##TITLE=AC1537_ROEFFECT0010_8214656_HnbXCdPfNy
##JCAMPDX= 6.0         $$ Bruker NMR JCAMP-DX V2.0
##DATA TYPE= NMR SPECTRUM
##DATA CLASS= NTUPLES
##ORIGIN= BRUKER
##OWNER= Administrator
$$ 1.72 TOPSPIN		Version 2.1
$$ 2013-10-11 17:39:06.804 -0700  Administrator@X
$$ Compression mode = diff/dup
##.OBSERVE FREQUENCY= 400.02188249412
##.OBSERVE NUCLEUS= ^1H
##.ACQUISITION MODE= SIMULTANEOUS (DQD)
##.ACQUISITION SCHEME= undefined
##.AVERAGES= 64
##.DIGITISER RES= 22
##SPECTROMETER/DATA SYSTEM= spect
##.PULSE SEQUENCE= noesygpps1d.comp
##.SOLVENT NAME= COFFEE_meoh
##.SHIFT REFERENCE= INTERNAL, COFFEE_meoh, 1, 14.96096
##AUDIT TRAIL= $$ (NUMBER, WHEN, WHO, WHERE, PROCESS, VERSION, WHAT)
$$ ##TITLE= Audit trail, TOPSPIN		Version 2.1
$$ ##JCAMPDX= 5.01
$$ ##ORIGIN= Bruker BioSpin GmbH
$$ ##OWNER= Administrator
$$ $$ E:\/data/COFFEE/nmr/AC1537_ROEFFECT0010_8214656_HnbXCdPfNy/12/pdata/1/auditp.txt
$$ ##AUDIT TRAIL=  $$ (NUMBER, WHEN, WHO, WHERE, PROCESS, VERSION, WHAT)
(   1,<2013-10-11 17:39:01.945 -0700>,<Administrator>,<X>,<go>,<TOPSPIN 2.1>,
      <created by zg
	started at 2013-10-11 17:27:32.507 -0700,
	POWCHK enabled, PULCHK disabled,
       configuration hash MD5:
       C8 4E 4E 5D D3 5C D8 9E 9F 52 82 E0 59 8A DE 15
       data hash MD5: 64K
       14 7F 04 FB 01 43 2C 09 64 67 BD F0 16 03 E3 E3>)
(   2,<2013-10-11 17:39:04.882 -0700>,<Administrator>,<X>,<proc1d>,<TOPSPIN 2.1>,
      <Start of raw data processing
       efp LB = 0.3 FT_mod = 6 PKNL = 1 PHC0 = 0 PHC1 = 0 SI = 128K 
       data hash MD5: 128K
       19 D8 86 B6 A2 8F AE 4E 0E E4 A1 49 45 1C 16 40>)
(   3,<2013-10-11 17:39:05.851 -0700>,<Administrator>,<X>,<proc1d>,<TOPSPIN 2.1>,
      <pk PHC0 = -81.01318 PHC1 = 0 
       data hash MD5: 128K
       38 44 CA 34 78 4D 98 1B 37 1F 03 2F 85 36 F2 87>)
(   4,<2013-10-11 17:39:06.226 -0700>,<Administrator>,<X>,<proc1d>,<TOPSPIN 2.1>,
      <abs ABSG = 1 
       data hash MD5: 128K
       CF 9D EB 5D DE 41 2A C6 2A 65 05 8A 4D 06 12 50>)
(   5,<2013-10-11 17:39:06.351 -0700>,<Administrator>,<X>,<proc1d>,<TOPSPIN 2.1>,
      <abs ABSG = 2 
       data hash MD5: 128K
       33 8F E3 5E 29 AC 36 25 9F 93 96 30 04 E7 44 1C>)
(   6,<2013-10-11 17:39:06.429 -0700>,<Administrator>,<X>,<proc1d>,<TOPSPIN 2.1>,
      <abs ABSG = 3 
       data hash MD5: 128K
       D1 67 87 11 BF 17 48 F3 62 25 91 09 6C E6 C8 B0>)
(   7,<2013-10-11 17:39:06.507 -0700>,<Administrator>,<X>,<proc1d>,<TOPSPIN 2.1>,
      <abs ABSG = 4 
       data hash MD5: 128K
       FA 69 40 98 F2 B7 4F 3C E6 18 E2 54 CF A5 84 E5>)
(   8,<2013-10-11 17:39:06.632 -0700>,<Administrator>,<X>,<proc1d>,<TOPSPIN 2.1>,
      <abs ABSG = 5 
       data hash MD5: 128K
       6A 68 2A 0F CB 89 6C 3A BE 61 B2 D2 FF 61 7F F7>)
$$ ##END=
$$ 
$$ $$ hash MD5
$$ $$ 50 C8 BD 61 BA B6 46 FC E4 63 97 BD 26 7A 53 E8
##$RELAX= 
##$RELAX= 
##$RELAX= 
##$RELAX= 
##$RELAX= 
##$RELAX= 
##$RELAX= 
##$RELAX= 
$$ Bruker specific parameters
$$ --------------------------
##$DU= <E:\>
##$EXPNO= 12
$$ [...]
150 150 150 150 150 150 150 150
##$TP07= 0
##$TPNAME0= <>
##$TPNAME1= <>
##$TPNAME2= <>
##$TPNAME3= <>
##$TPNAME4= <>
##$TPNAME5= <>
##$TPNAME6= <>
##$TPNAME7= <>
##$TPOAL= (0..7)
0.5 0.5 0.5 0.5 0.5 0.5 0.5 0.5
##$TPOFFS= (0..7)
0 0 0 0 0 0 0 0
##$TUNHIN= 0
##$TUNHOUT= 0
##$TUNXOUT= 0
##$USERA1= <user>
##$USERA2= <user>
##$USERA3= <user>
##$USERA4= <user>
##$USERA5= <user>
##$V9= 5
##$VALIST= <valist>
##$VCLIST= <CCCCCCCCCCCCCCC>
##$VD= 0
##$VDLIST= <DDDDDDDDDDDDDDD>
##$VPLIST= <PPPPPPPPPPPPPPP>
##$VTLIST= <TTTTTTTTTTTTTTT>
##$WBST= 1024
##$WBSW= 4
##$XGAIN= (0..3)
0 0 0 0
##$XL= 0
##$YL= 0
##$YMAX_a= 6608055
##$YMIN_a= -12920221
##$ZGOPTNS= <>
##$ZL1= 120
##$ZL2= 120
##$ZL3= 120
##$ZL4= 120
##$ABSF1= 14.96096
##$ABSF2= -5.597221
##$ABSG= 5
##$ABSL= 3
##$ALPHA= 0
##$AQORDER= 0
##$ASSFAC= 0
##$ASSFACI= 0
##$ASSFACX= 0
##$ASSWID= 0
##$AUNMP= <proc_prof1d_extract.lims>
##$AXLEFT= 0
##$AXNAME= <>
##$AXNUC= <1H>
##$AXRIGHT= 0
##$AXTYPE= 0
##$AXUNIT= <>
##$AZFE= 0.1
##$AZFW= 0.1
##$BCFW= 0
##$BC_mod= 0
##$BYTORDP= 0
##$COROFFS= 0
##$CY= 15
##$DATMOD= 1
##$DC= 0
##$DFILT= <>
##$DTYPP= 0
##$F1P= 0
##$F2P= 0
##$FCOR= 0.5
##$FTSIZE= 131072
##$FT_mod= 6
##$GAMMA= 0
##$GB= 0
##$INTBC= 1
##$INTSCL= 1
##$ISEN= 128
##$LB= 0.3
##$LEV0= 0
##$LPBIN= 0
##$MAXI= 10000
##$MC2= 0
##$MEAN= 0
##$ME_mod= 0
##$MI= 0
##$NCOEF= 0
##$NC_proc= -2
##$NLEV= 6
##$NOISF1= 0
##$NOISF2= 0
##$NSP= 0
##$NTH_PI= 0
##$NZP= 0
##$OFFSET= 14.96096
##$PC= 1
##$PHC0= -81.01318
##$PHC1= 0
##$PH_mod= 1
##$PKNL= yes
##$PPARMOD= 0
##$PPDIAG= 0
##$PPIPTYP= 0
##$PPMPNUM= 2147483647
##$PPRESOL= 1
##$PSCAL= 4
##$PSIGN= 0
##$PYNMP= <proc.py>
##$REVERSE= no
##$SF= 400.02000965438
##$SI= 131072
##$SIGF1= 0
##$SIGF2= 0
##$SINO= 400
##$SIOLD= 131072
##$SPECTYP= <>
##$SREGLST= <1H.CDCl3>
##$SSB= 0
##$STSI= 131072
##$STSR= 0
##$SW_p= 8223.68421052631
##$SYMM= 0
##$S_DEV= 0
##$TDeff= 65536
##$TDoff= 0
##$TI= <>
##$TILT= no
##$TM1= 0
##$TM2= 0
##$TOPLEV= 0
##$USERP1= <user>
##$USERP2= <user>
##$USERP3= <user>
##$USERP4= <user>
##$USERP5= <user>
##$WDW= 1
##$XDIM= 131072
##$YMAX_p= 408723181
##$YMIN_p= -12079
##$CURPLOT= <Network HP LaserJet P1505>
##$CURPRIN= <$Network HP LaserJet P1505>
##$DFORMAT= <normdp>
##$LAYOUT= <+/1D_H.xwp>
##$LFORMAT= <normlp>
##$PFORMAT= <normpl>
##$SURQMSG= 1
$$ End of Bruker specific parameters
$$ ---------------------------------
##NTUPLES= NMR SPECTRUM
##VAR_NAME=  FREQUENCY,     SPECTRUM/REAL,   SPECTRUM/IMAG
##SYMBOL=    X,             R,               I
##VAR_TYPE=  INDEPENDENT,   DEPENDENT,       DEPENDENT
##VAR_FORM=  AFFN,          ASDF,            ASDF
##VAR_DIM=   131072,        131072,          131072
##UNITS=     HZ,            ARBITRARY UNITS, ARBITRARY UNITS
##FACTOR=    0.0627417313425164, 1,          1
##FIRST=     8223.62146879497, 1052,         -63662
##LAST=      0,             3223,            -63694
##MIN=       0,             -12079,          0
##MAX=       8223.62146879497, 408723181,    0
$$ Real data points
##PAGE= N=1
##DATA TABLE= (X++(R..R)), XYDATA
$$ [...]
61637D78230j298m27j60o93j003k46J147K258K883L418L991M270L937K967J511
61622E00785j57j812l509n386p119q014p861p282o930o755o436o050n828n625
61608D22021n165m575m160l898l732l989m848n603n242l764k204j318r40q27j323
61593C70433k690m314n110m582l186j872j403j871k595k697j994j098n86l88k24
61578C35823j61m30r26j289j389j317j033l71N38J180J123M67k11l59J16Q78J580
61561C34219K189K820L352L470L110K605K282K167K117K060J983J858J741J701
61547C67674J603J160K88p71j727k427k675k251j247n3J083K141K863K724J745
61532C70130P90N62O71K72o90j493j726j643j511j301j111j234j554j444n72N59
$$ y = [478230, 476932, 476505, 476345, 475652, 474649, 474403, 475550, 477808, 480691, 484109, 488100, 492370, 496307, 499274, 500785, 500628, 498816, 495307, 489921, 482802, 474788, 466927, 459645, 452715, 445960, 439524, 433474, 427646, 422021, 416856, 412281, 408121, 404223, 400491, 396502, 391654, 386051, 380809, 377045, 374841, 373523, 372583, 371756, 370433, 367743, 363429, 358319, 353737, 350551, 348679, 347276, 345405, 342810, 340113, 338119, 337021, 336435, 336047, 335823, 335662, 335232, 334306, 333017, 331628, 330311, 329278, 328907, 329445, 330625, 331748, 332215, 332004, 331645, 331761, 332639, 334219, 336408, 339228, 342580, 346050, 349160, 351765, 354047, 356214, 358331, 360391, 362374, 364232, 365973, 367674, 369277, 370437, 370725, 369954, 368227, 365800, 363125, 360874, 359627, 359574, 360657, 362798, 365661, 368385, 370130, 370920, 371482, 372153, 372425, 371735, 370242, 368516, 366873, 365362, 364061, 362950, 361716, 360162, 358718, 358146, 358705]
61516C58705J141R43M10J36M22J136J859K207K167J999J922K022K321K673K715
61501C82778K290J853K026K769L530M130M857N601N697N000M351M440M799M604
61487D38725L903L296K762J819O56J18M37Q45P82P19J374K674L956M728M798M128
61471D75720L095K476K594K727J958M40q65j565k242l396m683n484n682n514n135
61456D54444m720m588m702m427l287j825j067j154j156l28R52J770J729J170O35
61441D33446N01Q95J591K092K081J783J649J704J476O42m36r65n43L79R19P28
61425D47942L47M52R53J229J204J534K502L342L199K356J827J908J854J067j23
61410D71593j059j510j521j017j20N21L05n37j194j290j213j442j900k120j735
$$ y = [358705, 359846, 360789, 361199, 361335, 361757, 362893, 364752, 366959, 369126, 371125, 373047, 375069, 377390, 380063, 382778, 385068, 386921, 388947, 391716, 395246, 399376, 404233, 409834, 415531, 420531, 424882, 429322, 434121, 438725, 442628, 445924, 448686, 450505, 451161, 451279, 451716, 452561, 453343, 454062, 455436, 458110, 462066, 466794, 471592, 475720, 478815, 481291, 483885, 486612, 488570, 489010, 488145, 486580, 484338, 480942, 476259, 470775, 465093, 459579, 454444, 449724, 445136, 440434, 436007, 432720, 430895, 429828, 428674, 427518, 427190, 428142, 429912, 431641, 432811, 433446, 433947, 434842, 436433, 438525, 440606, 442389, 444038, 445742, 447218, 447860, 447424, 446459, 445916, 446295, 447214, 447942, 448289, 448741, 449694, 450923, 452127, 453661, 456163, 459505, 462704, 465060, 466887, 468795, 470649, 471716, 471593, 470534, 469024, 467503, 466486, 466366, 466887, 467192, 466655, 465461, 464171, 462958, 461516, 459616, 457496, 455761]
61395D55761p61L55R04M78m56q68l47L65L02m49p91J11J994L872M865M702L853
61378D73890L349M035N672P039P203O488N925O037O468O623O215N301M187L301
61364E51733K778K236J238r0j256k043k565k794k627k401k644l206l298k617j757
61349E30687j184n94K65P58J48j246k384k728k448j726o23M46R00P06L76K35K25
61332E21813L54P35J100R73M45K17O70J397J873K074K195K189J967J737J854K459
61316E44052L393M295M836N102N664O911Q392R368R902J0724J2000J3008J3317
61303F50964J3470J4031J4623J4469J3393J1697R514O945M475K517P88j285l650
61290G51951n673o940p515p613p520p725q466r222r271q742q455q746r064q838
$$ y = [455761, 455000, 455355, 456259, 456737, 456281, 455413, 455066, 455431, 455733, 455284, 454493, 454604, 456598, 460470, 465335, 470037, 473890, 477239, 481274, 486946, 493985, 501188, 507676, 513601, 519638, 526106, 532729, 538944, 544245, 548432, 551733, 554511, 556747, 557985, 557895, 556639, 554596, 552031, 549237, 546610, 544209, 541565, 538359, 535061, 532444, 530687, 529503, 528909, 529174, 529932, 530080, 528834, 526450, 523722, 521274, 519548, 518925, 519371, 520271, 520977, 521353, 521588, 521813, 522167, 522902, 524002, 524975, 525420, 525637, 526307, 527704, 529577, 531651, 533846, 536035, 538002, 539739, 541593, 544052, 547445, 551740, 556576, 561678, 567342, 574253, 582645, 592013, 601915, 612639, 624639, 637647, 650964, 664434, 678465, 693088, 707557, 720950, 732647, 742161, 749106, 753581, 756098, 756886, 755601, 751951, 746278, 739338, 731823, 724210, 716690, 708965, 700499, 691277, 682006, 673264, 664809, 656063, 646999, 638161]
61276F38161q112p107n838m454l437k966k519j539k38O80Q96O67L38N7n2J60P22
61259F05419J582K754M149N251N362M373L073K452K760L399L624L237K624K357
61245F52416K767L675M473M582L958L028K118J167J38o51r41j077j647k605l222
61230F68179k914j787k41J364K592L078L123L619M941O351P049P248P571P812
61216G17985P258O082N408N810O638P095P153P000O380N174L994L455L264K791
61202G95487K295K639L915N198N846O259O983P805Q328Q873J0057J1640J2486
61189H87811J1818J0001P945O124M409K497K82k033l901m782m843n108o448q462
61175H95310r806r751q954q506q646q767q496q234q594r651j0835j1459j1328
$$ y = [638161, 630049, 622942, 617104, 612650, 609213, 606247, 603728, 602189, 601951, 602631, 603527, 604194, 604532, 604589, 604537, 604697, 605419, 607001, 609755, 613904, 619155, 624517, 628890, 631963, 634415, 637175, 640574, 644198, 647435, 650059, 652416, 655183, 658858, 663331, 667913, 671871, 674899, 677017, 678184, 678322, 677671, 676730, 675653, 674006, 671401, 668179, 665265, 663478, 663237, 664601, 667193, 670271, 673394, 677013, 681954, 688305, 695354, 702602, 710173, 717985, 725243, 731325, 736733, 742543, 749181, 756276, 763429, 770429, 776809, 781983, 785977, 789432, 792696, 795487, 797782, 800421, 804336, 809534, 815380, 821639, 828622, 836427, 844755, 853628, 863685, 875325, 887811, 899629, 909630, 917575, 923699, 928108, 930605, 930887, 928854, 924953, 920171, 915328, 910220, 903772, 895310, 885504, 875753, 866799, 858293, 849647, 840880, 832384, 824150, 815556, 805905, 795070, 783611, 772283]
61162G72283j0933j0956j1487j1864j1482j0579r914r746r535q714p344n854m453
61149F49422l064j680m67M08Q28O48k33j637k993l621l273k435j998k399l127
61134F24379l242k357r55K02Q23J229J909L039M374N572O709Q229J0221J2022
61120F72154J2980J3488J4617J6729J8994K0551K1559K2733K4290K5752K6556
61109H90403K6504K5871K5324K5380K5678K5215K3636K1792K0481J9153J6640
61098A146077J2829Q764N302K466K2k222m670p621j0479j2157j2455j2313j2456
61085A101087j2658j2575j2421j2279j1654j0358r103q444p789o322m443l332
61073I89709l345l653l376k394j071J78J078J725K565L799M997N698N979O003
$$ y = [772283, 761350, 750394, 738907, 727043, 715561, 704982, 695068, 685322, 675787, 667073, 659729, 653875, 649422, 646358, 644678, 644211, 644619, 645447, 646095, 645862, 644225, 641232, 637611, 634338, 631903, 629905, 627506, 624379, 621137, 618780, 617825, 618027, 618850, 620079, 621988, 625027, 629401, 634973, 641682, 649911, 660132, 672154, 685134, 698622, 713239, 729968, 748962, 769513, 791072, 813805, 838095, 863847, 890403, 916907, 942778, 968102, 993482, 1019160, 1044375, 1068011, 1089803, 1110284, 1129437, 1146077, 1158906, 1167670, 1172972, 1175438, 1175460, 1173238, 1168568, 1160947, 1150468, 1138311, 1125856, 1113543, 1101087, 1088429, 1075854, 1063433, 1051154, 1039500, 1029142, 1020039, 1011595, 1003806, 997484, 993041, 989709, 986364, 982711, 979335, 976941, 975870, 976048, 977126, 978851, 981416, 985215, 990212, 995910, 1001889, 1007892]
61059A007892N502M420L553L678M413M833M912N264N714N429M556M425N751P609
61045A077951Q731Q953Q972R412J0560J2327J4069J5062J5450J6140J7535J9138
61033A234300K0544K1990K3623K5127K6495K8274L0606L2894L4842L6886L9107
61022A554688M0806M1797M3144M5859M9844N4831O1307O9585P8925Q8638R9132
61011B228556J11098J24905J41955J65277J97426K38978K90551L54738M34391
61002D287875N30933O46536P85272R48543J132232J333026J551372J772551J939943
60993A4928283J964833J787522J436926J021143O53213L89293K34552J83630K26376
60984B2825771L12304L38571K04383j12806n39552r64151j307331j543808j678456
$$ y = [1007892, 1013394, 1017814, 1021367, 1025045, 1029458, 1034291, 1039203, 1044467, 1050181, 1055610, 1060166, 1064591, 1070342, 1077951, 1086682, 1095635, 1104607, 1114019, 1124579, 1136906, 1150975, 1166037, 1181487, 1197627, 1215162, 1234300, 1254844, 1276834, 1300457, 1325584, 1352079, 1380353, 1410959, 1443853, 1478695, 1515581, 1554688, 1595494, 1637291, 1680435, 1726294, 1776138, 1830969, 1892276, 1961861, 2040786, 2129424, 2228556, 2339654, 2464559, 2606514, 2771791, 2969217, 3208195, 3498746, 3853484, 4287875, 4818808, 5465344, 6250616, 7199159, 8331391, 9664417, 11215789, 12988340, 14928283, 16893116, 18680638, 20117564, 21138707, 21791920, 22181213, 22415765, 22599395, 22825771, 23138075, 23476646, 23681029, 23568223, 23028671, 22064520, 20757189, 19213381, 17534925]
60975A7534925j722013j688627j599989j479831j344919j204197j063697r28489
60967F503163q01346o83336n76238m82649m03869l39097k86596k44404k10210
60958B475418j81861j58210j38831j22986j09445r7111q5349p4096o4047n6244
60948A387238n0915m7075m3693m0721l8540l7048l5844l4694l3282l1154k8500
60937I65772k6266k4912k3754k2163k0586j9612j8928j8094j7490j7404j7037
60926G39526j5590j3705j2543j2009j1214j0217r740r568q746p298o198n629m753
60913F12316l443k780l304m076m031l297k602k203j956j754j452q96l38k64n92
60898E79328o71k09L76O33M34l45j732l171l906l998m154m528m594m344m468n110
$$ y = [17534925, 15812912, 14124285, 12524296, 11044465, 9699546, 8495349, 7431652, 6503163, 5701817, 5018481, 4442243, 3959594, 3555725, 3216628, 2930032, 2685628, 2475418, 2293557, 2135347, 1996516, 1873530, 1764085, 1666974, 1581625, 1507529, 1443482, 1387238, 1336323, 1289248, 1245555, 1204834, 1166294, 1129246, 1093402, 1058708, 1025426, 994272, 965772, 939506, 914594, 890840, 868677, 848091, 828479, 809551, 791457, 773967, 756563, 739526, 723936, 710231, 697688, 685679, 674465, 664248, 654508, 644940, 636194, 628896, 622698, 617069, 612316, 608873, 606093, 602789, 598713, 594682, 591385, 588783, 586580, 584624, 582870, 581418, 580522, 580184, 579920, 579328, 578657, 578448, 578824, 579457, 579891, 579546, 577814, 574643, 570737, 566739, 562585, 558057, 553463, 549119, 544651, 539541]
60882E39541n499n310n281n878o402o101n342m818m427l828l356l400l452k787
60868D73660j755j283j396j259o17j12J0M88J896L580M353L920L087K659K592
60853D89823K355J762J171R13R39J156J726K671L402L157J918M20p34j479j886
60838E07314j900j716j861k631l762m869n751o185n889m990m140l808l851l976
60824D51985m240m685m948m617l788k900k269k057k436l311m066m030l212k304
60810D03122j945k135k433k556k718l241l892l951l138k107j550j192l28Q25J226
60795C73987N49k57k50L87Q86Q63L76l83q91m79P67J772J739J116P50O16K27k10
60777C81565n5M79L57p64j828j608j40J400J971J521P55L58M82Q14R97Q85N53
$$ y = [539541, 534042, 528732, 523451, 517573, 511171, 505070, 499728, 494910, 490483, 486655, 483299, 479899, 476447, 473660, 471905, 470622, 469226, 467967, 467350, 467238, 467248, 467736, 469632, 473212, 477565, 481485, 484572, 487231, 489823, 492178, 493940, 495111, 496024, 496963, 498119, 499845, 502516, 505918, 509075, 510993, 511413, 510679, 509200, 507314, 505414, 503698, 501837, 499206, 495444, 490575, 484824, 478639, 472750, 467760, 463620, 459812, 455961, 451985, 447745, 443060, 438112, 433495, 429707, 426807, 424538, 422481, 420045, 416734, 412668, 408638, 405426, 403122, 401177, 399042, 396609, 394053, 391335, 388094, 384202, 380251, 377113, 375006, 373456, 372264, 371936, 372761, 373987, 374536, 374279, 374029, 374416, 375302, 376165, 376541, 376158, 375267, 374788, 375555, 377327, 379066, 380182, 380932, 381548, 381775, 381565, 381510, 381989, 382346, 381582, 379754, 378146, 378006, 379406, 381377, 382898, 383653, 384011, 384493, 385307, 386304, 387189, 387742]
60760C87742K24J76M15N01Q0m51k79O49J324Q72m01j481j712j049L00J843K788
60743C91541K651J878J347J339J357Q79j84j649l224m422m735m085k972k116k000
60728C75605k591l296l311k307p72M86J084J224J243J229J009M20l65q29n53K50
60712C68526Q83Q90M08j59m84l42L01J077J494J489J354J121N58j28l08M6J33
60695C76859m50r81p12p4j7n47q39m95O9M40O55Q06Q11O98O41O68O92P97J127
60676C80148J530J736J792J954K168K031J384O46M32Q96J472J305J76j090j523
60661C95057j250j254j858k254j881j400j613k193k230j524m36R49K569L693L618
60646C87993K843K499K696K479J473M86J74J14l62j160j730j893j895k031k434
$$ y = [387742, 387966, 388142, 388557, 389058, 389138, 388687, 388408, 389057, 390381, 391253, 390852, 389371, 387659, 386610, 386910, 388753, 391541, 394192, 396070, 397417, 398756, 400113, 400992, 400808, 399159, 395935, 391513, 386778, 382693, 379721, 377605, 375605, 373014, 369718, 366407, 364100, 363328, 363814, 364898, 366122, 367365, 368594, 369603, 370023, 369658, 368829, 368276, 368526, 369409, 370299, 370707, 370548, 370064, 369722, 370023, 371100, 372594, 374083, 375437, 376558, 377116, 376988, 376680, 376726, 376859, 376409, 375428, 374716, 374642, 374625, 374078, 373239, 372744, 372813, 373253, 373908, 374714, 375525, 376223, 376864, 377532, 378224, 379021, 380148, 381678, 383414, 385206, 387160, 389328, 391359, 392743, 393389, 393821, 394717, 396189, 397494, 397670, 396580, 395057, 393807, 392553, 390695, 388441, 386560, 385160, 383547, 381354, 379124, 377600, 377164, 378113, 380682, 384375, 387993, 390836, 393335, 396031, 398510, 399983, 400469, 400643, 400757, 400395, 399235, 397505, 395612, 393717, 391686, 389252]
60631C89252k950l102k505j435o39n02o98o59r5Q41J551J362L52m81l38M03R14
60614C81271J169J567J753J010k37o22K17J104J069N20J80K0q8K92J252J782R93
60597C93252m70j170o64L36J200J878K260K020J281P49R50J651K140J889R59k0
60581D08241l96j82j0k37m83l59j73l84o30j7J701L758N275O090O595P224Q218
60564D44231R552J0811J1308J0615Q991P179N795M853L894K501O66j320l132m406
60550E11538m692l812k275r47j36O72J986L572M807N585O447P872R756J1694J3602
60535E65669J5799J8323K0451K1261K0703J9703J8870J7601J4915J0782O027J195
60523G51299l609p888j0763j2085j2715j3331j3655j3232j2280j1210r959q349
$$ y = [389252, 386302, 383200, 380695, 379260, 378621, 378119, 377421, 376762, 376667, 377508, 379059, 380421, 380773, 380292, 379954, 380357, 381271, 382440, 384007, 385760, 386770, 386533, 385911, 386128, 387232, 388301, 388821, 389001, 389021, 388933, 389225, 390477, 392259, 393252, 392782, 391612, 390948, 391284, 392484, 394362, 396622, 398642, 399923, 400672, 401622, 403273, 405413, 407302, 408261, 408241, 407845, 407663, 407653, 407416, 406933, 406574, 406401, 406017, 405387, 405370, 407071, 410829, 416104, 422194, 428789, 436013, 444231, 453783, 464594, 475902, 486517, 495508, 502687, 508482, 513335, 517229, 519730, 520396, 519076, 515944, 511538, 506846, 503034, 500759, 499812, 499676, 500348, 502334, 505906, 510713, 516298, 522745, 530617, 540373, 552067, 565669, 581468, 599791, 620242, 641503, 662206, 681909, 700779, 718380, 733295, 744077, 750104, 751299, 747690, 739802, 729039, 716954, 704239, 690908, 677253, 664021, 651741, 640531, 630572, 622223]
60511F22223o604m995l424j904q88l87O05K961O070Q632J0572J3054J6660K0707
60497F83282K4582K8598L2992L6968L9568M0896M1711M2144M1651M0091L8108
60486A090591L6305L4512L2039K8257K2849J5838P636j144j0107j9216k8366l6953
60474A172241m4055m8953n1441n1758n0462m8281m5809m3234m0423l7254l3757
60463F76814l0016k6161k2540j9658j7723j6383j4987j3146j1035r208q039p343
60451D80575o557n476m629m608n224n684n601n235m771l999k950k172j953j883
60437D19833j625j556j982k342j962j149o64m68PN68L98n28j196j029o32o87r67
60420D04019q84l61K52O64O91L27N8M90J456K064J923J624J749K066K145K022
$$ y = [622223, 615619, 610624, 607200, 605296, 604408, 604021, 604626, 607587, 613657, 622289, 632861, 645915, 662575, 683282, 707864, 736462, 769454, 806422, 845990, 886886, 928597, 970741, 1012392, 1052483, 1090591, 1126896, 1161408, 1193447, 1221704, 1244553, 1260391, 1268027, 1266883, 1256776, 1237560, 1209194, 1172241, 1128186, 1079233, 1027792, 976034, 925572, 877291, 831482, 788248, 747825, 710571, 676814, 646798, 620637, 598097, 578439, 560716, 544333, 529346, 516200, 505165, 495957, 487918, 480575, 474018, 468542, 463913, 459305, 454081, 448397, 442796, 437561, 432790, 428791, 425841, 423669, 421716, 419833, 418208, 416652, 414670, 412328, 410366, 409217, 408553, 408085, 408092, 408660, 409058, 408530, 407334, 406305, 405673, 404986, 404019, 403135, 402774, 403026, 403690, 404381, 404708, 404766, 405256, 406712, 408776, 410699, 412323, 414072, 416138, 418283, 420305]
60404D20305J821J384Q77J004J942K742K554J912J931K686L283L282L027K763
60390D51513K345J923K000K615L117L011K581K414K696L120L279L047K716K686
60376D89063K873K710J995J377J565K336K917L015K874K489J637O36K60O51R95
60361E17393O31p3l35K4O47J326K191L263M275M938N225N395N722O193O427O033
60345E69275N001L669K307R41m81j887l078l837m099m142m435n076n566n454n043
60330E38095n054n672o327o458o016n160l975k762k109k313k912l187k914k342
60316D80894j648q03R8Q12J394K253L629N187O432P306Q154R121R950J0344J0289
60301E53412R913R221Q193O903N398L576J460o22k363l963n875q100r968j0776
$$ y = [420305, 422126, 423510, 424387, 425391, 427333, 430075, 432629, 434541, 436472, 439158, 442441, 445723, 448750, 451513, 453858, 455781, 457781, 460396, 463513, 466524, 469105, 471519, 474215, 477335, 480614, 483661, 486377, 489063, 491936, 494646, 496641, 498018, 499583, 501919, 504836, 507851, 510725, 513214, 514851, 515487, 515747, 516398, 517393, 518024, 517951, 517616, 517640, 518287, 519613, 521804, 525067, 529342, 534280, 539505, 544900, 550622, 556815, 563242, 569275, 574276, 577945, 580252, 581193, 580712, 578825, 575747, 571910, 567811, 563669, 559234, 554158, 548592, 543138, 538095, 533041, 527369, 521042, 514584, 508568, 503408, 499433, 496671, 494562, 492249, 489337, 486150, 483236, 480894, 479246, 478443, 478541, 479353, 480747, 483000, 486629, 491816, 498248, 505554, 513708, 522829, 532779, 543123, 553412, 563325, 572546, 580739, 587642, 593040, 596616, 598076, 597454, 595091, 591128, 585253, 577153, 567185, 556409]
60287E56409j0443r476q453p547o502n028l310j972j411j343j257j113j253j732
60273D95569k208k402k356k252k331k841l617l893l193k234k138k744k718j562
60259D59080m74o03j353j334l58M73L99k08n85l33N85J941L178L665L267K431
60243D69771J693J304J229J282J216R41N72K45k3j59m6J91K03o6j38M44J564K725
60225D82948L579M072M351M718N378O096O410O293O190O316O482O727P457Q671
60211E65688R726J0251J0660J1279J1741J1700J1464J1265J0733R782R203R457
60199F92949R607Q621P105O448O673O538N620M804M575M217L148J869J029M57
60185G63660k40r18j315j707k458l356l864l809l524l374l431l487l366l221l413
$$ y = [556409, 545966, 536490, 528037, 520490, 513988, 508960, 505650, 503678, 502267, 500924, 499667, 498554, 497301, 495569, 493361, 490959, 488603, 486351, 484020, 481179, 477562, 473669, 470476, 468242, 466104, 463360, 460642, 459080, 458606, 458003, 456650, 455316, 454958, 455431, 455830, 455622, 455037, 454704, 455289, 457230, 460408, 464073, 467340, 469771, 471464, 472768, 473997, 475279, 476495, 477436, 478008, 478253, 478230, 478071, 478025, 478216, 478419, 478353, 478215, 478659, 480223, 482948, 486527, 490599, 494950, 499668, 505046, 511142, 517552, 523845, 530035, 536351, 542833, 549560, 557017, 565688, 575414, 585665, 596325, 607604, 619345, 631045, 642509, 653774, 664507, 674289, 683492, 692949, 702556, 711177, 718282, 724730, 731403, 737941, 743561, 748365, 752940, 757157, 760305, 762174, 763203, 763660, 763420, 762502, 761187, 759480, 757022, 753666, 749802, 745993, 742469, 739095, 735664, 732177, 728811, 725590, 722177]
60170G22177l903m091l574k857k793l584m694n520n703n155m369m309n299o280
60156F60046n986m518k990j988j337j080j440j872j402n0J171J776K196K513K094
60141F47133R18OJ4M04O43J139K227L211L304K841K704L055L389L427L243K877
60125F80535K420K158K236K479K882L766N143O477P417Q080Q401P976P119P081
60111G54170Q455J0081J0506R879R477R744R913R347Q281P196O209N190L970K466
60097H64884R38n6m01q11j980l581m714n101n259n638o248o963p705q250q388
60082H00727q293q347q669r047r299r370r234q955q700q486q157p768p652p758
60068F80992p398o140m601l809m007m574m918m917m692m419m347m558m773m660
$$ y = [722177, 718274, 714183, 710609, 707752, 704959, 701375, 696681, 691161, 685458, 680303, 675934, 671625, 666326, 660046, 654060, 649542, 646552, 644564, 643227, 642147, 640707, 638835, 637433, 637383, 638554, 640330, 642526, 645039, 647133, 648051, 648057, 648071, 648475, 649118, 650257, 652484, 655695, 658999, 661840, 664544, 667599, 670988, 674415, 677658, 680535, 682955, 685113, 687349, 689828, 692710, 696476, 701619, 708096, 715513, 723593, 731994, 739970, 747089, 754170, 762625, 772706, 783212, 793091, 802568, 812312, 822225, 831572, 839853, 847049, 853258, 858448, 862418, 864884, 865822, 865766, 865365, 864554, 862574, 858993, 854279, 849178, 843919, 838281, 832033, 825070, 817365, 809115, 800727, 792434, 784087, 775418, 766371, 757072, 747702, 738468, 729513, 720813, 712327, 704170, 696402, 688750, 680992, 673594, 667454, 662853, 659044, 655037, 650463, 645545, 640628, 635936, 631517, 627170, 622612, 617839, 613179]
60054F13179m198l563k900k413k311k366j961r63j12m8l88k68N91J863L193M236
60038F01571M564M278M276N151O155O112N057L983L256K392J378R19J114Q88n74
60023F50520k658m192m963n658o701p721q140p819p129o612o599o952p177o859
60009E61340o048n243m926n055n034m452l721l567l854l591k346j063q53j529
59995E10058j987j655q76m3P79J518K070K644L552M711N787O709P441P515O559
59980E54782N126M182L831L340K466J788J553J150R3j234k232k817l165l229l042
59965E62592k920l042l199l247l281l176k537j472p16n60l55L54Q83L66p91j384
59949E37515j012l52J33Q32K105L512M359M554M517M459M141L314K164J256J090
$$ y = [613179, 608981, 605418, 602518, 600105, 597794, 595428, 593467, 592504, 592392, 592344, 591956, 591688, 592279, 594142, 597335, 601571, 606135, 610413, 614689, 619840, 625995, 632107, 637164, 641147, 644403, 646795, 648173, 649092, 650206, 651094, 650520, 647862, 643670, 638707, 633049, 626348, 618627, 610487, 602668, 595539, 588927, 582328, 575376, 568199, 561340, 555292, 550049, 545123, 540068, 535034, 530582, 526861, 523294, 519440, 515849, 513503, 512440, 511587, 510058, 508071, 506416, 505540, 505497, 506276, 507794, 509864, 512508, 516060, 520771, 526558, 533267, 540708, 548223, 554782, 559908, 564090, 567921, 571261, 573727, 575515, 577068, 578218, 578311, 577077, 574845, 572028, 568863, 565634, 562592, 559672, 556630, 553431, 550184, 546903, 543727, 541190, 539718, 539002, 538442, 538087, 538441, 539324, 539690, 538899, 537515, 536503, 536151, 536284, 537116, 539221, 542733, 547092, 551646, 556163, 560622, 564763, 568077, 570241, 571497, 572587]
59934E72587J662K501L071L210L172L324L848M616N341N798N941N851N678N595
59920F32195N624N448M665L454K652K847L635M188M395M765N382N672N366M904
59906F95192M530L694J970k0j311k002l081m847o324o502n643m863m724m747m269
59891F57053l347k514j897j038L97K040L280M046M724N415N811N887O156O942
59877F92955P795Q100P964P976Q204P995O889N253L758K532J218l23j713k557
59863G56046k941l278l789m293m578m769n121n526n442m528l093j693l50J374
59849G08019L472N112N613N488N839O764P020N600L074R39l5k61l87n71o96p37
59833G54253p46q10j177k048l193m113m602m832m876m608m152l910l998m133m140
$$ y = [572587, 574249, 576750, 579821, 583031, 586203, 589527, 593375, 597991, 603332, 609130, 615071, 620922, 626600, 632195, 637819, 643267, 647932, 651386, 654038, 656885, 660520, 664708, 669103, 673868, 679250, 684922, 690288, 695192, 699722, 703416, 705386, 705366, 704055, 702053, 698972, 694125, 687801, 681299, 675656, 670793, 666069, 661322, 657053, 653706, 651192, 649295, 648257, 648654, 650694, 653974, 658020, 662744, 668159, 673970, 679857, 686013, 692955, 700750, 708850, 716814, 724790, 732994, 740989, 747878, 753131, 756889, 759421, 760639, 760316, 758603, 756046, 753105, 749827, 746038, 741745, 737167, 732398, 727277, 721751, 716309, 711781, 708688, 706995, 706645, 708019, 711491, 716603, 722216, 727704, 733543, 740307, 747327, 752927, 756001, 756940, 756905, 756644, 756257, 755686, 754990, 754253, 753507, 752697, 751520, 749472, 746279, 742166, 737564, 732732, 727856, 723248, 719096, 715186, 711188, 707055, 702915]
59818G02915m077l731k707j270l60l11k43O26J764K169J860J630J630J238K60
59803G01393p07j230j619k272l009l343l065k462k129k528l379l771l266k651
59789F65962k959m025m717m466l712k954k252j853k293l433m226l889k778j668
59775F20737p89k5M87O27P27J219K028K834L626M543N403N893O123O484P019P334
59759F74270P225P036P277Q045Q924R435R542R734J0479J1613J2474J2639J2328
59746H01021J1905J1252R857P506M719K349P69m74j993l628m504m158l177k442
59732H29002k143j991k008k396k881k910k495k103j730q81M11J403J719J859K202
59717H15058K349J930J469J709K557L320L663L781L902M182M821N773O528O781
$$ y = [702915, 698838, 695107, 692400, 691130, 690770, 690459, 690216, 690842, 692606, 694775, 696635, 698265, 699895, 701133, 701393, 700686, 699456, 697837, 695565, 692556, 689213, 686148, 683686, 681557, 679029, 675650, 671879, 668613, 665962, 663003, 658978, 654261, 649795, 646083, 643129, 640877, 639024, 636731, 633298, 629072, 625183, 622405, 620737, 619948, 619923, 620410, 621037, 621764, 622983, 625011, 627845, 631471, 636014, 641417, 647310, 653433, 659917, 666936, 674270, 681495, 688531, 695808, 703853, 712777, 722212, 731754, 741488, 751967, 763580, 776054, 788693, 801021, 812926, 824178, 834035, 841541, 846260, 848609, 849378, 848904, 846911, 843283, 838779, 834621, 831444, 829002, 826859, 824868, 822860, 820464, 817583, 814673, 812178, 810075, 808345, 807464, 807875, 809278, 810997, 812856, 815058, 817407, 819337, 820806, 822515, 825072, 828392, 832055, 835836, 839738, 843920, 848741, 854514, 861042, 867823]
59703H67823P033Q049R801J1515J2696J3539J4288J4765J4717J4306J3934J3763
59691A016229J3585J3145J2423J1542J0432Q821O734M794L610K921J882K21j455
59678A104884k705l972n798p870r415j0223j0643j0838j0679j0309j0070r839
59666A002523q986p241n191l629k695j797k89J932M350O377P996R764J2067J4549
59652A029730J6470J7477J7662J7099J5731J3751J1544R078N798J435l412p827
59640A144536j1558j5027j8429k1307k3115k3870k3918k3363k2134k0505j9061
59629I22249j8041j7089j5895j4693j3884j3464j3174j2981j3014j3298j3790
59618G62926j4479j5020j4660j3132j1364j0562j0703j0678r875q799p963p108
$$ y = [867823, 874856, 882905, 892706, 904221, 916917, 930456, 944744, 959509, 974226, 988532, 1002466, 1016229, 1029814, 1042959, 1055382, 1066924, 1077356, 1086177, 1092911, 1097705, 1101315, 1104236, 1106118, 1106339, 1104884, 1102179, 1098207, 1092409, 1084539, 1075124, 1064901, 1054258, 1043420, 1032741, 1022432, 1012362, 1002523, 993537, 986296, 981105, 977476, 974781, 972984, 972695, 974627, 978977, 985354, 993350, 1003114, 1015181, 1029730, 1046200, 1063677, 1081339, 1098438, 1114169, 1127920, 1139464, 1148542, 1154340, 1155775, 1152363, 1144536, 1132978, 1117951, 1099522, 1078215, 1055100, 1031230, 1007312, 983949, 961815, 941310, 922249, 904208, 887119, 871224, 856531, 842647, 829183, 816009, 803028, 790014, 776716, 762926, 748447, 733427, 718767, 705635, 694271, 683709, 673006, 662328, 652453, 643654, 635691, 628583]
59606F28583n916m678l745k924k023j415j453j723j548r17l45j0L38P59R42O77
59590F04602J18m33p51p82o83o89q01q61r50j381k103k595k633k640k979l329
59574E81110l287l134l399l983m310m124l594k885k080j382q80l39L02N65J17
59559E48697n16o21l79m54p21l51Q09J859K082J843J935K636L703M750N354N291
59543E75917M911M908N604O845Q528J0626J2684J4191J5594J7925K0830K1952
59531G20515J9263J3556P627L420Q61q33j952k578k935k972k335j253p47j425
59517G48212k566l054k865k898l602m557n424o447p804r082r791r941r758r278
59503F61145q620q234q387q638q340p414o261n068l762k468j437o08L19J341K262
$$ y = [628583, 622667, 617989, 614244, 611320, 609297, 607882, 606429, 604706, 603158, 602241, 601896, 601886, 602224, 602983, 603925, 604602, 604720, 604287, 603536, 602754, 602071, 601382, 600581, 599720, 598770, 597389, 595286, 592691, 590058, 587418, 584439, 581110, 577823, 574689, 571290, 567307, 562997, 558873, 555279, 552394, 550314, 548932, 548052, 547713, 548015, 548580, 548697, 548181, 547560, 547181, 546727, 546006, 545655, 546464, 548323, 550405, 552248, 554183, 556819, 560522, 565272, 570626, 575917, 580828, 585736, 591340, 598185, 606713, 617339, 630023, 644214, 659808, 677733, 698563, 720515, 739778, 753334, 760961, 764381, 765242, 764409, 762457, 759879, 756944, 753972, 751637, 750384, 749637, 748212, 745646, 742592, 739727, 736829, 733227, 728670, 723246, 716799, 708995, 699913, 690122, 680181, 670423, 661145, 652525, 644291, 635904, 627266, 618926, 611512, 605251, 600183, 596421, 593953, 592516, 591908, 592227, 593568, 595830]
59488E95830L179M262N195N577N858O943Q680R679R039P519O404O012N892N873
59474F85942O044O069N372L906K176O53m18r51j212j789k815l520l165k164j590
59459F92538j726j806j130K16J740L066M035M775N712P071Q329Q658P929O836
59445G46243N986N217L963J946m94k669m211n520p249r176j0173r664q512p768
59431F97919p205o004m381l367l149k890k276j941k021j532K94K911N370P426
59417F79154R233J0755J2225J4310J7060J9354K0394K1098K2750K4626K4211J9982
59405H95152J2975N414j171o134r015r582q183n351j295L563P685Q867O045L91
59391H99361n627j0156j2806j4032j4234j3603j2412j1067r856q831p868o754
$$ y = [595830, 599009, 603271, 608466, 614043, 619901, 626844, 635524, 645203, 654242, 661761, 668165, 674177, 680069, 685942, 691986, 698055, 703427, 707333, 709509, 710162, 709744, 708793, 707581, 705792, 702977, 699457, 696292, 694128, 692538, 690812, 689006, 687876, 688092, 689832, 692898, 696933, 701708, 707420, 714491, 722820, 731478, 739407, 746243, 752229, 757446, 761409, 763355, 762861, 760192, 755981, 750461, 743212, 734036, 723863, 714199, 705687, 697919, 690714, 684710, 680329, 676962, 673813, 670923, 668647, 666706, 664685, 663153, 663447, 666358, 671728, 679154, 688387, 699142, 711367, 725677, 742737, 762091, 782485, 803583, 826333, 850959, 875170, 895152, 908127, 913541, 912370, 906236, 897221, 887639, 879456, 874105, 872810, 876373, 884058, 892925, 898970, 899361, 893734, 883578, 870772, 856740, 842506, 828903, 816491, 805424, 795568, 786737, 778869, 772115]
59379G72115n265l388j473j2P79J141J508K049K514K536K098J644J650K127K772
59364G82795L414M052M485M330L568K745K444K849L879N381O965Q138Q945J0048
59350H54038J1782J3536J4577J5074J5743J6827J8092J9553K1334K2962K3636
59339A047154K3294K2624K1888K0502J8061J5082J2259R585O667L488L68k530
59327A198442n249p789j0171j2534j4805j6548j7464j7882j8397j9125j9706j9913
59315A018859j9874j9650j9079j8233j7683j7932j8675j8965j8192j6640j4975
59304H18961j3429j1750r719p300m399r64K597N568P539Q505Q135N741J315l826
59290H06974p988j0452j1588j2032j2271j2588j2749j1960r738o699l956j889
$$ y = [772115, 766850, 763462, 761989, 761977, 762756, 763897, 765405, 767454, 769968, 772504, 774602, 776246, 777896, 780023, 782795, 786209, 790261, 794746, 799076, 802644, 805389, 807833, 810682, 814561, 819942, 826907, 835045, 843990, 854038, 865820, 879356, 893933, 909007, 924750, 941577, 959669, 979222, 1000556, 1023518, 1047154, 1070448, 1093072, 1114960, 1135462, 1153523, 1168605, 1180864, 1190449, 1197116, 1200604, 1200972, 1198442, 1193193, 1185404, 1175233, 1162699, 1147894, 1131346, 1113882, 1096000, 1077603, 1058478, 1038772, 1018859, 998985, 979335, 960256, 942023, 924340, 906408, 887733, 868768, 850576, 833936, 818961, 805532, 793782, 784063, 776763, 772364, 771400, 773997, 779565, 787104, 795609, 803744, 809485, 810800, 806974, 798986, 788534, 776946, 764914, 752643, 740055, 727306, 715346, 705608, 698909, 694953, 693064]
59278F93064j28J569L119M644O418Q229R535J0347J1337J2879J4598J5909J6523
59265H08043J6265J5108J3538J2281J1468J0556R138P255M877J825j476l951n079
59252H99848n596o466p646q380q375q087p960p893p451o388m953l679k840k133
59238H12001j163j18M46N02P02J473K337K389J225p33k612l768m340n096o414
59223G96831p640p967p735q050r069r579q666p061o216o518p005o618n309l971
59209F95427l512l936m283l703k439j416j022q76o91n17p6J286L504N424O050
59194F89220N671N325N617O485P614Q617R108R100R060R327R800J0362J1049J1518
59180H07873J1014R315P259N772M832L794K279L04j993m191n596o005o056o365
$$ y = [693064, 692936, 694505, 697624, 702268, 708686, 716915, 726450, 736797, 748134, 761013, 775611, 791520, 808043, 824308, 839416, 852954, 865235, 876703, 887259, 896397, 903652, 908529, 910354, 908878, 904927, 899848, 894252, 887786, 880140, 871760, 863385, 855298, 847338, 839445, 831994, 825606, 820653, 816974, 814134, 812001, 810838, 810720, 811166, 811668, 812370, 813843, 816180, 818569, 819794, 819061, 816449, 812681, 808341, 803245, 796831, 789191, 781224, 773489, 765439, 756370, 746791, 738125, 731064, 724848, 718330, 711325, 704707, 699398, 695427, 691915, 687979, 683696, 679993, 677554, 676138, 675116, 674240, 673549, 673032, 672956, 674242, 677746, 683170, 689220, 694891, 700216, 705833, 712318, 719932, 728549, 737657, 746757, 755817, 765144, 774944, 785306, 796355, 807873, 818887, 828202, 835461, 841233, 846065, 849859, 852138, 852442, 850449, 846258, 840662, 834657, 828601, 822236]
59166H22236o669o490o144o305o839o928o293n528n109m721l879k810k376l191
59152G48954m974o724p597p613p391p298p219p074p072p271p400p328p279p348
59138F49366p293p041o847o683o102n111m473m602m755l991k434q15O64K172L368
59123E95423L692L500L938N508P511R072J0090J0892J1481J1553J1055J0402J0098
59110G04215J0216J0245R582Q214O701N446M292K960J554L95l51o65o57p25j289
59095G60133k159k584k296j958k230k809k908k275j300m61j55o36j639k389k450
59080G31884k317k658l355l828l946m039m277m593n010n508n732n320m376l288
59066F73637k339j811j992k693l256l483l992n070n895n692n059n134n831o009
$$ y = [822236, 815567, 809077, 802933, 796628, 789789, 782861, 776568, 771040, 765931, 761210, 757331, 754521, 752145, 748954, 743980, 737256, 729659, 722046, 714655, 707357, 700138, 693064, 685992, 678721, 671321, 663993, 656714, 649366, 642073, 635032, 628185, 621502, 615400, 610289, 605816, 601214, 596459, 592468, 590034, 589219, 589883, 592055, 595423, 599115, 602615, 606553, 612061, 619572, 628644, 638734, 649626, 661107, 672660, 683715, 694117, 704215, 714431, 724676, 734258, 742472, 749173, 754619, 758911, 761871, 763425, 763820, 763469, 762804, 762147, 761422, 760133, 757974, 755390, 753094, 751136, 748906, 746097, 743189, 740914, 739614, 739153, 738998, 738362, 736723, 734334, 731884, 729567, 726909, 723554, 719726, 715780, 711741, 707464, 702871, 697861, 692353, 686621, 681301, 676925, 673637, 671298, 669487, 667495, 664802, 661546, 658063, 654071, 649001, 643106, 637414, 632355, 627221, 621390, 615381]
59052F15381n170l938k967k360k181k531k905k495j343m30l00l30K28J095J345
59037E91099N91o33j477j541j042l98K57Q98J232R52M92P80J951L054L501M002
59021F03718N346P072Q286R101J0047J0600R740P765O163N553N017L711J968N01
59007F94588n06j074j101p89o73q22o86k4O86J067J440K169K975L292K982K407
58991G05931K057K120K227J784R04O14J464K431K124Q02K9L89R02R23J262K779
58975G28742N021O968Q404R743J1111J2412J3792J5435J7112J8327J8733J8149
58963H83949J6659J4855J3483J2598J1544R889P783N290K153j361m297o196p781
58950I58568r845j2057j3550j4226j4678j5146j5275j4883j4323j3981j3732j3119
$$ y = [615381, 610211, 606273, 603306, 600946, 598765, 596234, 593329, 590834, 589491, 589061, 588761, 588431, 588659, 589754, 591099, 591690, 591057, 589580, 588039, 586997, 586599, 586856, 587754, 588986, 589938, 590430, 591210, 593161, 596215, 599716, 603718, 609064, 616136, 624422, 633523, 643570, 654170, 663910, 671675, 677838, 683391, 688408, 692119, 694087, 694588, 694082, 693008, 691907, 691118, 690445, 689623, 688937, 688913, 689599, 690666, 692106, 694275, 697250, 700542, 703524, 705931, 707988, 710108, 712335, 714119, 715023, 715637, 717101, 719532, 721656, 722458, 722487, 722876, 723778, 724701, 725963, 728742, 733763, 740731, 749135, 758878, 769989, 782401, 796193, 811628, 828740, 847067, 865800, 883949, 900608, 915463, 928946, 941544, 953088, 962977, 970760, 976050, 978203, 976842, 972545, 966349, 958568, 948723, 936666, 923116, 908890, 894212, 879066, 863791, 848908, 834585, 820604, 806872, 793753]
58938G93753j1906j0390r051p917o478m535k757j952j969j965j593j224r83m50
58924G30583M94J320J610J555J396J042N36K95N19Q93J135J319J438J318J200
58909G46653J727K986M240M901N247N809O777Q309J0630J3309J5196J5721J5619
58896H57124J5790J6098J5962J5512J5308J5391J5466J5701J6511J7748J8889
58885A035500J9866K1011K2204K2726K2079K0490J8559J6784J5391J4279J3093
58874A241982J1589R845P992N910L464Q24j686l901n758p135q015q666r424j0456
58860A226565j1790j3381j5022j6361j7222j7725j8082j8477j9051j9666j9790
58849A039998j9119j8236j8041j8474j8495j7499j6045j4929j4208j3564j3014
$$ y = [793753, 781847, 771457, 762406, 754489, 748011, 743476, 740719, 738767, 736798, 734833, 733240, 732016, 731033, 730583, 731077, 732397, 734007, 735562, 736958, 738000, 738536, 738831, 739350, 740243, 741378, 742697, 744135, 745453, 746653, 748380, 751366, 755606, 760507, 765754, 771563, 778340, 786649, 797279, 810588, 825784, 841505, 857124, 872914, 889012, 904974, 920486, 935794, 951185, 966651, 982352, 998863, 1016611, 1035500, 1055366, 1076377, 1098581, 1121307, 1143386, 1163876, 1182435, 1199219, 1214610, 1228889, 1241982, 1253571, 1263416, 1271408, 1277318, 1280782, 1281606, 1279920, 1276019, 1270261, 1263126, 1255111, 1246445, 1237021, 1226565, 1214775, 1201394, 1186372, 1170011, 1152789, 1135064, 1116982, 1098505, 1079454, 1059788, 1039998, 1020879, 1002643, 984602, 966128, 947633, 930134, 914089, 899160, 884952, 871388, 858374]
58838H58374j2744j2658j2526j2281j1886j1305j0726j0348r806q458o498n010
58826G34128m536m359l664k628j725o48J117L190M716N579O316O984O988O082
58812G57540M894M221M238M517M525L984L044K120J463Q87j9j483l282m790n344
58797G76515m920m312m290m709m894m747m720m793m319l069j599l22R45K263L319
58782G36348M289O009Q635J1057J2352J3084J4289J5837J6739J6555J5557J3745
58770H84496J0760O732K553r13l469n507p653j0250j2910j4772j5457j5448j5347
58757H02815j5184j4715j3889j2662j0914q961p604p227p262o937o100m975l757
58744F82628k781k463k563k149q34O59J631K331L202L961M248M415M845N078M549
$$ y = [858374, 845630, 832972, 820446, 808165, 796279, 784974, 774248, 763900, 754094, 745636, 739138, 734128, 729592, 725233, 721569, 718941, 717216, 716568, 717685, 720875, 725591, 731170, 737486, 744470, 751458, 757540, 762434, 766655, 770893, 775410, 779935, 783919, 786963, 789083, 790546, 791433, 791414, 789931, 786649, 781859, 776515, 771595, 767283, 762993, 758284, 753390, 748643, 743923, 739130, 734811, 731742, 730143, 729821, 730766, 733029, 736348, 740637, 746646, 755281, 766338, 778690, 791774, 806063, 821900, 838639, 855194, 870751, 884496, 895256, 901988, 904541, 903628, 900159, 894652, 886999, 876749, 863839, 849067, 833610, 818162, 802815, 787631, 772916, 759027, 746365, 735451, 726490, 718886, 711659, 704397, 697460, 691360, 686385, 682628, 679847, 677384, 674821, 672672, 671838, 672497, 674128, 676459, 679661, 683622, 687870, 692285, 697130, 702208, 706757]
58729G06757L666L227L206K967K363J787J466J414J757K373K715K620K813L824
58715G42955N039N643N921O560P243P151O470O135O178N556L660R84j785m460
58701H03250o971r117j0901j2525j3970j5047j5791j6344j6599j6403j5860j5019
58689F38703j3671j1935j0504r695q862p499o297o107o452o157n093m080l379
58676E38972k548j625j246j429j384o73L42J344K455L658M664N468O428P653Q909
58661E70988J0010J0706J0333Q399N411K416k30k838n376p264q198q406q138p546
58647E70267o964o634o307n703n151n047n050m518l503k496j583o49L2L10P98
58632E17802J923K839K466J209L65K09M3j70J88Q40P15j82n61J80J105J342J231
$$ y = [706757, 710423, 713650, 716856, 719823, 722186, 723973, 725439, 726853, 728610, 730983, 733698, 736318, 739131, 742955, 747994, 753637, 759558, 766118, 773361, 780512, 786982, 793117, 799295, 804851, 808511, 809495, 807710, 803250, 796279, 787162, 776261, 763736, 749766, 734719, 718928, 702584, 685985, 669582, 653722, 638703, 625032, 613097, 602593, 592898, 584036, 576537, 570240, 564133, 557681, 551524, 546431, 542351, 538972, 536424, 534799, 533553, 532124, 530740, 530067, 530409, 531753, 534208, 537866, 542530, 547998, 554426, 562079, 570988, 580998, 591704, 602037, 610436, 615847, 618263, 618033, 615195, 609819, 602555, 594357, 585951, 577813, 570267, 563303, 556669, 550362, 544659, 539508, 534461, 529411, 524893, 521390, 518894, 517311, 516662, 516694, 517004, 517802, 519725, 522564, 525030, 526239, 526604, 526813, 526856, 526686, 526874, 527714, 528429, 528247, 527686, 527866, 528971, 530313, 531544]
58615E31544J391J783K211K769L392L784M083M684N261N056M273M010M523M728
58601E83492L891K615J705J133P27P32J106J194P61M46O44Q23O57Q68K204M236
58585F07234N998P254Q488R993J1522J2536J2559J1627J0543J0169J0388J0362
58573G28673R826R305Q970Q314P251O589O957Q142R882J2432J5707J8718K0622
58560H71388K1786K3097K4597K5414K4841K2981K0462J7778J4848J1237O940K725
58548A088094o60l262n429o872p097o478o002o116o718q067j0587j3748j6327
58535I90731j7950j9425k1300k3126k4301k4650k3951k1909j8961j6252j4459
58524G64447j3301j2350j1480j0449q975p412o485o175n698m725l797l379l345
$$ y = [531544, 532935, 534718, 536929, 539698, 543090, 546874, 550957, 555641, 560902, 565958, 570231, 574241, 578764, 583492, 587383, 589998, 591703, 592836, 593563, 594295, 595401, 596595, 597356, 597802, 598446, 599269, 599926, 600794, 602998, 607234, 613232, 620486, 628974, 638967, 650489, 663025, 675584, 687211, 697754, 707923, 718311, 728673, 738499, 747804, 756774, 765088, 772339, 778928, 785885, 794027, 803909, 816341, 832048, 850766, 871388, 893174, 916271, 940868, 966282, 991123, 1014104, 1034566, 1052344, 1067192, 1078429, 1085369, 1088094, 1087434, 1084172, 1078743, 1071871, 1064774, 1058296, 1052294, 1046178, 1039460, 1031393, 1020806, 1007058, 990731, 972781, 953356, 932056, 908930, 884629, 859979, 836028, 814119, 795158, 778906, 764447, 751146, 738796, 727316, 716867, 707892, 700480, 693995, 687820, 682122, 677397, 673600, 670221, 666876]
58511F66876l420l343k683j348j28J63j07j04pn23j279j262o79o23j019o59N63
58494F50418J340J147R75J440J973K384L359M810N482N054M929O102P805R120
58480G06338J0344J1856J3147J4004J5200J7009J8362J8426J7631J6258J3496
58469H72071R061M327O90k065m656o805q022q675r132q840p307n024k516M10L626
58454H27143O093P325Q260R664J0886J1177J0904J0372Q763N498J523k051n446
58441I10111r053j1961j3067j2768j2200j1605j0623r379q167o781n126l673k435
58428G93273n56K145M383N197N447O366P707Q534Q785Q794Q148O300L652R74j437
58413H67712l370m438m979o073p864r137r275r199r503r289q010o710o207n518
$$ y = [666876, 663456, 660113, 657430, 656082, 655954, 656117, 656010, 655906, 655899, 655376, 654097, 652835, 652156, 651533, 650514, 649855, 650418, 651758, 652905, 653880, 655320, 657293, 659677, 663036, 667846, 673328, 678382, 683311, 689413, 697218, 706338, 716682, 728538, 741685, 755689, 770889, 787898, 806260, 824686, 842317, 858575, 872071, 881132, 885459, 886149, 884084, 879428, 872623, 864601, 855926, 846794, 837954, 830647, 825623, 823107, 823517, 827143, 833236, 840561, 848821, 858485, 869371, 880548, 891452, 901824, 910587, 916085, 917608, 915557, 910111, 901058, 889097, 876030, 863262, 851062, 839457, 828834, 819455, 811288, 804507, 799381, 795708, 793273, 792717, 794862, 799245, 804442, 809889, 816255, 823962, 832496, 841281, 850075, 858223, 864523, 868175, 869149, 867712, 864342, 859904, 854925, 848852, 840988, 831851, 822576, 813377, 803874, 794585, 786575, 779865, 773658, 768140]
58399G68140l615j251M03J543K687L312L048K914L767M837N265N646O573P177
58385H10446O775O440P134P760O953N422M569M066K765Q46q17k259l567l668j844
58370H51021O56K332L464M831N926O346P301R572J1565J1703J1247J2194J3836
58357I51994J4099J3201J3103J4094J4567J3646J1750R212O392M475M068L946
58345A074547L012K299L018M102M036L613M322N456N564N473O853R041J0263J0988
58331A152587J2943J5728J7456J8000J8504J8537J6837J4232J2717J2114J0684
58320A320339Q511P254P024O497N691N809O763P577Q641J0797J2967J3556J3310
58307A434736J3929J4878J4750J4508J5942J7886J7775J6183J5981J7518J8517
$$ y = [768140, 764525, 763274, 763677, 765220, 767907, 771219, 774267, 777181, 780948, 785785, 791050, 796696, 803269, 810446, 817221, 823661, 830795, 838555, 845508, 850930, 855499, 859565, 862330, 863176, 862359, 860100, 856533, 852865, 851021, 851677, 854009, 857473, 862304, 868230, 874576, 881877, 891449, 903014, 914717, 925964, 938158, 951994, 966093, 979294, 992397, 1006491, 1021058, 1034704, 1046454, 1055666, 1062058, 1066533, 1070601, 1074547, 1077559, 1079858, 1082876, 1086978, 1091014, 1094627, 1098949, 1104405, 1109969, 1115442, 1122295, 1131336, 1141599, 1152587, 1165530, 1181258, 1198714, 1216714, 1235218, 1253755, 1270592, 1284824, 1297541, 1309655, 1320339, 1328850, 1336104, 1343128, 1349625, 1355316, 1361125, 1367888, 1375465, 1384106, 1394903, 1407870, 1421426, 1434736, 1448665, 1463543, 1478293, 1492801, 1508743, 1526629, 1544404, 1560587, 1576568, 1594086, 1612603]
58296A612603J8302J8373J9025J9151J9205K0717K2985K3767K3044K2789K3372
58285A843333K3683K4147K5979K8107K8539K8122K9115L0913L1247L0709L1741
58274B155635L3938L4920L5170L7256M0762M2860M3542M5404M8587N0826N2275
58263B621175N5261N9511O2497O4283O7037P0242P1520P1578P3017P5013P4882
58252C366016P4036P6161Q0348Q2591Q3442Q7092R3399R8236J01520J07186J15075
58241D365102J20909J24724J31210J40958J49647J56770J66724J80117J92597
58232E728758K03475K16892K33277K48518K62726K80563L01887L21835L41213
58223H139144L66241L96882M26671M55615M91257N35167N81025O28368O84900
$$ y = [1612603, 1630905, 1649278, 1668303, 1687454, 1706659, 1727376, 1750361, 1774128, 1797172, 1819961, 1843333, 1867016, 1891163, 1917142, 1945249, 1973788, 2001910, 2031025, 2061938, 2093185, 2123894, 2155635, 2189573, 2224493, 2259663, 2296919, 2337681, 2380541, 2424083, 2469487, 2518074, 2568900, 2621175, 2676436, 2735947, 2798444, 2862727, 2929764, 3000006, 3071526, 3143104, 3216121, 3291134, 3366016, 3440052, 3516213, 3596561, 3679152, 3762594, 3849686, 3943085, 4041321, 4142841, 4250027, 4365102, 4486011, 4610735, 4741945, 4882903, 5032550, 5189320, 5356044, 5536161, 5728758, 5932233, 6149125, 6382402, 6630920, 6893646, 7174209, 7476096, 7797931, 8139144, 8505385, 8902267, 9328938, 9784553, 10275810, 10810977, 11392002, 12020370, 12705270]
58214A2705270P52584Q25492R04415R98710J110558J233545J370483J535528J734688
58205B3171273J963374K228167K550753K945418L416541L985924M698360N592882
58197E0552692O696267Q052818R728019J1772570J4216072J7093348K0412439
58190A38524225K4078046K7914557L1754753L5305053L7745721L7617202L3523973
58183C66463530K5260543J4248578K750530p409457j5483306k1508491k5722654
58176C38599273k8298455k9405727k9296360k8274214k6620591k4552349k2225440
58169A49926137j9769113j7315875j4990212j2871534j0985809r334930p916918
58162E6741746o717396n705952m853634m142610l554465l064049k651598k308371
$$ y = [12705270, 13457854, 14283346, 15187761, 16186471, 17297029, 18530574, 19901057, 21436585, 23171273, 25134647, 27362814, 29913567, 32858985, 36275526, 40261450, 44959810, 50552692, 57248959, 65301777, 75029796, 86802366, 101018438, 118111786, 138524225, 162602271, 190516828, 222271581, 257576634, 295322355, 332939557, 366463530, 391724073, 405972651, 408723181, 401313724, 385830418, 364321927, 338599273, 310300818, 280895091, 251598731, 223324517, 196703926, 172151577, 149926137, 130157024, 112841149, 97850937, 84979403, 73993594, 64658664, 56741746, 50024350, 44318398, 39464764, 35322154, 31767689, 28703640, 26052042, 23743671]
58154B3743671k024801j785050j578510j404792j261771j139165j028955r31853
58146A2588774q48354p72947p02049o38610n83899n33078m83293m38161m00068
58137G188315l65886l34226l08995k91371k75790k58287k41875k29432k18130
58128D664323k05217j92899j83089j73231j61567j50905j43131j35280j25077
58119C193927j15248j08523j03093r6711r0690q6460q2440p7596p3782p1681o8753
58108B218950o3958o0059n8519n6750n3153n0195m9435m8316m5130m2585m2849
58097A648001m3393m1414l8457l6923l5773l3358l1064l0462k9959k7771k5208
58086A274219k3894k2742k0708j9516k0437k1471k0842k0270k1466k2483k1090
$$ y = [23743671, 21718870, 19933820, 18355310, 16950518, 15688747, 14549582, 13520627, 12588774, 11740420, 10967473, 10265424, 9626814, 9042915, 8509837, 8026544, 7588383, 7188315, 6822429, 6488203, 6179208, 5887837, 5612047, 5353760, 5111885, 4882453, 4664323, 4459106, 4266207, 4083118, 3909887, 3748320, 3597415, 3454284, 3319004, 3193927, 3078679, 2970156, 2867063, 2770352, 2679662, 2593202, 2510762, 2433166, 2359384, 2287703, 2218950, 2154992, 2094933, 2036414, 1979664, 1926511, 1876316, 1826881, 1778565, 1733435, 1690850, 1648001, 1604608, 1563194, 1524737, 1487814, 1452041, 1418683, 1387619, 1357157, 1327198, 1299427, 1274219, 1250325, 1227583, 1206875, 1187359, 1166922, 1145451, 1124609, 1104339, 1082873, 1060390, 1039300]
58075A039300j8977j8864j9824j9206j7199j5914j5580j4909j3882j3261j2625
58064H59059j1418j0482j0374r810p972o468o835q051q681r386j0981j2128j1620
58051G34853j0828j1284j1744j0428q357p654q071p951p271p096p257p029o902
58038F22981p458p711o741n584n444n586n132n237o998q877q849p752p760q793
58024E25059r196q894r029r297q425o768n911n995n763m886m200l915l506l039
58010D36235k903k676j797q28n65o20l60l06j038j656j137k15j89p25p27n50j385
57993D18558l050m215m337l836k911j697r33j002j087o26n78j764l034k883j773
57978C84832j152j112r25q33j268j188N77K991L952L300K666K788K911K585K097
$$ y = [1039300, 1020323, 1001459, 981635, 962429, 945230, 929316, 913736, 898827, 884945, 871684, 859059, 847641, 837159, 826785, 816975, 809003, 802535, 795700, 787649, 778968, 769582, 758601, 746473, 734853, 724025, 712741, 700997, 690569, 682212, 674558, 666487, 658536, 651265, 644169, 636912, 629883, 622981, 615523, 607812, 601071, 595487, 590043, 584457, 579325, 574088, 567090, 558213, 549364, 541612, 533852, 525059, 515863, 506969, 497940, 488643, 480218, 473450, 467539, 461544, 455781, 450895, 446695, 442780, 439274, 436235, 433332, 430656, 428859, 428031, 427466, 426846, 426486, 426180, 425142, 423486, 422349, 422134, 421945, 421220, 420493, 419943, 418558, 415508, 411293, 406956, 403120, 400209, 398512, 397579, 396577, 395490, 394864, 394286, 392522, 389488, 386605, 384832, 383680, 382568, 381643, 380810, 379542, 378354, 378931, 381922, 385874, 389174, 391840, 394628, 397539, 400124, 402221]
57963D02221J362J40r17j020p51j250k367l224l990n359o724o828n904n316n300
57948C54773m795l479k207j549j326j496k049k183j073P56K141L008M045N108
57934C49674N538N647O311P324P718P367O827N904L988J510n65k350m540o594
57920C93759p260o749o604p364p991p760p163o781o603o569o505n644l443p47
57906C06576J122K111K904L177K054P5j097r37m81n12r28j729l002l892l290j648
57890C00503m91j08N93J862K659K629K720L312L484K756J998J936K103J949J750
57875C29655J764J623J163Q71R76J081J114J555K321K407J200o13j847j911r45
57860C40414L58J081R31P19J212J854J639R48J123K332L315L303K799K327J767
$$ y = [402221, 403583, 403723, 402806, 401786, 401035, 399785, 397418, 394194, 390204, 384845, 378121, 371293, 365389, 360073, 354773, 349978, 346499, 344292, 342743, 341417, 339921, 337872, 335689, 334616, 335372, 337513, 340521, 344566, 349674, 355212, 360859, 367170, 374494, 382212, 389579, 396406, 402310, 406298, 407808, 407243, 404893, 400353, 393759, 386499, 379750, 373146, 365782, 357791, 350031, 342868, 336087, 329484, 322915, 316410, 310766, 307323, 306576, 307698, 309809, 312713, 315890, 317944, 318019, 316922, 315985, 315504, 314992, 314064, 312335, 309333, 305441, 302151, 300503, 300012, 299904, 300497, 302359, 305018, 307647, 310367, 313679, 317163, 319919, 321917, 323853, 325956, 327905, 329655, 331419, 333042, 334205, 335076, 336052, 337133, 338247, 339802, 342123, 344530, 345730, 345117, 343270, 341359, 340414, 340772, 341853, 342784, 343503, 344715, 346569, 348208, 349156, 350279, 352611, 355926, 359229, 362028, 364355, 366122]
57845C66122J206J158J501J381M55o77j470j833j584o29K94L12j98j65K84K3r34
57828C65246j209k66P93J124J280J840K343K358K303K414K087R88k06q40j146
57813C79109j504j817k107k803l889m733n188n935p236q309q461p938p258o615
57799C05316o270o485o741o032m385l023k603k337j384l1J029J634J886J806J694
57784B74074J946K265K012J510J793K860L522L437L769N184O578O722N915N085
57770C26672M271L068J683N96k14j006j767k486l212l559l011k034j819k544l046
57755C11592k664k042j593o20J158K655L049L139L940N005N376N192N109M917
57741C44213M057K853K019J437N69l85p61n51l17l59o42j145j567j252j10Q92
$$ y = [366122, 367328, 368486, 369987, 371368, 371823, 371146, 369676, 367843, 366259, 365630, 365924, 366236, 366038, 365873, 366157, 366180, 365246, 364037, 363771, 364564, 365688, 366968, 368808, 371151, 373509, 375812, 378226, 380313, 381301, 381095, 380255, 379109, 377605, 375788, 373681, 370878, 366989, 362256, 357068, 351133, 343897, 335588, 327127, 319189, 311931, 305316, 299046, 292561, 285820, 279788, 275403, 272380, 269777, 267440, 266056, 266025, 267054, 268688, 270574, 272380, 274074, 276020, 278285, 280297, 281807, 283600, 286460, 289982, 293419, 297188, 302372, 308950, 315672, 321587, 326672, 330943, 334011, 335694, 336290, 336076, 335070, 333303, 330817, 327605, 324046, 321035, 319001, 317182, 314638, 311592, 308928, 306886, 305293, 304673, 305831, 308486, 311535, 314674, 318614, 323619, 328995, 334187, 339296, 344213, 348270, 351123, 353142, 354579, 355148, 354763, 354002, 353451, 353134, 352775, 352133, 350988, 349421, 348169, 348059, 348951]
57725C48951R14L59J49M46Q40J190J538J641J325Q70N40J93j54q3L80M19m38j602
57707C57478k387k887l302l258k590j957j862j831j351q04o59n33N3P47J035J067
57691C36959R96L90q49j880k236k734l947m772l946k175j225j421j555q51M55
57676C11209K310N104Q767J2713J6770K1261K6308L1970L8799M7267N6615O4933
57664F44026O9876O8744N8976M0360J6650o465k5225l8967m8086n2588n2812n0105
57652F24384m6067m1701l7457l3373k9060k4238j9386j5283j2036r282p077n773
57640C43651n047m040k484r41J78J037J738J960J449M14o80j396j519j302j346
57625C31672j872k482k895l421m253m879m868m590m478m158l222k210j938k245
$$ y = [348951, 349865, 350224, 350373, 350819, 351659, 352849, 354387, 356028, 357353, 358223, 358763, 358956, 358802, 358719, 359099, 359518, 359080, 357478, 355091, 352204, 348902, 345644, 343054, 341097, 339235, 337404, 336053, 335249, 334590, 334057, 334110, 334857, 335892, 336959, 337955, 338345, 337496, 335616, 333380, 330646, 326699, 321927, 317981, 315806, 314581, 313160, 311605, 310754, 311209, 313519, 318623, 327390, 340103, 356873, 378134, 404442, 436412, 475211, 522478, 579093, 644026, 713902, 782646, 841622, 881982, 898632, 892167, 866942, 827975, 779889, 727301, 674489, 624384, 578317, 536616, 499159, 465786, 436726, 412488, 393102, 377819, 365783, 356501, 349424, 343651, 338604, 334564, 332080, 331139, 331317, 332354, 334092, 336052, 337501, 337915, 337235, 335839, 334320, 333018, 331672, 329800, 327318, 324423, 321002, 316749, 311870, 307002, 302412, 297934, 293776, 290554, 288344, 286406, 284161]
57611B84161k373k210k203k410k612k923l381l318k172o15K07J23k47p46j567
57596B57714k285k256j733j520j692j797k003k764l583l478k551j784j394p64
57582B28110J04N15N01Q26J388J136r7j107j170j031j481k185k568k795l195l572
57566B13379l708l761l759l422k935l027l870m655m645l945k977j991j376j478
57552A67830j814j373j20P45N15l1Q5O88J093J308J699K050J790R27J20q6L14
57535A75740R07J188R51M87J75k3l08n05l34oO2K5K99O49M81L8J92J034J644J500
57515A84196J087R68J164J716K711L546L253J966J012J057J244P21j10n44p81
57500B03206j324j939k109j861j500j037n41m63r74j543j640j404j135p72k99
$$ y = [284161, 281788, 279578, 277375, 274965, 272353, 269430, 266049, 262731, 260559, 259944, 260151, 260274, 260027, 259281, 257714, 255429, 253173, 251440, 249920, 248228, 246431, 244428, 241664, 238081, 234603, 232052, 230268, 228874, 228110, 228214, 228729, 229230, 230056, 231444, 232580, 232483, 231376, 230206, 229175, 227694, 225509, 222941, 220146, 216951, 213379, 209671, 205910, 202151, 198729, 195794, 192767, 188897, 184242, 179597, 175652, 172675, 170684, 169308, 167830, 166016, 164643, 164523, 165268, 165783, 165752, 165837, 166525, 167618, 168926, 170625, 172675, 174465, 175392, 175512, 175426, 175740, 176647, 177835, 178786, 179273, 179448, 179425, 179117, 178612, 178278, 178272, 178334, 178359, 178658, 179307, 179788, 179826, 180018, 181052, 182696, 184196, 185283, 186251, 187415, 189131, 191842, 195388, 198641, 200607, 201619, 202676, 203920, 204641, 204531, 203987, 203206, 201882, 199943, 197834, 195973, 194473, 193436, 192895, 192432, 191458, 189915, 188275, 186871, 185736, 184964, 184665]
57485A84665m6j02j06k5l71j139j348l70R72J390O22o17j672k219k161j912k311
57468A73250l553m663m613l534k276j347q72j032j755k438k525k124j516o43L74
57453A40733P91J04j098j780j646j095m16L03Q74J214J538J927J999J572J069
57438A46089Q14M69k13o13KJ356K499K938K832K461K169K366K923K994K120J081
57422A72287R28J542J945J677J050L44l55p40n89l75p65j546j853j442r45q21
57406A70342p81m59n5J1l03o43o92n36o58j373k196k225j277k50J6k47l45k18
57388A58111k41l23K9Q89J771K301K480K365J968J456J106J045J255J615J789
57373A77616J405O43K50N94J097R81K37n65j051j167r42n39l43n68r92j302j285
$$ y = [184665, 184619, 184517, 184411, 184386, 184015, 182876, 181528, 181158, 182130, 183520, 184142, 183525, 181853, 179634, 177473, 175561, 173250, 169697, 165034, 160421, 156887, 154611, 153264, 152392, 151360, 149605, 147167, 144642, 142518, 141002, 140359, 140733, 141524, 141628, 140530, 138750, 137104, 136009, 135593, 135896, 136770, 137984, 139522, 141449, 143448, 145020, 146089, 146903, 147372, 147159, 146546, 146548, 147904, 150403, 153341, 156173, 158634, 160803, 163169, 166092, 169086, 171206, 172287, 173215, 174757, 176702, 178379, 179429, 179773, 179418, 178678, 178089, 177714, 176949, 175403, 173550, 172108, 171163, 170342, 169561, 169102, 169047, 169058, 168755, 168112, 167420, 166884, 166226, 164853, 162657, 160432, 159155, 158905, 158921, 158674, 158329, 158111, 157870, 157547, 157576, 158465, 160236, 162537, 165017, 167382, 169350, 170806, 171912, 172957, 174212, 175827, 177616, 179021, 179664, 179914, 180508, 181605, 182586, 182823, 182258, 181207, 180040, 179098, 178559, 178216, 177648, 176656, 175354, 174069]
57356A74069o82N88J839K129J644J610K362K623J478j7l28L90Q75P69P24R06Q60
57339A91839N85N04N86N46O99J443K213K193J744J796K064J437J18l57N18J402
57323B09330J264Q42J194K017K317J862J140N75M69J084K126K713K400J718J303
57308B32354J098Q94R41J445J970K026J807J835K232K779L301L595L411K911K691
57293B65290K985L294L243L273L885M674M808M272L855M063M619N099N470N898
57279C24728O368O741O950O985O852O617O405O222N838M995L857L133L457M588
57265D03736N519N568N074M748M659M269L230J742J87j022j365m59J466L731N858
57250D46941P795R570J1040J1990J2215J1645J0662R991R956J0101J0028J0118
$$ y = [174069, 173387, 173975, 175814, 177943, 179587, 181197, 183559, 186182, 187660, 187643, 187315, 187705, 188580, 189349, 190073, 190979, 191839, 192424, 192928, 193514, 194060, 194759, 196202, 198415, 200608, 202352, 204148, 206212, 207649, 207767, 207410, 207928, 209330, 210594, 211436, 212630, 214647, 216964, 218826, 219966, 220541, 221010, 222094, 224220, 226933, 229333, 231051, 232354, 233452, 234346, 235287, 236732, 238702, 240728, 242535, 244370, 246602, 249381, 252682, 256277, 259688, 262599, 265290, 268275, 271569, 274812, 278085, 281970, 286644, 291452, 295724, 299579, 303642, 308261, 313360, 318830, 324728, 331096, 337837, 344787, 351772, 358624, 365241, 371646, 377868, 383706, 388701, 392558, 395691, 399148, 403736, 409255, 414823, 419897, 424645, 429304, 433573, 436803, 438545, 438732, 437710, 436345, 435886, 437352, 441083, 446941, 454736, 464306, 475346, 487336, 499551, 511196, 521858, 531849, 541805, 551906, 561934, 572052]
57238E72052J0772J1344J0910R877R756J1115J2762J3377J3059J2794J3103J3778
57226G14699J4441J4803J4710J4451J4651J5595J6882J8038J9017J9796J9902
57215H96985J8812J6598J3931J1601J0238J0094J0743J1296J1236J0887J0753
57204A033174J0660R935Q415O885O391P226Q755J0322J2134J4923J8702K2379
57192A169901K4943K6538K7800K8612K8316K7051K5904K5549K5506K5028K4144
57181A459292K3458K3373K3804K4373K4716K4767K4745K4662K4145K3233K2951
57170A723519K4346K7024K9557L1252L2602L4011L5253L6478L8589M1965M5642
57159B100238M8331M9570M9381M7662M4687M1477L8974L7372L6776L7609L9422
$$ y = [572052, 582824, 594168, 605078, 614955, 624711, 635826, 648588, 661965, 675024, 687818, 700921, 714699, 729140, 743943, 758653, 773104, 787755, 803350, 820232, 838270, 857287, 877083, 896985, 915797, 932395, 946326, 957927, 968165, 978259, 989002, 1000298, 1011534, 1022421, 1033174, 1043834, 1053769, 1062184, 1069069, 1075460, 1082686, 1091441, 1101763, 1113897, 1128820, 1147522, 1169901, 1194844, 1221382, 1249182, 1277794, 1306110, 1333161, 1359065, 1384614, 1410120, 1435148, 1459292, 1482750, 1506123, 1529927, 1554300, 1579016, 1603783, 1628528, 1653190, 1677335, 1700568, 1723519, 1747865, 1774889, 1804446, 1835698, 1868300, 1902311, 1937564, 1974042, 2012631, 2054596, 2100238, 2148569, 2198139, 2247520, 2295182, 2339869, 2381346, 2420320, 2457692, 2494468, 2532077, 2571499]
57148B571499L9980L6850K9888K1445J4368J0404J0008J2356J5272J6042J3069
57137B791181O979L22l783l501M05N204Q578J0178J0729J0559R952J0146J2515
57124B869464J6751K0986K3866K5525K6437K6404K5035K2431J9008J5326J2376
57113C103609J1205J1908J3685J6201K0103K5878L3163M1811N2801O7266Q5306
57102C482936J06696J32268J63820K03124K51909L12355L86653M76233N82036
57093F098030P04673Q42900R92126J145343J295087J433456J551734J642758J703339
57084A7409446J731261J719898J660415J551964J406338J238701J055502Q55130
57076B8628655O38355M12416J84301m4674k75372n05887p33001r55076j169269
$$ y = [2571499, 2611479, 2648329, 2678217, 2699662, 2714030, 2724434, 2734442, 2746798, 2762070, 2778112, 2791181, 2798160, 2798482, 2794699, 2791198, 2791603, 2796807, 2805385, 2815563, 2826292, 2836851, 2846803, 2856949, 2869464, 2886215, 2907201, 2931067, 2956592, 2983029, 3009433, 3034468, 3056899, 3075907, 3091233, 3103609, 3114814, 3126722, 3140407, 3156608, 3176711, 3202589, 3235752, 3277563, 3330364, 3397630, 3482936, 3589632, 3721900, 3885720, 4088844, 4340753, 4653108, 5039761, 5515994, 6098030, 6802703, 7645603, 8637729, 9783072, 11078159, 12511615, 14063349, 15706107, 17409446, 19140707, 20860605, 22521020, 24072984, 25479322, 26718023, 27773525, 28628655, 29267010, 29679426, 29863727, 29819053, 29543681, 29037794, 28304793, 27349717, 26180448]
57067B6180448j366954j535482j664566j749120j787108j778066j724426j632174
57059A2942552j509447j365659j211571j057883r12551p80060o63048n63140m80044
57050D399149m11575l55337l09559k72306k41291k15032j93135j75032j59439
57041B066443j45379j32728j21332j10562j00109r0258q1003p1775o2405n3338
57031A097554m4507l5045k4625j4204m809L747J2364K1317K9366L3466K9654J6010
57019A120288m461k4916l9638m7540n0888n2025n2058n1375m9971m7607m4391
57008F55418m0890l7207l2729k7357k2230j8507j6103j4208j2408j0693r011p555
56996D06520o804o687o358n393m431l892k994r57J551L255M059M970O578Q415
$$ y = [26180448, 24813494, 23278012, 21613446, 19864326, 18077218, 16299152, 14574726, 12942552, 11433105, 10067446, 8855875, 7797992, 6885441, 6105381, 5442333, 4879193, 4399149, 3987574, 3632237, 3322678, 3050372, 2809081, 2594049, 2400914, 2225882, 2066443, 1921064, 1788336, 1667004, 1556442, 1456333, 1366075, 1285072, 1213297, 1150892, 1097554, 1053047, 1018002, 993377, 979173, 974364, 978111, 990475, 1011792, 1041158, 1074624, 1104278, 1120288, 1115827, 1090911, 1051273, 1003733, 952845, 900820, 848762, 797387, 747416, 699809, 655418, 614528, 577321, 544592, 517235, 495005, 476498, 460395, 446187, 433779, 423086, 414075, 406520, 399716, 393029, 386671, 381278, 376847, 372955, 369961, 369004, 370555, 373810, 377869, 382839, 389417, 397832]
56982C97832R554R095O538K370j988n527q465j1219j3251j3799j3210j2524j2117
56969C33289j1608j0717r307o942l466K89L246N407P574R978J2182J4183J6437
56956C60545J8607J9137J6651J1301M535k082p665j1906j4626j5691j5448j4860
56944C48498j4590j4065j2265r402o747m634j954J887N829Q906J1845J5720J9980
56931C49008K3172K4721K4582K1909J5795P140j760r357j5400j9748k2211k3452
56919C74399k4458k4996k3944k1316j8532j6440j4390j1717q897o717n336m688
56907A92968m794n129m641l068j495j003j321j429q46J55J187K098K939L943N287
56892A84851O850Q462J0325J2683J5130J6919J7960J8759J9242J8445J5644J1217
$$ y = [397832, 407386, 416481, 423019, 425389, 423401, 417874, 409409, 398190, 384939, 371140, 357930, 345406, 333289, 321681, 310964, 301657, 294715, 291249, 291538, 294784, 300191, 307765, 317743, 329925, 344108, 360545, 379152, 398289, 414940, 426241, 430776, 428694, 421029, 409123, 394497, 378806, 363358, 348498, 333908, 319843, 307578, 298176, 291429, 286795, 284841, 286728, 292557, 301463, 313308, 329028, 349008, 372180, 396901, 421483, 443392, 459187, 466327, 464567, 455210, 439810, 420062, 397851, 374399, 349941, 324945, 301001, 279685, 261153, 244713, 230323, 218606, 209709, 202992, 197656, 192968, 188174, 183045, 178404, 175336, 173841, 172838, 171517, 170088, 169242, 169397, 170584, 172682, 175621, 179564, 184851, 191701, 200163, 210488, 223171, 238301, 255220, 273180, 291939, 311181, 329626, 345270, 356487]
56880C56487O127J172l093o280q399r680r965q852o583m110j936N37M075Q520
56866C18020J3114J7552K2160K7183L2312L6986M0828M3556M4380M1719L4157
56855F71967K2084Q169m357j3928k0943k6268k9941l1276k9714k5492j9728j3672
56843D86901p696j254N979J3469K0823K8693L7888M7986N7685O6082P2455P4934
56831I03945P0744N8398L9173J6359o408k6236m1477n1834n7796n9873n8492n4390
56819G32113m8478m1439l3877k6470j9381j1811k913P049J7045K6460L5164M2719
56807F76181M8313N1073M9671M2257K8293J0283p648k2952l5364m4774n0207n1341
56795F93785m9441m6023m1696l6819l2087k7680k2822j6936j0548m319J955Q624
$$ y = [356487, 362614, 363786, 360693, 354413, 346014, 336334, 326369, 317517, 310934, 306824, 304888, 305425, 309500, 318020, 331134, 348686, 370846, 398029, 430341, 467327, 508155, 551711, 596091, 637810, 671967, 694051, 702220, 697863, 683935, 662992, 636724, 606783, 575507, 545793, 520301, 500573, 486901, 479205, 477951, 483930, 497399, 518222, 546915, 584803, 632789, 690474, 756556, 829011, 903945, 974689, 1033087, 1072260, 1088619, 1082211, 1055975, 1014498, 962664, 904868, 844995, 786503, 732113, 683635, 642196, 608319, 581849, 562468, 550657, 547744, 554793, 571838, 598298, 633462, 676181, 724494, 775567, 825238, 867495, 895788, 906071, 898423, 875471, 840107, 795333, 745126, 693785, 644344, 598321, 556625, 519806, 487719, 460039, 437217, 420281, 409733, 405414, 407369, 415993]
56783D15993J5168K0608K4495K6714K6681K3421J6514O694m255j4266k2037k7523
56771E08207l1115l2682l2022k9992k8068k6652k4824k2015j8904j6348j4322
56760B31263j2454j0759r336q012o726n687m859l886k871k418k655k922k786k549
56746A53343k456k185j533r18p15p24p35r03j282j590j772k091k397k120j213
56731A30709l70K1K77N55M74j7l31j70J17L66Q62J417J353P64O48J234J498R20
56713A40327M52Q71J455J345J065J418J883J491N70K92Q91J621K043K311K363
56698A60398J928J102K15o10j140q10M42J658J951J595J259Q28Nn76q5J041J553
56681A70754J151O96P37Q85P43N55O90J082J349J123L18o56j167j126j104j332
$$ y = [415993, 431161, 451769, 476264, 502978, 529659, 553080, 569594, 576288, 572033, 557767, 535730, 508207, 477092, 444410, 412388, 382396, 354328, 327676, 302852, 280837, 261933, 245585, 231263, 218809, 208050, 198714, 190702, 183976, 178289, 173430, 169544, 166673, 164255, 161600, 158678, 155892, 153343, 150887, 148702, 147169, 146251, 145536, 144812, 144077, 143174, 141892, 140302, 138530, 136439, 134042, 131922, 130709, 130339, 130360, 130637, 131192, 131666, 131649, 131318, 131148, 131265, 131631, 132493, 133910, 135263, 136027, 136675, 137909, 139407, 140327, 140779, 141650, 143105, 144450, 145515, 146933, 148816, 150307, 150877, 151169, 152060, 153681, 155724, 158035, 160398, 162326, 163428, 163643, 163033, 161893, 161083, 161525, 163183, 165134, 166729, 167988, 168816, 168821, 168245, 168160, 169201, 170754, 171905, 172601, 173338, 174223, 174966, 175521, 176211, 177293, 178642, 179765, 180083, 179427, 178260, 177134, 176030, 174698]
56665A74698j242m67L18L46m4j8L30J36q17j736j829j108j50M34M39K70N49J253
56647A71362J652J375R12P14M65j21m98l6R65J698J859J588Q98l6n68l14J66Q3
56629A82164n58j260j759j861j210RP46L38m79o38k37p4l22o56j108j755k044
56612A69296j524q23p93j149j072o72o08o46j3J016J254M03n41p52l61L06J101
56595A64422J580J221L20k24j80r7j81m8K96L05m5n8M64Q37O62M53O79R71Q79
56576A72256O58P22Q25M58k30m91J07J195K073K440K591K961L652M552N699P128
56560B06596Q462R235R665J0390J1295J1370J0087Q066N967L612R16j286k248
56547B92127k464k858l420l542l216k917k755k562k479k596k593k382k518l135
$$ y = [174698, 173456, 172989, 173307, 173653, 173609, 173591, 173921, 174057, 173240, 171504, 169675, 168567, 168417, 168851, 169290, 169560, 170109, 171362, 173014, 174389, 175301, 176015, 176480, 176359, 175861, 175825, 176790, 178488, 180347, 181935, 182833, 182797, 182229, 181915, 182081, 182164, 181606, 180346, 178587, 176726, 175516, 175525, 176271, 176609, 176130, 175492, 175255, 175181, 174859, 174203, 173095, 171340, 169296, 167772, 166949, 166156, 165007, 163935, 163263, 162655, 162009, 161996, 163012, 164266, 164669, 164128, 163376, 163015, 163321, 164422, 166002, 167223, 167543, 167319, 167139, 167042, 166861, 166813, 167109, 167414, 167369, 167311, 167775, 168612, 169274, 169727, 170406, 171377, 172256, 172914, 173636, 174461, 174919, 174689, 174198, 174305, 175500, 177573, 180013, 182604, 185565, 189217, 193769, 199468, 206596, 215058, 224293, 233958, 244348, 255643, 267013, 277100, 285166, 291133, 294745, 295661, 294375, 292127, 289663, 286805, 283385, 279843, 276627, 273710, 270955, 268393, 265914, 263318, 260725, 258343, 255825, 252690]
56533B52690l327k487j475j366j831j971j884k085k236j938k011l164m145l253
56519B19517j262o55k010l346l247k528k259k161j761j499j697j767j270o81m47
56504A92927k70K3N4k17j48M50Q56O44L45L68K97j68n32m07k05k85k38L61J091
56485A94946J213N93k77p92n10M47J212J035L91M18J278J962J834J327R03M13
56469B06393j43k43K43O28M15M4J34N97Q33L99p06j897k198j229Q1N03J27L6N31
56450B04548Q21N16J92K25K24m0j59Q9L67M83N89N93K57j5M13J176J309Q76Q83
56431B13347J374J197Qj015j081r44j357j750j389o95l84k49K10P85J033J078
56415B10168J157J011N02J66M66J025J181Q33L06j12j30M30J171J452J296J280
$$ y = [252690, 249363, 246876, 245401, 244035, 242204, 240233, 238349, 236264, 234028, 232090, 230079, 226915, 222770, 219517, 218255, 217600, 215590, 212244, 208997, 206469, 204210, 202049, 200288, 198789, 197092, 195325, 194055, 193374, 192927, 192657, 192680, 192734, 192517, 192369, 192819, 193675, 194319, 194664, 195032, 195329, 195161, 194629, 194222, 194017, 193732, 193494, 193855, 194946, 196159, 196752, 196475, 195683, 195173, 195620, 196832, 197867, 198258, 198676, 199954, 201916, 203750, 205077, 205980, 206393, 206250, 206007, 206250, 206878, 207293, 207337, 207471, 208068, 208901, 209300, 208594, 206697, 204499, 203270, 203351, 203854, 203981, 204017, 204548, 205369, 205885, 206077, 206302, 206526, 206486, 206327, 206416, 206783, 207266, 207855, 208448, 208705, 208690, 209103, 210279, 211588, 212464, 213347, 214721, 215918, 215926, 214911, 213830, 212886, 211529, 209779, 208390, 207695, 207311, 207062, 207272, 208057, 209090, 210168, 211325, 212336, 212838, 213004, 213470, 214495, 215676, 216509, 216815, 216703, 216573, 217003, 218174, 219626, 220922, 222202]
56399B22202J403J057K42k30j2L23M31O68J120J262J034J117J686K025J797J561
56383B37686J623J539J252J389J858J544J59r47p20R7L22O8O3K66K84L36P85J353
56365B48957J621J693J733J547J213J253J705J907J707J758K151K021J189Q59
56351B71314J708K581K204J069M84P47J370K150K842K735J702Q66J089J584J200
56336B95645K50p4N62J643K832L841L967K998K069K403L625M379M178L637L230
56321C35185K862K456K055J525Q48M95Q86J729K309K103R77o60j699j163M75J677
56305C52060J847J919K586L224L255L259L872M650M940M951N121N347N569O166
56291D08766P041P298O590N782N631N949O605P972R640J0218R410Q822R587J0714
$$ y = [222202, 223605, 224662, 224904, 224674, 224662, 224985, 225416, 226084, 227204, 228466, 229500, 230617, 232303, 234328, 236125, 237686, 239309, 240848, 242100, 243489, 245347, 246891, 247050, 246103, 245383, 245480, 245802, 245870, 245933, 246199, 246483, 246819, 247604, 248957, 250578, 252271, 254004, 255551, 256764, 258017, 259722, 261629, 263336, 265094, 267245, 269266, 270455, 271314, 273022, 275603, 277807, 278876, 279360, 280107, 281477, 283627, 286469, 289204, 290906, 291772, 292861, 294445, 295645, 295895, 295821, 296383, 298026, 300858, 304699, 308666, 311664, 313733, 316136, 319761, 324140, 328318, 331955, 335185, 338047, 340503, 342558, 344083, 344931, 345426, 346312, 348041, 350350, 352453, 353430, 352770, 351071, 349908, 350383, 352060, 353907, 355826, 358412, 361636, 364891, 368150, 372022, 376672, 381612, 386563, 391684, 397031, 402600, 408766, 415807, 423105, 429695, 435477, 441108, 447057, 453662, 461634, 471274, 481492, 490902, 499724, 509311, 520025]
56277E20025J0979J0903J1451J2186J2389J2741J4156J5948J6902J7334J8447
56266F73461K0426K2582K4708K6860K8571K9701L1352L4605L9083M3958M9495
56255A024802N6232O3530P0436P7278Q5214R4808J06112J19116J32899J45542
56245A975969J56229J66461J77707J88859J97454K02311K03435K00453J92874
56236C661752J81034J65176J44503J18798R0022O0604L0998N16l0256n9582q6237
56225D277328j09507j28501j43131j54737j64170j70326j72213j71186j69147
56216B894410j65850j60114j52590j44925j37188j28523j19521j11535j04313
56207A669851r6691q8951q2224p6143o9505o2684n6997n2209m7145m2222l8808
$$ y = [520025, 531004, 541907, 553358, 565544, 577933, 590674, 604830, 620778, 637680, 655014, 673461, 693887, 716469, 741177, 768037, 796608, 826309, 857661, 892266, 931349, 975307, 1024802, 1081034, 1144564, 1215000, 1292278, 1377492, 1472300, 1578412, 1697528, 1830427, 1975969, 2132198, 2298659, 2476366, 2665225, 2862679, 3064990, 3268425, 3468878, 3661752, 3842786, 4007962, 4152465, 4271263, 4361285, 4421889, 4452887, 4453403, 4423147, 4363565, 4277328, 4167821, 4039320, 3896189, 3741452, 3577282, 3406956, 3234743, 3063557, 2894410, 2728560, 2568446, 2415856, 2270931, 2133743, 2005220, 1885699, 1774164, 1669851, 1573160, 1484209, 1401985, 1325842, 1256337, 1193653, 1136656, 1084447, 1037302, 995080, 956272]
56196I56272l6454l3416k9666k6739k4764k2311j9290j7296j6704j5873j3821
56185F99938j1466r750q470p462p104p148o671n438m047k753j606j280k061k519
56171F22163j146J035J622L26q66p99k06L34J270K669L867M727N683O582P050
56156F54311P710R360J1365J2686J3839J5936J8508K0455K2373K5607K9633L3006
56144H74789L6303M1326M7889N4222O0241O7342P4961Q0499Q2892Q3373Q2353
56133A586190P8532P1701O3818N6581N0253M5179M1991L9709L6049L0237K3506
56122B123746J6696R562K619k884p221j2244j8911k6763l5763m6340n7517o7281
56110A877699p4807q0258q2810q1425p7261p2669o7988o1919n4645m7730m1396
$$ y = [956272, 919818, 886402, 856736, 829997, 805233, 782922, 763632, 746336, 729632, 713759, 699938, 688472, 678722, 670252, 662790, 655686, 648538, 641867, 636429, 632382, 629629, 628023, 626743, 624682, 622163, 621017, 622052, 623674, 624000, 623134, 622335, 622129, 622463, 623733, 626402, 630269, 634996, 640679, 647261, 654311, 662021, 671381, 682746, 695432, 709271, 725207, 743715, 764170, 786543, 812150, 841783, 874789, 911092, 952418, 1000307, 1054529, 1114770, 1182112, 1257073, 1337572, 1420464, 1503837, 1586190, 1664722, 1736423, 1800241, 1856822, 1907075, 1952254, 1994245, 2033954, 2070003, 2100240, 2123746, 2140442, 2150004, 2152623, 2149739, 2142518, 2130274, 2111363, 2084600, 2048837, 2002497, 1944980, 1877699, 1802892, 1722634, 1639824, 1558399, 1481138, 1408469, 1340481, 1278562, 1223917, 1176187, 1134791]
56099A134791l4863k8975k5243k2652j8809j3977j0592q902o758l666j381l45
56087I58628P98K033K042J513K622N018O207O002O591Q027Q142P206Q149J1283
56073A034261J3485J3508J3682J5218J6363J6432J7202J8844J8947J7078J6115
56062A211135J7363J8557J8223J7861J8301J8110J7169J7561J9400J9996J8671
56051A412347J8032J9055J9452J8425J8208J9333J9315J7826J8010K0640K2248
56040A622891K1342K1199K3825K6431K6846K7371L0047L2874L3974L4981L7307
56029A939088L9341M0270M2154M5529M7515M6981M6836M8663N0053M9902N0996
56018B447328N4511N7329N7844N8995O2526O5811O7472P0370P5768Q0378Q2534
$$ y = [1134791, 1099928, 1070953, 1045710, 1023058, 1004249, 990272, 979680, 970778, 964020, 960354, 958973, 958628, 959426, 961459, 963501, 965014, 967636, 972654, 978861, 984863, 991454, 999481, 1007623, 1014829, 1022978, 1034261, 1047746, 1061254, 1074936, 1090154, 1106517, 1122949, 1140151, 1158995, 1177942, 1195020, 1211135, 1228498, 1247055, 1265278, 1283139, 1301440, 1319550, 1336719, 1354280, 1373680, 1393676, 1412347, 1430379, 1449434, 1468886, 1487311, 1505519, 1524852, 1544167, 1561993, 1580003, 1600643, 1622891, 1644233, 1665432, 1689257, 1715688, 1742534, 1769905, 1799952, 1832826, 1866800, 1901781, 1939088, 1978429, 2018699, 2060853, 2106382, 2153897, 2200878, 2247714, 2296377, 2346430, 2396332, 2447328, 2501839, 2559168, 2617012, 2676007, 2738533, 2804344, 2871816, 2942186, 3017954, 3098332, 3180866]
56007C180866Q5413R0742R5542R8433J02681J09421J14755J17254J21347J29316
55997D245770J37273J43179J51175J63540J76134J86487J98284K13163K26682
55988E841687K37509K51633K71956K93002L11555L32726L59548L86997M12972
55979H699585M44210M84224N26801N68946O18145O78811P44640Q13234Q94330
55970A4472926R93857J104829J224954J367564J543314J748162J982869K266639
55962B6705114K617734L041398L553791M196539N009884O015810P247300Q766120
55954F7153690J0628794J2864463J5500380J8550442K1938812K5495939K9058345
55947B01190865L2406016L4891130L5206786L1908724K4498115J4030843K574762
$$ y = [3180866, 3266279, 3357021, 3452563, 3550996, 3653677, 3763098, 3877853, 3995107, 4116454, 4245770, 4383043, 4526222, 4677397, 4840937, 5017071, 5203558, 5401842, 5615005, 5841687, 6079196, 6330829, 6602785, 6895787, 7207342, 7540068, 7899616, 8286613, 8699585, 9143795, 9628019, 10154820, 10723766, 11341911, 12020722, 12765362, 13578596, 14472926, 15466783, 16571612, 17796566, 19164130, 20707444, 22455606, 24438475, 26705114, 29322848, 32364246, 35918037, 40114576, 45124460, 51140270, 58387570, 67153690, 77782484, 90646947, 106147327, 124697769, 146636581, 172132520, 201190865, 233596881, 268488011, 303694797, 335603521, 360101636, 374132479, 376707241]
55940C76707241p948928j6470773k2671734k6594749k8469963k8701346k7777588
55933B18072160k6124029k4043700k1747668j9381224j7035257j4778240j2681574
55926H2280468j0801711r155895p736354o534798n537009m710766m020841l447525
55918C0335569k977128k586852k254310j971727j736789j538486j364386j212769
55910A4693122j085370r75924q76866p89586p17399o55399n97070n44097n00197
55901G951214m61758m23624l88024l58976l33598l07259k81926k61348k43149
55892D891552k23473k04694j90979j80552j69229j57503j47701j38343j27449
55883C351629j17224j09714j02185r2512q4518q2068q2341q0915p9008p9517q0277
$$ y = [376707241, 368758313, 352287540, 329615806, 303021057, 274551094, 245849748, 218072160, 191948131, 167904431, 146156763, 126775539, 109740282, 94962042, 82280468, 71478757, 62322862, 54586508, 48051710, 42514701, 37803935, 33783094, 30335569, 27358441, 24771589, 22517279, 20545552, 18808763, 17270277, 15905891, 14693122, 13607752, 12631828, 11754962, 10965376, 10247977, 9592578, 8995508, 8451411, 7951214, 7489456, 7065832, 6677808, 6318832, 5985234, 5677975, 5396049, 5134701, 4891552, 4668079, 4463385, 4272406, 4091854, 3922625, 3765122, 3617421, 3479078, 3351629, 3234405, 3124691, 3022506, 2929994, 2845476, 2763408, 2681067, 2600152, 2521144, 2441627, 2361350]
55872B361350p7831p4143p3031p3143p0763o6679o4076o2262n8494n3750n0903
55861A636275m9190m5900m1801l9689l9193l7791l5406l3593l1814k8868k6281
55850A226749k6166k7325k7352k6763k7174k7475k5882k3799k3570k4153k3078
55839I44012k1013k0329k0646j9848j8091j7039j6428j4973j3427j3182j3201
55828G55835j1703r587q804q805p994p213q139r616r257p688p609r366j0895j1296
55814F27863j1339j1019r703q129p511p283o163m630l833l132j284R80K136K541
55800E59494L385M144L759L174L920N124M697K668P73m50j684k828l369l953n308
55785E73546o540o628o423p002p463o727o120p385r501j0276r841r723r610q053
$$ y = [2361350, 2283519, 2209376, 2136345, 2063202, 1992439, 1925760, 1861684, 1799422, 1740928, 1687178, 1636275, 1587085, 1541185, 1499384, 1459695, 1420502, 1382711, 1347305, 1313712, 1281898, 1253030, 1226749, 1200583, 1173258, 1145906, 1119143, 1091969, 1064494, 1038612, 1014813, 991243, 967090, 944012, 922999, 902670, 882024, 862176, 844085, 827046, 810618, 795645, 782218, 769036, 755835, 744132, 734545, 725741, 716936, 708942, 701729, 693590, 683974, 674717, 667029, 659420, 650054, 639159, 627863, 616524, 605505, 595802, 587673, 580162, 572879, 566716, 562086, 558253, 555121, 553837, 554817, 556953, 559494, 562879, 567023, 570782, 573956, 577876, 583000, 587697, 590365, 591138, 590688, 589004, 586176, 582807, 578854, 573546, 567006, 560378, 553955, 546953, 539490, 532763, 526643, 519258, 509757, 499481, 489640, 479917, 470307, 462254]
55771D62254n476l429j596J436N026O892O306M307J361k525o024p565p777q408
55757D44782r375r414q910r289j0180r998q981q798r428r197p884p009p013o742
55743C22564n833n213n073m573l683l150k697j384K86P91J07l19n4m7n56q71j115
55726B89180k238m109n523o210o925p610p344o137m936l968k739j558j222j352
55712B27309q16L39J199J881L246M933N640N152M253K979Q89j310k472l043m275
55697B45904n743n909m964m641n282n468m722m153m081l327j438M47J536K373
55683B00532L351L954L941L775L612L302L356M254M982M068K002O42L66j04j029
55668B41004j199m18q3p11j112o88n59j430k267j941p34O06J807K503K182J304
$$ y = [462254, 456778, 453349, 451753, 453189, 458215, 465107, 471413, 475720, 477081, 474556, 468532, 460967, 453190, 444782, 435407, 425993, 417083, 407794, 397614, 387616, 378635, 369837, 360409, 351212, 343328, 336319, 329306, 322564, 316731, 311518, 306445, 301872, 298189, 295039, 292342, 290958, 291244, 292035, 292142, 291823, 291769, 291722, 291166, 290295, 289180, 286942, 282833, 277310, 271100, 264175, 256565, 249221, 243084, 238148, 234180, 231441, 229883, 228661, 227309, 226493, 226832, 228031, 229912, 233158, 238091, 243731, 248883, 253136, 256115, 257004, 255694, 253222, 250179, 245904, 240161, 234252, 229288, 224647, 219365, 213897, 209175, 205022, 200941, 197614, 196176, 196623, 198159, 200532, 203883, 207837, 211778, 215553, 219165, 222467, 225823, 230077, 235059, 239127, 241129, 241771, 242137, 242033, 241004, 239805, 239387, 239304, 238593, 237481, 236793, 236234, 234804, 232537, 230596, 229862, 230468, 232275, 234778, 236960, 238264]
55652B38264J096J707J939J199L02l4q8j85k25n01j558k971l709l841m405n462
55636B21528n950n598n320n444n302m789m573m511l748k609k385k929k572r73
55622A64825J81O3m9O28P74o12k196k351j613j409j695j496q74p49j280j735j602
55605A48810j016l95k16o34j077q48k23q1m27m57j02k27j056j844k306k922l558
55588A31421l345k315j553j322p04M36R47M82K22P52J038M65O4N64J030P18O62
55571A29562J925L696M692N135N856O518O278N391M668M015K805J094o13k208
55557A78814l661m527m711m923n517n775n173m434m322m293l461k108j118o27
55543A24164k22J34L89R58K053L038L264K935K447J690P33L48Q62J345Q59j54
$$ y = [238264, 239360, 241067, 243006, 244205, 244507, 244473, 244385, 244200, 243975, 243474, 241916, 238945, 235236, 231395, 226990, 221528, 215578, 209980, 204660, 199216, 193914, 189125, 184552, 180041, 176293, 173684, 171299, 168370, 165798, 164825, 165006, 165069, 165020, 165648, 166422, 165810, 163614, 161263, 159650, 158241, 156546, 155050, 154176, 153427, 152147, 150412, 148810, 147794, 147399, 147183, 146549, 145472, 144624, 144401, 144320, 143893, 143436, 143334, 143107, 142051, 140207, 137901, 134979, 131421, 128076, 125761, 124208, 122886, 122182, 122618, 123565, 124047, 124269, 125021, 126059, 126524, 126588, 127152, 128182, 128900, 129562, 131487, 135183, 139875, 145010, 150866, 157384, 163662, 169053, 173721, 177736, 180541, 181635, 181022, 178814, 175153, 170626, 165915, 160992, 155475, 149700, 144527, 140093, 135771, 131478, 128017, 125909, 124791, 124164, 123942, 124076, 124465, 125423, 127476, 130514, 133778, 136713, 139160, 140850, 141583, 141931, 142793, 144138, 144997, 144843]
55527A44843o66n43l07j80k69j018k463l686l894l492l251l121k749k381k388
55512A14435k424k029j468j188j094j062j396j979j906r03j95q27j974k137j304
55497I2549n85k89J97R47J217O68k23q47q83k23P57J199P55K18M00R00Q08J30
55479I7695l70l71r9L70J082J699J856J678J362O23o46j725j885j466j320j542
55463I6941j608j356j052p80n35n63q80r16l45K45K28j4J65M65J68n54q81p01
55445H8027o64j030j324j177p35k60J28L87O16R52J090M03r70j850j436l83K14
55428H1988K77L80O10O58N90N86L72k21o50m14O8J92K34P25J325J397J190J348
55410I0655J666J452P96L45J23l04p88q67q14j249j866j744q94k99l67n07l35
$$ y = [144843, 144177, 143634, 143327, 143147, 142878, 141860, 139397, 135711, 131817, 128325, 125074, 121953, 119204, 116823, 114435, 112011, 109982, 108514, 107326, 106232, 105170, 103774, 101795, 99889, 98986, 98791, 97964, 95990, 93853, 92549, 91964, 91675, 91872, 92819, 94036, 94704, 94481, 93634, 92751, 92528, 93285, 94484, 95239, 95457, 95857, 96757, 97565, 97695, 97325, 96954, 96855, 97225, 98307, 100006, 101862, 103540, 104902, 105525, 104879, 103154, 101269, 99803, 98483, 96941, 95333, 93977, 92925, 92145, 91610, 91047, 90167, 89251, 88906, 89151, 89379, 89365, 89530, 89995, 90163, 89609, 88728, 88027, 87363, 86333, 85009, 83832, 83097, 82837, 82965, 83352, 83968, 84920, 86010, 86413, 85443, 83593, 82157, 81774, 81988, 82265, 82645, 83255, 83913, 84503, 85089, 85461, 85240, 84590, 84176, 84244, 84436, 84670, 85395, 86720, 88117, 89307, 90655, 92321, 93773, 94569, 94914, 95037, 94733, 93945, 93078, 92264, 91015, 89149, 87405, 86511, 86212, 85845, 85338, 85003]
55393H5003k64o11j063j257j184q46k32L82O77Q42J179J331O81n03j190q94j90
55376H1861J26k25r94j532j131J47J202J150N05L53P25P59J96m01p76j200j491
55359G9274j029O7P58M72j71l58j04J29J80K45M82Q59J129R86M24j76n14o33m67
55340H1553K02R68P89m59j262l87J179J501L92o04o21l29l81m89l36j19O2L49
55322H2008M05k81j244j350n09J58J15J10N72O62k84j439j592p83N2M45N86N56
55304G8187K48k01n21p00q84r53o31N4O51O92J94l06l49k29n77j153q37O16J723
55285G5024J187l6M0J501K373J436k92j222j045l79K54M62n1r23j260q26l34k09
55267G5700J6O24R69M72l65o79l94M3M61R28J311J410J238P93Q4m65k80L58L55
$$ y = [85003, 84739, 84128, 83065, 81808, 80624, 79778, 79546, 79928, 80605, 81447, 82626, 83957, 84638, 84135, 82945, 82051, 81861, 81987, 81762, 80768, 79236, 78105, 78252, 79454, 80604, 81109, 81462, 82187, 82946, 83142, 82741, 81965, 80765, 79274, 78245, 78312, 79070, 79542, 79371, 79013, 78909, 79038, 79218, 79463, 79945, 80804, 81933, 82919, 83343, 83167, 82653, 82020, 81553, 81755, 82723, 83512, 83053, 81791, 81404, 82583, 84084, 84476, 83872, 83251, 82922, 82541, 82052, 81716, 81597, 81659, 82008, 82413, 82132, 80888, 79538, 79029, 79187, 79302, 79412, 79984, 80646, 80362, 78923, 77331, 76548, 76600, 77045, 77631, 78187, 78435, 78234, 77713, 77013, 76129, 75176, 74545, 74599, 75250, 75942, 76136, 75830, 75481, 75252, 74675, 73522, 72685, 73301, 75024, 76211, 76175, 76215, 77716, 80089, 81525, 81233, 80011, 78966, 78587, 78841, 79303, 79252, 78329, 77069, 76243, 75909, 75700, 75716, 76340, 77309, 77781, 77416, 76737, 76343, 76386, 76847, 77775, 79086, 80496, 81734, 82527, 82611, 82146, 81866, 82224, 82579]
55248H2579o90j723j628o89M9K83M66P21O77K89R5N04J254J756J663J107M54j32
55230H7035p84j464j705j212n24m24p76o97M7O63N45R4q8k1L8J72M17M29M3k92
55210H1496j42K27L09J34O4J43J16j23m49o80o24j94L12M52K61K43N44P28N03
55191H3320J45m2j51k20j2M32O29M63M87J025J494J238M81r5k98l69m14m03m15
55172H7295l73N2Q58J410J262Q11N89L93j95p98o54J76Q43R04P28P17P88Q05Q64
55153I6475R11N63l01j094j056j79O63N67m37j420j483o54K47M63r7r89j633j636
55135H8910j050l58J2J26K58L64J72k41m75l93k22o9J78M30L64j09p53j352j715
55116H4077j468m86N54Q02M78O33J580K431K394J653O87l45j125j056j90N26N58
$$ y = [82579, 81889, 80166, 78538, 77849, 77898, 78181, 78647, 79368, 80045, 80334, 80429, 80933, 82187, 83943, 85606, 86713, 87167, 87035, 86251, 84787, 83082, 81870, 81346, 80922, 80146, 79449, 79496, 80159, 80704, 80798, 80710, 80689, 80727, 80899, 81316, 81745, 81788, 81496, 81354, 81581, 81890, 82024, 82088, 82231, 82347, 82224, 81775, 81095, 80471, 80277, 80589, 81041, 81302, 81545, 82089, 82817, 83320, 83465, 83423, 83272, 83052, 83040, 83472, 84101, 84564, 85051, 86076, 87570, 88808, 89289, 89194, 88896, 88527, 88113, 87710, 87295, 86922, 86974, 87832, 89242, 90504, 91315, 91904, 92297, 92102, 91304, 90650, 90826, 91669, 92573, 93301, 94018, 94806, 95611, 96475, 97386, 97949, 97648, 96554, 95498, 95319, 95982, 96549, 96112, 94692, 93209, 92555, 92802, 93265, 93168, 92179, 90546, 88910, 87860, 87502, 87514, 87640, 87898, 88262, 88434, 88193, 87718, 87325, 87103, 87034, 87212, 87642, 88006, 87897, 87144, 85792, 84077, 82609, 82123, 82677, 83479, 83957, 84590, 86170, 88601, 90995, 92648, 93335, 92990, 91865, 90809, 90619, 91145, 91703]
55099I1703N59J167J861J845J365J234J496J530J138O64L00J6m0K34M46J71l39
55082A05350n20l92m41p40q50n15Q3O43R35P44J96k4O79J965K756K314Q37q15
55064A12205j759j629q21p9K89N25O82L72m61j122j038o32o94j247j635j477r62
55047A00517m02L1K37K82L97O32P12M91J64j31m27n26q8N91O58J3l81n0J21o25
55027A02216j506j392o47m42q37r23n62m94p68n23M66J230R95P9q63j563j812
55010I2654j348m30J84K53L34P57J064Q38M36L92O74R78J299J747K113K067J610
54993A05622J037N07j13j031k114k790k447j180K22J102J425J231L42q66j184
54978I9763j5J393J347Q6m83N01J716J555J19j225j492p35L38Q94O05N9J75J018
$$ y = [91703, 92262, 93429, 95290, 97135, 98500, 99734, 101230, 102760, 103898, 104562, 104862, 104878, 104838, 105072, 105518, 105689, 105350, 104830, 104438, 103997, 103257, 102407, 101892, 101975, 102618, 103553, 104297, 104493, 104469, 105148, 107113, 109869, 112183, 113020, 112205, 110446, 108817, 107996, 107917, 108206, 108731, 109413, 109785, 109324, 108202, 107164, 106532, 105838, 104591, 102956, 101479, 100517, 100115, 100146, 100383, 100665, 101062, 101694, 102406, 102897, 103061, 102930, 102503, 101977, 101889, 102480, 103138, 103151, 102770, 102720, 102841, 102216, 100710, 99318, 98671, 98229, 97392, 96469, 95907, 95413, 94645, 94122, 94588, 95818, 96813, 96892, 96029, 94466, 92654, 91306, 90876, 91060, 91313, 91647, 92404, 93468, 94306, 94742, 95134, 95808, 96786, 98085, 99832, 101945, 104012, 105622, 106659, 107166, 107053, 106022, 103908, 101118, 98671, 97491, 97713, 98815, 100240, 101471, 101813, 100947, 99763, 99748, 101141, 102488, 102574, 102091, 102592, 104308, 105863, 105982, 104757, 103265, 102530, 102868, 103762, 104367, 104426, 104601, 105619]
54960A05619J728J693J161N31j43o90o32L4N02K02m32o39l61k1K49N94R11Q46
54942A11152K54o57j466j756j476j120j202j473j196k64O12J026J416K046K308
54927A08204J680P81O80J549K707L666M348M519L911K986K755L664N112O245O742
54912A59549O674O019M697K859Q92q51k169l020l488l761m013m295m519m513m193
54897A45868l681l212k900k657k357j988j622j293r71o05k10J10K90M46P28J008
54881A26954R55O17N38J098J966K673L370M485N775O410O105N539N435N675N483
54866A83078M264K042n59k718m003m617m895m798m311m010m471n165m870l422
54852A41545k191k326l246l545k797j783j239j233j569k126k662k822k545k196
$$ y = [105619, 107347, 109040, 110201, 110732, 110589, 109899, 109267, 109301, 109803, 110005, 109573, 108934, 108573, 108552, 108801, 109395, 110306, 111152, 111406, 110749, 109283, 107527, 106051, 104931, 103729, 102256, 101060, 100796, 101408, 102434, 103850, 105896, 108204, 109884, 110665, 111345, 112894, 115601, 119267, 123615, 128134, 132045, 135031, 137786, 141450, 146562, 152807, 159549, 166223, 172242, 176939, 179798, 180690, 179839, 177670, 174650, 171162, 167401, 163388, 159093, 154574, 150061, 145868, 142187, 138975, 136075, 133418, 131061, 129073, 127451, 126158, 125187, 124582, 124372, 124482, 124772, 125218, 125946, 126954, 127909, 128526, 129064, 130162, 132128, 134801, 138171, 142656, 148431, 154841, 160946, 166485, 171920, 177595, 183078, 187342, 189384, 188825, 186107, 182104, 177487, 172592, 167794, 163483, 159473, 155002, 149837, 144967, 141545, 139354, 137028, 133782, 130237, 127440, 125657, 124418, 123185, 121616, 119490, 116828, 114006, 111461, 109265]
54838A09265k126k225k030j221m1P94P32n7q33j005n13L15J030J253R85P12Q20
54821A05855R81N86k64q17p67n80n21j88N53R67M53m00n32J08O11L71l42j031
54803A05043j450j395p08L46J146J339J119Q63Q26J174J903K584K542J527M0j110
54787A15789j501j282q80n74l84k45j87k00j1O97J761K552K664K337J995J681
54771A24212J284R92J130J662K286K874L521M246M990N815O684P220P036O298
54757A80250N509M796L821K425Q36q48k809m907o438o911o706o436o028n041l751
54742A47762l120l471l837l172j746p76q50j329j383r08k58L84R33J106P96N10
54726A30641Q74J733K254K013J546J636K444L539M455N015N239N223N034M663
$$ y = [109265, 107139, 104914, 102884, 101663, 101622, 102416, 103148, 103091, 102258, 101253, 100740, 101055, 102085, 103338, 104323, 105035, 105855, 106836, 107422, 107158, 106341, 105574, 104994, 104473, 104285, 104838, 105805, 106258, 105858, 105326, 105434, 106045, 106416, 106074, 105043, 103593, 102198, 101490, 101836, 102982, 104321, 105440, 106303, 107129, 108303, 110206, 112790, 115332, 116859, 116899, 115789, 114288, 113006, 112126, 111552, 111168, 110923, 110736, 110536, 110525, 111222, 112983, 115535, 118199, 120536, 122531, 124212, 125496, 126488, 127618, 129280, 131566, 134440, 137961, 142207, 147197, 153012, 159696, 166916, 173952, 180250, 185759, 190555, 194376, 196801, 197637, 196789, 193980, 189073, 182635, 175724, 169018, 162582, 156554, 151513, 147762, 144642, 141171, 137334, 134162, 132416, 131640, 130790, 129461, 128078, 127170, 126912, 127296, 128229, 129335, 130131, 130641, 131515, 133248, 135502, 137515, 139061, 140697, 143141, 146680, 151135, 156150, 161389, 166612, 171646, 176309]
54712A76309M071L274K194N78j696m158n915o369n753m833m268m160m043l408
54698A41823k364j596j514j620j187k85L53K76l66j325k354k885k428j423r42
54683A22163j237j463j019m07k30k00J48M33L9p33j020o85m14n73p45n56k70l26
54665A12905o53p27j75P10J087L99q47j471r82j22J96Oj18p2k03n46p77p63n76
54646A07271j03P20J403J296M82k50l74q3K57N58Q35R97R19M73l76j190j120J53
54628A11868J693K194J432K37p30j378j477o78N77J132N78j94l12j5R0P1K78M81
54610A15847L15O6K41N80L55m30r37o59K1N56Q60R74O93l0o74o19K5M53R2o79
54590A17050r00m9J329K136J784O79l48q02o65n0Q30J404R98l58j627j693o03
$$ y = [176309, 180380, 183654, 185848, 186426, 184730, 180572, 174657, 168288, 162535, 157702, 153434, 149274, 145231, 141823, 139459, 137863, 136349, 134729, 133542, 133257, 133610, 133886, 133520, 132195, 129841, 126956, 124528, 123105, 122163, 120926, 119463, 118444, 118037, 117807, 117607, 117755, 118188, 118227, 117494, 116474, 115789, 115375, 114802, 114057, 113501, 113231, 112905, 112252, 111525, 111350, 112060, 113147, 113546, 112699, 111228, 110246, 110124, 110320, 110326, 110208, 110136, 109933, 109387, 108610, 107847, 107271, 107168, 107888, 109291, 110587, 111069, 110819, 110445, 110362, 110619, 111177, 112012, 113009, 113928, 114401, 114025, 112835, 111715, 111868, 113561, 115755, 117187, 117424, 116694, 115316, 113839, 113161, 113738, 114870, 115448, 115254, 114942, 114927, 115017, 115088, 115366, 115847, 116162, 116228, 116469, 117049, 117404, 116974, 116037, 115378, 115399, 115955, 116815, 117789, 118482, 118452, 117778, 117159, 117184, 117637, 117729, 117050, 116150, 116101, 117430, 119566, 121350, 122029, 121681, 120879, 120214, 120164, 120994, 122398, 123396, 123038, 121411, 119718, 119115]
54573A19115M21K93p78j672j664j061n59l99l20q9K65O20R04J049J029R39Q63
54556A18956O97L60J28L97J024J246N59n80j209r48l08Q8K32M95R55J293J314
54539A24699J261J407J584J371P47K76N15J320J891J466Mj697k586k208j141m68
54523A28441p52j549j985j644q40j60J32K63N78R99J003L53l41k25O02J088N83
54506A26546l78r45j038j006p53j6P77Q47K82k6K61M65J06k83p0L27M0q99j581
54487A22656j447q16j58N00J243J834J949J596J043N22J87K12O16J050J024M73
54471A32484p6mP49J643K110K059J861J906K182K295J946J336J045J272J516J175
54455A55499L94j71l93r11k083l225l377k543j597j120r02n70k17j61m85r86j406
$$ y = [119115, 119536, 119829, 119051, 117379, 115715, 114654, 114095, 113696, 113376, 113287, 113552, 114172, 115076, 116125, 117154, 118093, 118956, 119653, 120013, 120141, 120538, 121562, 122808, 123367, 122787, 121578, 120630, 120322, 120410, 120642, 121137, 122092, 123385, 124699, 125960, 127367, 128951, 130322, 131069, 131345, 131860, 133180, 135071, 136537, 136541, 134844, 132258, 130050, 128909, 128441, 127689, 126140, 124155, 122511, 121671, 121511, 121643, 121906, 122484, 123483, 124486, 124839, 124498, 124273, 124875, 125963, 126546, 126168, 125223, 124185, 123179, 122426, 122410, 123187, 124034, 124316, 124290, 124551, 125016, 125122, 124839, 124769, 125096, 125136, 124237, 122656, 121209, 120393, 120235, 120735, 121978, 123812, 125761, 127357, 128400, 128922, 129109, 129321, 129937, 130987, 132011, 132484, 132408, 132404, 133153, 134796, 136906, 138965, 140826, 142732, 144914, 147209, 149155, 150491, 151536, 152808, 154324, 155499, 155893, 155722, 155329, 154418, 152335, 149110, 145733, 143190, 141593, 140473, 139571, 139001, 138784, 138623, 138138, 137152, 135746]
54438A35746j502j150m47L13P60N62l37j393j619n50J036J909J753J201N96m28
54422A36450j856k689k133q38q9j13LP90J679J993J875J757J563R79K43o4O2n5
54404A39557p19j233p35N75J515J278K72m75m17K48J100J841K231K077J448O84
54388A49247J42l4P0J79km40o82l74K34N86N86N99P51P66O52Q70J538J989J614
54369A58291Q02M06O74J227J860K614L179L036K333J836J799J638J003N10P50
54354A81958J250J083K10o24j077j487j986k198k019j939k286k720k873k925l131
54339A59236l256k967k417j925j405o50K4R8l51p35p51n89m01k11k39p00j172
54322A41589q94J12Q81P34J26j62r7j71m73n52j10N73R13N69j60n23j54L29N9
$$ y = [135746, 134244, 133094, 132647, 132960, 133720, 134282, 133945, 132552, 130933, 130383, 131419, 133328, 135081, 136282, 136878, 136450, 134594, 131905, 129772, 128934, 128845, 128732, 128735, 129525, 131204, 133197, 135072, 136829, 138392, 139371, 139614, 139550, 139612, 139557, 138838, 137605, 136870, 137445, 138960, 140238, 140510, 140035, 139618, 139866, 140966, 142807, 145038, 147115, 148563, 149247, 149389, 149355, 149425, 149604, 149602, 149162, 148480, 148106, 148340, 148926, 149512, 150111, 150862, 151628, 152280, 153150, 154688, 156677, 158291, 159093, 159499, 160173, 161400, 163260, 165874, 169053, 172089, 174422, 176258, 178057, 179695, 180698, 181208, 181958, 183208, 184291, 184501, 183877, 182800, 181313, 179327, 177129, 175110, 173171, 170885, 168165, 165292, 162367, 159236, 155980, 153013, 150596, 148671, 147266, 146616, 146640, 146738, 146387, 145652, 144901, 144312, 143911, 143700, 143461, 142761, 141589, 140695, 140807, 141688, 142422, 142548, 142386, 142289, 142118, 141645, 141093, 140983, 141556, 142469, 143038, 142878, 142355, 142201, 142530, 142589]
54303A42589p99j179o36R8L82N97J143J420P16m57r70o22j22J68L89L61l18j247
54285A41513j477r07l57r4O02J918K712K019N03m47m42j38K7J93M16M46K26l3
54267A46680k71n89p98m67M72J482J965J768J180O12L77N43Q99J176J342J556
54251A57927J839J903J414M15o40j307j529j497j290q32k97j26m47p83o39j69
54235A53942J11O2l6k5J3J02L61O27O25L85J52q7m88p85n43P2L55N6l17l20r8
54214A54164J24L91O12M48j2j78J34L22k0m52n24n66r83j386j222q21q48j074
54196A48109o42N68J648J823J225M79Q4K99R85J512J295N04j62l92m43m85l21
54179A56086J45O76J083J353J377J015N44N27J051J533J467R71M17l0l44m68n43
$$ y = [142589, 141790, 140611, 139975, 140073, 140455, 141052, 142195, 143615, 144331, 143874, 142904, 142282, 142160, 142328, 142717, 143078, 142760, 141513, 140036, 139129, 138772, 138678, 139280, 141198, 143910, 145929, 146432, 145985, 145543, 145405, 145432, 145625, 146041, 146487, 146713, 146680, 146409, 145820, 145022, 144555, 145027, 146509, 148474, 150242, 151422, 152034, 152411, 152954, 153853, 155029, 156371, 157927, 159766, 161669, 163083, 163498, 162858, 161551, 160022, 158525, 157235, 156403, 156106, 155980, 155533, 154750, 154111, 153942, 154053, 154115, 154079, 154054, 154067, 154169, 154530, 155157, 155782, 156167, 156319, 156232, 155744, 154959, 154416, 154488, 154843, 154899, 154582, 154262, 154164, 154288, 154679, 155291, 155739, 155727, 155549, 155683, 156005, 155985, 155533, 155009, 154443, 153460, 152074, 150852, 150031, 149183, 148109, 147467, 148035, 149683, 151506, 152731, 153210, 153294, 153593, 154578, 156090, 157385, 157889, 157727, 157335, 156892, 156407, 156086, 156231, 156907, 157990, 159343, 160720, 161735, 162279, 162806, 163857, 165390, 166857, 167828, 168245, 168215, 167871, 167403, 166860]
54162A66860q93j493j829j606j280j414j805j766j202p82r33j188q98k07J63p3
54146A49654m52n37m93o04o99m71j13p6l00k90R0N10Q97J533K194K009O86p24
54128A52814j050n07j95m31m63J74R62J251J145J128J318J494J527J397J049M94
54112A62107M0J04P86J675K217K274K275K622L095L166K872K862L313L431K503
54097A95342J042J78J83L08n0p34j371j826j992j728j213q93r15j042j125j215
54081A82949j145o19J73O30N78N00O93Q19N59J23j60k45l8O77J545J605N22o99
54063A88467q96j97M49P39J135J749K068J843J414J034N44k3j74L41J031J293
54047B00817J167J145J517K195L001L781M369M714M984N407O055O855P700Q429
$$ y = [166860, 165967, 164474, 162645, 161039, 159759, 158345, 156540, 154774, 153572, 152790, 151857, 150669, 149771, 149564, 149727, 149654, 149202, 148665, 148172, 147568, 146869, 146398, 146285, 146209, 145909, 145619, 145709, 146219, 147116, 148649, 150843, 152852, 153538, 152814, 151764, 151257, 151062, 150631, 150168, 150342, 151304, 152555, 153700, 154828, 156146, 157640, 159167, 160564, 161613, 162107, 162147, 162251, 163037, 164712, 166929, 169203, 171478, 174100, 177195, 180361, 183233, 186095, 189408, 192839, 195342, 196384, 196562, 196745, 197053, 197003, 196269, 194898, 193072, 191080, 189352, 188139, 187246, 186331, 185289, 184164, 182949, 181804, 181185, 181358, 181988, 182566, 183066, 183759, 184578, 185137, 185260, 185100, 184855, 184817, 185494, 187039, 188644, 189166, 188467, 187571, 187374, 187823, 188562, 189697, 191446, 193514, 195357, 196771, 197805, 198349, 198326, 198152, 198493, 199524, 200817, 201984, 203129, 204646, 206841, 209842, 213623, 217992, 222706, 227690, 233097, 239152, 246007, 253707, 262136]
54033B62136Q866R019R059Q966Q417P290O056N368N231N001M248L326K844K852
54019C48679K815K342J629J088P81L04p55k368m031n211n832o288o944p696q113
54004C10400p909p168o129n104m485m595n247n725n440m503l499k812k431k275
53990B43078k346k506k416j931j401j364j947k682k988k682k018j295o68k54j59
53975B16421j99J16R86J873K102J839K014L154M746O010O828P562Q278Q533P804
53960B78067N929L312Q11q70j935l150m531n059m128k679k089k361k407j797j119
53945B55994o50J33J408K406K604K635L345M441M916M466L777L565L862M352M857
53930C02111N350N682N558M858L992L702M292N225N802O083O603P395P958Q249
$$ y = [262136, 271002, 280021, 289080, 298046, 306463, 313753, 319809, 325177, 330408, 335409, 339657, 342983, 345827, 348679, 351494, 353836, 355465, 356553, 357334, 357638, 356883, 354515, 350484, 345273, 339441, 333153, 326209, 318513, 310400, 302491, 295323, 289194, 284090, 279605, 275010, 269763, 264038, 258598, 254095, 250596, 247784, 245353, 243078, 240732, 238226, 235810, 233879, 232478, 231114, 229167, 226485, 223497, 220815, 218797, 217502, 216834, 216580, 216421, 216222, 216338, 217324, 219197, 221299, 223138, 225152, 228306, 233052, 239062, 245890, 253452, 261730, 270263, 278067, 283996, 287308, 288119, 287249, 285314, 282164, 277633, 272574, 268446, 265767, 263678, 261317, 258910, 257113, 255994, 255344, 255477, 256885, 259291, 261895, 264530, 267875, 272316, 277232, 281698, 285475, 289040, 292902, 297254, 302111, 307461, 313143, 318701, 323559, 327551, 331253, 335545, 340770, 346572, 352655, 359258, 366653, 374611, 382860]
53916C82860Q824R804J0514J0588J0653J1314J2095J2085J1163R825Q262O428
53904E04415M725L674L015J919J84j536k750l672m599n391n866o255o915p952
53890D72996r217j0400j1055j0903j0272r881j0075j0547j0879j0895j0442r327
53878C49103p762o417n756n592n528n481n455n223m636m066m059m655n372n754
53864B73347n674n184m456l815l493l350l080k665k359k218k011j674j473j566
53850B30329j734j733j669j658j450p56O2J65p44j907k274j601n87k5n7k14m5
53833B14102L62M88M3n43n30J56P09M18m03q05l60N20J292J769J917J682J279
53816B22096J202J604J925J568P29K29N83J583K748L829M765N448N785N954O365
$$ y = [382860, 391684, 401488, 412002, 422590, 433243, 444557, 456652, 468737, 479900, 489725, 497987, 504415, 509140, 512814, 515829, 517748, 517932, 516396, 513646, 509974, 505375, 499984, 494118, 487863, 480948, 472996, 463779, 453379, 442324, 431421, 421149, 411268, 401193, 390646, 379767, 368872, 358430, 349103, 341341, 334924, 329168, 323576, 318048, 312567, 307112, 301889, 297253, 293187, 289128, 284473, 279101, 273347, 267673, 262489, 258033, 254218, 250725, 247375, 244295, 241630, 239271, 237053, 235042, 233368, 231895, 230329, 228595, 226862, 225193, 223535, 222085, 221329, 221391, 221556, 220812, 218905, 216631, 215030, 214443, 214418, 214361, 214147, 214102, 214464, 214952, 214995, 214452, 213922, 214078, 214787, 215205, 214802, 213997, 213637, 214157, 215449, 217218, 219135, 220817, 222096, 223298, 224902, 226827, 228395, 229124, 229353, 229936, 231519, 234267, 238096, 242861, 248309, 254094, 260048, 266413]
53801B66413P253Q271Q712Q240P348O859O995P201O869N990M997M254L866L771
53787C57039L783L690L480L304L123K546J262n69k419l810m578m922n328o134
53773C50467p056p427p112o759o886p124o827o102n664n782n974n743n099m287
53759B62625l478k841k566k582k573k394k208k146k096j979j925k039k193k159
53745B29446j820j162k95L88L87l88j406j973j837j192l43M26P72M18m50j095
53729B19876q38K02J145J323J093J262J876K102J492P84Q99J597J842J304P40
53714B36699Q51J437J918K065J929J556J178J234J823K381K329J818J517J750
53700B60485K286K758L022L108L148L314L666M035M243M255M005L319K214J165
$$ y = [266413, 273666, 281937, 290649, 298889, 306237, 313096, 320091, 327292, 334161, 340151, 345148, 349402, 353268, 357039, 360822, 364512, 367992, 371296, 374419, 376965, 378227, 377658, 375239, 371429, 366851, 361929, 356601, 350467, 343411, 335984, 328872, 322113, 315227, 308103, 301276, 295174, 289510, 283728, 277754, 272011, 266912, 262625, 259147, 256306, 253740, 251158, 248585, 246191, 243983, 241837, 239741, 237762, 235837, 233798, 231605, 229446, 227626, 226464, 226169, 226557, 226944, 226556, 225150, 223177, 221340, 220148, 219805, 220231, 221003, 221421, 220971, 219876, 219038, 219240, 220385, 221708, 222801, 224063, 225939, 228041, 229533, 230317, 231216, 232813, 234655, 235959, 236699, 237550, 238987, 240905, 242970, 244899, 246455, 247633, 248867, 250690, 253071, 255400, 257218, 258735, 260485, 262771, 265529, 268551, 271659, 274807, 278121, 281787, 285822, 290065, 294320, 298325, 301644, 303858, 305023]
53686C05023O73O49N26j9p68j346j549j303o54M7K66j41o76p91o04o81j134j346
53668B96172q17J3K02m37j013o73K75P93M68q9j48K42N61M71j5p18j278j256o29
53649B92124l3m1l79k97L52R26R83Q69J157J914K795L523L890L626K671J518Q61
53632C16459R04J270J575J804K063K248K178J934J872K220K749K941K606K219
53618C45042K347K836K902K221J497J585K398L162L499L644L754L684L512L596
53604C85679L857L748L123K579K500K457K050J694J793J820J074l4n40n20q60
53589D10420j516j310J10J328R82m50j515j780j919k276k431k121j694j473j364
53574C92991j283j396j777k183k340k192j828j465j389j618j646j011l4M42J58
$$ y = [305023, 305696, 306345, 306871, 306852, 306084, 304738, 303189, 301886, 301232, 301279, 301545, 301404, 300728, 299937, 299333, 298652, 297518, 296172, 295355, 295368, 295570, 295133, 294120, 293447, 293722, 294515, 294983, 294894, 294746, 294988, 295549, 296020, 296005, 295287, 294009, 292753, 292124, 292091, 292050, 291671, 291374, 291726, 292652, 293635, 294504, 295661, 297575, 300370, 303893, 307783, 311409, 314080, 315598, 316459, 317363, 318633, 320208, 322012, 324075, 326323, 328501, 330435, 332307, 334527, 337276, 340217, 342823, 345042, 347389, 350225, 353127, 355348, 356845, 358430, 360828, 363990, 367489, 371133, 374887, 378571, 382083, 385679, 389536, 393284, 396407, 398986, 401486, 403943, 405993, 407687, 409480, 411300, 412374, 412340, 411800, 411280, 410420, 408904, 407594, 407704, 409032, 410014, 409564, 408049, 406269, 404350, 402074, 399643, 397522, 395828, 394355, 392991, 391708, 390312, 388535, 386352, 384012, 381820, 379992, 378527, 377138, 375520, 373874, 372863, 372829, 373271, 373429]
53559C73429k56k14K2j64q33j397j332o02M39J302J544J041J83l21o6O32J108
53542C74515J114J142J770K881L799M131M138M193M384M778N621O858P920Q410
53528D35654Q728R380J0075J0113R574R314R699J0179J0356J0735J1964J3816
53516E59587J5458J6482J7138J7781J8477J9155J9809K0493K1275K2200K3224
53505G71079K4249K5219K6029K6446K6315K5829K5364K4977K4388K3474K2427
53494A045796K1337J9989J8312J6732J5803J5751J6503J7844J9214J9771J9145
53483A246197J8016J7504J7963J8712J8915J8415J7593J6710J5624J4053J2001
53472A431703R804P764N755L408P20j789l707n329p248r432j1136j1866j2127
$$ y = [373429, 373173, 372959, 372981, 372817, 371984, 370587, 369255, 368653, 369092, 370394, 371938, 372979, 373162, 372841, 372775, 373407, 374515, 375629, 376771, 378541, 381422, 385221, 389352, 393490, 397683, 402067, 406845, 412466, 419324, 427244, 435654, 444382, 453762, 463837, 473950, 483524, 492838, 502537, 512716, 523072, 533807, 545771, 559587, 575045, 591527, 608665, 626446, 644923, 664078, 683887, 704380, 725655, 747855, 771079, 795328, 820547, 846576, 873022, 899337, 925166, 950530, 975507, 999895, 1023369, 1045796, 1067133, 1087122, 1105434, 1122166, 1137969, 1153720, 1170223, 1188067, 1207281, 1227052, 1246197, 1264213, 1281717, 1299680, 1318392, 1337307, 1355722, 1373315, 1390025, 1405649, 1419702, 1431703, 1441507, 1449271, 1455026, 1458434, 1459154, 1457365, 1453658, 1448329, 1441081, 1431649, 1420513, 1408647, 1396520]
53459A396520j2829j4159j5443j6183j6740j7641j8622j8940j8563j8343j8836
53448A210221j9571j9884j9853j9851j9609j8578j6993j5719j5031j4321j3116
53437A017695j1634j0104q320o318m761m099l757k811j152N61J857K834L730M597
53423I78318N413O139O742P387Q474J0178J2092J3707J5125J6968J9554K2457
53411A122554K4915K6552K7631K8733L0194L1833L3343L4825L6559L8365L9672
53400A475176M0434M1432M3313M5689M7719M9182N0554N2165N3817N5102N5735
53389B010318N5668N5230N4994N5154N5188N4459N2944N1016M8823M6362M3866
53378B584022M1530L8980L5669L1669K7473K3161J8390J3269Q380L820j116o942
$$ y = [1396520, 1383691, 1369532, 1354089, 1337906, 1321166, 1303525, 1284903, 1265963, 1247400, 1229057, 1210221, 1190650, 1170766, 1150913, 1131062, 1111453, 1092875, 1075882, 1060163, 1045132, 1030811, 1017695, 1006061, 995957, 987637, 981319, 976558, 972459, 968702, 965891, 964739, 965300, 967157, 969991, 973721, 978318, 983731, 989870, 996612, 1003999, 1012473, 1022651, 1034743, 1048450, 1063575, 1080543, 1100097, 1122554, 1147469, 1174021, 1201652, 1230385, 1260579, 1292412, 1325755, 1360580, 1397139, 1435504, 1475176, 1515610, 1557042, 1600355, 1646044, 1693763, 1742945, 1793499, 1845664, 1899481, 1954583, 2010318, 2065986, 2121216, 2176210, 2231364, 2286552, 2341011, 2393955, 2444971, 2493794, 2540156, 2584022, 2625552, 2664532, 2700201, 2731870, 2759343, 2782504, 2800894, 2814163, 2822543, 2826363, 2825247, 2818305]
53366B818305j3266j9425k5285l0999l6321m0694m3838m5956m7464m8706m9782
53355B416569n0516n0692n0370m9728m8698m7106m5295m3985m3422m3114m2655
53344A900988m2282m2233m2123m1507m0590l9747l8674l6795l4399l2522l1548
53333A478568l0682k9084k6892k4749k2851k1073j9651j8983j8849j8526j7800
53322A229428j7245j7253j7330j6739j5479j4106j2867j1603j0336r311q384p035
53310A071740n162l319j870m82J217K940M229N312O838Q901J0901J2307J3162
53297A126714J3944J5280J7622K0653K3206K4324K4425K4775K5833K6819K7006
53286A370601K6669K6406K6162K5395K3900K1920J9765J7621J5495J3067R883
$$ y = [2818305, 2805039, 2785614, 2760329, 2729330, 2693009, 2652315, 2608477, 2562521, 2515057, 2466351, 2416569, 2366053, 2315361, 2264991, 2215263, 2166565, 2119459, 2074164, 2030179, 1986757, 1943643, 1900988, 1858706, 1816473, 1774350, 1732843, 1692253, 1652506, 1613832, 1577037, 1542638, 1510116, 1478568, 1447886, 1418802, 1391910, 1367161, 1344310, 1323237, 1303586, 1284603, 1265754, 1247228, 1229428, 1212183, 1194930, 1177600, 1160861, 1145382, 1131276, 1118409, 1106806, 1096470, 1087159, 1078775, 1071740, 1066578, 1063259, 1061389, 1060907, 1062124, 1065064, 1069293, 1074605, 1081443, 1090344, 1101245, 1113552, 1126714, 1140658, 1155938, 1173560, 1194213, 1217419, 1241743, 1266168, 1290943, 1316776, 1343595, 1370601, 1397270, 1423676, 1449838, 1475233, 1499133, 1521053, 1540818, 1558439, 1573934, 1587001, 1596884]
53275A596884O027K305o10k881n056p266r341j1386j3634j5903j7807j9480k1440
53262A480412k3654k5297k5770k5444k5171k5352k5822k6286k6597k6737k6841
53251A197441k7076k7298k7035k6081k4929k4250k4099k4011k3767k3617k3742
53240I21536k4004k4297k4692k4954k4476k3074k1400k0099j8883j7088j4874
53229F83695j3113j2094j1202j0074r279r421j0114j0462j0238j0039j0421j1290
53217E55948j2116j2493j2525j2756j3462j4058j3634j2213j0875j0296r838q628
53205D13054o915n664n242n284n497n812n955n806n887o660p471p249o148n351
53191C28113n251m980m097l439l708m286m269l841l715l891l829l418k919k383
$$ y = [1596884, 1602911, 1605216, 1604606, 1601725, 1596669, 1589403, 1580062, 1568676, 1555042, 1539139, 1521332, 1501852, 1480412, 1456758, 1431461, 1405691, 1380247, 1355076, 1329724, 1303902, 1277616, 1251019, 1224282, 1197441, 1170365, 1143067, 1116032, 1089951, 1065022, 1040772, 1016673, 992662, 968895, 945278, 921536, 897532, 873235, 848543, 823589, 799113, 776039, 754639, 734540, 715657, 698569, 683695, 670582, 658488, 647286, 637212, 627933, 618512, 608398, 597936, 587698, 577659, 567238, 555948, 543832, 531339, 518814, 506058, 492596, 478538, 464904, 452691, 441816, 431520, 421682, 413054, 406139, 400475, 395233, 389949, 384452, 378640, 372685, 366879, 360992, 354332, 346861, 339612, 333464, 328113, 322862, 317882, 313785, 310346, 306638, 302352, 298083, 294242, 290527, 286636, 282807, 279389, 276470, 274087]
53177B74087j857j826k586l459l424k448j419q42m28OL0p24j817k378k010j094
53161B47811l23n3r5j85m47j101j785j744r24k44l80p84n22L55R43P16o4r33j552
53142B38689j564q78n4J52k26m26JO87J077J084R76J036J344J643J479Q18L00
53125B46138M46Q72R09P14R28J355J050o4o66K71K021K942K373J050O4o9M44R74
53107B61752R27K85m29q39j139j607k114k345k231j792r27K33J012P68k71j163
53091B50120j293r25o64o58n77k18K1m54j584k437k169j098l80n78j007p27K41
53074B35613J056J135O82K12l4j83m22p03p81n65l56n57j101j482j355q81l85
53057B29893pK05J71m2j66p9J25M79J157J908J988J096j5l70L3M24M25L77N26
$$ y = [274087, 272230, 270404, 267818, 264359, 260935, 258487, 257068, 256226, 255798, 255804, 255834, 255110, 253293, 250915, 248905, 247811, 247488, 247435, 247340, 247155, 246708, 245607, 243822, 242078, 241154, 240910, 240530, 239746, 239224, 239579, 240522, 241238, 241174, 240241, 238689, 237125, 236247, 236193, 236345, 236119, 235693, 235694, 236381, 237458, 238542, 239518, 240554, 241898, 243541, 245020, 245838, 246138, 246584, 247456, 248365, 249079, 250007, 251362, 252412, 252348, 251682, 251953, 253974, 256916, 259289, 260339, 260403, 260334, 260778, 261752, 262679, 262964, 262535, 261696, 260557, 258950, 256836, 254491, 252260, 250468, 249541, 249774, 250786, 251554, 251283, 250120, 248827, 247902, 247238, 246580, 246003, 245785, 245806, 245352, 243768, 241331, 239162, 238064, 237684, 237106, 236099, 235372, 235613, 236669, 237804, 238486, 238698, 238664, 238481, 238059, 237356, 236575, 236010, 235654, 235097, 233996, 232514, 231159, 230278, 229893, 229886, 230091, 230262, 230220, 230054, 229975, 230100, 230579, 231736, 233644, 235632, 236728, 236713, 236343, 236376, 236800, 237225, 237602, 238128]
53038B38128N55J85l18m68j88J81K79O6j54L3P32J520J785J316M18m94j203j548
53020B40825j337o01K49P40Q11P97R25J019Q08M44M10Q48J279J176O79L33K75
53003B49680J27k67n52n17n06q42j223j221r76q84q15k10J026K259K804K517J708
52986B52108Q23K64J77L61N46P72J209J754K081K060J756J121J39p71r37k41O63
52969B63885R85N77m0j35O26J706K016J108o5j86P09J290P80j12m50m29q17j559
52951B69889j813j162j85K06l84j531k280j915p78j05o79j818k101j010N32J212
52935B56078N76p24j661j738j259p70l03L97J067R79J11n50l27J57P9j74K91J213
52917B53442J468Q77M40O09N80k34j150j302r36q07j047j338j665k031j911q74
$$ y = [238128, 238683, 238868, 238550, 238082, 237894, 238075, 238354, 238420, 238266, 238299, 239031, 240551, 242336, 243652, 244070, 243576, 242373, 240825, 239488, 238887, 239136, 239876, 240687, 241484, 242409, 243428, 244236, 244680, 245090, 245938, 247217, 248393, 249072, 249405, 249680, 249807, 249540, 248988, 248471, 247965, 247123, 245900, 244679, 243703, 242819, 242004, 241794, 242820, 245079, 247883, 250400, 252108, 252931, 253195, 253372, 253733, 254279, 255051, 256260, 258014, 260095, 262155, 263911, 265032, 265171, 264400, 263463, 263222, 263885, 264870, 265447, 265407, 265272, 265898, 267604, 269620, 270728, 270663, 270477, 271186, 272476, 273256, 273144, 272694, 272265, 271448, 269889, 268076, 266914, 266729, 266935, 266551, 265020, 262740, 260825, 260047, 259942, 259263, 257445, 255344, 254334, 254866, 256078, 256654, 255930, 254269, 252531, 251272, 250502, 250199, 250596, 251663, 252642, 252753, 252203, 251876, 252033, 252112, 251938, 252229, 253442, 254910, 255787, 256227, 256836, 257416, 257182, 256032, 254730, 253794, 252987, 251940, 250602, 248937, 246906, 244995, 244121]
52901B44121N18J240J062O56N51P03R43J150R98K27p64j194r05n25n02n16q6O66
52883B48343J157R76J87o76q91j18J125J840J574Q15L81N96J147J526J539J521
52867B61042J941K589K545J328j68o42o0L93J1o65j001j156j404j434j056q61
52851B61402j375k128k350k228k583l546m362m425l741k477q92L68O28L1o19q87
52835B30816r75r65o11m1J25k61m82M0R32J517J754J955J958J334J96p29r13m84
52817B35166Q5L97K91p9l02r5L37M94K12r4J68J116K155K422J635M44k43k87l71
52798B43451j044k037k690k645j927p52L98Q01J16j112j897j720q50QK04m10j162
52781B26732j023K02J441J569P66Q6r3l17q07r13j79Q11J216J038Q50P77M40k17
$$ y = [244121, 244639, 245879, 246941, 247597, 248148, 248851, 249794, 250944, 251942, 252169, 251405, 250211, 249306, 248781, 248279, 247763, 247677, 248343, 249500, 250476, 250663, 249987, 249096, 248978, 250103, 251943, 253517, 254332, 254713, 255309, 256456, 257982, 259521, 261042, 262983, 265572, 268117, 269445, 269277, 268635, 268575, 268968, 268979, 268314, 267313, 266157, 264753, 263319, 262263, 261402, 260027, 257899, 255549, 253321, 250738, 247192, 242830, 238405, 234664, 232187, 231295, 231663, 232291, 232322, 231703, 230816, 229841, 228876, 228265, 228224, 228349, 228088, 227606, 227646, 228578, 230095, 231849, 233804, 235762, 237096, 237292, 236563, 235650, 235166, 235251, 235648, 235939, 235860, 235558, 235463, 235800, 236294, 236506, 236412, 236580, 237696, 239851, 242273, 243908, 244352, 244109, 243822, 243451, 242407, 240370, 237680, 235035, 233108, 232356, 232754, 233555, 233671, 232559, 230662, 228942, 228092, 228100, 228304, 227894, 226732, 225709, 225911, 227352, 228921, 229687, 229773, 229680, 229363, 228556, 227643, 227464, 228275, 229491, 230529, 231379, 232156, 232596, 232379]
52763B32379o86n56m8K68M4n98j137r59J13J509K278J966J022K63J10M59J077
52746B37504J801K334K221J326J79m33k43L96J163K144L333M160M046L239K514
52731B65684K054J230k59j540j485j78J034J052J49n84n62j78r5m13p07o95n77
52714B63930o64r38j215j486j815j945j500o46j12l12p77q27m41l4L20Q59J360
52697B53757J140K7j190j571r72J01J135J750J580O53k99m62M6L30p4o62q27p34
52679B53728q99j346j638j582j327r72n40l51p98j606j892j265m05j33k56P5J044
52662B39837J869J852J245P69P43R71J242J540J817J954J975K110K472K831K817
52647B66044K304J455M91m88j393k026k202j908j273m20M08P38K00q54j468j086
$$ y = [232379, 231693, 231137, 231089, 231357, 231401, 230803, 229666, 228707, 228820, 230329, 232607, 234573, 235595, 235858, 235968, 236427, 237504, 239305, 241639, 243860, 245186, 245365, 244932, 244689, 245085, 246248, 248392, 251725, 255885, 259931, 263170, 265684, 267738, 268968, 268709, 267169, 265684, 265506, 266540, 267592, 267741, 267157, 266595, 266417, 266322, 265909, 265202, 264507, 263930, 263266, 262328, 261113, 259627, 257812, 255867, 254367, 253721, 253609, 253297, 252520, 251693, 251252, 251218, 251538, 252397, 253757, 254897, 254924, 253734, 252163, 251191, 251292, 252427, 254177, 255757, 256410, 256111, 255649, 255695, 256025, 255951, 255289, 254462, 253728, 252829, 251483, 249845, 248263, 246936, 245964, 245424, 245073, 244275, 242669, 240777, 239512, 239107, 238974, 238718, 238793, 239837, 241706, 243558, 244803, 245572, 246315, 247286, 248528, 250068, 251885, 253839, 255814, 257924, 260396, 263227, 266044, 268348, 269803, 270294, 269806, 268413, 266387, 264185, 262277, 261004, 260584, 260992, 261730, 261930, 261076, 259608, 258522]
52631B58522k33J13k64o19j37J215K790L766L572K242N39n90q96r14j133j456
52615B66517j606j566j303o03L58O65l23j876k532j849q02l56m45o35q99j212
52599B51533j061j36R13J278J166J304J519R43k36n46O89K060J884N06l50r3K30
52582B61603r5l82N8N97K99n56r19n41j04K2K09O68R90Q40M71K55K32L56O87J058
52562B65748J011M80P2K45O02N14O1k59n18j196k092k260j317j77P9m00n40J24
52544B60177Q45P43l7n49k39M47P29M44J15K13O06Q32O97M90O46J263J946K051
52526B71419J291P4q68j166r55m04M37J230J295M39n64q24m55k19k77k0Q10J638
52508B72881J958K080K511L090L282L016K658K306J658N71o59j682k466l180l886
$$ y = [258522, 258289, 258402, 258138, 257519, 257382, 258597, 261387, 265153, 268725, 270967, 271506, 270916, 270020, 269106, 267973, 266517, 264911, 263345, 262042, 261439, 261797, 262462, 262139, 260263, 257731, 255882, 255080, 254724, 254279, 253644, 252745, 251533, 250472, 250336, 251249, 252527, 253693, 254997, 256516, 257459, 257223, 256677, 257366, 259426, 261310, 261816, 261466, 261373, 261603, 261508, 261126, 261184, 261781, 262080, 261524, 260605, 260064, 259960, 259982, 260191, 260859, 261849, 262689, 263160, 263415, 263647, 264003, 264690, 265748, 266759, 267239, 267311, 267556, 268158, 268672, 268733, 268474, 267956, 266760, 264668, 262408, 261091, 260914, 260993, 260593, 260053, 260177, 261022, 261765, 261728, 261179, 260940, 261387, 262116, 262560, 262675, 262888, 263494, 264326, 265023, 265513, 266159, 267422, 269368, 271419, 272710, 272784, 271916, 270750, 269795, 269391, 269828, 271058, 272353, 272792, 272228, 271404, 270949, 270730, 270453, 270433, 271243, 272881, 274839, 276919, 279430, 282520, 285802, 288818, 291476, 293782, 295440, 296011, 295352, 293670, 291204, 288024, 284138]
52493B84138m399m400l740k712j858j393r96l60K48L67Nl53m40m70o27o68k38
52476B62104O59J629K269K426K179J753J408J328J513J770J828J606J379J533
52462B85384K078K586K706K538K380K285K129J871J399L92j234k789l323k765
52448B95637k021j807j843j585j207j342k024k568k481k034j740j693j647j492
52434B70153j263q31l1Q78J282R56M51L70N08K07m98p88k76L21K97J44Q67K303
52416B75050L014K084L39n83mJ335K256K298K021K363L630N073N721N582N627
52401C15806O415P190O681M566J742o36k039k675k996l229l244k911k491k426
52387C19753k726k869k485j815j296r80o44j79L66R10J329J498J590J996K754
$$ y = [284138, 279739, 275339, 271599, 268887, 267029, 265636, 264640, 264280, 264528, 264895, 264900, 264547, 264107, 263637, 263010, 262342, 262104, 262763, 264392, 266661, 269087, 271266, 273019, 274427, 275755, 277268, 279038, 280866, 282472, 283851, 285384, 287462, 290048, 292754, 295292, 297672, 299957, 302086, 303957, 305356, 305748, 304514, 301725, 298402, 295637, 293616, 291809, 289966, 288381, 287174, 285832, 283808, 281240, 278759, 276725, 274985, 273292, 271645, 270153, 268890, 268059, 268028, 268906, 270188, 271144, 271595, 271965, 272473, 272680, 272182, 271394, 271118, 271439, 271736, 271880, 272747, 275050, 278064, 280148, 280487, 279904, 279900, 281235, 283491, 285789, 287810, 290173, 293803, 298876, 304597, 310179, 315806, 322221, 329411, 336092, 340658, 342400, 341764, 339725, 337050, 334054, 330825, 327581, 324670, 322179, 319753, 317027, 314158, 311673, 309858, 308562, 307582, 306938, 306759, 307125, 308035, 309364, 310862, 312452, 314448, 317202]
52372C17202L403L650L819M266M796N057N118N088M578L244J580M96J90J08j20
52357C62475l08k75j20R3L64N04L98L96Q13J158P06j85k45R83K544L449L757L878
52339C80385L766L527L945N468P159P646O829N915N875O721Q099R849J1788J3531
52325D80503J4757J5404J5608J5709J6193J7200J8214J8623J8500J8477J8876
52314F68064J9336J9299J8588J7491J6552J6142J6077J5828J5307J5152J5823
52303H53659J6716J6704J5505J3925J2793J2147J1483J0417Q898P115N324L610
52291I88296J826j22k036l693n105o290p058p416p797q406q609p665n795l882
52277I16248k235m73J454L056M206N347O577P399P805Q716J0629J2619J3408J2937
$$ y = [317202, 320605, 324255, 328074, 332340, 337136, 342193, 347311, 352399, 356977, 360221, 361801, 362297, 362487, 362595, 362475, 362167, 361892, 361772, 361865, 362229, 362733, 363131, 363527, 364340, 365498, 366204, 366019, 365774, 366757, 369301, 372750, 376507, 380385, 384151, 387678, 391623, 397091, 404250, 411896, 418725, 424640, 430515, 437236, 445335, 455184, 466972, 480503, 495260, 510664, 526272, 541981, 558174, 575374, 593588, 612211, 630711, 649188, 668064, 687400, 706699, 725287, 742778, 759330, 775472, 791549, 807377, 822684, 837836, 853659, 870375, 887079, 902584, 916509, 929302, 941449, 952932, 963349, 972247, 979362, 984686, 988296, 990122, 990000, 987964, 984271, 979166, 972876, 965818, 958402, 950605, 942199, 933590, 925925, 920130, 916248, 914013, 913540, 914994, 918050, 922256, 927603, 934180, 941579, 949384, 958100, 968729, 981348, 994756, 1007693]
52263A007693J2188J1796J1653J1634J1941J2644J3437J3931J3873J3219J2287
52252A146296J1770J2083J2816J3110J2532J1232R461P387N296L451J735j59k192
52239A244818l949n192o068o749p273p696q070q159p598o450n223m302l645l155
52225A161289k887k747k383j681r82n80k59L06J023J593K067K801L955N317O511
52210A173343P196P251P063P380Q376R156Q743P402O321N972N675N017M749N584
52196A269228O877P371O920O437O367O244N842N686O002O049N217M073L594L680
52182A349587L254J665o29k750m232n200o172p673r599j1087j1314j0462r404
52169A275984q655q061p452o865o159m991l505k387j972j702q52N66J929K688
$$ y = [1007693, 1019881, 1031677, 1043330, 1054964, 1066905, 1079549, 1092986, 1106917, 1120790, 1134009, 1146296, 1158066, 1170149, 1182965, 1196075, 1208607, 1219839, 1229300, 1236687, 1241983, 1245434, 1247169, 1247010, 1244818, 1240869, 1235677, 1229609, 1222860, 1215587, 1207891, 1199821, 1191662, 1184064, 1177614, 1172391, 1168089, 1164444, 1161289, 1158402, 1155655, 1153272, 1151591, 1150609, 1150029, 1149770, 1150076, 1151099, 1152692, 1154759, 1157560, 1161515, 1166832, 1173343, 1180539, 1187790, 1194853, 1202233, 1210609, 1219765, 1228508, 1235910, 1242231, 1248203, 1253878, 1258895, 1263644, 1269228, 1276105, 1283476, 1290396, 1296833, 1303200, 1309444, 1315286, 1320972, 1326974, 1333023, 1338240, 1342313, 1345907, 1349587, 1352841, 1354506, 1353877, 1351127, 1346895, 1341695, 1335523, 1327850, 1318251, 1307164, 1295850, 1285388, 1275984, 1267329, 1259268, 1251816, 1244951, 1238792, 1233801, 1230296, 1227909, 1225937, 1224235, 1223383, 1223949, 1225878, 1228566]
52155A228566K657J961J002K72j25n49j208j799j997j956j956j848j351p30o59
52140A220280j340k171k483k356k473l212l996l711j882O64K528L184L394M266
52126A210692O157Q689J1342J3805J5914J7695J9359K1104K2860K4343K5238K5411
52114A422609K5116K4873K4867K4608K3620K2276K1238K0108J7623J3573R608
52103A650119P456P008O888O331N627N089M644M194L603K369R9k730n142o790
52089A688765q108r499j1010j2670j4383j5557j5671j5096j4535j3696j1677q722
52077A538141o319n128l924j447J739M120N351O375P880R601J1078J2281J3342
52064A593090J4259J4964J5332J5116J4239J3082J2170J1576J0931R877Q313O353
$$ y = [1228566, 1231223, 1233184, 1234186, 1234458, 1234333, 1233784, 1232576, 1230777, 1228780, 1226824, 1224868, 1223020, 1221669, 1220939, 1220280, 1218940, 1216769, 1214286, 1211930, 1209457, 1206245, 1202249, 1198538, 1196656, 1197320, 1199848, 1203032, 1206426, 1210692, 1216849, 1225538, 1236880, 1250685, 1266599, 1284294, 1303653, 1324757, 1347617, 1371960, 1397198, 1422609, 1447725, 1472598, 1497465, 1522073, 1545693, 1567969, 1589207, 1609315, 1626938, 1640511, 1650119, 1657575, 1664583, 1671471, 1677802, 1683429, 1688518, 1693162, 1697356, 1700959, 1703328, 1703427, 1700697, 1695555, 1688765, 1680657, 1671158, 1660148, 1647478, 1633095, 1617538, 1601867, 1586771, 1572236, 1558540, 1546863, 1538141, 1531822, 1526694, 1522770, 1521323, 1523062, 1527182, 1532533, 1538908, 1546788, 1556389, 1567467, 1579748, 1593090, 1607349, 1622313, 1637645, 1652761, 1667000, 1680082, 1692252, 1703828, 1714759, 1724636, 1732949, 1739302]
52052A739302M354K780J635K07k179n202p764r217j0100j1530j4044j7165j9899
52039A651178k1639k2554k3156k3621k3692k3159k2089k0571j8577j6293j4268
52028A421559j2905j2005j0999r586q007o862o725p644q927r726r909j0021j0358
52015A297885j0586j0533j0710j1525j2443j2660j2281j2254j3206j4913j6827
52004A159947j8601k0124k1406k2468k3176k3271k2835k2394k2262k2104k1551
51993I19755k0764j9924j8621j6609j4721j4059j4381j4334j3317j2076j1345
51982G49604j0955j0715j1068j2200j3386j3957j4254j4846j5379j5118j4187
51971F03539j3373j2857j2012j0416q258n781l110p21P30J427K440M319O191O835
$$ y = [1739302, 1743656, 1746436, 1748071, 1748278, 1746099, 1740897, 1733133, 1723916, 1713816, 1702286, 1688242, 1671077, 1651178, 1629539, 1606985, 1583829, 1560208, 1536516, 1513357, 1491268, 1470697, 1452120, 1435827, 1421559, 1408654, 1396649, 1385650, 1376064, 1368057, 1361195, 1354470, 1346826, 1337899, 1328173, 1318264, 1308243, 1297885, 1287299, 1276766, 1266056, 1254531, 1242088, 1229428, 1217147, 1204893, 1191687, 1176774, 1159947, 1141346, 1121222, 1099816, 1077348, 1054172, 1030901, 1008066, 985672, 963410, 941306, 919755, 898991, 879067, 860446, 843837, 829116, 815057, 800676, 786342, 773025, 760949, 749604, 738649, 727934, 716866, 704666, 691280, 677323, 663069, 648223, 632844, 617726, 603539, 590166, 577309, 565297, 554881, 546623, 540842, 537732, 537011, 537741, 539168, 541608, 545927, 552118, 558953]
51957E58953O264N520N092M347K672M51j507l006m231m858m238k635j391j320
51943E60113j501m02K139M930P196R400J2074J4777J6737J7842J8389J8276J7089
51930F97059J4733J1426P258K313k866p469j1077j3739j5576j6724j7550j8421
51918F29367j9217j9567j9441j9041j8216j6640j4605j2889j1684j0351q562o940
51906D52214n985n089l427j291K73J083K060L803N667O608O323N224L770K219
51892D73452P07q18k528m286n563o131o517p323q238q257o870m607k420q98j26
51877D09577K05O83J776L274M467N039N376N794N912N273M151L138K209R49m74
51862D57349j320j453j694k605l539l452k240p39L78J146J883K742L670M389M437
$$ y = [558953, 565217, 570737, 575829, 580176, 582848, 583299, 581792, 578786, 574555, 569697, 565459, 562824, 561433, 560113, 558612, 558210, 560349, 565279, 572475, 581875, 593949, 608726, 625463, 643305, 661694, 679970, 697059, 711792, 723218, 730476, 732789, 729923, 722454, 711377, 697638, 682062, 665338, 647788, 629367, 610150, 590583, 571142, 552101, 533885, 517245, 502640, 489751, 478067, 467716, 459154, 452214, 446229, 441140, 437713, 436422, 436695, 437778, 439838, 443641, 449308, 455916, 462239, 467463, 471233, 473452, 474159, 473341, 470813, 466527, 460964, 454833, 448316, 440993, 432755, 424498, 417628, 413021, 410601, 409703, 409577, 409782, 410465, 412241, 415515, 419982, 425021, 430397, 436191, 442103, 447376, 451527, 454665, 456874, 457823, 457349, 456029, 454576, 452882, 450277, 446738, 443286, 441046, 440307, 440685, 441831, 443714, 446456, 450126, 454515, 458952]
51847D58952L581K214R66k8j145k607m196n649o885p679p621o683n498m705m285
51832D08732l802l062k165j148l4R11J383J503J660J893J811J215L65n21j561
51817D07180k706l382l084k122j335j104j104r45o02j23N93J449J980J871J379
51802C97945R19M70j48o59n38J24N79M10N1k0p3o41j526j998j903j896k395k815
51784C85886k379j273n49q31j568j718r29K41J101J534J821K057K056J796J598
51769C88843J714K016K354K931M018N411O605P427Q052Q403Q048O865N281L616
51755D61584J645q13l262n080o315p436q429q750q162p109o178n673n643n849
51741C84530n612m326k290m94O22J647L178M882O039O519O584O149M974L454K465
$$ y = [458952, 462533, 464747, 465713, 465685, 464540, 461933, 457737, 452088, 445203, 437524, 429903, 423220, 417722, 413017, 408732, 404930, 401868, 399703, 398555, 398521, 399432, 400815, 402318, 403978, 405871, 407682, 408897, 409262, 408741, 407180, 404474, 401092, 398008, 395886, 394551, 393447, 392343, 391398, 390796, 390673, 391266, 392715, 394695, 396566, 397945, 398864, 399334, 399186, 398527, 397989, 398113, 398692, 399102, 399153, 399133, 399060, 398419, 396893, 394895, 392992, 391096, 388701, 385886, 383507, 382234, 381685, 380854, 379286, 377568, 376639, 376880, 377981, 379515, 381336, 383393, 385449, 387245, 388843, 390557, 392573, 394927, 397858, 401876, 407287, 413892, 421319, 429371, 437774, 445822, 452687, 457968, 461584, 463229, 462416, 459154, 454074, 447759, 440323, 431894, 423144, 414982, 407873, 401695, 396022, 390379, 384530, 378918, 374592, 372302, 371808, 372430, 374077, 377255, 382137, 388176, 394695, 401279, 407428, 412402, 415856, 418321]
51726D18321K340K555K537K425K687L331L676K879P44j899l761m254l959l716
51712D23906l572l127k537k480k996l234k614j658j190j257j253q10j1R57J887
51697D00011K379K120J312M14m74j602k824l346k450l66J767K774K338J129K9
51682D03211p75j797l271m487m460l185j755j119j068p34K88J581K568L131L577
51667C91705M256N357O810Q195Q872Q514P437O187M822K988O82j505l183m676
51653D46461o291p427p131n397l274j609m22L76M96r2p15q50r18j626k797l587
51637D05197l631l267k721j827o98j2l09j358k462l162l411l292k812k039j266
51622C72930r64j374k107k424k029j385j076j239j717k384k882k600j498n28n88
$$ y = [418321, 420661, 423216, 425753, 428178, 430865, 434196, 437872, 440751, 441495, 439596, 435835, 431581, 427622, 423906, 420334, 417207, 414670, 412190, 409194, 405960, 403346, 401688, 400498, 399241, 397988, 397178, 397167, 398124, 400011, 402390, 404510, 405822, 406236, 405762, 404160, 401336, 397990, 395540, 395174, 396941, 399715, 402053, 403182, 403211, 402436, 400639, 397368, 392881, 388421, 385236, 383481, 382362, 381294, 380560, 380848, 382429, 384997, 388128, 391705, 395961, 401318, 408128, 416323, 425195, 433709, 441146, 447333, 452155, 455143, 455825, 454320, 451137, 446461, 440170, 432743, 425612, 420215, 416941, 415332, 414910, 415286, 415782, 415690, 414975, 414125, 413207, 411581, 408784, 405197, 401566, 398299, 395578, 393751, 393053, 393041, 392732, 391374, 388912, 385750, 382339, 379047, 376235, 374196, 372930, 371966, 370592, 368485, 366061, 364032, 362647, 361571, 360332, 358615, 356231, 353349, 350749, 349251, 348723, 348135]
51607C48135j318j683j448j156r02k05P92J170O57K32Q08K183L799N661P758R317
51591C73800R522Q606P405O194M660K709O09j423l156m123m107l619l176k421
51577C91480o91J706L671M787N716P057Q552R683J0373J0823J1212J1760J2638
51564D88767J3585J4041J3892J3629J3701J4237J5488J7831K1073K4276K6621
51553F77141K7846K7628K5343K1015J5906J1299P107K388l050q395j2969j6794
51541G74465j9979k2238k3321k3319k2388k0665j8570j6704j5245j3893j2626
51530E65517j1952j2056j2254j1785j0817j0039r570q919p908p030o733o912p207
51517D42335p369p189o513n607n066n069n090m684m185m131m321m088l360k778
$$ y = [348135, 346817, 345134, 343686, 342530, 341628, 341423, 342215, 343385, 344042, 344274, 345082, 347265, 351064, 356725, 364483, 373800, 383322, 391928, 399333, 405527, 410187, 412896, 413505, 412082, 408926, 404803, 400696, 397077, 393901, 391480, 390789, 392495, 396166, 400953, 406669, 413726, 422278, 431961, 442334, 453157, 464369, 476129, 488767, 502352, 516393, 530285, 543914, 557615, 571852, 587340, 605171, 626244, 650520, 677141, 704987, 732615, 757958, 778973, 794879, 806178, 813285, 815673, 812623, 804228, 791259, 774465, 754486, 732248, 708927, 685608, 663220, 642555, 623985, 607281, 592036, 578143, 565517, 553565, 541509, 529255, 517470, 506653, 496614, 487044, 478125, 470217, 463187, 456454, 449542, 442335, 434966, 427777, 421264, 415657, 410591, 405522, 400432, 395748, 391563, 387432, 383111, 379023, 375663, 372885]
51503C72885k678k623k156j457r12m45K47J086J672J796J592J296J131J253J548
51488C74235J637J398J298J753K323K046O62j000j984k170k061k028k116k322
51474C71671k667k962k889k407j938j985k635l453l928l847l298k444j556j128
51460C34534j544k448k809j976n05M92O62N79O93O90K18l09o5J181K858M308N337
51443C41896O033O471O803P464Q859J0724J1978J1532R393O707M550L003J635
51430D37048N09J09K09l04k107m373n691n770n629o095o795o849o114n265m842
51415C78041m688m332l643k823j995j081j04O42R10P88N49L50K45M17R65J511
51399C65752J396N36k51j08Q54J741K082K401L461N178O630P129P029P307Q422
$$ y = [372885, 370207, 367584, 365428, 363971, 363059, 362614, 362861, 363947, 365619, 367415, 369007, 370303, 371434, 372687, 374235, 375872, 377270, 378568, 380321, 382644, 384690, 385352, 384352, 382368, 380198, 378137, 376109, 373993, 371671, 369004, 366042, 363153, 360746, 358808, 356823, 354188, 350735, 346807, 342960, 339662, 337218, 335662, 334534, 332990, 330542, 327733, 325757, 325252, 325744, 326406, 326985, 327678, 328368, 328586, 328277, 328212, 329393, 332251, 336559, 341896, 347929, 354400, 361203, 368667, 377526, 388250, 400228, 411760, 421153, 427860, 432410, 435413, 437048, 437557, 437666, 437875, 437571, 435464, 431091, 425400, 419630, 414001, 407906, 401111, 394262, 388148, 382883, 378041, 373353, 369021, 365378, 362555, 360560, 359479, 359375, 360017, 360927, 361715, 362264, 362614, 362859, 363276, 364241, 365752, 367148, 367684, 367433, 367325, 368179, 369920, 372002, 374403, 377864, 383042, 389672, 396801, 403830, 411137, 419559]
51384D19559R908J1124J2197J3888J6639K0108K3708K7208L0627L3884L6857L9551
51372F95258M1780M2719M1223L6738K9748K1335J2546M101l673j0841j7624k3929
51360H69381k9263l3144l5508l6640l6906l6641l6035l4876l2699k9463k5921
51349E02285k2988k0745j8497j5746j2789j0228q313o991o196n807n475m906m182
51336C59422l479k624j378p5M99N6p91j271j252j085r65q97j013j455j961k018
51320C39713j533j036j044j437j654j369q18m67m79m99k1J021K052K380J851R43
51304C37603K34q0k09m42q46j149j004m59k6j20m96o05l54k26n20r10r28n78k28
51285C28657l3J99O65J290J774J882J800K131L322M915N728N033L453K304K207
$$ y = [419559, 429467, 440591, 452788, 466676, 483315, 503423, 527131, 554339, 584966, 618850, 655707, 695258, 737038, 779757, 820980, 857718, 887466, 908801, 921347, 925448, 921775, 910934, 893310, 869381, 840118, 806974, 771466, 734826, 697920, 661279, 625244, 590368, 557669, 528206, 502285, 479297, 458552, 440055, 424309, 411520, 401292, 392979, 385988, 379792, 373985, 368510, 363604, 359422, 355943, 353319, 351941, 351866, 352365, 352421, 351630, 350359, 349107, 348022, 347057, 346160, 345147, 343692, 341731, 339713, 338180, 337144, 336100, 334663, 333009, 331640, 330822, 330355, 329876, 329377, 329356, 330377, 332429, 334809, 336660, 337603, 337837, 337757, 337548, 337106, 336260, 335111, 334107, 333648, 333622, 333502, 333006, 332401, 332047, 331821, 331301, 330391, 329463, 328885, 328657, 328624, 328823, 329488, 330778, 332552, 334434, 336234, 338365, 341687, 346602, 352330, 357363, 360816, 363120, 365327]
51270C65327K608K609J936R83K58r9l04n81p75m63M07J184J149M44j55l38o24
51253C73566j390k171k381k321k772l719m286l967l253k738k281j479n45n1l6
51238C40176LK79M26J32l56n54k69K78O20L63l78q98n98J59M13j69r12j133r99
51219C36583r97j055p94k94k0o7M1P46J907K888L011K153J054P75J592K633K932
51202C53088K465J866J493J350J475J787J779J085K08l9L38O14M81K45K5l48o08
51185C67304k45L48N0j294k319j880n14N84J202J851K452K311J223j82j117j200
51169C68574n03L95O85Q3q16j337j459j456j277q75o35p75p38M0J077J381Q24
51152C63188J93j8n4j92m05o90j049j134o65j19k54r59j370j163p94m60J93J069
$$ y = [365327, 367935, 370544, 372480, 373463, 373721, 373622, 373318, 372737, 371962, 371499, 371906, 373090, 374239, 374683, 374528, 374190, 373566, 372176, 370005, 367624, 365303, 362531, 358812, 354526, 350559, 347306, 344568, 342287, 340808, 340263, 340212, 340176, 340179, 340458, 340884, 341016, 340660, 340106, 339837, 340115, 340735, 341098, 340720, 339822, 339224, 339383, 339796, 339627, 338715, 337582, 336583, 335586, 334531, 333737, 333443, 333423, 333356, 333397, 334143, 336050, 338938, 341949, 344102, 345156, 345931, 347523, 350156, 353088, 355553, 357419, 358912, 360262, 361737, 363524, 365303, 366388, 366596, 366557, 366895, 367509, 367990, 368235, 368260, 367912, 367304, 367059, 367407, 367457, 366163, 363844, 361964, 361450, 362034, 363236, 365087, 367539, 369850, 371073, 370891, 369774, 368574, 368071, 368466, 369151, 369234, 368418, 367081, 365622, 364166, 362889, 362014, 361379, 360604, 359866, 359906, 360983, 362364, 363188, 363381, 363363, 363309, 363117, 362712, 362022, 360973, 359839, 359174, 359055, 358801, 357842, 356472, 355309, 354515, 354055, 354248, 355317]
51134C55317J382Q97M93Q93J596J679J024J37o83j261j187l48O26J066J179J537
51118C64347K042K142J860J761J918J745J002K36p8j70m26o62l99L45J044J347
51102C78054J439J672K048K264K164J895J618J250P41M71R66K084K838K405J099
51087D03008O3k3M16N62K14j00L7L77M19J76J93P62J450J642J327J024J043J226
51069D13816J396J658K184K946L800M669N544O487P613Q984J0553J2324J4358
51056D96332J6296J7198J6314J4001J1387R258P755O983P073P548P454O458N195
51043F29252M228L278J896J78j664l736n933p473p715p014o245n875o031o940
51029E80206q505r872j0296j0146j0230j0445j0026q867p603o405m807k795r91
$$ y = [355317, 356699, 357596, 358089, 358982, 360578, 362257, 363281, 363418, 362735, 361474, 360287, 359939, 360565, 361631, 362810, 364347, 366389, 368531, 370391, 372152, 374070, 375815, 376817, 377053, 376975, 376805, 376379, 375717, 375318, 375663, 376707, 378054, 379493, 381165, 383213, 385477, 387641, 389536, 391154, 392404, 393145, 393616, 394582, 396666, 399504, 401909, 403008, 403071, 403048, 403464, 404026, 404240, 404140, 404177, 404554, 404973, 405149, 405342, 406104, 407554, 409196, 410523, 411547, 412590, 413816, 415212, 416870, 419054, 422000, 425800, 430469, 436013, 442500, 450113, 459097, 469650, 481974, 496332, 512628, 529826, 546140, 560141, 571528, 580786, 588541, 595524, 602597, 610145, 617599, 624057, 629252, 633480, 636758, 638654, 638832, 637168, 633432, 627499, 620026, 612311, 605297, 599052, 593177, 587146, 580206, 571701, 561829, 551533, 541387, 531157, 520712, 510686, 501819, 494216, 487811, 483004, 480209, 479218]
51016D79218M73K216M391O199P141P784Q636R150Q669P693P255P477P678P569
51002E71549P428P202O409N017L595K417J131m09j638j997j699j371j273j248
50988E95113j082n62N88K354M205N642O971Q961J1702J4275J5790J6301J6398
50975F96656J6273J5701J4740J3901J3618J4053J5409J7929K1311K4648K7317
50964H91556K9639L2353L5760L9717M4081M8659N2892N6195N8498O0017O0607
50953A409974N9926N8243N6378N4691N2717N0070M7145M4490M1973L9089L5888
50942A950584L3126L1594L1567L2634L3771L3817L2378L0159K8055K6008K3203
50931B286896J9224J4456R296L627k754r687j6976k4747l3059m1446m9294n6480
$$ y = [479218, 479691, 481907, 486298, 492497, 499638, 507422, 516058, 525208, 533877, 541570, 548825, 556302, 563980, 571549, 578977, 586179, 592588, 597605, 601200, 603617, 604748, 604339, 602701, 600704, 599005, 597634, 596361, 595113, 594031, 593469, 594057, 596411, 600616, 606258, 613229, 622190, 633892, 648167, 663957, 680258, 696656, 712929, 728630, 743370, 757271, 770889, 784942, 800351, 818280, 839591, 864239, 891556, 921195, 953548, 989308, 1029025, 1073106, 1121765, 1174657, 1230852, 1289350, 1349367, 1409974, 1469900, 1528143, 1584521, 1639212, 1691929, 1741999, 1789144, 1833634, 1875607, 1914696, 1950584, 1983710, 2015304, 2046871, 2079505, 2113276, 2147093, 2179471, 2209630, 2237685, 2263693, 2286896, 2306120, 2320576, 2329872, 2333499, 2330745, 2321058, 2304082, 2279335, 2246276, 2204830, 2155536, 2099056]
50919B099056o3143o8915p3036p5262p6180p6318p5409p2950o9197o5005o0819
50908A322822n6330n1305m6246m1860l8206l4761l1254k7989k5298k3035k0868
50897I25670j8777j6989j5493j3951j2174j0402r021q136p547o977o127m782l171
50884G92123k020j816k033j668n71L97P42J110K222L713M910O093P910R822J0499
50869H31433R974R964J1529J3538J4372J4177J4425J5858J8011K0388K2914K5326
50857A021909K7199K8801L1068L4540L8924M3822M9209N5091O1342O8045P5391
50846A535341Q3018R0118R6473J02837J09916J17373J24174J29489J32983J34551
50836B656273J34177J31772J27045J19777J10313R9467Q7947P6336O5644N7079
$$ y = [2099056, 2035913, 1966998, 1893962, 1818700, 1742520, 1666202, 1590793, 1517843, 1448646, 1383641, 1322822, 1266492, 1215187, 1168941, 1127081, 1088875, 1054114, 1022860, 994871, 969573, 946538, 925670, 906893, 889904, 874411, 860460, 848286, 837884, 828863, 820727, 813180, 806203, 800076, 795294, 792123, 790103, 788287, 786254, 784586, 784015, 784412, 785154, 786264, 788486, 792199, 797109, 803202, 811112, 820934, 831433, 841407, 851371, 862900, 876438, 890810, 904987, 919412, 935270, 953281, 973669, 996583, 1021909, 1049108, 1077909, 1108977, 1143517, 1182441, 1226263, 1275472, 1330563, 1391905, 1459950, 1535341, 1618359, 1708477, 1804950, 1907787, 2017703, 2135076, 2259250, 2388739, 2521722, 2656273, 2790450, 2922222, 3049267, 3169044, 3279357, 3378824, 3466771, 3543107, 3608751, 3665830]
50826C665830N0891M6128M2042L9268L9039M1692M6441N2251N8247O3395O6481
50815D211705O6492O2764N4922M3014K7605R356j1371l4202n8194q2076j04935
50804D185080j26298j45524j61521j73239j80282j82999j82093j78137j71492
50795B683495j62636j52401j41505j29910j17198j03663r0491p8564o7746n7707
50785A581674m8818m1557l5494k9757k4254j9729j6633j4653j3317j2437j1935
50774A313090j1741j1860j2172j2177j1636j1195j1728j3034j3998j4110j3993
50763A175446j4262j4627j4652j4595j4924j5408j5294j4225j2496j0644r065
50752A025254p804o433m333j436J530L847N682P866J0887J4396J7643K0237K2485
$$ y = [3665830, 3716721, 3762849, 3804891, 3844159, 3883198, 3924890, 3971331, 4023582, 4081829, 4145224, 4211705, 4278197, 4340961, 4395883, 4438897, 4466502, 4475858, 4464487, 4430285, 4372091, 4290015, 4185080, 4058782, 3913258, 3751737, 3578498, 3398216, 3215217, 3033124, 2854987, 2683495, 2520859, 2368458, 2226953, 2097043, 1979845, 1876182, 1785691, 1707127, 1639381, 1581674, 1532856, 1491299, 1455805, 1426048, 1401794, 1382065, 1365432, 1350779, 1337462, 1325025, 1313090, 1301349, 1289489, 1277317, 1265140, 1253504, 1242309, 1230581, 1217547, 1203549, 1189439, 1175446, 1161184, 1146557, 1131905, 1117310, 1102386, 1086978, 1071684, 1057459, 1044963, 1034319, 1025254, 1017450, 1011017, 1006684, 1005248, 1006778, 1010625, 1016307, 1024173, 1035060, 1049456, 1067099, 1087336, 1109821]
50739A109821K5064K8373L2240L6279M0285M4055M7139M9379N1504N4436N7953
50728A576528O0790O2277O3085O3943O4501O4092O2966O1812O0519N8284N4837
50717B253634N0637M5918M0216L3076K4789J6287Q656K736j239l571m399l288
50705B463452J00N210J1105J7501K4451L1096L5711L7326L6521L4087K9610K1968
50693B748138J0782l214j8902l5276n1336o6109p8874q9138r6441j00486j01440
50682B117704r9894r6413r1313q4783p7123o8819o0366n1926m3321l4568k6360
50671A382818j9561j4176r245m044J062N307Q598J1330J3372J4044J3180J1710
50659A414395J0849J1031J1876J2927J4057J5249J6317J7025J7392J7786J8717
$$ y = [1109821, 1134885, 1163258, 1195498, 1231777, 1272062, 1316117, 1363256, 1412635, 1464139, 1518575, 1576528, 1637318, 1699595, 1762680, 1826623, 1891124, 1955216, 2018182, 2079994, 2140513, 2198797, 2253634, 2304271, 2350189, 2390405, 2423481, 2448270, 2464557, 2473213, 2475949, 2474710, 2471139, 2466740, 2463452, 2463552, 2468762, 2479867, 2497368, 2521819, 2552915, 2588626, 2625952, 2662473, 2696560, 2726170, 2748138, 2758920, 2755706, 2736804, 2701528, 2650192, 2584083, 2505209, 2416071, 2319630, 2219144, 2117704, 2017810, 1921397, 1830084, 1745301, 1668178, 1599359, 1538993, 1487067, 1443746, 1409178, 1382818, 1363257, 1349081, 1339836, 1335792, 1336854, 1342161, 1350759, 1362089, 1375461, 1389505, 1402685, 1414395, 1425244, 1436275, 1448151, 1461078, 1475135, 1490384, 1506701, 1523726, 1541118, 1558904, 1577621]
50648A577621K0472K2954K5756K8465L0972L3536L6364L9152M1303M2780M4425
50637A943800M6972M9927N1945N2392N1874N1172N0279M8855M6965M4869M2504
50626B481554L9833L7219L4660L0866K4110J4230L185o594j3908j8855k1905k3378
50614B581017k3341k1670j8385j4134r972o448l325m14J724K264R07k208p028
50601B478987j3495k1114k9210l7531m6106n4546o1910o7452p1101p3133p3722
50590A929667p3037p1481o9542o7415o4881o1529n7167n2119m7145m2952l9569
50579A282830l6338l2538k8082k3554j9573j6228j3119r874o456k987M10L496
50567A097987N891P532Q954J0756J2853J4736J6359J8176K0207K1795K2556K2959
$$ y = [1577621, 1598093, 1621047, 1646803, 1675268, 1706240, 1739776, 1776140, 1815292, 1856595, 1899375, 1943800, 1990772, 2040699, 2092644, 2145036, 2196910, 2248082, 2298361, 2347216, 2394181, 2439050, 2481554, 2521387, 2558606, 2593266, 2624132, 2648242, 2662472, 2665657, 2659063, 2645155, 2626300, 2604395, 2581017, 2557676, 2536006, 2517621, 2503487, 2493515, 2487067, 2483742, 2483328, 2485052, 2487316, 2488223, 2486015, 2478987, 2465492, 2444378, 2415168, 2377637, 2331531, 2276985, 2215075, 2147623, 2076522, 2003389, 1929667, 1856630, 1785149, 1715607, 1648192, 1583311, 1521782, 1464615, 1412496, 1365351, 1322399, 1282830, 1246492, 1213954, 1185872, 1162318, 1142745, 1126517, 1113398, 1103524, 1097068, 1094081, 1094491, 1097987, 1103878, 1111410, 1120364, 1131120, 1143973, 1158709, 1175068, 1193244, 1213451, 1235246, 1257802, 1280761]
50555A280761K3503K3983K4096K4146K4418K4339K3310K2017K1815K2826K3757
50544A538971K3806K3721K4473K5897K7366K9060L1682L5330L9470M3887M8857
50533A892520N4449O0301O6195P2332P8808Q5221R1051R6192J00919J05392J09435
50522B812815J12843J15711J18208J19876J19437J15795J09134J00630R0965P9628
50512C895042O5915N0050L2931J5226k755k0601l7811n4047o8794q0961q9458
50501C704737r4123r5525r3864q8754q0170o8943n6003m1778k6710j1814J863
50490C048916J3960K4406L2411L6465L5339K8766J7179J359j7375l7091n5864
50479C128471p2603q7108r9325j08737j14724j17327j17364j15647j12332j07274
$$ y = [1280761, 1304264, 1328247, 1352343, 1376489, 1400907, 1425246, 1448556, 1470573, 1492388, 1515214, 1538971, 1562777, 1586498, 1610971, 1636868, 1664234, 1693294, 1724976, 1760306, 1799776, 1843663, 1892520, 1946969, 2007270, 2073465, 2145797, 2224605, 2309826, 2400877, 2497069, 2597988, 2703380, 2812815, 2925658, 3041369, 3159577, 3279453, 3398890, 3514685, 3623819, 3724449, 3815414, 3895042, 3960957, 4011007, 4043938, 4059164, 4056409, 4035808, 3997997, 3943950, 3875156, 3794195, 3704737, 3610614, 3515089, 3421225, 3332471, 3252301, 3183358, 3127355, 3085577, 3058867, 3047053, 3048916, 3062876, 3087282, 3119693, 3156158, 3191497, 3220263, 3237442, 3238801, 3221426, 3184335, 3128471, 3055868, 2968760, 2869435, 2760698, 2645974, 2528647, 2411283, 2295636, 2183304, 2076030]
50469B076030j00831r3906q7176q0647p4129o7724o1594n5529m9185m2683l6616
50458A326010l1329k6547k1756j6796j1878p197k722J716O158J0349J3842J6442
50446A256292J8630K1296K4789K8443L1296L3157L4476L5136L4012L0124K3973
50435A571624J7237J1307O521K696k79k562m484o212p454p879p578o775n309k829
50421A558024M57L655O028P764R802J2918J7050K1489K5689K9821L4417L9571
50409A766685M4689M9164N3008N6535N9641O1658O1890O0099N6536N1811M6708
50398B368424M1714L6583L0457K2596J3001K394q324j8708k8976l9517n0038n9283
50386B310323o5848o9223o9945o8853o6403o2536n6933m9421m0428l0964k1956
$$ y = [2076030, 1975199, 1881293, 1794117, 1713470, 1639341, 1571617, 1510023, 1454494, 1405309, 1362626, 1326010, 1294681, 1268134, 1246378, 1229582, 1217704, 1210507, 1207785, 1209501, 1215659, 1226008, 1239850, 1256292, 1274922, 1296218, 1321007, 1349450, 1380746, 1413903, 1448379, 1483515, 1517527, 1547651, 1571624, 1588861, 1600168, 1606689, 1609385, 1609106, 1606544, 1602060, 1595848, 1588394, 1580515, 1572937, 1566162, 1560853, 1558024, 1558481, 1562136, 1568164, 1575928, 1585730, 1598648, 1615698, 1637187, 1662876, 1692697, 1727114, 1766685, 1811374, 1860538, 1913546, 1970081, 2029722, 2091380, 2153270, 2213369, 2269905, 2321716, 2368424, 2410138, 2446721, 2477178, 2499774, 2512775, 2515169, 2506845, 2488137, 2459161, 2419644, 2369606, 2310323, 2244475, 2175252, 2105307, 2036454, 1970051, 1907515, 1850582, 1801161, 1760733, 1729769, 1707813]
50375A707813j3648n886J194P140J1623J4414J4996J2827Q113J808n284j2924
50363A742186k0840k8361l4944m0508m4848m7261m7334m5643m3194m0455l7490
50352A311308l4649l2296l0165k7829k5795k5247k6443k8061k8520k7452k5460
50341I99391k3023k0168j6969j3692j0506p374m304j460J035L191N113O886Q536
50328I26656R983J1068J1724J1974J1830J1372J0994J1202J1941J2411J1919J0689
50316A063763R513Q756Q189P631P146O478N074K941J024J57J26K69O48J823L654
50301A127192N246O316P721J0221J3369J6264J8922K2103K6083L0380L4685L9241
50289A357743M3915M7317M7229M1974L1537J7849L860q158j7701k5280l0823l3511
$$ y = [1707813, 1694165, 1688279, 1689473, 1696613, 1708236, 1722650, 1737646, 1750473, 1758586, 1760394, 1755110, 1742186, 1721346, 1692985, 1658041, 1617533, 1572685, 1525424, 1478090, 1432447, 1389253, 1348798, 1311308, 1276659, 1244363, 1214198, 1186369, 1160574, 1135327, 1108884, 1080823, 1052303, 1024851, 999391, 976368, 956200, 939231, 925539, 915033, 907659, 903355, 901895, 902930, 906121, 911234, 918120, 926656, 936639, 947707, 959431, 971405, 983235, 994607, 1005601, 1016803, 1028744, 1041155, 1053074, 1063763, 1073276, 1082032, 1090221, 1097852, 1104998, 1111476, 1116550, 1119491, 1120515, 1120672, 1120798, 1121067, 1121715, 1123538, 1127192, 1132438, 1138754, 1146475, 1156696, 1170065, 1186329, 1205251, 1227354, 1253437, 1283817, 1318502, 1357743, 1401658, 1448975, 1496204, 1538178, 1569715, 1587564, 1591424, 1583266, 1565565, 1540285, 1509462, 1475951]
50277A475951l3184l1031k8381k5512k2237j9007j6555j4760j2860j0729r055
50266A252640q110p254o023m975m824n215n007l608j522L79J687K547L261L948
50252A217924M491M810N140N938P381R150J0706J1622J1561J0293Q103N852M216
50239A317187K941J373l85j437j336q20r46j851k849l553m417o160r067j2935
50225A275745j7300k1491k4740k6542k7038k6854k6647k6752k7098k7258k6627
50214I97398k4889k2423k0117j8569j7554j6392j4764j3028j1671j0716r785q637
50202H08853p386o161m860l430k216j725k042k668l001k838k362j875j623j787
50188G64879k352l104l832m497n120n594n834n910n906n677n060m313m020m438
$$ y = [1475951, 1442767, 1411736, 1383355, 1357843, 1335606, 1316599, 1300044, 1285284, 1272424, 1261695, 1252640, 1244530, 1237276, 1231253, 1226278, 1221454, 1216239, 1211232, 1207624, 1206102, 1206481, 1208168, 1210715, 1213976, 1217924, 1222415, 1227225, 1232365, 1238303, 1245684, 1254834, 1265540, 1277162, 1288723, 1299016, 1307119, 1312971, 1317187, 1320128, 1321501, 1321116, 1319679, 1318343, 1317523, 1316577, 1314726, 1311877, 1308324, 1303907, 1297747, 1288680, 1275745, 1258445, 1236954, 1212214, 1185672, 1158634, 1131780, 1105133, 1078381, 1051283, 1024025, 997398, 972509, 950086, 929969, 911400, 893846, 877454, 862690, 849662, 837991, 827275, 817490, 808853, 801467, 795306, 790446, 787016, 784800, 783075, 781033, 778365, 775364, 772526, 770164, 768289, 766666, 764879, 762527, 759423, 755591, 751094, 745974, 740380, 734546, 728636, 722730, 717053, 711993, 707680, 703660, 699222]
50174F99222n151n415m820l552k256j596j686j941j720j115p13n91j17R95K034
50159F71578K236J911K003K748L558M131M880O095P479Q822J0437J2496J4456
50146G52830J5672J6202J6494J6671J6706J6999J8024J9484K0589K1094K1467
50135I52232K1856K1765K1110K0861K1938K3799K4838K4079K1951J9271J6056
50124A189756J1707O191N39m026p380j0520j4133j7461j9099j8760j7601j6664
50112A082549j5761j4396j2987j2321j2236j1835j0975j0503j0812j1095j0527
50101I49101r441q675q297p728o801o017n789n984o196o050n201l532j401O45
50087H68634K434M209O093P911R546J1123J2683J3910J4357J3799J2415J0825
$$ y = [699222, 694071, 688656, 683836, 680284, 678028, 676432, 674746, 672805, 671085, 669970, 669257, 668666, 668549, 669544, 671578, 673814, 675725, 677728, 680476, 684034, 688165, 693045, 699140, 706619, 715441, 725878, 738374, 752830, 768502, 784704, 801198, 817869, 834575, 851574, 869598, 889082, 909671, 930765, 952232, 974088, 995853, 1016963, 1037824, 1059762, 1083561, 1108399, 1132478, 1154429, 1173700, 1189756, 1201463, 1207654, 1208193, 1204167, 1196787, 1186267, 1172134, 1154673, 1135574, 1116814, 1099213, 1082549, 1066788, 1052392, 1039405, 1027084, 1014848, 1003013, 992038, 981535, 970723, 959628, 949101, 939660, 930985, 922688, 914960, 908159, 902142, 896353, 890369, 884173, 878123, 872922, 869390, 867989, 868634, 871068, 875277, 881370, 889281, 898827, 909950, 922633, 936543, 950900, 964699, 977114, 987939]
50075I87939R939J0308J1477J2160J1284Q833N731L141J715J192O08q03k789m372
50061A056363n036n276n826o714p366p398o942o343n824n417n000m352l311j896
50047I79662k57J418K944M209N336O601Q122R700J1075J2174J3093J3896J4524
50034A082497J4767J4320J3127J1671J0629J0152R751R026Q125P316O520N625
50022A203526M894M621M597M308L607K757J995J380R83O96J5j493l375m531m565
50007A219415m541o039r539j3994j7891k0510k2184k3534k4606k4819k3716k1506
49995A006536j8832j6215j3885j1964j0479r240q043o986o391o376o722p151p557
49982H76695q042q897j0387j2284j3731j4007j3447j3114j3546j4145j3951j2662
$$ y = [987939, 997878, 1008186, 1019663, 1031823, 1043107, 1051940, 1057671, 1060812, 1062527, 1063719, 1064327, 1063524, 1060735, 1056363, 1051327, 1046051, 1040225, 1033511, 1026145, 1018747, 1011805, 1005462, 999638, 994221, 989221, 984869, 981558, 979662, 979405, 980823, 983767, 987976, 993312, 999913, 1008035, 1017735, 1028810, 1040984, 1054077, 1067973, 1082497, 1097264, 1111584, 1124711, 1136382, 1147011, 1157163, 1166914, 1175940, 1184065, 1191381, 1197901, 1203526, 1208420, 1213041, 1217638, 1221946, 1225553, 1228310, 1230305, 1231685, 1232668, 1233364, 1233379, 1231886, 1228511, 1223980, 1219415, 1214874, 1208835, 1199296, 1185302, 1167411, 1146901, 1124717, 1101183, 1076577, 1051758, 1028042, 1006536, 987704, 971489, 957604, 945640, 935161, 925921, 917878, 910892, 904501, 898125, 891403, 884252, 876695, 868653, 859756, 849369, 837085, 823354, 809347, 795900, 782786, 769240, 755095, 741144, 728482]
49970G28482j0802r214q479q515q541p838o609n779n803o109n952n323m698m256
49956F30564l772l028j921m26J232K570L421M229N445O899Q145R112R860J0030
49942F82360R209P685O218N130M251L616L385L094J945J8j732l060m937p882j0723
49927F98577j2007j1921j1781j2013j1821j0653q902p062n258l726k809k213j232
49914E97179OM48k07p36n0J243J831J653J745K528L399L968M615N607O591P255
49898F37075P812Q469R003R170R036Q608P673O309N042M130L139J677J9j422k885
49883G12855m814o901q268q635q654q990r532r776r603r347r226r023q330o991
49869E94765n290l774k898k719k790k373j058P29K038K499K860M084O116Q037
$$ y = [728482, 717680, 708466, 699987, 691472, 682931, 675093, 668484, 662705, 656902, 650793, 644841, 639518, 634820, 630564, 626792, 623764, 621843, 621417, 622649, 625219, 628640, 632869, 638314, 645213, 653358, 662470, 672330, 682360, 691569, 699254, 705472, 710602, 714853, 718469, 721854, 724948, 726893, 726911, 725179, 722119, 717182, 709300, 698577, 686570, 674649, 662868, 650855, 639034, 628381, 619479, 612417, 607159, 603433, 600624, 598411, 597179, 597185, 597633, 597426, 596690, 596640, 597883, 599714, 601367, 603112, 605640, 609039, 613007, 617622, 623229, 629820, 637075, 644887, 653356, 662359, 671529, 680565, 689173, 696846, 703155, 708197, 712327, 715466, 717143, 717162, 715740, 712855, 708041, 701140, 692872, 684237, 675583, 666593, 657061, 647285, 637682, 628335, 619109, 610086, 601756, 594765, 589475, 585701, 582803, 580084, 577294, 574921, 573863, 574592, 576630, 579129, 581989, 586073, 592189, 600226]
49855F00226R344J0367J1297J1608J0860R548Q536P990P380O300M827L204J738
$$ y = [600226, 609570, 619937, 631234, 642842, 653702, 663250, 671786, 679776, 687156, 693456, 698283, 701487, 703225]
$$ [...]
##END NTUPLES=NMR SPECTRUM
##END=
