##TITLE=AC1538_ROEFFECT0010_8214700_gM39gyj76X
##JCAMPDX= 6.0         $$ Bruker NMR JCAMP-DX V2.0
##DATA TYPE= NMR SPECTRUM
##DATA CLASS= NTUPLES
##ORIGIN= BRUKER
##OWNER= Administrator
$$ 1.72 TOPSPIN		Version 2.1
$$ 2013-10-12 12:03:10.895 -0700  Administrator@X
$$ Compression mode = diff/dup
##.OBSERVE FREQUENCY= 400.02188249412
##.OBSERVE NUCLEUS= ^1H
##.ACQUISITION MODE= SIMULTANEOUS (DQD)
##.ACQUISITION SCHEME= undefined
##.AVERAGES= 8
##.DIGITISER RES= 22
##SPECTROMETER/DATA SYSTEM= spect
##.PULSE SEQUENCE= zg30
##.SOLVENT NAME= COFFEE_meoh
##.SHIFT REFERENCE= INTERNAL, COFFEE_meoh, 1, 14.98509
##AUDIT TRAIL= $$ (NUMBER, WHEN, WHO, WHERE, PROCESS, VERSION, WHAT)
$$ ##TITLE= Audit trail, TOPSPIN		Version 2.1
$$ ##JCAMPDX= 5.01
$$ ##ORIGIN= Bruker BioSpin GmbH
$$ ##OWNER= Administrator
$$ $$ E:\/data/COFFEE/nmr/AC1538_ROEFFECT0010_8214700_gM39gyj76X/10/pdata/1/auditp.txt
$$ ##AUDIT TRAIL=  $$ (NUMBER, WHEN, WHO, WHERE, PROCESS, VERSION, WHAT)
(   1,<2013-10-12 12:03:04.442 -0700>,<Administrator>,<X>,<go>,<TOPSPIN 2.1>,
      <created by zg
	started at 2013-10-12 12:01:58.864 -0700,
	POWCHK enabled, PULCHK disabled,
       configuration hash MD5:
       C8 4E 4E 5D D3 5C D8 9E 9F 52 82 E0 59 8A DE 15
       data hash MD5: 64K
       AB 11 4D 1C BC 2C 9A 7D E5 55 D0 1F 75 40 79 61>)
(   2,<2013-10-12 12:03:07.427 -0700>,<Administrator>,<X>,<proc1d>,<TOPSPIN 2.1>,
      <Start of raw data processing
       efp LB = 0 FT_mod = 6 PKNL = 1 PHC0 = 0 PHC1 = 0 SI = 32K 
       data hash MD5: 32K
       C6 52 10 5E 42 2E 1F 54 75 38 62 E6 5E 76 7A A9>)
(   3,<2013-10-12 12:03:07.724 -0700>,<Administrator>,<X>,<proc1d>,<TOPSPIN 2.1>,
      <pk PHC0 = 97.99805 PHC1 = 0 
       data hash MD5: 32K
       B7 1F 88 D2 E0 36 EA 90 01 6E 30 A9 5B 86 5A FB>)
(   4,<2013-10-12 12:03:07.833 -0700>,<Administrator>,<X>,<proc1d>,<TOPSPIN 2.1>,
      <abs ABSG = 1 
       data hash MD5: 32K
       85 D7 E4 92 02 03 F3 70 0B 92 EE 43 CA F3 D1 71>)
(   5,<2013-10-12 12:03:07.895 -0700>,<Administrator>,<X>,<proc1d>,<TOPSPIN 2.1>,
      <abs ABSG = 2 
       data hash MD5: 32K
       CF E8 EA F6 92 0B 52 13 D1 AF 32 4A A4 30 3D 29>)
(   6,<2013-10-12 12:03:07.958 -0700>,<Administrator>,<X>,<proc1d>,<TOPSPIN 2.1>,
      <abs ABSG = 3 
       data hash MD5: 32K
       8F 04 24 E5 EF B8 A8 51 D0 A6 4E AA 26 DB 3F 23>)
(   7,<2013-10-12 12:03:08.005 -0700>,<Administrator>,<X>,<proc1d>,<TOPSPIN 2.1>,
      <abs ABSG = 4 
       data hash MD5: 32K
       7A 2B 60 7D E2 E5 D8 F9 81 C2 3C 62 D0 BA 04 E0>)
(   8,<2013-10-12 12:03:08.052 -0700>,<Administrator>,<X>,<proc1d>,<TOPSPIN 2.1>,
      <abs ABSG = 5 
       data hash MD5: 32K
       0E 04 99 1F 95 F6 81 2E 85 E9 7E 35 B8 A8 C8 70>)
$$ ##END=
$$ 
$$ $$ hash MD5
$$ $$ 56 3D 46 09 AA 91 88 A6 1A B5 1C 7A EA 79 C8 D7
##$RELAX= 
##$RELAX= 
##$RELAX= 
##$RELAX= 
##$RELAX= 
##$RELAX= 
##$RELAX= 
$$ Bruker specific parameters
$$ --------------------------
##$DU= <E:\>
##$EXPNO= 10
$$ [...]
##$TP= (0..7)
150 150 150 150 150 150 150 150
##$TP07= 0
##$TPNAME0= <>
##$TPNAME1= <>
##$TPNAME2= <>
##$TPNAME3= <>
##$TPNAME4= <>
##$TPNAME5= <>
##$TPNAME6= <>
##$TPNAME7= <>
##$TPOAL= (0..7)
0.5 0.5 0.5 0.5 0.5 0.5 0.5 0.5
##$TPOFFS= (0..7)
0 0 0 0 0 0 0 0
##$TUNHIN= 0
##$TUNHOUT= 0
##$TUNXOUT= 0
##$USERA1= <user>
##$USERA2= <user>
##$USERA3= <user>
##$USERA4= <user>
##$USERA5= <user>
##$V9= 5
##$VALIST= <valist>
##$VCLIST= <CCCCCCCCCCCCCCC>
##$VD= 0
##$VDLIST= <DDDDDDDDDDDDDDD>
##$VPLIST= <PPPPPPPPPPPPPPP>
##$VTLIST= <TTTTTTTTTTTTTTT>
##$WBST= 1024
##$WBSW= 4
##$XGAIN= (0..3)
0 0 0 0
##$XL= 0
##$YL= 0
##$YMAX_a= 604697
##$YMIN_a= -515783
##$ZGOPTNS= <>
##$ZL1= 120
##$ZL2= 120
##$ZL3= 120
##$ZL4= 120
##$ABSF1= 14.98509
##$ABSF2= -5.573092
##$ABSG= 5
##$ABSL= 3
##$ALPHA= 0
##$AQORDER= 0
##$ASSFAC= 0
##$ASSFACI= 0
##$ASSFACX= 0
##$ASSWID= 0
##$AUNMP= <proc_prof1d_extract_pilot.lims>
##$AXLEFT= 0
##$AXNAME= <>
##$AXNUC= <1H>
##$AXRIGHT= 0
##$AXTYPE= 0
##$AXUNIT= <>
##$AZFE= 0.1
##$AZFW= 0.1
##$BCFW= 0
##$BC_mod= 0
##$BYTORDP= 0
##$COROFFS= 0
##$CY= 15
##$DATMOD= 1
##$DC= 0
##$DFILT= <>
##$DTYPP= 0
##$F1P= 0
##$F2P= 0
##$FCOR= 0.5
##$FTSIZE= 32768
##$FT_mod= 6
##$GAMMA= 0
##$GB= 0
##$INTBC= 1
##$INTSCL= 1
##$ISEN= 128
##$LB= 0
##$LEV0= 0
##$LPBIN= 0
##$MAXI= 10000
##$MC2= 0
##$MEAN= 0
##$ME_mod= 0
##$MI= 0
##$NCOEF= 0
##$NC_proc= -8
##$NLEV= 6
##$NOISF1= 0
##$NOISF2= 0
##$NSP= 0
##$NTH_PI= 0
##$NZP= 0
##$OFFSET= 14.98509
##$PC= 1
##$PHC0= 97.99805
##$PHC1= 0
##$PH_mod= 1
##$PKNL= yes
##$PPARMOD= 0
##$PPDIAG= 0
##$PPIPTYP= 0
##$PPMPNUM= 2147483647
##$PPRESOL= 1
##$PSCAL= 4
##$PSIGN= 0
##$PYNMP= <proc.py>
##$REVERSE= no
##$SF= 400.02
##$SI= 32768
##$SIGF1= 0
##$SIGF2= 0
##$SINO= 400
##$SIOLD= 32768
##$SPECTYP= <>
##$SREGLST= <1H.CDCl3>
##$SSB= 0
##$STSI= 32768
##$STSR= 0
##$SW_p= 8223.68421052631
##$SYMM= 0
##$S_DEV= 0
##$TDeff= 65536
##$TDoff= 0
##$TI= <>
##$TILT= no
##$TM1= 0
##$TM2= 0
##$TOPLEV= 0
##$USERP1= <user>
##$USERP2= <user>
##$USERP3= <user>
##$USERP4= <user>
##$USERP5= <user>
##$WDW= 1
##$XDIM= 32768
##$YMAX_p= 453408575
##$YMIN_p= -751851
##$CURPLOT= <Network HP LaserJet P1505>
##$CURPRIN= <$Network HP LaserJet P1505>
##$DFORMAT= <normdp>
##$LAYOUT= <+/1D_H.xwp>
##$LFORMAT= <normlp>
##$PFORMAT= <normpl>
##$SURQMSG= 1
$$ End of Bruker specific parameters
$$ ---------------------------------
##NTUPLES= NMR SPECTRUM
##VAR_NAME=  FREQUENCY,     SPECTRUM/REAL,   SPECTRUM/IMAG
##SYMBOL=    X,             R,               I
##VAR_TYPE=  INDEPENDENT,   DEPENDENT,       DEPENDENT
##VAR_FORM=  AFFN,          ASDF,            ASDF
##VAR_DIM=   32768,         32768,           32768
##UNITS=     HZ,            ARBITRARY UNITS, ARBITRARY UNITS
##FACTOR=    0.250966925370066, 1,           1
##FIRST=     8223.43324360094, 113641,       -206369
##LAST=      0,             5544,            457
##MIN=       0,             -751851,         0
##MAX=       8223.43324360094, 453408575,    0
$$ Real data points
##PAGE= N=1
##DATA TABLE= (X++(R..R)), XYDATA
$$ [...]
19552a81614H9190m0106a38705N9466C32612d49216b23548h1158c2773j59741
19542a92514C21798b50432k3424i7165B63921o9561j1350i9923b6150P052G0834
19530a99234J6904e8323j22165k25236a03966d9961k2818C0956i6878H7887c43821
19518c02045d567j62168B10405D8482R258a88055R3463A6280L6961P6574b26781
19506b25748a03669l9881j13950q329E9660b72290P3492g8504n3615k07036F4487
19494G2126a89158N3655D8159k1429J70668I0808b34618a8405q1211j36328G7568
19482A20766a57275m2043P3603j79397B06891r3048d0803k28024i4474B40586
19471H6077a64531f7482j42575B2010K80839q7640f88052C5519a55899j33188
$$ y = [-181614, 89190, 49084, -138705, -79239, 332612, -449216, -223548, -81158, -32773, -192514, 321798, -250432, -273856, -97165, 263921, 194360, 183010, -99923, -26150, -19098, 70834, -199234, -182330, -58323, -180488, -405724, -103966, -49961, -72779, 30956, -96878, 87887, -343821, -302045, -4567, -166735, 210405, 48482, 57740, -188055, -94592, 16280, 53241, 129815, -226781, -225748, -103669, -143550, -257500, -265829, 59660, -272290, -198798, -78504, -132119, -339155, 64487, 72126, -189158, -135503, 48159, 26730, 197398, 90808, -234618, -18405, -99616, -235944, 77568, 120766, -157275, -199318, -125715, -305112, 206891, 113843, -40803, -268827, -94474, 240586, 86077, -164531, -67482, -210057, 22010, 302849, 215209, -688052, 35519, -155899, -289087]
19461b89087J33075B2825e3723j21641j52070R2428f6258B6773d39112e4998j74381
19450b29379A26966a81452f8685A02664c77941Q6709A13410j2359K6013B9924
19439c37473B09990a67198A03006k7835J20848i608k18152A58070K7832a03117
19428a90837P431j28008J23216h5750E7816b29910C49088h0308j29846A30428
19417C5955J64347D9258a84512h5337F6037d7991a2005j67748H7063K32318g8849
19405I4759F048h1309F8405a13729A56619m8566b71A51868D9826f5791j48700
19394b14491b9499l40683c8161A4382n388b37894b4356A3884A1J43108a37688
19382a23724j31266B44386q1195a07038L0332A3208i8238c1260A50914a34280
$$ y = [-289087, -156012, 22825, -53723, -175364, -327434, -235006, -66258, 26773, -439112, -54998, -229379, 126966, -181452, -68685, 102664, -377941, -291232, 113410, 101051, 127064, 29924, -337473, 209990, -167198, 103006, 75171, 196019, -9608, -227760, 158070, 185902, -103117, -190837, -183406, -311414, -188198, -85750, 57816, -229910, 349088, -80308, -210154, 130428, 35955, 200302, 49258, -184512, -85337, 66037, -47991, -12005, -179753, 87063, 319381, -78849, 94759, 6048, -81309, 68405, -113729, 156619, 108053, -271, 151868, 49826, -65791, -214491, -29499, -370182, -38161, 14382, 8994, -237894, -24356, 13884, 11, 143119, -137688, -123724, -254990, 244386, 163191, -107038, -76706, 13208, -98238, -31260, 150914, -134280]
19371C4851a88694a7989B19060b31728g3529p0806e96E8080c62226R5178J25216
19360a41832O8165E6756D091a78961Q1459E2904R1392n2251e0316k17800A61809
19348b28081e6526A57982c60950c7102k17646j6314m124f1561C4272J38796c54518
19336a26752j43551d7935A32801a38692O2294J9941k1889C2282R7736b88670k4904
19325c13574B67907a95548m8236I4283a23164N3072r306r9343h7735q5256k6999
19314a99990f4381b5041p1112A00402c25979E3233b59659I2340a9635j81800j8422
19303b19857a03585M7330k66663a3633B6231J3675N5134b7113l15038g8768D1491
19291d1438k35596g6307j81159A89575O4893a13425A5149Q4595b22231C2586b87443
$$ y = [34851, -188694, -17989, 219060, -231728, -73529, -144335, -596, 58080, -362226, -267048, -141832, -73667, 56756, 4091, -178961, -97502, 52904, 144296, 92045, -50316, -268116, 161809, -228081, -56526, 157982, -360950, -37102, -254748, -271062, -275186, -61561, 34272, 173068, -354518, -126752, -270303, -47935, 132801, -138692, -76398, -56457, -78346, 32282, 130018, -288670, -313574, 267907, -195548, -243784, 94283, -123164, -70092, -79398, -178741, -87735, -172991, -199990, -64381, -25041, -96153, 100402, -325979, 53233, -259659, 92340, -19635, -201435, -219857, -103585, -56255, -322918, -13633, 26231, 39906, 95040, -27113, -342151, -78768, 41491, -41438, -277034, -76307, -257466, 189575, 254468, -113425, 15149, 99744, -222231, 32586, -287443]
19279a00839C81133a20208d5990A06856L46000c9080j49699C6312N2164b09195
19268C84869A47196d18295a33410K1064K6626F4232a29974j09818j01715B04321
19257G233a45758b5434k26282A816a1064H8605a66412g2072m80189K23393R5831
19246b33037P8423j77241A16022a03804e1689O461B55744b98905Q0333j4211f3317
19234A22958a39017q9283B49395G6162i8987Q863k06093j31093J55643e3865F3233
19222c1367j32829B13077i5566B63102C911J04575c66776A82408g6057C50729
19211a78789C09432j32216q7764g9818o8378P1056l35759i1590B5175J27108a79962
19199C3496b73280M9784D2731L9297K69236j33030b721o4756A04832c54493a31353
$$ y = [-100839, 381133, -120208, -45990, 106856, 452856, -39080, -188779, 36312, 88476, -209195, 384869, 147196, -418295, -133410, -112346, -85720, 64232, -129974, -239792, -341507, 204321, 7233, -145758, -25434, -251716, 1816, -11064, 88605, -166412, -72072, -552261, -328868, -233037, -154614, -331855, 116022, -103804, -51689, -45228, 255744, -298905, -218572, -232783, -63317, 122958, -139017, -228300, 249395, 76162, -98987, -90124, -296217, -427310, -271667, -53865, 63233, -31367, -164196, 213077, -95566, 263102, 3911, 108486, -366776, 182408, -76057, 350729, -178789, 309432, 177216, 89452, -79818, -148196, -77140, -412899, -91590, 25175, 152283, -179962, 33496, -273280, -223496, 42731, 82028, 351264, 218234, -2721, -67477, 104832, -354493, -131353]
19187c40182b9996g06l19355d22j97008B81582c8196a3986n9046o3148o5613a00131
19174a74180E4732b29837j69653J36368B6091c60591a60319B72770f2392A59867
19163d6502J9172A76927A7005d40104J64323J27931G122a4579j13691L5518m4509
19152a37261m1271R550B28353d2127j57968E1265i5457K0866b6255F3186b795
19140c31044b917l33836A2687b59601C455K629K5083b10468B36796k1978h6550
19128E7468a36000A20393k7560J92005b11129R6819B04214a74565C6301a84560
19117b27508A03617c34026J60687A82451q3273k2094b20668g2763l0751I0415
19106b60834J20239K1950A59688D3574d65613e1543r0796m8727R242k63730a49206
$$ y = [-340182, -29996, -706, -320061, -422, -197430, 281582, -38196, -13986, -73032, -136180, -201793, -100131, -174180, 54732, -229837, -399490, -263122, 26091, -360591, -160319, 272770, -62392, 159867, -46502, -27330, 176927, 17005, -440104, -275781, -147850, 7122, -14579, -128270, -92752, -137261, -178532, -168982, 228353, -42127, -200095, 51265, -95457, -74591, -26255, 63186, -2795, -331044, -2917, -336753, 12687, -259601, 3455, 6084, 31167, -210468, 236796, 214818, -86550, 57468, -136000, 120393, 92833, 284838, -211129, -114310, 204214, -174565, 36301, -184560, -227508, 103617, -334026, -173339, 182451, 99178, 77084, -220668, -72763, -103514, 90415, -260834, -140595, -118645, 159688, 43574, -465613, -51543, -142339, -191066, -181824, -445554, -149206]
19094b50189N1038H2039a99745D15400a84109A60814E9947a09650a3277A24735
19083b62540A84296b8582G7999d834I3195l8900c8859j39608N9280m2700b0856
19071a32910j13759a14059j48126c0189j7006B0504K14544f1016o0140D2441b80280
19059f4662D9673a83058a0452k03650B4043p502L9157e8414A71034b505n2010
19048e4515H4799b1607p994D3542d39398C53579A39290h4456b8400k03885c6766
19036G4237P5536a2880m6874C29788J41001D00N8486J2227a79315O6779j53245
19025b65781E4503b68401b4734m251I345Q1256b39351C94290d30299A94130a06207
19013A1337a81681b9024J2518A4982a95525A93288c06057F6269a39014A01405
$$ y = [-250189, -199151, 82039, -199745, 415400, -184109, 160814, 59947, -109650, -13277, 124735, -262540, 184296, -28582, 77999, -4834, 93195, 54295, -38859, -178467, -119187, -161887, -20856, -132910, -246669, -114059, -262185, -30189, -47195, 20504, 235048, -61016, -121156, 42441, -280280, -64662, 49673, -183058, -10452, -214102, 24043, 16541, 55698, -58414, 171034, -2505, -54515, 84799, -21607, -29601, 43542, -439398, 353579, 139290, -84456, -28400, -232285, -36766, 74237, 149773, -12880, -59754, 329788, 470789, 400, 58886, 71113, -179315, -112536, -265781, 54503, -268401, -24734, -28985, 9345, 90601, -239351, 394290, -430299, 194130, -106207, 11337, -181681, -29024, -16506, 14982, -195525, 193288, -306057, 66269, -139014, 101405]
19002b25146F5351e0758G536J06671f6866j74925i0621C9600h9974G0488a38527
18990a89429A03460i6454a4124j27329A10908N4349c991G1773b44293E7529f2816
18978g2319E0229d1017i824j62349b6833r1193H3615f9860p1541q7356b2302D870
18965a27497j88229a52819j10124i8138j03433B18817q1639j0603k8960C4414
18954b8203D1654P8948A7217e2548e225A41694b56921O0845n6148B01924f6535
18942E273f5781m05837b8186n9807E2632K85843C470K03518m5062a60440C09225
18930a63850M0189B05797e95270a24288J4874j32992a04944k52250I5853N0493
18920A46346a69411j67860J0525M9806B2554b11548B16044g8552m3255A48985
$$ y = [-225146, 65351, -50758, 7536, 114207, -66866, -241791, -90621, 39600, -89974, 70488, -138527, -189429, 103460, -96454, -14124, -141453, 110908, 165257, -3991, 71773, -244293, 57529, -62816, -72319, 50229, -41017, -9824, -172173, -26833, -118026, 83615, -69860, -141401, -228757, -22302, 4870, -127497, -315726, -152819, -262943, -98138, -201571, 218817, 137178, 126575, 97615, 34414, -28203, 41654, 120602, 17217, -52548, -5225, 141694, -256921, -196076, -252224, 201924, -66535, 5273, -65781, -471618, -28186, -87993, 52632, 338475, 3470, 206988, 161926, -160440, 309225, -163850, -123661, 205797, -595270, -124288, -109414, -242406, -104944, -357194, 95853, 146346, -169411, -337271, -326746, -276940, 22554, -211548, 216044, -78552, -121807, 148985]
18909C9131a18811B11382E2726J85007a40735A08155e8761j58677Q0775M4420
18899i2243l60663B9384b21150g437B16425d5655E3175h5215r6921F9316e7550
18887e6551k6196k35006h8697o6441A47745c6151j1243m49193a9511k95834B7873
18875A95328i3759j43066H1229c5186E1382b03551F4374a48247M0008A1638b40858
18863f0480F5416a18029A39353F9022J53723a42023d2249D3303A4582J90508h4445
18851G8711a49607A96209D8227c93741a35767B25041o245a10404o1324e5563j51186
18840b06749a1337m7026b1829k26127B34905g2295j18209N3755M2805J8962j27109
18829b02091j21307c1515G0085d6695G5830c15598O6326P8441H5859L5197a44397
$$ y = [39131, -118811, 211382, 52726, 237733, -140735, 108155, -58761, -217438, -136663, -92243, -452906, 29384, -221150, -7437, 216425, -45655, 53175, -85215, -182136, 69316, -57550, -56551, -82747, -317753, -88697, -155138, 147745, -36151, -47394, -496587, -19511, -315345, 27873, 195328, -93759, -236825, 81229, -35186, 51382, -203551, 64374, -148247, -108239, 11638, -240858, -60480, 65416, -118029, 139353, 69022, 222745, -142023, -42249, 43303, 14582, 205090, -84445, 78711, -149607, 196209, 48227, -393741, -135767, 225041, 218796, -110404, -171728, -55563, -206749, -11337, -58363, -21829, -247956, 234905, -72295, -190504, -136749, -93944, -74982, -202091, -323398, -31515, 70085, -46695, 75830, -315598, -249272, -170831, 85859, 121056, -144397]
18817B643J10546b0961A48658P7288f5107K5684B14029c13812F1761L84218a51809
18805C01515a1444j45156A52541b9454o7329B51684b51050M0887a1349A6428O5693
18794H2121a93507Q4574E2934a38741e1626j65809E7805B19M9080K11544J69376
18783D30219c69978E4034J67910a5087C6127J9343c14958A4076L7799b26503B88735
18771A56274A3274P5712A5803a20226P948F3298a29949n5776c7506A49242E3663
18759f2785B20294r7385A7035J75312a23622C55907a61206j68300B02516i4539
18748g9640j55190F0299J50733b55679d7436G0842l0956a41522k6565e1553j17625
18737a69178O9960j12078F111e38823C82185b66154F9429M6314L26460a53915
$$ y = [2643, 113189, -20961, 148658, 225946, -65107, -39423, 214029, -313812, 61761, 445979, -151809, 301515, -11444, -156600, 152541, -29454, -96783, 251684, -251050, -210163, -11349, 16428, 82121, -193507, -108933, 52934, -138741, -51626, -217435, 57805, 219, 49299, 260843, 430219, -369978, 54034, 221944, -15087, 36127, 55470, -314958, 14076, 51875, -226503, 288735, 156274, 13274, 88986, 15803, -120226, -112278, 63298, -129949, -185725, -37506, 149242, 53663, -62785, 220294, 122909, 17035, 192347, -123622, 355907, -161206, -329506, 202516, -94539, -79640, -234830, 60299, 211032, -255679, -47436, 70842, 39886, -141522, -168087, -51553, -169178, -99218, -211296, 6111, -538823, 382185, -266154, 69429, 115743, 442203, -153915]
18726A16095J09366b98358G5213b77958j21900a13547l91779a9837j10690j60017
18716b90544c6545k3589j53018a2262A88953d1905F0548a87272j052h1371j33676
18705b15047A28766a73504M390H8394b35254d8389n0076F6254O9528J0820a74716
18693h919B3351G043h9394K3991C1844d5786B9324J51619p3753a24624A78922
18681C4079b94871A19886a56316c6997k5605M258c663j95077A9489M8660j0846
18670E7303a9954j42085E6984i2234p641c8590k74914i8376p589B19071h6671
18658b17261g2369D0199i4161j32234Q5617d5567p5026J5565m6560C1495h0509
18646a68092I0387r597a84145Q2613j23201d3329H2543a14305p2077j20248J8471
$$ y = [116095, 225461, -298358, 75213, -277958, -399858, -113547, -505326, -19837, -130527, -290544, -36545, -60134, -213152, -12262, 188953, -41905, 60548, -187272, -188324, -81371, -215047, 128766, -173504, -169114, 88394, -235254, -48389, -98465, 66254, 135782, 146602, -174716, -8919, 23351, 7043, -89394, -65403, 31844, -45786, 29324, 180943, 107190, -124624, 178922, 34079, -294871, 119886, -156316, -36997, -62602, -58344, -3663, -198740, 19489, 68149, 57303, -19954, -162039, 56984, -92234, -99875, -38590, -313504, -98376, -105965, 219071, -86671, -217261, -72369, 40199, -94161, -226395, -140778, -45567, -120593, -105028, -151588, 31495, -80509, -168092, 90387, 80790, -184145, -101532, -224733, -43329, 82543, -114305, -186382, -306630, -288159]
18635b88159D026b4605m4436H6154a74836P4134M7540G8891a62389B33050o9709
18624A63341N7436b93643A88420E125K049J32315i8489B7188a03132F9042J1294
18613H0336b18202A42947Q6083c29568A478N96786a56341g2645e925A54334h959
18601g6858H0817a16546G6926b17469h1848k43036J42366A02479a4794k10503
18591b25297B3231d0655j03501r384B2188a42213k7122Q1067A5372b95617C34358
18579b95132e4843k06841a6533r8655A6103J21347b33015P9146g4080j60117B92346
18567b29805O1492A46129a55030j10340J19769e066l33223E0757a83522O4769
18557a18753D8564a34569c5501j97984b3560j57140f9733H1354L5574A3537c25222
$$ y = [-288159, 4026, -24605, -69041, 86154, -174836, -100702, -53162, 78891, -162389, 233050, 163341, 220777, -293643, 188420, 5125, 7174, 139489, -98489, 27188, -103132, 69042, 80336, -218202, 142947, 229030, -329568, 1478, 598264, -156341, -72645, -5925, 154334, -8959, -76858, 80817, -116546, 76926, -217469, -81848, -324884, -182518, 102479, -14794, -225297, 23231, -40655, -144156, -153540, 22188, -142213, -169335, -88268, 15372, -295617, 334358, -295132, -54843, -261684, -16533, -115188, 16103, 137450, -233015, -153869, -74080, -234197, 292346, -229805, -168313, 146129, -155030, -265370, -145601, -5066, -338289, 50757, -183522, -118753, 48564, -134569, -35501, -233485, -23560, -180700, -69733, 81354, 116928, 13537, -325222]
18545a3712E9758h886o4382l18845a78507B16818b4266h246E4359c25326c7048
18533C06250A22220k7258a38251A68246c788A71956a51316l2622r2499a13393
18522a10407L9517A32456a07855j86740d4923q0879o7136q3349A93872A9527J20260
18511A39787h7664l472n077G0063L0144a50416A25472g5183K6441j35004H9091
18499c59072A27051l5243F760J95105b81150a01114A4543N4684K32543D7243L3398
18488H0641f030j69772G9818b39510h5975j14306G3714a10566J0356A10779b35218
18476A7781h2364j34095a05756C6536c86253b0681B07133b49666P2486c5313C6746
18464i3142b1307l2787j1278J1108b5967B16271b05743a9346A69848b13757K7419
$$ y = [-13712, 59758, -8886, -73268, -392113, -178507, 216818, -24266, -8246, 54359, -325326, -37048, 306250, 122220, 94962, -138251, 168246, -3788, 171956, -151316, -183938, -276437, -113393, -110407, -70890, 132456, -107855, -294595, -44923, -125802, -192938, -276287, 193872, 19527, 139787, -87664, -91136, -96213, 70063, 100207, -150416, 125472, -75183, -48742, -183746, 89091, -359072, 127051, 91808, 6760, 201865, -281150, -101114, 14543, 69227, 301770, 47243, 80641, -6030, -175802, 79818, -239510, -85975, -200281, 73714, -110566, -100210, 110779, -235218, 17781, -82364, -216459, -105756, 36536, -386253, -20681, 207133, -249666, -177180, -35313, 36746, -93142, -21307, -54094, -65372, -54264, -25967, 216271, -205743, -19346, 169848, -213757, -186338]
18453a86338P0989B75055a11658d9763k07952j3409m2276i0386B85076h5642I8515
18441b99710g5086B86749A40011a79940Q2801j69921Q4232L4669A544d9997j29271
18430a79268b3182E7306P6701c3347r235B89617g6710A17511a28615k0352D8500
18418d5819H2946b09487B93423b72176J32292B15722h7442j95439g1652H7798
18407A56401O870A7357a838B208L02954G0094a31403M7036A56760C9811J69043
18396B08854c0507j60101N1804l93615d0234j7749k29891h79k15003j63932J8488
18385c61326d9863G8471B0550b25800n260B94809a07003A20248a42947b7762C1765
18373h6595r3082K0490M4066j24951f4245k42197A31857a6440o8634H662h0420
$$ y = [-186338, -115349, 275055, -111658, -49763, -257715, -271124, -313400, -90386, 285076, -85642, 98515, -299710, -75086, 286749, 140011, -179940, -97139, -267060, -182828, -148159, 1544, -49997, -179268, -23182, 57306, 134007, -33347, -42582, 289617, -76710, 117511, -128615, -148967, 48500, -45819, 82946, -209487, 293423, -272176, -139884, 215722, -87442, -282881, -71652, 87798, 156401, 163271, 17357, -1838, 2208, 305162, 70094, -131403, -84367, 156760, 39811, 208854, -30507, -190608, -138804, -532419, -40234, -57983, -287874, -879, -215882, -379814, -361326, -49863, 78471, 20550, -225800, -231060, 294809, -107003, 120248, -142947, -27762, 31765, -86595, -179677, -159187, -115121, -240072, -64245, -306442, 131857, -16440, -85074, 8662, -80420]
18361E0694K0621n48A5498a22336C95979c5469j06804j20998k13984A80646b37395
18349a07256B7531a309j30871A24616c98275a03437J5855l52701a27714A00882
18338G0660a9132E67823a11769C1469g1055q682l6979N1377P126A57091j1057
18327A46034b0996B80255a68628C44589a262k54530f8607p3462A5440a06548A44966
18315a12267l8294e5407B02317E7972b29184b1841k1271C0700c4239o8736E4823
18303d09205a42797C43587K4179B553b82137a09184c190A90750a24672e8686k17821
18292b76507F9212H949f7069C9298b39038A50625C9428b11417I1094C4250f0799
18280h4821j42591I7480B3288b21786H3045f9307C1304b57846h1499F6950b22467
$$ y = [50694, 71315, 70767, 15498, -122336, 395979, -35469, -142273, -263271, -477255, 180646, -237395, -107256, 27531, -1309, -132180, 124616, -398275, -103437, -87582, -440283, -127714, 100882, 70660, -19132, 567823, -111769, 31469, -71055, -79737, -116716, -65339, -58213, 157091, 146034, -20996, 280255, -168628, 344589, -1262, -255792, -68607, -142069, 15440, -106548, 144966, -112267, -150561, -55407, 202317, 57972, -229184, -21841, -43112, 30700, -34239, -102975, 54823, -409205, -142797, 343587, 367766, 2553, -282137, -109184, -3190, 190750, -124672, -58686, -276507, 69212, 8949, -67069, 39298, -239038, 150625, 39428, -211417, 91094, 34250, -60799, -84821, -227412, 97480, 23288, -221786, 83045, -69307, 31304, -257846, -81499, 66950, -222467]
18268d3574j53485B9557O4869i5522B17328i6689k8008B25897a45569N5113p0425
18257a60881O9677k3049A14464b35104A92438q7149J93551A22000c4435A64655
18246A8447b62919P2600h2407A86656J32063I0779K38513e67218G1750A7974N6260
18235G4234J8317d17711A39986a30610k168k41464b5951r0333b9622n3308L7342
18224d5588j05330j2513B6653a00110c4061n2745B9292L5167B5918k452b45544
18212A56606i6643k82383c0403E8369a59030q2347f676p1135G4434R1946P8473
18201B44853C4282b14289p0239G2246K3844b42512J14577F3752a84330j11006
18191b95336a35529b7301E804g8557K9557G509a90402A8565a4597A69558A010
$$ y = [-43574, -197059, 29557, 94426, -95522, 217328, -96689, -124697, 225897, -145569, -90456, -160881, -91204, -114253, 114464, -235104, 192438, 105289, 298840, 122000, -34435, 164655, 18447, -262919, -190319, -82407, 186656, 318719, 90779, 329292, -567218, 71750, 17974, 74234, 92551, -417711, 139986, -130610, -132778, -374242, -25951, -116284, -29622, -82930, -45588, -150918, -163431, 26653, -100110, -34061, -86806, 29292, 64459, 25918, 23466, -245544, 156606, -96643, -379026, -30403, 58369, -159030, -241377, -6676, -77811, 74434, 166380, 244853, 34282, -214289, -284528, 72246, 96090, -242512, -127935, 63752, -184330, -295336, -135529, -27301, 5804, -78557, -49000, 7509, -190402, 18565, -14597, 169558, 1010]
18179D5776h6932j64571A52420G5804b82120B7242J42763b30569d0879A67871
18168G3654R9925e021k70498q312a32751K7599C6589e4241k9540A49284C9890
18156i0450b7872C01207q9716r7811m5551A208a35004p792B29890o2754a4329
18144f7555l6215F8986O1234I169J1916N6849K13627G2395q208B7572A2815a23560
18131a68071j14832A753a13022l37877R8390O8916L2962K0594A0132b2076j50056
18120a72132N1415A19130d32929h2104m8979m5087P2538q2104k41451C1886i7034
18108A70935b02762A69771B5609j1883a19951I5933f4407F0278f7227j59457L8897
18097a87787A64275F517a95578Q8920D5041O6348O6616c4326A94876g2609q5025
$$ y = [45776, -86932, -251503, 152420, 75804, -282120, 27242, 170005, -230569, -40879, 167871, 73654, 173579, -5021, -275519, -283831, -132751, -105152, 36589, -54241, -83781, 149284, 39890, -90450, -27872, 301207, 211491, 113680, 68129, 1208, -135004, -142796, 229890, 167136, -14329, -67555, -103770, 68986, 130220, 9169, 21085, 77934, 291561, 72395, 64187, 27572, 12815, -123560, -168071, -282903, 1753, -113022, -450899, -352509, -283593, -250631, -230037, 10132, -22076, -172132, -120717, 119130, -432929, -82104, -131083, -176170, -103632, -185736, -427187, 31886, -97034, 170935, -202762, 169771, 25609, 13726, -119951, 95933, -64407, 60278, -67227, -226684, -187787, 164275, 6517, -195578, -106658, 45041, 111389, 178005, -34326, 194876, -72609, -157634]
18086a57634B47280N8436A3095Q7733e0672A38979C0886g8513o1545e2412A91464
18074A12442Q0062a81135A29035b0152A65498k7233J02325c10738J30955A09421
18063a52787k5203m4798M3016A38115I657a95362A48201i161j27374H0301B4169
18051d9325o3288A33029a23836o3805d6877A38220j6111h2438J3871A16288A9448
18039c24681J02529A67872a4900k36650K0688A73738R2308A07292a12811j46104
18029b58915R1639K8252b2536k71050C7624J24374e4434F1013q689b4501B00329
18017B71567b0263k7434H3740L2398d4979k03496J18419B47986j00056m2716c21017
18005a99308E9812M1193d616j60738J0479A5166J92271B3465L00L34508a03187
$$ y = [-157634, 247280, 305716, 13095, 100828, -50672, 138979, 30886, -78513, -140058, -52412, 191464, 112442, 192504, -181135, 129035, -20152, 165498, 138265, 240590, -310738, -179783, 109421, -152787, -177990, -222788, -179772, 138115, 9657, -195362, 148201, -9161, -136535, 80301, 24169, -49325, -112613, 133029, -123836, -187641, -46877, 138220, 122109, -82438, -68567, 116288, 19448, -324681, -222152, 167872, -14900, -251550, -230862, 173738, 266046, 107292, -112811, -258915, -167276, -139024, -22536, -293586, 37624, 161998, -54434, 61013, 52324, -24501, 200329, 271567, -20263, -47697, 83740, 116138, -44979, -248475, -130056, 247986, 147930, 105214, -321017, -199308, 59812, 101005, -4616, -165354, -154875, 15166, 207437, 23465, 23765, 358273, -103187]
17993E9412b3851A51036a39916r2224d8279A83723F7871b76231C99694a55607
17982A29799a53329B93338c52837a12556L0730j05774j23333e596l3093l0910
17972f9599C90719b371j83377q5815N5701I2304c18971H7362K65436D9865i9548
17960A33912a21636B21240b9006l27543B27167b79123a15340F8502a30153e5216
17949h7067F4496g6942a9102o7827A82856B8789a69976O4639C8970a7109r5488
17938a12597N5530O71m0288B32686A7136J69812a79955o325H767f1653B51514
17926a27206M0567P194H7155A3692a3416F9678A5250b57828A47456d99450A22801
17914E6557H761a04786r9609B02572f7570G1829a49087L92j29323A55278a84657
$$ y = [59412, -23851, 151036, -139916, -232140, -48279, 183723, 67871, -276231, 399694, -155607, 129799, -153329, 293338, -352837, -112556, -81826, -187600, -310933, -5596, -38689, -69599, 390719, -2371, -185748, -271563, -215862, 92304, -318971, 87362, 352798, 49865, -99548, 133912, -121636, 221240, -29006, -356549, 227167, -279123, -115340, 68502, -130153, -55216, -87067, 64496, -76942, -19102, -86929, 182856, 28789, -169976, -105337, 38970, -17109, -112597, -57067, -56396, -96684, 232686, 17136, 186948, -179955, -186280, 8767, -61653, 251514, -127206, -86639, -79445, 87155, 13692, -13416, 69678, 15250, -257828, 147456, -499450, 122801, 56557, 8761, -104786, -204395, 202572, -67570, 71829, -149087, -148695, -278018, 155278, -184657]
17902b0166J551K728j70598n876N1412j36086o5855a44525A47516B9544b8591
17890a22427e1057C10161c1011A04812b82972B00121c16926B51139F0480O9334
17880A29814R4484b01A30222b4421A74207a86658h6569a9141O921G9309J26382
17869B05691k6793b48876i0731j24357N869J3191D0920d055r5726L4814j52276
17858b17243A264N5215f5034J4315D5693O4728m8666b67708A08327a08263o280
17847a14543C22393b01438h0696K9949j24524h3166A03410f0424p6589m01226
17837e38239a87255R1269B83505c0252A19736k8909l4745a3066j59181B5861K16355
17826B42216b10820I4430c1268J5012C9978K71207G0316J2524K49619D4661J73909
$$ y = [-20166, -18615, -15887, -186485, -192361, -140949, -277035, -342890, -144525, 147516, 29544, -28591, -122427, -51057, 310161, -31011, 104812, -282972, 200121, -316926, 251139, 60480, 129814, 224298, -201, 130222, -24421, 174207, -186658, -86569, -19141, -12220, 79309, 205691, 178898, -248876, -90731, -215088, -209219, -196028, 40920, -4055, -99781, -64967, -217243, 1264, 56479, -65034, -50719, 45693, 110421, 61755, -267708, 108327, -108263, -114543, 322393, -201438, -80696, -50747, -175271, -83166, 103410, -60424, -137013, -538239, -187255, -95986, 283505, -30252, 119736, 90827, 56082, -13066, -172247, 25861, 242216, -210820, 94430, -31268, -16256, 39978, 311185, 70316, 82840, 332459, 44661, 218570]
17815B18570a98891L1006A15504P2199H3467L8773b7996A42570C5815R7101N6337
17804A89253b20068E4019a53847B5633c3170l4763C33396f9102F8770c80019A96648
17792B35383j02680A6221J28355a62166A4432e7482A56656a08535A67154D9604
17781a29442q4288k2316A55761R109b97538h6229A26682J25138q4310J69431j40836
17770A96105c82160C3153b19703A4093a94102i4890N783j42240h235I2285d9288
17758a82931A8062K23622c45918B23285j00418b31948F7114b71668J24823k43179
17748c90024C07442f9653A53033c6378p7616a953A24464a80140A50384K05199
17738C55583b45893h5240F7959d4844j2274o3436a9693l4479H5582L3406O5364
$$ y = [218570, -198891, -167885, 115504, 187703, 83467, 122240, -27996, 142570, 35815, 132916, 189253, -220068, 54019, -153847, 25633, -33170, -67933, 333396, -69102, 68770, -380019, 196648, 235383, 132703, 16221, 144576, -162166, 14432, -57482, 156656, -108535, 167154, 49604, -129442, -213730, -236046, 155761, 164870, -297538, -86229, 126682, 251820, 167510, 336941, 196105, -382160, 33153, -219703, 14093, -194102, -94890, -89107, -231347, -8235, 92285, -49288, -182931, 18062, 241684, -345918, 223285, 122867, -231948, 67114, -271668, -146845, -390024, 307442, -69653, 153033, -36378, -113994, -1953, 124464, -180140, 150384, 355583, -245893, -85240, 67959, -44844, -57118, -120554, -19693, -54172, 85582, 118988, 184352]
17727A84352B2054a34898p4356g5910A40754f8095B2271N8218M8313a35548j16598
17716b52146A08788h4294k01159A23279j5119n0391b50785k4960a18171H8713
17705a4815j08986B35259I2441q667K41436n6281f4554j5023B96052A7919J62705
17694A80624n9799a52118A81102D9472f7089J5557C0931M5804c2714F914a00394
17682b82195a05907C2909a9535G0259O631l191a23594r7266K391B4173L08793
17671C32966j23412a56867P0124k5870L3263C57674G9620K59935b46026i2276
17660C06720B6606O7120J6108h4901I0963Q8325a13558A02679a87123H7190J03441
17649A90631a13337l5753E2474j7843a26756b8990B46005f0857B28622j12334
$$ y = [184352, 22054, -134898, -209254, -75910, 140754, -68095, 22271, 80489, 128802, -135548, -252146, 108788, -84294, -285453, 123279, 108160, 57769, -250785, -275745, -118171, 88713, -14815, -123801, 235259, 92441, 83774, 325210, 268929, -64554, -79577, 296052, 17919, 180624, 120825, -152118, 181102, 49472, -67089, -51532, 30931, 76735, -32714, 6914, -100394, -282195, -105907, 32909, -19535, 70259, 76890, 73699, -123594, -220860, -218469, 24173, 332966, 209554, -156867, -86743, -112613, -79350, 357674, 79620, 339555, -246026, -92276, 306720, 26606, 93726, 109834, -84901, 90963, 179288, -113558, 102679, -187123, 87190, 190631, -113337, -149090, 52474, 34631, -126756, -28990, 246005, -60857, 228622, 116288]
17639A16288c50327b6452k0254B5725L83728a3716B70237N398a36253F1416a157
17627A87012K42287A11279c63232f5888l38043H9464c27069B56832d05n50285
17617e50690A56142o9035g1375C42207k2013B6105a25072k3167A6175L80971A7566
17605A14638E1470J9125b9j53660F5689R5739c31761J06812I2988b40719B41422
17593b96100R5707C0900G379L52290h3811n7238A31698a12902C14948a02087A64524
17581g4547c2429m9950A59159h0191R284B98629c3370G3121N6948l8322Q7883
17570A79630i2704B1727b4420B44667n5602a92081A7612R7488C7283Q6579c02391
17558a07618A64368a16111B22481b1408B85371A32755o1233A171P0841L3325d6175
$$ y = [116288, -350327, -26452, -46706, 25725, 409453, -13716, 270237, 275635, -136253, 61416, -1157, 187012, 429299, 111279, -363232, -65888, -403931, 89464, -327069, 256832, -405, -550690, 156142, 87107, -71375, 342207, 320194, 26105, -125072, -148239, 16175, 397146, 17566, 114638, 51470, 70595, -29, -153689, 65689, 161428, -331761, -224949, 92988, -240719, 241422, -296100, -200393, 30900, 7379, 359669, -83811, -141049, 131698, -112902, 314948, -102087, 164524, -74547, -32429, -82379, 159159, -80191, -70907, 298629, -33370, 73121, 130069, 91747, 179630, -92704, 21727, -24420, 244667, 189065, -192081, 17612, 115100, 37283, 123862, -302391, -107618, 164368, -116111, 222481, -21408, 285371, 132755, 71522, 1171, 72012, 105337, -46175]
17546h3978B34721J20056a06119A31476K5535o2130J91196j06203m9025A2236
17535E100K82321C6556b99572A9251J93018c60707A80512a32932A79933p8954
17525A00979a13087B54209J56837e4380a2684F8545G331L8641g2170o7021A02958
17513B68675E100K70251j17903P1447L293P9025C5094J4497h4369R341l4021I4265
17500G8911N9183l549a08313C02683i5701c0091C90288I5600R6639f5519C44022
17488b27506b4077E03123J6651A60950a06438L5818d978F3496g4633a4778j35135
17477a49913B7834A1378L24417j46789e7689j0093A30955C4921P4702J16410j07096
17466A18937k8528N7506A506d4347D55007B5499J9217J2008a53219E5011d4036
$$ y = [-83978, 234721, 354777, -106119, 131476, 157011, 94881, 286077, 179874, 130849, 12236, 5100, 287421, 36556, -299572, 19251, 212269, -360707, 180512, -132932, 179933, 100979, -113087, 254209, 411046, -54380, -12684, 68545, 7331, 45972, -72170, -139191, 102958, 268675, 5100, 275351, 157448, 228895, 232188, 311213, 35094, 49591, -84369, -75028, -109049, 94265, 78911, 138094, 134545, -108313, 302683, -95701, -30091, 390288, 95600, 192239, -65519, 344022, -227506, -24077, 503123, 519774, 160950, -106438, -70620, -4978, 63496, -74633, -14778, -149913, 27834, 11378, 335795, 189006, -57689, -67782, 130955, 34921, 109623, 226033, 118937, 90409, 147915, 1506, -44347, 455007, 25499, 44716, 56724, -153219, 55011, -44036]
17454c12827C41905H8203J92101j31890K69904j56133A13475c4936D16462j25738
17444B90724l7421q6024J99634N2608A40816K36893a22243B62006J75849A38755
17433B10891a2944B80661a2016B41233a35500A10833D908i3947A36275k5503i2664
17421b69193G3933L16940A60827J98090F7428J73427J44347A88235r302O204K28876
17410D14013E7897j4122f6060k3236A58437a30265B27579n6494m0916f9921D56481
17398A51565R3420f537D56178J2370j11738d9052b4050B09417M5458g82A30565
17386a53584F0609K63126A7919K89755b2602B15502o8031l9894L3148A6147N6766
17375G2913Q3390k3837g7373A41700K58194j15502o6612J33297I7759J16146b6571
$$ y = [-312827, 341905, 88203, 280304, 148414, 418318, 262185, 113475, -34936, 416462, 290724, 253303, 167279, 366913, 419521, 140816, 377709, -122243, 262006, 437855, 138755, 210891, -12944, 280661, -12016, 241233, -135500, 110833, 4908, -93947, 136275, 110772, -92664, -269193, 73933, 390873, 160827, 358917, 67428, 240855, 385202, 188235, 178933, 185137, 414013, 57897, 43775, -66060, -89296, 158437, -130265, 227579, 171085, 130169, -69921, 456481, 151565, 244985, -6537, 456178, 468548, 356810, -49052, -24050, 209417, 254875, -782, 130565, -153584, 60609, 323735, 17919, 307674, -22602, 215502, 147471, 107577, 140725, 16147, 72913, 156303, 132466, -77373, 141700, 399894, 284392, 217780, 351077, 97759, 213905, -26571]
17363e1152B20549b25817A45575h0299j38999d7820C47681H9177A2169K61903
17353B74072B3509e10307a3574B98056a8401A27667k0909J4836d0592H7767C3543
17341C90834j33248E8315b15067A19484J10313J34664j40706g2940C04917O0776
17331C65693A01580L4434k6254m4396J95279o9068b2463A91811o7314K3181a52725
17319B92032J32908j45235j13762K0664K75008F0038h4275B45936a27288A87518
17308A22713c4780B63884e6465A55706i4317j20117d5917n8450B16233p0931k2346
17297A22956g8456C33713j55605E8112L33514j44613G9931O0743n0684i6963B31789
17285b2566C80747j45120K9247H8158E193L1298J11199N8994G2334Q1197I609
$$ y = [-51152, 220549, -225817, 145575, -80299, -219298, -47820, 347681, 89177, 12169, 274072, 23509, -510307, -13574, 298056, -18401, 127667, 106758, 121594, -40592, 87767, 33543, 390834, 257586, 58315, -215067, 119484, 229797, 364461, 223755, -72940, 304917, 365693, 101580, 136014, 109760, 65364, 260643, 191575, -22463, 191811, 124497, 147678, -152725, 292032, 424940, 279705, 165943, 186607, 461615, 60038, -84275, 245936, -127288, 187518, 122713, -34780, 263884, -56465, 155706, -94317, -214434, -45917, -104367, 216233, 145302, 122956, -78456, 333713, 178108, 58112, 391626, 247013, 79931, 140674, 89990, -96963, 231789, -22566, 380747, 235627, 264874, 88158, 5193, 36491, 147690, 206684, 72334, 153531, 9609]
17273A98390a40364A58356P0232I336L4450L84541b7657D05306j97744G3600J9486
17262I3086b46971B50988A09307J03951M8162M6417J7866m381b34915A80955K46199
17251D27154H765J66331d7434B79982D0585J53639J20484o0980A7670a19714F2756
17239D88156a9367B01634D6530K49060J1389J47306j3740g090B58589P5793A36852
17227C61975j28203L247L1247b7286a2325A48319F546b38722A14640m8441J55414
17216B21613Q1759I5915J43191a01293K0189C95306A34380g1880C69333n643A54482
17204E5575K71680M3708p6116A34771J01172E1190K71168m9672l0431j12343J57867
17193B87779M1245A15796R7064K1909K73123B01829F126J38066B3074K67165A31192
$$ y = [198390, -140364, 158356, 228588, 9336, 43786, 428327, -27657, 405306, 207562, 73600, 93086, -246971, 250988, 109307, 213258, 261420, 307837, 325703, 321322, -234915, 180955, 427154, 8765, 175096, -47434, 279982, 40585, 194224, 314708, 253728, 17670, -119714, 62756, 488156, -19367, 201634, 46530, 295590, 306979, 454285, 440545, -7090, 258589, 334382, 136852, 361975, 233772, 237019, 268266, -27286, -12325, 148319, 6546, -238722, 114640, 66199, 221613, 303372, 95915, 239106, -101293, -81104, 395306, 134380, -71880, 369333, 363690, 154482, 55575, 327255, 370963, 294847, 134771, 235943, 51190, 322358, 272686, 242255, 129912, 287779, 329024, 115796, 212860, 234769, 507892, 201829, 6126, 144192, 23074, 290239, 131192]
17181B77167L447J98538a13849D47191j19636A53763J05918O9983j01802p7574
17171A50288J76413j28105J61449l6847R675j25868K60911A90768J75322l2780
17161C33310j12705C5336M03315l1277A16752M7559a52475F54018A48251P2686
17151B20937I2305P5873F0268K21908p5466J33983P7870K5795A44877b5524A99172
17139E09191j58166J51665k22414J0161A39330K51100A64833e7923G38669B86238
17128D38315A31961K69387K42023B98849K89920j38146j71052j02865K66124n5305
17118C87525R801J3325j59941I0713K80441j75522K49801j55190O8826J06584
17108D65653J10422A96324L00568n6977A54518L0820n9978K82644J26638A56236
$$ y = [277167, 280614, 479152, -113849, 447191, 327555, 153763, 259681, 329664, 227862, 150288, 326701, 198596, 360045, 323198, 332873, 207005, 467916, 190768, 366090, 333310, 220605, 35336, 438651, 407374, 116752, 164311, -152475, 654018, 148251, 220937, 92305, 168178, 60268, 282176, 206710, 340693, 418563, 444358, 144877, -25524, 199172, 509191, 351025, 502690, 280276, 290437, 139330, 390430, 164833, -57923, 738669, 286238, 438315, 131961, 401348, 643371, 298849, 588769, 450623, 279571, 176706, 442830, 387525, 397326, 410651, 250710, 90713, 371154, 195632, 445433, 290243, 359069, 465653, 576075, 196324, 496892, 439915, 154518, 185338, 125360, 408004, 534642, 156236]
17097E58945A87946J53068p6214K85088M1701o8346B37722k9566N7396R9875A33281
17085C42130J31228k00156p5771D1365N72674A77681J30514J20594M9840j70748
17075C07881J94153A82900K36743j16217J60941j32793K3512J39808j06640J40856
17065E29110q2078A10747M01462j39172n8978L19801M7561B91089L57598l471
17055F45216j05639B03943K92431B00850K01451P3136J27913j00829k04102M60068
17045G58487k88666j3303R3860p2275J97610j34467M13687m26909m9334p2135
17035D06555Q8327L811B12169K84139l4039L74160l61936q5021K09492Q9184A99904
17023B16074M42349l08093L41212l07812L43081l38231L11531M1622B23209J78431
$$ y = [558945, 187946, 341014, 264800, 549888, 591589, 523243, 237722, 208156, 265552, 365427, 133281, 342130, 473358, 273202, 197431, 41365, 614039, 177681, 308195, 428789, 478629, 307881, 502034, 182900, 419643, 303426, 464367, 331574, 355086, 494894, 388254, 529110, 447032, 110747, 512209, 373037, 314059, 633860, 681421, 291089, 648687, 645216, 539577, 203943, 496374, 200850, 402301, 475437, 603350, 502521, 298419, 758487, 469821, 456518, 550378, 478103, 675713, 541246, 954933, 528024, 478690, 406555, 494882, 498693, 212169, 496308, 462269, 836429, 474493, 389472, 598964, 688148, 199904, 216074, 658423, 350330, 691542, 383730, 726811, 388580, 700111, 741733, 223209, 401640]
17013D01640L08133l2270l13825K82285O5187j63879j19602J39711J81101l70496
17003C77985M02619L9889M3523o4619k59218J41837J05473M2796n5455k55476
16993E19354J80229k95281J76101K23056Q1212l20784j11054J88128J70371C12143
16982G26485M6027J04120k80316K55323D15477K86320J81980j13564j64254j60525
16972D45434L91791k61128j24880N36790k74041K92354q9690j03964Q0418k16237
16962F76847K60713k02493M7845r117k02818K69816K04867l88127K57349K12652
16952A127534m30208j13234L12475N50655o27021P5509R9201m6724j4031n4680
16942H79476P0175J68131J4338J92415L116l80695J23357r6346J6587K48033q3130
$$ y = [401640, 709773, 677503, 363678, 645963, 711150, 547271, 427669, 567380, 748481, 377985, 780604, 820493, 864016, 799397, 540179, 682016, 787489, 830285, 774830, 519354, 699583, 404302, 580403, 803459, 884671, 563887, 452833, 640961, 811332, 312143, 726485, 772512, 876632, 596316, 851639, 415477, 701797, 883777, 770213, 605959, 445434, 837225, 576097, 451217, 988007, 713966, 1006320, 916630, 812666, 893084, 676847, 937560, 735067, 782912, 773795, 570977, 840793, 1045660, 657533, 914882, 1127534, 697326, 584092, 896567, 1447222, 820201, 895710, 994911, 948187, 934156, 879476, 949651, 1117782, 1132120, 1324535, 1327651, 946956, 1070313, 973967, 990554, 1238587, 1155457]
16931A155457J62764m30099J77541J81000O7625k83154L9118J68180r1002K30943
16921A378373p2725K49853j10689m15549R5504o134J15722j23129L51939n5281
16911A407884k16514M34972l62654J46698k26056p288o6949M44646j81817k01193
16901A171729M00621k40916K46024N8483R7280j70868p143L65574j93465Q1710
16891A809029k82651Q1089K49275n0228j18035L3237J8664J36289k68931K89185
16881A896923o7981K74869j59558P0574Q1749l06258N35967l12581M20741l39338
16871B095107k33581P8443L13038k24002K44965k01975J67790M4640p9821J47328
16861B351932J17670k64250r6373K54776L44833k2103k74929K62343J24022l18960
$$ y = [1155457, 1318221, 888122, 1065663, 1246663, 1314288, 1031134, 1070252, 1238432, 1147430, 1378373, 1305648, 1555501, 1444812, 1029263, 1124767, 1118633, 1234355, 1111226, 1463165, 1407884, 1191370, 1626342, 1263688, 1410386, 1184330, 1177042, 1110093, 1554739, 1372922, 1171729, 1572350, 1331434, 1577458, 1635941, 1733221, 1562353, 1555210, 1920784, 1727319, 1809029, 1526378, 1607467, 1856742, 1806514, 1688479, 1721716, 1740380, 1876669, 1607738, 1896923, 1828942, 2103811, 1944253, 2014827, 2096576, 1790318, 2326285, 2013704, 2434445, 2095107, 1861526, 1939969, 2253007, 2029005, 2273970, 2071995, 2239785, 2284425, 2204604, 2351932, 2469602, 2205352, 2108979, 2363755, 2708588, 2686485, 2411556, 2673899, 2797921, 2478961]
16851B478961O01464n32686L87635j96294l508k3814O5904J68816j11736L49432
16841C184174M5362m89798N06121J79229k58214J47958M09101k67127k21599K10986
16831C446193L66426p2179K09383J51406j73980L8738P866J62221Q0275L60715
16821D577064O7956J3184L1161K52653j65626J34022Q1174K62125J40246J49162
16811E543121j34840M38066k11089K73254K96274k75559J65190K72763K06159
16802F573339l18431O49955J29973l33104P40179k70589N23539L6535J23874M86584
16792H341854m52777R22568m44036P42045j09274M23205J98626L40968N21728
16783A0484907K85913K76216J52798M18984K98449M97227J93415K97353K10726
$$ y = [2478961, 3080425, 2547739, 2935374, 2739080, 2735572, 2711758, 2777662, 2946478, 2834742, 3184174, 3229536, 2739738, 3245859, 3425088, 3166874, 3314832, 3723933, 3456806, 3235207, 3446193, 3812619, 3740440, 3949823, 4101229, 3927249, 3965987, 3973853, 4136074, 4216349, 4577064, 4645020, 4658204, 4689365, 4942018, 4776392, 4910414, 4991588, 5253713, 5393959, 5543121, 5408281, 5846347, 5635258, 5908512, 6204786, 5929227, 6094417, 6367180, 6573339, 6254908, 6904863, 7034836, 6701732, 7441911, 7171322, 7694861, 7731396, 7855270, 8341854, 7889077, 8811645, 8367609, 9109654, 9000380, 9423585, 9622211, 9963179, 10484907, 10770820, 11047036, 11199834, 11618818, 11917267, 12414494, 12607909, 12905262, 13115988]
16774A3115988P43723O37374j56471Q12456Q37336K62946N23263L02447R02500
16765A7981562P52029M02892J204941P07404Q28923P62617J013060J379646M88204
16756B5521278J170785J141519J483952J035298J589133J453830J728084J553086
16748C6676965K111238J687940K350092K660611J939996K652901K850938L225739
16740E6156420L346141L660404L550506M170158M405136M756333N197767N556380
16732I0799245N760830O567570O263369O880031P392596P776213P928527P625889
16724A46994270Q108529P534596P234561O843967N552092N037315L322983K180188
16716A92808501Q07060p68603k252228l752796n181148n967826o724239p468797
$$ y = [13115988, 13859711, 14497085, 14340614, 15153070, 15990406, 16253352, 16776615, 17079062, 17981562, 18733591, 19136483, 20341424, 21048828, 21877751, 22640368, 23653428, 25033074, 25521278, 26692063, 27833582, 29317534, 30352832, 31941965, 33395795, 35123879, 36676965, 38788203, 40476143, 42826235, 45486846, 47426842, 50079743, 52930681, 56156420, 59502561, 63162965, 66713471, 70883629, 75288765, 80045098, 85242865, 90799245, 96560075, 103127645, 109391014, 116271045, 123663641, 131439854, 139368381, 146994270, 155102799, 162637395, 169871956, 176715923, 182268015, 187305330, 190628313, 192808501, 193615561, 192846958, 190594730, 186841934, 181660786, 175692960, 168968721, 161499924]
16708A61499924p784572p784593q066310q233786p750498p512512o911973o527535
16700A00928145o893845n574157n429412n346228m923464m131384m148085m196060
16692F0285510l438650l220752l141817k492273k826285k402977j951185k389481
16684C8422090k027342j724298j571351j797144j513595j141706j402571j273607
16676B5970476r79180j503102q01823j114599n32634j210879n31722r25913n97503
16667A7773121m06574q04626j185713k12441p22977l60922k45417l39608n83167
16658A2911676o13746l08678j11698q21551m7576o47931o6978m35859m42349j87528
16648I227782J46971n12217m03399j72300k78552m34518M1215k42990j35328l94479
$$ y = [161499924, 153715352, 145930759, 137864449, 129630663, 121880165, 114367653, 107455680, 100928145, 94034300, 88460143, 83030731, 77684503, 72761039, 68629655, 64481570, 60285510, 56846860, 53626108, 50484291, 47992018, 45165733, 42762756, 40811571, 38422090, 36394748, 34670450, 33099099, 31301955, 29788360, 28646654, 27244083, 25970476, 24991296, 23488194, 22686371, 21571772, 21039138, 19828259, 19296537, 18370624, 17773121, 17366547, 16561921, 15376208, 15163767, 14440790, 14079868, 13834451, 13494843, 12911676, 12297930, 11989252, 11877554, 11056003, 11008427, 10360496, 10293518, 9857659, 9415310, 9227782, 9374753, 8862536, 8459137, 8286837, 8008285, 7573767, 7614982, 7371992, 7236664, 6842185]
16638F842185r7204l5017k55228o7955m25756q1372k61786J70778l10542J64962
16628E643065j72754l56936r5466r2794J42171k81638l08153k9045j7118o1187
16618D370145K5729j53481o5458j75965j37961j9157j80461j08575J76634j78017
16608C553433j4669j88218n3550q515j61624K86634n54886M67897k30812l72862
16598B722828J10897P5070K73442k41246K13m73172K76228o9137J37764o17115
16588B195772J88814L50067l92507K76393o56204l4155L39387r1447L04945l36902
16578B144163j41071P3975J41730K1222k65787j15044J44028n41064N72859m53208
16568A581803L75240n5161k68901M1606K57590l54025l25481M41046k57363N9698
$$ y = [6842185, 6744981, 6709964, 6454736, 6386781, 5961025, 5879653, 5617867, 5788645, 5478103, 5643065, 5470311, 5113375, 5017909, 4925115, 5067286, 4785648, 4477495, 4448450, 4431332, 4370145, 4395874, 4242393, 4176935, 4000970, 3863009, 3843852, 3663391, 3554816, 3731450, 3553433, 3538764, 3350546, 3296996, 3288481, 3126857, 3413491, 2858605, 3326502, 3095690, 2722828, 2833725, 2908795, 3182237, 2940991, 2941204, 2468032, 2744260, 2675123, 2812887, 2195772, 2384586, 2734653, 2342146, 2618539, 1962335, 1928180, 2267567, 2176120, 2481065, 2144163, 2003092, 2077067, 2218797, 2240019, 1974232, 1859188, 2003216, 1462152, 2035011, 1581803, 1957043, 1901882, 1632981, 1674587, 1932177, 1578152, 1252671, 1693717, 1436354, 1496052]
16558A496052J38993j63053j48859j62365L37990N4718k68891N05604l90676K40267
16548A639780k73553l6342l3029J49765o90199L68810N7625K37731q0786Q9327
16538A429129n06198L73484J19205l65801p7206J07761M49863k28619q9609m4730
16528A167279k95948j3915L26685l48564L2512j2199K41402j45943j24975K70592
16518A096926j01321p5111m5572J78359j03307j25501K2287M7836l22354L08973
16508H81215n4354o2121l3922J02677J0469k9901L29718j86774L78515F11903
16497G63519j23830P0091j32426L63977L5443L2208k89654j75326J40405o6733
16487F17674K16449k62525J26730k71251L57062k3942n6055k14332P5362j22130
$$ y = [1496052, 1635045, 1471992, 1323133, 1160768, 1498758, 1553476, 1284585, 1790189, 1399513, 1639780, 1366227, 1329885, 1296856, 1446621, 756422, 1125232, 1182857, 1420588, 1339802, 1429129, 922931, 1296415, 1415620, 1049819, 972613, 1080374, 1530237, 1301618, 1212009, 1167279, 871331, 857416, 1184101, 835537, 868049, 855850, 1097252, 951309, 826334, 1096926, 995605, 920494, 874922, 1053281, 949974, 824473, 846760, 894596, 572242, 881215, 826861, 764740, 730818, 833495, 843964, 814063, 1143781, 957007, 1335522, 611903, 763519, 639689, 709780, 577354, 941331, 976774, 1008982, 719328, 544002, 684407, 617674, 834123, 571598, 698328, 427077, 784139, 760197, 704142, 489810, 565172, 443042]
16477D43042R458K22631j13078k6487B66536K68706J59103k96716K89319q10J73750
16466H59888j34744k85929J7837l9386L59617j08302m9972j69824j99964M8903
16456B98124K81526A10353M53461P646j83159l162r0958L52924r4582J08411r3286
16445E67648B35554J62343K23156k06749k3972J07319K1953B41394J2287q0262
16435A73419J33465p3646J58769K15605N6038k35754H6353L64796p0594L0707
16425D11262J23749k57054K21421B47985f6760B31251k4248P6039H2160N79143
16415F61303k03613A63689N25954G2973J35366L02096A08986d7235B96424j16273
16405A80151k7242J58291A42109R8018L3186I5482L58333j56729h4842A30703
$$ y = [443042, 452500, 675131, 562053, 535566, 266536, 535242, 694345, 397629, 686948, 686138, 859888, 725144, 439215, 457052, 417666, 777283, 668981, 619009, 449185, 249221, 298124, 579650, 110353, 563814, 571460, 388301, 385139, 294181, 647105, 552523, 660934, 567648, 235554, 397897, 621053, 414304, 390332, 497651, 519604, 241394, 253681, 173419, 306884, 233238, 392007, 607612, 663650, 427896, 86353, 451149, 380555, 411262, 535011, 277957, 499378, 247985, -66760, 231251, 207003, 283042, 82160, 661303, 457690, 163689, 689643, 72973, 208339, 510435, 108986, -47235, 296424, 180151, 152909, 311200, 142109, 240127, 273313, 95482, 453815, 297086, -84842, 130703]
16394B11661K08374R2610o6949A47314J44833J08328A78487C7511J80724j1615
16384B06620r936A0342J68727R9949P4776A60578Q8018a69E00186j31450A58036
16372C88500j08479D3685J16121m6822J96279J28739j0477q5115H2342J00962
16362A83304E1697k1131M41709k08650A12293D7810J64793L23202j55101j54673
16352B26031F0999J3169L6810O3517a19764C02290b3143A54609L47448B21430
16341A93002M8802K77051A59298N7684P3784A26303m7312c1586B79599q4379K72054
16330D67274a26109A4022J9492K34759C8074M17671j10922D828Q0641R2739J31560
16319C09768C7006M4908K49690A05909L61809A32358d1207H3070K20964a20094
$$ y = [211661, 420035, 512645, 445696, 147314, 292147, 400475, 178487, 37511, 218235, 206620, 196684, 10342, 179069, 279018, 353794, 160578, 248596, -169, 500186, 368736, 158036, 388500, 280021, 43685, 159806, 112984, 309263, 438002, 427525, 342410, 82342, 183304, 51697, 30566, 472275, 263625, 112293, 47810, 212603, 535805, 380704, 226031, 60999, 74168, 110978, 174495, -119764, 302290, -23143, 154609, 502057, 221430, 193002, 241804, 518855, 159298, 216982, 290766, 126303, 78991, -31586, 279599, 195220, 467274, -126109, 14022, 33514, 268273, 38074, 455745, 344823, 4828, 85469, 178208, 309768, 37006, 81914, 331604, 105909, 467718, 132358, -41207, 83070, 304034, -120094]
16308H6112L28451A76005a55656B925L3470J09935e9547A77901m0207b5907G03
16296A04839i0840A24048a03370C01949j31661M48942B24124b43612B6052K11057
16286B37109b33614B25104A786P266P2991L7378c8658B44691G7169l8390J57165
16275A95944J0229o0531J49037A02786K3431n2375a63140d5369D48932F5205L24545
16264C89750A71496i199G9907K2851C8298Q5851B2151h3289B08538a9140B4623
16252a6920j61716B38826k3065B0243K06219a4017j59781A56594P946q218K46658
16241D02980G1091J55465b36305B27234m3596f0151J1538A25046L9712a89725
16230A25241E0556c3702j12500e7776H523a0944I7434K719k7458J84788a54F7567
$$ y = [86112, 414563, 176005, -155656, 2925, 36395, 146330, -59547, 177901, 137694, -25907, 703, 104839, -90840, 124048, -103370, 301949, 170288, 619230, 224124, -243612, 26052, 237109, -233614, 225104, 1786, 9052, 82043, 119421, -38658, 244691, 77169, 38779, 195944, 206173, 145642, 294679, 102786, 126217, 73842, -163140, -45369, 448932, 65205, 389750, 171496, -9199, 79907, 102758, 38298, 124149, 22151, -83289, 208538, -19140, 24623, -16920, -178636, 238826, 215761, 20243, 226462, -14017, -173798, 156594, 164540, 156322, 402980, 71091, 226556, -236305, 227234, 183638, -60151, -48613, 125046, 164758, -189725, 125241, 50556, -33702, -146202, -57776, 8523, -10944, 97434, 100153, 72695, 257483, -154, 67567]
16217d2674j4188m3423j45624C4115f6127G0683a69018C1788J78733A2622K11416
16206B24038m9941J22256A23107c6943l17920E2226K4387K6684m0144K28413c24776
16194C2383K6134a31978A1186b37888c8223A12379o019j0102L4093i3787j12780
16183b06567b4589H2565P9225h0879P724l27568A65954p6641e9750j90559J17144
16172a33165B40637M3386i1643A38962a6112A61066B380K608J56049d4329r3475
16161a37804B6565J64761d02364A4211d7575D7181f4470l8935m9559J3320A55864
16149g0769n1407A18476O5642F1602c63957A39976E3615J23594a47957D16069
16138b6740B97702B3447a41313j15072c7900A31613a7359k0857B62308F3613k0911
$$ y = [-42674, -56862, -100285, -245909, 34115, -66127, 70683, -169018, 31788, 210521, 12622, 224038, 174097, 296353, 123107, -36943, -354863, 52226, 76613, 103297, 63153, 291566, -324776, 32383, 58517, -131978, 11186, -237888, -38223, 112379, 106360, 96258, 130351, -93787, -206567, -24589, 82565, 161790, -80879, -73155, -400723, 165954, 89313, -59750, -250309, -133165, 240637, 284023, -91643, 138962, -16112, 161066, 2380, 4988, 161037, -44329, -137804, 26565, 191326, -402364, 14211, -47575, 47181, -64470, -103405, -152964, -139644, 155864, -70769, -122176, 118476, 184118, 61602, -363957, 139976, 53615, 177209, -147957, 416069, -26740, 297702, 23447, -141313, -256385, -37900, 131613, -17359, -38216, 262308, 63613, 42702]
16127D2702c45739c5295B87906A16656a63645B63286r7825b84188e2636C63723
16116f895B3507L563J56325a45420H1638R1622D6748K20187h5802A65034c80693
16104A70331a44772A01427J90651A40481K3576g4807g42B20218e1187D0229a66788
16092a08560j76579O6715o3812N0019o3844J14534e7447k9310A46182E9383c26267
16080A32670a39946O4156B62557F3778h8223b504I3130a09134F5592d1958j0366
16069e2324k3921n5373H0769b15225e439j67918j66235D2322N8203b03118d1713
16057b80205I5695J02080O3088e4499j22252A57467a65856A80489c33I92d8091
16045B99347c5233A73489b73914A13949K28314J07130a62861j84674g8704D1842
$$ y = [42702, -345739, -35295, 287906, 116656, -163645, 263286, 165461, -284188, -52636, 363723, -6895, 23507, 27070, 183395, -145420, 81638, 173260, 46748, 266935, -85802, 165034, -380693, 170331, -144772, 101427, 292078, 140481, 164057, -74807, -742, 220218, -51187, 40229, -166788, -108560, -285139, -218424, -282236, -232217, -296061, -181527, -57447, -86757, 146182, 59383, -326267, 132670, -139946, -75790, 262557, 63778, -88223, -2504, 93130, -109134, 65592, -41958, -52324, -76245, -131618, 80769, -215225, -5439, -173357, -339592, 42322, 100525, -203118, -41713, -280205, 95695, 197775, 260863, -54499, -176751, 157467, -165856, 180489, -333, 992, -48091, 299347, -35233, 173489, -273914, 113949, 342263, 449393, -162861, -347535, -78704, 41842]
16034B71401o6150B5375K74894D4013b8744A75767b36503a04428n3327N5733k03502
16023c05524E1484O8852a97579l0049B36620a09017k45520i0404A76397B0085
16012a5610k05428a04261r6225k9735A07072d1677o356j71287A68570b4460E3608
16000a65781a0775j66909F9260a71653C8346b77454p0044a35769B86129A34102
15989i2352A16645K31411B0493d63449A53028Q8031g7968B61429K02494A62126
15978B04338N947g6872C8618j1604N1202J01898G4977K11624A15907J6983o779
15967A26111J86138k0023a67357B45592d9783j79132i7769j3826d8543A14877
15956a21602E7055e3913J5927B00257i441k1794J1108C74769a13643K6181p4258
$$ y = [271401, 205251, 25375, 300269, 44013, -28744, 175767, -236503, -104428, -157755, -102022, -305524, 51484, 120336, -197579, -227628, 236620, -109017, -354537, -90404, 176397, 20085, -15610, -221038, -104261, -200486, -230221, 107072, -41677, -48033, -219320, 168570, -24460, 53608, -165781, -10775, -177684, 69260, -171653, 38346, -277454, -347498, -135769, 286129, 134102, -92352, 116645, 348056, 20493, -463449, 153028, 241059, -77968, 261429, 463923, 162126, 204338, 210285, -76872, 38618, 27014, 78216, 180114, 74977, 286601, 115907, 132890, 126111, 312249, 292226, -167357, 245592, -49783, -228915, -97769, -111595, -48543, 114877, -121602, 57055, -53913, -37986, 200257, -9441, -31235, -20127, 374769, -113643, -87462, -161720]
15945a61720P5596C4639d13080a71051L4660l4248A79262b67070A0418a41887
15934c76804J71336F4459a32358J0315I5968K1676b15499E8538b45183E1161a9124
15922B83b52919K9772j59074a76841A20800a01036L6890B64637a87494b7221k13048
15911b40269A7070c7044p3664M9991A17380M1093n2883l7109e7686r825k65306
15900c32817e8186o8613L4886L6371K1117A61738J54675a3170B7404b06763j4365
15889b21128a06831k76867A17219J17181p5056b36799d49q9303J5650A2316P9959
15878I2275c06548I4131k6897J24970b884k94543A0676b15605R3731N0225A58733
15866g6053j84036L0314D5238J01405D3942a54758N1040q9854b2798j68124O8690
$$ y = [-161720, -86124, 34639, -413080, -171051, -136391, -170639, 179262, -267070, 10418, -141887, -376804, -205468, 64459, -132358, -122043, 95968, 117644, -215499, 58538, -245183, 51161, -19124, 283, -252919, -223147, -382221, -176841, 120800, -101036, -64146, 264637, -187494, -27221, -240269, 17070, -37044, -110708, -60717, 117380, 158473, 105590, 68481, -57686, -67511, -332817, -58186, -126799, -91913, -55542, -34425, 161738, 316413, -13170, 27404, -206763, -221128, -106831, -383698, 117219, 234400, 159344, -236799, -449, -89752, -74102, 12316, 92275, -306548, 94131, 67234, 192204, -2884, -297427, 10676, -215605, -121874, -71649, 158733, -76053, -260089, -229775, 45238, 146643, 43942, -154758, -103718, -193572, -22798, -190922, -122232]
15855a22232F4794b8558B40003r1129K9345a2793p2661m613C75540d88529a02347
15843F6235M0125c31278J52514g0574B23429G2692k1683b1596A98328I3137a31608
15831G7227a20401G5228J08278B4141J67798f8602j34781B43982a01404d6154
15820a44103N4768B1638a34182A08120b07712k3019A05359a3798B47557n0219
15810A97338D6756P7028a28698H9150H618Q4588e55638H1339a85999C48600j52166
15799A96434a47753k27490b2316o6670N855A14519m2182J11328e5571F2347A0854
15787g4632B7865f6167j75255f5116j3199A89182q1893j4095K6066b15704h9022
15775e6144A74580b37887L5003B25574K7670g3774n0280H6783c4784j54436M0037
$$ y = [-122232, 64794, -28558, 240003, 148874, 178219, -12793, -85454, -90067, 375540, -488529, -102347, 66235, 106360, -331278, -178764, -70574, 223429, 72692, 51009, -21596, 198328, 93137, -131608, 77227, -120401, 75228, 183506, 24141, 191939, -68602, -203383, 243982, -101404, -46154, -144103, -89335, 21638, -134182, 108120, -207712, -230731, 105359, -13798, 247557, 197338, 46756, 123784, -128698, 89150, 8618, 93206, -555638, 81339, -185999, 348600, 196434, -147753, -375243, -22316, -88986, -83131, 114519, 72337, 183665, -55571, 62347, 10854, -74632, 27865, -66167, -241422, -65116, -78315, 189182, 107289, 93194, 119260, -215704, -89022, -56144, 174580, -237887, -202884, 225574, 253244, -73774, -124054, 86783, -34784, -189220, -149183]
15764a49183j48260A56359B3399b60025e574j11881P633E9074N4045d1046F3642
15752A21612a06414j7098A17470a51088p4157B19763B4143K61656c8957j7418
15742e6375B13232f4874j1394k36340B2068g2548H8128O4735l1688a52065C81478
15730A40064a16538I2468A148K83616e1333F6778B5653e7211k77497J14332D8902
15718A33434a61938g6197i95k04577i0807k19469C49659b68032B66004d4862q0706
15707a25568H1189a20727k7942D0478b7352l4946C8633a02365j25136n9994B84673
15695b50363D97976c02752M768G0519P1069a51729A78527b1303G8695b56047D2871
15683A83195B3759E457a30747b1763C8728H264J39963D1891e6437K6519H0747
$$ y = [-149183, -297443, 156359, 23399, -260025, -5574, -117455, -109822, 59074, 113119, -41046, 63642, 121612, -106414, -123512, 117470, -151088, -225245, 219763, 24143, 285799, -38957, -56375, 213232, -64874, -76268, -312608, 22068, -72548, 88128, 152863, 121175, -152065, 381478, 140064, -116538, 92468, 1148, 284764, -51333, 66778, 25653, -57211, -334708, -220376, 48902, 133434, -161938, -76197, -995, -205572, -90807, -310276, 349659, -268032, 266004, -44862, -125568, 81189, -120727, -148669, 40478, -27352, -62298, 38633, -102365, -227501, -287495, 284673, -250363, 497976, -302752, -297984, 70519, 141588, -151729, 178527, -21303, 78695, -256047, 42871, 183195, 23759, 5457, -130747, -21763, 38728, 8264, 148227, 41891, -56437, -29918, 80747]
15671a73267A60784E9115a04827A08602e1816j19570d3133A98769J7365a08880
15660A28520C1008a08864H6733b3343I8780m7010a9362E6230c9934H9453m3503
15649D5950c77235a56316j48474a49146b123A6016a90036i4274k62795g2444p7422
15638a49866I7432K1701g6775D95534a51463J0615D7957e5866D4417K71359a53193
15626F5517h6566j40974b0625b663k75743a00750B22214k5309J46564F9026R9709
15615A68735d1421G0182a11384j56055C37094c37048B35126b98526J17814j14727
15605b95439C21995a53492A01087b08065m1740R6071O0993l94074e9397a4102
15594h1279B4312b66268A12391m4863a59648A37211a04830A72114d702j09006
$$ y = [-173267, 160784, 59115, -104827, 108602, -51816, -171386, -43133, 198769, 216134, -108880, 128520, 31008, -108864, 86733, -23343, 98780, 51770, -19362, 56230, -39934, 89453, 45950, -377235, -156316, -304790, -149146, -2123, 16016, -190036, -94274, -357069, -72444, -149866, 97432, 119133, -76775, 495534, -151463, -140848, 47957, -55866, 44417, 315776, -153193, 65517, -86566, -227540, -20625, -2663, -278406, -100750, 222214, 196905, 343469, 69026, 168735, -41421, 70182, -111384, -267439, 337094, -337048, 235126, -298526, -180712, -295439, 321995, -153492, 101087, -208065, -249805, -153734, -92741, -486815, -59397, -14102, -81279, 24312, -266268, 112391, 67528, -159648, 137211, -104830, 172114, -4702, -113708]
15584a13708j31744G1699k9384L07226a40756k68164e441j88159b2834A92244
15573B82692C8879a4246m9287k29606N4193i3273A71253c40476E20844F7544a73758
15561a93698d5752B8430b3829H4586C800e2820B1058a35348A81415o7400h8666
15549B01479b59670a21144A45465f1500B06047G3512c5893k10026j06290a44490
15538A5868J62715A7960a51017d0672H6822M8455b50566K6071j4220A83067K6286
15527B09353a24036B2839c6714j88561D0505j1386a13202d5926j8408A5929J32481
15516A48410b52206h7329g786B60756b33325g9630A25024J8125f9053A08382b34460
15504A04447a63152L4358o6686j2384C8676a79268A7347m313f4333o095m5448
$$ y = [-113708, -245452, 71699, 42315, 349541, -140756, -408920, -5441, -193600, -22834, 192244, 282692, 38879, -14246, -63533, -293139, -238946, -93273, 171253, -340476, 520844, 67544, -173758, -193698, -45752, 28430, -23829, 84586, 3800, -52820, 21058, -135348, 181415, 114015, -88666, 201479, -259670, -121144, 145465, -61500, 206047, 73512, -35893, -245919, -352209, -144490, 15868, 178583, 17960, -151017, -40672, 86822, 135277, -250566, -224495, -238715, 183067, 209353, -124036, 22839, -36714, -225275, 40505, 29119, -113202, -45926, -64334, 15929, 148410, -252206, -87329, -7786, 260756, -233325, -79630, 125024, 143149, -69053, 108382, -234460, 104447, -163152, -128794, -195480, -207864, 38676, -179268, 17347, 13034, -64333, -70428, -115876]
15493a15876G2329G73J39707a5921c839q0180j62626h3030q349J1184j16723b9990
15480D3977J31265a52988n088L1098b6708A09383a07739p3955g7537o6120O204
15469a37453C883c14652A87431a3107e437k55911d125r5202A9722M560b17211
15457B49825a32422A79389b72026A30754N6653E872h8715l6546m4239e3068A31211
15445A28304B2234i8691G7842j1222a25777l97362B09578a13757j52072a09681
15434i91F6776b90766O5342k24155C48303b39764a08300A01773a56674f9010c3817
15422B17342a70866A1202b12986e5173F3321d0831I9525f2180j61111q1186H1665
15410c652C8395a33725b6132p4809l49334g5284k3309E9635R4174a12907j44337
$$ y = [-115876, 72329, 773, 140480, -15921, -3839, -84019, -246645, -83030, -91379, -80195, -196918, -29990, 43977, 175242, -152988, -158076, -126978, -26708, 109383, -107739, -181694, -77537, -143657, -137453, 3883, -314652, 187431, -13107, -5437, -261348, -4125, -99327, 19722, 24282, -217211, 249825, -132422, 179389, -272026, 130754, 187407, 5872, -88715, -125261, -169500, -53068, 131211, 128304, 22234, -98691, 77842, 66620, -125777, -523139, 209578, -113757, -265829, -109681, -991, 66776, -290766, -225424, -449579, 348303, -239764, -108300, 101773, -156674, -69010, -33817, 217342, -170866, 11202, -212986, -55173, 63321, -40831, 99525, -62180, -223291, -304477, 81665, -3652, 38395, -133725, -26132, -100941, -450275, -75284, -98593, 59635, 153809, -112907, -257244]
15399b57244D80928a56861A91243H7828Q0888c5095j96357q4832e3109F590J93033
15388A99623B2847e4752C21900F7196K21095b17097c5034E3217Q8627f0675D05860
15376H4647R7904o3270b67485b3138A32072a55010j23931d2040j20569g7936l0260
15365a08196L8176B6306a39375M9583L0885j77034A49851N154Q8342c2626a5689
15353A37435A1090a10218q2190C27505o5922n8283C9653K59023d7110A13070J86426
15342B99496b05077A38055J00464G166J78023a98748o9225A75869a91915d1969
15331c86459A14024b21199D44151a32062d3242B00413p3206g8650B07776q0628
15321A27148K33020A41785a29336b265B02413j8230f1781n6706A40722d09403
$$ y = [-257244, 480928, -156861, 191243, 87828, 168716, -35095, -231452, -316284, -53109, 6590, 199623, 22847, -54752, 321900, 67196, 288291, -217097, -35034, 53217, 141844, -60675, 405860, 84647, 182551, 119281, -267485, -23138, 132072, -155010, -278941, -42040, -162609, -77936, -108196, -70020, 26306, -139375, -89792, -58907, -235941, 149851, 155005, 243347, -32626, -15689, 137435, 11090, -110218, -192408, 327505, 261583, 203300, 39653, 298676, -47110, 113070, 299496, -205077, 138055, 238519, 7166, 185189, -198748, -267973, 175869, -191915, -41969, -386459, 114024, -221199, 444151, -132062, -43242, 200413, 127207, -78650, 207776, 127148, 360168, 141785, -129336, -2265, 202413, 184183, -61781, -118487, 140722, -409403]
15310F8944K9419K01744a66823G9387c0926B43739l6751a66203C8974m195K84814
15299C19593G935J71888N2016F8401e0412A17057P8172a83703M6859O3759C2903
15287B34000b98043D0724e1165k73430J46697b8141l08112F9928K52309j34394
15277A87843q6698d855A75369b46490A65416E9667I052b44727N6400A14768p200
15266A07568D5635P1905f2308C16212d34866c4991q6805P749B17826M3027m2456
15255B18397H0704J17560j5090L02303A89343J89125J88287Q34653P9917k38335
15245A242990R8036k29423B60358A04653P6472E3979J56453n730g7167q599r7880
15234a83646A43495m4584a21419D868R6014K6293b49532a03475A37537d2185H4108
$$ y = [68944, 98363, 300107, -166823, 79387, -30926, 243739, 206988, -166203, 38974, 34779, 319593, 7935, 179823, 231839, 68401, -50412, 117057, 195229, -183703, -136844, -73085, 32903, 234000, -298043, 40724, -51165, -324595, -177898, -28141, -336253, 69928, 322237, 187843, 101145, -4855, 175369, -246490, 165416, 59667, 9052, -244727, -188327, 114768, 107568, 45635, 117540, -62308, 316212, -434866, -34991, -121796, -114047, 217826, 260853, 218397, 80704, 198264, 183174, 485477, 189343, 378468, 566755, 1401408, 1481325, 1242990, 1341026, 1111603, 260358, 104653, 181125, 53979, 210432, 204702, -77167, -85766, -183646, 143495, 98911, -121419, 4868, 100882, 127175, -249532, -103475, 137537, -42185, 84108]
15222A25275J41062A17494a53473A95546a06334I1233q257a94515N6218C34413
15211G9051a24827B06316J15750P7121A11523a58491I6469a59564e8227E2263
15200e8639C6564Q0340K54634a13129A97088A1718g7323L2349A0173a24410D41828
15188b5906C07652K8530O2673i5010l0520A8521a92609C0026d2796A93505m3203
15177A50302o4043Q9906b3412C21484D3602A4889J09624J50741g7424B7575J38993
15166A66568N9529A07426A271R59N4500l093c29709C57880q2972A05833A7445
15154b6433F4560R2389n8036m5718c2432F6820J38987a88105i3949B41049q7394
15143A53655h5206B04158k4977c65731A45415f8769a8350j27394B45304M8717
$$ y = [125275, 266337, 117494, -153473, 195546, -106334, 91233, 82976, -194515, -138297, 334413, 79051, -124827, 206316, 322066, 399187, 111523, -158491, 96469, -159564, -58227, 52263, -58639, 36564, 116904, 371538, -113129, 197088, 11718, -77323, -44974, 10173, -124410, 441828, -25906, 307652, 336182, 398855, -95010, -125530, 18521, -192609, 30026, -42796, 193505, 150302, 86259, 176165, -23412, 321484, 43602, 14889, 124513, 275254, -77424, 27575, 166568, 226097, 107426, 1271, 2230, 56730, 53637, -329709, 357880, 274908, 105833, 17445, -26433, 64560, 156949, 98913, 53195, -32432, 66820, 205807, -188105, -93949, 241049, 153655, -85206, 204158, 179181, -365731, 145415, -68769, -18350, -145744, 245304, 294021]
15133B94021F2889N5748Q801F1223N790J80123k7593M17570B94959A27188L0106
15122A57294e8161H1965j8048L36334E8895I426g4634D65188b71964f692A11197
15110f6473D02806j52450j13604P8751G1351M44011B670c30405G6701a97608B44180
15098A96842d5461A20441J00521p1277F124K53169a43437C47126I6808a73281
15087D33334h8565k1787D19026A03405C8265c2258A92277K3049b8605A07338K63252
15076C70590h2417B11084B2367J13530K0109l9946R9422e6894j02644A35274O8135
15065B03409a4774n349J031C01870c91606A89096a2089k2617A77162G0561f3951
15053B56015B5558c7755B23502n1698B7489N1358J94427A4671b23793D59339E9682
$$ y = [294021, 62889, 118637, 127438, 61223, 67013, 247136, 219543, 637113, 294959, 127188, 157294, -58161, 81965, 63917, 400251, 58895, 9426, -74634, 465188, -271964, -6692, 111197, -66473, 402806, 250356, 136752, 215503, 71351, 515362, 2670, -330405, 76701, -197608, 244180, 196842, -45461, 120441, 220962, 149685, 6124, 259293, -143437, 347126, 96808, -173281, 433334, -88565, -110352, 419026, 103405, 38265, -32258, 192277, 215326, -28605, 107338, 370590, -82417, 211084, 22367, 135897, 156006, 116060, 215482, -56894, -159538, 135274, 203409, -14774, -20123, -19092, 301870, -391606, 189096, -12089, -34706, 177162, 70561, -63951, 256015, 25558, -37755, 223502, 171804, 27489, 78847, 273274, 14671, -223793, 459339, 59682]
15041d4405A81151a6628k9266B48511o1248J15317a42472A14373J3011A8145M3706
15030F1851K4063O9705c5439D2134D071b0333A28897g4153A99540F0060J71237
15019B31297j6537K20892A54909m7749N0480a51042C41310A28435K7728K04442
15009C60605H8934J75785G9787K13913o0546E2469G223K05569k7925n3289j345
14998A30233L42870b32715A11865J74765j19685J65156A39487K97340n8392f018
14987B63573m4796K34741A27635N5756M14732o241j29584B17754J60127A71232
14976A61466K33788c3788C33377j22915C4687L64850e2075C99106j33106K90504
14966E56504A88394i3568B46783b05314B45526D961R8224a0256A32501j1672J95186
$$ y = [-44405, 181151, -16628, -45894, 248511, 187263, 302580, -142472, 114373, 127384, 18145, 61851, 85914, 155619, -35439, 42134, 4071, -20333, 128897, -74153, 199540, 60060, 231297, 214760, 435652, 154909, 107160, 157640, -151042, 341310, 128435, 156163, 360605, 88934, 264719, 79787, 293700, 233154, 52469, 7223, 212792, 184867, 131578, 130233, 473103, -232715, 111865, 286630, 166945, 332101, 139487, 436827, 378435, -6018, 263573, 218777, 453518, 127635, 183391, 598123, 591882, 462298, 217754, 377881, 171232, 161466, 395254, -33788, 333377, 210462, 34687, 399537, -52075, 399106, 266000, 556504, 188394, -93568, 246783, -205314, 245526, 4961, 103185, -10256, 132501, 120829, 316015]
14955C16015J55149q4537p2516f3605B61948e5239C36739j4793A29091N4370q6580
14944I6881g0257D35576J3599A73441c7293B79013A09042K63194F5273J05997
14934A71270J86889M7519b9313B49431J52365E3726K36006j1346F4374J72765
14924B37139J15309m0307K02193A29560J46269L54330j93112j20593n8642j07398
14914A50414l1050J36558n676b6782B04013I0479J39289L41747A85382J90521
14904C75903J31225B15865Q0136G6536L14304K71192j8332A38139J77727n3543
14894B62323J11233o0316m816a413C02925M0578m8448K233J9480j38683K32921
14883D11006j16008A29298J56840J51787A89196J37108j9123q7872p136o795j2745
$$ y = [316015, 471164, 386627, 314111, -63605, 261948, -55239, 336739, 321946, 129091, 183461, 96881, -70257, 435576, 449175, 173441, -37293, 279013, 109042, 372236, 65273, 171270, 358159, 405678, -29313, 249431, 401796, 53726, 289732, 278386, 64374, 237139, 352448, 312141, 514334, 129560, 275829, 630159, 437047, 316454, 257812, 150414, 119364, 255922, 250246, -26782, 204013, 90479, 229768, 571515, 185382, 375903, 507128, 215865, 296001, 76536, 390840, 662032, 643700, 138139, 315866, 262323, 373556, 313240, 308424, -1413, 302925, 343503, 295055, 297288, 316768, 178085, 411006, 294998, 129298, 286138, 437925, 189196, 326304, 307181, 219309, 212173, 205378, 192633]
14872A92633J65808K08045B05862J23854P0403m0407J31751J38140k40611J73759
14862E62751A85547K11009I5568J16963J81995a7117C84776j34269K5534K0833
14852B96874J52331j39203j04100J50209J98060k25339J6319O4265l5773r9817
14842B73826r2489K48991J0349k04498A04187M66825A9267J11120K08437o9429
14832B69395p3075J61996j24391K8071Q4614Q9268A81216O1024J91113A80051
14821D55442K2481B04939K83871J15454k14433M45209m01963M84642k99020A54368
14810B53819J95835r6504O5659I2226J64884L06937B60350A06942K9855J75951
14800C12748R1682q269J48888o02K5887R1948l12704L60861k32412A10500L30221
$$ y = [192633, 358441, 566486, 205862, 329716, 400119, 359712, 491463, 629603, 388992, 562751, 185547, 396556, 95568, 212531, 394526, -17117, 384776, 250507, 276041, 296874, 449205, 310002, 205902, 356111, 554171, 328832, 345151, 409416, 373643, 273826, 181337, 430328, 440677, 236179, 104187, 571012, 19267, 130387, 338824, 269395, 196320, 358316, 233925, 261996, 346610, 435878, 181216, 242240, 433353, 180051, 455442, 477923, 204939, 488810, 604264, 389831, 835040, 433077, 917719, 618699, 154368, 253819, 449654, 353150, 418809, 92226, 257110, 564047, 260350, 106942, 136797, 312748, 404430, 396161, 545049, 544447, 570334, 662282, 349578, 710439, 478027, 110500, 440721]
14789D40721M94590l29956k53096K01769j92239o56L05929j27769j91553J66291
14779E14031l4877N4684Q9184j47379N2784B17622K15629m8458K67932j56458
14769D96267k4805N29793D55283K13809j95632J81395j87816m0028K02548k45888
14759C83671L33686l55738K45306j2146L7953M0266j95041J58412j75835P8711
14749E39245L6533N4901p2500K96943j23366C42742J93439K17547j47495j96422
14739D09811J72423K9329o2923J83361j54702B84211N33400k17651K0140r6912
14729E23188K92776p4712K33817m40482j03881J72720P2338k94024Q5672K8243
14719D95655K14945k11926M99760j42185J06674j78580l33163K94282L9227k73385
$$ y = [440721, 935311, 605355, 352259, 554028, 361789, 361133, 667062, 539293, 347740, 514031, 479154, 533838, 623022, 475643, 528427, 217622, 433251, 384793, 652725, 496267, 471462, 1001255, 455283, 669092, 473460, 654855, 467039, 427011, 629559, 383671, 717357, 361619, 606925, 594779, 632732, 672998, 477957, 636369, 460534, 539245, 575778, 630679, 558179, 855122, 731756, 342742, 536181, 753728, 606233, 409811, 582234, 611563, 548640, 732001, 577299, 284211, 817611, 599960, 620100, 523188, 815964, 741252, 975069, 534587, 430706, 603426, 675764, 381740, 467412, 495655, 710600, 498674, 998434, 856249, 962923, 784343, 451180, 745462, 784689, 511304]
14709E11304J32722p4801J45619J48231k21377O9834B88120N36684l00125K81388
14699H06067j22143K88209L6466l2913l46501m2710J37114k33852M63163j03866
14689H49034k03989j298J68202k57658N3318K47892l48670O78827k86009l45654
14679E53995L80076k97172L50352j51317M437N1972o2279r188j64751N08070l22052
14668H42143k52934L06591M45789k56792k00630Q5135j60870l4909J49441Q5478
14658A008442J05529k47002J89523Q828l41367j821K05216R6699O8838o8301J3534
14647A038118j26482J87792K27541m07716L79040m05009O32753l60029n3391l66448
14637G46169J30834J96037j72492M30924l32270J76028l6587J45201l18931K24243
$$ y = [511304, 644026, 569225, 714844, 863075, 641698, 711532, 288120, 824804, 524679, 806067, 683924, 972133, 1008599, 975686, 629185, 586475, 723589, 489737, 952900, 849034, 645045, 643747, 811949, 554291, 607609, 855501, 506831, 1185658, 899649, 553995, 934071, 636899, 987251, 835934, 840371, 892343, 830064, 820876, 656125, 1164195, 842143, 589209, 895800, 1341589, 1084797, 884167, 969302, 808432, 773523, 922964, 1008442, 1113971, 866969, 1056492, 1065320, 723953, 722132, 927348, 1024047, 1092885, 1024584, 1038118, 911636, 1099428, 1326969, 919253, 1298293, 893284, 1526037, 1166008, 1112617, 746169, 877003, 1073040, 900548, 1331472, 999202, 1175230, 1138643, 1283844, 964913, 1189156]
14627A189156K69038l24845j61Q0946K32225j8493l03025K71240r6829M02063
14617A701315l69463k75211J91735p5843o208J05629J44409Q738k5428q8455K98967
14606A610185m20538J77500l41835L71010o0560K43247K4538N634l4005O7602
14596A642778k37521k9342q197K5120j11755M71701r8437j5777J36788j04703
14586A670655j23159J42425l04173o4772L44742l96925M43261p1523K4994K84147
14576A949672k86797n1709J65902J47371j117j26185P09k33453M44394K2926R0164
14565B121877j77027J59311K2914J03283K86634m3122L1475q75k24528L65573
14555B645515J17130R9325J33269N74894N88355P43192J555067L856275J0222890
$$ y = [1189156, 1458194, 1133349, 1133188, 1214134, 1446359, 1427866, 1124841, 1396081, 1299252, 1701315, 1331852, 1056641, 1248376, 1172533, 1166325, 1271954, 1416363, 1425101, 1399673, 1311218, 1610185, 1189647, 1367147, 1025312, 1396322, 1335762, 1579009, 1603547, 1609181, 1575176, 1642778, 1405257, 1375915, 1367718, 1392838, 1281083, 1752784, 1654347, 1638570, 1775358, 1670655, 1547496, 1689921, 1385748, 1320976, 1665718, 1268793, 1712054, 1640531, 1665525, 1949672, 1662875, 1611166, 1777068, 1924439, 1923322, 1797137, 1797846, 1564393, 2008787, 2031713, 2121877, 1944850, 2104161, 2127075, 2230358, 2516992, 2473870, 2505345, 2504470, 2279942, 2645515, 2762645, 2861970, 2995239, 3570133, 4158488, 4901680, 6456747, 10313022, 20535912]
14546B0535912J9212712K038112B0180408H387056D025204j461687k80991m31880
14538A850646m6367L11671l77633K21586J1036m89247J51442M04361n6421K3496
14528B004570q3774M16668k79007j27049J27620K96190l90298P7072j20231J29898
14518B051659M07634q2374J10196k64115J17273M0306j21839k45810O88623K34808
14508B936361m44431n0273M47055k64671J31920J195k43847N4958J74131J47136
14498B889534l45303K37351N5650j28067M05719j35630k73481M4560L66032k75420
14488B840945M84483K63119k07232j93678J14336n1294R7994j1845l9427M8074
14478C345475j5156L07429K86617l91297P2129j03831r9378M57798j86735N3662
$$ y = [20535912, 39748624, 41786736, 20180408, 8387056, 4025204, 2563517, 2282526, 1850646, 1804279, 2115950, 1738317, 1959903, 1970939, 1481692, 1633134, 2037495, 1981074, 2004570, 1920796, 2337464, 2058457, 1931408, 2059028, 2355218, 1964920, 2041992, 1921761, 2051659, 2459293, 2376919, 2487115, 2223000, 2340273, 2380579, 2258740, 2012930, 2701553, 2936361, 2491930, 2441657, 2888712, 2624041, 2755961, 2757156, 2513309, 2568267, 2742398, 2889534, 2544231, 2781582, 2837232, 2709165, 3114884, 2979254, 2705773, 2750333, 3116365, 2840945, 3325428, 3588547, 3381315, 3187637, 3301973, 3250679, 3348673, 3336828, 3297401, 3345475, 3330319, 3637748, 3924365, 3533068, 3605197, 3501366, 3401988, 3859786, 3673051, 3726713]
14468C726713K01147j4876O5602R2780p1402J6044r1045q826J38704K83942K32148
14457D570931J9012p5716j85424L62545k37320L11735N4581j34563J54827k41822
14447D598786J24640L25732j8824l76633M50605K23333n1491Q8315o2020O26411
14437E928854k85312r042J20120l6663N5748R8785K89939k25086R4660o9317L28180
14426F290866K38456p8670j45807R2776L82036K33934j05232N1333J9433L60179
14416G339304j71051L03313n08429M36779K58271L78197j69109K42180N0509K96497
14406H456461k89120K14721L34185O0117K25183P7283K86288j09473M27945p4146
14396I609444L53522M9868k04570N26593k58018N02728L17646J06638M55549l67920
$$ y = [3726713, 3927860, 3912984, 3978586, 4071366, 3999964, 4016008, 3924963, 3916137, 4054841, 4338783, 4570931, 4589943, 4514227, 4328803, 4691348, 4454028, 4765763, 4820344, 4685781, 4840608, 4598786, 4723426, 5049158, 5030334, 4653701, 5104306, 5327639, 5276148, 5364463, 5302443, 5928854, 5643542, 5634500, 5754620, 5717957, 5773705, 5872490, 6162429, 5937343, 6032003, 5962686, 6290866, 6529322, 6450652, 6304845, 6397621, 6779657, 7013591, 6908359, 6959692, 6979125, 7339304, 7168253, 7471566, 6963137, 7399916, 7658187, 8036384, 7867275, 8109455, 8159964, 8456461, 8167341, 8382062, 8716247, 8776364, 9001547, 9078830, 9365118, 9255645, 9683590, 9609444, 9962966, 10012834, 9808264, 10334857, 10076839, 10579567, 10897213, 11003851, 11459400, 11091480]
14386A1091480K25304L76588K00399K41783L52057r5282M36826L16755M42094
14377A3588004k46680L01760M50430K89813M89148J21991M36086J31715K93080
14368A5855347k757O56387K41041P84625O2667L77235M50158L68066J54886N44492
14358A9492147O62178L70308L61809L21192R58920K68475M66154N26013P30415
14349B4157611L53747P57919N84302P13556N00664J019199N36226J028440J032693
14340C0684357N53595N86676P91393J146623Q95116J223504J002830P79449J277758
14331C8941301J364507J096002J303190J633267J435361J165532J563478J621180
14323E0123818J316110K212803J905624K277140J840576K084486K355354K342472
$$ y = [11091480, 11316784, 11693372, 11893771, 12135554, 12487611, 12392329, 12829155, 13145910, 13588004, 13341324, 13643084, 14093514, 14383327, 14872475, 14994466, 15430552, 15562267, 15855347, 15852590, 16508977, 16750018, 17534643, 17597310, 17974545, 18424703, 18792769, 18947655, 19492147, 20154325, 20524633, 20886442, 21207634, 22166554, 22435029, 22901183, 23427196, 24157611, 24511358, 25269277, 25853579, 26567135, 27067799, 28086998, 28623224, 29651664, 30684357, 31237952, 31824628, 32616021, 33762644, 34657760, 35881264, 36884094, 37663543, 38941301, 40305808, 41401810, 42705000, 44338267, 45773628, 46939160, 48502638, 50123818, 51439928, 53652731, 55558355, 57835495, 59676071, 61760557, 64115911, 66458383]
14315F6458383K784741K560450K784191L102493L044627L360830L999119L310717
14307I1405551L979289M490662M354358M591126N189946N407551N710174O224550
14299A31353207O454242O932520P318503P619351Q581929Q840087R323740R921113
14291A96344692J0892401J1331750J1553036J2547508J3253855J3479620J4446312
14284B83849174J4820387J5299260J5696533J5772939J6110057J5418089J5623196
14277C92589635J4075734J3354045J1816506J0355315P861112L280370P5858q23262
14269D52585313r62651l86316k761652p429410q633140j0760732j2519336j4256113
14261C94875963j5199515j5882827j6072022j6292182j5866437j5638045j5314429
$$ y = [66458383, 69243124, 71803574, 74587765, 77690258, 80734885, 84095715, 88094834, 91405551, 95384840, 99875502, 104229860, 108820986, 114010932, 119418483, 125128657, 131353207, 137807449, 144739969, 152058472, 159677823, 168259752, 177099839, 186423579, 196344692, 207237093, 218568843, 230121879, 242669387, 255923242, 269402862, 283849174, 298669561, 313968821, 329665354, 345438293, 361548350, 376966439, 392589635, 406665369, 420019414, 431835920, 442191235, 450052347, 453332717, 453408575, 452585313, 451622662, 451236346, 448474694, 441045284, 432412144, 421651412, 409132076, 394875963, 379676448, 363793621, 347721599, 331429417, 315562980, 299924935, 284610506]
14254B84610506j3360616j4087951j3311129j2475681j2296739j1210857j1175790
14247A96691743r930276r728222q521963q482140p675130p151582p031112p155285
14239A31016033o049785n262811n273700n420040m661068m735212m254212l610706
14231I1748499l645136l464639l720730l148648l194154k835759k801812k574096
14223F6363525k517813k289902k051658j572544k052149k067563k167437j494752
14215E0149707j711702j021444j759246j436284j363372j110726j599698j032285
14207C9114950m45409j068488j476018j297343j009167r35318n44937n97876r33719
14198C0806675j145675o17562p48417p21757p17183o09773p77328p60873o71568
$$ y = [284610506, 271249890, 257161939, 243850810, 231375129, 219078390, 207867533, 196691743, 186761467, 177033245, 168511282, 160029142, 152354012, 145202430, 138171318, 131016033, 124966248, 119703437, 114429737, 109009697, 104348629, 99613417, 95359205, 91748499, 88103363, 84638724, 80917994, 77769346, 74575192, 71739433, 68937621, 66363525, 63845712, 61555810, 59504152, 57931608, 55879459, 53811896, 51644459, 50149707, 48438005, 47416561, 45657315, 44221031, 42857659, 41746933, 40147235, 39114950, 38669541, 37601053, 36125035, 34827692, 33818525, 32883207, 32338270, 31740394, 30806675, 29661000, 29043438, 28295021, 27573264, 26856081, 26246308, 25468980, 24708107, 24036539]
14189B4036539l27192n84788k56037p65303n64430n92483n59721j96462n66065
14180A9624058l26733k47426m90957l30876n37336m41546o1848o68355p9508l94431
14170A6045042m24297k47473n77957J12407N146o18976j00345l24368j54570m81549
14160A3233060m8887r0446n21416P6381m05430m44504k9801k17163l0185j50743
14150A1370866j55367l22680r2397l82456l8347q9463k51141k45669j44546M2891
14140I691691l62851O8406l61566J43064r7695n14799J89024o9132J5196q75398
14130G825940N98435n54317Q0458j97881j84947K35952j73413l01224r2612L4633
14120G271024l47865M14548k57377l33822j10652O5012n9349l94435j5976M5087
$$ y = [24036539, 23709347, 23124559, 22868522, 22103219, 21538789, 20946306, 20386585, 20190123, 19624058, 19297325, 19049899, 18558942, 18228066, 17690730, 17249184, 17187336, 16518981, 16439473, 16045042, 15620745, 15373272, 14795315, 14907722, 14912868, 14293892, 14193547, 13869179, 13714609, 13233060, 13184173, 13093727, 12572311, 12648692, 12243262, 11798758, 11768957, 11551794, 11521609, 11370866, 11215499, 10892819, 10800422, 10417966, 10379619, 10290156, 10039015, 9793346, 9648800, 9691691, 9328840, 9397246, 9035680, 9178744, 9081049, 8566250, 8755274, 8686142, 8701338, 7825940, 8424375, 7870058, 7950516, 7752635, 7567688, 7803640, 7630227, 7329003, 7236391, 7271024, 6923159, 7337707, 7080330, 6746508, 6635856, 6700868, 6641519, 6247084, 6231108, 6276195]
14110F276195j3646l76967R9461j3786q3447l2170L22297n63004J44106m46210
14100E312829O6750p1138J15328l31608L28747j10283m39281J36957J91435m75129
14090D724607K69878j58352K76972m74215K7980l20108m7564K88367j39185k50516
14080D197864M49399l32118l002j85317p0742n27005O84791J00765j76594k81235
14070C856806o1411L66758m90413p9023N85709n49572L24663j76257m43157M06247
14060C740350j723j57603J70301R1421J16289Q4115m68788k16772p233k01198
14050C149159k8670J26992k60225j32850L57339j68049Q6379m4399l14260L26826
14040C098242r132L3031l02089Q1714N8792j50949j27727K20011k28648J19775
$$ y = [6276195, 6262549, 5885582, 5985043, 5971257, 5887810, 5855640, 6177937, 5614933, 5759039, 5312829, 5379579, 5308441, 5423769, 5092161, 5420908, 5310625, 4871344, 5008301, 5199736, 4724607, 4994485, 4836133, 5113105, 4638890, 4666870, 4346762, 4299198, 4587565, 4448380, 4197864, 4647263, 4315145, 4312143, 4126826, 4056084, 3529079, 4213870, 4314635, 4138041, 3856806, 3795395, 4162153, 3671740, 3592717, 4178426, 3628854, 3953517, 3777260, 3334103, 3740350, 3738627, 3581024, 3751325, 3842746, 3959035, 4043150, 3574362, 3357590, 3350357, 3149159, 3120489, 3247481, 2987256, 2854406, 3211745, 3043696, 3130075, 3085676, 2771416, 3098242, 3089110, 3122141, 2820052, 2901766, 2960558, 2809609, 2681882, 2901893, 2673245, 2793020]
14030B793020k4136j43276O178J20151j14448p7681j1800M3363k38279j60643
14020B192449J74347R993P5428K41868k62889j64126p5909K1232J35115k28856
14010B118652J76709l93429j76840M40326r6828L3201J84119k93101n3727p9309
14000A859773J45753O096j27626J07012k24299J0690k24234M30807M6888R5264
13990B126124J34404N36050L098141Q177258J9630751J0622848j9779182A1230909
13981F742277j622465p14071p57936l63317l14402k11051J12188l57543k81372
13972B232308L11010j88020j56131K30498l18561j21599M21427n03380J11177
13963B018729L6523j91284L26552j09937l11695K41153l39483P71713n78183j99064
$$ y = [2793020, 2768884, 2625608, 2631786, 2751937, 2637489, 2559808, 2548008, 2591371, 2353092, 2192449, 2366796, 2376789, 2452217, 2694085, 2431196, 2267070, 2191161, 2212393, 2347508, 2118652, 2295361, 1901932, 1725092, 2165418, 2068590, 2101791, 2285910, 1992809, 1939082, 1859773, 2005526, 2011622, 1883996, 1991008, 1766709, 1777399, 1553165, 1983972, 2030860, 2126124, 2260528, 2796578, 5894719, 14071977, 33702728, 44325576, 24546394, 11230909, 6742277, 5119812, 4405741, 3647805, 3284488, 2970086, 2759035, 2871223, 2513680, 2232308, 2543318, 2355298, 2199167, 2429665, 2111104, 1989505, 2410932, 1907552, 2018729, 2055252, 1863968, 2190520, 2080583, 1768888, 2010041, 1670558, 2442271, 1864088, 1665024]
13953A665024M4255j30418k69247P87506j83899j13620k29135K43192J2790k58978
13943A567470M6320R9878L28884m95912k06J33165q9109J70713j83320J69186
13933A747069k77379N0788j34622j05299L31314o2039l48438K18384K3468k06402
13923A236844J70526O3554m1131m243J81709N149j75428j3312k91786J57090M7905
13912A336877J68503k25331l9111J0998o9356m543K31726n6180J24174k73540
13902A204217j33043J73074K12795n06813J90577K9367J0173k50521L02644k18480
13892A013990m5027l9930K38268O8807l02347n9955J18243N8755j38254J30980
13882A043530n5950J01933l9434M8335q6550P0860l6141l31870M98856K93930
$$ y = [1665024, 1709279, 1578861, 1309614, 2097120, 1913221, 1799601, 1570466, 1813658, 1826448, 1567470, 1613790, 1713668, 2042552, 1546640, 1546434, 1679599, 1590490, 1761203, 1577883, 1747069, 1469690, 1520478, 1385856, 1280557, 1611871, 1549832, 1201394, 1419778, 1443246, 1236844, 1407370, 1470924, 1429793, 1425550, 1607259, 1612408, 1436980, 1423668, 1131882, 1288972, 1336877, 1505380, 1280049, 1240938, 1251936, 1182580, 1178037, 1409763, 1353583, 1477757, 1204217, 1071174, 1244248, 1457043, 950230, 1140807, 1170174, 1180347, 929826, 1232470, 1013990, 968963, 929033, 1167301, 1236108, 933761, 873806, 992049, 1050804, 912550, 1043530, 987580, 1089513, 1050079, 1098414, 1011864, 1082724, 1046583, 714713, 1213569, 1507499]
13872A507499m67975j14440m4400K3305j78948M1451R1395J32292o3901m0223
13862H86055J77980l57618M20927k47588R4160r2783J06973J10151l31781K47241
13852A013717j50502j82170L38990J45243l9258k29418j38375K21070m9503J27209
13842A057003j79837J16620j73676L0155n4747j01053P0120K18733q6149k4586
13832H72583o7397k11132M12588M1636p2089j57294M1638k69870J26477J67909
13822H85049m25599M36132k58438L71592o2415J3414k76074K75075j96784j80409
13812E81543j24413L71660J6956D14792L26266j1642L1701j10242j5356K87176
13802I22695J57553D59508L35272R0487C91348K91431L17238k24155k53730j69533
$$ y = [1507499, 1039524, 925084, 880684, 903989, 725041, 766492, 857887, 990179, 926278, 886055, 1064035, 706417, 1127344, 879756, 973916, 881133, 988106, 1098257, 766476, 1013717, 863215, 681045, 1020035, 1165278, 1126020, 896602, 758227, 979297, 929794, 1057003, 877166, 993786, 820110, 850265, 795518, 694465, 764585, 983318, 897169, 872583, 805186, 594054, 1006642, 1048278, 976189, 818895, 860533, 590663, 717140, 885049, 459450, 895582, 637144, 1008736, 946321, 959735, 683661, 958736, 761952, 581543, 457130, 828790, 845746, 414792, 741058, 729416, 761117, 650875, 635519, 922695, 1080248, 459508, 794780, 885267, 391348, 682779, 1000017, 775862, 522132, 352599]
13792C52599L27935p8041J67502l78454N07170D35584J87694J36678m1908K03929
13782I21977k79958j89203K31658k50245J24717O4680J34864P1378l5073l4499
13772G60296O2782j97628P1129j59716J37211j71877o7741J81964M43935m01332
13762F59023J35107l14403K35168k76098M10029j79078o500J48018n3174P1801
13752H29893k31409J00795C47082L49790p3325o5322n3588k05623J67460L03185
13742G69659j90321Q0509k22666m5869J0323K96202k73327J54061O0805l13246
13732C26130h0512F71648j79837j84824L27537L6166C10067K23102N9118L390
13722E95677K9043k80807J63639L228N4329m4300j75658m2450M77553B46370M02069
$$ y = [352599, 680534, 602493, 769995, 391541, 898711, 435584, 623278, 759956, 718048, 921977, 642019, 452816, 684474, 434229, 558946, 623626, 758490, 829868, 794795, 760296, 823078, 625450, 696579, 536863, 674074, 502197, 434456, 616420, 1060355, 659023, 794130, 479727, 714895, 438797, 848826, 669748, 663248, 811266, 758092, 829893, 598484, 699279, 347082, 696872, 623547, 558225, 504637, 299014, 466474, 769659, 579338, 659847, 437181, 391312, 401635, 697837, 424510, 578571, 639376, 326130, -80512, 671648, 491811, 306987, 634524, 670690, 310067, 533169, 592287, 595677, 624720, 343913, 507552, 510780, 565109, 520809, 345151, 302701, 780254, 246370, 648439]
13711F48439l6584l01414J06416j30132L23622L399K36137l81298J55791B44916
13700D89588N0267k55065K35598J63338l02634j82377L42592K26694h653B87281
13689F38446K06560k77624j47733J70158J4525B02659L2703K22755B7121L20080
13679C47201j05887K64183B05375J76888j71307K92972D9461K83002N18068k99597
13669E50934A32475K14233K30074J20062j91891B46176J79221j80169K53822K52873
13659G51923G8004J12921K87075j59589J83489I6066A2175L87661j77744J21863
13649C43955Q1787k6860j3533P1906M3163m3333L1487Q7710J6377j37305j24187
13638C31167O6474K50197k18446A55615J70551n0873l0038P2776K34732q1877
$$ y = [648439, 611855, 310441, 416857, 286725, 610347, 613746, 849883, 468585, 624376, 244916, 489588, 539855, 284790, 520388, 683726, 381092, 198715, 541307, 768001, -8653, 287281, 638446, 845006, 567382, 419649, 589807, 604332, 202659, 235362, 458117, 27121, 347201, 241314, 505497, 205375, 382263, 210956, 503928, 49461, 332463, 850531, 550934, 132475, 346708, 576782, 696844, 504953, 246176, 425397, 245228, 499050, 751923, 78004, 190925, 478000, 318411, 501900, 96066, 12175, 399836, 222092, 343955, 425742, 398882, 385349, 457255, 500418, 457085, 488572, 576282, 592659, 455354, 331167, 397641, 647838, 429392, 155615, 326166, 275293, 245255, 318031, 552763, 470886]
13628D70886K2015j21910J87609k35401j61403L19986p8819J94994k31875L3273
13618C99355K6231j08958n5855O6838J43704B13898O7584j179K88931j38460j60853
13607B69921j02623D8969L54115j70124K11719J29950I4058M61563j76713j51505
13597B27403J83147l8737O8157j41907M9838R7598N3260j3180j00072j60859q097
13586B16551J98684k3186o3232j4222R7692j49089G4652M64833j67256R7922j4649
13575D55502B06921A02884K08487A00823K10488r597j46997l710K0312m1500N52982
13564F82801C15018K48889I1846M6351K11681j57983o388R9782R7017j36870K07158
13553D52594E677L81392J29814B25199r1153J68061K26801m0954J46686A21838
$$ y = [470886, 492901, 370991, 558600, 323199, 161796, 481782, 402963, 597957, 366082, 399355, 425586, 316628, 260773, 327611, 471315, 213898, 281482, 280303, 569234, 430774, 269921, 167298, 48969, 403084, 232960, 444679, 574629, 94058, 555621, 378908, 227403, 410550, 371813, 439970, 298063, 347901, 445499, 498759, 485579, 385507, 224648, 216551, 415235, 392049, 328817, 314595, 412287, 263198, 74652, 539485, 372229, 470151, 455502, 206921, 102884, 311371, 100823, 311311, 301714, 154717, 151007, 171319, 129819, 682801, 315018, 563907, 91846, 138197, 349878, 191895, 185507, 285289, 382306, 245436, 452594, 5677, 387069, 516883, 225199, 134046, 302107, 528908, 487954, 634640, 121838]
13542A90401A616K83782J56399P238j68975m4294p4885L53432o1011A15922J766
13531A17688m8924K08568K371J40225C7699O9058L31673j71178H7387K06845j35190
13520A59042d2453C41254p2842J7774j40849K93166I8980M5077L71056j87406
13510C27707j17547O5012J52239p3224g7364E20985j57627B2261L57314p5759
13500C03816o8336C4729L74535j79883P6331F0608R6016b3682F84103A44044C9295
13488B51035J386J31569H900J99388J40032A55162K0163h54A48655J57099J2555
13477C18309L3110b0265C88586j48900J22966K27832A63123L57140B35765P0060
13467C05825L86618a5054C5676J2043K98426n367d980A1618K59454q5302k644
$$ y = [190401, 1616, 285398, 441797, 449035, 280060, 235766, 160881, 514313, 453302, 115922, 117688, 68764, 277332, 279703, 419928, 37699, 106757, 438430, 267252, 87387, 294232, 159042, -42453, 341254, 268412, 286186, 145337, 438503, 98980, 144057, 515113, 327707, 210160, 275172, 427411, 354187, -77364, 520985, 363358, 22261, 379575, 303816, 235480, 34729, 409264, 229381, 305712, 60608, 156624, -23682, 684103, 144044, 39295, 251035, 252421, 383990, 8900, 208288, 348320, 155162, 175325, -854, 148655, 305754, 318309, 351419, -20265, 388586, 239686, 362652, 590484, 163123, 520263, 235765, 305825, 692443, -15054, 35676, 47719, 346145, 340778, -4980, 11618, 271072, 185770, 183126]
13456A83126C879L72391H0180K76256b06078B45037C21L12060K16628A72737K69517
13445D42254a75056C81469B0053J80222R8894A02645J8270n9881K61764a05046
13434f2438A78508K01911n387j37556n1518i949n5895A55212J57757N4198M8487
13423D15654A92662J7299D8286e6186J6776A37638N6910l4826J39746j41256J66564
13412C24776D5123N00039A03875l4773K54309G7151K0282J00314J8045o9965R0594
13401B36421a7135D22885A77203Q7583n4574J26717g6369A57759O5396J02768
13391C25923n7360K0822j31141K39104a25312A55473J17069O8383A36654j5307
13381A21347J56416r0108F3046e9998A94144K8909K01560F7115J40911J63845
$$ y = [183126, 3879, 376270, 80180, 356436, -206078, 245037, 321, 312381, 529009, 172737, 442254, -175056, 381469, 20053, 200275, 299169, 102645, 120915, 61034, 322798, -105046, -62438, 178508, 380419, 375032, 237476, 185958, -9949, -65844, 155212, 312969, 367167, 415654, 192662, 209961, 48286, -56186, -39410, 137638, 194548, 159722, 299468, 158212, 324776, 45123, 545162, 103875, 69102, 323411, 77151, 97433, 197747, 215792, 145827, 236421, -17135, 422885, 177203, 264786, 210212, 336929, -76369, 157759, 223155, 325923, 268563, 289385, 158244, 397348, -125312, 155473, 272542, 340925, 136654, 121347, 277763, 187655, 63046, -59998, 194144, 223053, 424613, 67115, 208026, 371871]
13371C71871A76285Q684e5797A57122K6251m0410J01164J87591k01522J37623
13361C67819k5529a1011E2368K1561f8032D06842A33493K10854b73695B11573
13350D1359L46929A92341E8124J01464K1373Q7391J78466b1476D27818o443A35927
13338C47200B0969J45850J47004B238K02764h4316C4534a06911B49888b6496B18631
13326B37120l6998J7260o5864N348K72539p2548n058q1681A24453J52939C1396
13314A6508J69909A9086K12020l9139G5708J27309a71684D78973A47483a12220
13303B30314j14724J11790k516J47508A62760J87716A52388k6515j6554O2359
13293A71678a5176B20548b3522l0247B47043k5869G5776B4011b5550k82380a00875
$$ y = [371871, 176285, 184969, -55797, 157122, 183373, 142963, 244127, 431718, 230196, 367819, 342290, -11011, 52368, 73929, -68032, 406842, 133493, 344347, -273695, 211573, 41359, 388288, 192341, 58124, 159588, 180961, 268352, 446818, -21476, 427818, 421375, 135927, 347200, 20969, 166819, 313823, 2238, 205002, -84316, 34534, -106911, 249888, -26496, 218631, 237120, 200122, 217382, 151518, 156866, 429405, 356857, 351799, 270118, 124453, 277392, 31396, 16508, 186417, 19086, 231106, 191967, 75708, 203017, -171684, 478973, 147483, -112220, 230314, 115590, 227380, 224864, 372372, 162760, 350476, 152388, 125873, 109319, 171678, -15176, 220548, -23522, -53769, 247043, 221174, 75776, 24011, -25550, -307930, -100875]
13281A11799A5119J23938L4853k509K08549e4914C92415G7787N5312a51276D39547
13269E8138K58637J25200A88967K8349C1136J78281O0414l0574a55843C10596
13258B18222e0727A29971e5939A85495n0266J15088i3786I8076C3336e6115B11386
13246B22931E1313M6187J16634O2251F820J19722a32691A41677L5932F1678L56134
13235D17812A74033l1207J12108I0861M9512i2728B2028K35654I9367c9840B06279
13223A50486F8398B5806a22852A18898g2587I2427a53116k2166B64045A24248
13212A31517l4343J76041a47373H9751l600J34109C4617K36866N6418j61466b462
13200G0916N3781a7486C91468A87702h3850B83956E9283P3844C8085Q6970f9827
$$ y = [111799, 15119, 139057, 173910, 171401, 379950, -54914, 392415, 77787, 133099, -151276, 439547, 58138, 316775, 441975, 188967, 217316, 31136, 209417, 269831, 239257, -155843, 310596, 218222, -50727, 129971, -55939, 185495, 135229, 250317, -93786, 98076, 33336, -56115, 211386, 222931, 51313, 97500, 214134, 276385, 6820, 126542, -132691, 141677, 177609, 61678, 417812, 174033, 142826, 254934, 90861, 140373, -92728, 22028, 257682, 99367, -39840, 206279, 150486, 68398, 25806, -122852, 118898, -72587, 92427, -153116, -175282, 264045, 124248, 131517, 97174, 273215, -147373, 89751, 86151, 220260, 34617, 271483, 327901, 166435, -2462, 70916, 124697, -17486, 391468, 187702, -83850, 283956, 59283, 133127, 38085, 125055, -69827]
13188I6956b12953A06147a40758B35511K44339k10005l0821q3543K7353n5413
13178A27421a10128j15954D6262J46095k9146d24001A64786g7136A50800B6786
13167C02348l966j46086I525R3087Q5258M0077a29744l0371B00811j9056p8900
13156A02855j4678j9377Q1038J48443A38127o8285l147k5882j6537b16377h645
13144E6404L3193e6977a5910j15166e2307m9431p379B54232A06636a1372B3091
13132b8722B5371a48806C71274c18344B6983h2312n1995p9186J9575g6724B23183
13120B3613Q3459N1540D6150o547I449K94973C8631L83320A19665K92138E9292
13108a31548f819m9168k92101b0330A33934f8858D1950K16223E3525L09446N731
$$ y = [96956, -212953, 106147, -140758, 235511, 479850, 269845, 239024, 155481, 182834, 127421, -110128, -226082, 46262, 192357, 163211, -424001, 164786, -77136, 150800, 26786, 302348, 298382, 152296, 9525, 102612, 187870, 227947, -129744, -160115, 200811, 181755, 102855, 88177, 68800, 149838, 298281, 138127, 69842, 66695, 40813, 24276, -216377, -8645, 56404, 89597, -56977, -15910, -131076, -52307, -101738, -109117, 254232, 106636, -11372, 23091, -28722, 25371, -148806, 371274, -318344, 26983, -82312, -134307, -213493, -193918, -76724, 223183, 23613, 107072, 158612, 46150, 39603, 9449, 304422, 38631, 421951, 119665, 411803, 59292, -131548, -6819, -55987, -348088, -20330, 133934, -68858, 41950, 258173, 53525, 362971, 368702]
13097C68702b20333M4491C01228b9567B43888a90147A7983h1421c6198o4340j04856
13086b05394A4256M05587j86442p5420h5550a2946B1955b24415B84370I5459a56555
13074a38733O2949o4442G430f2149j53885B35859r6785A2094J14362C3268N5734
13063H9002h3610B28957J4604K35792D6403K17030q8314J8276i9424A04145D6717
13051E21345f3921o2658A60404g9117D27879c02580E29959G1614j9108B778L78762
13040C81540C2490i5766F6382K68202k7430b2709D8335J34176e7390i575C92324
13028G5202L84927m1069j95972K487b02077A09482g6592A41692o6396j3767K7102
13017H8631a23654E8966b77291C02498b1184A4119d3802A22868K6225n5777Q307
$$ y = [368702, -220333, -175842, 301228, -29567, 243888, -190147, 17983, -81421, -36198, -100538, -205394, 14256, 419843, 233401, 157981, -85550, -12946, 21955, -224415, 284370, 95459, -156555, -138733, -75784, -140226, 7430, -62149, -216034, 235859, 139074, 12094, 126456, 33268, 89002, -83610, 228957, 243561, 479353, 46403, 263433, 175119, 193395, -99424, 104145, 46717, 521345, -63921, -126579, 160404, -79117, 427879, -302580, 529959, 71614, 52506, 2778, 381540, 32490, -95766, 66382, 334584, 307154, -22709, 48335, 182511, -57390, -9575, 392324, 75202, 460129, 419060, 223088, 225575, -202077, 109482, -76592, 141692, 75296, 61529, 88631, -123654, 58966, -277291, 302498, -21184, 14119, -43802, 122868, 149093, 93316, 101623]
13006A01623J2652A2218b94314D51006j05402j41917P1479F6520K70108C9494
12995e9691B44211A21589n9061N5165j1020a12667o1718H578c804E5309a4004
12983A16623f9998C08068A49639k5646J5182K63608j33447c29647I8249N9838
12973A58087a271j8820D9880e0438o9305j60497B07841J08852c2796j76378A3516
12961f0930A46042B8386a18182D08242b32687D89669k01509A7196L92096j80533
12951B28759h0387C54143A46336J25009H6227a02017d8997j04553A99969B3655
12940a7960E323P106a76900F596J56692e9092b8211A36996c5897C75494c0516
12928A36982c61342F2102A6926J00440b1718A22005J67546f1804E9908h9268a5803
$$ y = [101623, 114275, 12218, -294314, 451006, 345604, 203687, 275166, 66520, 336628, 39494, -59691, 244211, 121589, 62528, 117693, 106673, -112667, -174385, 8578, -3804, 55309, -14004, 116623, -69998, 308068, 149639, 123993, 139175, 402783, 269336, -329647, 98249, 158087, -1271, -20091, 49880, -50438, -119743, -280240, 207841, 316693, -32796, -209174, 13516, -60930, 146042, 28386, -118182, 408242, -232687, 489669, 288160, 17196, 409292, 228759, -80387, 354143, 146336, 271345, 86227, -102017, -48997, -153550, 199969, 23655, -17960, 5323, 12429, -176900, 6596, 163288, -59092, -28211, 136996, -35897, 375494, -30516, 136982, -361342, 62102, 16926, 117366, -21718, 122005, 289551, -61804, 59908, -89268, -15803]
12916B27520b76j14149C56473C0509J52728g169C3951E864R7693a91332H6427
12904D8327a0743A79859H2129a4211l7100a2998n0675B10937d9877B1746K36009
12893B57755F5043K34953r5626E3320J00877K460G6105J38740b39109H7237j1077
12882G6160k9926h5836a4620A45795D7966J53114H5185l3452a71382A47066i7208
12870F1963O0314N4673b0956B16118c9993D6741f6473p7050c8081o7198L6067
12859f9212l7291C14160g692E9385Q9870d6275j6921m8039j51200I0361a81160
12847B7857j3492M5997O3255o601I432J74381G6516A4892a6457n9336j10214j7279
12835b03286A79512H8710f1941j4235B89942c4067G3579L9470e3501q208j1658
$$ y = [227520, -276, -114425, 356473, 30509, 183237, -7169, 33951, 5864, 103557, -191332, 86427, 48327, -10743, 179859, 82129, -14211, -51311, -12998, -63673, 210937, -49877, 21746, 257755, 65043, 299996, 204370, 53320, 154197, 156657, 76105, 214845, -239109, 87237, 76160, 46234, -85836, -14620, 145795, 47966, 201080, 85185, 51733, -171382, 147066, -97208, 61963, 122277, 176950, -20956, 216118, -39993, 46741, -66473, -143523, -38081, -105279, -69212, -106503, 314160, -7692, 59385, 149255, -46275, -63196, -111235, -262435, 90361, -181160, 27857, 14365, 60362, 123617, 117016, 9432, 183813, 76516, 14892, -16457, -75793, -186007, -203286, 179512, 88710, -61941, -76176, 289942, -34067, 73579, 113049, -53501, -61709, -73367]
12824g3367k12930A31202d4362g041k01210H1592a81074O8904a990B6930L06764
12813C33694e5911G7904a30991J974B3753J35102j7528d0150C14551a66546g0522
12801a54528j4320B53325a38531A12222a41342l4168B08833l6361b969k1881B51150
12789b01269G9392i9907D3802Q2682a46071B34593E2367L687L17156A2847Q1379
12778I4226D5901E40h3282b8634E6652a11448A25956K1392J07871F6708b9122
12766a36918m0054H5804b39818J06652C05824r9702c02769g3377A91020o1868
12756A29152c5046D66956A52293k9686l9537K744b0213j16882f8498K2873k7936
12745g3561B74118C4912b27894i0534A43026K0004a49524B44326b70927B6746
$$ y = [-73367, -286297, 131202, -44362, -7041, -208251, 81592, -181074, -112170, -1990, 26930, 333694, -55911, 77904, -130991, -129017, 23753, 158855, 141327, -40150, 314551, -166546, -70522, -154528, -168848, 253325, -138531, 112222, -141342, -175510, 208833, 172472, -2969, -24850, 251150, -201269, 79392, -99907, 43802, 126484, -146071, 234593, 52367, 56054, 373210, 12847, 94226, 45901, 540, -83282, -28634, 56652, -111448, 125956, 147348, 255219, 66708, -29122, -136918, -176972, 85804, -239818, -133166, 305824, 206122, -302769, -73377, 191020, 129152, -35046, 466956, 152293, 122607, 83070, 85814, -20213, -137095, -68498, -45625, -73561, 274118, 34912, -227894, -90534, 143026, 163030, -149524, 244326, -270927, 26746]
12734A3634K37445L4480A6379a25209B78302a43980B33200A88J19337e9351J8233
12723d1118D0568d2965B76761O8507j12399p0682a85180C85604b32809L4695I0803
12711C4963M9919L504e9397B47712r9384K04055r3884I9551a3898e663B16869
12699H2047J41201C5238J7967a19886A82009m4026A7525J43315K8302a00126H9757
12687C17299r0076g1805C8970A046a62821B48807M9697j32645J61512j30649a74625
12675D6076a71498F4410a64839A20564L6749B973J17709M7977E0811a62121m657
12664a66778P0026A15848N3938p794C8911k650K07483r7699C9029N9552n383K1541
12652A14739m9093b41612B12716L21062B29626i9006C40209A3623a75054j35852
$$ y = [13634, 251079, 285559, 16379, -125209, 278302, -143980, 233200, 188, 119525, -59351, -41118, 40568, -42965, 276761, 345268, 232869, 162187, -185180, 385604, -232809, -198114, 90803, 34963, 84882, 88386, -59397, 247712, 148328, 352383, 258499, 99551, -13898, -5663, 216869, 82047, 223248, 35238, 53205, -119886, 182009, 137983, 17525, 160840, 189142, -100126, 89757, 317299, 227223, -71805, 38970, 1046, -162821, 248807, 298504, 165859, 327371, 196722, -174625, 46076, -171498, 64410, -164839, 120564, 157313, 2973, 120682, 168659, 50811, -162121, -166778, -96752, 115848, 169786, 161992, 38911, 36261, 243744, 146045, 39029, 98581, 93198, 114739, 65646, -241612, 212716, 533778, 229626, -99006, 340209, 13623, -175054, -310906]
12642c10906H3263b39398a15806B30107d0316D951c11760B00773f2275A46996
12631e0437A30918L27777F6629c561B81985J62772a08673D85482q2951a44435
12620a68220C65739j33664l6503d8270A08385J8211c19917f4436K8018H1031b9785
12608a48076A07629Q743i1058A0697J02253J02144C2198K39340b71140hF3612
12596B59526r3100R2191r8902k4035C8958L30445F9855a35759A48932A9151i0228
12584b8084B7089c3495C38199a26778D1964i3658C0977e788A43863a7115D6920
12572F9749J82549A1110b24310a2205A15598o077J15830h4748C02176a20330K1559
12561i8771B37437H0017J45243n6251J41315k3246F2140K27815A39830a16686
$$ y = [-310906, 83263, -239398, -115806, 230107, -40316, 4951, -311760, 200773, -62275, 146996, -50437, 130918, 458695, 66629, -3561, 281985, 444757, -108673, 485482, 402531, -144435, -168220, 365739, 232075, 195572, -48270, 108385, 126596, -319917, -64436, -36418, 81031, -29785, -148076, 107629, 116372, -91058, 10697, 112950, 215094, 32198, 271538, -271140, -8, 63612, 259526, 166426, 258617, 159715, 135680, 38958, 369403, 69855, -135759, 148932, 19151, -90228, -28084, 27089, -33495, 338199, -126778, 41964, -93658, 30977, -5788, 143863, -17115, 46920, 69749, 252298, 11110, -224310, -12205, 115598, 109521, 225351, -84748, 302176, -120330, -98771, 237437, 80017, 225260, 169009, 310324, 287078, 62140, 289955, 139830, -116686]
12550B85303f9699E6712b98207h4013J6319b3199B429K21506K8454l2678b07139
12538E24905k09827c25515A46640k3813c8782F504J76521m0778L18979d2671D1913
12526f9819b762A90609b4311A39401g9539B37177H2172f4169b852I4201a36293
12514a27123e5282B03547q3482L2797k7968L54149d7688E9069i4532j33603g5034
12502A32748E4294i0984l2643H409b26894L6730A97945a50554j50192a34251A91213
12490f5618B74873I1050e4519b6751n0026I3611b16670B05647H5561J29116i3542
12478c53501e3837j5721I3433j8143h8166j0664c4041o2030d3580j27779Q1956
12467h9403m17327D2445K98675b08293P3247k0281E5711J35214b29005K6940R118
$$ y = [285303, -69699, 56712, -298207, -84013, -67694, -23199, 2429, 223935, 252389, 219711, -207139, 524905, 315078, -325515, 146640, 122827, -38782, 6504, 183025, 142247, 461226, -42671, 41913, -69819, -2762, 190609, -24311, 139401, -79539, 237177, 82172, -64169, -2852, 94201, -136293, -127123, -55282, 203547, 120065, 152862, 124894, 479043, -47688, 59069, -94532, -228135, -75034, 132748, 54294, -90984, -123627, 8409, -226894, -190164, 197945, -150554, -300746, -134251, 191213, -65618, 274873, 91050, -54519, -26751, -76777, 93611, -216670, 205647, 85561, 214677, -93542, -353501, -53837, -69558, 93433, 75290, -88166, -98830, -34041, -96071, -43580, -171359, -89403, -506730, 42445, 341120, -208293, -135046, -155327, 55711, 190925, -229005, -202065, -192947]
12456a92947N0716b0235j40632H6375j5310a77168B64467A09530e3064B6544J14879
12445A41423b33168B1408J48414c02529e4236A05572b09596d013k98280B0997
12434f12081A0446J58995c4676A51054d9055A9370K11670a79046d5119A97437
12423i4868A71696G3574g4682J4914E2827c55826A57635C4303d4637D3257j6565
12412B6692L1073a3407A47489b81984D6092J47258g0957A40812K336b05865i1495
12400c33020c6273B51352o8900H990R819Q1174b22849a6411B10065O8866i761
12388a22880l2020K4986c801j15170c1117k54672J9175J06206j56531L2269B69023
12376e9650I4896J35952I7288j6082G786J7150i7745C7590J71691b93335a4908
$$ y = [-192947, -142231, -20235, -160867, 86375, 71065, -177168, 264467, 109530, -53064, 26544, 141423, -233168, 21408, 169822, -302529, -54236, 105572, -209596, -4013, -302293, 20997, -612081, 10446, 169441, -34676, 151054, -49055, 19370, 231040, -179046, -45119, 197437, -94868, 171696, 73574, -74682, -59768, 52827, -355826, 157635, 34303, -44637, 43257, 26692, 57765, -13407, 147489, -281984, 46092, 193350, -70957, 140812, 143148, -205865, -91495, -333020, -36273, 251352, 182452, 8990, 18809, 99983, -222849, -16411, 210065, 278931, -9761, -122880, -154900, -129914, -3801, -118971, -31117, -285789, -266614, -160408, -316939, -284670, 269023, -59650, 94896, 230848, 97288, 81206, 7786, 24936, -97745, 37590, 209281, -293335, -14908]
12364C06286e6996A41744Q6376a03958j33302g5017k0870A45141o4148g2374C40803
12352a13980B495J67185K11878I9526J61230a38562O992A94383b19818A70281
12341C1262M6303N0618a68890M1103C6613K50128b04720f4073B680J93749D8768
12329a81453o253N1850F231h5502E492e6078I2114i6857B9680d7655B4926a49052
12316A0054O9253B5149K7739J47484j7595a74314f7249n8879F4374c63378e2179
12304b7848H1418Q8136b69344C0085L3056a29582C45771A1277J56836o4339K59134
12293C62908j39521n4296O6007I0620K7911a49090e6433K0156D45432a54648H4474
12281d8570B06677D7391K85340K6457d6802A42005J53083K7086o5504l9927J8448
$$ y = [306286, -56996, 141744, 228120, -103958, -237260, -75017, -95887, 145141, 80993, -72374, 340803, -113980, 2495, 169680, 381558, 99526, 260756, -138562, -131570, 194383, -219818, 170281, 31262, 77565, 128183, -168890, -127787, 36613, 286741, -204720, -64073, 2680, 196429, 48768, -181453, -187706, -135856, 6231, -85502, 5492, -56078, 92114, -96857, 29680, -47655, 24926, -149052, 10054, 79307, 25149, 52888, 200372, 182777, -174314, -67249, -126128, 64374, -363378, -52179, -27848, 81418, 169554, -269344, 30085, 63141, -129582, 345771, 11277, 168113, 103774, 362908, 223387, 169091, 235098, 90620, 118531, -149090, -56433, -36277, 445432, -154648, 84474, -48570, 206677, 47391, 332731, 359188, -46802, 142005, 295088, 322174, 256670, 216743, 235191]
12270B35191R1320q8684D1790J4673m869a86290B2622K6223k1417N0512J22402
12259B00342j2608a45927A22652e5242F1010j4023i009A57524a59097A12697K35742
12248C48439n3062A228L6204a04878A40495B8124K08305C8195R3154K7286A248
12236A15048J43315E1724K43600A03740J08471O1916J25389A13663Q6132K29715
12226D29510d0978j61445F00130k6590C9553J19431K16957e9994B81417j25933
12216A55484J44135f2795j21183d7920E0227L19365A71759A335J93719l0611m38
12205A64005J04534A20119k2035f4855H6655P4251N8049I9892d04055E1754a82409
12193B3780M34688B20016g4381O397A65001h4549C33742a09523F5487R5829Q2170
$$ y = [235191, 326511, 237827, 41790, 56463, 51594, -186290, 22622, 48845, 27428, 77940, 200342, 187734, -145927, 122652, -55242, 61010, 46987, -9009, 157524, -159097, 112697, 348439, 295377, 1228, 37432, -104878, 140495, 28124, 236429, 38195, 131349, 158635, 1248, 115048, 258363, 51724, 295324, 103740, 212211, 274127, 399516, 113663, 199795, 429510, -40978, -202423, 600130, 573540, 39553, 158984, 375941, -59994, 281417, 155484, 299619, -62795, -183978, -47920, 50227, 369592, 171759, 1335, 195054, 164443, 164005, 268539, 120119, 98084, -64855, 86655, 160906, 218955, 99892, -404055, 51754, -182409, 23780, 458468, 220016, -74381, -67984, 165001, -84549, 333742, -109523, 65487, 161316, 243486]
12182B43486j06547r995j4222m4249K56773o6844q6677G9107b0968I4258F367
12170a08562k13807H3132J99150j18980J89460A00925K02162A08075B0411f8345
12159a00829C2143E51d4260B42456J14358h9855j16528I067c574j32022D94947
12147c11811c703a667B09530b7175l49910i4561A78561k1700a83007C78659b4270
12135b19399O7334A4709Q2156A4793C470e2574A2997M16042A65928a35710A87506
12123h1216B31943A8335M12948A87619J61654O6335A10345b69344Q2258h6435
12112B49306a1727j81805c4971A26446b6079j9270G3070M5452a48244A79456B0338
12100b38570A15849k9050l2748a18226B08693c56577A25702F1340a9494A38881
$$ y = [243486, 136939, 126944, 112722, 68473, 325246, 258402, 171725, 79107, -20968, 94258, 6367, -108562, -322369, 83132, 282282, 163302, 352762, 100925, 303087, 108075, 20411, -68345, -100829, 32143, 551, -44260, 242456, 356814, -89855, -206383, 9067, -3574, -135596, 494947, -311811, -3703, -1667, 209530, -27175, -377085, -94561, 178561, 156861, -183007, 378659, -24270, -219399, -152065, 14709, 96865, 14793, 3470, -52574, 12997, 429039, 165928, -135710, 187506, -81216, 231943, 18335, 431283, 187619, 349273, 415608, 110345, -269344, -187086, -86435, 249306, -11727, -193532, -34971, 126446, -26079, -45349, 73070, 118522, -148244, 179456, 20338, -238570, 115849, 86799, 54051, -118226, 208693, -356577, 125702, 61340, -19494, 138881]
12089H5741a93397A11890K6435a96230J6610B17032a29534B04825k967E4988J20499
12078A75487J98943N09101R01949D84661O8236B45487a58511j5668A11402k3733
12068H7669J06883q6205K21809f5136D8081J44206a98654C9209e1871j06617H2638
12056D52985p2110a7858A26155E3837a04993A15872b0705j31404D65997A5758
12045a71582O7636A93024D4995a18491A58112f9228j2505a4842k1243B00432Q7642
12034B88074b06545f3669A77784b25062B1745R5207c45998e1470a4390A97941
12023a71467h2834A91407a38760K7317j93353a43947H4226e6953a1378r2376G1112
12011A6638J18676m33a77653d9660j5848j10334L7761e0470k51420A06093I995
$$ y = [85741, -193397, 111890, 138325, -196230, -179620, 217032, -129534, 204825, 201858, 54988, 175487, 374430, 883531, 1785480, 484661, 552897, 245487, -158511, -174179, 111402, 87669, 194552, 108347, 330156, -65136, 48081, 192287, -198654, 39209, -51871, -158488, 82638, 452985, 380875, -17858, 126155, 53837, -104993, 115872, -20705, -152109, 465997, 15758, -171582, -103946, 193024, 44995, -118491, 158112, -69228, -81733, -14842, -36085, 200432, 288074, -206545, -63669, 177784, -225062, 21745, 116952, -345998, -51470, -14390, 197941, -171467, -82834, 191407, -138760, -111443, -304796, -143947, 84226, -56953, -11378, -103754, 71112, 16638, 135314, 134881, -177653, -49660, -65508, -175842, -138081, -50470, -301890, 106093, 9995]
11999A05642O0016c6630j68174a0007j71083E8116A5859a89126j1430A03265J62520
11988B65785r261O8488j52038a57205M4825E6929M3692R0593p9134c74791A9567
11976D3284f2671K3245n4434G2493a83324F8104a75114A09987J45164h2818E1425
11964H222b73808G4121K5138a35142d9170l692a9735A0506b02297D0132A953O1951
11952F3904K25932N7172A03311a81467A19841J15073q4662a98486B29160G3938
11941f8793A8329J12027a46046E7480K22030a28827D37666E6392J9684J19511
11931A95587H616L10526E3982a46923k9401M1769e5581k11487A67328o7508J8902
11920A18722B3181e5438p8402M3620m2542j56490a4934D02013e6926j46090c8906
$$ y = [105642, 165658, -36630, -204804, -10007, -181090, 58116, 15859, -189126, -200556, 103265, 265785, 256524, 325012, 172974, -157205, -112380, 56929, 100621, 191214, 112080, -374791, 19567, 43284, -62671, -39426, -93860, 72493, -183324, 68104, -175114, 109987, 255151, -82818, 51425, 8222, -273808, 74121, 99259, -135142, -49170, -52862, -19735, 10506, -202297, 40132, 1953, 63904, 289836, 347008, 103311, -181467, 119841, 234914, 150252, -198486, 229160, 73938, -68793, 18329, 130356, -146046, 57480, 279510, -128827, 437666, 56392, 76076, 195587, 8616, 319142, 53982, -146923, -176324, -134555, -55581, -267068, 167328, 99820, 118722, 23181, -55438, -133840, -90220, -132762, -289252, -14934, 402013, -56926, -203016, -38906]
11908B33857a45422a1314C04987A09185O3674a85638K3223e1564p8080d2789A968
11896b77665i6116L9592j27261A48989h3368A87287C72i3088Q055G8552c08696
11884b38515f735A69261G0095m358a47341A15188b67648B05672a14931l25363
11874d40294F3775J8845a07633q9464A51723a09023A04912M6495c04459i914l68073
11863c77987a07248E2557J58132a32528A40653a20252H5752C6768e10204i4192
11852A25652B3730P1336c1618B13839o9245a72657F0598c45144d1074l7337q113
11841h6524B45672e8004j93049A81636A5753P5281b98077B31903f2516I9132D1975
11829A48446L17248A16820c4908c992j85014A8654i7031j56557Q3738I4273Q9260
$$ y = [233857, -145422, -11314, 304987, 109185, 172859, -185638, -162415, -51564, -129644, -42789, 1968, -277665, -96116, -56524, -183785, 148989, -83368, 187287, 372, -93088, -85033, 78552, -308696, -238515, -6735, 169261, 70095, 65737, -147341, 115188, -267648, 205672, -114931, -440294, 63775, 82620, -107633, -197097, 151723, -109023, 104912, 151407, -304459, -9914, -377987, -107248, 52557, 210689, -132528, 140653, -120252, 85752, 36768, -510204, -94192, 125652, 23730, 95066, -31618, 213839, 144594, -172657, 60598, -345144, -41074, -78411, -86524, 245672, -58004, -251053, 181636, 15753, 91034, -298077, 231903, -62516, 99132, 41975, 148446, 465694, 116820, -34908, -3992, -189006, 18654, -97031, -253588, -169850, 94273, 183533]
11818A83533d04398A22317a33031e4981j10646d789j98753C70465a06515r3528
11808b00043A44063b15688E9099c5112A44318B9332b8036j41485L1070A00610
11797A69607c2272k06594O9869E13161c13101I1650L59235I3690b46910L0963
11787b15947L656K0563E2911b60488G3513a36962j41217E0574J47480b31923J12367
11776a19556C7039c01F5691B3165h8068H7270L790h9521k03334h4557j03021A32166
11763d49786J59148A63574B7079a59386c7041p8724M934K6067G7201K2487c46473
11751a61191B45340B8172a95758a4223A85916q0566K56676h1399A537h8436B19681
11739g1973D6088e8347A15441c9466j82482A43418J50205a20324B77431H9283
$$ y = [183533, -404398, 122317, -133031, -54981, -165627, -4789, -203542, 370465, -106515, -200043, 144063, -215688, 59099, -35112, 144318, 29332, -28036, -169521, -138451, 100610, 169607, -32272, -238866, -168997, 513161, -313101, 91650, 450885, 93690, -246910, -215947, -212291, -191728, 52911, -260488, 73513, -136962, -278179, 50574, 198054, -231923, -119556, 37039, -301, 65691, 23165, -88068, 87270, 91060, -89521, -292855, -84557, -187578, 132166, -449786, -290638, 163574, 27079, -159386, -37041, -115765, -110831, -84764, 77201, 99688, -346473, -161191, 245340, 28172, -195758, -14223, 185916, 105350, 362026, -81399, 1537, -88436, 219681, -71973, 46088, -58347, 115441, -39466, -221948, 143418, 293623, -120324, 277431, 89283]
11728b24472b4138A12346d10963a61643A12930b18785A1180g2989l2048C58809
11717G6217P4938m7846J57595F0692B1933a85069C03470A09437f9994n4834M7405
11706g7423C01411A9472a17598A1941b7843k4650H8772b72589g9395A13974A7842
11694G3513a11586l6389H8720a94156D6981J4897L7380B4532f4883k6167m5641
11683a36691p5421c9486A35945h7522B11202K3094n420a70319N4314B06835D1750
11671D15591a90648B29161a23990k51397J82449B02358g5043a4896E12315b83940
11660I8366j374k1648b12166B23249a50841A71272d0244A9577b7076A46285Q4836
11649B31121D9921i1806b3326Q812k42786k064A07884Q1115n2833E18J61841a59594
$$ y = [-224472, -24138, 112346, -410963, -161643, 112930, -218785, 11180, -72989, -105037, 358809, 76217, 151155, 103309, 260904, 60692, 21933, -185069, 303470, 109437, -69994, -124828, -77423, 301411, 19472, -117598, 11941, -27843, -52493, 88772, -272589, -79395, 113974, 17842, 73513, -111586, -147975, 88720, -194156, 46981, 61878, 99258, 24532, -64883, -91050, -136691, -212112, -39486, 135945, -87522, 211202, 234296, 228876, -170319, -116005, 206835, 41750, 415591, -190648, 229161, -123990, -375387, -192938, 202358, -75043, -14896, 512315, -283940, 98366, 96992, 75344, -212166, 223249, -150841, 171272, -40244, 19577, -27076, 146285, 231121, 49921, -91806, -23326, -14514, -257300, -259364, 107884, 188999, 136166, 518, 162359, -159594]
11636B05066c16799B59627a1065j43276i725D59341D241J97253c3581j98866j673
11625b34120g921B15487e6835K7383j38994j3528C33945c661G4417C6500L95351
11614D31851A42214J66571A34522b64477i480q2922A76644e7982G7144L9883c72675
11602i9011k3124b3548G1993J63355j16629g4925c4073B6383d8876a0925H5908
11590c2328A8958Q9512b08526d624A30041J89903I8989K81672q0458E1637J15317
11579A66954d4597p7320B18496N2719g0918j78835R5480N5333D19278A1625M4188
11568E5813Q9008a86099i098B04681k3007H2634f7386B08462J96234F4622r444
11557E5178K3651A7523c8333A91089I453L53657j71398J72293A04911f5667A2367
$$ y = [205066, -316799, 259627, -11065, -154341, -9725, 459341, 4241, 201494, -33581, -232447, -234120, -7921, 215487, -56835, -29452, -168446, -181974, 333945, -3661, 74417, 36500, 431851, 142214, 308785, 134522, -264477, -9480, -92402, 176644, -57982, 77144, 117027, -372675, -99011, -122135, -23548, 71993, 235348, 118719, -74925, -34073, 26383, -48876, -10925, 85908, -32328, 18958, 108470, -208526, -4624, 130041, 319944, 98989, 380661, 300203, 51637, 166954, -44597, -121917, 218496, 271215, -70918, -249753, -154273, -98940, 419278, 11625, 55813, 144821, -186099, -9098, 204681, 181674, 82634, -67386, 208462, 404696, 64622, 55178, 78829, 17523, -38333, 191089, 9453, 363110, 191712, 364005, 104911, -65667, 12367]
11545b56943E493K72073L636B0675L46687e6479J0910C20741m0094E281a96629
11533A44939K63936E4544P4600b0156A4291L1962A1710J76077a7978A41683c7747
11521a51043C22867j10422b26502d7862A06402a69478D11821a27649C4653d9752
11510A10631J65498A20161l2070J79990F7704a4537C17912i4176A17836J02765
11500B20601p8015F0843J53565b0638B46098A02356O1984a4899B47205j05638
11490A41567R387J90755a14541L782A44054K60612H9Q5912c07844h3606A75351
11478a15572A37602P9872L676l1472A2322K5512K72019G6759J65992c5493A31875
11466A98926r161a46909B24850c5476A26172K97787F4451J45034j03098J29488
$$ y = [-256943, 5493, 277566, 281202, 20675, 367362, -56479, -45569, 320741, 280647, 5281, -196629, 144939, 408875, 54544, 129144, -20156, 14291, 46253, 11710, 187787, -17978, 141683, -37747, -151043, 322867, 212445, -226502, -47862, 106402, -169478, 411821, -127649, 34653, -49752, 110631, 276129, 120161, 88091, 268081, 67704, -14537, 317912, -94176, 117836, 220601, 142586, 60843, 214408, -20638, 246098, 102356, 164340, -14899, 247205, 141567, 150954, 341709, -114541, -110759, 144054, 404666, 89, 86001, -307844, -83606, 175351, -115572, 137602, 217474, 221150, 189678, 12322, 37834, 309853, 76759, 242751, -35493, 131875, 198926, 189765, -146909, 224850, -35476, 126172, 423959, 64451, 209485, 106387, 235875]
11456B35875d7335a5190C17000e4148a5170A50735J82885g3294B69822K395D0014
11444G6617A6191M93416A31612b85910b492B43931A05325J99831A03344c5318
11433B55415HJ09407D698P0747b61694H5082b21076H0091A5907K35569a9138h421
11420C10432A01800K53293a52298a9733o2952A41477F3684J03586m9351d98612
11409a2923f196C9986a2951A71131L8690r2348a37017q6691b6214F1947C0418
11397C14592n1548r1600b05080c7162A30833c2797j66759P8309G9925d5139q4077
11386a29216p2174f0805q199j26766j76421L5460g0456C49502b9126B4377L27217
11375C51594a80630Q7190A686Q3343J88388D2617B877c7832j13425F2484K05473
$$ y = [235875, -47335, -15190, 317000, -54148, -15170, 150735, 333620, -73294, 269822, 272217, 40014, 76617, 16191, 509607, 131612, -285910, -2492, 243931, 105325, 305156, 103344, -35318, 255415, 8, 109415, 4698, 75445, -261694, 85082, -221076, 80091, 15907, 251476, -19138, -8421, 310432, 101800, 355093, -152298, -19733, -82685, 141477, 63684, 167270, 117919, -498612, -12923, -6196, 39986, -12951, 171131, 209821, 117473, -137017, -223708, -26214, 61947, 30418, 314592, 263044, 171444, -205080, -37162, 130833, -32797, -199556, -121247, 79925, -45139, -129216, -201390, -60805, -69004, -195770, -372191, -336731, -70456, 349502, -29126, 24377, 351594, -180630, -93440, 1686, 85029, 273417, 42617, 2877, -37832, -151257, 62484, 267957]
11364B67957N2876b87804J02916P3392A41350J00701h4407m09364A07737m6096
11354F1641a64686H098a44613n4k16504H1833c290B23600A7946P0745c015o0804
11342f3819j8693I943a69065B05365a4863E2702Q8424D3912h0948l382C04816
11330A9963P3644a74269k11523R1065C5589a12198D4978K02193a34428A32737
11319A88835a53877A68409J94315A5490N3578a50734J4521M0828A05194D2233
11308c51379c7833C6024b30509A88073M8177q8355b51997B34416q9036A5796i2130
11296D53745D7134J66129a87215M2930J3832e060j89149c5469l7596r0131L3902
11285a29294L4547p0088k1033D6810c2158B2940d41679B7085d4545B76705a79752
$$ y = [267957, 320833, -287804, -184888, -111496, 141350, 242051, -84407, -493771, 107737, 61641, -164686, 8098, -144613, -144667, -361171, 81833, -3290, 223600, 17946, 88691, -3015, -63819, -82512, 9943, -169065, 205365, -14863, 52702, 141126, 43912, -80948, -84330, 304816, 19963, 93607, -174269, -385792, -294727, 35589, -112198, 44978, 247171, -134428, 132737, 188835, -153877, 168409, 362724, 15490, 69068, -150734, -136213, -95385, 105194, 42233, -351379, -37833, 36024, -230509, 188073, 236250, 147895, -251997, 234416, 145380, 15796, -92130, 453745, 47134, 213263, -187215, -144285, -130453, -5060, -194209, -35469, -73065, -163196, -129294, -94747, -164835, -185868, 46810, -32158, 22940, -441679, 27085, -44545, 276705, -179752]
11273A37773a81971A4158c217l4595j45871o4058e5430q6815k54142g3011B0951
11261i0597g634C0376b3251A01049J32088m083j0643h7624j75923A18680a06099
11249c70828i284l5081A02504N2876c312j70393A8669J37176A3432J40288O7481
11238B21201m5988E3868Q7737h1897A58264h219D8198J81092B5161a75069I7923
11226C6290d8454A69522f827j951j65647a0049A16027c0108q4611L8900J3508
11215f2311J7065g221A35947L0460b87001N3099c3056r6098G833J98355i7007
11203a45585e7479a3233j73572M8868C0143b54389P531e9192j56267j85624B9294
11191b60171o4201a46572A48514a02672I5389N6866d69940B19892q2632i623m1740
$$ y = [137773, -181971, 14158, -3217, -37812, -183683, -247741, -55430, -142245, -396387, -73011, 20951, -90597, -7634, 30376, -23251, 101049, 233137, 229054, 218411, -87624, -263547, 118680, -106099, -370828, -9284, -44365, 102504, 155380, -3312, -173705, 18669, 155845, 13432, 153720, 221201, 175213, 53868, 141605, -81897, 158264, -8219, 48198, 229290, 25161, -175069, 97923, 36290, -48454, 169522, -6827, -8778, -174425, -10049, 116027, -30108, -114719, -75819, -62311, -45246, -7221, 135947, 166407, -287001, -233902, -33056, -129154, 7833, 206188, -97007, -145585, -57479, -13233, -186805, -137937, 30143, -254389, -246858, -59192, -215459, -401083, 29294, -260171, -324372, -146572, 148514, -102672, 95389, 152255, -469940, 219892, 137260, -9623, -51363]
11180e1363A48887e5624A2229g3059B63452R4262j16598a04666B7578b42473A3586
11168A21507a93251N5716H7811b9592j38064n017o6915A30916e9263A41746E3827
11156A17458a82040m39q6492J10985l97842f4247j55251h8219j53828E3832M5264
11145I9096l433b60167J07554B05121r196f1275p747a4153k48240G1456J83170
11134B54626H5802l5214O32918H3995L01667j10284L0317a65242H6509J42232
11124B28741c03598a28788d1576A84157m3297f9754m4874A69715b80140B55146
11113f1490O538l718A35846m9945K93429f7456c1749A88195o1095c2349Q223k25491
11101b49617A03534c15649H6961k4746i1142B08188g4578A01249K23370e1267
$$ y = [-51363, 148887, -55624, 12229, -73059, 263452, 357714, 241116, -104666, 27578, -242473, 13586, 121507, -193251, -137535, 87811, -29592, -167656, -172673, -239588, 130916, -59263, 141746, 53827, 117458, -182040, -182479, -268971, -157986, -555828, -64247, -219498, -88219, -242047, 53832, 99096, 95663, -260167, -152613, 205121, 195925, -61275, -69022, -14153, -262393, 71456, 254626, 85802, 50588, 683506, 83995, 385662, 275378, 305695, -165242, 86509, 228741, -303598, -128788, -41576, 184157, 140860, -69754, -114628, 169715, -280140, 255146, -61490, -54952, -58670, 135846, 85901, 379330, -67456, -31749, 188195, 127100, -32349, -24126, -249617, 103534, -315649, 86961, 62215, -91142, 208188, -74578, 101249, 324619, -51267]
11090B54788m4267e5444k1570r4957a8243G5640J97100k4736A350a7260r1437
11079a08697B76804j5580q1689R3088q8483n6377L51927j28570j00857n2825J03523
11068C00961R3993o3699D8674J92753K90955A61182K37311j50358R0877J52432
11058D91444J32462k9995A97211N20083l53354M61637k30550J20440J58412P5492
11048I49371j91589k38226J96054j92754N2216j28260l1582K38385k3495N3098
11038F83218L7421p3081K97652k28127o6321J6930J75762l89182J65558l8590
11028E81240o4987q4074J85019j67241K42621j44957j61098J14967L6576q7313
11018D50753K22454j75542L52145r9755k78843K0047j21251M06586n8690l44931
$$ y = [254788, 210521, -55444, -77014, -171971, -18243, 75640, 272740, 248004, 1350, -17260, -108697, 276804, 261224, 179535, 272623, 184140, 127763, 479690, 351120, 250263, 197438, 300961, 394954, 331255, 48674, 241427, 532382, 161182, 398493, 248135, 339012, 491444, 623906, 593911, 197211, 717294, 363940, 825577, 595027, 715467, 873879, 949371, 757782, 519556, 715610, 522856, 575072, 446812, 415230, 653615, 630120, 683218, 720639, 647558, 945210, 717083, 650762, 667692, 843454, 454272, 619830, 581240, 516253, 432179, 617198, 449957, 692578, 547621, 386523, 501490, 538066, 450753, 673207, 497665, 849810, 750055, 471212, 491259, 370008, 776594, 717904, 372973]
11008C72973J38059L81659l73700Q32B17319Q0965J23374k2969K63061k94402
10998C67348K72640R256q8912L11383l55589L49761C88053K93792j39695K72289
10988H14439p0934k15317j22977M10107J72154k22178K18678l9419J45619O9778
10978A159950J62099L48274k9467K62864J0363L31876O8533L73564J04043m91857
10968B300242j63256K13088l31117j96473j26380j26625L41764r8131j59138K15850
10958A869824J81092J40197L1092l62048l43945l7356j04972k38309k23890j65743
10948G45942k78470k21563M20726k65806J42237M2966j67993j93623f0565j59117
10938b19682A94272Q6839k6504P4435a48714j06828J24892q736c8930a1077A62086
$$ y = [372973, 511032, 892691, 518991, 519823, 217319, 298284, 421658, 398689, 661750, 367348, 639988, 649244, 560332, 871715, 516126, 865887, 388053, 681845, 542150, 814439, 743505, 528188, 405211, 815318, 987472, 765294, 983972, 944553, 1090172, 1159950, 1322049, 1670323, 1640856, 1903720, 1914083, 2245959, 2314492, 2688056, 2792099, 2300242, 2136986, 2350074, 2018957, 1822484, 1696104, 1569479, 1911243, 1813112, 1653974, 1869824, 2050916, 2191113, 2222205, 1860157, 1516212, 1478856, 1373884, 1135575, 911685, 745942, 467472, 245909, 666635, 400829, 543066, 586032, 418039, 224416, -60565, -219682, 194272, 281111, 254607, 329042, -148714, -255542, -130650, -139386, -38930, -11077, 162086]
10926D4826g2027C37028n4880B7541J58842c6671K278B6624K44373F1076g3326
10914I943K6974K12995d753B8205P8727c65260a39165L1667n0464O5760D9436
10902b09706C33305b0793A01831L61555H2590a03988G5967k9517P5987K97491
10892D19928b20256C3154h3286j26537R3797B37379a62575k03525A28454B3853
10881a23411H1425R9191b06336a7061J430k15980C2851g4641J6408k1072J6544
10870f2761A38278E9137L1703N8482h4563a2991j65074A01728A9938J79224d7167
10858B51166a82122d2184C8978R3604Q7022D6205a38546q3099C21909A7187J482
10847A8669a04522j63575A24797a46215M6398j4242B66740c6538p8973A85157
$$ y = [44826, -72027, 337028, 282148, 27541, 186383, -36671, -34393, 26624, 270997, 61076, -73326, 9943, 36917, 249912, -4753, 28205, 106932, -365260, -139165, -107498, -157962, -92202, 49436, -209706, 333305, -20793, 101831, 463386, 82590, -103988, 75967, 46450, 122437, 419928, -220256, 33154, -83286, -209823, -116026, 237379, -162575, -366100, 128454, 23853, -123411, 81425, 180616, -206336, -17061, -15631, -231611, 32851, -74641, -58233, -79305, -62761, 138278, 59137, 90840, 149322, -84563, -12991, -178065, 101728, 19938, 199162, -47167, 251166, -182122, -42184, 38978, 132582, 219604, 46205, -138546, -221645, 321909, 17187, 18669, -104522, -268097, 124797, -146215, -99817, -114059, 266740, -36538, -115511, 185157]
10836A4936g3833B53471a60855p4360E9478c0795m7564C63231n3756F4849g1062
10824A45590h8907j90544l9426a47274j29444J12975k2998D155b23690B25784
10813b81848B52974O9931A27808Q4001F1907O524c24726E1488a86332B0618b27999
10801e6872r0272A27329d750j99447G6234b38618h551l2573B25687d6898j06584
10790a53482H065e1825b0719A03861j008J8353J13093c09396Q2114a03276j58389
10779b61665f9460A59868a10702k38456D02021H9548P0132C130a27469H1797Q223
10768I0020b51842D9889h1761m8268j52370E2122d2265C00286j20029a94418N0912
10757a43506O9230K4158p3564J9854A91546A9745d447n4551L597B82084c40839
$$ y = [14936, -73833, 253471, -160855, -235215, 59478, -30795, -78359, 363231, 309475, 64849, -71062, 145590, -88907, -279451, -318877, -147274, -276718, -163743, -186741, 4155, -223690, 225784, -281848, 252974, 322905, 127808, 211809, 61907, 68431, -324726, 51488, -186332, 20618, -227999, -56872, -147144, 127329, -4750, -204197, 76234, -238618, -8551, -41124, 225687, -46898, -153482, 8065, -51825, -20719, 103861, 102853, 121206, 234299, -309396, -227282, -103276, -261665, -69460, 159868, -110702, -349158, 402021, 89548, 159680, 3130, -127469, 81797, 90020, -251842, 49889, -81761, -130029, -282399, 52122, -42265, 300286, 180257, -194418, -143506, -74276, -50118, -123682, -103828, 191546, 19745, -4447, -58998, -55401, 282084, -340839]
10745a58990A84889c12066i9462B3802J81092a58920H9435l5223O7599k3106J94289
10734B92994A09192b17542m107N9256B27068h1970o9551O307j78668b2645n4537
10723g7182A91413n4824b98990R0342a01520B28733p3376a68267C5748l309a86814
10711D3476b32497i7580l3840A04450a68620A22029b9632G3766a89667l668b0096
10699A22130a73049D8079a19573q0381O5038A4574a43843e4224g873p3462M207
10688g7128B5621b41196B69352C3522R2500A1759M8469L85047a27973o9816A1438
10676B4703K5071J38293b5354A52500a28593A30243K363k367a13728c2546p4098
10665a06644c3260j46912A18237B0888e16501A40552B5890a25003C0202c42389
$$ y = [-158990, 184889, -312066, -99462, 23802, 204894, -158920, 89435, 54212, 121811, 98705, 292994, 109192, -217542, -221649, -162393, 227068, -81970, -151521, -145214, -323882, -22645, -77182, 191413, 136589, -298990, -208648, -101520, 228733, 155357, -168267, 35748, 32439, -186814, 43476, -232497, -97580, -131420, 104450, -168620, 122029, -29632, 73766, -189667, -193335, -20096, 122130, -173049, 48079, -119573, -199954, -134916, 14574, -143843, -54224, -7873, -81335, -77128, 25621, -241196, 269352, 33522, 126022, 11759, 60228, 445275, -127973, -197789, 11438, 24703, 49774, 188067, -25354, 152500, -128593, 130243, 132606, 130239, -113728, -32546, -106644, -33260, -180172, 118237, 20888, -516501, 140552, 25890, -125003, 30202, -342389]
10654e2803A89618c1163l58710a34867l8264N0234A44614a95380g1184C301d364
10642B48678l4861p8266k3762L89749a0914I7962d1683a1792K702l14310R4869
10631b28531a3526k63859J33237b984j51543C10298b51115a04836o8624B00073
10620a21402j03242a06165M5735A37526b49617I6200a68660k3500G4928B7702
10609A59191L9627f4479l10573A67253E0771a69436k7585K3114d6203j21424N7722
10598a09905I5011K44261Q2013a00545b7092k03609h5155l4548p7142k14083D40265
10586A95028B7129J75635K50459G5486q825f6000k6860A28720D2828f0063j43921
10575b03984d9030j79358r488A58796P4838a48412B37482D1457c1093l72190g4465
$$ y = [-52803, 189618, -31163, -389873, -134867, -173131, -122897, 144614, -195380, -71184, 3301, -4364, 248678, 213817, 135551, 111789, 501538, -10914, 97962, -41683, -11792, -9090, -323400, -228531, -13526, -277385, -144148, -2984, -154527, 310298, -251115, -104836, -173460, 200073, -121402, -224644, -106165, -60430, 137526, -249617, 96200, -168660, -192160, 74928, 27702, 159191, 198818, -64479, -375052, 167253, 50771, -169436, -197021, -173907, -46203, -167627, -109905, 95011, 339272, 421285, -100545, -27092, -230701, -85155, -119703, -196845, -410928, 440265, 195028, 27129, 202764, 453223, 75486, 66661, -66000, -92860, 128720, 42828, -60063, -203984, -49030, -228388, -237876, 158796, 233634, -148412, 237482, 41457, -31093, -403283, -74465]
10563c24622m7742J36440I7211l2016K12026a74760C7963r851Q3470M3554b10547
10551e8029H8559e1240F9243B770c55397B69536d8938p1699I6942b21352J5205
10540b06147C25792c1399H4324a55758F9210a70977d3601q2757B06913a60737
10529b8827H602b06746d818C5723q071e8704j66010C8845b38425A27435b13392
10517A7733O210J56216K7790a63322A6479L40532A41256G777J35694n5015a98443
10505b91119F0044i9650B1194N4456J65542c4252k73157A28619d6952K0396H3223
10493h0467n5071O1221C211b7843j53916C5727b13090J9319H153L44068a0397
10481B23977J53721j6681H5359J80742a4932B37444O6601b64317B31808D9689
$$ y = [-324622, -372364, -235924, 97211, 65195, 277221, -174760, 37963, 28112, 111582, 155136, -210547, -58029, 88559, -51240, 69243, 2770, -355397, 269536, -48938, -120637, 96942, -221352, -206147, 325792, -31399, 84324, -155758, 69210, -170977, -43601, -126358, 206913, -160737, -28827, 8602, -206746, -4818, 35723, 27652, -58704, -224714, 38845, -238425, 127435, -213392, 17733, 23943, 180159, 207949, -163322, 16479, 357011, 141256, 7777, 143471, 88456, -198443, -291119, 60044, -99650, 21194, 75650, 241192, -34252, -307409, 128619, -46952, -26556, 83223, -80467, -135538, -74317, 3211, -27843, -181759, 35727, -213090, -193771, 8153, 352221, -10397, 223977, 377698, 361017, 85359, 266101, -14932, 237444, 304045, -264317, 231808, 49689]
10470a6437m8185a569B46340j07688a49502e5439A47227b0409D8894R7766d5218
10458a23792a6237j10092A45518b3209n751j79140H9432M5954i095k43801B07038
10446a52439p4427a7272j84826A95295a42821O9412A42634j8607Q6449c78877
10435A76557b40220B57395p4457J2579g8379A82761a32112r6748C93231F8970
10424b11018A23325b82425a28893m1051M8952j99538E4832a28517b1059A41674
10413A39783q035g4987o5099j23522C03369E4414b37939O714h5473C5597e5303
10401a35935M7778A44739D3047g283j5920j50441B19282L57578I0981M5753J06271
10390B43005P9198B822a9800B95797J18483a16041j86870d2262D99412B31011
$$ y = [-16437, -64622, -1569, 246340, 138652, -149502, -55439, 147227, -20409, 48894, 146660, -45218, -123792, -16237, -126329, 145518, -23209, -28960, -208100, 89432, 135386, -9095, -252896, 207038, -152439, -226866, -17272, -202098, 195295, -142821, -73409, 142634, 124027, 210476, -378877, 176557, -240220, 257395, 182938, 195517, -78379, 182761, -132112, -228860, 393231, 68970, -211018, 123325, -282425, -128893, -169944, -120992, -320530, 54832, -128517, -21059, 141674, 139783, 131748, -74987, -140086, -263608, 303369, 54414, -237939, -231225, -85473, 35597, -55303, -135935, -88157, 144739, 43047, -7283, -23203, -173644, 219282, 576860, 90981, 136734, 243005, 322203, 2822, -19800, 295797, 414280, -116041, -302911, -42262, 499412, 231011]
10379a15564D11925a0624A91761d4291A14141B5514J68409M35494B24182K32438
10369D56620j54179A28577L78137j15339J78510j45721j12572G8989J16098J9928
10359B15015K94755B10588A9459K10000J9661n4876O3460j05767O25970C34015
10348E49452k03758D1780M46644J56734l11105A46425K51515D3789J36771l1724
10338A48836F8173g13E4760J18355J38316C9390R6328b54661C8261J13154j865
10327A49550a05735n8043e626I4208L2268P3276L2128I5528J71759b02218A05798
10315b31601F68762B37452b42972A93498h1169j32871g6639K9482K0689l5184
10305f1652j5556B72540E5436a68957B62532c04087h8674L6243q8092E04858j96223
$$ y = [-115564, 411925, -10624, 191761, -44291, 114141, 25514, 193923, 629417, 224182, 456620, 302441, 128577, 506714, 391375, 569885, 424164, 311592, 78989, 195087, 215015, 509770, 210588, 19459, 229459, 249120, 194244, 257704, 151937, 777907, 334015, 549452, 345694, 41780, 488424, 645158, 334053, 146425, 397940, 43789, 180560, 148836, 68173, -713, 54760, 173115, 311431, 39390, 135718, -254661, 38261, 151415, 149550, -105735, -163778, -5626, 94208, 126476, 199752, 231880, 95528, 267287, -202218, 105798, -231601, 668762, 237452, -242972, 193498, -81169, -214040, -76639, -47157, -26468, -61652, -77208, 272540, 55436, -168957, 262532, -304087, -88674, -52431, -140523, 504858, 308635]
10294C08635a54559M2337A41816b21382a2688o453p1200c8365l0645A08047b1391
10282b26427A494a64225K3150j10308a19286C092f8528A45233B1586J1518c38879
10270C19612d12201J78579E4593b942C4353K91187G8905l1407K63348j37444M03102
10259E76504B37704D4290M12938A18583O4587n086q2630d0372A82183c2541k27498
10248b60039B39247a49962m3546b3887g93A51556b97353a6534l06320A10874l8091
10237G2783O9109b0638A6107M8397a20045K2153p6307c5583O373F5317b639o3022
10225f5661m9407K5331l2603A472L5318a36069E6116a82741J763d5314p9748j38279
10213b63341g5281K4681B61309j22161h0062j81624L8350i3953A13587f2418p1957
$$ y = [308635, -154559, -112222, 141816, -221382, -12688, -19141, -90341, -38365, -69010, 108047, -21391, -226427, 1494, -164225, -141075, -251383, -119286, 3092, -68528, 145233, 21586, 33104, -338879, 319612, -412201, -233622, 54593, -2942, 34353, 325540, 78905, 47498, 310846, 173402, 576504, 237704, 44290, 457228, 118583, 183170, 178084, 95454, -40372, 182183, -32541, -260039, 239247, -149962, -193508, -23887, -793, 151556, -297353, -16534, -322854, 110874, 72783, 141892, -20638, 16107, 64504, -120045, -97892, -174199, -35583, -29210, 65317, -2639, -65661, -115068, -89737, -122340, 1472, 36790, -136069, 56116, -182741, -180978, -45314, -125062, -263341, -75281, -50600, 261309, 139148, -80062, -261686, -223336, -93953, 113587, -62418, -134375]
10202a34375p4776I0995b87023h0750B8180J31022b44655B18485a20216B33366
10191b8874A53329b74546B24069a17263D8206b33548d9812E2121a08175m6076
10181a54251e8063j47773A97821I0053k1590f0939A13570a39543I1489a71194
10170a12584e2549b4292o5511j35504R9966N1771o3011B12095a59022k12013c018
10158g8449K9862m9690F1152L34592I1783i8585L2920j80389B09791e1887A70817
10146a7062k11607A59266K8374H4263G994b9581C640i4133A58848h0565n3852
10135a34417A53789a63637f050j5668k37481A65476a23297P347F0915f10911K06057
10124d04854J5485J57719k38038J52367C0582L0864M1413b7219k12259D352c679
$$ y = [-134375, -209151, 90995, -287023, -80750, 28180, 159202, -244655, 218485, -120216, 233366, -28874, 153329, -274546, 224069, -117263, 48206, -233548, -49812, 52121, -108175, -154251, -58063, -205836, 197821, 90053, 68463, -60939, 113570, -139543, 91489, -171194, -112584, -52549, -24292, -89803, -225307, -125341, -73570, -136581, 212095, -159022, -371035, -3018, -78449, -48587, -98277, 61152, 395744, 91783, -98585, -65665, -246054, 209791, -51887, 170817, -17062, -228669, 159266, 187640, 84263, 7994, -29581, 3640, -94133, 158848, -80565, -134417, 153789, -163637, -6050, -21718, -259199, 165476, -123297, -115950, 60915, -610911, -404854, -389369, -231650, -469688, -317321, 30582, 61446, 102859, -27219, -239478, 4352, -3679]
10112a65497A55233N6469g8933A28057B0558J31565a14496B24062a32529C3797
10101A76390q3662F039c28093h6604j67133d3153j36691A15571g0719j93243M741
10090b59221F7149R1787b10293B25254j07744c97332h3095A37596c05653H5476
10079b25630A27262a06683c5809B8369c24261a02617A38973b97623A85978A3245
10068a87811q4105a26340H7948f3403q0469B24110j6975c162j03558p0141P3810
10057a03051H3384J50462E3298b7276j72255A68212a08340c1550A53371i3447
10046a0874l80046a93811h7253e132j08180j6516B83454c66158a32287r2475m2809
10035b67571O5045I32L1225a41574A61121p4067f9555r4609n1723f270m6256A08249
$$ y = [-165497, 155233, 211702, -78933, 128057, 20558, 152123, -114496, 224062, -132529, 33797, 176390, 92728, 6039, -328093, -86604, -253737, -43153, -179844, 115571, -70719, -263962, -259221, 67149, 158936, -210293, 225254, 117510, -397332, -83095, 137596, -305653, 85476, -225630, 127262, -106683, -35809, 28369, -324261, -102617, 138973, -297623, 185978, 13245, -187811, -271916, -126340, 87948, -63403, -143872, 224110, 207135, -3162, -106720, -176861, -103051, 83384, 233846, 53298, -27276, -199531, 168212, -108340, -31550, 153371, -93447, -10874, -390920, -193811, -87253, -5132, -113312, -129828, 283454, -366158, -132287, -224762, -267571, -202526, 932, 32157, -141574, 161121, 87054, -69555, -164164, -215887, -6270, -52526, 108249]
10022b17538i5148A82044E7184e9892n3205H2073K6731i9375F4672a71997I2395
10010b98456J38315r3221A78285n2041b26717R8430j54411i7745r0617k5416A49564
9998d4519a0757A4476a92175F7401b07094A56052m4043d3896j16267k35121I0413
9986e7899F8147e2362p5109j54886C5415K6403F154a10040k7053d5453n00667
9975e46120a11157j11919A0209i2330j52134K983F6034c88405A25059c17480G0898
9963A98789h827j03101b3861l29924N9593g2227L3347D8695J09629N7781C2031
9951a94410g5702j05451d5939B9037a01597D8333f0083A34573C7442d6646j44140
9940a90786A8250J55805p2426b46974A67336c69572a10002c3510C33400a21390
$$ y = [-217538, -95148, 182044, 57184, -59892, -113097, 82073, 108804, -99375, 64672, -171997, 92395, -298456, -160141, -253362, 178285, 126244, -226717, -128287, -282698, -97745, -188362, -213778, 149564, -44519, -10757, 14476, -192175, 67401, -207094, 156052, 112009, -43896, -160163, -395284, 90413, -57899, 68147, -52362, -127471, -282357, 35415, 61818, 6154, -110040, -137093, -45453, -546120, -111157, -223076, 10209, -92330, -244464, -241481, 66034, -388405, 125059, -317480, 70898, 198789, -8827, -111928, -23861, -353785, -294192, -72227, -38880, 48695, 158324, 216105, 32031, -194410, -75702, -181153, -45939, 29037, -101597, 48333, -60083, 134573, 37442, -46646, -190786, 18250, 174055, 101629, -246974, 167336, -369572, -110002, -33510, 333400, -121390]
9929A40484b83032O045G1423b56068M8605D7151a77040i28m18652D2102b767j38726
9917a41493D2483a26354I6052c4466j96940m7310R7684q236B8149e3263A51763
9905C98537a97714f6270G254e7172B36673a58614j56669c9649J8157j46381f8022
9893A7300a86901l480B41513i1204A48678i3093j07462H1328a10140A72923M1971
9882B14894a03718E7397j8892A042c4458k684H2910a12433B03629K239B2247b65486
9869C5175a00008B26699o4866h779A69847f5944B85844c2489H9944J7674b83988
9857A09876g9229E1479i2898G3338o661E285a38240G9184e5516A64397p2052a35681
9844H0478a89969N626C8548h6483A5235a38138D8419a54555F1262J75161c10566
$$ y = [140484, -283032, -276987, 71423, -256068, -207463, 47151, -177040, -928, -419580, 42102, -2767, -141493, 42483, -126354, 96052, -34466, -231406, -278716, -181032, -189268, 28149, -53263, 151763, 398537, -197714, -66270, 7254, -57172, 236673, -158614, -315283, -39649, -21492, -167873, -68022, 17300, -186901, -190381, 241513, -91204, 148678, -93093, -200555, 81328, -110140, 172923, 214894, -103718, 57397, 38505, 1042, -34458, -37142, 82910, -112433, 203629, 205868, 22247, -265486, 35175, -100008, 226699, 161833, -8779, 169847, -65944, 285844, -32489, 89944, 107618, -283988, 109876, -79229, 51479, -92898, 73338, 66677, 5285, -138240, 79184, -55516, 164397, 92345, -135681, 80478, -189969, -184343, 38548, -86483, 15235, -138138, 48419, -154555, 61262, 236423, -310566]
9832A84997a2479k16551p0941J02983e1239A6101K94074h4211A92097c88962B26637
9820f259B7442a13595o8987j37360R1880j09163a09454H2901B6408f9958c0104
9808A68400l1256L1942G3072N9032E5038j0989a54955B1468a16621n620p7149
9797a99390a8460J741l8631j4080j554L2964o8779D3982a91399J6429r176j48065
9785c32211a57128j3629C47755a76159C8770K73520a42249n2480I034c2379l32637
9774c65016D3266e5610D20875A1223b11397A3640c00349Q0623b2071o369j9870
9763d8310A26363m2547g7503j06756A57225a68673K9565B11636I9631a17064H3928
9751C7296b08370j34561J35353a3604j1514n4957j04137R0308K7530A27633B7132
$$ y = [184997, -12479, -229030, -299971, -196988, -51239, 16101, 310175, -84211, 192097, -388962, 226637, -6259, 27442, -113595, -182582, -319942, -228062, -337225, -109454, 82901, 26408, -69958, -30104, 168400, 137144, 169086, 73072, 132104, 55038, 44049, -154955, 21468, -116621, -122241, -199390, -18460, -16719, -55350, -69430, -70984, -38020, -106799, 43982, -191399, -174970, -184146, -332211, -157128, -170757, 347755, -176159, 38770, 312290, -142249, -194729, 9034, -32379, -365016, 43266, -55610, 420875, 11223, -211397, 13640, -300349, -219726, -22071, -28440, -48310, 126363, 83816, -77503, -184259, 157225, -168673, -139108, 211636, 99631, -117064, 83928, 37296, -208370, -342931, -207578, -13604, -25118, -80075, -184212, -93904, -66374, 127633, 27132]
9739I7940d35636J88238I3520l4517b45690Q5526A9589h8930j04969l0249b7545
9727D14755E935M8329R0009J25465a93214I4410A9806b90229I007M34770b05063
9715h7964k62415J05687A10898f9775B12711a3981r976A92489h8789j4163r7023
9704a99975M1561k12226A83494a20810r4203A77870i8260j101n2969e1258n6518
9693a07776o6869l95b9588J1463j05422d5514m4104k40821A2655Q6409m3271e5558
9680b2929A03476K66240c7384j07372J8195A47314i8119j00368j4239j84843a20054
9668a14559I3975d6324B67301b68280L3572A24049F697b11833D2823c37523E30
9656b18805E6502b61605j3778B9394a06058b3149n30256c1225k5187A04303J8571
$$ y = [97940, -435636, -247398, 93520, 59003, -245690, -160164, 19589, -88930, -193899, -224148, -27545, 414755, 5935, 54264, 144273, 269738, -193214, 94410, 19806, -290229, 9007, 443777, -205063, -87964, -350379, -244692, 110898, -69775, 212711, -13981, -23957, 192489, -88789, -102952, -199975, -158414, -370640, 183494, -120810, -215013, 177870, -98260, -99361, -152330, -51258, -107776, -174645, -175040, -29588, -18125, -123547, -45514, -89618, -330439, 12655, 99064, 55793, -55558, -22929, 103476, 369716, -37384, -144756, -126561, 147314, -98119, -198487, -212726, -397569, -120054, -114559, 93975, -46324, 267301, -268280, -234708, 124049, 6697, -211833, 42823, -337523, 530, -218805, 56502, -261605, -275383, 29394, -106058, -23149, -553405, -31225, -56412, 104303, 122874]
9645A22874b41491h5852A07310a76918H0971a23234d7469A88898F2122g8246B1719
9633a6112H782J27280D3733a46218J4401k93948J29037J34037A25240J14406j18913
9622A20733d15242B45898a22340A1993R1586Q8140c5811k40890a20498m622l1990
9611a57110P4042j54529l9934A22327b8593j80461l7831a02173l3605E9088L7263
9600I6351M5051D0088h29j04182K4219c5728p2678j67323J2946i9709A93055b59404
9587h0445I2383a36610C4033Q9767b29890A66186o1670A5938c96481a2998j74393
9576a87391n7838H2431a25834j2389a1217p7165G4450a55238A27387h5159D2202
9564A1704a9354A30837f7789j07683j51012J58640F0337F61a66959j0313A75326
$$ y = [122874, -241491, -85852, 107310, -176918, 80971, -123234, -47469, 188898, 62122, -78246, 21719, -16112, 8782, 136062, 43733, -146218, -131817, -425765, -296728, -162691, 125240, 239646, 120733, -415242, 245898, -122340, 11993, 103579, 191719, -35811, -276701, -120498, -125120, -157110, -83068, -237597, -277531, 122327, -28593, -209054, -246885, -102173, -135778, 59088, 96351, 141402, 40088, -829, -105011, -80792, -35728, -108406, -275729, -262783, -99709, 193055, -259404, -80445, 92383, -136610, 34033, 123800, -229890, 166186, 104516, 15938, -396481, -12998, -187391, -245229, 82431, -125834, -138223, -11217, -88382, 74450, -155238, 127387, -85159, 42202, 11704, -19354, 130837, -67789, -175472, -326484, -167844, 60337, 661, -166959, -177272, 175326]
9552a63529n6200a2741k4155a0159p3110r7367r3468e7133j45744o8873P4772
9541a96978c8676A97089a3954A86661c03022A349b29122b2374G3469L186P8010
9530A54665b34071N2640A42422c08674a5085C9745c240H7414K2431D5520J00647
9519A46167l997R0975i2039p1166C2442a47369K4584e5932D9807a20781A52698
9507b606j84676j01996e2459O249j37009p6405j27725f1102l79189f1493A53878
9495d5047A46071a27741k6690A55303A398a12124C1772b0525j6600A67910b6974
9483a32084f2121B95101a31086M8970j02452C3933K570K6867a44622q7472j17223
9472c49317d8757D7488F622h8208n2690j69975a02293H2558b92861A10974a21303
$$ y = [-163529, -219729, -12741, -36896, -10159, -83269, -180636, -274104, -57133, -202877, -271750, -196978, -38676, 197089, -13954, 186661, -303022, 1349, -229122, -22374, 73469, 76655, 154665, -234071, -181431, 142422, -308674, -15085, 39745, -3240, 87414, 109845, 45520, 146167, 142170, 233145, -92039, -163205, 32442, -147369, -122785, -55932, 49807, -120781, 152698, -2606, -187282, -289278, -52459, -46210, -183219, -259624, -387349, -61102, -440291, -61493, 153878, -45047, 146071, -127741, -154431, 155303, 1398, -112124, 31772, -20525, -37125, 167910, -26974, -132084, -62121, 295101, -131086, -82116, -184568, 33933, 36503, 63370, -144622, -232094, -349317, -48757, 47488, 6622, -88208, -140898, -310873, -102293, 82558, -292861, 110974, -121303]
9460C80450j52955b59668C2351J56876g4202l50425a48058N2765j78349E9497
9449b5897A26102Q3846c01725B2600b1611j41407j7488c5142R196B90163h0499
9437C66035h7387I8036g8146j02924L5844E5062f0921l86114J22551F6960d2754
9425c7883H2779J73320n3080M988a23799e8746j69551B29200c27956J00962L9298
9414a87696c9385I6043i4997j31048i0256I4784l8568b33537A73396M8114a53290
9402G5484c825k89795q2789I0448d3813G7174e56575b54098a01158A70174o4809
9391A05365a2093p0946B42902J32974b04002n4858H1655O264g2213a569j23826
9380a25395A14741c07477H5566B8757L01314a15765J6653M8829G9353a02893M0999
$$ y = [380450, 227495, -259668, 32351, 189227, -74202, -424627, -148058, -95293, -273642, 59497, -25897, 126102, 209948, -301725, 22600, -21611, -163018, -180506, -35142, -25946, 290163, -80499, 366035, -87387, 98036, -78146, -181070, -145226, 55062, -60921, -447035, -324484, 66960, -42754, -37883, 82779, 256099, 203019, 208007, -123799, -58746, -228297, 229200, -327956, -226994, -187696, -39385, 96043, -94997, -226045, -90256, 94784, 56216, -233537, 173396, 221510, -153290, 75484, -3825, -293620, -376409, 90448, -43813, 77174, -556575, -254098, -101158, 170174, 105365, -12093, -83039, 242902, 375876, -204002, -258860, 81655, 87919, -72213, -1569, -125395, 114741, -307477, 85566, 28757, 330071, -115765, -99112, -50283, 79353, -102893, -61894]
9369f1894j29443h6856b571C8215a72852m6161g5448j13723k4159i4067c3823
9357a05117A96852A8856L99219b54993J19714I0949a93304B02568c05599C0711
9346b6752Q467l05087a7692j9203l25557B4919J06169Q0373a08414n6591f8692
9334a36357l6073k1832K4573A02134b48332G0457Q7661c51591h6592J9088C941
9322g3720c447A62232n3407a01460n2945F9662R5197a8445A44897a50113H5646
9310a84867j09400a0851A39091b40292A74933I93b14310i8168G0468a91758A61674
9298C74696d4218f347l8241j19179k02155a16904e2232K2865h108A1250K26348
9287B37598A17856a62581p613D23612a53789j34335j08713d0060a2269H3753a23515
$$ y = [-61894, -191337, -86856, -2571, 38215, -172852, -219013, -75448, -189171, -213330, -94067, -33823, -105117, 196852, 18856, 418075, -254993, -135279, 90949, -193304, 202568, -305599, 30711, -26752, -18285, -323372, -17692, -36895, -362452, 24919, 131088, 211461, -108414, -165005, -68692, -136357, -172430, -194262, -169689, 102134, -248332, 70457, 158118, -351591, -86592, -67504, 3941, -73720, -3447, 162232, 108825, -101460, -154405, 69662, 164859, -18445, 144897, -150113, 85646, -184867, -294267, -10851, 139091, -240292, 174933, 993, -214310, -98168, 70468, -191758, 161674, 374696, -44218, -6347, -44588, -163767, -365922, -116904, -52232, -29367, -8108, 11250, 237598, 117856, -162581, -170194, 423612, -153789, -288124, -396837, -40060, -12269, 83753, -123515]
9275a95813j99813d9535l350a744j73363o117Q1778j98693a01887A20982b12416
9263E3219j1499c42578P0785C4327g0910r2394B9157f5889a0580A26519k6045
9252A00474d7589B51284k4046Q3691d3367p8841m2696f0708A52504B433i6149
9240C69060a20203M3403C0828b9299A60547d6137B66888A09642a82335B55064
9229B27357j13636b90721l26033a57517j31103G8721a65589A40881I977J61752
9219A71729O3588d9511j04911K4444D9170c0742k70004j07299b2183l5668p7228
9208a35079A999O9608l4273f7655A65980J15447A3601c9768A68088c84783A56341
9196a39066j0324C06539a65467n6740j57722K978A79641B4760J33361b5112J2380
$$ y = [-195813, -395626, -49535, -52885, -1744, -175107, -181224, -99446, -298139, -101887, 120982, -212416, 53219, 41720, -342578, -271793, 34327, -70910, -163304, 29157, -65889, -10580, 126519, 100474, -47589, 251284, 227238, 310929, -43367, -122208, -164904, -60708, 152504, 2433, -96149, 369060, -120203, -76800, 30828, -29299, 160547, -46137, 266888, 109642, -182335, 255064, 227357, 113721, -290721, -616754, -157517, -288620, 78721, -165589, 140881, 9977, 171729, 235317, -49511, -154422, -129978, 49170, -30742, -300746, -408045, -22183, -57851, -135079, 1999, 71607, 37334, -67655, 165980, 281427, 13601, -39768, 168088, -384783, 156341, -139066, -149390, 306539, -165467, -222207, -379929, -376951, 179641, 24760, 158121, -25112, -12732]
9185a2732C4267A1217a74586a3994k25211a554k13819d8002G1293J08072c6341
9173c29564a3744l23266g7294A0209O4989b93154f133N82D7741I547a58138I791
9160a5222B0786a80281E8744b7804C213K3790a80022A0486a14738m0375c6348
9148c96906g4020g568A67661C4269c1671n15182J71950D4859J2018h3854k66528
9137c50382H9402k2168D83b4177k4550l0649a4136A14284A6213M9116a07703j11351
9125b19054k8082B16525C1462c07732m986l6223A5818d91379G2746j9402M893
9114E8237a08942k17366C00948r8308f2747j64667A21506J0963k124B5314a91836
9102a83792j87899a72226l4726A20363D304O1041a23276K2279d4660F8134a4081
$$ y = [-12732, 34267, 11217, -174586, -13994, -239205, -1554, -215373, -48002, 71293, 179365, -36341, -329564, -13744, -337010, -77294, 10209, 75198, -293154, -6133, -5551, 47741, 9547, -158138, 9791, -15222, 20786, -180281, 58744, -27804, 3213, 27003, -180022, 10486, -114738, -155113, -36348, -396906, -74020, -7568, 167661, 34269, -31671, -546853, -374903, 44859, 56877, -83854, -350382, 89402, 67234, 483, -24177, -48727, -79376, -14136, 114284, 16213, 65329, -107703, -219054, -247136, 216525, 31462, -307732, -312718, -348941, 15818, -491379, 72746, 53344, 58237, -108942, -326308, 300948, 202640, -62747, -227414, 121506, 132469, 130345, 25314, -191836, -183792, -371691, -172226, -206952, 120363, 4304, 65345, -123276, -100997, -44660, 68134, -14081]
9090a55485B5928P6492c79993A20651a3577p03D1283e1734r4950B12579m6781
9079A65798G2086L4128a57668j21134l2456j4527d4250C9244a27363a9158q9867
9068a09025J0399D8075a96704j25850k2972G5849a56039q7572C7828J5874J12847
9057A66549Q2298a66700H0698c42238P5255a00275j10971F2864b3850b724C3253
9045H6649a42632F783b31822H0568C4009J53648Q9352I4407B5859b50680P7990
9034a72690C5974b7349k00246B64378D632d4368A1233J58873d7308A49824E7265
9022e0839G1425a65853a9539j23192j33928g5645k46505a310I1168a00843l63001
9011d63844J00458a67834A91617E4355c13144L8644O1981G7376a11886B9064N0857
$$ y = [-155485, 25928, 102420, -379993, 120651, -13577, -14280, 41283, -51734, -146684, 212579, 165798, 72086, 106214, -157668, -278802, -311258, -325785, -44250, 39244, -127363, -19158, -109025, -98626, 48075, -196704, -322554, -345526, 75849, -156039, -243611, 37828, 53702, 166549, 248847, -166700, 80698, -342238, -266983, -100275, -211246, 62864, -23850, -2724, 33253, 86649, -142632, 6783, -231822, 80568, 34009, 187657, 277009, 94407, 25859, -250680, -172690, 35974, -27349, -227595, 264378, 4632, -44368, 11233, 170106, -47308, 149824, 57265, -50839, 71425, -165853, -19539, -142731, -276659, -75645, -322150, -1310, 91168, -100843, -463844, -363386, -167834, 191617, 54355, -313144, -274500, -212519, 77376, -111886, 29064, 79921]
9000G9921a20745E9268P7178E8427d0100A42008E9139c20127c3579C49534j37576
8989B11958F1628a18163m19178A16219F083h9734j3273K196j99143D3881J35090
8978A78971a27566G2814R8663k5496b71057f5887F9533a53623P0681q3111G2726
8966A46998B6018N0166J26099a70680Q2824c4066r2077k7877C6964J54927b4780
8954c06288a32443F0320A1346L3382P960K5250c4577n4288b6502j36815A21861
8942F0797J7804N9515d3145H2535a10868B27095E4799M06301A18188i6767B25650
8930b68D6919O4532J6775m7438K44453K06350Q13613L255360J0196537l326572
8920A1470529B501851E25892r5611j36827a4699j18737A2500a95058A05558Q2165
$$ y = [79921, -120745, 59268, 136446, 58427, -40100, 142008, 59139, -320127, -33579, 349534, 211958, 61628, -118163, -537341, 116219, 6083, -89734, -103007, -100811, -299954, 43881, 178971, -127566, 72814, 171477, 145981, -271057, -65887, 69533, -153623, -82942, -166053, 72726, 146998, 26018, 76184, 202283, -170680, -87856, -34066, -126143, -154020, 36964, 191891, -24780, -306288, -132443, 60320, 11346, 44728, 52688, 77938, -34577, -88865, -26502, -163317, 121861, 60797, 78601, 138116, -43145, 82535, -110868, 227095, 54799, 461100, 118188, -96767, 225650, -268, 46919, 111451, 128226, 80788, 325241, 531591, 1345204, 4600564, 14797101, 11470529, 2501851, 525892, 430281, 293454, -14699, -133436, 12500, -195058, 105558, 187723]
8910A87723F8285a11494C58210b0697j5473D74458b13873P7870k806i054j03581
8899a12635c0046A90500b92542G097O3852B6045L7418k6831c556l64801h9493
8887c57348J77410A5316f0372B02408c63880B5706e3034B25774E2376c59849a39379
8875B33716c41754a08521A56019b17708A3573b5154E3155K4223b11569B93778
8864d55126b2642j00989c6663E5513i0446A74235d5520j89089F4261f9262j18897
8853a88159J0390j55515G9276a81955A61166i1250B8510b57351A43855b21574
$$ y = [187723, 68285, -111494, 358210, -20697, -36170, 474458, -213873, -136003, -138809, -9054, -112635, -30046, 190500, -292542, 7097, 70949, 26045, 63463, 36632, -3556, -368357, -89493, -357348, -179938, 15316, -60372, 202408, -363880, 25706, -53034, 225774, 52376, -359849, -139379, 233716, -341754, -108521, 156019, -217708, 13573, -25154, 53155, 77378, -211569, 293778, -455126, -22642, -123631, -36663, 55513, -90446, 174235, -45520, -234609, 64261, -69262, -188159, -177769, -333284, 79276, -181955, 161166, -91250, 28510, -257351, 143855, -221574]
$$ [...]
##END NTUPLES=NMR SPECTRUM
##END=
