##TITLE=AC1538_ROEFFECT0010_8214700_gM39gyj76X
##JCAMPDX= 6.0         $$ Bruker NMR JCAMP-DX V2.0
##DATA TYPE= NMR SPECTRUM
##DATA CLASS= NTUPLES
##ORIGIN= BRUKER
##OWNER= Administrator
$$ 1.72 TOPSPIN		Version 2.1
$$ 2013-10-12 12:16:19.527 -0700  Administrator@X
$$ Compression mode = diff/dup
##.OBSERVE FREQUENCY= 400.02188249412
##.OBSERVE NUCLEUS= ^1H
##.ACQUISITION MODE= SIMULTANEOUS (DQD)
##.ACQUISITION SCHEME= undefined
##.AVERAGES= 64
##.DIGITISER RES= 22
##SPECTROMETER/DATA SYSTEM= spect
##.PULSE SEQUENCE= noesygpps1d.comp
##.SOLVENT NAME= COFFEE_meoh
##.SHIFT REFERENCE= INTERNAL, COFFEE_meoh, 1, 14.96081
##AUDIT TRAIL= $$ (NUMBER, WHEN, WHO, WHERE, PROCESS, VERSION, WHAT)
$$ ##TITLE= Audit trail, TOPSPIN		Version 2.1
$$ ##JCAMPDX= 5.01
$$ ##ORIGIN= Bruker BioSpin GmbH
$$ ##OWNER= Administrator
$$ $$ E:\/data/COFFEE/nmr/AC1538_ROEFFECT0010_8214700_gM39gyj76X/12/pdata/1/auditp.txt
$$ ##AUDIT TRAIL=  $$ (NUMBER, WHEN, WHO, WHERE, PROCESS, VERSION, WHAT)
(   1,<2013-10-12 12:16:14.810 -0700>,<Administrator>,<X>,<go>,<TOPSPIN 2.1>,
      <created by zg
	started at 2013-10-12 12:04:40.978 -0700,
	POWCHK enabled, PULCHK disabled,
       configuration hash MD5:
       C8 4E 4E 5D D3 5C D8 9E 9F 52 82 E0 59 8A DE 15
       data hash MD5: 64K
       2D DE 13 F2 49 EA 3D 59 38 B8 E1 D0 FB 88 69 B3>)
(   2,<2013-10-12 12:16:17.750 -0700>,<Administrator>,<X>,<proc1d>,<TOPSPIN 2.1>,
      <Start of raw data processing
       efp LB = 0.3 FT_mod = 6 PKNL = 1 PHC0 = 0 PHC1 = 0 SI = 128K 
       data hash MD5: 128K
       69 6F 32 CC CF 9F 38 7E BF D9 AA 9B EF 81 27 F4>)
(   3,<2013-10-12 12:16:18.654 -0700>,<Administrator>,<X>,<proc1d>,<TOPSPIN 2.1>,
      <pk PHC0 = -79.8761 PHC1 = 0 
       data hash MD5: 128K
       5D D1 E9 96 C7 1E DC 15 44 36 B7 CA 26 87 6C 6B>)
(   4,<2013-10-12 12:16:19.037 -0700>,<Administrator>,<X>,<proc1d>,<TOPSPIN 2.1>,
      <abs ABSG = 1 
       data hash MD5: 128K
       A7 AA F4 E8 12 B1 0D EE 92 1A 0F 17 01 68 6E 87>)
(   5,<2013-10-12 12:16:19.113 -0700>,<Administrator>,<X>,<proc1d>,<TOPSPIN 2.1>,
      <abs ABSG = 2 
       data hash MD5: 128K
       36 40 27 8B A3 BC D6 57 24 B8 AA 73 02 3E B1 6E>)
(   6,<2013-10-12 12:16:19.190 -0700>,<Administrator>,<X>,<proc1d>,<TOPSPIN 2.1>,
      <abs ABSG = 3 
       data hash MD5: 128K
       6E F3 E9 05 D0 93 D8 54 25 0E C5 FC 65 7C 57 CE>)
(   7,<2013-10-12 12:16:19.282 -0700>,<Administrator>,<X>,<proc1d>,<TOPSPIN 2.1>,
      <abs ABSG = 4 
       data hash MD5: 128K
       00 7C 33 10 91 E7 A1 15 14 52 3D 1B 3E D9 5A 56>)
(   8,<2013-10-12 12:16:19.358 -0700>,<Administrator>,<X>,<proc1d>,<TOPSPIN 2.1>,
      <abs ABSG = 5 
       data hash MD5: 128K
       1A E7 BE 86 A1 3D 74 F2 1C 53 52 F3 8E 95 58 B7>)
$$ ##END=
$$ 
$$ $$ hash MD5
$$ $$ 43 47 21 0A C4 08 CA DE 2D 6E 54 AE 8E 75 11 C5
##$RELAX= 
##$RELAX= 
##$RELAX= 
##$RELAX= 
##$RELAX= 
##$RELAX= 
##$RELAX= 
##$RELAX= 
$$ Bruker specific parameters
$$ --------------------------
##$DU= <E:\>
##$EXPNO= 12
$$ [...]
150 150 150 150 150 150 150 150
##$TP07= 0
##$TPNAME0= <>
##$TPNAME1= <>
##$TPNAME2= <>
##$TPNAME3= <>
##$TPNAME4= <>
##$TPNAME5= <>
##$TPNAME6= <>
##$TPNAME7= <>
##$TPOAL= (0..7)
0.5 0.5 0.5 0.5 0.5 0.5 0.5 0.5
##$TPOFFS= (0..7)
0 0 0 0 0 0 0 0
##$TUNHIN= 0
##$TUNHOUT= 0
##$TUNXOUT= 0
##$USERA1= <user>
##$USERA2= <user>
##$USERA3= <user>
##$USERA4= <user>
##$USERA5= <user>
##$V9= 5
##$VALIST= <valist>
##$VCLIST= <CCCCCCCCCCCCCCC>
##$VD= 0
##$VDLIST= <DDDDDDDDDDDDDDD>
##$VPLIST= <PPPPPPPPPPPPPPP>
##$VTLIST= <TTTTTTTTTTTTTTT>
##$WBST= 1024
##$WBSW= 4
##$XGAIN= (0..3)
0 0 0 0
##$XL= 0
##$YL= 0
##$YMAX_a= 5898712
##$YMIN_a= -12410403
##$ZGOPTNS= <>
##$ZL1= 120
##$ZL2= 120
##$ZL3= 120
##$ZL4= 120
##$ABSF1= 14.96081
##$ABSF2= -5.597372
##$ABSG= 5
##$ABSL= 3
##$ALPHA= 0
##$AQORDER= 0
##$ASSFAC= 0
##$ASSFACI= 0
##$ASSFACX= 0
##$ASSWID= 0
##$AUNMP= <proc_prof1d_extract.lims>
##$AXLEFT= 0
##$AXNAME= <>
##$AXNUC= <1H>
##$AXRIGHT= 0
##$AXTYPE= 0
##$AXUNIT= <>
##$AZFE= 0.1
##$AZFW= 0.1
##$BCFW= 0
##$BC_mod= 0
##$BYTORDP= 0
##$COROFFS= 0
##$CY= 15
##$DATMOD= 1
##$DC= 0
##$DFILT= <>
##$DTYPP= 0
##$F1P= 0
##$F2P= 0
##$FCOR= 0.5
##$FTSIZE= 131072
##$FT_mod= 6
##$GAMMA= 0
##$GB= 0
##$INTBC= 1
##$INTSCL= 1
##$ISEN= 128
##$LB= 0.3
##$LEV0= 0
##$LPBIN= 0
##$MAXI= 10000
##$MC2= 0
##$MEAN= 0
##$ME_mod= 0
##$MI= 0
##$NCOEF= 0
##$NC_proc= -2
##$NLEV= 6
##$NOISF1= 0
##$NOISF2= 0
##$NSP= 0
##$NTH_PI= 0
##$NZP= 0
##$OFFSET= 14.96081
##$PC= 1
##$PHC0= -79.8761
##$PHC1= 0
##$PH_mod= 1
##$PKNL= yes
##$PPARMOD= 0
##$PPDIAG= 0
##$PPIPTYP= 0
##$PPMPNUM= 2147483647
##$PPRESOL= 1
##$PSCAL= 4
##$PSIGN= 0
##$PYNMP= <proc.py>
##$REVERSE= no
##$SF= 400.02000971271
##$SI= 131072
##$SIGF1= 0
##$SIGF2= 0
##$SINO= 400
##$SIOLD= 131072
##$SPECTYP= <>
##$SREGLST= <1H.CDCl3>
##$SSB= 0
##$STSI= 131072
##$STSR= 0
##$SW_p= 8223.68421052631
##$SYMM= 0
##$S_DEV= 0
##$TDeff= 65536
##$TDoff= 0
##$TI= <>
##$TILT= no
##$TM1= 0
##$TM2= 0
##$TOPLEV= 0
##$USERP1= <user>
##$USERP2= <user>
##$USERP3= <user>
##$USERP4= <user>
##$USERP5= <user>
##$WDW= 1
##$XDIM= 131072
##$YMAX_p= 420985046
##$YMIN_p= -16038
##$CURPLOT= <Network HP LaserJet P1505>
##$CURPRIN= <$Network HP LaserJet P1505>
##$DFORMAT= <normdp>
##$LAYOUT= <+/1D_H.xwp>
##$LFORMAT= <normlp>
##$PFORMAT= <normpl>
##$SURQMSG= 1
$$ End of Bruker specific parameters
$$ ---------------------------------
##NTUPLES= NMR SPECTRUM
##VAR_NAME=  FREQUENCY,     SPECTRUM/REAL,   SPECTRUM/IMAG
##SYMBOL=    X,             R,               I
##VAR_TYPE=  INDEPENDENT,   DEPENDENT,       DEPENDENT
##VAR_FORM=  AFFN,          ASDF,            ASDF
##VAR_DIM=   131072,        131072,          131072
##UNITS=     HZ,            ARBITRARY UNITS, ARBITRARY UNITS
##FACTOR=    0.0627417313425164, 1,          1
##FIRST=     8223.62146879497, 1965,         -59124
##LAST=      0,             3806,            -58541
##MIN=       0,             -16038,          0
##MAX=       8223.62146879497, 420985046,    0
$$ Real data points
##PAGE= N=1
##DATA TABLE= (X++(R..R)), XYDATA
$$ [...]
67863 87358 87872 88998 90054 90424 89934 88620 86551 84105 82065 80941 80279 79078 76986 74748 73305
67848 73305 72713 72156 70909 69131 67713 67359 67772 67888 67105 66096 66051 67232 68704 69489 69453 68990 68480 68406
67830 68406 69378 71457 73735 75179 75794 76558 78271 80868 83832 86894 90140 93580 96762 98968 99926
67815 99926 100147 100149 99529 97466 94266 91587 90569 90410 89465 87274 84770 82807 81400 80301 79438 78640 77607
67798 77607 76388 75387 74702 73859 72403 70441 68534 67344 67299 68201 69168 69379 68915 68497 68467 68521 68355 67959
67780 67959 67221 65950 64548 64011 64837 66357 67582 68310 69020 69971 70910 71544 71910 72275 72893 73842 74941
67763 74941 75908 76703 77593 78822 80376 82063 83629 84709 85027 84784 84604 84876 85328 85361 84664 83398 82090
67746 82090 81508 82243 84082 85971 86933 86910 86519 86134 85570 84541 83085 81494 80038 78764 77356 75244
67730 75244 72193 68812 66230 65061 64852 64734 64469 64542 65285 66246 66673 66401 65924 65645 65407 64898 64176 63587
67712 63587 63342 63421 63708 63978 63953 63682 63704 64376 65126 64863 63310 61499 60656 60908 61379 61348 60932 60673 60867 61451
67692 61451 62338 63509 64713 65297 64670 63010 61297 60515 60908 62043 63397 64648 65642 66419 67252 68377
67676 68377 69607 70431 70546 70118 69577 69351 69714 70651 71778 72678 73407 74557 76723 79975 83791 87284 89581
67659 89581 90282 89762 88934 88595 88946 89572 89765 89016 87444 85715 84348 83196 81876 80557 79876 79986 80110
67642 80110 79331 77612 75854 74956 75022 75429 75562 75391 75309 75479 75608 75425 75114 75082 75516 76461 78051 80302 82810
67623 82810 85108 87167 89071 90349 90300 89053 87627 86686 85832 84514 83107 82538 83165 84604 86500 88872
67607 88872 91614 94133 95724 96145 95671 94714 93461 91810 89585 86900 84351 82732 82377 82805 83131 82901
67591 82901 82360 81811 80977 79407 77408 76058 75999 76568 76479 75152 73090 71150 69824 69111 68686 68133 67249
67574 67249 66178 65189 64508 64426 65207 66581 67684 67924 67721 67934 68774 69727 70384 70750 70864 70664 70260 69877
67556 69877 69517 69057 68584 68167 67458 66126 64591 63704 63780 64522 65787 67607 69474 70485 70397 69787 69008 67880
67538 67880 66647 66202 66791 67361 66886 65672 64617 63793 62566 60759 58922 57681 57387 58154 59658 61117
67522 61117 61998 62541 63160 63688 63696 63211 62511 61554 60299 59291 59219 60005 60992 61897 62852 63623 63613 62782 61841 61302
67502 61302 60932 60407 59936 59845 59960 59808 59233 58521 58019 57897 58112 58451 58675 58781 59066 59818 60937 61861 61939
67483 61939 61003 59653 58805 58779 58922 58352 57007 55782 55652 56792 58513 59878 60387 60223 59929 59849 59890 59753
67465 59753 59268 58482 57611 56992 56939 57556 58705 60107 61322 61811 61375 60541 60154 60540 61323 62009 62366 62274 61795
67446 61795 61471 61903 62806 63118 62394 61469 61315 61840 62346 62652 63014 63337 63270 62947 63019 63924 65562 67581 69552
67427 69552 71034 71859 72268 72522 72598 72573 72800 73260 73161 71844 69745 67807 66277 64798 63375 62386 61755 60957
67409 60957 59840 58746 57870 57231 57126 57725 58259 57633 56033 54911 55095 55862 56286 56498 56954 57318 56990 56235
67391 56235 55883 56146 56482 56575 56761 57397 58248 58715 58545 58222 58614 60045 61749 62575 62307 61850 62023 62672 63292
67372 63292 63931 64902 65871 65929 64635 62557 60677 59509 58894 58449 58055 57917 58196 58704 59118 59356 59542 59690
67354 59690 59761 59963 60530 61154 61143 60384 59676 59815 60698 61677 62389 62871 63149 63259 63461 63970 64543 64729 64451 63962
67334 63962 63339 62494 61685 61621 62868 65384 68693 72246 75592 78517 81205 83973 86675 88539 88840 87707
67318 87707 86078 84783 83813 82568 80771 78910 77657 76948 75943 73981 71368 69082 67801 67417 67407 67445
67302 67445 67582 68040 68978 70486 72696 75636 78818 81107 81446 79962 78121 77484 78357 79792 80742 80905
67286 80905 80515 79740 78481 76579 74090 71469 69479 68685 68888 69289 69336 69194 69228 69302 69010 68439 68226 68811
67268 68811 70005 71408 72930 74736 76970 79688 82699 85271 86450 86038 84950 84133 83441 82133 80225
67253 80225 78545 77424 76132 73965 71334 69321 68512 68613 68964 69109 69021 69039 69478 70203 70832 71342 72104 73186
67235 73186 74097 74450 74442 74407 74293 73934 73501 73318 73519 74113 74977 75564 75248 74327 74091 75245 76888 77846 78432
67216 78432 79821 81967 83362 83015 81637 80533 80180 80297 80601 80947 81153 81169 81208 81402 81592 81622 81569 81531 81460
67197 81460 81352 81335 81438 81485 81300 80801 79961 78917 78049 77640 77537 77498 77644 78067 78250 77610 76604 76477 77679
67178 77679 79229 79953 79758 79421 79729 81164 83783 86885 89274 90363 90730 91227 91920 92264 91938 91071 89963
67161 89963 88974 88425 88228 87895 87243 86753 86875 87359 87737 88056 88563 88975 88775 88132 87858 88378 89298 90101 90778
67142 90778 91586 92557 93533 94474 95481 96558 97466 97855 97584 96952 96505 96542 96920 97404 98025 98944 100107 101250
67124 101250 102162 102774 103123 103396 103875 104616 105243 105304 104837 104448 104767 105881 107267 108272 108736 109146 110060 111398
67106 111398 112543 113184 113762 114876 116469 117889 118649 118821 118716 118467 118141 118081 118779 120277 121903 122906 123287
67089 123287 123647 124218 124530 124312 124172 124908 126422 127862 128619 128672 128220 127689 127899 129434 131734 133604 134671
67072 134671 135627 136917 138117 138930 139876 141344 142734 143314 143452 144198 145919 148021 149827 151138 152062 152871
67056 152871 153979 155592 157353 158668 159378 159882 160720 162181 164156 166222 168056 169898 172240 174906 176935
67041 176935 177709 177722 177845 178338 179135 180617 183271 186720 189849 191932 193128 193926 194681 195752 197519 199982
67025 199982 202663 205035 206897 208376 209840 211777 214411 217391 220145 222562 225087 228048 231134 233686
67011 233686 235447 236923 238931 241719 244649 246969 248818 251123 254467 258455 262346 265896 269391 273191
66997 273191 277541 282464 287547 292087 295724 298730 301554 304464 307748 311715 316167 320314 323642 326473
66983 326473 329411 332718 336562 341287 346911 352828 358563 364350 370488 376663 382528 388384 394565 400677
66969 400677 406243 411618 417404 423410 429222 435404 442951 451663 460254 468117 475918 484249 492740 500801
66955 500801 508409 515832 523340 531435 540672 550952 561634 572449 583594 594800 605321 615193 625595
66942 625595 637431 650216 662922 675281 687692 700477 713945 728691 745070 762496 779858
66931 779858 796597 813012 829669 846877 864686 883098 902277 922585 944295 967250 990992
66920 990992 1015173 1039562 1063821 1087812 1112085 1137466 1164032 1191105 1218403 1246555 1276209
66909 1276209 1307298 1339546 1373035 1407747 1443101 1478608 1514686 1552243 1591621 1632384 1673946
66898 1673946 1715991 1758460 1801544 1845574 1890607 1936253 1982203 2028713 2076271 2124977 2174509
66887 2174509 2224504 2274692 2324866 2375008 2425257 2475505 2525247 2574152 2622484 2670568 2718063
66876 2718063 2764145 2808291 2850418 2890370 2927770 2962507 2994964 3025540 3054117 3080168 3103231
66865 3103231 3123082 3139478 3151965 3160161 3164253 3164940 3162732 3157492 3148860 3136891 3121912 3103895 3082446
66852 3082446 3057363 3028853 2997252 2963046 2927052 2889843 2850896 2809047 2764176 2717800 2671542
66841 2671542 2625558 2578928 2531073 2482105 2432214 2381532 2330580 2280140 2230537 2181460 2132613
66830 2132613 2084275 2037078 1991410 1947016 1903110 1858952 1814427 1769992 1726097 1682946 1640853
66819 1640853 1600339 1561619 1524317 1488036 1452872 1419029 1386232 1353978 1322166 1291107 1261037
66808 1261037 1231964 1203785 1176260 1149070 1122265 1096393 1071792 1048026 1024490 1001316 979030
66797 979030 957533 936162 914783 894124 874828 856726 839294 822240 805358 788309 771044
66786 771044 754182 738512 724195 710691 697353 683881 670336 656974 644022 631451 619040
66775 619040 606782 595118 584517 574925 565840 556865 547923 538919 529569 519782 510018 500936 492693
66762 492693 484820 476799 468547 460337 452519 445446 439352 433972 428481 422173 415215 408428 402368 396908
66748 396908 391681 386509 381277 375805 370115 364609 359706 355391 351301 347141 342837 338391 333828 329237
66734 329237 324724 320266 315730 311072 306511 302419 298919 295619 291943 287864 284097 281289 279185 276901
66720 276901 273893 270288 266377 262350 258601 255713 253787 252126 249920 247052 243971 240977 237955 234746
66706 234746 231524 228697 226468 224555 222481 220258 218551 217832 217575 216696 214735 212124 209301 206141 202402
66691 202402 198239 194045 190209 187197 185416 184756 184643 184678 184798 184730 183960 182492 180980 179709 178134 175899
66675 175899 173657 172134 170967 169286 167076 165106 163690 162363 160742 158972 157288 155777 154629 154064
66661 154064 153890 153599 152921 151904 150544 148851 147207 146057 145252 144318 143331 142825 142724 142171 140734 139129
66645 139129 138254 138068 137924 137567 137137 136477 135184 133368 131786 131050 131033 131231 131335 131292 131081 130765 130594 130670 130578
66626 130578 129700 127965 125909 123877 121639 119138 117163 116607 117243 117924 117964 117636 117248 116589 115614 114898 114801
66609 114801 114786 114212 113341 112840 112674 112262 111555 111145 111326 111744 111980 111857 111086 109334 106893 104739 103611 103325
66591 103325 103149 102515 101287 99765 98635 98499 99157 99646 99240 98233 97461 97274 97208 96597 95272 93697 92493
66574 92493 91832 91299 90429 89369 88842 89364 90605 91632 91774 91208 90627 90400 90226 89750 89196 88996 88980 88569
66556 88569 87820 87547 88073 88540 88024 86827 86013 86048 86604 87370 88166 88392 87351 85355 83798 83750 84924 86231
66538 86231 86945 87075 86997 87021 87138 87022 86392 85344 84155 82920 81709 80868 80697 80874 80704 79985 79159 78603
66520 78603 78214 77786 77354 77081 77183 78009 79715 81816 83464 84180 83964 82860 81064 79360 78610 78649 78481
66503 78481 77823 77596 78468 79702 80144 79677 78980 78323 77468 76483 75845 75739 75880 76000 75956 75387 73944 72034
66485 72034 70838 71201 72720 74149 74585 74170 73798 74301 75857 77996 80030 81443 82006 81733 80830 79619
66469 79619 78389 77292 76334 75450 74681 74297 74541 75129 75290 74610 73604 73071 73051 72947 72575 72432 72811 73214
66451 73214 72957 71935 70561 69318 68588 68570 69093 69818 70762 72228 74020 75250 75306 74685 74451 75132 76436
66434 76436 77683 78129 77246 75254 73286 72518 73156 74499 75808 76732 77040 76572 75600 74860 74951 75778 76625 76768
66416 76768 76065 75055 74434 74346 74271 73665 72579 71567 71152 71465 72217 72869 72998 72649 72200 71854 71475 70996 70680
66397 70680 70841 71509 72491 73483 74047 73896 73366 73195 73558 73738 73072 71790 70568 69699 69250 69566 70892 72655
66379 72655 73896 74371 74643 75080 75420 75415 75248 75057 74673 74164 74130 74994 76324 77308 77680 77741 77606 76947 75587
66360 75587 73922 72541 71673 71187 70998 71162 71558 71746 71302 70238 69004 68143 67994 68542 69360 69806 69575 69056
66342 69056 68913 69269 69615 69544 69285 69304 69694 70232 70758 71192 71279 70734 69674 68634 68027 67804 67715 67775 68229 69135
66322 69135 70174 71016 71709 72447 73032 72933 72075 71201 71034 71332 71242 70525 69882 69968 70580 71048 71073 70901 70897 71196 71638
66301 71638 71934 72022 72226 72826 73528 73734 73335 72778 72366 72023 71823 72076 72615 72675 71955 71223 71358 72212 73005 73412
66281 73412 73661 73847 73912 74105 74801 75799 76363 76030 75033 73954 73281 73147 73107 72362 70720 69160 68928 70066
66263 70066 71378 71796 71249 70207 69046 68117 67852 68435 69622 71058 72539 73866 74795 75307 75630 75814 75572
66246 75572 74742 73629 72669 71928 71205 70495 70093 70225 70734 71192 71336 71318 71467 71854 72255 72532 72786 72977 72731
66227 72731 71828 70728 70238 70691 71753 72947 74102 75306 76633 77962 78910 79089 78585 77991 77764 77761 77698 77739
66209 77739 78155 78644 78549 77703 76542 75402 74256 73252 73003 74027 76108 78317 79508 78962 76934 74587
66193 74587 72969 72081 71274 70482 70434 71546 73177 74291 74497 74166 73793 73506 73051 72188 71199 70835 71417 72190
66175 72190 72095 71129 70292 70144 70151 69697 69008 68685 68909 69558 70556 71598 72013 71480 70569 70109 70368 71278 72936
66156 72936 75182 77043 77450 76448 75058 73984 73163 72517 72335 72700 73189 73516 73995 75020 76432 77722
66140 77722 78549 78836 78639 78222 78006 78168 78448 78574 78681 79034 79581 80084 80523 80966 81153 80681 79658 78735 78315
66121 78315 78087 77579 76798 75940 74774 73008 71240 70847 72501 75189 77206 77928 78094 78515 79146 79572 79798
66104 79798 80120 80601 81105 81663 82371 83079 83630 84327 85629 87306 88435 88472 87913 87539 87429 87203 86972 87339
66086 87339 88431 89580 90203 90457 90698 90793 90509 90220 90554 91422 92039 91967 91561 91228 90861 90261 89613 89086 88422
66067 88422 87484 86918 87642 89678 91998 93584 94260 94432 94466 94479 94441 94210 93616 92675 91623 90698 90015 89674 89784
66048 89784 90249 90653 90532 89755 88643 87747 87508 87998 88895 89733 90185 90175 89830 89427 89289 89666 90653 92216 94128
66029 94128 95903 97045 97556 98006 98937 100310 101697 102809 103606 104052 104058 103662 103098 102748 103012 103976 105050 105339
66011 105339 104696 104084 104459 105623 106675 107296 107900 108723 109594 110680 112572 115273 117832 119438 120440 121781
65995 121781 123802 126097 128299 130514 133094 136386 140566 145358 149900 153202 154854 155238 155112 155054 155109 154784
65979 154784 153499 151196 148438 145811 143375 140825 138015 135061 131981 128519 124492 120238 116580 114209
65965 114209 113161 113005 113471 114514 115676 115907 114584 112430 110826 110311 110353 110552 111295 112995 115396 118011
65949 118011 120700 123350 125504 126854 127854 129307 131448 133831 135949 137662 139101 140447 141715 142582
65935 142582 142733 142532 142929 144304 145776 146244 145845 145768 146700 148121 149219 149933 150816 152303 154462 157197 160350
65918 160350 163631 166660 169180 171233 173120 175155 177479 180162 183351 187043 190673 193355 194819 195837
65904 195837 197357 199393 201083 201685 201210 200248 199557 199750 200922 202462 203523 203682 202937 201216 198357 194641
65888 194641 190856 187565 184570 181303 177544 173515 169487 165564 161800 158275 154953 151608 148016 144248
65874 144248 140648 137477 134631 131929 129593 128109 127517 127160 126449 125555 125004 124818 124531 123944 123289 122597 121486
65857 121486 119829 118202 117220 116760 116256 115647 115527 116250 117281 117805 117866 118520 120698 124039 127131 128872 129372
65840 129372 129462 129678 130012 130369 130735 130877 130369 129129 127717 126899 127082 128260 130240 132662 135048 137170 139393
65823 139393 142369 146329 150846 155349 159691 164146 168974 174102 179130 183549 187031 189607 191561 193071
65809 193071 194003 194120 193440 192215 190548 188229 185027 181027 176561 171998 167745 164258 161735 159772 157638
65794 157638 155042 152482 150675 149711 148855 147214 144610 141857 140145 140025 141031 142363 143822 145860 148820
65779 148820 152474 156409 160577 165270 170713 176879 183582 190570 197546 204178 210126 215061 218705 220746
65765 220746 220675 217933 212550 205544 198306 191543 185103 178805 173015 168275 164832 162736 162013 162504 163873
65750 163873 166018 169156 173331 178315 184280 192011 201921 213301 225142 237347 250337 263661 275877
65737 275877 285875 293611 299389 303137 304714 304274 301851 296999 289364 279421 268202 256436 244263 231720
65723 231720 219174 207260 196530 187158 178868 171218 164041 157516 151782 146667 141972 137843 134632
65710 134632 132394 130740 129181 127467 125570 123502 121303 119199 117609 116924 117176 117923 118455 118209 117114
65695 117114 115653 114583 114479 115452 117188 119166 120827 121752 121943 121964 122513 123767 125271 126503 127349 127978
65679 127978 128560 129321 130668 132956 136223 140307 145118 150672 157007 164298 172900 183035 194482 206749
65665 206749 219483 232567 245962 259703 273865 288245 302139 314700 325479 334393 341361 346338
65653 346338 349644 351842 353206 353634 353149 352178 351282 350914 351528 353580 357136 361587 365901 369097 370495 369709
65637 369709 366552 360866 352452 341301 327886 312982 297160 280624 263615 246735 230721 216066
65625 216066 202904 191157 180660 171329 163289 156719 151451 146862 142317 137701 133437 130028 127637
65612 127637 126038 124883 123945 123108 122200 121023 119592 118186 116979 115765 114290 112793 111980 112370 113765
65597 113765 115334 116169 115891 114919 114142 114164 114945 116227 118011 120257 122334 123301 122892 121854 121254 121689 123239
65580 123239 125763 129003 132687 136810 141731 147821 155109 163355 172353 182071 192626 204178 216724
65567 216724 229961 243487 257119 270759 283889 295426 304288 310043 313014 313878 313092 310422 305016
65554 305016 296235 284572 271489 258274 245296 232439 219776 207536 195785 184640 174637 166434
65542 166434 160089 154980 150480 146482 143241 140987 139783 139535 139972 140711 141497 142338 143380 144725 146409
65527 146409 148429 150592 152353 152993 152150 150102 147449 144542 141401 138105 134933 132032 129225 126429 124022
65512 124022 122459 121597 120710 119223 117195 115141 113632 113034 113273 113769 113917 113736 113839 114653 115923 117108
65496 117108 117984 118620 119021 119143 119149 119399 120154 121493 123534 126523 130632 135695 141196 146532 151328 155562
65480 155562 159426 163071 166457 169361 171438 172382 172195 171293 170190 168989 167286 164676 161301 157788 154541
65465 154541 151172 146851 141374 135730 131259 128343 126351 124840 124126 124303 124416 123374 121425 119905 119587
65450 119587 119951 120156 119977 119569 118951 118164 117541 117434 117892 118813 120125 121582 122730 123380 123970 125270 127842
65433 127842 131786 136657 141543 145655 149075 152534 156262 159466 161194 161304 160230 158252 155475 152186
65419 152186 148706 145073 141399 138358 136733 136459 136572 136238 135503 134976 135037 135446 135572 135030 134218 134060 134960
65402 134960 136208 136766 136523 136376 137096 138602 140443 142585 145435 149282 153949 158876 163412 167064 169564
65387 169564 170753 170550 169157 167183 165285 163597 161680 159157 156269 153756 152198 151557 151351 151197 151045
65372 151045 150819 150084 148502 146643 145865 147058 149770 152900 156007 159477 163579 167950 172160 176330 180931
65357 180931 186284 192496 199653 207733 216390 225124 233760 242603 251959 261466 269974 276187 279500 280231
65343 280231 279130 276781 273501 269541 265103 260175 254559 248169 241188 233967 226851 220066 213543 206794
65329 206794 199213 190762 182315 175079 169572 165263 161311 157489 154257 152046 150752 149951 149275 148464 147337
65314 147337 146002 144908 144353 144011 143222 141714 139743 137672 135755 134311 133606 133458 133359 133206 133546 134874
65298 134874 136961 139129 140947 142441 143881 145630 147983 150820 153595 155884 157726 159173 159767 158924 156753
65283 156753 154092 151715 149752 147864 145658 142986 140143 137853 136763 136829 137382 137775 137762 137288 136367 135374
65267 135374 135039 135723 136804 137199 136584 135736 135502 135725 135575 134758 133921 133776 134306 135132 136256 137943 140049
65250 140049 141949 143129 143435 142867 141623 140369 139870 140145 140399 139967 138858 137236 134975 132184 129677 128333
65234 128333 128216 128727 129404 130135 130852 131557 132535 134040 135763 137046 137611 137711 137597 137259 136680 135936 134943 133470
65216 133470 131575 129760 128584 128270 128748 129801 131061 132053 132479 132416 132181 132033 132058 132248 132571 132935 133119 132885
65198 132885 132230 131505 131159 131385 132106 133138 134181 134740 134491 133728 133175 133291 134012 135091 136311 137385 138171
65181 138171 139030 140488 142430 144195 145560 146923 148366 149398 150025 151198 153478 156029 157722 158605 159430
65166 159430 160316 160912 161442 162466 163908 165391 167390 170816 175444 179909 183483 186824 190722 195156 200030
65151 200030 205843 213070 221599 231294 242489 255515 270428 287611 307946 331812 358521 387288
65139 387288 418146 451194 485376 518691 549421 576784 600923 622865 644055 665102 684986
65128 684986 701915 714701 722807 725509 721977 712385 698303 681744 664029 645574 626220 605500
65116 605500 582740 557256 528745 497673 465345 433341 402849 374663 349573 328128 309904
65105 309904 293673 278711 265371 253951 243646 233356 223171 214206 207111 201473 196611 192251
65093 192251 188320 184731 181540 178848 176446 174025 171812 170409 169896 169605 169084 168697 168927 169487 169642 169157
65077 169157 168427 167802 167218 166567 166094 166242 167139 168312 168959 168627 167629 166651 165970 165276 164320 163391 162875 162603
65059 162603 162012 160948 159924 159503 159679 160069 160536 161387 162905 164856 166560 167452 167469 166924 166193 165624 165513
65042 165513 165817 165885 164858 162567 159828 157588 156010 154672 153392 152360 151518 150438 148986 147602 146576
65027 146576 145546 144184 142958 142503 142368 141195 138398 135109 133086 132993 134040 135022 135361 135308 135498 136379 137869
65010 137869 139506 140865 141743 142069 141997 142117 143209 145560 148789 152443 156378 160346 163727 166120 167889
64995 167889 169596 171183 172267 173068 174371 176501 178904 180882 182245 183043 183204 182861 182756 183824 186279
64980 186279 189423 192422 195084 197606 199661 200158 198296 194674 190868 187871 185415 182898 180321 177923
64966 177923 175464 172541 169310 166304 163716 161409 159412 157778 156164 154178 152111 150646 149908 149419 149001
64951 149001 148944 149189 149104 148405 147653 147493 147875 148335 148556 148324 147453 146126 144941 144241 143770 143307 143284 144340 146498
64932 146498 149123 151461 152932 153165 152248 150864 149872 149688 150154 150868 151496 151894 152064 151996 151594 150885 150138 149521
64914 149521 148820 147852 146951 146527 146314 145816 145452 146388 148976 152134 154746 156947 159547 162845 166658 171025
64898 171025 176128 181803 187756 194055 200878 207872 214328 219892 224765 229238 233302 236572 238465 238743
64884 238743 238072 237645 238023 238729 239196 239468 239584 238953 237039 234181 231002 227432 223107 218414 214253 210866
64868 210866 207706 204495 201712 200024 199745 200729 202191 202792 201761 199903 198697 198263 197081 193993 189666
64853 189666 185639 182545 179818 176716 173092 169379 166212 163935 162231 160398 158210 156283 155405 155708 156661
64838 156661 157648 158296 158441 158051 157234 156252 155551 155647 156719 158302 159610 160274 160504 160529 160198 159378 158457 158149
64820 158149 158837 160310 162149 164225 166795 170210 174567 179657 185184 190964 196899 202909 208992 215346
64806 215346 222371 230492 239892 250208 260471 269527 276589 281331 283623 283551 281640 278527 274196 268007
64792 268007 259801 250586 241725 233733 226260 218969 211989 205680 200389 196285 193170 190613 188596 187624
64778 187624 187818 188333 188360 188428 189891 193192 197360 201293 204836 208435 212475 217247 223080 230026 237688 245556
64762 245556 253344 260942 268321 275539 282504 288692 293497 296938 299697 302340 304826 306757 307776 307685 306612
64747 306612 305101 303619 301891 299198 295410 291164 286812 281789 275354 267599 259347 251402 244189 237837
64733 237837 232211 227043 222342 218541 216051 214765 214122 213442 212113 209829 206920 204275 202635 202055 202120
64718 202120 202502 203147 204179 205801 208107 210767 213102 214724 215982 217598 219875 222346 224076 224262 222795
64703 222795 220422 218260 216920 216043 214671 212008 207929 202961 197871 193199 189136 185810 183385 181745
64689 181745 180366 178917 177803 177627 178237 178830 179057 179475 180822 183282 186591 190400 194396 198480 202997
64674 202997 208375 214434 220558 226734 233873 242784 253236 264300 275065 284641 292012 296512 298269
64661 298269 297746 295084 290250 283582 275741 267346 258987 251336 244759 238974 233578 228767 225143 222916
64647 222916 221668 220850 220176 219632 219493 220258 222280 225492 229774 235384 242661 251520 261645 273037 285809
64632 285809 299511 313243 326516 339514 352362 364618 375633 384916 391850 395539 395428 391932 386090
64619 386090 378709 370077 360343 349809 338889 328075 318020 309384 302400 296643 291390 286280 281613
64606 281613 277899 275051 272144 268227 263316 258327 253896 249627 244750 239263 233950 229362 225256 221095
64592 221095 216666 212024 207268 202675 198756 195785 193498 191597 190304 189976 190419 191151 192287 194536 198300
64577 198300 203255 208866 214730 220359 225337 229829 234242 238154 240470 241087 241473 242801 244223 243917 241306
64562 241306 237239 232436 226979 221171 215688 210713 205863 201227 197524 195032 193132 191225 189333 187539
64548 187539 185657 183793 182506 182041 182036 182262 182891 183688 183897 183493 183729 185656 188713 191542 193558 194957 195730
64531 195730 195653 194898 193695 191673 188499 185030 182769 182098 181935 181349 180653 180545 180967 181365 181587 181950 182648
64514 182648 183585 184723 186196 188074 190229 192507 194908 197561 200578 204046 208115 212951 218495 224379
64500 224379 230326 236580 243648 251644 260216 269212 278901 289234 299240 307546 313322 316420 316861 314680
64486 314680 310183 303945 296510 288369 280177 272714 266536 261780 258284 255698 253578 251570 249514 247277
64472 247277 244593 241201 237102 232590 228112 224195 221312 219671 219184 219665 220851 222277 223504 224626 226229
64457 226229 228609 231274 233397 234492 234531 233804 232912 232529 232781 233109 232997 232572 232201 231925 231713 231958 233254
64440 233254 235768 239202 243176 247417 251852 256813 262928 270455 279019 288258 298368 309721 322537
64427 322537 337426 355661 378103 404254 433229 465499 502908 547134 598945 658820 727235
64416 727235 804050 888149 977658 1069790 1160618 1246222 1324701 1396451 1462026 1520204 1568321
64405 1568321 1603736 1624424 1628976 1617146 1590599 1552598 1506547 1454406 1395961 1329459 1253603
64394 1253603 1169551 1080964 992062 905885 824346 749011 681026 620585 567194 520494 480385
64383 480385 446370 417387 392424 370977 352692 336910 322952 310771 300933 293738 288565 284342
64371 284342 280581 277514 275105 272437 268540 263598 258779 254903 251725 248574 245152 241569 238045 234852
64357 234852 232224 230099 228265 226928 226794 228256 230747 233332 235842 239141 244202 251179 259343 267759
64343 267759 275947 283897 291501 298102 302776 305031 305005 303006 299277 294403 289536 285765 283302 281640 280416
64328 280416 279782 279967 280976 282853 285787 289508 292853 294482 294089 292467 290333 287652 284332 280990 278363
64313 278363 276263 273835 270756 267469 264212 260645 256730 253193 250529 248092 244885 240950 237285 234513
64299 234513 232249 229832 227208 224925 223478 222724 221947 220662 219419 219424 221170 223908 226753 229744 233292
64284 233292 237241 241314 246141 252768 261170 270094 278461 286171 293434 300143 306179 311640 316510 320663
64270 320663 324441 328553 333085 337190 340112 341871 342512 341336 337619 331888 325848 321108 318288 317213
64256 317213 317462 318635 320372 322270 323768 324160 322750 319029 312812 304425 294688 284511 274528 265179
64242 265179 256911 250006 244466 240360 237953 237049 236649 235972 235476 235948 236879 236903 235869 235181 235674 236409 236260
64225 236260 235590 235408 235678 235521 234636 233493 232406 231263 229999 228626 227008 225195 223674 222621 221186
64210 221186 218357 214421 210849 208792 208260 208659 209416 210135 210756 211594 212719 213552 213680 213797 214944 216951
64194 216951 218626 219617 221067 224109 228666 234219 240931 249332 259555 271559 285531 301296 317673
64181 317673 333237 347504 360629 372046 380188 383743 382564 377210 368210 356151 342093 327411
64169 327411 313284 300440 289190 279430 270824 263273 257145 252809 250047 248246 247129 246984 248070 250094
64155 250094 252424 254579 256308 257404 257819 257898 258180 258823 259379 259253 258387 257437 257260 258172 259669 260992 261899
64138 261899 262711 263611 264308 264606 264785 264900 264084 261382 257266 253522 251391 250493 249915 249585 249936 250734 251155
64121 251155 250914 250681 251324 253259 256578 261234 266895 273036 279456 286480 294542 303822 314423 326501
64107 326501 339827 353332 365551 375594 383509 389646 393949 396173 396714 396925 398422 402175 408306 416549
64093 416549 426591 438007 450102 461987 472696 481254 486848 489166 488533 485617 480912 474418 465788
64080 465788 454819 441933 428111 414315 401057 388605 377364 367625 359048 350817 342496 334467
64068 334467 327421 321655 317017 313261 310249 307957 306505 306045 306547 307749 309325 310985 312441 313625 315073
64053 315073 317716 321991 327318 332716 337831 343178 349489 357044 365570 374626 384121 394576 406880 421621
64039 421621 438588 456904 475563 493884 511608 528630 544632 558941 570728 579252 583874 584140
64027 584140 580190 572981 563792 553438 542169 530263 518409 507517 498366 491257 485648 480218 473742
64014 473742 465965 457328 448055 438041 427489 416953 406687 396633 387129 378884 372016 365853 360042
64001 360042 355139 351670 349265 347303 345751 344752 343920 342828 341836 341707 342634 344271 346447 349141 351997
63986 351997 354592 357160 360429 364727 369821 375566 382154 389651 397824 406568 416082 426538 437846 449825
63972 449825 462403 475725 490199 506176 523309 540572 557335 574113 591730 610035 628168
63961 628168 646031 664804 685911 710034 737162 767130 800058 836790 879038 928729 987121
63950 987121 1054929 1133221 1223751 1328447 1449085 1587383 1744733 1921575 2117514 2332069
63940 2332069 2564759 2814252 3077929 3352460 3634224 3918925 4201276 4475428 4735295
63931 4735295 4974234 5185066 5361205 5497967 5592694 5643974 5651025 5613616 5532251 5408525
63921 5408525 5245584 5048167 4822077 4573634 4309483 4036333 3760425 3487224 3221591
63912 3221591 2967771 2728864 2506580 2301925 2116007 1949782 1803091 1674315 1561129
63903 1561129 1461482 1373930 1297327 1230393 1171528 1119049 1071729 1029161 991457 958403 928917
63892 928917 901478 875113 849774 825673 802545 779880 757666 736309 715757 695347 674913
63881 674913 655524 638568 624418 612590 602965 596024 591855 589766 589302 591062 595952 603846 613507
63868 613507 623874 635092 648177 663785 681409 699784 718006 736070 754246 772112 788480
63857 788480 802324 813616 823215 832051 840269 846961 850698 850564 846793 840478 832759 824254 814876 803879
63843 803879 790309 773848 755216 735457 714871 692965 669398 644619 619487 594550 569868
63832 569868 545416 521541 498977 478249 459023 440350 421773 403938 387833 373744 361348
63821 361348 350493 341232 333136 325298 317236 309361 302330 296232 290599 284972 279354 274252 270306 267713
63807 267713 266060 264849 263981 263452 262848 261651 259975 258504 257684 257347 257066 256461 255211 253320 251346 249815
63791 249815 248294 245653 241425 236490 232153 228926 226349 223670 220494 217109 214265 212414 211198 210052
63777 210052 209154 209148 209966 210671 210688 210500 210808 211660 212716 213724 214204 213365 211025 208267 206500 206041 206172 206298
63759 206298 206361 206238 205527 204204 202996 202715 203374 204180 204377 203945 203454 203299 203292 203142 203153 204041 205994 208253 209827
63740 209827 210425 210584 211128 212666 215378 218932 222624 225764 228082 229866 231709 233906 235975 237075 237202
63725 237202 237631 239685 243294 247404 251595 256415 262069 267751 272759 277438 282316 286864 289907 291063
63711 291063 291011 290439 289322 287391 284805 282132 279852 278075 276655 275409 274205 272906 271466 270155 269428
63696 269428 269398 269669 269962 270605 271981 273818 275656 277777 280846 284690 288255 290901 292910 294524 295361 295220
63680 295220 294644 294182 293700 292976 292358 292309 292826 293762 295125 296580 297343 297297 297620 299458 302395 305042 306754
63663 306754 307892 308682 308769 307845 305951 303117 299382 295208 291240 287573 283720 279267 274150 268492 262804
63648 262804 258195 255599 254678 254087 252999 251830 251368 251712 252286 252520 252358 252382 253461 255920 259064 261904
63632 261904 264336 267162 270940 275360 279858 284290 288760 293211 297548 301895 306439 311276 316658 323194
63618 323194 331421 341208 351848 362838 374439 387299 401609 416880 432722 449601 468489 489840
63606 489840 513305 538384 564805 592042 619010 644576 667958 688306 704388 715260 720970 722267
63594 722267 720002 715281 709740 704823 700866 697333 693664 689246 682834 672970 659128 641926 622227
63581 622227 600631 577885 555032 532913 511969 492680 475701 461295 449070 438460 429254 421660
63569 421660 416240 413736 414422 417516 421722 426433 431999 438699 446041 453274 460093 466557 472715 478660
63555 478660 484628 490808 497325 504648 513693 525244 539479 556310 575924 598729 624923 654380
63543 654380 686870 722044 758941 795345 827736 852367 867018 871956 869228 861279 850402 838830
63531 838830 828378 819797 812947 807596 803453 799440 793718 784813 772189 755528 734170 707909 677942
63518 677942 646424 615219 585356 557344 531433 507614 485772 465927 448155 432427 418654
63507 418654 406745 396429 387239 378961 371875 366275 361870 357947 354032 350171 346693 343962 342277 341675
63493 341675 341783 342075 342321 342654 343195 343735 343813 343073 341648 340233 339685 340350 341837 343563 345448 347911 351196
63476 351196 354917 358380 361256 363754 366106 368092 369226 369338 368658 367261 364764 360843 355889 350841 346366
63461 346366 342382 338351 333879 329190 325170 322771 322056 322001 321558 320770 320413 320770 321378 322029 323268 325605
63445 325605 328795 332306 336131 340659 346087 352363 359548 367782 377036 387304 398979 412709 428967
63432 428967 448107 470669 496917 525723 554261 579301 598935 613122 622950 629730 634648 638740
63420 638740 642920 648133 655567 666495 681671 700968 723806 749803 778701 809658 840933 870372
63408 870372 895967 916031 929374 935763 936098 931894 924682 915972 907334 899917 893848 888321 882161 874068
63394 874068 862554 846284 824743 798413 768330 735741 702180 669423 638948 611410 586600
63383 586600 563858 542679 523203 506226 492548 482262 474779 469537 466477 465832 467644 471599 477215
63370 477215 484164 492454 502243 513354 524974 536033 545958 555100 564493 575142 587380 600848 615257
63357 615257 631154 649630 671195 695313 721214 748689 777670 807344 836195 862739 885724
63346 885724 903833 915881 921555 921663 917593 910738 902358 893488 884738 876293 868090 859757 850385 838591
63332 838591 822965 802652 777830 749773 720179 690205 660369 631404 604634 581129 560990
63321 560990 543988 530433 520812 514962 512240 512047 513235 513272 509235 500002 486828 471739 456112 440917
63307 440917 427271 416026 407220 400406 395321 391997 390474 390540 391606 392921 394241 396060 398682 401250
63293 401250 402365 401568 399458 396413 392070 386257 379578 372740 365998 359550 353770 348685 343780 338669
63279 338669 333511 328537 323799 319537 316165 313639 311572 310183 310261 311755 313235 313370 312265 310796 309418
63264 309418 308359 308317 309899 312605 315145 316697 317384 317812 318686 320625 323743 327474 331147 334540 337718
63249 337718 340798 344220 348679 354297 360319 366128 372061 378696 385860 393162 401091 410703 422355 435468
63235 435468 449433 464117 479588 495929 513307 531709 550669 569664 588617 607593 626336
63224 626336 644641 662936 681893 701594 721625 741743 761855 781612 800840 820226 840718
63213 840718 862098 882811 901299 916822 928911 936847 940144 938961 933583 923877 909787 892213
63201 892213 873010 854013 836166 819506 803869 789550 777290 767708 760982 757090 756029 757633
63189 757633 761488 767302 775077 784703 795756 808100 822355 839285 858916 880723 904447 930187
63177 930187 957761 986528 1015856 1045371 1074810 1104100 1133500 1163175 1192550 1220487 1246148
63166 1246148 1269182 1288981 1304163 1313073 1314632 1308594 1295159 1274520 1246801 1212427 1172445 1128211
63154 1128211 1080735 1030703 979264 928345 879885 835087 794647 759067 728149 700632 675188
63143 675188 651668 630821 612943 597513 584066 572612 563102 555089 548156 542236 537364 533496 530665
63130 530665 528942 528269 528665 530547 534315 539573 545365 551349 558303 567167 577889 589345 600095 609022
63116 609022 615524 619432 620782 619686 616453 611718 606300 600987 596478 593195 590890 588688 585892 582588
63102 582588 579269 576218 573617 571855 571110 570846 570303 569343 568323 567334 566215 565117 564404 564000 563513 563015
63086 563015 563077 563989 565515 567476 569954 572811 575612 578193 580802 583541 586172 588642 591386 594958 599654
63071 599654 605461 612016 618683 625189 632126 640305 649743 659853 670501 682163 695099 709219 724759
63058 724759 742289 761929 783378 806791 832682 860794 890160 920724 953828 990541 1030391
63047 1030391 1072390 1116210 1161467 1206813 1251059 1294763 1339447 1385462 1431744 1477535 1523236
63036 1523236 1569378 1615760 1661990 1708066 1753934 1798860 1841582 1880762 1915054 1943097 1963695
63025 1963695 1975784 1978134 1969491 1949401 1918794 1879589 1833823 1783270 1729579 1674412 1619452 1566523
63013 1566523 1517698 1474909 1439140 1410106 1387095 1370217 1360596 1359236 1365983 1379880 1400253 1426981
63001 1426981 1459824 1498072 1541072 1588583 1640227 1694883 1751096 1808094 1866010 1924991 1984379
62990 1984379 2043064 2100527 2157154 2213349 2268521 2321225 2369966 2413324 2449303 2475353 2489455
62979 2489455 2490749 2478732 2452472 2411379 2356397 2289592 2212683 2126847 2034011 1937396 1840391
62968 1840391 1745356 1653715 1566495 1484387 1407765 1337084 1272902 1215133 1162684 1114323 1069696
62957 1069696 1029126 992564 959182 927984 898540 871022 845593 821832 798902 776369 754718
62946 754718 734744 716549 699487 683022 667305 652862 640071 628930 618964 609351 599614 590266
62934 590266 582391 576493 572101 568449 565069 561695 558229 554981 552445 550616 548937 547108 545442 544215
62920 544215 543182 541980 540552 538906 536866 534374 531587 528444 524590 520035 515481 511590 508303 505176
62906 505176 502047 499035 496210 493587 491109 488445 485204 481661 478826 477425 477162 477293 477489 477768 477989
62891 477989 477940 477630 477073 476080 474672 473380 472691 472430 472116 471726 471646 472023 472590 473074 473500 474093 474997 475955 476329
62872 476329 475746 474710 474032 473641 472622 470653 468611 467348 466664 466006 465480 465406 465540 465641 466242 467911 470052
62855 470052 471493 472110 472913 474553 476640 478594 480283 481645 482469 482838 483180 483624 483846 483767 483843 484335 484744
62838 484744 484342 483023 481384 480149 479713 480037 480787 481592 482166 482253 481729 480959 480789 481796 483656 485584 487180
62821 487180 488527 489698 490699 491798 493387 495488 497759 499903 501710 502900 503415 503758 504509 505556 506346
62806 506346 506898 507954 510102 513283 517229 521782 526640 531397 536054 541049 546558 552256 557966 564139
62792 564139 571380 579950 589988 601866 616004 632664 652135 674868 701158 731010 764507 802013
62780 802013 843851 890152 941217 997539 1059049 1124767 1193629 1265252 1339276 1414177 1487387
62769 1487387 1556545 1619998 1676165 1723137 1759270 1783583 1795259 1793319 1777407 1748696 1709387
62758 1709387 1661293 1605401 1542807 1475488 1405825 1335715 1266448 1199127 1134655 1073425 1015419
62747 1015419 960724 909695 862567 819211 779400 743165 710782 682458 657991 636603 617240
62736 617240 599326 583181 569488 558406 549422 541914 535437 529526 523872 518870 515522 514454 515294
62723 515294 517208 519721 522837 526710 531476 537195 543759 551153 559898 570811 584071 598945 614793
62710 614793 631971 651431 673794 699265 728181 761106 798487 840577 887661 940167 998718
62699 998718 1064188 1137322 1218015 1305244 1398015 1496011 1599058 1706351 1816571 1928188 2038987
62688 2038987 2145572 2243960 2330620 2402628 2457292 2492353 2506478 2499095 2470121 2420493 2352760
62677 2352760 2270329 2176108 2072450 1962239 1849129 1736444 1626331 1520164 1419211 1324726
62667 1324726 1237716 1158662 1087120 1021709 961101 905135 854530 809519 769359 733257 701111
62656 701111 673018 648597 627126 608038 590945 575475 561356 548506 536773 525740 514958
62645 514958 504337 494272 485425 478272 472707 468098 463834 459673 455537 451339 447353 444390 443117 443344
62631 443344 444314 445421 446222 446137 444853 442836 440752 438477 435403 431695 428435 426391 425369 424942 425157 426245
62615 426245 428224 431080 434874 439502 444785 450887 458010 465549 472287 477811 483081 489241 496423 504162
62601 504162 512398 521473 531608 543050 556528 572940 592637 615413 641068 669579 700778 734148
62589 734148 768947 804339 839542 873985 907111 937871 964674 986108 1001502 1010539 1012656 1007305
62577 1007305 994779 976370 953570 927308 897968 865974 832211 797915 764259 732083 701931
62566 701931 674123 648652 625199 603452 583333 564793 547633 531836 517878 506274 496883 489104
62554 489104 482653 477675 474068 471237 468679 466382 464476 462969 462028 462068 463165 464676 465774 466252 466601
62539 466601 467452 469088 471315 473611 475526 477079 478662 480480 482284 483751 484975 486567 489390 494243
62525 494243 501547 511201 522822 536173 551348 568660 588531 611385 637536 667264 701116 739799
62513 739799 783580 832080 884942 942276 1003956 1068807 1134997 1200910 1265026 1325363 1379931
62502 1379931 1427595 1467637 1498532 1518191 1525613 1521531 1507277 1483935 1452882 1416312 1376667 1336121
62490 1336121 1296871 1261244 1231010 1207087 1190109 1180695 1178880 1184090 1196068 1215174 1241304 1273255
62478 1273255 1309714 1350224 1394461 1440892 1486570 1527812 1560896 1583140 1594263 1596205 1590767 1577536
62466 1577536 1554458 1519924 1473834 1417570 1354004 1287034 1219870 1153671 1088427 1024825 964378
62455 964378 908079 856105 808920 767646 732987 704571 681580 663360 649157 637987 629279 623123
62443 623123 619546 617979 617881 619456 623180 628817 635497 642757 650964 660396 670238 678953 685625 690491 693964
62428 693964 695593 694497 690576 684650 677426 668987 659435 649313 639021 628434 617569 607085 597481
62415 597481 588177 578089 566932 555415 544306 533912 524381 515818 507949 500185 492260 484570 477792
62402 477792 472422 468631 466252 464770 463571 462385 461417 461015 461253 461795 462120 462011 461855 462253 463321 464672
62386 464672 466124 467995 470467 473168 475847 479123 483887 490037 496349 501737 506274 510894 516371 522758
62372 522758 529621 536630 543920 551950 561085 571384 582669 594673 607228 620598 635567 652870
62360 652870 672619 694662 719406 747755 780190 816469 856334 899861 946844 996397 1047419
62349 1047419 1098813 1148860 1195016 1234907 1267209 1291329 1306967 1314580 1315556 1311081 1301130 1285255
62337 1285255 1263960 1238484 1209573 1177353 1142391 1106078 1069872 1034695 1001202 970137 942289
62326 942289 918218 897911 880567 865103 851087 838621 826905 813735 797338 778256 758477
62315 758477 739053 719574 699725 680073 661175 643002 625676 609888 596121 584078 573290
62304 573290 563758 555625 548786 543264 539584 538276 539208 541668 544912 548468 552118 555884 559938 564328
62290 564328 568827 573102 577066 581060 585619 590787 595717 599385 601890 604517 608139 612109 615239 617325
62276 617325 618998 620511 621727 623133 625817 630180 635483 640945 646672 653212 660741 669009 677720 686772
62262 686772 696404 707295 720280 735974 754834 777387 803938 834296 868322 906584 949881 998105
62250 998105 1049996 1103789 1157462 1208619 1255044 1295508 1329509 1356393 1375487 1386871 1391049 1387861
62238 1387861 1376720 1357892 1332359 1300288 1261031 1215107 1164888 1112642 1059184 1005355 953547
62227 953547 906287 864044 825770 791065 760428 733791 710386 690123 673594 660407 648815
62216 648815 637648 627593 619769 613811 608253 602340 596561 591601 587634 584730 583191 583078 583857 584916
62202 584916 586344 588875 593110 598971 605882 613269 620864 628683 636859 645408 654150 662843 671346 679518
62188 679518 687047 693587 699127 704094 709139 714918 721958 730349 739519 748645 757328 765518 772851 778655
62174 778655 782803 785988 788847 791472 794211 798301 804988 814465 826367 840945 858967 880761 906161
62161 906161 935210 967979 1003602 1040247 1076069 1109511 1138775 1161978 1178229 1188016 1192366 1192176
62149 1192176 1188287 1181351 1171218 1157031 1138246 1115142 1088325 1058444 1026627 994450 963120 933181
62137 933181 905305 880698 860253 843830 830728 820405 812344 805788 800088 794945 789969 784501 778300
62124 778300 771905 765836 759863 753613 747484 742339 738574 736184 735535 737335 741628 747229 752332 755483
62110 755483 756009 753860 749328 742946 735616 728606 723042 719151 716070 712355 706683 698402 687939 676729
62096 676729 666291 657243 649488 643234 639204 637703 638116 639605 641820 644673 647971 651698 656201 661673
62082 661673 667780 674260 681538 690333 700783 712335 724358 736660 749572 763721 779415 796077
62070 796077 812529 828033 842779 857281 871827 886730 902509 919290 936554 954096 972917
62059 972917 994432 1018782 1044407 1069159 1091425 1110265 1125133 1135782 1142232 1144626 1143167 1138162
62047 1138162 1129863 1118139 1102318 1081480 1055137 1023821 988962 952077 914191 876108 838849
62036 838849 803297 769589 737465 707163 679387 654404 631887 611781 594551 580229 567895
62025 567895 556591 546241 537221 529471 522502 515927 509531 503092 496535 489993 483446 476593 469410 462470
62011 462470 456390 451308 447142 443898 441376 439058 436778 435087 434503 434756 435273 436041 437425 439443 441828
61996 441828 444664 448337 452810 457385 461221 463923 465685 467066 468432 469447 469271 467345 463721 458576
61982 458576 451940 444125 435925 427981 420372 413126 406587 400890 395602 390411 385740 382101 379269 376661
61968 376661 374205 372228 370795 369739 369071 368790 368558 368184 368182 369203 371066 372977 374598 376314 378517 381183
61952 381183 384155 387363 390718 394124 397575 401028 404357 407704 411603 416462 422185 428582 435745 443604
61938 443604 451594 459287 467046 475523 484819 494657 504954 515636 526275 536486 546290 555409 562777
61925 562777 567696 571140 574822 579008 582226 583133 581745 578732 574450 569108 563178 557295 552094 548274
61911 548274 546363 546341 547965 551451 557334 565636 575740 587061 599287 611888 624055 635327 645802
61898 645802 655503 663934 670320 674032 674855 673384 671143 669769 669910 671196 673155 675694 678840 682555 686837
61883 686837 691456 695635 698401 699107 697145 691523 681623 668315 653388 637747 621040 603206 585456
61870 585456 569233 554887 541931 530171 520061 512164 506570 502716 499723 497169 495518 495508 497164
61857 497164 499839 503128 507306 512965 520721 531044 543713 557600 571762 586645 603377 621931
61845 621931 640992 659670 678188 696481 713340 727568 739120 748326 754779 757784 757385 754215 748747
61832 748747 741410 733008 724396 716067 708647 703400 701520 703086 707307 713561 721640 731184 741516 752031
61818 752031 762229 771366 778512 782987 784521 783069 778802 772146 763561 753386 742193 731106 721368
61805 721368 713573 707483 702460 697803 692821 686958 679896 671441 661372 649621 636517 622738 609094
61792 609094 596409 585293 575818 567554 560141 553641 548176 543462 539030 534784 531092 528407 526989 526847
61778 526847 527648 528728 529446 529672 529868 530690 532583 535630 539654 544367 549438 554531 559522 564832 571390
61763 571390 580003 590758 603237 617249 633040 650795 670198 690552 711115 731333 750931 769721
61751 769721 787047 801491 811455 816033 815085 808642 796861 780592 761416 740747 719238 697289
61739 697289 675748 655703 637755 621790 607418 594438 582870 572679 563574 555225 547685 541381
61727 541381 536511 532700 529508 526981 525295 524109 522856 521555 520715 520439 520230 519791 519380 519191 518946 518388
61711 518388 517725 517249 516847 516141 514848 512815 509953 506383 502461 498468 494433 490215 485611 480482 475087
61696 475087 470155 466183 462722 458846 454333 449892 446223 443361 440935 438481 435419 431342 426566 421976
61682 421976 418174 415155 412743 410737 408671 406138 403528 401787 401233 401176 400835 400024 398856 397529 396547 396391
61666 396391 396726 396760 396558 397076 398623 400300 401508 402961 405537 409012 412764 416930 422023 428047 434817
61651 434817 442440 450573 457822 462919 466071 468159 469067 467922 464712 460593 456633 453189 450428 448489
61637 448489 447049 445660 444673 445087 447319 450767 454697 458894 463285 467541 471334 474546 477021 478404 478328
61622 478328 476453 472391 466014 457918 449230 440878 433184 426039 419189 412511 406270 400929 396467 392230
61608 392230 387807 383629 380183 377070 373530 369553 365697 362017 358055 353861 350169 347382 345097 342811
61594 342811 340441 337944 335047 331681 328265 325313 323085 321692 321107 321001 320999 321159 321733 322435 322534 321827 320906
61577 320906 320241 319571 318611 317831 317999 319191 320711 321869 322525 322991 323713 325037 327000 329299 331519 333456
61561 333456 335262 337321 339879 342667 344966 346241 346639 346660 346475 345949 345233 344923 345426 346487 347495 348068
61545 348068 348219 348139 348006 347913 347858 347834 347935 348282 348806 349186 349075 348422 347602 347179 347370 347796 347978 348087 348810 350319
61525 350319 351747 352021 350936 349148 347403 346113 345441 345247 345054 344460 343578 342843 342471 342433 342788 343684 345108
61508 345108 346996 349471 352593 355949 358891 361217 363353 365906 369239 373387 378098 383064 388311 394182
61494 394182 400643 406928 412282 416789 420971 424849 427952 430103 431523 432237 432019 430994 429697 428457 427321
61479 427321 426692 427447 430119 434348 439336 444492 449487 454099 458190 461551 463724 464278 463283 461095 457783
61464 457783 453253 447955 442722 437735 432333 426226 420310 415742 412691 410498 408710 407345 406352 405455 404601
61449 404601 404126 404355 405271 406647 408347 410408 412892 415666 418350 420631 422626 424753 427154 429461 431185
61434 431185 432100 432166 431384 429983 428537 427586 427130 426738 426142 425601 425752 427166 429989 433795 437773 441199 443835
61417 443835 445949 447942 449936 451642 452611 452611 451699 450002 447590 444743 442115 440328 439344 438482 437153 435460
61401 435460 434028 433334 433276 433339 433114 432603 431989 431272 430328 429342 428813 428998 429587 430209 431051 432671 435292 438606
61383 438606 442205 445915 449687 453510 457566 462258 467879 474245 480778 487084 493436 500500 508330 515782
61369 515782 521323 524465 525999 526762 526750 525664 523761 521548 518971 515485 510879 505581 500276 495579 491911
61354 491911 489286 487301 485649 484497 484077 484218 484731 486010 488592 492153 495495 497553 498037 497150 495258
61339 495258 493016 491390 491281 493111 496568 500564 503751 505559 506587 507624 508588 508934 508730 508591 508695 508738
61323 508738 508850 509669 511338 513224 514961 517106 520309 524454 529050 534072 539952 547067 555553 565351 576159
61308 576159 587576 599491 612071 625247 638711 652598 667621 684018 700659 715612 727455
61297 727455 735698 740205 740788 737498 731017 722633 713699 704965 696244 686804 676142 664417 652233 640241
61283 640241 628921 618419 608486 598824 589579 581311 574392 568697 563987 560338 558026 557136 557426 558475
61269 558475 559815 561014 561730 561811 561481 561426 562424 564616 567425 570436 574173 579539 586647 594573 602193 608823
61253 608823 614097 617846 620333 622308 624591 627654 631532 635919 640383 644710 648877 652497 654651 654772
61239 654772 653512 652161 651280 650436 649111 647256 644944 642182 639205 636382 633781 631430 630072 630926 634453
61224 634453 639995 646846 654989 664425 674434 684106 693103 701461 709002 715512 721269 726876 732683 738609
61210 738609 744395 749774 754515 758513 761726 764019 765334 766115 767187 769076 771729 775019 779153 784456
61196 784456 791172 799638 810213 822668 835958 848926 860976 871898 881284 888462 892841 894145 892577
61183 892577 888853 883891 878284 872201 865781 859276 852743 845932 838615 830713 822121 812772 802939 793056
61169 793056 783159 772983 762677 752805 743488 734118 724193 713909 703616 693235 682638 672166
61157 672166 662319 653290 645188 638308 632768 628181 624167 620950 619068 618720 619755 622008 625178 628455
61143 628455 630692 630947 628778 624300 618292 612002 606446 601887 598144 595221 593394 592852 593538 595304 598075
61128 598075 601953 607286 614451 623437 633797 645156 657596 671431 686790 703591 721751 741261
61116 741261 762154 784471 808146 832894 858329 884184 910292 936490 962755 989241 1015795
61105 1015795 1041556 1065543 1087628 1108434 1128110 1145637 1159544 1169021 1174232 1175863 1174550 1170547
61093 1170547 1163851 1154686 1143689 1131422 1117979 1103510 1088818 1074816 1061509 1048216 1034791 1022014
61081 1022014 1010644 1000658 991604 983202 975453 968526 962610 957579 952910 948336 944385 941694 940028 938578
61067 938578 937101 936024 935594 935689 936348 937642 939048 939861 940226 940883 941909 942650 943008 943776 945547 948175 951477
61050 951477 955501 959851 963736 966991 970335 974493 979891 987186 996989 1008880 1021722 1035094 1049492
61037 1049492 1065146 1081822 1099740 1119329 1140052 1161040 1182992 1207727 1235550 1264882 1294993
61026 1294993 1327158 1362265 1399173 1436455 1474060 1512222 1550562 1589666 1632083 1680368 1735366
61015 1735366 1797512 1868321 1949296 2040780 2143138 2257965 2387695 2536372 2712412 2929006
61005 2929006 3200885 3542734 3971015 4503296 5154010 5935275 6864725 7968136 9272537
60996 9272537 10805197 12601599 14687405 17007383 19351385 21378534 22768469 23392726
60988 23392726 23365085 22948605 22427531 22041482 21963383 22249276 22765948 23192028 23150634 22398826
60978 22398826 20932400 18943830 16699091 14436325 12325536 10464757 8887233 7578820
60970 7578820 6504165 5626329 4911099 4325795 3842769 3443103 3113475 2840582 2610854
60961 2610854 2413694 2241976 2090103 1953823 1831262 1721932 1624721 1537961 1460818 1393178
60951 1393178 1334509 1283885 1240600 1203646 1170997 1140314 1110006 1079100 1046960 1014074 982326
60940 982326 953354 927011 902182 878453 856118 835157 815258 796451 778806 761792 744733
60929 744733 727680 711263 695976 682141 670096 659844 650817 642466 634745 627713 621169 615047 609512
60916 609512 604299 598693 592586 586819 581932 577404 572767 568671 566007 564671 564030 563951 564478 565004 564773 563871
60900 563871 562870 561756 560088 558006 556211 554934 553587 551525 548695 545514 542415 539447 536176 532161
60886 532161 527650 523354 519353 514681 508402 500691 492531 484732 477588 471144 465432 460677 457305 455354
60872 455354 453946 451988 449543 447711 447057 446969 446811 446747 447015 447377 447957 449734 453407 458434 463820 469231
60856 469231 474595 479277 482453 483952 484141 483523 482932 483464 485475 488181 490793 493406 496110 498074 498411
60841 498411 497374 495745 493548 490289 486032 481237 475850 469524 462543 455651 449201 443253 438263 434693
60827 434693 432011 428938 424860 420404 416589 413891 412060 410371 408127 405281 402390 399662 396489 392368
60813 392368 387769 383461 379444 375355 371603 369219 368624 369221 370073 370397 369623 367688 365337 363549 362625 362145
60797 362145 361643 360897 359894 359013 358923 359718 360452 360197 359325 359073 360028 361739 363620 365424 366881 367616 367639 367355
60779 367355 366975 366350 365451 364641 364374 364837 365815 366702 366891 366410 365903 365708 365387 364624 364122 364929 367029 369295
60761 369295 370755 371382 371744 372394 373566 375076 376492 377657 378820 380005 380577 379914 378273 376582 375587 375569
60745 375569 376534 378168 379824 381056 382007 382920 383483 383053 381267 378084 373639 368494 363673 359900 357033
60730 357033 354585 352430 350625 349051 347751 347138 347304 347583 347403 347091 347176 347396 347168 346703 346834 347970 349886
60713 349886 352257 354717 356683 357806 358374 358740 358799 358636 359073 360641 362456 363140 362565 361781 361533 361839 362691
60696 362691 364013 364998 364650 363051 361195 359549 357769 355801 354225 353350 352886 352668 352842 353231 353425 353656
60680 353656 354709 356748 359092 361318 363769 366723 369871 372907 375881 378681 380884 382358 383373 383905
60666 383905 383500 382046 379994 377659 374971 372103 369603 367660 365929 364240 362782 361488 360087 359026
60652 359026 359352 361254 363615 365573 367661 370758 374642 378371 381471 383916 385381 385387 384050 381924 379238
60637 379238 375928 372339 369172 366625 364151 361343 358659 356918 356334 356337 356277 355962 355472 354851 354351 354690 356456
60620 356456 359183 361587 362909 363508 363872 363690 362472 360566 358865 357779 357176 357061 357634 358777 360089 361354
60604 361354 362464 363124 363246 363379 364126 365286 366279 367174 368495 370192 371726 373119 374978 377358 379572 381319
60588 381319 383115 385283 387323 388702 389579 390260 390527 389986 388691 387051 385396 383982 383161 383302 384648 387229
60572 387229 390719 394515 398327 402547 407655 413523 419875 427140 436015 446248 456607 466085 474418 481417
60558 481417 486645 489851 491003 489803 486019 480448 474714 469803 465551 461802 459212 458494 459539 461779
60544 461779 464905 468924 474009 480544 488790 498370 508701 520070 533554 549673 567904 587669 608836
60531 608836 630778 651868 670539 686183 698389 706033 707924 703987 695208 682779 667809 651489
60519 651489 634920 618862 603982 591046 580558 572494 566558 562337 559126 556257 553905 552951 553762
60506 553762 555756 558568 562866 569449 578226 588902 602144 619180 640530 665919 695283 729009
60494 729009 767046 808345 851303 894406 936416 976324 1013369 1047074 1077285 1104167 1127836
60483 1127836 1147765 1162632 1170864 1171165 1162493 1143913 1114885 1075829 1028438 975539 920366 865512
60471 865512 812419 761952 715230 673478 637280 606472 580620 559025 540461 523759 508771
60460 508771 496051 485530 476254 467600 459871 453354 447581 441994 436646 431733 427014 422186 417387 412828
60446 412828 408375 403953 399970 396895 394707 393174 392353 392454 393352 394500 395147 394675 393049 390989 389278
60431 389278 387950 386624 385447 384915 384776 384151 382995 382443 383236 384676 385688 386135 386483 386897 387405 388368 389985
60414 389985 391747 393019 393863 394731 395686 396445 396954 397470 398303 399743 401882 404331 406540 408642 411395 415065
60398 415065 418999 422576 425866 429004 431726 434045 436607 439736 442815 445237 447351 449794 452597 455643
60384 455643 459284 463597 467667 470615 472935 475789 479277 482373 484496 486233 488412 491153 493980 496458
60370 496458 498717 501541 505613 510401 514230 515971 516244 516484 517309 518451 519740 521332 523203 525211 527497
60355 527497 530174 532796 534866 536773 539551 543668 548592 553501 558039 562367 566860 571603 575954 578872
60341 578872 579987 579971 579533 578482 576325 573317 570239 567446 564785 562257 560080 558119 555783 552493 547971
60326 547971 542198 535403 527919 519826 511099 502273 494442 488150 482760 477407 472164 467771 464691 463083
60312 463083 463342 465980 471036 478038 486413 495692 505573 515970 526652 536793 545557 553262 561055 569025
60298 569025 575527 578999 579474 577676 573585 566947 558310 548432 537245 524598 511593 500092 491228
60285 491228 485251 482235 481774 482397 482599 482264 482127 482163 481701 480788 480079 479463 478120 476026 474157 472978 471811
60268 471811 469970 467547 464785 461596 458049 454626 451710 449418 447992 447645 447915 447894 447221 446264 445271 444086
60252 444086 442756 441708 441190 441122 441586 442873 444987 447647 450705 453973 456724 458128 458207 457836 457832 458530 459992
60235 459992 461861 463222 463345 462548 461661 460921 460217 460139 461722 465157 469671 474674 480089 485607 490668 495417
60219 495417 500765 507297 514823 523046 531840 540844 549696 558771 568809 579711 590615 601216 611988
60206 611988 622962 633375 642886 652123 661569 670822 679441 687641 695612 702928 709246 715001 720785 726496
60192 726496 731580 735736 738962 741312 742889 743750 743600 741985 738981 735326 731672 727967 723601 717933 710820
60177 710820 703080 696184 690967 686846 682855 679027 675963 673456 670729 667834 665552 663838 661665 658635
60163 658635 655528 652863 650053 646543 642727 639137 635572 631676 627684 624115 621350 619857 619983 621095
60149 621095 621754 621273 620427 620182 620546 621102 621761 622335 622213 621281 620502 620800 621911 623101 624512 626899 630313
60132 630313 633895 636951 639679 642763 646533 650529 653836 656037 657817 660252 663566 667176 670924 675523
60118 675523 681573 688885 697097 706231 716245 726643 737017 747490 758260 769122 779685 789568
60106 789568 798265 805464 811653 817632 823152 826871 828056 827476 826166 824174 821202 817620 814041 810387
60092 810387 806167 801293 795983 790238 784016 777547 770917 763670 755345 746130 736555 726924 717423 708382
60078 708382 699919 691707 683516 675703 668772 662762 657331 652050 646397 640006 633300 627345 622636 618480
60064 618480 613948 608960 604039 599529 595486 591903 588527 584826 580583 576232 572295 568926 566206 564366
60050 564366 563327 562530 561639 560946 560802 561160 561970 563440 565590 568138 571179 575247 580310 585442 589981 594330
60034 594330 599070 603965 608500 612748 617024 621147 624705 627513 629219 629077 626815 623278 619477 615363
60020 615363 610134 603356 595208 586107 576721 567905 559919 552124 544043 536251 529582 523973 518868 514281
60006 514281 510513 507095 503010 497972 492792 488440 485282 483190 481889 481148 480913 481179 481687 482102 482666 484099
59990 484099 486581 489476 492485 496324 501684 508166 514942 521836 528989 536029 542407 548157 553434 557679
59976 557679 560042 560440 559461 557520 554785 551591 548135 544030 538927 533344 528130 523361 518491 513385 508503
59961 508503 504269 500998 499218 499253 500573 502216 503729 505145 506269 506775 506850 507055 507686 508883 511116 514776
59945 514776 519428 524194 528744 533241 537485 540956 543614 545852 547645 548519 548516 548471 549126 550502 552231 554054
59929 554054 555907 558023 561006 565349 570830 576756 582768 589023 595590 602115 608046 612941 616725 620013
59915 620013 623989 629521 636445 643987 651591 658953 665635 671254 675892 679718 682323 682864 680818 676269
59901 676269 669650 661662 653235 645109 637441 630074 623014 616499 610978 607190 605759 606407 608169 610696
59887 610696 614648 620370 626990 633536 640117 647192 654375 661047 667526 674602 682257 689921 697555 705402
59873 705402 712973 719410 724591 728808 731566 731953 730118 727158 723516 718697 712649 706215 699891 693315
59859 693315 686460 680370 676139 673837 672884 672829 673341 674031 674763 675817 677517 679993 683375 687804 693174 699209
59843 699209 705639 711779 716131 717248 715153 711375 707538 704434 702367 701565 702068 703664 705959 708074 708489
59828 708489 706083 701391 696168 691605 687583 683583 679445 675075 670305 665450 661403 658801 657517 657136
59814 657136 657440 658271 659418 660889 662855 665155 667208 668494 668791 667998 666205 663928 661796 659947 658086
59799 658086 655994 653487 650046 645206 639425 633943 629593 626096 622578 618472 613979 609991 607373 605989
59785 605989 604651 602460 599756 597286 594979 592409 589958 588441 587668 586475 584251 581627 579580 578606 578765
59770 578765 579769 581050 582474 584950 589519 595905 602712 608998 614826 620482 626194 632594 640329 649090
59756 649090 657987 667003 677034 688354 700197 712110 724607 737991 751510 764181 775585 785358
59744 785358 792706 797006 798329 797058 793640 788966 784204 779887 775779 771822 768409 765501 762418 758948
59730 758948 755856 753811 752587 751752 751387 751677 752458 753635 755377 757488 759312 760683 762214 764189 766000
59715 766000 767224 768499 770677 773768 777413 781740 787040 793101 799609 806763 814831 823507 832459 842204
59701 842204 853693 867115 881655 896370 910923 925578 940820 956791 972789 987501 1000011
59690 1000011 1010437 1019455 1027499 1034613 1040713 1045667 1049338 1051769 1053135 1053370 1052122 1049178 1044594 1038335
59676 1038335 1030119 1019787 1007575 993994 979738 965727 952792 941274 931194 922659 915655 909651
59664 909651 904103 899459 897054 897910 902110 909261 918965 930761 944249 959421 976350 994570 1013257
59651 1013257 1031903 1050203 1067428 1082687 1095704 1106420 1113819 1116125 1112374 1103023 1088910 1070510
59639 1070510 1048382 1023453 996561 968436 940276 913528 888930 866556 846786 830224 816500
59628 816500 804308 792981 782997 774539 766632 758166 748745 738012 725219 710203 694017 677890
59616 677890 662256 647263 633451 621263 610591 601337 593769 587846 582935 578738 575774 574442 574204
59603 574204 574208 574065 573683 573044 572542 572712 573250 573153 572172 571259 571109 571279 571242 571265 571551 571540 570791 569680 568495 566788
59583 566788 564389 562045 560122 557583 553375 548088 543144 538970 535077 531408 528430 526117 523926 521680
59569 521680 519749 518385 517449 516710 515992 515246 514750 514853 515360 515661 515629 515738 516137 516475 516891 518088 520031 521653
59551 521653 522491 523507 525550 528010 529906 531397 533409 536527 541010 547039 554253 562045 570987 582776
59537 582776 597962 615168 633758 655591 681964 709593 731745 743411 744233 737059 725575 713362
59525 713362 703293 696730 693610 693294 694860 697067 698965 700404 701397 701409 699930 697108 692937 686531 677315
59510 677315 666348 655324 644731 634133 623766 614494 606424 598805 591246 584023 577386 571519 566928
59497 566928 563838 561400 558550 555488 553372 552813 553592 555556 558717 562685 567024 572016 578153 585130 592313
59482 592313 599866 608322 617309 625787 633376 640346 646477 651003 653630 654676 654382 653036 651463 650308
59468 650308 649081 646933 644086 641353 638562 634860 630441 626615 624126 622635 622001 622842 625686 630555 637385
59453 637385 645818 654653 662731 670327 678469 686944 694318 699990 704702 708731 711030 710700 708008 703325
59439 703325 696217 686460 675113 663836 653636 644692 636806 629678 623247 617983 614340 611880 609700
59426 609700 607749 606915 607717 609844 613119 617954 624623 632937 642932 654971 668924 684149 700515 718527
59412 718527 738159 758803 780875 806039 834373 861777 881492 888601 882940 868224 849296 830186
59400 830186 813760 802136 796975 799383 809439 825334 842553 854495 855454 844096 823939 800245
59388 800245 776894 756054 739151 726597 717220 709407 702827 698203 695768 694963 695358 696738 698426 699660
59374 699660 700635 702267 704898 708047 711292 714483 717263 719335 721116 723219 725473 727394 729352 732177
59360 732177 735832 739661 743803 749094 755619 762717 770457 779795 791068 803635 817289 832746 850363
59347 850363 869559 889864 911380 933798 956163 978221 1000930 1024941 1049426 1072898 1094298
59336 1094298 1112757 1127291 1137585 1144436 1148646 1149902 1147283 1140455 1129873 1116251 1100364 1083099
59324 1083099 1065216 1047047 1028534 1009503 989945 970195 950566 930686 909733 887853 866753
59313 866753 848107 831784 816369 800965 785514 769903 754033 738698 725291 714616 706706 701522
59301 701522 698849 697926 698379 701317 708277 719208 732455 746198 758428 766044 766097 758353 745263 729260
59287 729260 711594 693800 678208 666130 656942 649737 644727 642405 642538 644701 648807 654528 661170
59274 661170 668653 677741 688913 701899 716533 732957 750631 768278 785254 801929 818273 833112
59262 833112 845225 854267 860290 863375 864039 862974 860073 854707 847160 838661 829828 820322 810327 801021
59248 801021 793137 786259 779948 774401 769694 765601 762471 761016 760844 760560 759680 759054 759050 758797 757791 756682
59232 756682 755811 754398 751928 748980 746015 742643 738702 734638 730148 723979 715864 707254 699307 691500
59218 691500 683050 674220 665365 656197 647024 639277 633693 629250 624966 621418 619414 618426 617515 616617 615892
59203 615892 615073 614569 615892 619689 624467 628496 631922 635890 640769 646441 653171 660818 668269 674972 682092
59188 682092 690899 700991 711308 721819 732876 743936 754355 764505 774703 783858 790531 794567
59176 794567 796460 796003 792920 787963 782004 774864 766372 757661 749944 742811 735295 727890 721978 717778
59162 717778 714388 711312 708530 705539 701820 697882 694477 691139 686752 681253 675494 669731 663496 656794
59148 656794 650344 644726 640029 636026 632055 627288 621807 616699 612406 607844 601968 595229 588533 581877
59134 581877 575116 568969 563996 559491 554748 550509 547850 546571 546068 546801 549330 552752 555792 558781 562966
59119 562966 568565 575123 583157 593585 605907 618566 630880 643094 654910 665515 674872 683536
59107 683536 691367 697658 702328 705818 708248 709739 711020 712493 713302 712623 711182 710135 709174 707282 704700
59092 704700 702428 700312 697434 694068 691503 690103 689138 688363 688189 688394 688133 687183 685836 683762 680316 675823
59076 675823 671270 666917 662372 657715 653346 649089 644678 640632 637431 634435 630976 627821 626006 624829
59062 624829 622631 619059 614957 610557 605538 600324 595573 590790 585219 579620 575356 572192 568880 565484
59048 565484 563038 561350 559375 557573 557558 559355 561213 562286 563366 564699 565235 564549 563588 562956 562175 561058
59032 561058 560180 559619 558774 557726 557292 557610 558273 559936 564001 570546 578264 586567 595982 606371 616741
59017 616741 627077 638322 650074 660255 667648 672972 676944 679088 679083 677537 674795 670681 666030 662720
59003 662720 661491 661285 661351 662349 664729 667733 670826 674512 678943 683166 686558 689584 692477 694598 695779
58988 695779 696820 697909 698032 696778 695285 694564 694241 693829 693977 695514 698404 702435 707921 714969 723128
58973 723128 732385 743504 756814 771697 787671 804873 823028 841140 858626 875615 891803 906261
58961 906261 918688 929529 938589 944948 948501 950020 949420 945648 938661 929726 919257 906301 890818
58948 890818 874472 858244 841210 822828 804596 788135 773289 759523 747580 738142 730132 722070
58936 722070 714225 707926 703452 699954 696916 694532 693060 692665 693448 694985 696421 697568 699116 701356 703585
58921 703585 705277 706825 708509 709765 710142 710137 710443 711207 712462 714408 716858 719331 722035 725702 730278 735009
58905 735009 740071 746682 755244 764833 775070 786987 801296 817156 833368 849509 865316 880260
58893 880260 894433 908637 923097 937401 952084 968717 987898 1008742 1030860 1054964 1080803
58882 1080803 1106335 1129994 1152015 1172617 1190678 1205473 1218013 1229332 1238858 1245715 1250131 1252316
58870 1252316 1251469 1247277 1241034 1233833 1224906 1213170 1199240 1184593 1169796 1154836 1140083 1125612
58858 1125612 1110529 1094131 1076817 1058936 1039992 1020027 1000442 982210 964496 946272 928104
58847 928104 911104 895287 880301 866585 854400 842689 830240 817140 804037 790992 778067
58836 778067 765957 754903 744139 733442 723970 716425 709719 702740 696164 691169 687608 684845 683189
58823 683189 683062 683873 685132 687653 692209 698030 703994 710297 717559 725273 732474 739020 745025 750010 753771
58808 753771 757012 760062 762189 763216 764287 765769 766006 763703 759969 756339 752315 746740 740193 733993
58794 733993 728042 721709 715775 711347 707777 703758 699780 697549 697602 699319 702636 707902 714659 722331 731617
58779 731617 743551 757731 772945 788859 805567 822186 837439 850877 862056 869432 871685 869350
58767 869350 863622 854567 842153 827900 813490 798616 782214 765033 748982 734615 721258 709024
58755 709024 698623 689610 680824 672288 664929 658839 653493 649162 646294 643997 640980 637644 635443 634579
58741 634579 634125 634118 635719 639429 644698 651049 658071 664588 669450 673002 676529 680499 684492 688280 691763
58726 691763 694454 696294 698238 700834 703148 704395 705486 707503 709834 711627 713948 718493 725081 732343
58712 732343 739964 748230 756277 762920 768422 773367 776614 776559 773713 769718 764493 756582 745728 732764
58698 732764 717518 699335 679374 659990 641884 624029 606248 589756 575272 562625 552106
58687 552106 544250 538351 532987 527885 523595 519810 515794 511947 509078 506700 503970 501648 501061 501716 502125
58672 502125 502358 503572 505573 507224 508789 511564 515651 520410 526526 535123 545283 555005 564137 573609
58658 573609 582155 586742 586358 582684 576993 569174 559956 551253 543754 536515 529324 523142 517891 512202
58644 512202 505805 500009 495467 491536 488074 485804 484701 484041 484083 485639 488061 489822 491021 492996 495644
58629 495644 497528 498593 500199 502328 503375 502968 502527 502750 502924 502934 503583 504694 505287 505873 508176 512335
58613 512335 516753 520852 525593 531127 536389 541160 546125 550832 554111 556478 559463 562585 563886 563538
58599 563538 563918 565820 567607 568436 569236 570011 569380 567514 566545 567311 568592 570229 573891 579898 586349 592499
58583 592499 600084 610223 621746 633652 646439 659976 672745 684283 695693 706823 715724 721949
58571 721949 727586 733937 740057 745727 752909 762842 774420 786962 801941 820537 841928 865353 891353
58558 891353 919526 947442 973165 996562 1017057 1032592 1042154 1046886 1047591 1043627 1035484 1025806 1016550
58545 1016550 1007586 999192 993043 989230 984984 977986 968500 956928 941899 922446 899669 874765 847861
58532 847861 820151 794546 772579 752976 734676 718681 705570 693942 683024 674201 668196 663211
58520 663211 657585 651979 647321 642995 638590 635014 632322 628937 624543 621224 620136 619582 617957 616054
58506 616054 614871 613745 612273 611503 611618 611086 609597 609039 610035 610550 609639 609409 611240 613193 613420 613163 614039
58489 614039 615305 616340 619033 624988 632747 640354 648431 658398 669954 682587 697276 714408 732244
58476 732244 749599 767756 787617 807317 824570 838911 849726 854977 854113 849550 843019 833307 819919
58463 819919 805976 794759 786123 778965 774422 773721 775472 778103 782767 791069 802119 814446 828458
58450 828458 844322 859634 871842 880853 886956 888522 884201 875105 862616 846598 827958 810036
58438 810036 794999 781593 768782 758466 752034 747541 743206 740563 741157 743264 745034 747820 753212
58425 753212 759805 766152 773843 784281 795398 804900 813674 822558 829017 830736 829415 827249 822786 814259
58411 814259 803875 794588 785495 774660 763660 754988 747625 739600 732357 728205 725847 722773 719751
58398 719751 718672 718413 717199 716699 719357 723914 727866 732004 738124 744628 748912 751913 755888 759972 762346
58383 762346 764419 768377 772927 775994 779149 784704 790949 795125 798721 804825 812521 818999 825006 833087
58369 833087 842402 850348 857396 865500 873824 880907 888799 900067 912980 924688 936708 951992 968961
58356 968961 983984 997376 1011335 1024173 1032435 1036697 1039618 1040342 1036691 1030801 1026722 1024333 1021429
58343 1021429 1019586 1021850 1026677 1030470 1034259 1041618 1051845 1061532 1071119 1083572 1098262 1112451 1127067
58330 1127067 1144625 1163280 1179337 1193781 1209779 1225732 1237556 1245864 1253986 1260879 1263224 1262720
58318 1262720 1263942 1266626 1267321 1266954 1269284 1273570 1276379 1279125 1286043 1296235 1305495 1314589 1327806 1344685
58304 1344685 1361100 1377226 1396438 1417693 1437050 1455303 1476047 1497769 1516173 1532637 1551850
58293 1551850 1572856 1591281 1608519 1629390 1652423 1672126 1689397 1709898 1733549 1755683 1777242
58282 1777242 1803390 1833084 1860498 1885875 1914418 1945488 1973837 2000612 2031877 2066932 2099527
58271 2099527 2130102 2165229 2205288 2244488 2282779 2325837 2373489 2420187 2466653 2518864 2576001
58260 2576001 2631938 2687917 2750604 2818315 2882959 2944940 3011705 3082088 3147401 3208085 3273606
58249 3273606 3345512 3416687 3487915 3568389 3658613 3749868 3842141 3945129 4059667 4175919 4292081
58238 4292081 4416847 4551296 4687224 4825880 4979060 5148787 5325511 5509060 5710775
58229 5710775 5932011 6162130 6401170 6662316 6948385 7249081 7565278 7911681 8291340
58220 8291340 8693122 9118948 9586703 10101359 10651784 11241653 11893566 12616884 13403826
58211 13403826 14264110 15229199 16315092 17518188 18857027 20379300 22119469 24094229
58203 24094229 26352579 28985667 32078221 35707761 40014871 45227411 51607200 59438338
58195 59438338 69079395 80942383 95392297 112751828 133420834 157867491 186464805
58188 186464805 219461234 257006606 298568778 341599213 380727935 409020668 420985046
58181 420985046 415094731 393992467 362680144 326353772 289053747 253251162 220081580
58174 220081580 189926611 162949911 139268135 118849106 101471421 86832683 74621266
58167 74621266 64487534 56052432 48993009 43075890 38100556 33871239 30240403 27123364
58159 27123364 24446893 22123951 20090448 18320220 16783992 15429670 14217346 13137601
58151 13137601 12179619 11313409 10517857 9795894 9147353 8553975 8004027 7505392 7061280
58142 7061280 6657004 6282469 5944537 5645688 5372445 5115896 4882358 4672872 4472501
58133 4472501 4271113 4075965 3893456 3716761 3541799 3377730 3230907 3094392 2963006
58124 2963006 2843136 2738283 2640001 2542452 2451543 2370929 2293145 2213367 2138283 2072573 2009688
58113 2009688 1944550 1882697 1828397 1775925 1721021 1669300 1625059 1582885 1538331 1496048 1459554
58102 1459554 1423436 1383430 1344219 1309862 1276130 1239468 1204073 1173277 1143236 1111671 1083433
58091 1083433 1060901 1038238 1011772 986816 967628 949782 929273 910131 895980 882624 866006
58080 866006 849343 835573 820782 801937 783373 768867 754829 737966 722161 711071 701190 688982
58068 688982 677759 670768 664321 654617 644846 638848 634028 627112 620803 618145 616071 610880 604547 599571
58054 599571 593260 583152 572465 564179 555228 542558 529425 519717 511420 501693 493040 488255 484439
58041 484439 478212 471923 468590 465480 458946 451076 445480 440823 434498 428370 424847 421313 414398 405968
58027 405968 399199 392577 383419 373570 366015 359420 351425 343705 338424 333367 325958 318495 314001 310483
58013 310483 304781 298597 295168 293285 290124 286848 285866 285503 282852 279280 277955 278492 278874 279818 282425
57998 282425 284447 283805 282950 284847 287609 287999 287171 287796 288562 286960 284768 285258 287297 287633 286835 287665 289543
57981 289543 289823 288766 288313 287748 285405 282923 283028 284779 285544 285889 288011 291192 293357 295335 299046 303231
57965 303231 305473 306674 309066 311562 311515 309404 307408 305123 301066 296553 293606 290801 285678 279446 274764
57950 274764 270720 264840 258389 254677 253433 251733 249321 248316 248701 248836 249526 253008 258683 264141 269559
57935 269559 276853 285502 293446 301095 310068 318945 324700 327517 329945 332131 332173 330217 327797 323949 316564
57920 316564 306962 298635 291855 283955 274521 265944 259028 252334 245836 241165 238276 235691 233880 234627
57906 234627 237325 239647 241549 244731 248524 250297 249737 248763 247384 243658 237839 232711 229563 227404 226120
57891 226120 226753 228619 229754 230372 232531 236369 240014 243053 246710 250784 253891 256518 260300 264517 266886
57876 266886 267565 268667 270089 269681 267522 266097 266131 266036 265632 266524 268478 269319 268864 269209 270661 271135 270213
57859 270213 270113 271895 274208 276509 280064 284912 289220 292465 296135 300516 303929 305880 307854 310285
57845 310285 311747 311803 311626 311248 309291 306047 303815 303450 303477 303091 303059 303263 302479 301106 300923 301664 301100 299052
57827 299052 297903 298437 298687 297858 297953 300282 303533 306509 309709 312975 314606 314164 313376 313057 311863 309249
57811 309249 306781 305204 302816 298100 291530 283724 274258 263440 252862 243240 234004 225668 219970 216944
57797 216944 214625 212400 211737 212725 213038 211585 210214 210430 211241 211693 212726 214948 217092 218262 219369 220968
57781 220968 222074 222476 223828 227051 231003 234906 239661 245430 250522 254145 257799 262317 265929 266924 266045
57766 266045 264664 262684 259843 257059 254867 252396 249310 246912 246043 245797 245447 245623 246539 247200 247531 249054
57750 249054 252293 255827 259062 263472 269734 276105 281193 285908 291103 295708 298971 302135 305971 308867
57736 308867 309348 308492 307927 307433 306366 305527 305662 305903 305527 305474 306383 307029 306514 306081 306872 307840 307847 307936 309309
57717 309309 310813 310729 309574 308862 308430 307243 305690 304958 305008 304999 304797 304422 303091 300456 297845 296735 297015
57700 297015 297961 299686 302315 305175 308226 312817 319457 326203 330752 332727 332485 329355 322831 314110 304743
57685 304743 295064 285381 277127 271111 266220 261600 258567 258565 260991 265117 272523 285269 303068 324711
57671 324711 351107 384348 424706 471201 524585 587030 658287 733140 802017 853001 875203
57660 875203 863655 822031 759863 687388 613164 544061 484327 434559 393327 359715 333301
57649 333301 312729 296209 283041 273183 265879 260099 255734 253030 251497 250647 251024 253047 255635 257391
57635 257391 258396 259474 260508 260962 261261 262057 262794 262497 261404 260347 259125 256870 253482 249405 244640
57620 244640 239232 234045 229797 225951 221756 217599 214192 211293 208431 206000 204341 202683 200294 197790
57606 197790 196054 194781 193416 192506 192747 193613 194255 194806 195478 195467 194130 192110 189979 187039 182956 179132
57590 179132 176718 174619 171431 168075 166370 166049 165470 164470 164224 164905 165682 166619 168417 170541 171449 170504
57574 170504 168105 164426 159668 155025 151610 148883 145669 142076 138769 135153 130273 124949 120983 118583
57560 118583 116442 114033 111965 110327 108534 106658 105275 104210 102943 101956 102113 103040 103643 103809 104116 104400
57544 104400 104230 104177 104879 105406 104374 102264 100868 100812 101423 102552 104573 106887 108348 109050 109893 110604 110037
57527 110037 108319 106911 106508 106492 106383 106320 106188 105732 105453 106070 107381 108902 111046 114300 117857 120695 123320
57510 123320 126789 130650 133629 135706 137539 138554 137682 135554 133812 132639 131043 129146 127905 126850
57496 126850 124483 120931 117939 116184 114704 113059 111920 111390 110764 110169 110476 111444 111838 111513 111501 111976 112034
57479 112034 111498 110978 110126 107910 104715 102079 100203 97790 94564 91811 90052 88234 85652 82749 79684
57464 79684 76052 72456 70412 70212 70592 70784 71079 71191 70069 67720 65345 63368 61189 59077 58201 58484
57448 58484 58533 58056 58161 58852 58580 56962 55685 55912 56851 57774 59286 61617 63618 64656 65759 67805 70156
57431 70156 72041 73738 75480 76714 77379 78484 80558 82813 84504 85761 86523 86218 85093 84384 84542 84717
57415 84717 84412 84024 83361 81493 78634 76328 75091 73733 71725 70289 70273 70740 70633 70069 69075 66802 63121
57398 63121 59424 56769 54642 52440 50660 49797 49505 49667 50792 52634 54017 54731 55945 58068 59981
57383 59981 61163 62670 65128 67635 69629 71882 74538 76119 75825 75058 75361 76399 77208 77774 78162 77698
57367 77698 76279 74920 73893 72048 69087 66613 65569 64544 62235 59758 58780 58953 58975 58714 58518 57818
57351 57818 56296 55208 55827 57594 59329 61047 63050 64524 64768 64691 65393 66352 66642 66820 67867 69198
57335 69198 69446 68453 66945 65165 63297 62332 62881 63944 64261 64040 63962 63545 62085 60322 59489 59431 59088 58188
57317 58188 57039 55455 53284 51275 50160 49620 49275 49633 50801 51447 50558 49179 48829 49193 49036 48403 48190
57300 48190 48349 48257 48147 48515 48794 48227 47414 47442 48166 48864 49759 51255 52468 52336 51609 51935 53422 54727
57282 54727 55167 55131 54816 54096 53344 52961 52481 51400 50409 50563 51855 53858 56876 60938 64549 66284 67003
57265 67003 68659 71359 73456 74222 74594 75336 76154 76677 76905 76658 75810 75005 75139 76307 78066 80185 82248
57248 82248 83379 83496 83929 85513 87079 87287 86852 87158 87681 86873 84891 83284 82439 81465 80356 80106 80650
57231 80650 80742 80022 79471 79681 80245 80967 82088 83263 83828 84190 85526 88013 90714 93210 95994 99315 103020
57214 103020 107480 113245 119756 125651 130436 134657 138614 142134 145453 149017 152630 156074 160267 166384
57200 166384 173917 181055 186897 192059 197337 203133 209970 218123 226794 235039 243319 252815 263438 273955
57186 273955 283848 293583 303225 312379 321467 331475 342322 352918 362904 373029 383708 394546 405364
57173 405364 416513 428068 439841 452104 465234 478839 492381 506435 522102 539345 557149
57162 557149 575067 593433 612276 631258 650501 670303 690321 710118 730075 750595 770893
57151 770893 789814 807279 823747 839032 853127 867389 883191 899904 915940 931251 947185
57140 947185 964429 982828 1002748 1024784 1048505 1073193 1099489 1128746 1161311 1197015 1236615
57129 1236615 1280975 1329614 1381924 1438927 1501679 1568804 1638014 1709504 1785590 1867617 1955627
57118 1955627 2050428 2153323 2264139 2382090 2508302 2645039 2792793 2950716 3119621 3302028
57108 3302028 3499773 3714462 3950156 4213093 4509230 4845165 5231425 5682419 6214024
57099 6214024 6844879 7600393 8513170 9620423 10964080 12591777 14551757 16883661 19613835
57090 19613835 22755728 26309313 30260463 34584768 39250428 44213359 49412245 54770631
57082 54770631 60187838 65499503 70438039 74656415 77826667 79739844 80330360 79631463
57074 79631463 77728063 74744276 70847108 66240242 61148197 55799574 50408718 45156383
57066 45156383 40178548 35567343 31376654 27626767 24311136 21406488 18880606 16695259
57058 16695259 14809016 13182157 11779480 10569126 9521637 8611559 7818431 7125341
57050 7125341 6517736 5983716 5513622 5098575 4730512 4403540 4113579 3856362 3627165
57041 3627165 3422397 3239777 3076711 2930036 2797530 2678191 2570795 2473634 2385888 2307892
57031 2307892 2239718 2180782 2131103 2091811 2064127 2048966 2047856 2062980 2094827 2138805 2183272
57020 2183272 2211293 2206959 2163137 2084382 1982442 1869514 1755334 1647483 1550851 1466383 1392188
57009 1392188 1326372 1268030 1216143 1169240 1126376 1087361 1052017 1020054 991432 965882 942365
56998 942365 919878 898394 878148 858624 839290 820703 803720 788208 773770 761192 751764 745560
56986 745560 741631 739623 739978 742810 747548 753149 757479 757087 749098 733399 712141 687696 662036 637193
56972 637193 614675 594589 576481 560633 547477 536502 527120 520035 516297 515593 517066 521319 529865
56959 529865 542843 558939 577334 597839 618840 636650 647411 648847 640435 623325 600253 574436
56947 574436 548160 522965 500573 482409 468439 457667 449638 444431 441647 440771 442469 448292 459040
56934 459040 474384 493899 517458 544698 574772 605933 634256 653582 658612 648346 625730 594613
56922 594613 558426 521000 486260 456333 431031 409431 391053 375631 362880 352614 344238 336340
56910 336340 327774 318957 311145 304780 299541 295507 292976 291436 290001 288634 287848 287537 287304 287568 289073
56895 289073 291718 295122 299964 307323 317058 328259 341016 356353 374693 395749 419369 444705
56883 444705 468723 487213 497499 499112 492510 479026 461785 444538 429201 415873 405083 398156
56871 398156 395344 395582 398482 404921 415374 429435 447460 470976 500829 536394 577323 624633
56859 624633 678935 737951 795755 843652 872467 876404 856154 817925 769348 716835 665732 620376
56847 620376 582898 553237 531074 516967 511461 514404 525655 545552 574376 612270 659795 717642
56835 717642 785859 864352 953415 1051222 1149676 1234140 1288915 1303957 1278075 1218172 1136067
56824 1136067 1044122 951844 865491 789414 726159 675612 636014 606377 586995 577737 577437 585261
56812 585261 601377 625987 658975 700810 752557 814291 883616 954819 1018218 1061479 1074652
56801 1074652 1055469 1009337 944698 869675 791941 718263 652544 595691 548001 510201 481869
56790 481869 460940 445838 436760 434225 437849 447234 462571 483622 509470 539911 575314 613842
56778 613842 649827 675965 686724 679819 656237 619906 576294 530202 484990 443449 407757 378106
56766 378106 352892 330843 311893 295826 281675 269043 258496 250029 242576 235682 230118 226094
56754 226094 222251 217366 211826 206648 202196 198614 196301 195157 194351 193453 192868 192729 192573 192438 192982 194084
56738 194084 194730 194736 195081 196017 196454 195810 194856 194045 192720 190858 189814 190204 190617 189698 188154 187433 187669 188208
56720 188208 189083 190638 192498 194061 195277 196164 196392 196057 195937 196350 196729 196893 197528 198811 199885 200424 201349
56703 201349 203179 205036 206222 207419 209268 211028 211798 211943 212244 212600 212566 212242 211759 210894 210011 210280 212084
56686 212084 214211 215414 215779 215960 216197 216775 218149 219919 220948 221155 221752 222996 223385 221971 219846 218263
56670 218263 216931 215386 214407 214641 215197 215023 214469 214216 213999 213706 214380 216571 218829 219291 217904 215876 214021
56653 214021 212808 212869 214057 215008 214850 214357 214420 214618 214456 214640 215743 216870 217045 216758 216791 216775 216305 216228 217264
56634 217264 218517 218913 218985 219719 220676 220823 220236 219512 218502 217044 215866 215321 214401 212488 210854 210792 211425
56617 211425 211121 209986 209177 208745 208043 207394 207496 207835 207433 206551 206046 205739 204984 204158 204100 204713 205424 206252 207129
56598 207129 207140 205801 204110 202998 201937 200484 199806 200959 202917 204154 204921 206079 206924 206383 205312 205416
56582 205416 206647 207729 208429 209310 210041 210090 210317 211825 213873 214940 215136 215631 216522 217333 218755 221697 225373
56565 225373 228496 231643 236236 241982 247719 254088 262808 273732 284998 295673 305819 314386 319583
56552 319583 321176 320175 316739 310896 304939 302122 302757 304081 304171 303538 302719 301002 298193 295400 293232
56537 293232 291029 288378 285703 283045 279895 276468 273517 270861 267732 264509 262287 260867 259091 257056
56523 257056 255970 255788 255104 253576 252383 252013 251514 250261 248658 246847 244459 241846 239877 238405 236594
56508 236594 234719 233831 233682 232867 231060 229227 227645 225713 223760 223002 223484 223972 224074 224594 225647 226330
56492 226330 226437 226649 226854 226192 224875 224120 224112 223847 223085 222689 222996 223632 224809 226882 228838 229311 228837 228962
56474 228962 229384 228485 226513 225527 226056 226485 226104 226085 226984 227910 228776 230734 233584 235288 234965 234128 234073 234304
56456 234304 234368 234942 236097 236609 236034 235606 236186 237173 238099 239363 240676 240876 240036 239739 240515 241046 240657 240455
56438 240455 241123 241677 241354 240810 240508 239832 238656 237961 238082 238160 238002 238494 239562 239846 239146 238975 239796 240004
56420 240004 238658 237122 236834 237456 238351 239879 242013 243539 243849 243903 244408 244741 244526 244458 244687 244286 243226
56403 243226 242964 244116 245476 246232 247182 248788 250097 250660 251549 253330 254932 255614 256164 257124 257766 257920 258849
56386 258849 261174 263776 265807 267878 270228 271688 271609 270996 270663 270120 269209 268865 269309 269508 269316 269984 271645
56369 271645 272661 272519 272901 274643 276137 276203 276087 276964 277819 277637 277522 278740 280548 281718 282455 283183 283265
56352 283265 282559 282554 284411 287464 290880 294894 299138 301866 302326 302014 302194 302185 301421 301002 301660 302361 302528 303503
56334 303503 306189 309322 311709 314034 316889 319296 320880 323168 326934 330542 332813 335154 338827 342469
56320 342469 344509 345848 347891 350018 351282 352524 354460 355703 355118 354271 355080 356797 357698 358081 359198
56305 359198 360804 362198 364190 367711 371841 375371 378994 383919 389737 395500 401362 407378 412354 415809
56291 415809 419352 424292 429705 434693 440497 448369 457414 466623 476930 489042 501330 512248 522826
56278 522826 534440 546206 557092 568501 582103 596945 611370 625978 642114 659263 676567
56267 676567 695188 716500 739614 763231 788219 815913 845756 877272 912520 953836 1000836
56256 1000836 1052280 1109228 1173778 1246508 1327818 1419920 1524791 1641850 1770217 1911312
56246 1911312 2066627 2234934 2414350 2604865 2805876 3013342 3222360 3430365 3634647
56237 3634647 3829052 4006557 4163141 4295776 4398980 4467245 4499199 4495932 4457299 4383785
56227 4383785 4280270 4153801 4008818 3847957 3675778 3497712 3316575 3133808 2952878
56218 2952878 2777849 2609873 2448631 2295795 2153570 2021249 1896854 1780790 1674483
56209 1674483 1577057 1486856 1404438 1330377 1262118 1197021 1136596 1083511 1036296 991451 949037
56198 949037 911490 878378 847141 817853 792531 770741 750406 731961 717167 704838 692305
56187 692305 680132 670818 663827 656524 649017 643287 638526 632276 625468 621363 619976 618321 615700 614018
56173 614018 613366 612089 610803 611659 613972 615167 615560 617612 621081 623629 625635 629568 635195 640280 645424
56158 645424 653175 662878 671506 679176 688795 700731 713042 726456 743715 764325 785440 807690
56146 807690 834694 867022 902305 941197 987486 1042198 1103262 1171204 1249290 1337496 1431710
56135 1431710 1529044 1628252 1724717 1811141 1884260 1945881 1997454 2039550 2076666 2115717 2158160
56124 2158160 2198869 2233360 2260482 2277899 2281832 2272910 2256462 2235454 2208145 2173087 2130355 2077087
56112 2077087 2008252 1923547 1828368 1727343 1622747 1519652 1425690 1343935 1271828 1208263 1155691
56101 1155691 1114195 1079902 1050820 1028324 1011679 997217 984095 974770 968843 962811 956733 954417
56089 954417 955961 957011 956508 958020 962230 965463 967124 971056 977788 983079 986063 991175 999823 1007805
56075 1007805 1013368 1020213 1030035 1039626 1047987 1058758 1072986 1086908 1099480 1114564 1133073 1150640
56063 1150640 1165770 1182546 1202609 1222292 1240347 1260442 1283203 1304015 1321594 1340430 1361804
56052 1361804 1380897 1395876 1411170 1428582 1444060 1456567 1471104 1489395 1506723 1521583 1539140
56041 1539140 1561361 1583285 1602981 1625376 1652129 1677755 1700224 1725304 1755782 1786572 1815276
56030 1815276 1847189 1884883 1923320 1960241 2000579 2045425 2087864 2125311 2164702 2209762 2254776
56019 2254776 2296861 2342409 2394882 2448347 2499760 2555381 2618169 2681537 2742752 2809574 2886082
56008 2886082 2965146 3042723 3125915 3218758 3314192 3408802 3510989 3625240 3742977 3858564
55998 3858564 3979435 4110635 4245109 4379780 4525052 4687270 4858185 5033069 5221942
55989 5221942 5430859 5650292 5875076 6117239 6385427 6670923 6968483 7290836 7647114
55980 7647114 8027935 8428356 8863749 9345546 9864214 10415104 11017429 11688058 12422057
55971 12422057 13220513 14110817 15116714 16237308 17480822 18889029 20502711 22338139
55963 22338139 24429162 26858493 29718413 33086507 37084960 41929078 47884388 55227822
55955 55227822 64290954 75472493 89147182 105628769 125278776 148550257 175839504
55948 175839504 207407172 243451233 283720836 326237116 366129438 396374966 410689817
55941 410689817 406477531 385555682 352588332 312967521 271483079 231760210 196027971
55934 196027971 165191737 139253233 117785534 100180005 85747599 73847640 63986585
55927 63986585 55785153 48909004 43083104 38125463 33905131 30287211 27151778 24429622
55919 24429622 22074646 20023407 18214412 16620599 15227707 14001051 12903083 11922629
55911 11922629 11057516 10286612 9585435 8951535 8388722 7882076 7412236 6979037 6588362
55902 6588362 6230052 5890558 5573746 5288201 5026496 4776846 4543014 4333296 4141097
55893 4141097 3955121 3778251 3618425 3470818 3326350 3188443 3064712 2950939 2839365
55884 2839365 2734359 2644263 2565669 2490695 2421898 2365006 2313979 2257784 2195765 2133180 2068300
55873 2068300 1997222 1925096 1859398 1797580 1733376 1669441 1611873 1558236 1502953 1448985 1402412
55862 1402412 1360707 1317781 1275553 1239385 1207094 1173474 1140917 1114629 1091866 1066606 1040513
55851 1040513 1018843 999611 977142 952421 929910 907962 882369 855765 833728 814865 794139
55840 794139 772586 754457 738171 719488 700575 686669 676585 665384 653588 644983 638215 629403
55828 629403 620408 615762 613804 609412 603188 599467 597416 592487 584775 577846 571215 562007 552160 546005
55814 546005 542326 536562 529155 524073 520689 514913 507101 501355 498089 494469 491109 491245 494358 497339
55800 497339 500789 507460 515763 521615 525448 530644 536274 538189 536264 533807 530828 524611 516055 508749
55786 508749 502466 494115 484537 477830 474318 470285 464117 456670 446383 430445 410596 391816 375625
55773 375625 360362 347161 339336 336257 334015 332053 333085 336614 338636 337985 337249 337175 335726 332859 330781
55758 330781 329309 326227 322224 320184 319640 317331 313284 310790 310165 308060 303367 298494 294223 288582 281578
55743 281578 276007 272695 269500 265676 262780 260765 257658 253539 250601 249006 246949 244787 244628 245877
55729 245877 245777 244340 243997 244381 242426 237873 233737 230885 227058 221789 217407 214500 211135 207297 205400
55714 205400 205559 204947 202757 201362 201781 202394 202985 205599 210467 215336 219531 224357 228876 229969 227514
55699 227514 224875 223279 220351 215313 210769 207837 204230 198925 194322 191842 189642 186719 185205 186375
55685 186375 188137 188773 189804 192992 197558 202301 207545 213202 217799 221068 224734 229309 232888 234393
55671 234393 235140 235937 235520 233205 230298 227737 225026 222485 221641 222402 222731 222061 222095 223499 224925 226092
55655 226092 228458 231883 234075 234534 235585 238257 240486 240764 240215 239583 237565 233740 229963 227103 223351
55640 223351 217422 210571 203881 196524 188321 181163 176219 172359 168764 166367 165351 164106 162093 160923
55626 160923 161167 161069 159858 159285 160301 161318 161461 162432 165203 167893 169002 169892 171805 173128 171982 169160
55610 169160 166259 163092 159092 155190 152216 149320 145876 143011 141613 140774 139798 139698 141119 142865 144006
55595 144006 145235 146650 146496 143854 140329 137458 134599 130998 127709 125745 124524 123774 124679 127427 129955
55580 129955 130953 131911 134445 137945 141718 147044 154919 163966 172781 182382 194239 207803 222029 237238
55566 237238 253229 267355 276821 281443 282303 279444 272900 264200 254684 243762 230768 217043 204372
55553 204372 192897 182247 173021 165393 158076 150505 144289 140603 137971 134665 131473 129968 129779 129756
55539 129756 130238 131927 133963 135332 136773 139191 141530 142367 142288 142568 142806 142009 140782 140314 140294 139771 138924
55522 138924 138052 135978 131545 125702 120271 115706 111727 108894 107560 106405 103967 100670 97687 94962
55508 94962 92113 90020 89610 90152 90500 90882 91774 92339 91829 91241 91690 92351 91928 90868 90203 89490 87935 86326
55490 86326 85786 85754 85236 84887 85786 87332 88491 89906 92471 94961 95512 94575 94081 94485 94936 95545 97032
55473 97032 98693 99092 98423 98079 98253 97929 96801 95291 93189 90217 87417 86058 85652 84893 83969 83989 84766
55456 84766 85203 85453 86597 88468 89744 89993 89881 89585 88689 87449 86579 86057 85486 85186 85567 86028 85880 85676
55438 85676 86190 86909 87032 86987 87305 87038 85188 82760 81406 80929 80170 79481 80092 81728 83110 84240 85930
55421 85930 87563 87718 86694 86212 86783 87479 87997 88780 89295 88450 86686 85590 85453 85196 84573 84389 84558 84091
55403 84091 83113 82863 83474 83673 82936 82202 82160 82478 82856 83326 83461 82872 82454 83517 85705 87389 88049 88588
55385 88588 89407 89997 90416 91410 92850 93718 93770 93711 93726 93402 93030 93325 93879 93577 92511 91789 91467 90438 88502
55366 88502 86734 85604 84433 83001 82001 81608 81127 80347 79821 79596 79133 78666 79169 80738 82354 83379
55350 83379 83964 83993 83103 81836 81343 81807 82401 82713 82907 82756 82091 81960 83594 86302 88041 88089 87479 86893
55332 86893 85992 84833 84081 83602 82606 81333 80863 81117 80895 80084 79962 80988 82106 82628 83002 83332 82944 81897
55314 81897 81266 81435 81669 81719 82190 82976 83104 82535 82364 82785 82690 81846 81600 82715 84228 85154 85680 85877 84967
55295 84967 82829 80733 79670 79270 79107 79661 81074 82328 82572 82190 81775 81136 80030 78876 78171 78115 79064
55278 79064 81168 83335 83963 83060 82215 82211 82312 82269 83112 85175 87043 87498 87078 86812 86826 87057 87872 89045 89456
55259 89456 88815 88358 88908 89592 89484 89207 89718 90647 91086 91131 91480 92225 92980 93560 93772 93281 92337 91811 91928
55240 91928 91844 90988 89831 88818 87719 86695 86729 88117 89599 89915 89290 88553 87817 86910 86165 85839 85499 84829
55222 84829 84360 84616 85222 85516 85350 84792 83768 82557 81870 82003 82685 83977 86231 88805 90110 89511 88064
55205 88064 86854 85842 84935 84778 85543 86196 85960 85471 85552 85893 85938 86062 86781 87678 88156 88527 89376 90466 91123
55186 91123 91160 90715 89883 89174 89555 91259 93166 94051 93883 93418 93204 93428 93974 94195 93457 92231 91698 91965
55168 91965 91837 90727 89561 89208 89332 89452 89880 90804 91694 92413 93703 95709 97215 97306 96642 96173 95740 94931
55150 94931 94189 93962 93823 93475 93614 94688 95770 95815 95199 94939 95168 95381 95406 95256 94813 94437 94940 96216 96940
55131 96940 96437 95627 95285 94741 93444 92357 92399 92746 92263 91486 91586 92298 92599 92643 93326 94468 95068 94980 94909
55112 94909 95068 95121 95100 95204 95070 94350 93543 93222 92999 92331 91677 91683 91885 91475 90824 90964 92077 93599 95295
55093 95295 97129 98706 99993 101845 104556 106676 106706 105292 104265 104097 103909 103399 103091 102995 102764 102941 104436
55076 104436 106816 108634 109416 109861 110161 109664 108337 107124 106590 106441 106582 107408 108762 109755 109968 109935 110139
55059 110139 110309 109953 108933 107413 105796 104650 104168 103885 103469 103398 104166 105298 105872 105608 104672 103005 100784
55042 100784 98968 98310 98271 97947 97513 97604 97831 97284 96177 95619 95923 96469 97083 98246 99917 101352 102108 102263
55024 102263 101752 100581 99539 99591 100559 101448 101931 102507 103346 104106 104800 105763 106821 107565 108271 109463 110699
55007 110699 110965 110195 109268 108567 107678 106506 105554 105095 105071 105693 107052 108291 108336 107368 106385 105544 104243 102723
54989 102723 102072 102508 103086 103357 103917 104989 105798 105861 105693 105762 105817 105786 106266 107505 108728 109062 108582 108060 108187
54970 108187 109193 110673 111708 111776 111505 111890 112952 113959 114691 115491 116237 116392 116042 115776 115581 114978 114233
54953 114233 114200 114890 115423 115554 116000 117003 117736 117495 116394 114682 112464 110393 109432 109488 109369 108486 107593 107480
54935 107480 107921 108314 108454 108354 108228 108797 110579 112711 113727 113772 114652 117294 120603 123537 126828 131571
54919 131571 137365 143091 148704 154982 162014 169047 175516 181291 186073 189333 190767 190325 187950 183724
54905 183724 178090 171641 164863 158199 152028 146476 141592 137724 135206 133677 132306 130786 129453 128350
54891 128350 126962 125108 123426 122613 122707 123322 124094 124744 125230 125955 127409 129609 132346 135767 140042 144750
54875 144750 149402 154344 160209 166651 172720 178274 183784 188760 191718 191960 190157 186979 182439 176868
54861 176868 171134 165481 159422 153265 148404 145450 143362 141145 139093 137587 135887 133168 129756 126332
54847 126332 122870 119329 116464 114834 113721 112088 110022 108274 106954 105729 104782 104553 104844 105069 105160 105473
54831 105473 106110 107005 108295 109874 110941 110759 109625 108458 107666 107017 106378 105924 105731 105697 105804 106120 106608
54814 106608 107184 107763 108170 108275 108261 108320 108101 107150 105943 105679 106709 108013 108560 108426 108124 107674 107001 106543
54796 106543 106781 107624 108761 110113 111502 112502 113086 113802 114886 115834 116348 116914 117894 118755 118884 118500 118082
54779 118082 117578 116962 116907 118018 119866 121611 123133 124748 126284 127377 128405 130277 133410 137590 142576
54764 142576 148091 153511 158466 163680 170417 178879 187657 194848 199351 201081 200462 197905 193575 187524
54750 187524 180093 172093 164487 157981 152820 148752 145193 141753 138589 136036 134097 132709 132166 132570 133115
54735 133115 132833 131981 131626 131801 131261 129415 127387 126633 127431 129336 132090 135394 138558 141190 143714 146761
54719 146761 150643 155745 162510 170401 177734 183191 186786 188833 188960 186940 183504 179336 173997 166941
54705 166941 159012 151940 146700 143149 140764 138867 136603 133668 130854 129142 128512 128218 127809 127251 126449
54690 126449 125298 123879 122178 120102 118139 117214 117358 117343 116346 115129 114783 115176 115576 115973 116621 116988 116377
54673 116377 115164 114308 113999 113774 113518 113343 112980 112339 112177 113034 113952 113557 112108 111149 111268 111489 110963 110056
54655 110056 109545 109691 110349 111249 112030 112558 113099 113663 113563 112380 110980 110598 111217 111829 112061 112449 113272 114201
54637 114201 115129 116247 117268 117573 117305 117316 117815 117908 116796 114774 112829 111805 112021 113125 114201 114495 114073
54620 114073 113439 112814 112251 112051 112373 112736 112642 112381 112509 112923 113293 113871 114907 115679 115356 114485 114337 114942 115188
54601 115188 114811 114820 115688 116592 116906 117127 117674 117998 117663 117298 117562 117870 117108 115225 113309 112227 111852 111601
54583 111601 111310 111416 112372 113985 115551 116689 117631 118411 118395 117235 115828 115397 115897 116257 116035 115867 116261
54566 116261 116980 117722 118475 118970 118733 117963 117578 118054 118920 119669 120419 121361 122254 122892 123474 124130 124584 124639 124543
54547 124543 124592 124812 125231 126013 127055 127899 128313 128614 129188 129983 130618 130728 130155 129121 128155 127590 127188 126614
54529 126614 126024 125720 125466 124754 123584 122409 121479 120876 120961 121963 123223 123718 123383 123132 123492 124030 124241 124236
54511 124236 124294 124449 124729 125239 125854 126346 126868 127683 128410 128296 127327 126328 125783 125265 124298 123132 122419 122612 123853
54492 123853 125915 128135 129820 130859 131504 131686 131180 130329 129848 129840 129748 129381 129248 129711 130485 131195 131849 132591
54474 132591 133472 134526 135637 136391 136585 136679 137215 138065 138955 140304 142569 145071 146652 147371 148381 150101
54458 150101 151734 152696 153262 153544 153097 151933 150790 149908 148580 146382 143835 141446 139143 137153 136329 136919
54442 136919 137938 138391 138352 138265 138073 137704 137613 138101 138688 138703 137931 136350 134014 131586 130110 129768 129696 129461 129778
54423 129778 131196 133110 134751 136204 137634 138471 138333 137950 138162 138637 138590 138193 138244 138842 139366 139532 139575 139554
54405 139554 139250 138712 138323 138413 139088 140204 141218 141510 141175 141039 141626 142642 143730 144947 146117 146604 146355
54388 146355 146402 147588 149451 151010 151973 152446 152231 151302 150386 150125 150105 149587 148795 148650 149535 151095 152932 154853
54370 154853 156742 158807 161525 164771 167616 169662 171947 175588 180052 183771 186105 187687 189072 190014
54356 190014 190042 188995 187004 184531 182224 180218 177946 175194 172795 171504 170736 169320 167063 164585 162015
54341 162015 159057 156131 154248 153724 153993 154633 155508 155922 154879 152563 150510 149802 149860 149520 148596 147792 147567
54324 147567 147669 147648 147381 147054 146778 146312 145365 144224 143755 144448 145779 146866 147454 147763 147720 147035 145839 144614
54306 144614 143496 142252 140869 139619 138556 137514 136637 136391 136958 138026 139161 140013 140241 139722 138879 138376
54290 138376 138472 139030 139961 141233 142496 143241 143372 143255 143198 143279 143602 144294 145218 146103 146977 148129 149584 150953
54272 150953 151816 152060 151819 151323 150792 150338 150016 149947 150196 150492 150489 150436 151045 152386 153462 153386 152593 152348 153371
54253 153371 155428 157930 160327 162147 163221 163774 163888 163170 161396 159211 157660 157227 157728 158817 160102
54238 160102 161049 161371 161337 161236 160846 159941 158965 158548 158571 158368 157656 156695 155739 154902 154370 154162 153865 153219 152675
54219 152675 152796 153301 153415 152970 152506 152451 152849 153699 154846 155642 155432 154339 153037 151945 151187 151027 151491 151821
54201 151821 151183 149839 148818 148576 148810 149433 150672 152157 153016 153094 153115 153309 152877 151397 149898 149830 151408
54184 151408 153577 155318 156429 157219 157916 158454 158686 158746 159091 160086 161625 163342 164966 166270 166970 167061 166958
54167 166958 166871 166388 165158 163632 162484 161588 160408 159168 158706 159094 159219 158014 155562 152822 150713 149541
54151 149541 148902 148140 147197 146791 147333 148048 147898 147065 146630 146975 147452 147643 147916 148596 149465 150346 151366 152350
54133 152350 152713 152251 151417 150588 149774 149230 149578 150932 152543 153778 154846 156200 157713 158916 159632 160012
54117 160012 160269 160726 161842 163860 166579 169567 172390 174676 176272 177462 178849 181039 184537 189532 195401
54102 195401 200810 204872 207849 210119 211007 209609 206437 203088 200359 197782 195034 192589 190739 189076
54088 189076 187350 185927 185017 184284 183573 183119 182683 181396 178966 176302 174472 173712 173789 174511 175532 176477 177748
54071 177748 180319 184158 187670 189428 189781 190155 191382 193326 195483 197231 197977 197722 197100 196412 195232 193418
54055 193418 191796 191152 191198 191274 191455 192117 192992 193626 194473 196539 200106 204631 209768 215590 221856 227943 233754
54038 233754 239981 247131 254765 262091 269000 276219 284464 293630 302873 311477 319506 327435 335313 342567
54024 342567 348593 353167 356327 358272 359399 359981 359793 358564 356765 355265 354046 352033 348491 343842 338740
54009 338740 333020 326144 318110 309350 300193 290984 282336 274676 267849 261606 256105 251475 247339 243349
53995 243349 239882 237605 236536 235969 235167 233760 231702 229215 226592 223806 220617 217291 214713 213449 213179
53980 213179 213458 214450 216297 218317 219657 220514 221859 224058 226523 228832 231541 235553 241083 247568 254550
53965 254550 262448 272197 283830 295457 304066 307530 305682 299636 290855 281051 272134 265361 260682 257331
53951 257331 254828 253074 251925 251158 250693 250488 250467 250840 252183 254772 258199 261977 266235 271379 277312 283395
53935 283395 288993 293787 297811 301493 305377 309537 313529 317176 320968 325423 330427 335639 341133 347243
53921 347243 354042 361353 368992 376792 384685 393002 402260 412446 422962 433467 444179 455174 466116
53908 466116 476978 488141 499162 508278 513930 516254 516421 515135 512526 508862 504400 498958 492520 485815
53894 485815 479418 472681 464565 455210 445654 436155 425897 414414 402348 390583 379336 368363 357546
53881 357546 347170 337895 330285 324003 317834 311052 304376 298972 294904 291310 287630 283729 279255 274040
53867 274040 269004 265442 263303 261176 258069 254223 250084 245630 241050 237024 233835 231005 228309 226339
53853 226339 225532 225344 224924 224063 222903 221305 219161 216975 215477 214816 214552 214274 213917 213687 214010 215314 217469
53836 217469 219587 220682 220490 219461 218159 216934 216033 215627 215660 215916 216340 217149 218431 219697 220116 219414 218374
53819 218374 218114 218910 220130 221295 222657 224545 226796 229222 232072 235506 239044 242221 245462 249578 254598
53804 254598 259851 265140 271087 278283 286711 296053 305908 315496 323818 330505 336172 341631 346964 351578
53790 351578 354967 357297 359329 361820 364882 367912 370188 371405 371529 370474 368230 365090 361362 356941
53776 356941 351485 344884 337402 329534 321945 315131 308811 302043 294443 286978 280979 276636 272987 269204
53762 269204 265195 261115 256945 252723 248656 244869 241307 237896 234553 231185 227937 225202 223117 221322
53748 221322 219531 217988 216979 216360 215940 215855 215971 215556 214332 213359 213905 215685 217187 217566 217309 217166 217337
53731 217337 217725 218128 218157 217740 217641 218724 220741 222660 224070 225417 226956 228481 230070 232046 234046 235167
53715 235167 235276 235292 235928 237037 238377 240066 242004 243807 245637 248184 251381 254085 255585 256607 258243
53700 258243 260597 263089 265527 268233 271522 275461 279801 283826 286769 288607 290016 291405 292584 293450
53686 293450 294184 294605 294171 292967 291889 291472 291329 291076 290925 290933 290615 289891 289514 289809 289869 288879 287482 286912 287306
53667 287306 287870 288188 288363 288166 287151 285563 284268 283719 283594 283420 282970 282085 280697 279152 278116 278038 278888
53650 278888 280294 281747 282889 283829 284903 286010 286549 286341 286194 287196 289704 293235 296900 299706 301061
53635 301061 301487 302365 304444 307038 309191 311096 313622 316891 320173 323034 325732 328406 330597 331836 332301
53620 332301 332718 333789 335724 338109 340338 342314 344562 347483 350813 354124 357491 361207 365071 368498
53606 368498 371338 374149 377564 381539 385267 387799 388872 389183 389672 390546 391289 391472 391024 389797 387622 385047
53590 385047 383228 382638 382528 382126 381672 381648 381643 380789 378961 376752 374528 372207 369795 367454 365212 363154 361665
53573 361665 360864 360074 358540 356500 354835 353805 352861 351654 350462 349633 349288 349638 350799 352158 352630 351908
53557 351908 350906 350604 350988 351489 351987 352819 353994 355043 355726 356438 357623 359011 359842 359947 360262 361974 365260
53540 365260 369250 373095 376697 380339 384129 388013 391912 395672 399262 403186 408189 414318 420797 427234
53526 427234 434377 443201 453713 465220 477283 489678 501824 513195 524235 536098 549424 564011
53514 564011 579662 596647 615099 634614 654744 675465 696902 718960 741511 764593 788169
53503 788169 811925 835597 859273 883097 906737 929445 950640 970287 988677 1006014 1022349
53492 1022349 1037826 1052778 1067510 1082176 1096959 1112205 1128141 1144662 1161601 1179033 1197015
53481 1197015 1215259 1233457 1251710 1270110 1288035 1304444 1318799 1331036 1340757 1347396 1351332 1353867
53469 1353867 1355588 1355534 1352499 1346532 1338627 1329534 1319432 1308218 1295565 1281218 1265815 1250841 1237071
53456 1237071 1223564 1208796 1192300 1174516 1155698 1135970 1116068 1096915 1078484 1059956 1040970
53445 1040970 1022002 1003561 985813 969101 954113 941337 930759 922136 915179 909528 904971 901549
53433 901549 899071 896825 894338 892129 891080 891257 892115 893715 896837 901777 907845 914332 921416 929863 940264
53418 940264 952781 967177 982883 999344 1016538 1034991 1055275 1077658 1102115 1128336 1155747
53407 1155747 1183902 1212925 1243462 1276248 1311709 1349596 1388857 1428350 1468060 1509131 1552415
53396 1552415 1597562 1644016 1692095 1742148 1793212 1843714 1893379 1943355 1994412 2046008 2097190
53385 2097190 2147455 2196415 2243495 2288505 2331952 2374317 2415277 2453786 2488624 2518810 2543902
53374 2543902 2564063 2579697 2591075 2598416 2601909 2601191 2595156 2582909 2564630 2540966 2511975 2477534
53362 2477534 2438453 2396206 2351612 2304788 2256408 2207928 2160315 2113436 2067037 2021517 1977455
53351 1977455 1935090 1894636 1856332 1819747 1783573 1746624 1708691 1670211 1631562 1592937 1554529
53340 1554529 1516575 1479477 1443877 1410280 1378655 1348841 1321156 1296006 1273065 1251629 1231692
53329 1231692 1213812 1197787 1182368 1166460 1149870 1132731 1115150 1097684 1081282 1066278 1052134
53318 1052134 1038491 1025752 1014303 1003998 994847 987430 982075 978290 975524 973903 973694 974688 976653
53305 976653 979823 984386 989987 996354 1003970 1013602 1025549 1039787 1056410 1075352 1096059 1117956 1140917
53292 1140917 1164897 1189460 1214174 1239111 1264505 1290134 1315439 1339955 1363295 1384986 1404673
53281 1404673 1422295 1437898 1451563 1463504 1473681 1481257 1485195 1485609 1483682 1479830 1472934 1462110 1448414
53268 1448414 1433772 1418728 1402298 1383743 1363454 1342107 1319878 1296793 1273213 1249668 1226443
53257 1226443 1203475 1180496 1157226 1133548 1109449 1084884 1059975 1035319 1011625 988937 966673
53246 966673 944489 922499 900525 877926 854580 831281 808678 786548 764633 743402 723187
53235 723187 703360 683413 664319 647658 633642 621105 609378 598987 590355 582860 575629 568463
53223 568463 561448 554176 545923 536347 525639 514106 501821 488674 474654 460117 445774 432374
53211 432374 420397 409967 400820 392331 383929 375669 368162 361811 356436 351695 347369 343030 338051 332396
53197 332396 326900 322298 318378 314564 310840 307454 304098 300141 295488 290565 285662 280961 277039 274575
53183 274575 273458 272777 271707 269946 267408 264154 260718 257918 256071 254760 253431 251922 250372 248986
53169 248986 247963 247319 246757 245982 245111 244474 244080 243648 243053 242396 241666 240756 239800 239104 238719 238405 238062 237865
53151 237865 237936 238134 238209 238039 237786 237952 239008 240638 241634 240980 238975 236849 235460 234846 234867 235558 236679 237504
53133 237504 237477 236821 236297 236544 237767 239780 242109 244166 245528 246134 246273 246402 246875 247725 248758 249921 251352
53116 251352 253037 254631 255819 256631 257222 257615 257886 258291 258871 259182 258759 257729 256652 255915 255525 255292 254902
53099 254902 253969 252387 250474 248542 246513 244271 242086 240335 239020 237921 236996 236230 235358 234243 233368
53084 233368 233423 234430 235651 236332 236256 235701 235226 235360 236173 237193 237920 238161 237684 236075 233452 230916 229621
53067 229621 229590 229912 229831 229057 227445 225199 223224 222403 222502 222535 222198 222108 222565 222965 222798 222446 222526 222997 223432 223808
53047 223808 224551 225960 227911 230010 231815 232966 233250 232585 231090 229268 227927 227682 228589 230381 232718
53032 232718 235004 236417 236620 236053 235106 233488 231142 229283 229439 231524 233888 235326 236129 236996 237946 238721
53016 238721 239381 239980 240219 239898 239207 238202 236643 234740 233500 233732 235114 236699 237944 238814 239251 239209 239018
52999 239018 239218 239993 241028 241790 241822 241011 239889 239421 240204 241958 243990 245879 247501 248700 249368 249811 250663
52982 250663 252362 254826 257605 260235 262363 263623 263542 261855 259039 256249 254408 253543 253270 253639 254910
52967 254910 256706 258195 259207 260464 262377 264258 265231 265442 265774 266570 267210 266946 265748 264190 262736 261337
52951 261337 259711 257854 256055 254444 252860 251334 250401 250536 251443 252255 252268 251207 249116 246535 244506 243690
52935 243690 243560 243109 242278 241913 242357 242975 243229 243295 243305 242866 241901 241187 241398 242131 242528 242448 242393 242605 242881 243085
52915 243085 243300 243566 243864 244239 244579 244492 243776 242836 242242 242032 241764 241134 240239 239377 238905 239117 239987 241079 241961
52896 241961 242584 243123 243679 244364 245404 246836 248228 249034 249149 248923 248754 248823 249052 249109 248586 247432 246132 245338
52878 245338 245373 246100 247102 247934 248451 248990 250046 251720 253704 255727 257697 259419 260644 261475 262292 263173
52862 263173 263850 264310 264822 265169 264509 262435 259647 257139 255117 253094 250615 247487 243736 239835 236576
52847 236576 234228 232145 229685 227106 225052 223568 222302 221341 221031 221111 220821 219987 219309 219373 219865 219982 219327
52830 219327 218200 217266 217059 217718 219118 221209 223936 226801 228919 229882 230210 230575 230931 230894 230667 230888 231618
52813 231618 232122 231773 230754 229791 229525 230160 231368 232556 233536 234802 236720 238584 239064 237651 235191 232916
52797 232916 231486 231059 231606 232683 233334 232794 231283 229756 228849 228340 227591 226339 224942 223954 223625 223867 224614
52780 224614 225923 227670 229370 230568 231332 232116 233200 234456 235582 236306 236364 235625 234359 233160 232402 231867
52764 231867 231077 229917 228789 228125 227890 227699 227343 226978 226786 226694 226688 227194 228753 231340 234279 236887 238859
52747 238859 240094 240604 240788 241330 242511 243900 244997 245905 247063 248600 250401 252591 255477 258925 262149
52732 262149 264304 265219 265478 265813 266448 267084 267473 267773 268139 268249 267648 266437 265096 263655 261667 259116 256722
52715 256722 255079 254055 253350 253022 253042 252901 252171 251076 249984 248818 247428 246103 245172 244578 244455 245516
52699 245516 247972 250523 251518 251020 250699 251640 253221 254299 254535 254137 253159 251620 249852 248233 246937 246154
52683 246154 246144 246777 247497 248055 248791 249790 250223 249129 246676 244144 242711 242561 243053 243354 242929 241795 240455
52666 240455 239425 238799 238373 238117 238271 238903 239704 240417 241315 242928 245324 247930 250159 251972 253727 255756
52650 255756 258324 261608 265195 267836 268376 267043 265263 264046 263080 261650 259761 257958 256550 255568 255105
52635 255105 255085 254982 254365 253565 253302 253744 254415 254952 255493 256402 258003 260465 263472 266073 267264 266717 264672
52618 264672 261394 257244 253084 249935 248177 247511 247614 248238 248771 248450 247255 246058 245604 245741 245854 245671
52602 245671 245385 245315 245657 246413 247425 248609 250111 251974 253782 255006 255565 255630 254958 253104 250358 247871
52586 247871 246564 246407 246997 248286 250296 252546 254333 255490 256497 257893 259798 261932 263842 265109 265478
52571 265478 264932 263703 262274 261211 260805 260928 261348 261998 262707 262929 262188 260710 259215 258097 257236 256590 256367
52554 256367 256469 256215 254983 252859 250553 248913 248624 249899 252214 254527 256024 256563 256420 255919 255409 255250
52538 255250 255589 256280 257141 258073 258885 259343 259480 259635 260002 260414 260643 260697 260649 260449 260050 259582 259308 259509 260336
52519 260336 261497 262215 261880 260842 260175 260587 261932 263840 266306 269386 272774 276078 279299 282630 285933
52504 285933 288722 290613 291531 291509 290437 288151 284761 280845 277176 274074 271188 268142 265263 263292 262500
52489 262500 262453 262665 262994 263326 263353 262907 262201 261514 260892 260336 260046 260241 260908 261850 262836 263632 264116 264454 265010
52470 265010 266036 267595 269682 272142 274520 276364 277780 279430 281916 285380 289562 293868 297426 299536
52456 299536 300169 299707 298287 295875 292896 290187 288089 286156 283922 281501 279240 277238 275489 274150 273440
52441 273440 273573 274737 276657 278115 277665 275162 272005 269574 268018 266917 266343 266541 267098 267282 267087 267245
52425 267245 268205 269589 270661 271000 270708 270268 270152 270390 270576 270447 270290 270655 271856 273838 276243 278460 280008
52408 280008 281149 282836 285765 289842 294782 300858 308538 317550 326658 334274 339147 340823 339829 337299
52394 337299 334089 330309 325724 320415 314953 310221 307150 306132 306451 306723 306144 304983 303757 302568 301529
52379 301529 301163 301777 303002 304546 306937 310820 315826 320836 325173 328916 332330 335640 339219 343328 347627
52364 347627 351426 354333 356213 356817 356076 354635 353392 352473 351319 349811 348695 348674 349592 350744 351627 352175
52348 352175 352563 352979 353527 354318 355648 357822 360677 363575 366205 369042 372667 377019 381814 387313 393987
52333 393987 401685 409869 418473 427740 437366 446778 456372 467527 481045 496324 512415 529081 546406
52320 546406 564120 582013 600446 619617 638692 656415 672539 687982 703567 719230 734633
52309 734633 749969 765744 782013 798221 813805 828673 843057 857128 870925 884491 897789
52298 897789 910439 921773 931317 939075 945245 949787 952319 952278 949150 942898 934320 924729 915002 905204
52284 905204 895395 886352 879019 873513 869239 865824 863333 861762 861054 861710 864603 869842 876453 883546 891266
52269 891266 900168 910232 921129 933068 946485 960900 974905 987593 999442 1011450 1023860 1036306
52257 1036306 1048829 1061962 1075743 1089385 1102315 1115054 1128530 1142737 1156589 1168920 1179098
52246 1179098 1186734 1191465 1193267 1192547 1189736 1185138 1179234 1172658 1165633 1157937 1149681 1141650 1134501 1128012
52232 1128012 1121545 1114880 1108225 1101817 1096016 1091475 1088610 1087033 1085982 1085116 1084438 1083754 1082838 1082084 1082330
52217 1082330 1083969 1086696 1090086 1093958 1098160 1102558 1107369 1113088 1119930 1127598 1135642 1143699 1151445 1158741
52203 1158741 1165922 1173468 1181202 1188139 1193430 1197299 1200917 1205425 1211134 1217491 1223812 1230010 1236572 1243836
52189 1243836 1251598 1259486 1267301 1274642 1280556 1284136 1285324 1284721 1282721 1279237 1274108 1267291 1258727 1248508
52175 1248508 1237131 1225208 1213036 1200843 1189268 1179061 1170430 1163216 1157565 1153800 1151625 1150232
52163 1150232 1149327 1149425 1150857 1153044 1155163 1157091 1159319 1162067 1164775 1166450 1166464 1165090 1163169 1161209 1159048
52148 1159048 1156495 1153864 1151449 1149018 1146403 1144216 1143161 1142854 1142209 1140892 1139505 1138297 1136672 1134180
52134 1134180 1131187 1128332 1126101 1125159 1126271 1129441 1133885 1139296 1146494 1156415 1169087 1184034 1201033
52121 1201033 1219964 1240521 1262613 1286480 1311850 1337457 1362051 1385527 1408534 1431324 1453546
52110 1453546 1474775 1494595 1512373 1527561 1540161 1550539 1558990 1565893 1571982 1577992 1584129 1590258
52098 1590258 1596273 1601893 1606336 1608715 1608720 1606573 1602523 1596734 1589370 1580316 1568964 1554754 1537955 1519641
52084 1519641 1501053 1483254 1467137 1453266 1441740 1432514 1425774 1421709 1420070 1420294 1422016 1425264 1430291
52071 1430291 1437395 1446696 1457818 1469993 1482720 1496074 1510147 1524531 1538726 1552719 1566656 1580180
52059 1580180 1592590 1603591 1613419 1622304 1630189 1636955 1642574 1647012 1650221 1652042 1651934 1649056 1643023 1634374
52045 1634374 1623870 1611489 1596623 1579113 1559483 1538157 1515037 1490172 1464430 1439224 1415690
52034 1415690 1394259 1374838 1357257 1341524 1327727 1315725 1305124 1295665 1287414 1280417 1274315 1268495
52022 1268495 1262452 1255826 1248299 1239764 1230490 1220821 1210802 1200280 1189214 1177671 1165716 1153535
52010 1153535 1141411 1129245 1116331 1101947 1086031 1068917 1050638 1031004 1010211 988832 967151
51999 967151 945005 922389 899868 878229 857926 838890 820720 803177 786828 772981 762472
51988 762472 754471 746947 738417 728840 718729 708050 696405 683874 671031 658156 644936 631126
51976 631126 617113 603529 590455 577434 564376 552075 541503 532832 525596 519690 515672 513949
51964 513949 514246 516169 519829 525495 532890 541225 549633 557216 563027 566558 568166 568494 567570 564946 560693
51949 560693 555710 550995 547053 544157 542753 543265 545724 549881 555724 563750 574681 588804 605583 623968
51935 623968 643024 662012 679882 695212 706848 714240 716893 714079 705631 692596 676449 657915
51923 657915 637244 615361 593779 573299 553613 534466 516487 500508 486638 474467 463732
51912 463732 454301 445854 438118 431299 425882 422077 419744 418793 419322 421359 424727 429252 434890 441491 448515
51897 448515 455180 460999 466001 470207 472962 473122 469994 463810 455184 444593 432708 420801 410269
51884 410269 401815 395476 391180 388828 387999 388210 389443 391980 395757 400449 406094 412965 420703 428256 434907
51869 434907 440792 446124 450465 453196 454233 453840 452108 449117 445343 441421 437638 434016 430814 428567
51855 428567 427719 428505 431034 435151 440246 445566 450653 455241 458739 460265 459365 456371 451861 446009 438802
51840 438802 430665 422437 414601 406990 399516 392890 388119 385434 384172 383733 384100 385298 386949 388697 390629
51825 390629 392806 394762 395939 396323 396105 395049 392823 389840 387117 385320 384453 384315 384603 384680 384039 383098
51809 383098 382842 383525 384458 385205 386124 387371 388278 388291 387822 387465 386946 385675 383995 383018 383333 384506 385788
51792 385788 386712 386994 386432 385043 382985 380366 377475 375057 373835 373735 374027 374277 374736 375672 376785 377549
51776 377549 377876 378178 378934 380327 382224 384349 386519 388764 391268 394408 398917 405681 414964 425868 436898
51761 436898 447081 456226 464158 470217 473685 474297 472027 466752 458564 448210 436763 424890 412876
51748 412876 401331 391276 383244 376711 370861 365704 361979 360078 359601 360045 361344 363497 366138 369007
51734 369007 372542 377492 383932 391097 398141 404599 410067 413905 415636 415474 414310 413278 413324 414830 417360
51719 417360 419815 421000 420088 416778 411423 405130 399400 395338 393169 392442 392434 392293 391176 388657 385004 381029
51703 381029 377752 376147 376800 379527 383477 387741 391680 394642 395870 395096 392972 390485 388167 386226 385183
51688 385183 385702 387655 389858 390954 390365 388311 385283 381711 377897 373971 370017 366419 363932 363169 364048
51673 364048 365900 368147 370707 373723 377153 380811 384741 389303 394817 401245 408340 415919 423701 430863
51659 430863 436051 438048 436374 431222 423156 413161 402860 394127 388223 385355 385140 387257 391414 396806
51645 396806 402009 405598 406847 405831 403078 399282 395141 391113 387266 383605 380599 378973 378722 378651 377374
51630 377374 374758 371937 369855 368286 366547 364754 363798 364103 364857 364697 362960 360078 356877 353772 350736
51615 350736 347800 345252 343271 341639 340055 338630 337729 337298 336672 335250 333204 331295 330107 329746 330199
51600 330199 331596 333938 336911 340295 344424 349826 356416 363527 370920 379252 388996 399103 407288 411726
51586 411726 412136 409320 404302 398100 391705 385780 380584 376517 374440 375128 378624 384410 391953 400740 410169
51571 410169 419889 430044 440790 451855 463106 475232 489107 504484 520024 534741 548917 563577
51559 563577 579721 598194 619609 643996 670875 699863 730637 761918 790858 813972 828718
51548 828718 834299 831418 821544 806080 785931 761918 735465 708346 681677 655692 630746 607880
51536 607880 588040 571264 557098 545302 535547 526827 517939 508463 498726 488890 478696 468073 457438
51523 457438 447254 437738 429103 421658 415403 409732 403852 397512 391312 386218 382632 379857 376703 372770
51509 372770 368953 366431 365334 364693 363543 361731 359687 357800 356147 354606 353081 351691 350746 350495 350876
51494 350876 351610 352499 353600 355193 357591 360819 364340 367263 368973 369499 369234 368455 367277 365837 364346
51479 364346 362992 361912 361123 360399 359364 357796 355743 353329 350705 348169 345919 343567 340318 335893 330944
51464 330944 326317 322290 318848 316230 314654 313771 312889 311646 310111 308478 307094 306588 307352 309032 311009
51449 311009 313308 316431 320409 324658 328931 333852 340240 348321 357806 368427 380153 393037 406816
51436 406816 420328 431454 438253 440431 439403 436873 433790 430710 428231 426341 423763 418802 410996 401547
51422 401547 392147 383769 376565 370341 364833 359828 355401 351940 349683 348266 346986 345519 344173 343427
51408 343427 343512 344560 346781 350051 353471 355898 357079 357887 359238 361062 362583 363316 363532 363942 365248 367796
51392 367796 371345 375265 379266 383800 389477 396273 403749 411995 421912 434475 450112 468899 491014
51379 491014 516793 546490 580057 617002 656555 698354 742857 790297 838690 883278 918694
51368 918694 941887 952796 952515 941661 920749 891423 856370 817945 777356 735241 692471 650066
51356 650066 608809 569470 533204 501160 473714 450511 431221 415748 403623 393795 385347 378080
51344 378080 372153 367532 364012 361403 359325 357204 354866 352840 351669 351163 350763 350411 350506 351140 351817 351890
51328 351890 350891 348584 345183 341436 338027 334890 331515 327908 324752 322595 321371 320810 320805 321156 321389 321170
51312 321170 320682 320371 320512 321179 322398 324110 326051 327806 328950 329210 328701 327990 327702 327954 328353 328531 328443
51295 328443 328103 327326 326010 324474 323292 322684 322212 321284 320000 319285 319878 321351 322627 323521 325106 328221
51279 328221 332305 336316 340234 344734 349672 353939 356892 358981 360716 361873 362176 362026 361946 361806 361256 360651
51263 360651 360925 362592 365213 367724 369024 368439 366047 362576 358815 355187 351985 349644 348380 347720 346826
51248 346826 345324 343488 341587 339430 336751 333789 331165 329223 327772 326567 325772 325714 326306 327066 327724 328493
51232 328493 329567 330706 331568 332158 332598 332671 332026 330801 329593 328791 328276 327784 327252 326737 326300 326039 326082 326457
51214 326457 327136 328092 329172 330067 330703 331468 332680 334070 335251 336571 338807 341963 345045 347268 349011
51199 349011 351242 354336 357798 360838 362964 364166 364746 364943 364688 363824 362422 360664 358621 356491 354809
51184 354809 353924 353401 352588 351712 351724 352965 354734 356358 357955 359807 361636 362964 363668 363792 363246 362063
51168 362063 360488 358475 355613 351954 348422 345950 344669 344298 344784 346033 347595 349265 351491 354472 357252
51153 357252 358550 358252 357276 356134 354508 352237 349887 348135 347203 347083 347751 348895 349880 350248 349998 349305
51137 349305 348350 347531 347412 348141 349171 349836 350073 350325 350740 350682 349276 346499 343581 342042 342408 344129 346597
51120 346597 349646 352930 355572 356967 357493 357906 358478 359199 360353 362098 363796 364622 364759 365204 366408 367878
51104 367878 369159 370379 371671 372816 373815 375131 376984 378976 380783 382686 384989 387392 389329 390534
51090 390534 390874 390175 388783 387862 388329 389659 390397 389909 388998 388740 389283 390040 390576 390910 391192 391417 391469 391311
51072 391311 391158 391474 392694 394917 397998 401900 406696 412182 417878 423699 430338 438631 448673 460054
51058 460054 472996 488607 507460 528005 546877 561005 569548 574061 577174 581073 586750 594021 601902
51045 601902 609008 614045 616417 616557 615371 613088 608768 601246 590592 578470 567156 558324 552488 549018
51031 549018 546423 542898 536987 528045 516395 503245 490206 478474 468407 460040 453777 450141 449004
51018 449004 449628 451549 454975 460195 467067 475278 484647 494910 505523 515941 525862 535156 543913 552606
51004 552606 561588 570190 576847 580535 581714 581582 580867 579727 578279 576650 574740 572454 569935 567288 564498
50989 564498 562051 561111 562450 565561 569570 574689 581923 591506 602551 614405 627608 643148 661238
50976 661238 680992 700870 719277 735214 748723 760735 772544 785582 801373 821117 845200
50965 845200 873446 905772 942289 982921 1027419 1075723 1127844 1183471 1242082 1303246 1366172
50954 1366172 1429103 1489935 1547586 1602077 1653189 1699895 1741449 1778367 1811868 1842854 1871862
50943 1871862 1899481 1926309 1952866 1979987 2008899 2040302 2073422 2106309 2136940 2163942 2186675
50932 2186675 2205047 2218963 2227571 2229258 2222755 2208037 2185751 2156102 2118765 2073628 2021010 1961274
50920 1961274 1894904 1823062 1747575 1670176 1592175 1515005 1440577 1370662 1306076 1246710 1192250
50909 1192250 1142595 1097733 1057566 1021957 990747 963593 939819 918554 899014 880663 863212
50898 863212 846674 831478 818346 807768 799553 792998 787542 783157 780091 778371 777591 777049 776021 774156
50884 774156 771885 770404 770915 773616 777467 781106 783985 786569 789524 793010 796925 801519 807363 814682
50870 814682 823082 832072 841619 852049 863662 876660 891260 907561 925380 944402 964529 985991
50858 985991 1009280 1035092 1064101 1096588 1132527 1172323 1217232 1268658 1327115 1392358 1464458
50847 1464458 1544218 1632339 1728618 1832293 1942865 2060170 2183701 2312220 2444094 2577763
50837 2577763 2711557 2843124 2969384 3087255 3194383 3289082 3370051 3436864 3490801 3534515
50827 3534515 3570487 3600187 3625055 3647756 3671874 3700662 3736653 3781993 3838039 3904201 3977578
50816 3977578 4053786 4127806 4194153 4247154 4281650 4293527 4279764 4238672 4170287 4076042 3957749
50805 3957749 3817209 3657018 3481298 3295209 3103877 2911994 2724021 2544129 2375652
50796 2375652 2220707 2080364 1955081 1844932 1749437 1667400 1597285 1537996 1489093 1450094
50786 1450094 1419861 1396972 1380355 1369017 1361341 1355334 1349582 1343510 1336751 1328940 1320179 1311018 1301667
50773 1301667 1291736 1280964 1269673 1258206 1246429 1234080 1221142 1207573 1193138 1177914 1162514
50762 1162514 1147383 1132238 1116586 1100494 1084451 1068832 1053982 1040509 1028940 1019238 1011119 1004743
50750 1004743 1000647 999088 999876 1002828 1008037 1015770 1026411 1040456 1058251 1079758 1104761 1133225 1165231
50737 1165231 1200661 1239236 1280819 1325508 1373503 1424968 1479818 1537408 1596728 1657058 1718239
50726 1718239 1780038 1841645 1902188 1961395 2019279 2075442 2129335 2180954 2230398 2276543 2316831
50715 2316831 2348704 2370864 2383106 2385756 2379921 2367905 2352666 2336929 2323246 2314597 2314000 2323093
50703 2323093 2341466 2367730 2400848 2439986 2483341 2527803 2569850 2606228 2633629 2648405 2647292
50692 2647292 2628233 2590206 2532774 2456631 2364543 2261009 2150733 2037813 1926203 1819831
50682 1819831 1721519 1632210 1551859 1480738 1419423 1367895 1325464 1291576 1266153 1249040 1239562
50671 1239562 1236773 1239772 1247652 1259374 1273841 1290009 1306981 1324221 1341569 1358745 1374845 1388737
50659 1388737 1400123 1409982 1419759 1430335 1441919 1454709 1469192 1485728 1504057 1523407 1543053 1562766
50647 1562766 1582886 1604175 1627472 1653230 1681258 1711073 1742510 1775832 1811240 1848636 1888031
50636 1888031 1929673 1973310 2017591 2060852 2102492 2143016 2182704 2220821 2256432 2289594 2321482
50625 2321482 2353488 2386018 2417365 2443327 2458621 2459701 2446721 2423050 2393310 2361968 2332872
50614 2332872 2308891 2291493 2280804 2276129 2276277 2279637 2284456 2289280 2293071 2294860 2293341 2286763 2273186
50601 2273186 2250992 2219384 2178435 2128691 2070984 2006652 1937673 1866278 1794356 1723189 1653520
50590 1653520 1585741 1520205 1457538 1398532 1343732 1293320 1247478 1206564 1170769 1139788 1113004
50579 1113004 1089857 1069949 1053019 1038980 1027840 1019509 1013828 1010796 1010510 1012919 1017933 1025731 1036471
50566 1036471 1049619 1064096 1079283 1095387 1112599 1130486 1148649 1167521 1187948 1210167 1233589
50555 1233589 1257369 1280920 1304106 1327240 1350682 1374239 1397278 1419579 1441540 1463237 1483925
50544 1483925 1503122 1521751 1541496 1563302 1587198 1613310 1642272 1674692 1710955 1751684 1797864
50533 1797864 1850357 1909643 1975868 2048497 2125886 2205868 2287240 2370539 2457289 2548628 2644514
50522 2644514 2743854 2845186 2947325 3049214 3149061 3243901 3330445 3406211 3469562 3519006 3553116
50511 3553116 3571183 3573356 3560016 3531395 3487919 3430623 3361163 3281755 3195195 3104723 3013796
50500 3013796 2926099 2845535 2775696 2719104 2677047 2650040 2638214 2641287 2658279 2687176 2724809
50489 2724809 2767320 2810979 2852247 2886836 2909246 2913937 2897134 2857516 2795815 2714470 2617395
50478 2617395 2509213 2394354 2276851 2160474 2048225 1941721 1841585 1748424 1662929 1585130
50468 1585130 1514260 1449514 1390564 1337324 1289730 1247827 1211680 1181099 1155696 1135110 1118887
50457 1118887 1106401 1097354 1092104 1090988 1093624 1099528 1109116 1123104 1140995 1161137 1182572 1205962
50445 1205962 1232399 1262069 1294582 1329877 1368043 1408303 1448510 1485500 1515990 1537695 1550081
50434 1550081 1554139 1551570 1544351 1534641 1524258 1514010 1503975 1494382 1485705 1478065 1471395 1466260 1463636
50421 1463636 1463670 1465552 1469046 1475307 1485594 1499931 1517779 1539474 1566079 1598056 1634801 1675453
50409 1675453 1719588 1767052 1817477 1870050 1923517 1976425 2027490 2075693 2120017 2159398 2193047
50398 2193047 2220596 2241751 2255967 2262470 2260363 2248690 2226820 2194858 2153375 2102767 2043465 1977037
50386 1977037 1906596 1835742 1767287 1703112 1644764 1593692 1551031 1517451 1493130 1477828 1471143
50375 1471143 1472660 1481609 1496408 1514920 1535138 1555216 1572888 1585422 1590415 1586351 1572519 1548979
50363 1548979 1516811 1477898 1434320 1388199 1341882 1297474 1256093 1218171 1184485 1156070 1132914
50352 1132914 1113564 1096209 1079325 1061158 1039779 1014490 986523 957827 929798 903596 880666
50341 880666 862033 847676 837319 831201 829315 830587 833776 838737 845913 854976 864910 875226 886173
50328 886173 897912 910181 922633 934827 946147 956459 966632 977655 989440 1001247 1013028
50317 1013028 1025435 1038450 1050835 1061126 1068642 1073552 1076560 1078555 1080015 1080713 1080474 1080058 1080745 1083164
50303 1083164 1087192 1092875 1100690 1110888 1123300 1138037 1155810 1177388 1203200 1233508 1268557 1308582
50291 1308582 1354057 1405520 1461845 1518004 1565166 1593983 1598681 1579188 1540632 1491010 1438155
50280 1438155 1387532 1342049 1303218 1271792 1247395 1228560 1213781 1202336 1193819 1187331 1181627 1176054
50268 1176054 1171014 1167419 1165656 1165127 1164780 1164082 1163272 1162720 1162469 1162602 1163491 1165266 1167485 1169973 1173614 1179474
50252 1179474 1187238 1195348 1202784 1210021 1218075 1227214 1236819 1245900 1253426 1258559 1260949 1260700 1258171 1254088
50238 1254088 1249677 1246019 1243241 1240854 1238918 1238228 1239133 1240727 1241399 1239529 1233395 1221191 1201959 1176437
50224 1176437 1146678 1114941 1083061 1052366 1023632 997063 972469 949487 927686 906794 886900
50213 886900 868249 850793 834309 818951 805304 793758 784137 776026 769074 762894 757127 751831 747420
50200 747420 744062 741475 739451 738073 737184 736128 734422 732329 730401 728774 727246 725683 723916 721475
50186 721475 717972 713682 709347 705370 701455 697019 691765 685931 680179 675226 671357 668287 665519 662731
50172 662731 659831 656865 654089 651903 650473 649508 648578 647613 646965 647052 648048 649871 652292 655065 657998 661042
50156 661042 664394 668564 674113 681166 689400 698710 709713 723215 739274 757115 775910 795213 814806
50143 814806 834634 854972 876155 897949 919600 940607 961056 981169 1001116 1021497 1043383
50132 1043383 1067403 1093118 1119507 1145520 1169685 1189672 1203132 1208992 1207568 1199540 1185416 1166126
50120 1166126 1143616 1120379 1098209 1077399 1057200 1037131 1017830 1000511 985762 973199 962165
50109 962165 952177 942607 932628 921962 911279 901404 892384 883708 875072 866458 857825 849350 841798 835895
50095 835895 831313 826924 822257 818125 815536 814465 814202 814681 816947 822185 830559 841200 853145 865974
50081 865974 879447 892978 905896 918186 930426 942861 954965 966139 976327 985551 993267 998851
50069 998851 1002509 1005112 1007111 1008205 1008076 1006798 1004354 1000342 994641 987975 981352 975125 968979 962656
50055 962656 956219 949680 942876 935921 929472 924322 920875 919222 919503 921912 926385 932557 940098 948923
50041 948923 959043 970441 983183 997393 1012858 1028772 1044111 1058268 1071258 1083433 1095191
50030 1095191 1106823 1118365 1129640 1140642 1151709 1162973 1173756 1183030 1190508 1196804 1202358 1206733
50018 1206733 1209343 1210423 1210749 1210684 1210054 1208814 1207154 1204838 1200979 1194851 1186546 1176464 1164286 1148840
50004 1148840 1128984 1104469 1076045 1045127 1013574 983492 956745 934372 916442 902431 891698
49993 891698 883700 877997 874098 871144 867803 862944 856648 850151 844383 838773 831975 823514 814008 803796
49979 803796 792214 778620 763481 747972 732908 718619 705473 693766 683262 673540 664816 657761
49967 657761 652357 647546 642311 636619 630898 625101 618930 612695 607249 603027 599758 597332 596281 597045
49953 597045 599267 602436 606907 613547 622402 632497 643112 654425 666350 677431 685814 691170 694842
49940 694842 698077 700916 703042 704851 706947 708967 709637 708011 704009 697673 688495 676048 661121 645708
49926 645708 631663 619532 608849 599347 591478 585712 581686 578364 574997 571775 569503 568769 569405 570663
49912 570663 571907 573114 574625 576506 578420 580269 582631 586273 591382 597596 604669 612696 621674 631224
49898 631224 640962 650919 661401 672421 683368 693205 700986 706192 708688 708606 706479 703257 699652 695371
49884 695371 689429 681442 672149 662422 652313 641558 630511 619877 609777 599833 590121 581368 574131
49871 574131 568302 563469 559342 555859 553326 552368 553211 555151 557299 559780 563478 568664 574698 581167 588460
49856 588460 596929 606265 616050 626217 636553 646418 655424 663799 671624 678276 683138 686332 688250 688906
49842 688906 688353 687231 686129 684658 681841 677199 670883 662953 653302 642340 631233 621236 613038 606657
49828 606657 601681 597664 594518 592454 591402 590792 590196 589947 590810 593232 597193 602522 608999 616353 624539
49813 624539 633824 644274 655278 665884 675385 683368 689569 694130 697762 701123 704075 705903 706115 704715
49799 704715 701853 697644 692292 686102 679411 672600 665839 658557 649631 638622 626606 615336 605844
49786 605844 598212 592347 588206 585389 583209 581285 579647 578241 576749 574920 572715 570182 567610 565746
49772 565746 565443 567013 570209 574700 580224 586418 592975 599918 607324 614796 621636 627562 632897 638083
49758 638083 643237 648079 651983 654307 655017 654768 653921 651774 647319 640522 632192 622807 612364 601491
49744 601491 591783 584595 579958 576979 574924 573638 573292 573998 575459 576898 577634 577799 578264 579853 582970
49729 582970 587827 594339 601649 608333 613471 617233 620289 623047 625698 628637 632490 637901 645372 655086
49715 655086 666709 679536 692805 705548 716181 722867 724629 721935 716096 708414 699958 691610 683821
49702 683821 676440 669151 662154 656371 652990 652688 655002 658373 660963 661581 659969 656615 652525 648825 646093
49687 646093 644203 643135 643587 646209 650600 655835 661813 669168 677918 687287 697090 708263 721576 736838
49673 736838 753989 773850 796510 819393 838111 849493 853283 851161 845056 836700 828063 821395 818495
49660 818495 819866 824713 831979 841294 852390 863377 870256 868913 857717 838231 813849 788174 764064
49647 764064 743053 725189 709728 696243 685012 676521 670936 668072 667557 668883 671516 675011 678868
49634 678868 682315 684453 684694 682994 679697 675285 670211 664730 658807 652291 645298 638335 631997 626506
49620 626506 621571 616773 612050 607704 603931 600586 597599 595390 594490 594853 595927 597327 599019 600825 602291
49605 602291 603213 603897 604637 605374 606045 606852 607862 608752 609341 610068 611474 613436 615305 616653 617490 617872 617718
49588 617718 617055 616146 615324 614789 614491 614088 613238 612068 611165 610892 610978 611003 610996 611309 612197 613899 616801 620988 625843
49569 625843 630702 635839 642254 650435 659866 669825 680148 690952 701992 712573 721881 729199 734035
49556 734035 736200 735722 732665 727312 720425 712975 705503 698051 690833 684578 680057 677643 677463 679466 682933
49541 682933 686373 688590 689786 691079 692970 694803 695809 696154 696758 698493 701861 707089 714200 723141 734159
49526 734159 747828 764429 783528 804538 827493 852700 879487 905681 928546 946125 957910
49515 957910 964781 968536 970976 972954 974357 975177 976392 979561 985648 994321 1004085 1012849 1018589 1019888
49501 1019888 1015996 1006517 991415 971570 948939 925712 903343 882465 863431 846467 831534 818479
49489 818479 807362 798327 791262 785856 781821 778842 776545 774902 774396 775271 776832 778039 778716 779574 781021
49474 781021 782547 783428 783520 783210 782980 783159 783760 784482 785238 786596 789205 792769 796176 798811 801210 804233
49458 804233 808090 812431 816852 820957 824333 826838 828689 830000 830458 829667 827577 824519 821104 818144 816227
49443 816227 815219 814533 813929 813591 813339 812507 810996 809945 810813 814033 818870 824326 829896 835762 842597 851013
49427 851013 861092 872643 885877 901263 918542 936409 953529 969513 984833 1000287 1016436
49416 1016436 1032589 1045892 1052474 1050453 1041560 1029489 1017360 1007279 1001136 1000302 1004708 1013299 1025407
49403 1025407 1040936 1059418 1079880 1101590 1124108 1146635 1168220 1188692 1208512 1227510 1244529
49392 1244529 1258625 1269960 1279197 1286586 1291907 1294721 1294369 1290222 1282391 1271877 1259731 1246337 1231705
49379 1231705 1216044 1199741 1183131 1166696 1151289 1137759 1126373 1116872 1109031 1102965 1098874 1096613
49367 1096613 1095674 1095531 1095949 1096792 1097570 1097431 1095765 1092664 1088589 1083763 1078075 1071425 1063854 1055390 1045958
49352 1045958 1035445 1023839 1011467 999155 987858 977937 969101 961127 954189 948246 942758 937578 933578
49339 933578 931550 930781 929528 926907 923551 920464 918031 916327 915661 916416 918776 922837 928567 935581 943453
49324 943453 952535 963946 978296 994493 1009907 1021538 1027210 1026342 1020039 1010261 998650 986071 972988
49311 972988 959806 946717 933704 920895 908702 897583 887961 880379 875257 872408 871193 871275 872802
49298 872802 875792 879909 885024 891429 899040 906866 913785 919679 925254 930840 935777 939072 940420 940447 940080
49283 940080 939806 939588 939364 939345 939689 940249 941104 943144 947573 954741 963886 974002 984447 994571 1003400
49268 1003400 1010121 1014643 1017352 1018523 1018084 1015721 1011074 1004174 995913 987744 980645 974528 968848 963601
49254 963601 959624 958172 960265 966054 974688 985095 996971 1010458 1024635 1036891 1044344 1045706 1041523
49241 1041523 1033090 1021660 1008468 994863 982247 971851 964254 958829 954165 949637 946434 946489 950500
49228 950500 957396 965534 973756 981378 988004 993828 999658 1006164 1013252 1020414 1027475 1034675 1042192 1050012
49214 1050012 1058298 1067554 1078138 1089710 1101407 1112572 1123166 1133385 1143184 1152506 1161875 1172331
49202 1172331 1184549 1198223 1212514 1226920 1241533 1256582 1271944 1287110 1301453 1314583 1326538
49191 1326538 1337667 1348320 1358701 1368918 1378887 1388140 1396025 1402340 1407616 1412692 1418299 1425213 1434397
49178 1434397 1446514 1461443 1478704 1498252 1520447 1545343 1572620 1602360 1635359 1672247 1712568
49167 1712568 1754949 1797685 1838476 1873758 1899322 1912582 1914461 1908862 1900184 1891289 1883427 1877347
49155 1877347 1873893 1873616 1876231 1880635 1885473 1889767 1893302 1896565 1900208 1904530 1909498 1915173 1921898 1930104
49141 1930104 1940205 1952665 1967657 1984378 2001166 2016908 2032214 2048703 2067112 2086713 2106686
49130 2106686 2127392 2149756 2173761 2198202 2221930 2244841 2267554 2290524 2313685 2336740 2359604
49119 2359604 2382666 2406647 2432058 2458829 2486843 2516873 2550688 2589985 2635586 2687917 2748012
49108 2748012 2817753 2899737 2997721 3116830 3261166 3428562 3606630 3775988 3921729 4045308
49098 4045308 4164524 4297084 4439488 4561507 4624465 4608663 4525805 4407137 4280458 4155788
49088 4155788 4027484 3886024 3728436 3561090 3395468 3241993 3107009 2993518 2902318 2831573
49078 2831573 2776765 2732880 2696829 2667352 2643330 2623322 2606352 2591883 2578912 2566050 2552696
49067 2552696 2539430 2527115 2516181 2506735 2498629 2491361 2484595 2478745 2474327 2470778 2466828 2462146 2457638
49054 2457638 2453852 2450192 2446303 2443268 2442520 2444076 2446769 2449910 2453894 2459347 2466417 2474921 2484351 2493360
49040 2493360 2499843 2502132 2500220 2495591 2489832 2483611 2477070 2470877 2466356 2464404 2464690 2466201 2468245 2470502
49026 2470502 2472429 2473253 2472507 2470057 2465674 2459218 2451365 2443584 2437093 2432116 2428225 2424977 2422173 2419928
49012 2419928 2418688 2418768 2419886 2421547 2423905 2427595 2432578 2437836 2442506 2446697 2450817 2454763 2458312 2461785
48998 2461785 2465553 2469120 2471402 2471815 2470519 2467643 2462946 2456451 2448946 2441372 2433886 2425860 2416924 2407682
48984 2407682 2399142 2391571 2384357 2377038 2369987 2363847 2358818 2354988 2352860 2352743 2353880 2355059 2356059 2357637
48970 2357637 2359984 2362167 2363468 2364464 2366185 2368835 2371943 2375330 2379268 2383918 2389222 2395272 2402382 2410734
48956 2410734 2420087 2429804 2439215 2448301 2458059 2469808 2484038 2500309 2518233 2537901 2559186 2581360
48944 2581360 2603916 2627217 2651785 2677326 2702980 2728305 2753621 2779692 2807489 2838056 2872061
48933 2872061 2909475 2949868 2993002 3039065 3088516 3141694 3198297 3257308 3317843 3380022 3444389
48922 3444389 3510600 3577506 3644629 3712527 3781341 3849972 3917333 3983515 4048835 4112410 4172539
48911 4172539 4228039 4278474 4323734 4364371 4401850 4437385 4470764 4501243 4529242 4556026 4581871
48900 4581871 4605786 4627146 4646440 4664097 4679618 4692377 4702408 4709789 4713938 4714286 4711349 4706500
48888 4706500 4700757 4694104 4685921 4675744 4663649 4650002 4634873 4617715 4597819 4575078 4550122 4523624
48876 4523624 4495646 4465704 4433259 4398001 4359738 4318202 4273134 4224601 4173088 4119095 4062805
48865 4062805 4004519 3945370 3887103 3830943 3776959 3724644 3673676 3624061 3576102 3530567 3488355
48854 3488355 3449599 3413461 3379175 3346870 3317070 3289947 3265550 3244173 3225847 3209908 3195762
48843 3195762 3183738 3174492 3167947 3163550 3161347 3161988 3165778 3172424 3181567 3192870 3205707 3219569 3234734
48830 3234734 3251782 3270414 3289470 3308229 3326993 3346179 3365503 3384343 3402425 3419862 3436862
48819 3436862 3453627 3470325 3487037 3503868 3520947 3538016 3554238 3568871 3582112 3594888 3607957
48808 3607957 3621597 3635925 3650943 3666406 3682202 3698752 3716504 3735254 3754553 3774589 3795837
48797 3795837 3817943 3839875 3861236 3882555 3904060 3924942 3944142 3961102 3975476 3986888 3995525
48786 3995525 4002398 4008482 4013962 4018545 4021943 4023578 4022363 4017377 4008504 3995952 3979458 3958439 3932725
48773 3932725 3902706 3868853 3831468 3790776 3746994 3700453 3651976 3602961 3554642 3507232 3460103
48762 3460103 3412920 3366380 3321702 3279484 3239342 3200672 3163546 3128591 3096112 3065796 3037450
48751 3037450 3011567 2988824 2969254 2952336 2937700 2925302 2915000 2906481 2899717 2895192 2893591 2895359
48739 2895359 2900369 2907759 2916265 2925084 2934304 2944193 2954276 2963617 2971827 2979268 2986270 2992759 2998726 3004544
48725 3004544 3010505 3016396 3021745 3026291 3030121 3033546 3036899 3040245 3043256 3045514 3046935 3047745 3048181 3048484 3049074
48710 3049074 3050493 3053174 3057356 3063035 3069812 3076988 3083966 3090312 3095365 3098293 3098956 3098264 3097260 3096193
48696 3096193 3094895 3093573 3092747 3092837 3094319 3097762 3102974 3108614 3113419 3117407 3121114 3124238 3126098 3127064 3128311
48681 3128311 3130400 3133331 3137867 3145350 3155963 3168519 3182502 3199245 3220521 3246927 3278334 3315213
$$ [...]
##END NTUPLES=NMR SPECTRUM
##END=
