##TITLE=AC1542_ROEFFECT0012_8215128_l67O6OVqZC
##JCAMPDX= 6.0         $$ Bruker NMR JCAMP-DX V2.0
##DATA TYPE= NMR SPECTRUM
##DATA CLASS= NTUPLES
##ORIGIN= BRUKER
##OWNER= Administrator
$$ 1.72 TOPSPIN		Version 2.1
$$ 2013-10-11 19:44:18.817 -0700  Administrator@X
$$ Compression mode = diff/dup
##.OBSERVE FREQUENCY= 400.02188249412
##.OBSERVE NUCLEUS= ^1H
##.ACQUISITION MODE= SIMULTANEOUS (DQD)
##.ACQUISITION SCHEME= undefined
##.AVERAGES= 8
##.DIGITISER RES= 22
##SPECTROMETER/DATA SYSTEM= spect
##.PULSE SEQUENCE= zg30
##.SOLVENT NAME= COFFEE_meoh
##.SHIFT REFERENCE= INTERNAL, COFFEE_meoh, 1, 14.98509
##AUDIT TRAIL= $$ (NUMBER, WHEN, WHO, WHERE, PROCESS, VERSION, WHAT)
$$ ##TITLE= Audit trail, TOPSPIN		Version 2.1
$$ ##JCAMPDX= 5.01
$$ ##ORIGIN= Bruker BioSpin GmbH
$$ ##OWNER= Administrator
$$ $$ E:\/data/COFFEE/nmr/AC1542_ROEFFECT0012_8215128_l67O6OVqZC/10/pdata/1/auditp.txt
$$ ##AUDIT TRAIL=  $$ (NUMBER, WHEN, WHO, WHERE, PROCESS, VERSION, WHAT)
(   1,<2013-10-11 19:44:12.098 -0700>,<Administrator>,<X>,<go>,<TOPSPIN 2.1>,
      <created by zg
	started at 2013-10-11 19:43:05.645 -0700,
	POWCHK enabled, PULCHK disabled,
       configuration hash MD5:
       C8 4E 4E 5D D3 5C D8 9E 9F 52 82 E0 59 8A DE 15
       data hash MD5: 64K
       CB 36 8D 5B F1 FA 39 FD 3B FF 9A AD 99 D0 D2 27>)
(   2,<2013-10-11 19:44:15.067 -0700>,<Administrator>,<X>,<proc1d>,<TOPSPIN 2.1>,
      <Start of raw data processing
       efp LB = 0 FT_mod = 6 PKNL = 1 PHC0 = 0 PHC1 = 0 SI = 32K 
       data hash MD5: 32K
       34 2C 3C C4 BB 0A E6 A7 EC 3F E3 F7 BA 0F 5D 20>)
(   3,<2013-10-11 19:44:15.364 -0700>,<Administrator>,<X>,<proc1d>,<TOPSPIN 2.1>,
      <pk PHC0 = 97.05872 PHC1 = 0 
       data hash MD5: 32K
       2C 27 4E 7D 98 05 90 C0 DC EF 6A CA B4 3C DB 0D>)
(   4,<2013-10-11 19:44:15.458 -0700>,<Administrator>,<X>,<proc1d>,<TOPSPIN 2.1>,
      <abs ABSG = 1 
       data hash MD5: 32K
       8C AB 4D 55 8B 8F 61 5D D2 FB 96 5F 62 4E 27 3D>)
(   5,<2013-10-11 19:44:15.551 -0700>,<Administrator>,<X>,<proc1d>,<TOPSPIN 2.1>,
      <abs ABSG = 2 
       data hash MD5: 32K
       2C CA 85 DF FA 80 A9 63 14 DA BF 20 CA F9 2E CB>)
(   6,<2013-10-11 19:44:15.630 -0700>,<Administrator>,<X>,<proc1d>,<TOPSPIN 2.1>,
      <abs ABSG = 3 
       data hash MD5: 32K
       11 13 B1 C9 91 59 1C 6B 74 DD 78 46 91 3D 52 73>)
(   7,<2013-10-11 19:44:15.692 -0700>,<Administrator>,<X>,<proc1d>,<TOPSPIN 2.1>,
      <abs ABSG = 4 
       data hash MD5: 32K
       66 96 2F A3 04 CB 3A AC 54 BD 2D 6A 8A E4 32 00>)
(   8,<2013-10-11 19:44:15.755 -0700>,<Administrator>,<X>,<proc1d>,<TOPSPIN 2.1>,
      <abs ABSG = 5 
       data hash MD5: 32K
       69 2C 9F D0 23 96 22 35 5F B7 73 C5 56 24 29 3E>)
$$ ##END=
$$ 
$$ $$ hash MD5
$$ $$ 34 C4 D7 87 D9 73 16 D4 20 A6 4E 80 7C 76 27 28
##$RELAX= 
##$RELAX= 
##$RELAX= 
##$RELAX= 
##$RELAX= 
##$RELAX= 
##$RELAX= 
$$ Bruker specific parameters
$$ --------------------------
##$DU= <E:\>
##$EXPNO= 10
$$ [...]
150 150 150 150 150 150 150 150
##$TP07= 0
##$TPNAME0= <>
##$TPNAME1= <>
##$TPNAME2= <>
##$TPNAME3= <>
##$TPNAME4= <>
##$TPNAME5= <>
##$TPNAME6= <>
##$TPNAME7= <>
##$TPOAL= (0..7)
0.5 0.5 0.5 0.5 0.5 0.5 0.5 0.5
##$TPOFFS= (0..7)
0 0 0 0 0 0 0 0
##$TUNHIN= 0
##$TUNHOUT= 0
##$TUNXOUT= 0
##$USERA1= <user>
##$USERA2= <user>
##$USERA3= <user>
##$USERA4= <user>
##$USERA5= <user>
##$V9= 5
##$VALIST= <valist>
##$VCLIST= <CCCCCCCCCCCCCCC>
##$VD= 0
##$VDLIST= <DDDDDDDDDDDDDDD>
##$VPLIST= <PPPPPPPPPPPPPPP>
##$VTLIST= <TTTTTTTTTTTTTTT>
##$WBST= 1024
##$WBSW= 4
##$XGAIN= (0..3)
0 0 0 0
##$XL= 0
##$YL= 0
##$YMAX_a= 656002
##$YMIN_a= -557967
##$ZGOPTNS= <>
##$ZL1= 120
##$ZL2= 120
##$ZL3= 120
##$ZL4= 120
##$ABSF1= 14.98509
##$ABSF2= -5.573092
##$ABSG= 5
##$ABSL= 3
##$ALPHA= 0
##$AQORDER= 0
##$ASSFAC= 0
##$ASSFACI= 0
##$ASSFACX= 0
##$ASSWID= 0
##$AUNMP= <proc_prof1d_extract_pilot.lims>
##$AXLEFT= 0
##$AXNAME= <>
##$AXNUC= <1H>
##$AXRIGHT= 0
##$AXTYPE= 0
##$AXUNIT= <>
##$AZFE= 0.1
##$AZFW= 0.1
##$BCFW= 0
##$BC_mod= 0
##$BYTORDP= 0
##$COROFFS= 0
##$CY= 15
##$DATMOD= 1
##$DC= 0
##$DFILT= <>
##$DTYPP= 0
##$F1P= 0
##$F2P= 0
##$FCOR= 0.5
##$FTSIZE= 32768
##$FT_mod= 6
##$GAMMA= 0
##$GB= 0
##$INTBC= 1
##$INTSCL= 1
##$ISEN= 128
##$LB= 0
##$LEV0= 0
##$LPBIN= 0
##$MAXI= 10000
##$MC2= 0
##$MEAN= 0
##$ME_mod= 0
##$MI= 0
##$NCOEF= 0
##$NC_proc= -8
##$NLEV= 6
##$NOISF1= 0
##$NOISF2= 0
##$NSP= 0
##$NTH_PI= 0
##$NZP= 0
##$OFFSET= 14.98509
##$PC= 1
##$PHC0= 97.05872
##$PHC1= 0
##$PH_mod= 1
##$PKNL= yes
##$PPARMOD= 0
##$PPDIAG= 0
##$PPIPTYP= 0
##$PPMPNUM= 2147483647
##$PPRESOL= 1
##$PSCAL= 4
##$PSIGN= 0
##$PYNMP= <proc.py>
##$REVERSE= no
##$SF= 400.02
##$SI= 32768
##$SIGF1= 0
##$SIGF2= 0
##$SINO= 400
##$SIOLD= 32768
##$SPECTYP= <>
##$SREGLST= <1H.CDCl3>
##$SSB= 0
##$STSI= 32768
##$STSR= 0
##$SW_p= 8223.68421052631
##$SYMM= 0
##$S_DEV= 0
##$TDeff= 65536
##$TDoff= 0
##$TI= <>
##$TILT= no
##$TM1= 0
##$TM2= 0
##$TOPLEV= 0
##$USERP1= <user>
##$USERP2= <user>
##$USERP3= <user>
##$USERP4= <user>
##$USERP5= <user>
##$WDW= 1
##$XDIM= 32768
##$YMAX_p= 455098613
##$YMIN_p= -731486
##$CURPLOT= <Network HP LaserJet P1505>
##$CURPRIN= <$Network HP LaserJet P1505>
##$DFORMAT= <normdp>
##$LAYOUT= <+/1D_H.xwp>
##$LFORMAT= <normlp>
##$PFORMAT= <normpl>
##$SURQMSG= 1
$$ End of Bruker specific parameters
$$ ---------------------------------
##NTUPLES= NMR SPECTRUM
##VAR_NAME=  FREQUENCY,     SPECTRUM/REAL,   SPECTRUM/IMAG
##SYMBOL=    X,             R,               I
##VAR_TYPE=  INDEPENDENT,   DEPENDENT,       DEPENDENT
##VAR_FORM=  AFFN,          ASDF,            ASDF
##VAR_DIM=   32768,         32768,           32768
##UNITS=     HZ,            ARBITRARY UNITS, ARBITRARY UNITS
##FACTOR=    0.250966925370066, 1,           1
##FIRST=     8223.43324360094, -102887,      -12765
##LAST=      0,             -135214,         -238524
##MIN=       0,             -731486,         0
##MAX=       8223.43324360094, 455098613,    0
$$ Real data points
##PAGE= N=1
##DATA TABLE= (X++(R..R)), XYDATA
$$ [...]
19567f2492j57263O379b4465k79014a8024q8064k20442j39434I1576J09850G0041
19555E8148n090b74966l01998A71703D9098Q5752G57g7994k10290D5419a55555
19543b85526B5880L47567a000m0471H7199L0623D8582j4539i5594D6174B1126
19531d1750B91138g1119A24437a73699o3878c2375A76650g8565F510f7912A91016
19519a33370c8845B6562L4092N5318b04806Q6909a8748j05384j25777e1242p2838
19508a24080b8704j7013j69953A91883i384k02746J4632G5160c34565o6095A61418
19496H352a79104C42576C795a12971A71861i5098j15675E3253c47171b2812k91420
19485c14232f1737l9281E4051c1312B67139a06901j51961i5240o0608A089e3900
$$ plain form
19567 -62492 -219755 -213376 -24465 -303479 -18024 -106088 -326530 -465964 91576 201426 70041
19555 58148 53058 -274966 -576964 171703 49098 134850 757 -77994 -288284 45419 -155555
19543 -285526 25880 373447 -1000 -41471 87199 117822 48582 34043 -95594 46174 21126
19531 -41750 291138 -71119 124437 -173699 -237577 -32375 176650 -78565 6510 -67912 191016
19519 -133370 -38845 26562 60654 115972 -204806 -117897 -18748 -124132 -249909 -51242 -124080
19508 -124080 -28704 -45717 -215670 191883 -9384 -212130 -197498 75160 -334565 -400660 161418
19496 8352 -179104 342576 3795 -112971 171861 -95098 -210773 53253 -347171 -22812 -314232
19485 -314232 -61737 -101018 54051 -31312 267139 -106901 -258862 -95240 -155848 1089 -53900
19473a76346e4727A13671m0700L20108g7629l24128B23282H1225a5885G2458a34423
19461d07624H6741a42403n3387K8017F9856f973k80768i6014A82754B5617a78373
19449F6018B3674h0389k02551h2848o6023j19401i2772p5320j35984Q2370j32666
19438c54372G851K79062f6291j42196A44933i1505m7071C9103L5556k3296R6994
19427A48357a68051A52612a20688F6285c0353D17388A93604c66998O4686g927
19416h3718k39737Q5205A72575g424j79272B08049E8639B5561a47273k72000c5517
19404c33829j586J13105A36341a21876e4571B78723c91763a8782k6337l0693A58570
19392e1124k47535A37163h3823c9543j93491E0042c16560G8908A6297K56182h7068
$$ plain form
19473 -176346 -54727 113671 72971 393079 -77629 -401757 223282 81225 -15885 72458 -134423
19461 -407624 86741 -142403 -195790 -167773 69856 -6973 -287741 -96014 182754 25617 -178373
19449 66018 23674 -80389 -282940 -82848 -148871 -268272 -92772 -168092 -304076 -221706 -354372
19438 -354372 7851 286913 -66291 -208487 144933 -91505 -138576 39103 74659 51363 148357
19427 148357 -168051 152612 -120688 66285 -30353 417388 193604 -366998 -302312 -7927
19416 -83718 -323455 -238250 172575 -7424 -186696 208049 58639 25561 -147273 -419273 -35517
19404 -333829 -335415 -222310 136341 -121876 -54571 278723 -391763 -18782 -45119 -75812 158570
19392 -51124 -298659 137163 -83823 -39543 -233034 50042 -316560 78908 16297 272479 -87068
19380g8090o3991M7804A2461a07606L4124k17307P4726m6405d2824p4567a3888
19368B0872D074J0446J3711a90610A27183ek74704a14781A08670a34892A94291
19356C35540c26399a12136E0938b86728D949K50527j11761b45373l47028i1434
19345A86704c1720k07641G5100b64107E4452k3558c77123R0603g8688D7022E392
19333A31142E3704n174c65845c5690k73606P7098E4382K23933E8455h3536A51743
19321A92833l0047B6868b42095J0645g8134k8111M1419A94129b68401C5929d8066
19309a29929p2471c9823H2152J00996k6970c2390l53871J36257i6337k78176a24402
19297b36505J04852B70594f8002j38061O5946j5781k01218a78541B78320a08081
$$ plain form
19380 -78090 -142081 -94277 12461 -107606 -73482 -290789 -216063 -262468 -42824 -117391 -13888
19368 20872 4074 14520 28231 -190610 127183 -5 -274709 -114781 108670 -134892 194291
19356 335540 -326399 -112136 50938 -286728 4949 255476 143715 -245373 -592401 -91434
19345 186704 -31720 -239361 75100 -264107 54452 30894 -377123 -286520 -78688 47022 5392
19333 131142 53704 48530 -365845 -35690 -309296 -232198 54382 278315 58455 -83536 151743
19321 192833 162786 26868 -242095 -231450 -78134 -106245 -64826 194129 -268401 35929 -48066
19309 -129929 -202400 -39823 82152 183148 156178 -32390 -386261 -250004 -96337 -374513 -124402
19297 -236505 -131653 270594 -68002 -206063 -140117 -155898 -357116 -178541 278320 -108081
19286a0228j32545G9239g4212k47519A750a63560A22090M9339a72289M7468B12082
19274e5743A46012d1995J3895F8127f0784A1260g2730A9459J11172f9671B36343
19262e4920j14631H1074a70435d7117A60423P201F394Q1973a88979B05056A4011
19250b81183D5026d5685J1152j66727c739E5499a05381A48775d2759p1999j20257
19239b35015A55458a40992f3787r3137C29961d18472b2293k49457a25056C5875
19228b06305m6947C0880N148b00599A61055c05989B27757a48617l4041B81695
19217A22432B2925a26321r7429N2771j03437a22225L306j42164e7870o2144j12691
19206b32705j34414A993e9773H2402J46205b78403a38719K6894c0987o8975k657
$$ plain form
19286 -10228 -142773 79239 -74212 -321731 1750 -163560 122090 171429 -172289 -124821 212082
19274 -55743 146012 -41995 -28100 68127 -60784 11260 -72730 19459 130631 -69671 236343
19262 -54920 -169551 81074 -170435 -47117 160423 167624 6394 88367 -188979 205056 14011
19250 -281183 45026 -45685 -34533 -201260 -3739 55499 -105381 148775 -42759 -114758 -235015
19239 -235015 155458 -140992 -63787 -156924 329961 -418472 -22293 -271750 -125056 35875
19228 -206305 -253252 30880 36028 -200599 161055 -305989 227757 -148617 -182658 281695
19217 122432 22925 -126321 -223750 -170979 -274416 -122225 -118919 -261083 -57870 -120014 -232705
19206 -232705 -367119 1993 -59773 82402 228607 -278403 -138719 -111825 -30987 -99962 -102619
19195a02619d3322k57549R2286q429j19475a01033l6552F3522c58527a28279C65896
19183H7296c19786P8145B09797P1815h4587I5214m1581c03437R9120R0043E4572
19171a22881m9076G6025a8580k00599A31758J4405m1139a10954n8731N7518a5861
19159H8098e8336A20114b28840e0327N003m289A8297a21130B84703g3197F4663
19147a87912j30385J28677A61164a58639d1259D49763e3400j89667l4021M2377
19137b34711O3215F8335d80560g5347k73528C3891a49021K8938k30339A94352
19126A16804f3796A59926L9329a29950l1278B1260Q5677b42837B7099a43372I6391
19114d7096r800q9602J8391d2727k83459a26061C3285i5764g452k19808C19950
$$ plain form
19195 -102619 -43322 -300871 -208585 -217014 -336489 -101033 -137585 63522 -358527 -128279 365896
19183 87296 -319786 -241641 209797 281612 -84587 95214 53633 -303437 -204317 -114274 54572
19171 -122881 -171957 76025 -18580 -219179 131758 146163 105024 -110954 -169685 -112167 -15861
19159 88098 -58336 120114 -228840 -50327 -45324 -49613 18297 -121130 284703 -73197 64663
19147 -187912 -318297 -189620 161164 -158639 -41259 449763 -53400 -243067 -277088 -234711
19137 -234711 -171496 68335 -480560 -75347 -348875 33891 -149021 -120083 -350422 194352
19126 116804 -63796 159926 199255 -129950 -161228 21260 106937 -242837 27099 -143372 96391
19114 -47096 -56896 -146498 -128107 -42727 -326186 -126061 33285 -95764 -7452 -227260 319950
19102h4004c5310j97835D0814O7109f4992C8325b43147r2848A43714l8024a79481
19090c9159E1529a99186A60780c4783m06236K14076i2513A01558b19178N1646
19080a67532a7126k48578a06365p406A80143M2282D1523a87054j0308B79300A21691
19068f6676j25355G0458e00158b1029j7676A05667c70656J71835e0866F7619a59847
19056a23997b789o462j76736P2204K815j14026i4244M6566l0601A08318k6589
19045H1729b77543e9825D24844h2789H3221F481g3945o417K3462j88809a1432
19033b84170f4722A35726j2769C9392A9364G778K02149I0741J52152i2363j51341
19022b43704G9763C4412j7137c6301k2689k5085k7868B50298a31821A9238h3856
$$ plain form
19102 -84004 -35310 -233145 40814 107923 -64992 38325 -243147 -335995 143714 105690 -179481
19090 -39159 51529 -199186 160780 -34783 -441019 -226943 -92513 101558 -219178 -167532
19080 -167532 -17126 -265704 -106365 -113771 180143 222425 41523 -187054 -197362 279300 121691
19068 -66676 -192031 70458 -500158 -21029 -38705 105667 -370656 -198821 -50866 67619 -159847
19056 -123997 -2789 -9251 -185987 -113783 -110968 -224994 -94244 -47678 -78279 108318 81729
19045 81729 -277543 -59825 424844 -82789 83221 6481 -73945 -80362 -56900 -245709 -11432
19033 -284170 -64722 135726 122957 39392 19364 7778 209927 90741 242893 -92363 -243704
19022 -243704 79763 34412 17275 -36301 -58990 -84075 -111943 250298 -131821 19238 -83856
19010c41982A59222b93513B06077N6055a87668d6870E9782K5914b59456A07726
18999e5694k07762J23847A49479R7089a58285j13002N5140e4486B3947P0033M929
18988I8909B2827h4874D2407K0988J66689c81334J11431a22054A02768b18075
18977A31118a95857J1373A2802J62105b00714L5407M8726A07974a23953p8599
18967b02552N0916M816j30969E5412j6709a31062A8071J79117n7369b12654B77920
18955a79174A52115b01731j36774L4443A3327d1384A23317c1235A72305J88233
18945C60538B98b84866C76931D7326M3711a96984d8045B4506a55501j64329C18982
18933a21165e7313l7246k4044j55601Q8610c1637A33456a95334l7452m5518d7646
$$ plain form
19010 -341982 159222 -293513 206077 262132 -187668 -46870 59782 85696 -259456 107726
18999 -55694 -263456 -139609 149479 246568 -158285 -271287 -216147 -54486 23947 93980 98909
18988 98909 22827 -84874 42407 63395 230084 -381334 -269903 -122054 102768 -218075
18977 131118 -195857 -184484 12802 174907 -200714 -165307 -116581 107974 -123953 -202552
18967 -202552 -151636 -146820 -277789 55412 38703 -131062 18071 197188 139819 -212654 277920
18955 -179174 152115 -201731 -338505 -304062 13327 -41384 123317 -31235 172305 360538
18945 360538 298 -284866 376931 47326 91037 -196984 -48045 24506 -155501 -319830 318982
18933 -121165 -57313 -94559 -118603 -274204 -185594 -31637 133456 -195334 -232786 -278304 -47646
18921A31097a38122j63923F4863E091e0361k6477q2556b6451H9250l671h7820
18909D0865h6865M2934D6008a06111C3845h6241l7186j27007M2479B65192a51300
18897a38999b4214o498l02800b5102j58542C5280C758a65577m9461g6632j12205
18886a88837R3915k4738P505H6791C6943J59153a75279b9600A9752a92443g2235
18874b12362F3404c4176A13591a22228A01906K39380C240d7586m33D1687E013
18862G715d6468K575k12933M0678b1386D3327a82607e6337J2917C25444A7681
18850B77500g6105l1425r3454D8619a93575Q5299d5911i852A52819a64606H8447
18838d2596F4281a91268q6029A96119a97128o5881B66785A2904a74608B3787J27508
$$ plain form
18921 131097 -138122 -302045 64863 5091 -50361 -76838 -159394 -26451 89250 85579 -87820
18909 40865 -86865 -43931 46008 -106111 33845 -86241 -123427 -250434 -207955 265192 -151300
18897 -138999 -24214 -30712 -333512 -25102 -183644 35280 3758 -165577 -215038 -76632 -188837
18886 -188837 -94922 -119660 -112155 86791 36943 196096 -175279 -29600 19752 -192443 -72235
18874 -212362 63404 -34176 113591 -122228 101906 341286 3240 -47586 -48019 41687 5013
18862 7715 -46468 -43893 -256826 -216148 -21386 43327 -182607 -56337 -43420 325444 17681
18850 277500 -76105 -107530 -200984 48619 -193575 -108276 -45911 -9852 152819 -164606 88447
18838 -42596 64281 -191268 -277297 196119 -197128 -263009 266785 12904 -174608 23787 151295
18827A51295E1130a55147D2636N0309c2510l00646A05329k8650A6259K71960j20820
18816A67399a54655A06563P8322J59702E8150J93412a06298e928G4039J3857d16586
18804A35939a29195A82622b24007A6781c37761J65182B3966a5122j2291B93553
18793d79973F2293b90909B19100E6138g6728r298J3552p1237A36638d4892a3141
18781B9130J69208a13831a2603m02951E317R8593J60785F0910f9566E69785A19302
18769d6924G7939b03053E8487c33557h8728f774m739A43266E6306b15000J2232
18758b02768a06j74912d2488I1731c84120J53663d8448n090A34357n1118c4165
18746C2039e0871q6457m3938f2878l56848F3652a11525B72359C5508p715A3004
$$ plain form
18827 151295 51130 -155147 42636 92945 -32510 -333156 105329 76679 16259 288219 167399
18816 167399 -154655 106563 184885 344587 58150 251562 -106298 -5928 74039 87896 -416586
18804 135939 -129195 182622 -224007 16781 -337761 -172579 23966 -15122 -27413 293553
18793 -479973 62293 -290909 219100 56138 -76728 -86026 -72474 -143711 136638 -44892 -13141
18781 29130 198338 -113831 -12603 -415554 5317 103910 264695 60910 -69566 569785 119302
18769 -46924 77939 -203053 58487 -333557 -88728 -6774 -11513 143266 56306 -215000 -202768
18758 -202768 -106 -175018 -42488 91731 -384120 -230457 -48448 -53538 134357 83239 -34165
18746 32039 -50871 -137328 -181266 -62878 -419726 63652 -111525 272359 35508 27793 13004
18734b05987A1789a63590j30093a22594B6113N6795b16252g6902A29863A1788
18723c30403F4150Q8971B5112b01204M5857m0765B7211b23463K2612e3824o7430
18712a21254c8654I9103b7081n2564m3646B49268I9288a39366a4831I6294h944
18700b20456K9181i3948a7542m8998o5009f0080C3601j3905b36460f8722I9437
18688D0810a26214j35500B45539H1011a22943d3201G0588b1412H936P3216c52112
18676B41870d6569k34703R2266R0960j53658B07503a3571C1577a29684B8335d4466
18664b4299A9992J7093b53684d979j21601j62993j02317A4629K56025b24804K1221
18653b03583j66830h1947B01285A4772a66139A89571b29260E8651l47J66888f8915
$$ plain form
18734 -205987 11789 -163590 -293683 -122594 26113 82908 -216252 -76902 129863 11788
18723 -330403 64150 153121 25112 -201204 -155347 -196112 27211 -223463 -200851 -53824 -121254
18712 -121254 -38654 99103 -27081 -79645 -123291 249268 99288 -139366 -14831 96294 -8944
18700 -220456 -191275 -93948 -17542 -66540 -131549 -60080 33601 19696 -236460 -68722 99437
18688 40810 -126214 -261714 245539 81011 -122943 -43201 70588 -21412 8936 82152 -352112
18676 241870 -46569 -281272 -189006 -98046 -251704 207503 -13571 31577 -129684 28335 -44466
18664 -24299 19992 37085 -253684 -4979 -126580 -289573 -391890 14629 270654 -224804 -203583
18653 -203583 -370413 -81947 201285 14772 -166139 189571 -229260 58651 58304 225192 -68915
18641i5534q5265j50522a7746m6256r7056e2240L535c911A4773b5453A29825N1639
18629A81464h1191O427a5836l87377J66215A371a43486C216a28966a7856j23134
18618a40990C92945H0716j4395a83938P055j74219A16614h218I0133R3734a51960
18606c73158Q6202A40831R1892a28716A07081a87919H4186J4343e808k50917k9090
18595b85815A0800a16410N1545j52489G3078h8669j7107A75580a19094A82060
18584a03684K6982B81471r2237a76817A0926a02079G0830a98801k1984j3568j46915
18573c81268P5062I7321O4761a66117N6462B15582a07795d275j36689e7984A60
18561c08448D5359M7980A3432J86755M7694a43163B08380a22802c9829r3697g358
$$ plain form
18641 -95534 -180799 -331321 -17746 -64002 -161058 -52240 -48705 -3911 14773 -25453 129825 181464
18629 181464 -81191 -74764 -15836 -403213 -236998 1371 -143486 3216 -128966 -17856 -140990
18618 -140990 392945 80716 66321 -183938 -176883 -351102 116614 -8218 90133 183867 -151960
18606 -373158 -286956 140831 232723 -128716 107081 -187919 84186 98529 -5808 -256725 -285815
18595 -285815 10800 -116410 -64865 -217354 73078 -88669 -105776 175580 -119094 182060
18584 -103684 -76702 281471 189234 -176817 10926 -102079 70830 -198801 -220785 -234353 -381268
18573 -381268 -306206 97321 162082 -166117 -109655 215582 -107795 -4275 -140964 -57984 160
18561 -308448 45359 93339 13432 200187 247881 -143163 208380 -122802 -39829 -133526 -7358
18549d09002a6320m6065I099a60358j86644a40741C87399B4439b15711c879J385
18538b494j02334K6203l4714j26151D9828g2954A4386a68904k0712K730G8837
18526a12594J2417d5311j11499k28737C79122a1650m7974l23892F8657J36045
18516B04702a20457N1329j8069p8762j38198B6268G753K77889D0272G543h3529
18504a59786k96935g369B29432a20679H3103g8431H5630O8665C2875a19348o1284
18493a80632p1464e340m35342K05384k02933G2734K6507i5241p2236j54424D91521
18481c3802a1586J735E376c79842B82985a81255M2731c6181k48583J00163B3545
18469i9031o3251B03999A9504a56569A76705q2685J9407n0478c1242k13997L0492
$$ plain form
18549 -409002 -16320 -62385 9099 -160358 -347002 -140741 387399 24439 -215711 -3879 -2494
18538 -2494 -104828 -78625 -113339 -239490 49828 -72954 14386 -168904 -189616 -186886 78837
18526 -112594 -100177 -45311 -156810 -385547 379122 -11650 -59624 -383516 68657 204702
18516 204702 -120457 -69128 -87197 -165959 -304157 26268 7753 285642 40272 7543 -83529
18504 -159786 -456721 -7369 229432 -120679 83103 -78431 85630 154295 32875 -119348 -180632
18493 -180632 -252096 -5340 -440682 -235298 -438231 72734 99241 -95241 -167477 -321901 491521
18481 -33802 -11586 -9851 5376 -379842 282985 -181255 -138524 -36181 -284764 -184601 23545
18469 -99031 -162282 203999 19504 -156569 176705 94020 113427 62949 -31242 -245239 -214747
18458b14747i1491A62498j884J54826b93492c8427o7551A05280R3317q0946d52431
18446e5872j52870E08678b6955k43541c0705n415a1210j05646j36800Q2619k15971
18435c87008g6327A93726c8801j7088a0654F6125a03091M4668A36521e4435C43891
18423A23832I912O6457d9566C09080m9932f7049A40315d28261h6225j62186B75469
18411a48472B02179i6565B48008b6790l26788a63329A74037G723a41991a7793
18400h948F6015b78017d3963A592c487k7946G4047j752J38502K6293B9137c05399
18387A84167a33326k38969A9140L25272E0789c88143D7901j6037i5866n7061C4868
18375a61256E0835Q4174k3026a09628b7964A36749a02652K5928c7251h245A29950
$$ plain form
18458 -214747 -91491 162498 160614 315440 -293492 -38427 -105978 105280 198597 117651 -452431
18446 -55872 -208742 508678 -26955 -270496 -30705 -36120 -11210 -116856 -253656 -171037 -387008
18435 -387008 -76327 193726 -38801 -55889 -10654 66125 -103091 -58423 136521 -54435 343891
18423 123832 9912 76369 -49566 309080 259148 -67049 140315 -428261 -86225 -248411 275469
18411 -148472 202179 -96565 248008 -26790 -353578 -163329 174037 7723 -141991 -17793
18400 -8948 66015 -278017 -43963 1592 -3487 -31433 74047 72295 210797 237090 29137 -305399
18387 184167 -133326 -372295 19140 344412 50789 -388143 47901 31864 -95866 -152927 34868
18375 -161256 50835 135009 111983 -109628 -27964 136749 -102652 -76724 -37251 -8245 129950
18363B36741H8822d3339j61993f4992A79210e9193l13051h1886j02231A32337
18352G170J26693a11194I4152b99781K1933j65961E2939N7656b72500P6445I5461
18340b63147j17099J39486A56776p0019a44528M3678I2756c77234J31334m5057
18330b90957d3802A9609c42816h1373A74556P566b27616P2883l48171j028B71207
18318d2836a5593j00030j59823C10885I7716d4381F0747a04795j12359B64503
18307E322c43824J26577i1036j25901A95499R6434B7343d77036B78529a20888
18296g3433k1870B00030d07576K02410d8574A07832h1015G6069d35324b07871
18285g4658C1625d7462J909j61429A83862m0301c3246E76a10213d0712B20233
$$ plain form
18363 236741 88822 -43339 -205332 -64992 179210 -59193 -372244 -81886 -184117 132337
18352 7170 133863 -111194 94152 -299781 -277848 -443809 52939 110595 -272500 -196055 95461
18340 -263147 -380246 -240760 156776 86757 -144528 -100850 92756 -377234 -245900 -290957
18330 -290957 -43802 19609 -342816 -81373 174556 182122 -227616 -154733 -502904 -503932 271207
18318 -42836 -15593 -115623 -275446 310885 97716 -44381 60747 -104795 -217154 264503
18307 5322 -343824 -217247 -91036 -216937 195499 291933 27343 -477036 278529 -120888
18296 -73433 -95303 200030 -407576 -205166 -48574 107832 -81015 76069 -435324 -207871
18285 -74658 31625 -47462 -45553 -206982 183862 143561 -33246 576 -110213 -40712 220233
18273E3835A8167P9489K7111B1235K36539f9190K4674C4052j0855L22891j60492
18262A85596o0245a52193K1412C3296J22921c1767k5239J018j32483a8074A11553
18250I6230c03649C7834b67228B36028a20615d0202k39436D4345c16350a10830
18239A91254i2174C3505c434j23501k0087N1394C48754c10309B32401c77314a53373
18227a35065j95834a9635j10347A98204f3310A01550M6779i6514K2737A82419
18216d12005D76K92883a17122F3196f2268k14295A48910o7285e4885A04844J46002
18205B50846r9922h7315G1041c9499A96478b78260d5891O676J2819A10324J3589
18194A23913K16351h4089j13626j3295A02282f8518F5715A2408L6857a40810B17662
$$ plain form
18273 53835 18167 97656 124767 21235 257774 -69190 -44516 34052 23197 346088 185596
18262 185596 125351 -152193 -130781 33296 156217 -31767 -57006 -55988 -188471 -18074 111553
18250 96230 -303649 37834 -267228 236028 -120615 -40202 -279638 44345 -316350 -110830
18239 191254 -92174 33505 -3434 -126935 -147022 -95628 348754 -310309 232401 -377314 -153373
18227 -135065 -330899 -19635 -129982 198204 -63310 101550 148329 -96514 -73777 182419
18216 -412005 476 293359 -117122 63196 -62268 -276563 148910 81625 -54885 104844 250846
18205 250846 150924 -87315 71041 -39499 196478 -278260 -45891 -39215 -26396 110324 123913
18194 123913 340264 -84089 -197715 -211010 102282 -68518 65715 12408 49265 -140810 217662
18182b66414L2279Q521G4077J05171A084a48483b4153j23773L0277B62323d2097
18170E9078J8484P5135J90327d1185n0188f92A71166M5693A5867a85731k79429
18159d65160J10391d4911A2392J41482a46195k1565j3037B49882b23121Q2546
18149a40575I6685K29009C5213b75846C79558g5855j23850B7372J56713b34614
18138b57129g2821G1479K4056f3671k15181e9118F497P884d61139A69428g0121
18126c30404N7289J24727H4232A199N6346J76796a7084l6465B05423g022j99854
18115b06876f6177E3447b13862I36b41373K4062E4942i3456B2070L28804A3963
18103a90731j681J1517A24109a20631J7517a2666r8719B4349f6458k2510R03C23733
$$ plain form
18182 -266414 -234135 -225614 74077 179248 1084 -148483 -24153 -147926 -117649 262323 -42097
18170 59078 77562 152697 343024 -41185 -91373 -692 171166 216859 15867 -185731 -465160
18159 -465160 -354769 -44911 12392 153874 -146195 -167760 -180797 249882 -223121 -140575
18149 -140575 96685 325694 35213 -275846 379558 -75855 -199705 27372 184085 -234614
18138 -257129 -72821 71479 95535 -63671 -278852 -59118 6497 14381 -461139 169428 -70121
18126 -330404 -273115 -148388 84232 1199 57545 234341 -17084 -53549 205423 -7022 -206876
18115 -206876 -66177 53447 -213862 936 -241373 -217311 54942 -93456 22070 350874 13963
18103 -190731 -192412 -180895 124109 -120631 -103114 -12666 -111385 24349 -66458 -88968 -88065 323733
18090I1608P7322d6683B7164J88858E3641J61590e4067c307j22262B30946a21935
18078B3122c2273A93222a2154k98415A13285d209H0152a54367G0661h8938A94752
18066b7379H9045e5093J6040G8978a25405d8704I711J63355a96605O9677o5979
18055a92907e7305j06650A48599l383B2272c5170B2615b1407B32420n3174i7384
18043H3331J92495A23347b5708B7557f8671G0182q366b5925m13544a2446j53806
18032a66252I2509a69982C35974b0406k28614g9379L239b2655A40606d64432H6813
18020a39965I0133J27512H5382K79017a13481j69481c1464C09389d1064j50859
18010a91923M8130j2702G3511H805g6677j03191g1791I9041A2739K00262f0819
$$ plain form
18090 91608 168930 -46683 27164 216022 53641 215231 -54067 -3307 -125569 230946 -121935
18078 23122 -32273 193222 -12154 -310569 113285 -4209 80152 -154367 70661 -88938 194752
18066 -27379 89045 -55093 -39053 78978 -125405 -48704 9711 173066 -196605 -126928 -192907
18055 -192907 -57305 -163955 148599 145216 22272 -35170 22615 -21407 232420 179246 -97384
18043 83331 275826 123347 -25708 27557 -68671 70182 61816 -25925 -439469 -12446 -166252
18032 -166252 92509 -169982 335974 -20406 -249020 -79379 -76140 -22655 140606 -464432 86813
18020 -139965 90133 217645 85382 364399 -113481 -282962 -31464 309389 -41064 -191923
18010 -191923 -143793 -156495 73511 8805 -76677 -179868 -71791 99041 12739 213001 -60819
17998C26126g8343k16248c5373l22600a72495g5154E3341a6965o5574I8605k6089
17987G2516b49182A5023b49839m9463c5540G0047l1500J58035D4484N1488q982
17976H6990l1437c8847G159a39993q7606O695R0649N9872k4576j75681I7786L79555
17964D77341A78563d1290F2250N4890L1492a58242B72107G549J49941b61619A66770
17952e4041A9757K18273D0292e1264a1799l5727A01395g1453l0412H7516K77447
17941C64963b18972M0640m3253I9820M6452o9524h2896H36J40470h0311j6737
17930i7048C3771e014A12774a10161G0935B109L2549d9831b4200o6471F5942c26584
17917B18620B3748f9304k30353c4684j42427c9426D0815c24772H8865k937O997
$$ plain form
17998 326126 -78343 -294591 -35373 -357973 -172495 -75154 53341 -16965 -82539 98605 72516
17987 72516 -249182 15023 -249839 -299302 -35540 70047 38547 196582 44484 95972 86990
17976 86990 55553 -38847 7159 -139993 -227599 -220904 -130255 -70383 -94959 -270640 97786 477341
17964 477341 178563 -41290 62250 117140 148632 -158242 272107 7549 157490 -261619 166770
17952 -54041 19757 238030 40292 -51264 -11799 -47526 101395 -71453 -101865 87516 364963
17941 364963 -218972 -178332 -221585 99820 146272 76748 -82896 836 141306 -80311 -97048
17930 -97048 33771 -5014 112774 -110161 70935 2109 34658 -49831 -24200 -90671 65942 -326584
17917 218620 23748 -69304 -299657 -34684 -177111 -39426 40815 -324772 88865 85928 92925
17906I2925a47836O3602G3583C701J36177b12130A25437a3101I8660a226A1883
17894e88A01911a4908j07788b7111m5327A33609b84155A35707c5001A81842b47149
17882H7065j8705K34056b67245B29192a44362L8872I2728j5586J94419A33838
17871b83556A50270d5039o9754j23219J06300B02246e6634C07537c9116p0010
17861a09126q8401c288C21664I3673I469b10446j8718Q7473C7845K85806F9981
17849b17490K2162c4370C6670O9991Q6618H0310i3021M192A48172A4518K3526
17838C8044a9594B36350d9309n9376I0537i3916I6235J61068a23323E7884a7927
17826A15809A9870c71522A25837H138d6245A27852a58712k6558O5751o2387d3506
$$ plain form
17906 92925 -147836 -84234 73583 3701 139878 -212130 125437 -13101 98660 -1226 11883
17894 -588 101911 -14908 -122696 -27111 -72438 133609 -284155 135707 -35001 181842 -247149
17882 87065 68360 302416 -267245 229192 -144362 -105490 92728 77142 271561 133838
17871 -283556 150270 -45039 -114793 -238012 -131712 202246 -56634 307537 -39116 -109126
17861 -109126 -197527 -3288 321664 93673 9469 -210446 -229164 -141691 37845 323651 69981
17849 -217490 -195328 -34370 36670 106661 193279 80310 -93021 -88829 148172 14518 38044
17838 38044 -19594 236350 -49309 -108685 90537 -93916 96235 257303 -123323 57884 -17927
17826 115809 19870 -371522 125837 8138 -46245 127852 -158712 -185270 -119519 -181906 -43506
17814G4678L0262J48525b01452d8420p1911f286A29167d32F6147j8151F74L5221
17802C5895a27024e3214A23431a57010a3966j88721B2183i386p0366B0551b8600
17790C11281d0251B28329q0936c72624B96830A34451b7653a992r9261j33435A09102
17778f9426b4841E2798J21098J76883b52964A43832K20820a21699B68206b6665
17767B2394K17885c32616B76441j0509g6813A13142K39666j13356l785e8504k308
17756f0812j13644f1128J0770B91436A43019h3021A23039d8843k21576A39133
17745I113J73046c2323b791j45138C67067a657j77249A10155c0102j71056K4246
17734a76912B2434f2271A21459m3137J09457d88729A84102E0003K681B1260J08711
$$ plain form
17814 74678 104940 253465 -201452 -48420 -120331 -6286 129167 -432 66147 47996 674 35895
17802 35895 -127024 -53214 123431 -157010 -13966 -202687 22183 -9386 -79752 20551 -28600
17790 311281 -40251 228329 147393 -372624 296830 134451 -27653 -1992 -101253 -234688 109102
17778 -69426 -24841 52798 173896 350779 -252964 143832 364652 -121699 268206 -26665
17767 22394 240279 -332616 276441 265932 -76813 113142 352808 239452 235667 -58504 -60812
17756 -60812 -174456 -61128 -50358 291436 143019 -83021 123039 -48843 -270419 139133
17745 9113 182159 -32323 -2791 -147929 367067 -1657 -178906 110155 -30102 -201158 -176912
17734 -176912 22434 -62271 121459 78322 187779 -488729 184102 50003 52684 21260 129971
17723A29971b16813E88363B5074a89118A05430B8391K898a0621B69900j19525
17713A50375a75237g5908j03326A71497b2563A32517a10454c0065B93914g8113
17702h1483k21627i6334A8395b45814e5938b1391I9763e8676E4147d94634A01814
17690A05970h2416A17479a59294B99867a72780c4753c828A64307c5126B41547
17679h0856J6064k7023A9263c8644K701A23159M2804j9222p1930h4459A50228
17667A35539C4288R7356i2118k06547i232j05379A1888g4555A61999m1884c07938
17655b80517J05947A128Q7707R8415a96872b6734o9240D8172N3478M8023o0078
17644H9595K95703A40792a01295E9064d7556C5442b54669H2071J24679O7758A01995
$$ plain form
17723 129971 -216813 588363 25074 -189118 105430 28391 31289 -10621 269900 150375
17713 150375 -175237 -75908 -179234 171497 -22563 132517 -110454 -30065 293914 -78113
17702 -81483 -303110 -96334 18395 -245814 -55938 -21391 99763 -58676 54147 -494634 101814
17690 105970 -82416 117479 -159294 299867 -172780 -34753 -3828 164307 -35126 241547
17679 -80856 -64792 -91815 19263 -38644 -35943 123159 165963 146741 74811 -84459 150228
17667 135539 34288 131644 -92118 -298665 -9232 -114611 11888 -74555 161999 120115 -307938
17655 -280517 -174570 1128 88835 187250 -196872 -26734 -95974 48172 101650 149673 89595
17644 89595 385298 140792 -101295 59064 -47556 35442 -254669 82071 206750 274508 101995
17632h1221K7616A12600b93825A46769i0410C07198H7600a84554D74136c29799
17621f9707B02705n993b33746B2987J29091F6717d4127B0068J80824B0200a32967
17609C21139C2722i3496E4197Q1344J22096r2515a7007I1799J03777a79435f5381
17597e077E6457B2899b3523j1994A68288a53998L949D905N4874K14681A25892
17585a17615B73854e0372I0141k9452K19017A15520J689a69317C6035q666b02877
17573f5872F8133A7386a82809K833L0438i162n7091e62C24169j43824m7795n6028
17561G6522a719B88895C9224a56782A82437D0781J60584k3583c2947B07804E4715
17549G4038c42040b6174C8421J04962o3030N78D115a48273B77064j35253b35962
$$ plain form
17632 -81221 -53605 112600 -293825 146769 -90410 307198 87600 -184554 474136 -329799
17621 -69707 202705 196712 -233746 22987 152078 66717 -44127 20068 200892 20200 -132967
17609 321139 32722 -93496 54197 135541 257637 165122 -17007 91799 195576 -179435 -65381
17597 -5077 56457 22899 -23523 -35517 168288 -153998 -150049 4905 59779 274460 125892
17585 -117615 273854 -50372 90141 60689 279706 115520 117209 -169317 36035 27369 -202877
17573 -65872 68133 17386 -182809 -179976 -149538 -9162 -66253 -562 324169 180345 132550 76522
17561 76522 -1719 288895 39224 -156782 182437 40781 201365 177782 -32947 207804 54715
17549 74038 -342040 -26174 38421 143383 80353 80931 4115 -148273 277064 141811 -235962
17537E1544N213K5609g8738p8782e9220A97637Q3860A06280m0634h1371J0666
17526g0705A25208i3334j2841A4754Q233Q0676a73747B61187D950d8609B15653
17514b3415G0356b82080I9743b7521j47183b251q3403D74968A71985N82J41902
17503C14469a48797C89895g705D15808d4435a0358B63230k0044H9396j6859J07350
17492A79887E2369a07559D47411q5169a52383f2912n88A62002j6706B5468J97091
17481B22559d4468j9354B03392M7537F5801J18494O0328e2001A80521a15116B45119
17469B78512j6925p4326D0100K08605C2053J41683P1053a20570c1603D3241a40296
17457C12280c9015M517p6393D88018A01366M75439A04289J02459e1782C84018
$$ plain form
17537 51544 56757 82366 -78738 -157520 -59220 197637 281497 106280 65646 -81371 -70705
17526 -70705 125208 -93334 -106175 14754 22987 103663 -173747 261187 4950 -48609 215653
17514 -23415 70356 -282080 99743 -27521 -174704 -2251 -85654 474968 171985 172567 314469
17503 314469 -148797 389895 -7705 415808 -44435 -10358 263230 243186 89396 72537 179887
17492 179887 52369 -107559 447411 362242 -152383 -62912 -63500 162002 145296 25468 222559
17481 222559 -44468 -63822 203392 250929 65801 184295 244623 -52001 180521 -115116 245119
17469 278512 261587 187261 40100 248705 32053 173736 244789 -120570 -31603 43241 -140296
17457 312280 -39015 -34498 -110891 488018 101366 576805 104289 206748 -51782 384018
17446C32886L13234j53623B8126J9033J56294O6999C5446L43488j19363J65612
17436D25183j54727r7855i382B42978L2422j34301J53623A01815B1061M37290
17426D58351F2646K38497j11282J31710J01753j58437L1220n0973p9579L14263
17416D79818j71364A47455J15056J63772j89137L27813A66855m200G1303a29157
17405B20226m1430a7177B46115R0978J2976q4425A16905n1699J22929k5854A4140
17393D0364a31885A98054J0298p5886O7407b17647B66533l5185a57393B71748
17382D75315a7110A83152j3648k3212J80908d1552A29718a02172C25031A23274
17371c7981B23063a42471A3365M08022D6000a16032B75320P033b41264A90090
$$ plain form
17446 332886 646120 492497 28126 47159 203453 270452 35446 378934 259571 425183
17436 425183 270456 172601 -9382 242978 275400 141099 294722 101815 21061 458351
17426 458351 62646 301143 189861 321571 423324 264887 296107 245134 165555 479818
17416 479818 308454 147455 262511 426283 237146 564959 166855 162655 71303 -129157
17405 220226 178796 -17177 246115 337093 350069 265644 116905 65206 188135 162281 14140
17393 40364 -131885 198054 208352 132466 199873 -217647 266533 231348 -157393 271748
17382 475315 -17110 183152 169504 146292 327200 -41552 129718 -102172 325031 123274
17371 -37981 223063 -142471 13365 421387 46000 -116032 275320 282353 -241264 190090
17360C52168a7230D570O9273K89423j47136K83074d7871G8862L82585B03234A00855
17348F00f4215B69165m8041A07314K1151R1428a99165F7308i2282B87112P7968
17337C65080H9646K304B5417K05798b17761A27176B6523J73784I5646Q2704N1765
17326B30115a35798B10800J8222d713B18235J49422b2801l11390B30482J77137
17316D07619A84122J52851I4419K52473l588B6484a73486j20230A1658f3125g726
17304B31264j2885J60580A37509K37949n7179p5342K5646f0304H5914b10716a00805
17292B37222j08089J67533p1312J9046A04331k1121R2002B3426a42354d2886j67053
17281b09939B12929A05276L0215C3558L15582A0331L15903n2726a28353D51707
$$ plain form
17360 352168 -17230 4570 73843 363266 216130 499204 -47871 78862 461447 203234 100855
17348 600 -64215 269165 221124 107314 128465 219893 -199165 67308 -92282 287112 365080
17337 365080 89646 91950 25417 231215 -217761 127176 26523 200307 95646 178350 230115
17326 230115 -135798 210800 229022 -4713 218235 367657 -22801 -334191 230482 407619
17316 407619 184122 336973 94419 346892 343304 26484 -173486 -293716 11658 -63125 -7726
17304 231264 218379 378959 137509 375458 318279 242937 268583 -60304 85914 -210716 -100805
17292 237222 129133 296666 225354 244400 104331 83210 175212 23426 -142354 -42886 -209939
17281 -209939 212929 105276 135491 33558 349140 10331 326234 273508 -128353 451707
17270H6007J68672J94564j23157P8269J05156j69087G4064m392K10782J0344I8191
17258A00142J98662J67927e2483B82496B4981M09402A84451K94797k37682J17600
17248C59166n7884j11189a54938A92342p5729G320J71156J20612I5338L13384
17238D08722A51335J32601O6620B8448n373J33604J76734b6831C95423a66725
17227A13979M33974k73136L8858K85987j19381A47089n6629J86620n6842J32577
17217C52815j01017B6606P896J43984e8731B86156m5862K9284J99374F6794B3863
17205A63824D8268N73424H1814i7850C05401E7132K6873J20397K64277B23345
17194C51139j20022l0989P6847A22274e3356j79393B54242J28926A07746J19545
$$ plain form
17270 86007 254679 449243 326086 404355 509511 340424 74064 69672 280454 290798 98191
17258 100142 298804 466731 -52483 282496 24981 434383 184451 479248 241566 359166
17248 359166 301282 190093 -154938 192342 116613 7320 178476 299088 95338 408722
17238 408722 151335 283936 350556 28448 23075 156679 333413 -26831 395423 -166725
17227 113979 547953 274817 313675 599662 480281 147089 90460 277080 220238 352815
17217 352815 251798 26606 34502 178486 -58731 286156 240294 269578 468952 66794 23863
17205 163824 48268 621692 81814 -97850 305401 57132 84005 204402 468679 223345
17194 351139 231117 200128 276975 122274 -53356 -232749 254242 383168 107746 227291
17184B27291F4532K04625E8317Q6212K99188K24883A06640R0805B4711K65568
17174B90279Q7168K58069B92533J14637N7004D0350r194N04181A36519D7388K22302
17163B69690J48709p9794c8022B08898J11574A15339K61283l1792K06470A61448
17152B83033Q2370j58640q8515J61973K19091r3925m9708K5286J67327B07863
17141D70834A11475J15747J10971j02534K79737J08887B36499i275B07518B6831
17130D31493J06682q8182A64992L59067B30189Q8287R8497A02362K23476J58983
17120D84821i3292B79763K3887J94026j70471K93288j4492A01142J55748L09299
17110E66189A43846N57804k81403D8119L66560A79591P0350r0974M8248J01441
$$ plain form
17184 227291 64532 269157 58317 144529 443717 668600 106640 197445 24711 290279
17174 290279 377447 635516 292533 407170 464174 40350 31156 535337 136519 47388 269690
17163 269690 418399 338605 -38022 208898 320472 115339 376622 344830 551300 161448
17152 283033 365403 206763 118248 280221 499312 405387 355679 380965 548292 207863
17141 470834 111475 227222 338193 235659 515396 624283 236499 -9275 207518 26831
17130 431493 538175 449993 164992 524059 230189 318476 416973 102362 325838 484821
17120 484821 -93292 279763 303650 497676 327205 620493 606001 101142 256890 566189
17110 566189 143846 701650 420247 48119 414679 179591 249941 158967 207215 308656
17100C08656J02726j1345L570o9598j50294j9188N86810C55504d3030F41547j72628
17089D68919j40828L88507l20186J70139B42159K10002N2554p7318K92449B89363
17078D96211k29354K65161j22427j12414n375N769n7502L11456K41808k24967
17068E68366M434j10109K13310N5684C00311J64700j62489J65164L80164D11594
17057G28557j87788j94475J61876K41271B38454L41584r8494K14326j80169J53129
17047F68830Q6889m6283l40086M95751m07780j0241J21875R1487j26803P6209
17037F09848K8689k97952K83032J19939m270N0989L8669l49553O5935B08752M33470
17026F42222J4460R0600l4519k34645j80278J36723J95785r1661J65383B87842
$$ plain form
17100 308656 411382 400037 403607 334009 183715 164527 751337 355504 -43030 641547 468919
17089 468919 328091 716598 396412 566551 242159 452161 504715 427397 719846 289363
17078 496211 266857 532018 409591 297177 291802 297571 240069 551525 793333 568366
17068 568366 572800 462691 676001 731685 300311 465011 302522 467686 847850 411594
17057 728557 540769 346294 508170 749441 238454 580038 481544 695870 515701 668830
17047 668830 755719 709436 369350 865101 457321 447080 568955 660442 533639 609848
17037 609848 638537 340585 623617 743556 739286 790275 828944 479391 545326 208752 642222
17026 642222 656682 747282 712763 478118 297840 434563 630348 538687 704070 287842
17015C80373J16711M16179k61151r0883P1516n6425K40694j26999j1153L15575
17005I94437m45873J57804K9481K7732j00754R9003j281N1087j26228J75784m388
16994H56804L86648j37525m20612L85377E08414J38550q3208j07375M56499l53189
16984E59691K67454k17701J29941K23786k01644j041j08192k42550L86854P7065
16974H73663J29809j85646j55884J21037J58252J13056r5980j5791j15531O6078
16964H93063P1559p1203K15424n2380R4390n49685L89684k10428N20190l82292
16954I18322J41285j48230M17442m81777K06189K51275n30824N15837M9974k83694
16944A055799N6627l34653J97187J97850l5223N8577j94631K01302p4045L59760
$$ plain form
17015 380373 497084 913263 652112 561229 632745 576320 817014 690015 678862 994437
17005 994437 548564 706368 735849 763581 662827 761830 760549 811636 685408 861192 856804
16994 856804 1243452 1105927 685315 1070692 508414 646964 563756 456381 912880 559691
16984 559691 827145 609444 739385 963171 761527 760486 652294 409744 796598 873663
16974 873663 1003472 817826 661942 782979 941231 1054287 958307 942516 826985 893063
16964 893063 964622 893419 1108843 1056463 1150853 601168 990852 780424 1300614 918322
16954 918322 1059607 911377 1328819 847042 1053231 1304506 773682 1289519 1339493 1055799
16944 1055799 1112426 777773 974960 1172810 1137587 1196164 1001533 1202835 1128790 1488550
16934A488550l24471j62016L05719j60327j00838J8690j2508j2388P4718K92440
16924A407569r5679O3795J82938m02158L09954J10452k79682L80157J29248k73293
16914A533301j88595J1286P110L92731k59882P2175J25084O6771j49978K15970
16904A825973l2510k29079K41295k3237M00089m63807j68628K29566P6094l25419
16894A530337K46866L18506j43359J26527l28626K75084n28617O07530j30389
16885A973859J08219k41592K11863K30895q3592l20287M70029j68004J37270j79133
16875B139527J60861j63723K71524Q421j10475M50882n83574L38519K60307k33527
16865B538742K00010J32307J10775q0654M6287k79112K57145n1987J72794k19346
$$ plain form
16934 1488550 1164079 1002063 1307782 1147455 1046617 1065307 1052799 1040411 1115129 1407569
16924 1407569 1311890 1375685 1558623 1156465 1466419 1576871 1297189 1677346 1806594 1533301
16914 1533301 1344706 1355992 1363102 1755833 1495951 1568126 1693210 1759981 1610003 1825973
16904 1825973 1793463 1564384 1805679 1782442 2182531 1718724 1550096 1779662 1855756 1530337
16894 1530337 1777203 2095709 1952350 2078877 1750251 2025335 1496718 2104248 1973859
16885 1973859 2082078 1840486 2052349 2283244 2199652 1879365 2349394 2181390 2318660 2139527
16875 2139527 2300388 2136665 2408189 2416610 2306135 2757017 2173443 2511962 2772269 2538742
16865 2538742 2738752 2871059 2981834 2901180 2947467 2668355 2925500 2873513 3046307 2826961
16855B826961J51219J65963J09707J40731j85111j53541J41482N0199o7622M75228
16845C655216p7722j19854J06852K79553m78625L23583j26118O30798n9810l36303
16835C797570K12597J44343j60471j39283L14446J41929k48013M18177M9934P0388
16825D601617J46382J43095L15286q351N705M36598Q583k86392J9818N86074p2108
16814E896307q0959L81832k02519K88651K8676M69457j63954K97706L00964m7749
16804G168412J4826N8694L52334N6884K2999M35130R1936O96959J85743m69901
16794H614016P01375K30294J27146M26844J80752J61587o243P23247K59864K49386
16784A1668268K62385N29147K46200O99314J59288K34481L77051R72191J22500
$$ plain form
16855 2826961 2978180 3144143 3253850 3394581 3209470 3055929 3197411 3247610 3179988 3655216
16845 3655216 3577494 3457640 3564492 3844045 3365420 3689003 3562885 4193683 4133873 3797570
16835 3797570 4010167 4154510 3994039 3854756 4169202 4311131 4063118 4481295 4531229 4601617
16825 4601617 4747999 4891094 5206380 5198029 5203734 5640332 5648915 5362523 5382341 5968415 5896307
16814 5896307 5815348 6197180 5994661 6283312 6311988 6781445 6617491 6915197 7216161 7168412
16804 7168412 7183238 7241932 7594266 7651150 7674149 8109279 8201215 8898174 9083917 8614016
16794 8614016 9315391 9545685 9672831 10099675 10280427 10442014 10435771 11159018 11418882 11668268
16784 11668268 11930653 12459800 12706000 13405314 13564602 13799083 14176134 15148325 15270825
16775A5270825L35947R61932R1148P68625L92486Q33068P30000N91457O26678
16766B0602166Q95320O28330J051006P93727P94355J062060J018967J350170J002380
16757B9198481J183766J174981J692106J416527J455073J719936J897138J801289
16749D1539297K448163J811646K524647K187278K686177L268551K988696L109905
16741F2564360L441838L640326M687989L805626M493159N381104N181366N664694
16733I8860462N596605O595508O680684O840606P280682P397873P836713P492506
16725A54581639P301853P174904P165469O052675N507307M354152L268958K480763
16717A97887720Q28893m41525k151525k799196m166016n246649o099721p055085
$$ plain form
16775 15270825 15606772 16568704 16659852 17428477 17820963 18654031 19384031 19975488 20602166
16766 20602166 21497486 22125816 23176822 23970549 24764904 25826964 26845931 28196101 29198481
16757 29198481 30382247 31557228 33249334 34665861 36120934 37840870 39738008 41539297
16749 41539297 43987460 45799106 48323753 50511031 53197208 56465759 59454455 62564360
16741 62564360 66006198 69646524 74334513 78140139 82633298 88014402 93195768 98860462
16733 98860462 104457067 111052575 117733259 124573865 131854547 139252420 147089133 154581639
16725 154581639 161883492 169058396 176223865 182276540 187783847 192137999 195406957 197887720
16717 197887720 198716613 198275088 196123563 193324367 189158351 183911702 177811981 170756896
16709A70756896p282283p605858p958772p699663p653975q204777p201787o834475
16701A10315306o834549o423698n702441n479846n055847m682195m818013l845524
16693F7473193m062645l333881l748553k806437k820780k877331k321023k288776
16685D3213767k415286j722114j929747j674231j802634j803560j477617j012341
16677B9376237j296035j656899q52229j045862j020110j022893r58346o84621
16669B0839242q16559j017147k76204r52513m71300o87310m37116j073195J21868
16660A5229766o81816m08309m33908n57297m89344l49621o8523l92799n93647
16651A1254502l38943l32606m40000k04304k43516l31381p5874m82913J24830
$$ plain form
16709 170756896 163474613 155868755 147909983 140210320 132556345 124351568 117149781 110315306
16701 110315306 103480757 97057059 91354618 85874772 80818925 76136730 71318717 67473193
16693 67473193 63410548 60076667 56328114 53521677 50700897 47823566 45502543 43213767
16685 43213767 40798481 39076367 37146620 35472389 33669755 31866195 30388578 29376237
16677 29376237 28080202 26423303 25571074 24525212 23505102 22482209 21523863 20839242
16669 20839242 20022683 19005536 18729332 17776819 17305519 16618209 16181093 15107898 15229766
16660 15229766 14547950 14139641 13705733 13148436 12659092 12309471 12240948 11848149 11254502
16651 11254502 10915559 10582953 10142953 9938649 9695133 9363752 9287878 8804965 8929795
16642H929795o11515q9292l66777P2075j70015k24761n08788j79968j00188j98117
16632F552449J4446j94434j68710L6187j9570l52707M6105o37781N47721l68326
16622E455380q334k76272l07813j5755l03704m4815k4801K73257k61522j00579
16612D385042l23026m0376L1784p941J1859l60458J17788l77035N42165o17250
16602C362552J3674K49342k22022l17433j8152Q2691j0614Q4767j53821k64779
16592B806205j29903m4955L27919j33568J36864l54550j58828J50704L05871m87904
16582B417855l2621J7929L24908l93856p9739K59356k44625P8324k89644Q0431
16572B138318j70578l5077R7460J54938l10404K03378l24277L55389l81523J28336
$$ plain form
16642 8929795 8318280 8228988 7862211 7934286 7764271 7539510 7030722 6850754 6750566 6552449
16632 6552449 6566895 6372461 6203751 6239938 6220368 5867661 5913766 5275985 5823706 5455380
16622 5455380 5447046 5170774 4862961 4847206 4543502 4498687 4473886 4747143 4485621 4385042
16612 4385042 4062016 4021640 4053424 4045483 4057342 3696884 3814672 3437637 3979802 3362552
16602 3362552 3376226 3625568 3403546 3086113 3067961 3150652 3140038 3224805 3070984 2806205
16592 2806205 2676302 2631347 2959266 2825698 2962562 2608012 2449184 2599888 2905759 2417855
16582 2417855 2385234 2403163 2728071 2334215 2254476 2513832 2269207 2347531 2057887 2138318
16572 2138318 1967740 1932663 2030123 2185061 1874657 2078035 1753758 2109147 1727624 1855960
16562A855960M2302l49955J35663j39806O12194m02738j29325Q4119J60831l83972
16552A485273O242K19897o40346L29500K12711L9023k37129k8208K27108l99501
16542A214570Q4976J90762n92162M59517K42591m85254k5919J2040o487j16450
16532I78184M33305k49772L10689k19137R6919j58608Q2513r5831k06327k340
16522I69595K16875l09329N7594M14148k24387j71311j38437J13382Q0466J71308
16512A179904n4929l02707K39271J15209m68340M25264l90857O323L60734O760
16502A116632J445Q4153m79772J86768l37382J91851J34622k84139o1934P09693
16492A261937k75430m3474j21280J72674k52074L42171j37787j41869j87832L9393
$$ plain form
16562 1855960 1898262 1548307 1683970 1544164 2156358 1753620 1624295 1708414 1869245 1485273
16552 1485273 1491515 1711412 1071066 1400566 1613277 1652300 1415171 1386963 1614071 1214570
16542 1214570 1299546 1490308 898146 1357663 1600254 1115000 1089081 1101121 1094634 978184
16532 978184 1411489 1161717 1472406 1253269 1350188 1191580 1274093 1178262 971935 969595
16522 969595 1186470 877141 934735 1348883 1124496 953185 814748 928130 1008596 1179904
16512 1179904 1124975 822268 1061539 1176748 708408 1133672 742815 749138 1109872 1116632
16502 1116632 1118077 1202230 722458 909226 571844 763695 898317 614178 552244 1261937
16492 1261937 986507 943033 821753 994427 742353 1084524 946737 804868 617036 656429
16482F56429K36055k03434L46087E16306R6669K17756j76073B36577M55740j59168
16472E33149O6691j58673J4148L09859l37520K19666l1001k62474J70720n6603
16462D67962M11607K2033k78843k08167N5311J42416k15555o2795K52336J09703
16452F96008k64236K42767Q4339j63273J56073j67747j17493O9355j15329J2291
16442D32755n4655O3666P0772A7593Q93051B86411K47696J94254B10509P25574
16432I36083l86066k54421J09438j23592J84768J0744J26376l5318j98233J90891
16422E60670j45416j19116A43019K73923J51940j08768j18677K63729A09381L02383
16412D11764j59353L979o3734n4516N0824J10643J06274A24112K62986O3576j77784
$$ plain form
16482 656429 892484 689050 1035137 516306 612975 830731 654658 236577 692317 533149
16472 533149 599840 441167 455315 765174 427654 647320 616319 353845 524565 467962
16462 467962 879569 901602 622759 414592 469903 612319 396764 333969 586305 696008
16452 696008 431772 674539 758878 595605 751678 583931 466438 535793 420464 432755
16442 432755 378100 441766 512538 17593 910644 286411 534107 728361 210509 936083
16432 936083 550017 295596 405034 281442 466210 476954 603330 568012 369779 560670
16422 560670 415254 296138 143019 416942 568882 460114 341437 605166 109381 411764
16412 411764 252411 256390 192656 138140 188964 299607 405881 124112 387098 450674 272890
16401B72890J10671p1387O7691n7860N0034J26227p897j27733J93535j50002M1259
16390D47428a36708B13900O1439K36653O7410D7839J48657J2800G4619J95562
16380B70181N6959L557j36590M8942p6726L70658J17533k86025G6365C4967L80398
16369D15365A26991K14821J08843j40224k659j36445K97463P5857E378M32037
16359D37415A17066K72403N830A61373M32817a34670I100K34492l5822H2510a34196
16347B76045M8260r2184r6183J80637q9943a05754B01021q1767Q3341J34975A02769
16335E75809j95753j78725b77549C52114k2376K2352b328I7673J28142a09321
16324E33711B28037C0598L34363j2337j71464O3025P9134j37198a04867A90512
$$ plain form
16401 272890 383561 312174 379865 322005 372039 498266 490369 362636 556171 406169 447428
16390 447428 -136708 213900 275339 511992 579402 47839 196496 209296 74619 270181
16380 270181 327140 330697 194107 243049 166323 536981 654514 368489 76365 34967 415365
16369 415365 126991 341812 450655 310431 307772 171327 468790 544647 5378 437415
16359 437415 117066 389469 395299 161373 594190 -134670 9100 243592 207770 82510 -134196
16347 276045 324305 232121 135938 316575 226632 -105754 201021 119254 202595 337570 102769
16335 575809 380056 201331 -277549 352114 329738 352090 -2328 97673 225815 -109321
16324 533711 228037 30598 364961 352624 181160 244185 323319 186121 -104867 190512
16313C1473K49807j21098K31482J1586i8832m3194e0856m9509j66961G1416L53556
16302D24972A18072B2314K40359A12099D178a20327B58281a52505d2563G3457
16291A28453M1501N3631p9919O944d8467l1130B9796K48263J08428F6801J35443
16280B02244m3991A827M91308j24805C7506J46857q0444F915b6559B79023n652
16269B73371b99219A63347l95L524n321o1366N5796K1679o6800a0649o0091I7821
16256A32200J32244c6506G0207K87014d8997A06710A2365c62449A38959c6960
16245F3730N1065a87889c7453C54269q9494h6826B40852A19307c49104A65608
16234A8843J60987E8897N4354K66926p7400F8485J24591A3111J10649J12724b3924
$$ plain form
16313 31473 281280 160182 391664 403250 -98832 -142026 -50856 -100365 -267326 71416 424972
16302 424972 118072 22314 262673 112099 4178 -120327 258281 -152505 -42563 73457
16291 128453 169954 223585 143666 150610 -48467 -79597 29796 278059 386487 66801 202244
16280 202244 158253 1827 493135 368330 37506 184363 103919 6915 -26559 279023 273371
16269 273371 -299219 163347 162952 166476 161155 99789 155585 177264 110464 -10649 -70740 97821
16256 132200 264444 -36506 70207 357221 -48997 106710 12365 -362449 138959 -36960
16245 63730 114795 -187889 -37453 354269 264775 -86826 240852 119307 -349104 165608
16234 18843 179830 58897 113251 380177 302777 68485 193076 13111 123760 236484 -23924
16222C37703j26841i1987H7768a12737G7022a22750B58386a22537A40113n9081
16212H1032e564B92881J79774A65741k0925a31793C2291L45420I004a16361C69919
16200c48691H5337a54720A71009N4505r4165l0839M0853C2075K0929J13231J3598
16189A79833J7783m3100a654m6893j49460C28578a3411O279E907a79107A66183
16177i8590C8686a51234K0417B00251d56536K06779A41616A2107b6648A70984
16166A74495a7364A41753f4500o9588B53825i760l60100c778B21033b09195M7889
16155a61306M8742B39552f9672J2891C43716f4545B45123o9276a74618A5587J8786
16144C4373K3848A1270L30121c6797l97016C40280j01910C8439J11866c48202
$$ plain form
16222 337703 210862 -91987 87768 -112737 77022 -122750 258386 -122537 140113 81032
16212 81032 -5564 292881 472655 165741 144816 -131793 32291 377711 9004 -116361 369919
16200 -348691 85337 -154720 171009 225514 131349 100510 141363 32075 53004 166235 179833
16189 179833 197616 154516 -1654 -48547 -198007 328578 -13411 -7132 5907 -179107 166183
16177 -98590 38686 -151234 -130817 200251 -456536 -249757 141616 12107 -26648 170984
16166 174495 -17364 141753 -64500 -134088 253825 -9760 -369860 -3778 221033 -209195 -161306
16155 -161306 -112564 239552 -69672 -56781 343716 -64545 245123 175847 -174618 15587 34373
16144 34373 58221 11270 341391 -36797 -433813 340280 238370 38439 150305 -348202
16133h2999E0002G657f9777A16622c9686A85923n5499K82987H8579C4048M0934
16122G4982a07936c5580j22231E3079K60150B5063d8293n6352B9056M7556d28874
16110b5022B2169L6071b23415a07812B19786r0950b9878o3848H0469i8019E34193
16098C56693H5086O6238k9732O4246c92574c1021k66995g4147j22472J9418A91630
16086a78768F1971K0519e0602Q172G380J2749a49513A41383m5757h3148j2035
16075i5183A75087c30737i0190j97492a5389j0140A82707p4861a48905K2710D8704
16063h5909H4896c22384e1798B68863F545R0075a15457M1779k3430q9322j39944
16052c26374R5404N6849B37851g535j4989C0548a10559B25490L7694a35251M3767
$$ plain form
16133 -82999 50002 7657 -69777 116622 -39686 185923 130424 413411 88579 34048 74982
16122 74982 -107936 -35580 -157811 53079 313229 25063 -48293 -104645 29056 76612 -428874
16110 -25022 22169 58240 -223415 -107812 219786 128836 -29878 -93726 80469 -98019 534193
16098 356693 85086 151324 121592 185838 -392574 -31021 -298016 -74147 -196619 -177201 191630
16086 -178768 61971 82490 -50602 -42430 7380 20129 -149513 141383 95626 -83148 -95183
16075 -95183 175087 -330737 -90190 -287682 -15389 -25529 182707 107846 -148905 -126195 48704
16063 -85909 84896 -322384 -51798 268863 6545 96620 -115457 -73678 -97108 -186430 -326374
16052 -326374 -230970 -174121 237851 -7535 -22524 30548 -110559 225490 263184 -135251 -91484
16041i1484l28574E9337k1804E830a93978H672R182N8117i9803A4879d3077B55679
16028a00490B19403a32m92671B83776q9232l9014d1712a6239o7953A71143k8608
16017A42535e8528E0421J7440a26930q5879k6436g8848a2439j48461D20620c59263
16005b15055H4158e1134r5404a9615E3056e7033k9774A7446h8567A79047a02578
15993a50551q2462c0121j82052i2057A18618B6438b4677F736K96689j47109N5490
15982B11806J26203F9557r594j9525P0408b03402e1660K3556A22525l3590c1279
15970D1080e0677R655C22769a74279B04845j2288f5678A09689b64967R7162P3740
15959i4065A39811Q9934j786k4453m6244B4581a2125j748j14100k7720H694a24274
$$ plain form
16041 -91484 -420058 59337 37533 5830 -193978 8672 17854 75971 -99803 14879 -43077 255679
16028 -100490 219403 -132 -492803 283776 194544 155530 -41712 -16239 -84192 171143 142535
16017 142535 -58528 50421 67861 -126930 -212809 -239245 -78848 -12439 -160900 420620 -359263
16005 -215055 84158 -51134 -146538 -19615 53056 -57033 -86807 17446 -88567 179047 -102578
15993 -150551 -233013 -30121 -212173 -92057 118618 26438 -24677 6736 303425 156316 211806
15982 211806 338009 69557 59963 40438 110846 -203402 -51660 -28104 122525 88935 -31279
15970 41080 -50677 -41022 322769 -174279 204845 192557 -65678 109689 -264967 -167805 -94065
15959 -94065 139811 229745 227959 203506 157262 24581 -12125 -13873 -127973 -155693 8694 -124274
15946B95686b47848A93922G9376a37634r9381I6746h8831A83163A6336f17396
15935F6330P3282c26070q5145a7369k17182B04274G7435c4152r7818A44192a21726
15923g8736G6718a95938O4560j9254M9165A28255d6025A5774d719A1515b07194
15911d9060E9371d41929E079J93038R0540B4251K639J27651a03398B74172c67367
15899F1722f1978A86957F0599a52554C2259i8306A17884b63355G3614a82743k6075
15888b08818A70485b89187C62376h8104l56830A61540B2718O3272b62807C28466
15877b9020A77985c8714j27090d1668k639B07755p8961a18167D6765a60676I9752
15865g5849E0208c9144A11546f9812k31934B87640c05163d9410I6440J58341b34243
$$ plain form
15946 295686 -247848 193922 79376 -137634 -237015 96746 -88831 183163 16336 -617396
15935 66330 139612 -326070 -411215 -17369 -234551 204274 77435 -34152 -131970 144192 -121726
15923 -78736 76718 -195938 -131378 -150632 -101467 128255 -46025 15774 -4719 11515 -207194
15911 -49060 59371 -441929 5079 198117 288657 24251 26890 154541 -103398 274172 -367367
15899 61722 -61978 186957 60599 -152554 32259 -98306 117884 -263355 73614 -182743 -208818
15888 -208818 170485 -289187 362376 -88104 -444934 161540 22718 85990 -262807 328466
15877 -29020 177985 -38714 -165804 -41668 -44307 207755 128794 -118167 46765 -160676 99752
15865 -75849 50208 -39144 111546 -69812 -301746 287640 -305163 -49410 96440 254781 -234243
15853a1302o002j81161M250A87483R8299A28029l7659b0133q7869k530N3200J0968
15841d6364k04057J18082A19130a95492g9385E5001e3775o6870B34710a04465
15830F2486J57337b35589A02105g4945B9620b9604A25966c58963A77948a85659
15819B23581o0981C6071K109b3356j34567F6909i8429d2148j38465c0534A12897
15807B77579a40633O1984I4544g7252E4623O7857K12815I8824H335a41356m6806
15796a88162a7740p7465A3889b97662a26360B8308c44221a66537B07354a51409
15785a40075k804k13627N8004J41722I1351c20422A05576a21981J5010H273a34001
15773B2387j246c7886R065l7134n4452m41126A40111d29900A14273a01613c3355
$$ plain form
15853 -11302 -17304 -198465 -194215 187483 285782 128029 90370 -20133 -108002 -110532 -57332 -46364
15841 -46364 -250421 -132339 119130 -195492 -79385 55001 -53775 -120645 234710 -104465
15830 62486 219823 -235589 102105 -74945 29620 -29604 125966 -358963 177948 -185659
15819 223581 162600 36071 38180 -23356 -157923 66909 -98429 -42148 -180613 -30534 112897
15807 277579 -140633 -78649 94544 -77252 54623 122480 335295 98824 8335 -141356 -188162
15796 -188162 -17740 -95205 13889 -297662 -126360 28308 -344221 -166537 207354 -151409
15785 -140075 -142879 -356506 -298502 -156780 91351 -320422 105576 -121981 -106971 8273 -134001
15773 22387 21141 -37886 -28821 -65955 -120407 -561533 140111 -429900 114273 -101613 -33355
15761h9404B6340a84294a0601j10069D7112m582j0714J01625c50550C75852h0631
15749A73991A0581a66953C8689e2726A46029o163A7063K3282b67942A99176L948
15738B03124K66762a69917A45369C1946a47054M3027K1848K3235C09705r0177
15728B19528a12326k34119B01850G3174d0799q9679O416N6602l03316A70269a32304
15716A27502l2606C3831Q9053R823j5874d8464j70156m0363B4542a84418f811
15704g0014m086j11573M3478A14391a93242B15835g2152r1013j4387j1801H7929
15692E9486L90738H4387C1742J47008a11205C49768j25810c867F6843a19176G1854
15680b50593J15539m1628f9701L1303n9530B58554F4738J61172D615b05933A36130
$$ plain form
15761 -89404 26340 -184294 -10601 -120670 47112 42530 31816 133441 -350550 375852 -80631
15749 173991 10581 -166953 38689 -52726 146029 139866 17063 40345 -267942 199176 203124
15738 203124 469886 -169917 145369 31946 -147054 -104027 -82179 -58944 309705 219528
15728 219528 -112326 -346445 201850 73174 -40799 -130478 -124062 -67460 -370776 170269 -132304
15716 127502 94896 33831 122884 132707 116833 -48464 -218620 -258983 24542 -184418 -6811
15704 -70014 -74100 -185673 -142195 114391 -193242 215835 -72152 -163165 -177552 -189353 87929
15692 59486 450224 84387 31742 178750 -111205 349768 223958 -3867 66843 -119176 71854
15680 -250593 -135054 -176682 -69701 -38398 -97928 258554 64738 225910 4615 -205933 136130
15668a21101C29644B7576b06310A55612B1425M9705c22182A55192o8594l0784
15658E5814K57269H4454b35119c6812a1456k13517A81251o5470K61116A24585
15647B33783a71376D11322a55629M5301B9449a35820B39253a03608B23433g5421
15636H6329N4975a98019h6101n0761r4190R3240b0265o873A09032c50538A13346
15624B37727a62239G6819c5270k53260B45450l5715i1568A03814h3784A57086
15613B51143F6327b03475j12358E6959b05295g9672q7755j17283C3108J59686
15603A92794J23563f61283G52L64795a729k55228I0763L75476c26127B19525F3581
15591g4926n9274B91849A43902E8886b3768B58551A23363Q6572j5436d0126o2550
$$ plain form
15668 -121101 329644 27576 -206310 155612 21425 71130 -322182 155192 86598 55814
15658 55814 313083 84454 -235119 -36812 -11456 -224973 181251 115781 376897 124585
15647 233783 -171376 411322 -155629 -110328 29449 -135820 239253 -103608 223433 -75421
15636 86329 141304 -198019 -86101 -136862 -231052 -137812 -20265 -27138 109032 -350538 113346
15624 237727 -162239 76819 -35270 -288530 245450 209735 -91568 103814 -83784 157086
15613 251143 66327 -203475 -315833 56959 -205295 -79672 -167427 -284710 33108 192794
15603 192794 316357 -661283 752 365547 -1729 -256957 90763 466239 -326127 219525 63581
15591 -74926 -134200 291849 143902 58886 -23768 258551 123363 209935 194499 -40126 -102676
15580a02676A86045f9998A3023b63598J29128M4350q3162L9170k40657J37899
15570b36870E8016b23429h8441o6936L7639k30488J51707H1467B6777a11383D6305
15558A09777g5388L6113k13189A00380J41137j15249b34491A70417J27139E767
15547C8158O1234J97206d161B3680e211A35819h5793m6960A31361j7476D3296
15535B35657F516L71087a04220k50093A32859K35727r9466R0231j15448A5993
15524E0174a06352C5315a49279A72939a61949N1543m7571A04415R8543E8516H132
15512b41626A29257a34930J6908l26480a7493r9415B020L4164a94080A59124K13802
15501C72926n8243j32519a05332E0827J09907C8921a13845B0142M8116g5248E7226
$$ plain form
15580 -102676 186045 -69998 13023 -263598 -134470 -90120 -173282 -134112 -374769 -236870
15570 -236870 58016 -223429 -88441 -155377 -117738 -348226 -196519 81467 26777 -111383 46305
15558 109777 -75388 -39275 -252464 100380 241517 126268 -234491 170417 297556 5767
15547 38158 99392 296598 -4161 23680 -5211 135819 -85793 -132753 131361 113885 43296
15535 235657 6516 377603 -104220 -354313 132859 368586 269120 359351 243903 15993
15524 50174 -106352 35315 -149279 172939 -161949 -110406 -157977 104415 202958 58516 8132
15512 -241626 129257 -134930 -118022 -444502 -17493 -116908 2020 36184 -194080 159124 372926
15501 372926 314683 182164 -105332 50827 160734 38921 -113845 20142 68258 -75248 57226
15489a92111A61122a95039c0551j29420P9000A25152a29506b560F2562P4471D5298
15477a55465f6469E8995c12711a30067G9929K64882a02714a6652B9273c21344
15466a18089M2535B01565K4412b26612i4644j49862A09278J3730a26678b7909
15455a55341a5605C56270c9414j21235m0250G2642N9484a47080G5244H600J4295
15444B2895d9098A5194o498e363B03620E911h3091C54545D5600B1254J54800K31810
15432D07864a93115c9121k44277C90a1772o3775j25167K4513r1735m5828e1807
15420A58351f7441C30194a73100j47311A44966K53645j25546f8535C06251b9214
15409A67184b61138a13586B91772g1890A06175J94450a07183D8301J36521G2679
$$ plain form
15489 -192111 161122 -195039 -30551 -159971 -80971 125152 -129506 -2560 62562 137033 45298
15477 -155465 -66469 58995 -312711 -130067 79929 344811 -102714 -16652 29273 -321344
15466 -118089 -75554 201565 225977 -226612 -94644 -244506 109278 123008 -126678 -27909
15455 -155341 -15605 356270 -39414 -160649 -200899 72642 132126 -147080 75244 8600 22895
15444 22895 -49098 15194 8696 -5363 203620 5911 -83091 354545 45600 21254 176054 407864
15432 407864 -193115 -39121 -283398 390 -11772 -75547 -200714 -176201 -267936 -313764 -51807
15420 158351 -67441 330194 -173100 -320411 144966 398611 273065 -68535 306251 -29214
15409 167184 -261138 -113586 291772 -71890 106175 300625 -107183 48301 184822 72679
15398B05421n2803a68930K8798J5699B03870f7642j75164H3842k6986J21948l1908
15387A46896E5469i6298B74828F0782L9043c7308l2185m8810A3560b2204C8937
15375c60187D0244J4296c5036k06967A59253J67352d8611j94386A63525a42491
15364b0191B63346J65596a49681A91721H3318B9143A0651d6974B81141f3588n8244
15353a21832A54879a35874E2374J89549r5350K8023h3823b4346A2853J26254K41768
15342C80875H0202K1705B0457L4462c67948B3265f7066B06696g1673B75666H3767
15330A98459J54707D1206h8673H2689j2087d1616A84369h8419r1329C9548J62203
15319B01751h7621A63266o5597d1076B11894h100o7789a8045A59006C8396e69814
$$ plain form
15398 205421 152618 -168930 -140132 -124433 203870 -67642 -242806 83842 56856 178804 146896
15387 146896 55469 -96298 274828 60782 99825 -37308 -69493 -118303 13560 -22204 38937
15375 -360187 40244 54540 -35036 -242003 159253 326605 -48611 -242997 163525 -142491
15364 -20191 263346 428942 -149681 191721 83318 29143 10651 -46974 281141 -63588 -121832
15353 -121832 154879 -135874 52374 241923 146573 174596 -83823 -24346 12853 139107 380875
15342 380875 80202 101907 20457 54919 -367948 23265 -67066 206696 -71673 275666 83767
15330 198459 353166 41206 -88673 82689 70602 -41616 184369 -88419 -179748 39548 201751
15319 201751 -87621 163266 97669 -41076 211894 -8100 -75889 -18045 159006 38396 -569814
15307b676j296D0057a7863E9572a30122A21575J09625C3035K45889h7370o4867
15296a52237e0279A62702K3048M3881a5456A022a10874B87177A35625k1613R5764
15285B09776a93450A62932K35066F9725e4430A58276c33467A53955R1748n9934
15275A85769k1112K0707K3943F9537a25835N5170B76379F6522J5608l74a04588
15263B82156r6142a2254D6179j2601l040J71095p9733a3678B47836j03361l5496
15252A08979K61971M3191j84392L87304K93941O40573j97451P7145n19163l79236
15242E32862n5960A6085N6868J23775E732L1615c7082A47228a08669B38383J50624
15231C89007b38141A14784m9311b395F4029a28269A23195M6788a64483J6495o3593
$$ plain form
15307 -2676 -3972 40057 -17863 59572 -130122 121575 231200 33035 278924 -87370 -152237
15296 -152237 -50279 162702 185750 229631 -15456 1022 -110874 287177 135625 114012 209776
15285 209776 -193450 162932 397998 69725 -54430 158276 -333467 153955 245703 185769
15275 185769 164657 185364 209307 69537 -125835 -70665 276379 66522 82130 81756 -104588
15263 282156 186014 -12254 46179 33578 30538 201633 121900 -13678 247836 144475 108979
15252 108979 370950 414141 229749 617053 910994 1551567 1354116 1431261 912098 532862
15242 532862 476902 16085 72953 196728 5732 37347 -37082 147228 -108669 238383 389007
15231 389007 -238141 114784 65473 -2395 64029 -128269 123195 169983 -164483 -147988 -211581
15220b11581A39566b11714e7375m3432I4632m5503J21966G31K62036f3247C09995
15208A0636Q8590b00040B43570r5326G3526J55680O2838J09294N5645B07822p084
15197B00738o1870g7896M456m7473C46893Q7987k14203g3047B63107n6217b6130
15185A10536l701b01241A42660d918o3602q7967C1897K75237b65535M9854h0591
15173E31893D531b36935N128A44754L07267j75883i0978C57785A71826N0476b20521
15161A89429D947b8844d458A68225J73788j62637a2281j56692B20285A00524b66893
15149A51047C4187a28049A86667K52881a94561G264d5151B09313A7532L7647K36829
15138B92008c7114A87043L7403K68367d709B37053M3038g4938q5717I3661k5924
$$ plain form
15220 -211581 139566 -211714 -57375 -100807 94632 49129 171095 731 262767 -63247 309995
15208 10636 99226 -200040 243570 148244 73526 229206 292044 401338 456983 207822 200738
15197 200738 138868 -77896 -73440 -120913 346893 434880 220677 -73047 263107 206890 -26130
15185 110536 106835 -201241 142660 -4918 -68520 -156487 31897 307134 -265535 -215681 -80591
15173 531893 4531 -236935 -231807 144754 452021 276138 -90978 357785 171826 222302 -220521
15161 189429 4947 -28844 -4458 168225 342013 179376 -12281 -168973 220285 100524 -266893
15149 151047 34187 -128049 186667 439548 -194561 7264 -45151 209313 17532 55179 292008
15138 292008 -37114 187043 224446 492813 -4709 237053 280091 -74938 -160655 93661 67737
15127F7737K26821I8746J04243n973h7452l6235B30336j07282J09963J38085J65770
15116E36872A32287L43769i7723B5457J82813q1574b4878A94759J27543r5854
15106B26448i1888K9249B45796E0410a49342H6833O1560M7560a49991A84817h2061
15094A35808F2967K22330K7718A33940E0699a15945B456J6798L4907R0851K0948
15083A65960o509K54475k04140K77J81805A36589J08893m0409D9170i0542C47513
15071E8472K88955a50274B41565j17759K53458G0561N2247L3652i7367C14446
15060C992L63980a29248D09910L1909j13089G7804O7622J87181A59433J87742
15050C47175j48446q3691K4443R9569I802M43935F3897a05799d5712c761B36710
$$ plain form
15127 67737 294558 98746 202989 197016 -87452 -123687 230336 123054 233017 371102 536872
15116 536872 132287 476056 -97723 25457 208270 126696 -24878 194759 322302 226448
15106 226448 -91888 -62639 245796 50410 -149342 86833 148393 195953 -149991 184817 -82061
15094 135808 62967 285297 313015 133940 50699 -115945 2456 19254 54161 145012 165960
15083 165960 159451 413926 209786 210063 391868 136589 245482 205073 49170 -90542 347513
15071 58472 347427 -150274 241565 123806 377264 70561 122808 156460 -97367 314446
15060 3992 367972 -129248 409910 441819 328730 77804 145426 332607 159433 347175
15050 347175 198729 115038 139481 239050 9802 453737 63897 -105799 -45712 -3761 236710
15038A31418m2314Q6268J21437l2328o4002c3230D13675A11471E5647O8123l2139
15027I1631M48957c04345A46051L39476a56904A0L32492N3192J70011k73222D746
15015A21109K88550a49678A68986b25933a4980C28619J8176K50155k14004h1560
15004e0513D00122E535J33313L3162P6912a51011j68490D08382N7371j45847K34380
14993E54286B42286l9744J43907q4138f7748B49065m2375j7729J68246A17389
14982F7519e8128E51060A38704K12269B7026L64150p2930m6304N51123B42573
14971b6070A72407M285L89172j31329q3504j02554J24115A50863L52288k21360
14961B81791K72401k35069j47323K17035A55445L03825k07236L05017j30218m3067
$$ plain form
15038 131418 89104 175372 296809 264481 200479 -33230 413675 111471 55647 123770 91631
15027 91631 540588 -304345 146051 485527 -156904 10 332502 385694 555705 282483 4746
15015 121109 409659 -149678 168986 -225933 -14980 328619 346795 596950 382946 -81560
15004 -50513 400122 5535 138848 172010 248922 -151011 -319501 408382 465753 319906 554286
14993 554286 242286 202542 346449 262311 -67748 249065 206690 188961 357207 117389
14982 67519 -58128 551060 138704 350973 27026 391176 318246 271942 823065 242573
14971 -26070 172407 176692 565864 434535 351031 248477 372592 150863 503151 281791
14961 281791 554192 319123 171800 388835 155445 459270 252034 557051 426833 383766
14951C83766R5798I7805q37J34666G6417K01053j22593J34477d1151A57271J27552
14940B84823N3565A3928J77637J14554k4900K88085A56515K5115J90005A75906
14929E07463A50865K3944j9100O17804B32587K05496A58586D8379g2630D80644
14918B74474M67514C17222j52020R3567K90090B44917P677K36700j26076j51458
14908B11760F6066A8843Q10712A40312P65271A57489N27043q8665k92693J73958
14898D77132M9550j65613k8040A62906J29648L9933r9730K39765J55264k19658
14888D08128n1541K8108K47365j14825A79592J41821J37587n4637K17994k2449
14878E99908j31243j10185C9571L00191R7869L8982j38022J48040J68927A15153
$$ plain form
14951 383766 479564 97805 96968 231634 76417 277470 154877 289354 -41151 157271 284823
14940 284823 338388 13928 191565 306119 281219 569304 156515 181630 371635 175906
14929 507463 150865 174809 155709 773513 232587 438083 158586 48379 -72630 480644
14918 274474 741988 317222 165202 258769 548859 244917 252594 489294 363218 211760
14908 211760 66066 18843 829555 140312 905583 157489 684532 595867 303174 477132
14898 477132 526682 361069 333029 162906 292554 332487 232757 472522 627786 408128
14888 408128 356587 384695 632060 517235 179592 321413 459000 404363 622357 599908
14878 599908 468665 358480 39571 339762 437631 476613 338591 486631 655558 115153
14867D41678p0197j4712K40214o0338j54885r7247K71203j56313p3025M465J82102
14856E12945k15011m4603L48286o9262B03511K92586K30126C56297K20515q8340
14846D88472j23590L7764J22425J89957k38011a6464G99474A31103L22685j01814
14836C51974j70560K34858B05725K64117j66245K01938K04401C25004O8447Q2772
14826D76223B35036E4980Q19936k03977j89888p4935R7221R8929r8628K93322
14816G96960j51738B83868J72429L54288C39999L24358B79847L40944k31261Q111
14806C97641L3821K33935L6208k37004J01345r4951R2210R4507A80056J90763
14796C70819J92031L26820l89680K01584q4519j99507L0465H2761M26659L2632
$$ plain form
14867 441678 371481 356769 596983 536645 381760 284513 555716 399403 326378 330843 512945
14856 512945 297934 253331 601617 532355 203511 496097 726223 356297 576812 488472
14846 488472 364882 402646 525071 715028 477017 -16464 799474 131103 453788 351974
14836 351974 181414 416272 205725 469842 303597 505535 709936 325004 393451 476223
14826 476223 235036 54980 874916 670939 481051 406116 503337 602266 503638 796960
14816 796960 645222 283868 456297 810585 339999 664357 279847 620791 389530 397641
14806 397641 431462 665397 701605 464601 565946 470995 563205 657712 180056 370819
14796 370819 562850 889670 499990 701574 617055 417548 448013 82761 509420 542052
14786E42052j15636L12691k06478L9676P8597P662n0993O4879j8253B23921R3900
14775C17821N08966k56018l190J60335j28954L616L0701k09131L32553L46186
14765A102885m96943J26885k7831J58581k28201k48450M86965l06327L8068J9493
14755F25125J0207N4900r4969K06921j62871J02361k72386J982J32398K05381
14745H09049J45214l96356M12824j21270Q7641D41192L55583P1580l02653O11338
14735A177040l25434D15109K1953J75317L81457l2341j32921j82730J37598j73829
14725F09613n6745J29169J19956J46213D60626K89970J38250k22206L76424k05642
14715H37422m10157N41801j78393k14212K43728J88312k62041P405Q5951J22922
$$ plain form
14786 542052 426416 739107 532629 572305 650902 658564 607571 672450 654197 223921 317821
14775 317821 826787 570769 567579 727914 598960 602576 633277 424146 756699 1102885
14765 1102885 605942 732827 704996 863577 635376 386926 873891 567564 605632 625125
14755 625125 635332 690232 595263 802184 639313 741674 469288 471270 603668 809049
14745 809049 954263 557907 970731 849461 937102 441192 796775 868355 565702 1177040
14735 1177040 851606 415109 437062 612379 993836 961495 828574 645844 783442 609613
14725 609613 552868 682037 801993 948206 460626 750596 888846 666640 1043064 837422
14715 837422 427265 969066 790673 576461 820189 1008501 746460 753865 839816 962738
14705I62738q8925k44451K78824k16758L30453r8217j40160P3561J32615q8130
14695I01550J18014k45025M23652J35166m68962m6547J24603R1725R594J43441
14685A187211k22551k65910J41069L22374l59995N7379K0651J55035p077n194
14675A022992J59794K16286k21917l89699J63153L20205O5013j38844L42630m25228
14665A114385J55691l36502K67239j74382J16206k09667J79992j12631J33193
14656A133524L24089r7499j46182L06644j90729j49710J94466k7599J73152m71709
14646A048447L21351n8080K25772j41912q0809J0414O6269k70403K46978N7474
14636A425501J02304l05114M16838k33585k37029k9999M10476N4266j81978m662
$$ plain form
14705 962738 873813 629362 908186 691428 1021881 923664 783504 857065 989680 901550
14695 901550 1019564 774539 1198191 1333357 864395 817848 942451 1034176 1043770 1187211
14685 1187211 964660 698750 839819 1162193 802198 859577 880228 1035263 1028186 1022992
14675 1022992 1182786 1399072 1177155 787456 950609 1270814 1335827 1196983 1539613 1114385
14665 1114385 1270076 933574 1200813 1026431 1142637 932970 1112962 1000331 1133524
14656 1133524 1457613 1360114 1213932 1520576 1329847 1180137 1374603 1347004 1520156 1048447
14646 1048447 1369798 1311718 1537490 1395578 1314769 1325183 1391452 1121049 1368027 1425501
14636 1425501 1527805 1222691 1639529 1405944 1168915 1138916 1549392 1603658 1421680 1417018
14626A417018K76463m44129l198L0667l9410J27207K80857k21994M32254k59322
14616A596413O034m0574j34702L57385j01274l28361J10451j20062L24200M4324
14606A713834R1136k73745j04269K47022Q8633j52460P2417m4214M1422J86231
14596A866007L29276m22789J78368j09405J7636L57085K2892l35036k39479K19774
14586A884329J5251k68468M95101j19077j06098J75337M622K57288k29387k549
14576B106349L54276l62702M17618m06473L68733q3383M65862p76405K05558K04989
14566B494422j2512k0916M42396k48104k1319L82824j97042K85738R2488K9099
14556C227074n4942L26521o3041R78823L44909O38343J696168L631984N074550
$$ plain form
14626 1417018 1693481 1249352 1246154 1276821 1237411 1364618 1645475 1423481 1855735 1596413
14616 1596413 1602447 1561873 1427171 1784556 1683282 1354921 1465372 1345310 1669510 1713834
14606 1713834 1804970 1531225 1426956 1673978 1762611 1610151 1682568 1638354 1679776 1866007
14596 1866007 2195283 1772494 1950862 1841457 1859093 2216178 2239070 1904034 1664555 1884329
14586 1884329 1899580 1631112 2126213 2007136 1901038 2076375 2080997 2338285 2108898 2106349
14576 2106349 2460625 2097923 2515541 2109068 2477801 2394418 2860280 2083875 2289433 2494422
14566 2494422 2481910 2460994 2903390 2655286 2633967 3016791 2819749 3105487 3197975 3227074
14556 3227074 3172132 3498653 3435612 4414435 4759344 5397687 7093855 10725839 15800389
14547A5800389O247598R128409P474090j6461735j0726592E692837k314817k56238
14539C121782k82234p12399K33203j29144L29905n6018l15378l5172O0423k28216
14529A986752L89139J92061q0204J28209l33431P9330J98355K02536n25534K15547
14519B452760L16735O4347J26836o48401N72277j1168k06418L17280j54261J61489
14509B991476j79207R8599Q1904L5286q0685Q0907L51000l93673J56306K36190
14499C378103k48610N8851J04133M06427l90205M38088o0894j87887J08590J32393
14489C738989K1081l6706J38810m325J60657k74501O2713J65429J98229J6238
14479D186614Q2189k93187N15210n15602K91337n8171j70833M13833Q9047k66376
$$ plain form
14547 15800389 22047987 31176396 38650486 22188751 11462159 5692837 3378020 3121782
14539 3121782 2839548 2127149 2360352 2231208 2561113 2505095 2189717 2154545 2214968 1986752
14529 1986752 2375891 2567952 2487748 2615957 2282526 2361856 2560211 2762747 2237213 2452760
14519 2452760 2769495 2833842 2960678 2312277 2884554 2873386 2666968 2984248 2829987 2991476
14509 2991476 2812269 2910868 2992772 3028058 2947373 3028280 3379280 2985607 3141913 3378103
14499 3378103 3129493 3188344 3292477 3698904 3308699 3746787 3685893 3498006 3606596 3738989
14489 3738989 3760070 3723364 3862174 3857849 4018506 3744005 3806718 3972147 4170376 4186614
14479 4186614 4268803 3975616 4490826 3975224 4266561 4208390 4037557 4451390 4540437 4274061
14469D274061L15520l76892N74297m633j92262L38370K09704j80680J35174j13519
14459D979140N04815m01787K12492j05280K3313M19481r1757n4806J92783p7592
14449E600802L45700j36544l0397K03513Q628K87522M4955M1719J7763J15692
14439F499353M5304M7966m12864M19916M62433l65082J92391R7260J1008L33717
14429G331402J12168K12320j34999K42366k47814L88005m1740M02672j0654K66930
14419H520656j59030j8184L68654j31652K38613M76357j6421r4018q1860N23464
14409I626579m5718J02431K32819Q5102N72368J14441r3121K87853K02383L49865
14399A1435002M1906j8197M48938m69646O41089J78093k8225m8014P53856o4286
$$ plain form
14469 4274061 4589581 4212689 4786986 4782353 4590091 4928461 5138165 4957485 5092659 4979140
14459 4979140 5483955 5082168 5294660 5189380 5212693 5632174 5540417 5485611 5678394 5600802
14449 5600802 5946502 5809958 5779561 5983074 5991702 6279224 6324179 6365898 6383661 6499353
14439 6499353 6544657 6592623 6179759 6599675 7062108 6697026 6889417 6986677 6997685 7331402
14429 7331402 7443570 7655890 7520891 7763257 7515443 7903448 7861708 8264380 8253726 8520656
14419 8520656 8361626 8343442 8712096 8580444 8819057 9295414 9278993 9184975 9103115 9626579
14409 9626579 9580861 9683292 9916111 10001213 10573581 10688022 10594901 10882754 11085137 11435002
14399 11435002 11476908 11458711 11907649 11438003 12079092 12257185 12228960 12180946 12934802 12870516
14389A2870516L33708K81486K72153K95388K67130j94452O32731J4037M20920
14380A5193617L09468J61489J17189M85561N34296L09065J38927K22362N02406
14371A7974380J51973L92074O29935J52077L85583M32859N80851K73352M94125
14362B1467209N23548M21722N94386K85692L00917J100523L03975Q98131J67664
14353B6063767P79418O57923P26126R04765q0576J249436R38151P39726O36537
14344C2615273J192737R49337J94740J217463J041599J184912Q83792J170666
14336D0450519J433280R91091J540795J186629J168091J385367J726177J478630
14328E1360579J630830J657380J897497J357568K222523K113289J887262K226268
$$ plain form
14389 12870516 13204224 13485710 13757863 14053251 14320381 14125929 14758660 14772697 15193617
14380 15193617 15503085 15664574 15781763 16267324 16801620 17110685 17249612 17471974 17974380
14371 17974380 18126353 18518427 19148362 19300439 19686022 20118881 20699732 20973084 21467209
14362 21467209 21990757 22412479 23006865 23292557 23593474 24693997 24997972 25896103 26063767
14353 26063767 26843185 27501108 28227234 29131999 29051423 30300859 31239010 31978736 32615273
14344 32615273 33808010 34757347 34952087 36169550 37211149 38396061 39279853 40450519
14336 40450519 41883799 42874890 44415685 45602314 46770405 48155772 49881949 51360579
14328 51360579 52991409 54648789 56546286 57903854 60126377 62239666 64126928 66353196
14320F6353196K377088K531553K634779K526696L180851K749346L646571L147139
14312H9147219L511655L160283M037228L950105M636648M486120M651671N209545
14304A22790474N406040N186837O262794O381659O859593O561422P751945P592481
14296A74793245Q406657Q840757R453431R574021J0129753J0495064J1501206
14289B43194134J1806028J1877572J2572665J3018075J3415462J3870996J4023003
14282C33777935J4122041J4232026J4112440J4111241J3369045J2849710J2046056
14275D28620494J0540931P202404M67966r25731J85162L346136N661251m552851
14267D50545762k024411n376247p888420r195376j1292287j2660321j3775295
$$ plain form
14320 66353196 68730284 71261837 73896616 76423312 79604163 82353509 86000080 89147219
14312 89147219 92658874 95819157 99856385 103806490 108443138 112929258 117580929 122790474
14304 122790474 128196514 133383351 139646145 146027804 152887397 159448819 167200764 174793245
14296 174793245 183199902 192040659 201494090 211068111 221197864 231692928 243194134
14289 243194134 255000162 266877734 279450399 292468474 305883936 319754932 333777935
14282 333777935 347899976 362132002 376244442 390355683 403724728 416574438 428620494
14275 428620494 439161425 446363829 446831795 445906064 446091226 449437362 455098613 450545762
14267 450545762 448521351 443145104 435256684 426061308 414769021 402108700 388333405
14260C88333405j4374593j4581623j5302723j5002805j5065820j4958362j3417205
14253B85630274j3629383j2820202j2695272j2160020j1299726j0867040j0546750
14246B01611881r537014q756254r002774p924437p658618p388004o840923o483584
14238A38020273o013256n551169n667519m805534n078280m555027m248344l421028
14230I8680116m133466m115413l322962l515212l314636k752880l018365k669694
14222G1837488k275931k332919k430369j989273k138752j991444j852411j879873
14214E4946516j381658j643221j870596j393054j341209j467261j148508j246728
14206D3454281p05767j715411q31098j348579j118697p98172m43385j139840j456023
$$ plain form
14260 388333405 373958812 359377189 344074466 329071661 314005841 299047479 285630274
14253 285630274 272000891 259180689 246485417 234325397 223025671 212158631 201611881
14246 201611881 192074867 183318613 174315839 166391402 158732784 151344780 144503857 138020273
14238 138020273 132007017 126455848 120788329 115982795 110904515 106349488 102101144 98680116
14230 98680116 94546650 90431237 87108275 83593063 80278427 77525547 74507182 71837488
14222 71837488 69561557 67228638 64798269 62808996 60670244 58678800 56826389 54946516
14214 54946516 53564858 51921637 50051041 48657987 47316778 45849517 44701009 43454281
14206 43454281 42748514 41033103 40202005 38853426 37734729 36936557 36493172 35353332 33897309
14197C3897309r15241n84860m45097j190831o09615q22173p96463m52804p87370
14188B7292855j023958l51504q64989p4450m27758m47536o62369p23748m20691
14179B2295852o41488n39160k48069m78157r2212q64484l59764k00606k65175
14170A8606737m33336l09295k29331m27106n51497j1080q23234n0556k12215l32538
14160A5226549Q7952n65463j5224l62430l89767j02578L2299n61001o05289K44889
14150A2989937l15810k45380J62465m32313j51786k72277j27914k85507k89013
14141A1032402J23766n59550J58579l16943J5148k63199j67567k28583K02289
14132I996342n76883l4500j15044m100j61708n16765N34296m47197r1246K97344
$$ plain form
14197 33897309 32982068 32397208 31952111 30761280 30151665 29329492 28533029 28080225 27292855
14188 27292855 26268897 25917393 25052404 24977954 24550196 24102660 23440291 22716543 22295852
14179 22295852 21654364 21115204 20867135 20388978 20296766 19432282 19072518 18871912 18606737
14170 18606737 18173401 17864106 17634775 17207669 16656172 16645092 15821858 15771302 15559087 15226549
14160 15226549 15314501 14749038 14733814 14371384 13981617 13879039 13911338 13350337 12745048 12989937
14150 12989937 12674127 12428747 12591212 12158899 12007113 11734836 11606922 11321415 11032402
14141 11032402 11156168 10596618 10755197 10438254 10453402 10190203 10022636 9794053 9996342
14132 9996342 9419459 9384959 9269915 9265815 9104107 8587342 9121638 8674441 8583195 8880539
14122H880539l95455n51008q596L81118m55270j21958M1313l44431K31261j68891
14112G488622k03461K51009n41387L11943l50205j39941J95894o08608j44275
14103F259591J82090k6259R4465l72542K18563l76590j02953Q0724K15494k78270
14093E894313n2658l09948K22769k39077M54497o64701j3786M63995j48228j32823
14083E474353k24462L22946j16389k10484j19444J55209m10800R9451j27817j36713
14073D705850l36164J36620K76788l36034k06170J13757J00486l91953M52505
14064D515685n01479K19529Q104q2984J92849l32629J54066Q119k65596O13542
14054D529206o67329k15883J22481q9640L08674l88988J34596Q3014O4979k97282
$$ plain form
14122 8880539 8485084 7934076 7925480 8306598 7851328 7729370 7770683 7426252 7657513 7488622
14112 7488622 7285161 7536170 6994783 7306726 6956521 6816580 7012474 6403866 6259591
14103 6259591 6441681 6415422 6509887 6137345 6355908 5979318 5876365 5957089 6172583 5894313
14093 5894313 5841655 5531707 5754476 5515399 5969896 5305195 5291409 5755404 5607176 5474353
14083 5474353 5249891 5572837 5456448 5245964 5126520 5281729 4870929 4970380 4842563 4705850
14073 4705850 4369686 4506306 4783094 4447060 4240890 4354647 4455133 4063180 4515685
14064 4515685 4014206 4233735 4241839 4158855 4351704 4019075 4173141 4181260 3915664 4529206
14054 4529206 3861877 3645994 3768475 3678835 3987509 3598521 3733117 3816131 3881110 3583828
14044C583828j99437p8038K85884p8202n3686l29520K41605j77523L65817j52402
14034C408326k30430K38882j59483m00323J70439K15464R5913k17634P5832j22466
14024C074520p6443K22844k17292l01545J51161Q0258l91184J37882J36867m54607
14014B362461M70658j80347l48812O19857l13947j6218j77518q6589K8068J53775
14004B511388J27971l6580m55478J34623k08316J47221K93051k9940l8753k87821
13994B157366M13342j45709J02813K06537J046065K959739M301981O271655R021722
13985B6335511J2474157j2778153j1993806n261489k212598j689452k46200p39904
13977C888066m94129J83767m07939j16524k78696K60090k03675j07891j11422
$$ plain form
14044 3583828 3384391 3306353 3592237 3514035 3460349 3130829 3372434 3194911 3560728 3408326
14034 3408326 3177896 3416778 3257295 2856972 3027411 3242875 3338788 3121154 3196986 3074520
14024 3074520 2998077 3220921 3003629 2702084 2853245 2933503 2542319 2680201 2817068 2362461
14014 2362461 2833119 2652772 2303960 2923817 2609870 2593652 2416134 2329545 2357613 2511388
14004 2511388 2639359 2602779 2147301 2281924 2073608 2220829 2513880 2483940 2445187 2157366
13994 2157366 2570708 2424999 2527812 2734349 3780414 6740153 11042134 17313789 26335511
13985 26335511 38809668 26031515 14037709 8776220 6563622 4874170 4627970 3888066
13977 3888066 3393937 3577704 3169765 3053241 2774545 3034635 2830960 2723069 2611647
13968B611647k06555j15047P7980P5244J89337o42371K05706J42201j52522J21127
13958B306747o9655J58081k67657l13346N64094r5319j34223j2033J73393k96878
13948B013204M5848r0066J9258m6490l67881J93539K34753o6346j18586q3669
13938A733564K32839l12661J82428l139p4668j48304J84240k67930L58381k35581
13928A649169J85905k50594n6275J16734j93840k0244M56553l13550o2089o5632
13918A446137R776j19624L74934k33210N6767r5278l8834O5600j21740O5750J57143
13907A567421m3159L0054l04267K21461O3925J31434k9444k68721l7387m3662
13897A287655L1033l1632L0074j44683o1839J59751j32544l1017K61078J63286
$$ plain form
13968 2611647 2405092 2290045 2368025 2443269 2632606 1990235 2195941 2338142 2185620 2306747
13958 2306747 2237092 2395173 2127516 1814170 2378264 2282945 2148722 2136689 2310082 2013204
13948 2013204 2059052 1968986 1988244 1941754 1573873 1767412 2002165 1935819 1817233 1733564
13938 1733564 1966403 1653742 1836170 1833031 1758363 1610059 1794299 1526369 1884750 1649169
13928 1649169 1835074 1584480 1528205 1644939 1451099 1430855 1887408 1573858 1511769 1446137
13918 1446137 1455913 1336289 1711223 1478013 1534780 1439502 1400668 1466268 1344528 1410278 1567421
13907 1567421 1524262 1554316 1250049 1471510 1535435 1666869 1637425 1368704 1331317 1287655
13897 1287655 1318688 1287056 1317130 1172447 1110608 1270359 1137815 1106798 1367876 1531162
13887A531162k67612P1835j38861J75601j81792j27347Q9142O0520J50305l60163
13877A002790P4813J13326k98919N03975k6071j35963Q3250j46347k77601J22091
13867A015344N6121J41687l27381N45555k28524o3754p188N0204m61494N97674
13857A318244l91323J3510J28510K2264J28776r250p6117O2489j0644j54722q8630
13846I43107J32657J71030n72538J46151M9364J32114l3052J9763l2161L9808
13836I96243l63458N21752k08783J7857R5500j80235L02932P797l64181J36152
13826I61576k42684M18270j83944j09416N0330N80533m60743l06078K4326j47254
13816E84916K51361L60920k24983k08446K60267K33004N6129F00725L52584j27706
$$ plain form
13887 1531162 1263550 1335385 1196524 1372125 1190333 1062986 1152128 1212648 1362953 1002790
13877 1002790 1077603 1190929 892010 1395985 1369914 1233951 1317201 1170854 893253 1015344
13867 1015344 1071465 1213152 885771 1431326 1202802 1139048 1131860 1182064 720570 1318244
13857 1318244 926921 940431 1068941 1091205 1219981 1210731 1134614 1197103 1186459 1031737 943107
13846 943107 1075764 1246794 674256 820407 869771 1001885 968833 988596 956435 996243
13836 996243 632785 1154537 945754 963611 1059111 878876 1181808 1189605 825424 961576
13826 961576 718892 1137162 953218 843802 894132 1474665 1013922 707844 732170 584916
13816 584916 836277 1197197 972214 763768 1024035 1257039 1313168 600725 953309 825603
13806H25603K92319n39702N15594E07047M42736m9847o3133K0439q6377N01097
13796A271962m19662m0292J85922l27882J34213m1161Q1785m4465K61395j66813
13786H95002J98780k49936k99895K26275J66237l09615R8376j6631K52163N2219
13776A012975O4380k85402J33313m52109P2671K53645j98496M86312l89990j59658
13766E37641K21881l43387q2090M46908p0369K01332j11042q2823L2989J54665
13756I05705D28386N64490L0235m93575j01356K61844l23174N12135k27491J82073
13746H33567C00205N99050k11186r6406R9244j31704K99503j82231j07146J85250
13736G54579k27145q6552k2421M31240j96700p9205L24367j46162k70541M455
$$ plain form
13806 825603 1117922 578220 1093814 507047 949783 899936 836803 857242 770865 1271962
13796 1271962 852300 812008 997930 670048 804261 763100 844885 800420 1061815 895002
13786 895002 1093782 843846 543951 770226 936463 626848 725224 708593 960756 1012975
13776 1012975 1077355 791953 925266 473157 545828 799473 600977 1087289 697299 537641
13766 537641 759522 416135 334045 780953 710584 911916 800874 718051 751040 905705
13756 905705 428386 992876 1023111 529536 428180 690024 366850 878985 651494 833567
13746 833567 300205 899255 688069 591663 690907 559203 858706 676475 569329 754579
13736 754579 527434 440882 418461 849701 653001 573796 898163 752001 481460 485915
13726D85915J68913J27016j53407j76829B16544L11448R1518k13485L73098K43135
13716A022258m14981j57545K7640j73449R175J53066M5717j21786M72354k85185
13706E77264o2429j26314K25747n5802q6226M21494k34818k00450R7714J15269
13696F71449L6211k24409J146N1168k24433K00986A74426M26594j11153l2922
13686D56945o6858J17974J87874B86488J17649L53584k66238R9863j17679A63392
13675D40467j86560L88858J80550C82810L07684n7130P4131l49073J40817q2948
13665D16291A37143J98906j44285K89355j74705L4775J55058l8818j5975L7438
13655D78892r7411q7683J04933A65099L13240p5970r2181j4512l449J07614K52681
$$ plain form
13726 485915 654828 781844 628437 451608 216544 527992 619510 406025 779123 1022258
13716 1022258 607277 449732 477372 303923 313098 466164 511881 390095 862449 577264
13706 577264 514835 388521 614268 558466 472240 893734 658916 458466 556180 671449
13696 671449 707660 483251 484397 535565 311132 512118 174426 601020 489867 456945
13686 456945 390087 508061 695935 286488 404137 757721 491483 591346 473667 163392
13675 440467 253907 642765 823315 382810 690494 633364 707495 358422 499239 416291
13665 416291 137143 336049 191764 481119 306414 341189 496247 457429 441454 478892
13655 478892 381481 293798 398731 165099 478339 402369 310188 295676 292227 399841 652522
13644F52522l09925o4553M52089B55905M05246j91320r2693N04701F5746N74971
13634F40717n9055k69438A47210M12918j60046K72919k1012B01629L79094j12537
13624D68186j00441A37982K30175J65778B00156M67060B97694L34088k33227j17607
13614B80948L66985j34125M0301j19850L29839C62369P3759M1156q2344q4398
13604C10542L55605k47033A70381J44535L840J71930B04060L664J05855L86998
13594G00577k50709j77099J80571i3121A04312K08307j26086K0367L21837A96096
13583C27204m3750j11168K80140N9700K09578A29024O18127I9646L36812j72507
13573B63951J92704n9333j03740A33102P2612E6439M21108j15192k7478R7798
$$ plain form
13644 652522 342597 278044 730133 255905 661151 469831 377138 881839 65746 640717
13634 640717 581662 312224 147210 560128 400082 673001 651989 201629 580723 468186
13624 468186 367745 137982 368157 533935 200156 667216 297694 631782 398555 280948
13614 280948 647933 513808 554109 434259 764098 362369 436128 477284 394940 310542
13604 310542 666147 419114 170381 314916 318756 490686 204060 207724 313579 700577
13594 700577 449868 272769 453340 -93121 104312 312619 186533 206900 528737 196096
13583 327204 283454 172286 452426 512126 721704 129024 747151 99646 436458 263951
13573 263951 456655 397322 293582 133102 205714 56439 477547 362355 334877 432675
13563D32675k02071N9487c6366B40610c6481B08905L2743J63753j05278K60111
13553E60234B62829a57997B62827I5876m4457M4945L64606k06956f0747B38059
13542B68050j7083C3783L82256A85475L6854J11977O6608j46003O25534C27950
13531C29449K05934j4915d2897E17712m3578j99300o7850J61908j71778K70150
13521D67264j16062Q8560p9697p1500J76109j57858J29443A64689J59261A11043
13510D6205M83694O3875a28922E56477k50614J80652i556l1296E29533H4331Q5184
13499A69515n9245n4191J09239J75542g3797B48824m5428J76826l6494G5780L03740
13488C79520A61067K16399j70117p8704J38167F9642J14402L81584B78680Q9891
$$ plain form
13563 432675 230604 290091 -36366 240610 -36481 208905 241648 405401 300123 560234
13553 560234 262829 -157997 262827 95876 51419 96364 460970 254014 -60747 238059
13542 268050 250967 33783 416039 185475 222329 334306 400914 254911 880445 327950
13531 329449 535383 520468 -42897 517712 474134 274834 206984 368892 197114 467264
13521 467264 351202 439762 360065 288565 464674 306816 436259 164689 323950 111043
13510 46205 529899 593774 -128922 556477 305863 486515 -9556 -40852 529533 84331 169515
13499 169515 110270 56079 165318 340860 -73797 248824 203396 380222 343728 75780 379520
13488 379520 161067 377466 207349 128645 266812 69642 184044 565628 278680 368571
13478C68571q9808k4060N2735r3020m2977J4780K1581J71156j76815L1468r5019
13467A38592J05855m9541p4596L01471q5086A10898J53787J17557P8473A31603
13456E91478j71515j72533e3133A71451L35817i007B00694l0134M5648q2831J34118
13445B67495a21753A25799k0210B3766J70029J07010n97q7801a0324B87700p0896
13434B16804j03043j5560J79654J44870B02540J74433j58658f8383D83049j77757
13424C05292b3073C75447a40270C09256q7118F9863K22374A28524J6935m9212
13414I6247A3837Q8871B4041J77284m1258j1643M69685j32802A69608J01165J08079
13403C78852J14853N044j50527A05854c5383D48299j75009J81423j41854k8655
$$ plain form
13478 368571 278763 254703 307438 214418 171441 186221 207802 378958 202143 233611 138592
13467 138592 244447 194906 120310 421781 336695 110898 264685 382242 460715 131603
13456 591478 419963 247430 -53133 171451 507268 -9007 200694 170560 216208 133377 267495
13445 267495 -121753 125799 105589 23766 193795 300805 300208 212407 -10324 287700 216804
13434 216804 113761 98201 277855 422725 202540 376973 218315 -68383 483049 305292
13424 305292 -23073 375447 -140270 309256 222138 69863 292237 128524 145459 96247
13414 96247 13837 102708 24041 201325 160067 148424 618109 485307 169608 270773 378852
13403 378852 493705 498749 348222 105854 -35383 448299 273290 454713 312859 284204
13393B84204E7915J46687I1453J38530L03805k27205a27208H8965J84659k726
13383B70898j03830b31948C66305a06754A14532K00273F6923J64783L2912J81016
13373D45634F2731L88591o8859j0247j41139O6944P5714p7454N7894a61483A82220
13361B5789M75933C1509f0164A41140a28031I9392M36577D3132J51170J7884k7325
13350A84861J96691j76321p4573f7233A89641D8745M67827j67974d1697D02828
13339D92174B29129p2522J29069j21077M19939k38801A26575J15552j03258o7002
13329G1867K7131L73210H5191L73306A82456J89882j42514a93596A75540N28905
13319G04445A61601K72569j9697j54017n9764J05637n2805h380C37342j0266j26869
$$ plain form
13393 284204 57915 204602 91453 229983 533788 306583 -127208 88965 273624 270898
13383 270898 167068 -231948 366305 -106754 114532 314805 66923 231706 264618 445634
13373 445634 62731 451322 382463 372216 231077 298021 373735 296281 354175 -161483 182220
13361 25789 501722 31509 -60164 141140 -128031 99392 535969 43132 194302 212186 184861
13350 184861 381552 205231 130658 -67233 189641 48745 516572 348598 -41697 402828
13339 492174 229129 156607 285676 164599 584538 345737 126575 242127 138869 71867
13329 71867 98998 472208 85191 458497 182456 372338 229824 -193596 175540 704445
13319 704445 161601 434170 414473 260456 200692 306329 253524 -8380 337342 327076 200207
13308B00207Q5287p0361G5705M97780B61007P4498b1096C61242A26753K20202
13298C46955F7748J0817J08753j3719a4051F9029J372a76994A88766f1314D40218
13286a62444B38720A05900J90837j16465L22438k16408H1209J257j959J8398J31808
13275B30713a75339A95843c70018A89139B6397L2747L90145h659A4402J36219
13265A50621a89469B39516O7244i6005m7363B14305c40364f2429D8526K48649
13255B97175b57820e2600H9750L97058f1736C75175A23662K13737a67763B06700
13244D28461A1231c4359C01817m4860p4937c38508B42863n1107b90931a1013G7903
13232B80584a10773C71870a1768A12293A9573o350b71581B93976D5376J87261
$$ plain form
13308 200207 285494 215133 75705 573485 261007 335505 -21096 361242 126753 346955
13298 346955 67748 78565 187318 173599 -14051 69029 70401 -176994 188766 -61314 440218
13286 -162444 238720 105900 296737 180272 502710 286302 81209 82466 80507 98905 230713
13275 230713 -175339 195843 -370018 189139 26397 59144 449289 -8659 14402 150621
13265 150621 -189469 239516 306760 -96005 -143368 214305 -340364 -62429 48526 297175
13255 297175 -257820 -52600 89750 486808 -61736 375175 123662 337399 -167763 206700
13244 428461 11231 -34359 301817 256957 182020 -338508 242863 191756 -290931 -11013 77903
13232 280584 -110773 371870 -11768 112293 19573 13223 -271581 293976 45376 232637
13222B32637g3393B14324M0811A05053l3852K26357J97154k00031K6066C0971
13211D9269J83048P1822n9019j20962b860B35761J48849g0716G1388K45543j3980
13200C02951H1272p668J2285b884j38413A55726R1461i0917B87098K3723a93226
13188e728C86489q2655b5786l78115A10844l37a80421l5064H5978m2689L82552
13177D25841I1523A6156a18702e6342E1319L0835a11317n4934m2995I0849J41098
13166B31947I2838J15439r7786Q1532F8805K09406j00676l3781f1781G2645M7598
13155A20243A8346L02677a81377c9194l1811B53221r9395R9322A2879a14603I6460
13143b13838E3366K20596R2290h7670L3333l5168l6729I5728J745l892J35708
$$ plain form
13222 232637 -73393 214324 255135 105053 71201 297558 494712 294681 320747 30971
13211 49269 232317 304139 245120 124158 -2860 235761 384610 -70716 71388 316931 302951
13200 302951 81272 73604 85889 -2884 -141297 155726 247187 -90917 287098 310821 -193226
13188 -5728 386489 303834 -25786 -403901 110844 110507 -180421 -215485 85978 43289 425841
13177 425841 91523 16156 -118702 -56342 51319 82154 -111317 -166251 -209246 90849 231947
13166 231947 92838 208277 110491 192023 68805 278211 177535 143754 -61781 72645 120243
13155 120243 18346 321023 -181377 -39194 -71005 253221 153826 253148 12879 -114603 96460
13143 -213838 53366 273962 366252 -87670 -54337 -89505 -126234 95728 97473 93581 229289
13132B29289e9580j63860I8789h2845D6335a19595B2250N32072B76371a19394
13121G8550e9651l2027d3439A32668J04540C6404M63046c46779e83j82081B02937
13109b71784J33147B72336J14643b40806C59900a98243B17111i314A99179I3874
13098A00259M8129J90092A9884J0451D429h7966a039D04342A92747p6893j0202
13087A05652J33918L392n1109J10043A2865a71928F8461N9074K03327f826B12627
13075c0237I7407M78894k58968f9962A73578I963b21472C5318K59149b23978A60825
13063F3001L93428A0520J79468g3455F1933b24425D92544j38634b21431J08199
13053a13232d0117C882J43174J2824a27471B09718R979A05311a26365E2005J36562
$$ plain form
13132 229289 -59580 -223440 98789 -82845 46335 -119595 22250 554322 276371 -119394
13121 78550 -59651 -91678 -43439 132668 237208 36404 499450 -346779 -583 -182664 202937
13109 -271784 -138637 272336 386979 -240806 359900 -198243 217111 -9314 199179 93874
13098 100259 148388 338480 19884 30335 4429 -87966 -1039 404342 192747 115854 105652
13087 105652 239570 242962 191853 301896 12865 -171928 68461 127535 330862 -6826 212627
13075 -30237 97407 576301 317333 -69962 173578 9963 -221472 35318 294467 -223978 160825
13063 63001 456429 10520 189988 -73455 61933 -224425 492544 353910 -221431 -113232
13053 -113232 -40117 3882 147056 159880 -127471 209718 219697 105311 -126365 52005 188567
13042A88567a03852C33562A43607K29905h0855C4682K22813b14286A31188J40881
13032B72069C2842b1501B31352J60803r4812L0973F3721N1470R2029r037B4482
13020A24764a20455D68707D0930a25972B47497C4970L22597j40458A02459L08571
13010D11030a00196A94379A2066b6556D88189j72456r4068d4804C37441J21238
13000D58679b5075E9751d27033B801K87950A41918f3153j74025h2920D5152b91964
12988e5290o5514A21108O0690C283a91409C67926j23153A6213M360K3449a87450
12976A75033a06733B53091b05224J02131C63091a14105b0185C52844j52416K6382
12966B26810b9939k32675C2346M02812e3371a6999A58406F9888B4871L9126Q7034
$$ plain form
13042 188567 -103852 333562 143607 373512 -80855 34682 257495 -214286 131188 272069
13032 272069 32842 -21501 231352 392155 297343 328316 63721 115191 207220 198183 24482
13020 124764 -120455 468707 40930 -125972 247497 34970 357567 217109 102459 411030
13010 411030 -100196 194379 12066 -26556 488189 315733 221665 -44804 337441 458679
13000 458679 -25075 59751 -427033 2801 290751 141918 -63153 -237178 -82920 45152 -291964
12988 -55290 -120804 121108 181798 3283 -191409 367926 244773 16213 20573 44022 -187450
12976 175033 -106733 253091 -205224 -103093 363091 -114105 -20185 352844 200428 226810
12966 226810 -29939 -262614 32346 435158 -53371 -16999 158406 69888 24871 63997 151031
12955A51031a90821m0311a1969A17703E3864J14657f6900C31439A04507g5230
12944B71354h2861l33386a24250G0031a64850C067Q1186b13900P6391d5981p3014
12933a18995G1990e3k85893E19725F7181a08980B31263d8637A37416J559a85800
12921D677a94987A75748d6520H4208m0312b67538J17824e6383A67543l876b27014
12909b6207I2313J83002r6439l2464O4490b92596A24805d7276C06471j15769p9337
12898A11365a21464k064G6741a94679j5117g7026D06757R994a06798F0303R9720
12887A60023a64669A74025k9124c7871k97321b3191B59574C2767c71386G5222
12876e7567J2706A74078b9574A26174k6550R8142f8684d404l3956B30519a60775
$$ plain form
12955 151031 -190821 -231132 -11969 117703 53864 168521 -66900 331439 104507 -75230
12944 271354 -82861 -416247 -124250 70031 -164850 3067 84253 -213900 -137509 -45981 -118995
12933 -118995 71990 -53 -285946 519725 67181 -108980 231263 -48637 137416 138975 -185800
12921 4677 -194987 175748 -46520 84208 43896 -267538 -149714 -56383 167543 163667 -227014
12909 -26207 92313 275315 178876 146412 210902 -292596 124805 -47276 306471 190702 111365
12898 111365 -121464 -123528 76741 -194679 -209796 -77026 406757 416751 -106798 60303 160023
12887 160023 -164669 174025 144901 -37871 -335192 -23191 259574 32767 -371386 75222
12876 -57567 -44861 174078 -29574 126174 99624 197766 -68684 -4404 -38360 230519 -160775
12864B4146i0498k38461f1273q4233A13309a68898G5439J31798a99503A78203
12853A48454D3417J69343E3347h4757A57705D0925L1275b65745Q2831P5676B89651
12841B245J89766P3511I6973J1657b30765f6252n5721B2433b7192j83652a732
12829a14309a1890j2986E1058c3724B50862c9248o9981C6564c1365l8964C24266
12817A00592C4488b43913H1328a73498B38764I7870K4354E0847a38126F2402d0923
12805C25756c52669C63849A65590D6300i5041D03087b77297N3587d8800A52398
12794B22667c8684B23020b29761A07973c8508j32208B98722q7820b26836A24296
12783A66701i5549H6348b40086i2735m6231k23697J81002M356B27409d60472a77874
$$ plain form
12864 24146 -90498 -328959 -61273 -145506 113309 -168898 75439 207237 -199503 178203
12853 148454 43417 212760 53347 -84757 157705 40925 72200 -265745 -182914 -107238 289651
12841 2245 192011 265522 96973 108630 -230765 -66252 -121973 22433 -27192 -210844 -1732
12829 -114309 -11890 -24876 51058 -33724 250862 -39248 -109229 36564 -31365 -70329 324266
12817 100592 34488 -243913 81328 -173498 238764 97870 122224 50847 -138126 62402 -40923
12805 325756 -352669 363849 165590 46300 -95041 403087 -277297 -223710 -48800 152398
12794 222667 -38684 223020 -229761 107973 -38508 -170716 298722 210902 -226836 124296
12783 166701 -95549 86348 -240086 -92735 -138966 -362663 -181661 -177305 227409 -460472 -177874
12771a8215D4028K0827J72049e3028G1140C100i0058A5136a57064A35113J00622
12760B35735m8038K16995A85881J58415D1997b7586C15242b45679P1447k62774
12750d37006b15665A79805i1368a2143j05666l1562A01755b0333j81471A9878
12739G605L19731A13755d5764B87368o5406H1440l7630M22367J42806b65725b5210
12727B45426b76447A61226P8450r579h3737H404c80620B14379b46022p5317J24977
12716a96362a1074C25434b45747e4997A50265K05J64570e2029I3703A3141M42147
12705D55288H6709L21450Q1562A02845A8085L89862i3138D05429j10083n6718
12695B38628n9733B4675a29556C16530A17L38437A57955e5133C1285e0785G6553
$$ plain form
12771 -18215 44028 64855 236904 -53028 71140 3100 -90058 15136 -157064 135113 235735
12760 235735 187697 404692 185881 344296 41997 -27586 315242 -245679 -174232 -437006
12750 -437006 -215665 179805 -91368 -12143 -117809 -149371 101755 -20333 -201804 19878
12739 7605 327336 113755 -45764 287368 221962 81440 43810 466177 608983 -265725 -25210
12727 245426 -276447 161226 239676 230097 -83737 8404 -380620 214379 -246022 -321339 -196362
12716 -196362 -11074 325434 -245747 -54997 150265 150470 315040 -52029 93703 13141 455288
12705 455288 86709 408159 489721 102845 18085 407947 -93138 405429 295346 238628
12695 238628 178895 24675 -129556 316530 117 338554 157955 -55133 31285 -50785 76553
12683B43265a43173B8299L72965j09337B7766c60284H9857g4375D749K64543c6693
12671f6170C75714a8214m8344j90606B59704I3089c8033n5732H0560a10865F6487
12659G6973P7410b44034G5415a1710F4108N8717L68143b8055I7281O9219d2553
12647D25762D122J06075j5298m2603J84154J86182a53918G9027a81657D23545
12636e6899B92544A4712a3710B3966L8465J71458a60088g5298B83817J90236D1377
12624B12676M0833R4563q0836Q286k1627R1798h1652o5329C1050a52742C3593
12612A05155a55032e8301a6912B90878M2024b42684F8502d3558r765A30065M1543
12601A71608G9766p545a69999d6108a628A85408C3772h2347I7376J64144M8853
$$ plain form
12683 243265 -143173 28299 401264 291927 27766 -360284 89857 -74375 4749 269292 -36693
12671 -66170 375714 -18214 -66558 -257164 259704 93089 -38033 -93765 80560 -110865 66487
12659 76973 154383 -244034 75415 -11710 64108 122825 490968 -28055 97281 166500 -42553
12647 425762 4122 110197 94899 52296 236450 422632 -153918 79027 -181657 423545
12636 -56899 292544 14712 -13710 23966 62431 233889 -160088 -75298 283817 474053 41377
12624 212676 253509 348072 267236 275522 253895 345693 -81652 -146981 31050 -152742 33593
12612 105155 -155032 -58301 -16912 290878 332902 -242684 68502 -43558 -53323 130065 171608
12601 171608 79766 72221 -169999 -46108 -1628 185408 33772 -82347 97376 261520 310373
12590C10373b03253A09416d9683B9512d4060C2436A1097a64599m4781p011A15551
12578B50069a04214B03746F246b72531L7170l7221A12124c1974A35378K42286
12568C77664A44324h4264p7774A07199J38847K0703C6458K10127b01919b8591
12557C24480b68177D0998b95908i1931A94167a40607b6821p8554j04684c5714
12546C06K10692b47023n8292A8839P3837g6978A3026c08086H1975a57465j3028
12535a70493b6067j31282B16323h459k80487C70503p2417B0188J91070a74803
12524b25438h8604A78230a33356A01110Q4677f4442B06329a7620r146A85491G2192
12512B00684m8412c22655g3255F8025L0277a86870b1416k6788j4017C74982D5309
$$ plain form
12590 310373 -203253 109416 -49683 29512 -44060 32436 11097 -164599 -209380 -216391 115551
12578 250069 -104214 203746 6246 -272531 -235361 -272582 112124 -31974 135378 377664
12568 377664 144324 -84264 -162038 107199 246046 266749 36458 246585 -201919 -28591
12557 324480 -268177 40998 -295908 -91931 194167 -140607 -26821 -105375 -210059 -35714
12546 306 210998 -247023 -305315 18839 92676 -76978 13026 -308086 81975 -157465 -170493
12535 -170493 -26067 -157349 216323 -8459 -288946 370503 298086 20188 211258 -174803
12524 -225438 -88604 178230 -133356 101110 185787 -64442 206329 -17620 -26766 185491 72192
12512 200684 152272 -322655 -73255 68025 98302 -186870 -21416 -48204 -62221 374982 45309
12500i1263C98150e0812G1122a02465c1165A70996a77545C97890A16743P3208
12490A89951F2176f5995F4316i9910l27902A90854a13683A32007b41838h2889
12479a04745n7599B05433a49737L0150e9015b7359A19673a58117M6077F4676b74653
12467I9397K20807a50644K7468A94028A1520K31970A0934M37625H8216c446G7177
12455A8856b52229A94641g2296r5575B85K9417a78823k24467h8589A50141D3861
12443a14516M8795l7705A38558h4534b3864p5612j75756A52693c2594B14089D7429
12431A0235J64443a62504k27060a84784D04418A66852P4345a00393E7678L7640
12421I5318J83621p1377N6195e2003H1274K5543b89391I3189b6731j46775j69565
$$ plain form
12500 -91263 398150 -50812 71122 -102465 -31165 170996 -177545 397890 116743 189951
12490 189951 62176 -65995 64316 -99910 -427812 190854 -113683 132007 -241838 -82889
12479 -104745 -162344 205433 -149737 -119587 -59015 -27359 119673 -158117 -112040 64676 -274653
12467 99397 320204 -150644 -123176 194028 11520 243490 10934 448559 88216 -3446 77177
12455 18856 -252229 194641 -72296 -167871 285 29702 -178823 -403290 -88589 150141 43861
12443 -114516 -65721 -103426 138558 -84534 -23864 -99476 -275232 152693 -32594 214089 47429
12431 10235 174678 -162504 -389564 -184784 404418 166852 241197 -100393 57678 95318
12421 95318 278939 207562 263757 -52003 81274 106817 -289391 93189 -26731 -173506 -343071
12410c43071a26720L3832B6893a52121F066L28962f8392j31223e5655n9166L1900
12399h2921B63177I2226l2264B6314J7134R1252E7111a8474j18657N3778k94428
12388c77781J72799b7938A54246F0659L3981a74281L355d5438H7382L4827b9807
12376C25190h6970h145E6372i6901p466a2212j0358M934q0326F6747b62581R2008
12364a70573j62179a02755B5461J0946J10818E7377M1791b516j89641P5060q645
12353a25742B2100J0096a20428A8328R2888R8118a897C2568j0391P1020d8434
12341G7546k0133H258K2088N2583A2168Q9631d1118A18262h2590K5765A52526
12329C97798a1741A71255l9601a60579A41870J46929k3923b6408F8079J32287
$$ plain form
12410 -343071 -126720 -92888 26893 -152121 6066 335028 -68392 -199615 -55655 -114821 -82921
12399 -82921 263177 92226 59962 26314 43448 134700 57111 -18474 -137131 -83353 -377781
12388 -377781 -204982 -27938 154246 60659 94640 -174281 -170926 -45438 87382 122209 -29807
12376 325190 -86970 -8145 56372 -96901 -104367 -12212 -22570 -17636 -97962 66747 -262581 -170573
12364 -170573 -332752 -102755 25461 36407 147225 57377 99168 -2516 -192157 -117097 -125742
12353 -125742 22100 32196 -120428 18328 111216 209334 -1897 32568 22177 93197 -48434
12341 77546 57413 8258 30346 82929 12168 101799 -41118 118262 -82590 -56825 152526
12329 397798 -11741 171255 131654 -160579 141870 288799 264876 -26408 68079 200366
12319B00366n5552I22N8087i9135E8060d6204m3448A66190G6056J45977F8787
12307A2987Q8172m0204A1547K08974P9311B9957A2578J59833a33208C76356c7086
12295i6590j3328E4435A7917K07859j05103L5396e6684A36026C9041J76136K15344
12284D30521g666o1802A04106J56150a03635B57132N440a88888B16142J09365
12274C25507L43946k49438j28501j19396l5461a65085K9722A91895R6866q5904
12264B02857i045H4730K63517A3664J54101D9617a65034f7997b5616A35110n9046
12253G6064B0525h180j66341D4630b05923f744k99167C99343B5828K38087C1973
12241b27676D4296K87726b24242B03064G5698j8270c5929A08103P866a7991B61787
$$ plain form
12319 200366 144814 922 59009 -99135 58060 -46204 -89652 166190 76056 222033 68787
12307 12987 101159 60955 11547 220521 299832 29957 12578 172411 -133208 376356 -37086
12295 -96590 -109918 54435 17917 225776 120673 156069 -56684 136026 39041 215177 430521
12284 430521 -7666 -69468 104106 260256 -103635 257132 262572 -188888 216142 325507
12274 325507 669453 420015 291514 172118 136657 -165085 -135363 191895 288761 202857
12264 202857 -9045 84730 348247 13664 167765 49617 -165034 -67997 -25616 135110 76064
12253 76064 20525 -8180 -174521 44630 -205923 -6744 -305911 399343 25828 263915 31973
12241 -227676 44296 332022 -224242 203064 75698 57428 -35929 108103 115969 -17991 261787
12229A88530K734q7837K05186P3042A76741R6180j22617J17597b37768H5183N8405
12218A43588J10563D2624Q6194K70992n3458C6667K16087h470B1009L87049A55573
12206H4300J00541a85785A87393E1082A8776K13717c7214C05458D0409K33238
12196B73647G2658K52673a96962A86217p2430q708c2336C5477I654K47678g3773
12184C52286e1794g410F2807P7383c5014B60088A25236h2803B05073b9190B30730
12172i37A23941C4443h9103A05352K16111J03307a7690B29462q1968c2744D22422
12160a33981A32756J05060g9203G2345M4882M0167o9889a78466j2853K9198J4990
12149a47131A71390J66651j24282a49847A70155a71408B66454l8258h8367K0527
$$ plain form
12229 188530 191264 103427 308613 381655 176741 272921 150304 267901 -237768 85183 143588
12218 143588 254151 42624 128818 399810 346352 36667 252754 -8470 21009 408058 155573
12206 84300 184841 -185785 187393 51082 18776 232493 -37214 305458 40409 273647
12196 273647 72658 325331 -196962 186217 113787 105079 -32336 35477 9654 257332 -73773
12184 352286 -51794 -7410 62807 140190 -35014 260088 125236 -82803 205073 -29190 230730
12172 -937 123941 34443 -89103 105352 321463 424770 -17690 229462 147494 -32744 422422
12160 -133981 132756 237816 -79203 72345 117227 157394 87505 -178466 -191319 -162121 -147131
12149 -147131 171390 338041 213759 -149847 170155 -171408 266454 228196 -88367 -67840
12139f7840A39969F2231P5067c3555A51075M09469k20616j60829H6094e274l307
12128h581A27170a38305C3668i9914B48219K9607A04210a74051j9707c7651I4581
12116a15629m3324c3476I5459L1912M7313c2942A49654B5607O0416A1445J49201
12105A60646h3473k4560A5193K64110c17810a02291k2476B4793J5032J20213a69116
12093D1411Q4916c9877j98333B60281c0712k4238k01497a6046m3488o078m9106
12082a14718B14461a23019k3310O6874K2451K5846B81334L76378k20745O50065
12072A087032J13104B18187A04837n172a43477f719E1708L06181j56956h8120
12061A33422j3939A4832J37019B0723M09029a30221m11680A65717i9143A83813
$$ plain form
12139 -67840 139969 62231 137298 -33555 151075 560544 339928 179099 86094 -5274 -8581
12128 -8581 127170 -138305 33668 -99914 248219 277826 104210 -174051 -193758 -37651 94581
12116 -115629 -158953 -33476 95459 127371 174684 -32942 149654 25607 86023 11445 160646
12105 160646 -83473 -108033 15193 279303 -317810 -102291 -124767 24793 39825 160038 -169116
12093 41411 126327 -39877 -238210 260281 -30712 -54950 -256447 -16046 -59534 -65612 -114718
12082 -114718 214461 -123019 -146329 -79455 -57004 -31158 281334 657712 436967 1087032
12072 1087032 1200136 218187 104837 99665 -143477 -6719 51708 357889 200933 -88120
12061 133422 119483 14832 151851 20723 429752 -130221 -541901 165717 -99143 183813
12050C0911a61896N0660F7073J04666a74238B8924b67499e916k90171J27655a8047
12038a40862k9801A75300H7051h1146L9998k05333C07412c8710a5624A57218K45986
12027D03204b60534c0774j51973B54131a33277d612j14736r1340R6144a8818l7760
12016e6578C15960j16358o0895R9047o9131J34495a26623L4678K6147k65066J31731
12005a99133N3378C7072P3601l5715J13736J5857D6863b38591b0992j92191A3526
11993c75409A12362j2882J03511A1773O3348a85567D9183Q8147j1412D8456J26866
11982A75322a01318A08983d5285r292B65932O5178b39569A03891B747K81664b85103
11970c3411C80068A08702a16069d643A5405J27425P0284a39654E7592b56563C00495
$$ plain form
12050 30911 -161896 -111236 67073 171739 -174238 28924 -267499 -5916 -296087 -168432 -18047
12038 -140862 -170663 175300 87051 -81146 -41148 -246481 307412 -38710 -15624 157218 403204
12027 403204 -260534 -30774 -182747 254131 -133277 -4612 -119348 -210688 -114544 -18818 -56578
12016 -56578 315960 199602 138707 237754 168623 303118 -126623 -91945 -65798 -330864 -199133
12005 -199133 -145755 37072 110673 74958 188694 204551 46863 -238591 -20992 -213183 13526
11993 -375409 112362 99480 202991 11773 75121 -185567 49183 137330 125918 48456 175322
11982 175322 -101318 108983 -45285 -54577 265932 331110 -239569 103891 2747 284411 -285103
11970 -33411 380068 108702 -116069 -4643 15405 142830 213114 -139654 57592 -256563 300495
11958I0692b13971C94336b02505a6572I7111j4366a60762B90250a70305a7626
11947H2708h5041G1951O3325o0860g0483C4844a36267l120J931F1398A7779L76144
11935C93923f2176r5947c0244k4577A53430J62347b75218Q5100B29190j04335
11925A24855H76b18827h5852n6362G535a1481k11501D01350A0950d7272A88080
11913a0905m5099p8847j57628h3012j24667C34356e997B86535h6680A20337b08968
11901b24933F1073O850a2964A83277b91431a2210l8630A24294e2136l5894b8931
11889A995M9770J6417g1204j55485a03772k20860A27247B9772N9703a82626G5975
11877h2405k14747J01056C06627a79389E6064a7315j08922J2879d7002J6561b085
$$ plain form
11958 90692 -213971 394336 -202505 -16572 97111 82745 -160762 290250 -170305 -17626
11947 82708 -85041 71951 135276 74416 -70483 34844 -136267 -139387 -137456 61398 17779 393923
11935 393923 -62176 -158123 -30244 -54821 153430 315777 -275218 -190118 229190 124855
11925 124855 876 -218827 -85852 -142214 7535 -11481 -222982 401350 10950 -47272 188080
11913 -10905 -56004 -134851 -292479 -83012 -207679 334356 -5997 286535 -86680 120337 -208968
11901 -224933 61073 67923 -12964 183277 -291431 -12210 -50840 124294 -52136 -88030 -28931
11889 1995 51765 68182 -71204 -226689 -103772 -324632 127247 29772 89475 -182626 75975
11877 -82405 -297152 -196096 306627 -179389 56064 -17315 -126237 -113358 -47002 -30441 -2085
11865B23131a99102A57229b80849J21614L1372A44743b21558A12642m5287c47247
11854H9489k7184a04493m5207H486L56991e2517l47159c6119j51360A17476C0072
11842B41752b14660A09492b26659N7806O9063j8076D2711i3154j28701k2568D7259
11830A04879b64363a01566j79819J14443C5822K9202b7628A35207m3586M5560
11820A37181O8737i5703A45511b68961O641b820l7638j50965O2932A39603J83039
11809C22642g5392K7389l24461C15854p3235b71052A99854J68631a30727A0645
11798B5263J17078l5674j5021a40302H2843L81653j14412A14090a6330B28506
11787B18211p3908f4816k51643H1501b32055I2546L5234a90540c5080j29268M63
$$ plain form
11865 223131 -199102 157229 -280849 -159235 -127863 144743 -221558 112642 67355 -347247
11854 89489 62305 -104493 -149700 8486 365477 -52517 -399676 -36119 -187479 117476 30072
11842 241752 -214660 109492 -226659 -168853 -99790 -117866 42711 -93154 -221855 -244423 47259
11830 104879 -264363 -101566 -281385 -166942 35822 65024 -27628 135207 91621 137181
11820 137181 205918 -95703 145511 -268961 -262320 -2820 -40458 -191423 -128491 139603 322642
11809 322642 -75392 -48003 -372464 315854 242619 -271052 199854 368485 -130727 10645
11798 25263 142341 106667 91646 -140302 82843 464496 350084 114090 -16330 228506
11787 218211 144303 -64816 -316459 81501 -232055 92546 127780 -190540 -35080 -164348 -163885
11776a63885c4835B0753g3206j01590B24247c4316C9021b0272A51607c33633A04051
11764b3988r5914d0893m6564k60872d8911j38484j6805A12039R7351b1771B98640
11752I3198e0400m3190q7297B4316K2345b8472F7006b77108q7494d5623k9190
11741g4813A03581J33791m2145a8238B15492b23691j324A91783b44883A04972
11730B08721j4806a78350A39056c37213i7734d171A01750B2709m188i8128j3801
11719a11929B479M3782c1283A57449a42661A59869h4828k0094k2225j66141E0371
11707b18807E5020Q1081O0347e657G7933b01161h2941J7168I7263a35074k7364
11696a62438b0218A33945R7318f7713A01446e5817B0896K09767M7320a45734F3796
$$ plain form
11776 -163885 -34835 20753 -73206 -174796 224247 -34316 39021 -20272 151607 -333633 104051
11764 -23988 -119902 -40893 -87457 -348329 -48911 -187395 -204200 112039 209390 -21771 298640
11752 93198 -50400 -93590 -180887 24316 46661 -28472 67006 -277108 -364602 -45623 -74813
11741 -74813 103581 237372 195227 -18238 215492 -223691 -225015 191783 -244883 104972
11730 208721 193915 -178350 139056 -337213 -97734 -4171 101750 22709 18521 -98128 -111929
11719 -111929 2479 46261 -31283 157449 -142661 159869 -84828 -104922 -127147 -293288 50371
11707 -218807 55020 136101 196448 -5657 77933 -201161 -82941 -65773 97263 -135074 -162438
11696 -162438 -20218 133945 231263 -67713 101446 -55817 20896 230663 277983 -145734 63796
11684B27114a26584L9279D31505b17427i0414c0647j8997D6656J30826E9949h2675
11672D11165H4337N4552b1395j70951m140a0426k5458H6765O0540O6411J55438
11661C69154A03709J4505M6253F2035K8968f953n9118B14863L2177A11093p582
11650A03511M6799a61027A76475d0561o2886n7273I5051a09228k39641A2017N7078
11639F9095c98906C4880J01218c8535o595I0721h7647j32398d9656A271c6911
11627a50393B5176a80007d0316B9419N2560A8771K63610g260E8128N22485G1483
11615a22439b6158l0391C1108a99918A93631q2215l4700c31182a6526o6029g885
11603F0708e3067j63965A77113M549h9240b3076F92163d3899A88163r0210a80262
$$ plain form
11684 227114 -126584 -87305 431505 -217427 -90414 -30647 -49644 46656 177482 59949 -82675
11672 411165 84337 138889 -21395 -192346 -196486 -10426 -35884 86765 147305 213716 369154
11661 369154 103709 118214 164467 62035 91003 -6953 -66071 214863 247040 111093 103511
11650 103511 150310 -161027 176475 -40561 -103447 -160720 95051 -109228 -348869 12017 69095
11639 69095 -398906 34880 136098 -38535 -45130 90721 -87647 -220045 -49656 1271 -36911
11627 -150393 25176 -180007 -40316 29419 81979 18771 282381 -7260 58128 580613 71483
11615 -122439 -26158 -56549 31108 -199918 193631 111416 76716 -331182 -16526 -82555 -7885
11603 60708 -53067 -217032 177113 181662 -89240 -23076 692163 -43899 188163 97953 -180262
11591d4115k28643A67814L05484A14669N5465p6951J85191J9858a93142C66502
11580i9992F9723K6321K58419A20566J33772H4869J65588a41341A69820h0957
11569A78160E7072K40984r2142c4964B18892E1416a82622A78092Q655a84834g8152
11557c9225j08949a9791j50788g0944A3600L79754j16130c48010A93164m5733
11547A47431j3158b76048K1532A997K83419K0506a18638B87840B5083J13746a75493
11535a29337m8423A43031n737b03272F5302M9435O5923G6175g8717C5205L9234
11524G4439a22606A63365I988M0911J77430E554J94492d0823a7077m9230E274
11512A04603J74077k103j37269f2483C44094j51365K69256j87066h4320o7317
$$ plain form
11591 -44115 -272758 167814 473298 114669 170134 93183 278374 298232 -193142 366502
11580 -99992 69723 96044 354463 120566 254338 84869 250457 -141341 169820 -80957
11569 178160 57072 298056 205914 -34964 218892 51416 -182622 178092 186747 -184834 -78152
11557 -39225 -148174 -19791 -170579 -70944 13600 393354 277224 -348010 193164 147431
11547 147431 134273 -276048 -254516 1997 285416 305922 -118638 287840 25083 138829 -175493
11535 -129337 -177760 143031 137294 -203272 65302 114737 180660 76175 -78717 35205 74439
11524 74439 -122606 163365 9988 50899 228329 5554 200046 -40823 -17077 -66307 5274
11512 104603 278680 276577 139308 -62483 344094 192729 461985 274919 -84320 -151637
11502a51637I075g3736B9763j0257L15143L393A36309m1548b11767B45055l0338
11491B14717o856E0074c3970E34771B39616A06374b28879N1245C08974a74783
11480g0864a5679F2395J90601K06892B6001P2048N60830B21305a96245b5802A06201
11468a19847A7447L67815L7356H8783M180J49766B5633K9393k3962K5290M8312
11457A04666a83643E09429h8000B91042F7669B547K69047J31452a89938C9736
11446I5360a07078n1033a5566A96952a1438A18990Q2474o9834j7027E607M49670
11435D55277c4900C0872a06490A93896I2518a4382c66r4700D8594a82560G2380
11423H237N2614L5999b61307k54428C4173L22448j18915b23383G6998J57267a11364
$$ plain form
11502 -151637 9075 -73736 29763 19506 334649 338042 136309 94761 -211767 245055 214717
11491 214717 207861 50074 -33970 534771 239616 106374 -228879 -177634 308974 -174783
11480 -70864 -15679 62395 252996 459888 26001 98049 658879 221305 -196245 -25802 106201
11468 -119847 17447 385262 422618 88783 92963 242729 25633 55026 31064 56354 104666
11457 104666 -183643 509429 -88000 291042 67669 2547 271594 403046 -189938 39736
11446 95360 -107078 -158111 -15566 196952 -11438 118990 201464 131630 114603 5607 455277
11435 455277 -34900 30872 -106490 193896 92518 -14382 -366 -95066 48594 -182560 72380
11423 8237 60851 96850 -261307 -515735 34173 356621 237706 -223383 76998 234265 -111364
11411c36115G2691K4376j7892B9385J72543i9858B51675i1301A11271a63799E1238
11399G961J59142o8659f2875j35581A10264n1486e99988a46401E7735a10169k80878
11388c91047H8326c82594B00187p9416K74113A87262b95760D6993d1609a2931
11377a22420k3947C37729c48815i9384D0814h4088A5464a4754B5372d05534f9087
11365B86466b16733c7861D5585M3426i8611L020d7427q5581N1496p0309o9870
11354b21691B7846a7401A5227M3863a50862I0611b13561h7791C44930b54352C9216
11342d01676a29665C36163a1823A70752n7938D214a06641A21967a74898O1898
11332a13000j54995a02717D45015A10951c04788h6733A07247h3812C9607a48727
$$ plain form
11411 -336115 72691 97067 79175 29385 201928 -99858 251675 -91301 111271 -163799 51238
11399 7961 167103 98444 -62875 -198456 110264 58778 -599988 -146401 57735 -110169 -391047
11388 -391047 88326 -382594 200187 120771 394884 187262 -295760 46993 -41609 -12931
11377 -122420 -146367 337729 -348815 -99384 40814 -84088 15464 -14754 25372 -405534 -69087
11365 286466 -216733 -37861 45585 89011 -98611 -95591 -47427 -133008 -81512 -151821 -221691
11354 -221691 27846 -17401 15227 59090 -150862 90611 -213561 -87791 344930 -254352 39216
11342 -401676 -129665 336163 -11823 170752 112814 4214 -106641 121967 -174898 -113000
11332 -113000 -267995 -102717 445015 110951 -304788 -86733 107247 -83812 39607 -148727
11321B80532a20395A05251a70436B06334I5154Q0867J91344a79890A23089K9815
11311A52904b21087B60704a76781H2494c3909A32025c76086B45354E0882a66707
11300a10415k47290Q2634B92202j09784f1888C66037A00186f5507j98185L3915
11290b29777N4710h5563B14815D0566b165l6236j45498B29277q3578f9220j2450
11279h1670j1192L6231E9158b17530B3816J11685m0276a83908j10675J4176Q9736
11268a90671h836A22771L10946j80902b87962B34163J86767a92423q4561A19327
11257C866O8609h073H0726f0153k08761f3343H6500a94270M0766d7563A36415
11245a02835j0006j23710D7844a0381j3251k2166k06762f4695B37081e2125A24478
$$ plain form
11321 280532 -120395 105251 -170436 206334 95154 176021 367365 -179890 123089 152904
11311 152904 -221087 260704 -176781 82494 -33909 132025 -376086 245354 50882 -166707
11300 -110415 -357705 -275071 292202 182418 -61888 366037 100186 -65507 -263692 -229777
11290 -229777 -175067 -85563 214815 40566 -2165 -38401 -183899 229277 145699 -69220 -81670
11279 -81670 -92862 -56631 59158 -217530 23816 135501 95225 -183908 -294583 -280407 -190671
11268 -190671 -8836 122771 433717 252815 -287962 234163 420930 -192423 -276984 119327
11257 3866 72475 -8073 80726 -60153 -268914 -63343 86500 -194270 -153504 -47563 136415
11245 -102835 -112841 -236551 47844 -10381 -23632 -45798 -252560 -64695 237081 -52125 124478
11233B50524g779B52098b27456B79351D1927d2984m6536l28792c0640B70090b0928
11221A42126b84460P2837O5286f8602A81977b02710g8386n7467a8751j2018A19570
11209B02140I9644P1748a11693A14626K32272a07934D242J69356c0313b413j01962
11198a04375B42087b78415a18254J200C66731a00428A81787b23929K017n8243
11188b80155C6174J11337d6138k24431A98759H328D104a18773C7592G346b53261
11176e3450B4114O4904j9575A9756b63970k0611A3754f1892k2725J8388j28266
11165a94495A65274h6107k20309P9462E8464a3393k18680r2289H3286K79272c7321
11153I2342a66479F5394b35815h6p002K435A4700e7224A31838K6833h5971n7996
$$ plain form
11233 250524 -7779 252098 -227456 279351 41927 -42984 -89520 -418312 -30640 270090 -20928
11221 142126 -284460 -211623 -146337 -68602 181977 -202710 -78386 -135853 -18751 -30769 119570
11209 202140 99644 171392 -111693 114626 346898 -107934 4242 173598 -30313 -2413 -104375
11198 -104375 242087 -278415 -118254 -117054 366731 -100428 181787 -223929 -221912 -280155
11188 -280155 36174 147511 -46138 -270569 198759 8328 4104 -118773 37592 7346 -253261
11176 -53450 24114 89018 69443 19756 -263970 -284581 13754 -61892 -84617 -66229 -194495
11165 -194495 165274 -86107 -306416 -226954 58464 -13393 -232073 -324362 83286 362558 -37321
11153 92342 -166479 65394 -235815 -86 -7088 -4653 14700 -57224 131838 158671 -85971 -143967
11141a43967J8549A87273a34335B63870A531Q3583b04067A73916o7090B9585O0903
11130I0488l1704q377Q6914b1220l633j30387B63814a67474m6560e0752b331B4921
11117d1415E0374J1018G085K87995K2115a47041K2083J6792o211b357A68744O054
11105A74798P2888i5111I9595i9933B95106L66397c18955F7926f1372B22841R7914
11094C20755P6251d7486C44126o1670p8595K29602B5263K37598O5390o4534L0026
11083B93743l4301J73592A68019d7201D64362f686C12463k3720j18163J11910
11073B82490L1935o5006o9785k6429J05159O5692O5532A26161m9411L69479L64302
11062H10531C99545A91891L52889j8272m8878K27062k6798k16453j16886K75462
$$ plain form
11141 -143967 -125418 187273 -134335 263870 1531 85114 -204067 173916 106826 29585 90488
11130 90488 58784 50407 137321 -21220 -24853 -155240 263814 -167474 -214034 -50752 -2331 24921
11117 -41415 50374 61392 7085 295080 317195 -147041 -124958 -108166 -114377 -2357 168744 174798
11105 174798 247686 -95111 99595 -99933 295106 661503 -318955 67926 -61372 222841 320755
11094 320755 397006 -47486 344126 282456 203861 433463 25263 262861 328251 263717 293743
11083 293743 259442 433034 168019 -47201 464362 -6686 312463 288743 170580 282490
11073 282490 314425 249419 179634 153205 258364 324056 389588 126161 76750 446229 810531
11062 810531 399545 191891 544780 526508 477630 704692 677894 461441 344555 620017
11052F20017j19244N02969m26482J2019J04750k10756B27703M64272L1863k51652
11042D72186J01677K39002N0860l24268J13948K28027j96042k28193M10498j78099
11032F89596m8273M40395n06104J67246q3745j26727J21946N1865p4985J3375
11022F44589K38851k68286J31589j24721J73599j31828r3457j68090M04606l02621
11012E04231q0920J01966r8178M4145J60541p0791k26264L09908l9655L25181
11002I30164k83650J52045k51567K66007j10311k18468N835J99756k18142M16536
10992H88205j18080P3971p931j683j27156J73586L3998L06966j39867n0641M5343
10981A076711K26208L08914l19875L90169J32580J59625K2326L53916L02169J9558
$$ plain form
11052 620017 500773 1003742 577260 589279 694029 483273 227703 691975 723838 472186
11042 472186 573863 812865 863725 539457 653405 881432 685390 457197 867695 689596
11032 689596 641323 1081718 575614 742860 659115 532388 654334 706199 631214 644589
11022 644589 883440 615154 746743 622022 795621 663793 570336 402246 806852 504231
11012 504231 423311 525277 427099 471244 631785 560994 334730 644638 604983 930164
11002 930164 646514 798559 546992 812999 702688 484220 490055 689811 471669 888205
10992 888205 770125 844096 836165 834482 707326 880912 914910 1221876 1082009 1031368 1076711
10981 1076711 1302919 1611833 1291958 1682127 1814707 1974332 1996658 2350574 2652743 2672301
10971B672301J5469j51487m49935J27458m70213J26122M6841j1964l77364j3617
10961A513611N22948j74841O1263l56764L13289k49643J7113j5440j73486j0424
10951A447626j47282n18106k56427k55486M19435A84722K29623j5347A27528J64255
10941B91783j39426G3551K48661j50328C6914g8703c0879C36902b4436J2D89607
10929H4326b98173f4467K4109k40501b6084A43904L509b41823e269k7499j76148
10918b08916B60153A8513J46078P7465A16214a31585D6381a13216N1162B13835
10907b05729E5506L0774Q289b87701O2732P3464B76595a24029A2562L2684h6102
10895A98590b57158c3429B42463l4796a14253m0530d1602q6034E8197Q9302h6139
$$ plain form
10971 2672301 2687770 2536283 2086348 2213806 1743593 1869715 1916556 1904592 1527228 1513611
10961 1513611 2036559 1861718 1922981 1566217 1879506 1629863 1646976 1631536 1458050 1447626
10951 1447626 1300344 782238 525811 270325 689760 184722 414345 398998 127528 291783
10941 291783 152357 73551 322212 171884 36914 -78703 -30879 336902 -24436 -24424 489607
10929 84326 -298173 -64467 -40358 -280859 -26084 143904 147413 -241823 -5269 -32768 -208916
10918 -208916 260153 18513 164591 242056 116214 -131585 46381 -113216 -62054 213835
10907 -205729 55506 86280 94569 -287701 -224969 -151505 276595 -124029 12562 45246 -86102
10895 198590 -257158 -33429 242463 207667 -114253 -154783 -41602 -127636 58197 147499 -86139
10883G7205b59516A14776b51039C8994b41935a08325o7305L1140O6429C17538
10872C68517d9850R151I4850j652K55787a092l89768R7049g2068j67297A61242
10860a19615J8056A32424F2422c130A11847e6230j25998B06128F597J37131a40485
10848f9982j0609I9401N6306J13058a04733p8024B95760a6881k12722n0452Q9119
10837a90936D42856h2698b2337j11656C1921e285E6527O2688P9593o9798a36433
10825A20893E201a1422l33235f8885r0599n6685d9811K502G3106a27435C6365
10813A76325q0755h9310A80039o7931d4429j78697g4380G0113J04632a12289j09511
10802b21800B41071H7277e1603G5997D141J67008b97486a5001n0999p8614l0733
$$ plain form
10883 77205 -259516 114776 -251039 38994 -241935 -108325 -175630 -144490 -78061 317538
10872 368517 -49850 -40699 94850 93198 348985 -1092 -390860 -293811 -72068 -239365 161242
10860 -119615 -101559 132424 62422 -3130 111847 -56230 -182228 206128 6597 143728 -140485
10848 -69982 -80591 99401 155707 268765 -104733 -182757 295760 -16881 -229603 -280055 -190936
10837 -190936 442856 -82698 -22337 -133993 31921 -5285 56527 119215 198808 129010 -136433
10825 120893 5201 -11422 -344657 -68885 -159484 -216169 -49811 -47309 73106 -127435 36365
10813 176325 95570 -89310 180039 112108 -44429 -223126 -74380 70113 174745 -112289 -221800
10802 -221800 241071 87277 -51603 75997 4141 171149 -297486 -15001 -66000 -144614 -175347
10791a75347E0577a21673j00781E0906a80125n5445B26934r9637a94978c5547
10780A94087b23554r4075j6190r70Q0670O8069F4678a09997A4080a45300B75460
10768F6321R6821b35407j04760A16845j5159R4034b88020A54278a04885i526B31874
10756A90643f703A3491K28789b69280A92794E8998a05950J9304A25302J87067
10746C12369I5632K59012G7040B8597h0451H2549i8610j08893k8739m5043P4486
10735b06799g1594j04119A21829a8777A32634c08022C11467K6086d7787B15782
10724d3968f669m4685r2424b3701j35798j14994h8025j78622I406J09278d5171
10712A79003b66027a6713e531A69755D034g4960B29793A02797e2635j40931b7361
$$ plain form
10791 -175347 50577 -121673 -222454 50906 -180125 -235570 226934 127297 -194978 -35547
10780 194087 -223554 -317629 -333819 -334789 -254119 -186050 64678 -109997 14080 -145300 275460
10768 66321 163142 -235407 -340167 116845 101686 195720 -288020 154278 -104885 -9526 231874
10756 190643 -6703 13491 242280 -269280 192794 58998 -105950 -86646 125302 312369
10746 312369 95632 354644 77040 28597 -80451 82549 -98610 -207503 -236242 -281285 -206799
10735 -206799 -71594 -175713 121829 -18777 132634 -308022 311467 337553 -47787 215782
10724 -43968 -6669 -51354 -143778 -23701 -159499 -274493 -88025 -266647 9406 118684 -45171
10712 179003 -266027 -16713 -5531 169755 4034 -74960 229793 102797 -52635 -193566 -27361
10700A59814c48405B71508a15938B7949a1662A89978c14648a03072j43851g9755
10689a66939N8255C07332d0674A73068b35639B34210q3661F6130a69188m6832
10679b16020B97279d4614q8048D5204g9121o3610A03628f8796A4769K5244i1214
10667a34493r5628a8437B43566g9939n5207p3347A68926b00573A95404C1368b57661
10655b81702A97153J6492b18363j21869a46856m9397I6670b27506R8592q7309
10645b16223N7036F1878J02036o5601a15110F191a05437q6826f361j16645G7336
10633g1551E9271K46237b70081p5953a83l6175k54200A95132a53991l1956h2490
10621C6407K34656j30552a10297K4233j29084B23275b09718H4274e898F3840Q538
$$ plain form
10700 159814 -348405 271508 -115938 27949 -11662 189978 -314648 -103072 -246923 -79755
10689 -166939 -108684 307332 -40674 173068 -235639 234210 150549 66130 -169188 -216020
10679 -216020 297279 -44614 -132662 45204 -79121 -142731 103628 -68796 14769 40013 -91214
10667 -134493 -230121 -18437 243566 -79939 -135146 -208493 168926 -200573 195404 31368 -257661
10655 -281702 197153 213645 -218363 -340232 -146856 -196253 96670 -227506 -128914 -216223
10645 -216223 -159187 61878 163914 98313 -115110 6191 -105437 -192263 -6361 -123006 77336
10633 -71551 59271 305508 -270081 -346034 -183 -36358 -290558 195132 -153991 -185947 -82490
10621 36407 271063 140511 -110297 -86064 -215148 223275 -209718 84274 -5898 63840 72378
10610G2378l3259a06133n12440e549j17851m5392B7168a25689c391D857b69430
10598a966I1500R0301c1050k0099j50201h2379E4561b4407j94779M8379B84826
10586c6382A11538h1992c8154r1491n6122k11137C3526K39586b60077a29120G1806
10574A18797b38096p8995A95894f2711A79751b06556B16587c05706a04433K6326
10564g8107p5924l7416B80709a34412j85829J44051L9041m5752k3215b5454B09802
10552a68932P1588D0151a06067M4986J9086j91819e8643a7805p4564j50029A97542
10540H281a61421a1603A9661b09580A24681m5979b00223B68393a41693C0121a65334
10528b0128r978q7649F3577a91608M2296A76861a05565A85587i2200r6717h121
$$ plain form
10610 72378 39119 -106133 -618573 -5549 -123400 -168792 27168 -125689 -3391 4857 -269430
10598 -1966 91500 181801 -31050 -51149 -201350 -82379 54561 -24407 -219186 -170807 284826
10586 -36382 111538 -81992 -38154 -129645 -185767 -396904 33526 273112 -260077 -129120 71806
10574 118797 -238096 -317091 195894 -62711 179751 -206556 216587 -305706 -104433 -78107
10564 -78107 -154031 -191447 280709 -134412 -320241 -176190 -137149 -182901 -206116 -25454 209802
10552 -168932 -97344 40151 -106067 -61081 -41995 -233814 -58643 -17805 -92369 -242398 197542
10540 8281 -161421 -11603 19661 -209580 124681 78702 -200223 268393 -141693 30121 -165334
10528 -20128 -30106 -117755 63577 -191608 -149312 176861 -105565 185587 -92200 -188917 -8121
10516f1621A54276J12014J0776L2821a99465f9971H7057b48283C70503j3053F5798
10504a60245k21531J55608a4874B59913d43299a09223A11986m6168a03264a875
10493b5580p5844J3446H4873N5655J14054j25929J79991D6979N0593Q0243K11426
10482C89241J59113j76469n9754E9596K73115J9319j44119a4044A63882K3632
10472A87514L2283I8039b08873C40428g0439j3327A18169c1703j41428m2170C431
10460A5048b91208N669e6772B1952J44334a55572C51460A10605j7167K6670g2487
10448A34737P3223f2708A38786A2110b1446A41713o2615e3048j49753B7798a01102
10436A15881a37963C10633I0406e8639p4344H0826J55899b73710a31124G3178
$$ plain form
10516 -61621 154276 266290 277066 309887 -199465 -69971 87057 -248283 370503 357450 65798
10504 -160245 -381776 -226168 -14874 259913 -443299 -109223 111986 65818 -103264 -1875
10493 -25580 -101424 -87978 84873 140528 254582 128653 308644 46979 97572 177815 389241
10482 389241 548354 371885 312131 59596 332711 352030 207911 -14044 163882 187514
10472 187514 219797 98039 -208873 340428 -70439 -83766 118169 -31703 -173131 -215301 3431
10460 15048 -291208 -285539 -56772 21952 166286 -155572 351460 110605 93438 120108 -72487
10448 134737 207960 -62708 138786 12110 -21446 141713 79098 -53048 -202801 27798 -101102
10436 115881 -137963 310633 90406 -58639 -132983 80826 236725 -273710 -131124 73178
10425a8590k83243L3230B43936c10863G5743B7766K15327b01489q867f2290m74658
10414e36948a99046K5841h1968l6671d668j72158l6609h5355o2917N7693l3531
10403a24110B05370c21402J41121g3448A06707d080E7088b70981a20716B40457
10392A7251J93500a53759E6429a02758B60147f1854B43086a60371A16889Q7155
10382B04044K2159E7092B0526K09287O3792a99192F0416k0088J93242J6275J80202
10371D30047j59285A00544J66688n485p3357P3683M33127C22525J20352d100B75390
10359A9376N4003J8659Q8380n2243p893K15580j2421K15224J8944n5190q7775
10348D14644K0516K38148j09032A64490L7794K02005j86560N3432G7756L55019
$$ plain form
10425 -18590 -301833 -268603 243936 -310863 75743 27766 243093 -201489 -210356 -62290 -536948
10414 -536948 -199046 -173205 -81968 -118639 -4668 -176826 -213435 -85355 -148272 -90579 -124110
10403 -124110 205370 -321402 -180281 -73448 106707 -4080 57088 -270981 -120716 240457
10392 17251 210751 -153759 56429 -102758 260147 -61854 243086 -160371 116889 204044
10382 204044 226203 57092 20526 229813 293605 -199192 60416 40328 233570 249845 430047
10371 430047 270762 100544 267232 261747 188390 262073 695200 322525 442877 -4100 275390
10359 19376 73379 92038 180418 128175 120282 335862 323441 538665 557609 502419 414644
10348 414644 435160 673308 564276 164490 202284 404289 217729 271161 77756 432775
10338D32775A91006K39960f1608A62610b50882I2123e2264H2172B0016K37066
10328B57082i2992A4362a3886A18770J62441r7063P4089d9004I9914L1801i4120
10316a18231D78553E9900b27320I9351O5847D2458c07099A93458g2575J0731j06887
10305a68731E1475J7117M8342A3823a27j56898O2397D722O7970a88233c18F6982
10292B8160J6321Q0313i4021p9217A29541J5723a33210j31495I812f5919n07530
10281e73449b55817j45394h5723r101A1841Q1458K8869L1232j915a40180I0860
10269a51322d4111k34226B16916c32608A71799a91676I5768Q2099a1371B31702
10258D07570A78150h505B40627J49291I3725B6047J69691R906r2285L661h04B8693
$$ plain form
10338 432775 191006 430966 -61608 162610 -250882 92123 -52264 82172 20016 257082
10328 257082 -92992 14362 -13886 118770 281211 184148 258237 -49004 99914 131715 -94120
10316 -118231 478553 59900 -227320 99351 165198 42458 -307099 193458 -72575 -61844 -168731
10305 -168731 51475 68592 116934 13823 -127 -157025 -94628 4722 72692 -188233 -318 66982
10292 28160 44481 124794 -94021 -173238 129541 145264 -133210 -264705 9812 -65919 -573449
10281 -573449 -255817 -401211 -85723 -94824 11841 93299 122168 153400 151485 -140180 90860
10269 -151322 -44111 -278337 216916 -332608 171799 -191676 95768 177867 -11371 231702
10258 407570 178150 -8505 240627 389918 93725 26047 195738 205644 113359 117020 -804 28693
10245F2491J61412C1077P4256c69344i2565E6655B2114P1122Q7778a09545j15737
10234b25282O9730F0252R532b69688I6197b92359f7439J8092j34160L0529k4767
10223a77745j32189J44650M7814b8419B15913e0672m4979B6596a19596b1537G092
10211A5889a0145G2213c08606A48810o7544a63824H626h2689D4188d2901k083
10200d4984A95829J52716b3091E5592c13352J33404L4280J3674G7748l556b27860
10188d4332R768F6762K7264a63327A947a75827N058D2204J47602D5252a91100
10176b33517a4366k92883a11793k4321a2934o7696j441n6170n7486d3859j2395
10165e6254n0706n3071b6775n1114j43567j04399c312p6288C0230L9285g0481
$$ plain form
10245 62491 223903 31077 105333 -369344 -92565 56655 22114 93236 181014 -109545 -225282
10234 -225282 -155552 60252 69784 -269688 96197 -292359 -67439 -49347 -183507 -152978 -177745
10223 -177745 -309934 -165284 -117470 -28419 215913 -50672 -95651 26596 -119596 -21537 7092
10211 15889 -10145 72213 -308606 148810 81266 -163824 8626 -82689 44188 -42901 -44984
10200 -44984 195829 348545 -23091 55592 -313352 -179948 -145668 -131994 77748 74192 -227860
10188 -44332 -34564 66762 94026 -163327 1947 -175827 -170769 42204 189806 45252 -191100
10176 -233517 -14366 -307249 -111793 -136114 -12934 -80630 -82071 -138241 -195727 -43859 -56254
10165 -56254 -106960 -160031 -26775 -77889 -221456 -325855 -3312 -79600 30230 69515 -70481
10153a77180B64061F6531b34253d5859b1056A30200f5166j05708K1860E2511a69987
10141B37669c57631J59957j82103i7806A24293Q1034c56391b3835A57718a34403
10130b00589B28135b35144r6120f0750k86007j59525A73947A9637b7887n3126
10120h1013B26211D1849b75219a11600k35618A83116Q7864a28015K5392j71562
10110b74185R0790j09548D5149Q9265E8737e17559B11284g8221q5431j32937J25561
10099a71028A23896a22560H8934D3373e8256m0742C54023d77970a76943c2378
10088F7624a92925g3046G1144c52411K6748K1685J46134A20333a47874A27441
10077a19885B27383b59382j76812A75211F5816k7836j7509J85234m9212o9806
$$ plain form
10153 -177180 264061 66531 -234253 -45859 -21056 130200 -65166 -170874 -149014 52511 -169987
10141 237669 -357631 -197674 -379777 -97806 124293 205327 -356391 -23835 157718 -134403
10130 -200589 228135 -235144 -331264 -60750 -346757 -506282 173947 19637 -27887 -81013
10120 -81013 226211 41849 -275219 -111600 -347218 183116 270980 -128015 -102623 -274185
10110 -274185 -183395 -292943 45149 134414 58737 -517559 211284 -78221 -163652 -296589 -171028
10099 -171028 123896 -122560 88934 43373 -58256 -98998 354023 -477970 -176943 -32378
10088 67624 -192925 -73046 71144 -352411 -325663 -303978 -157844 120333 -147874 127441
10077 -119885 227383 -259382 -436194 175211 65816 37980 20471 205705 156493 86687
10067H6687a31890E7915O3520Q0272b45918c8375A86037a40046O5367k34081B7746
10055A7274c33286J45517B7105g6807N312A93906r3784h6930Q856n1478e9074
10043d1644k85558A62090c11379h6807l50917I6413P7152a39795j47742I7578
10032g266k06881d1249q6798j57017J31155D8225b61007A17730n6566a81337B3074
10020b64659J18270k1616n6440a8117F5897a17585j09579j13645B560J5082g7729
10008d1940j91574b9018j70270m8456C1808b74639e461A50723b22457f8635I5811
9996B33636I797b31384C1205b17521q993A00473b15175r5093o57a6098A21020
9984e8271n8402j76268A06426c1989K348G0007h6687a071k56503Q5861j07987
$$ plain form
10067 86687 -131890 57915 121435 201707 -245918 -38375 186037 -140046 -74679 -308760 27746
10055 17274 -333286 -187769 27105 -76807 -71495 193906 100122 -86930 -78074 -129552 -59074
10043 -41644 -327202 162090 -311379 -86807 -437724 96413 173565 -139795 -287537 97578
10032 -7266 -214147 -41249 -128047 -285064 -153909 48225 -261007 117730 61164 -181337 23074
10020 -264659 -146389 -168005 -224445 -18117 65897 -117585 -227164 -340809 2560 17642 -77729
10008 -41940 -233514 -29018 -199288 -247744 31808 -274639 -5461 150723 -222457 -68635 95811
9996 233636 9797 -231384 31205 -217521 -226514 100473 -215175 -310268 -310925 -16098 121020
9984 -58271 -116673 -292941 106426 -31989 -29641 70007 -86687 -1071 -257574 -171713 -279700
9973b79700j22185g1596j11840J3745A41555L2748a88698p0160C493f4328j23849
9962a88177B57196E1126R399l720d23454a0875j86688A30117a73939P0383a1823
9950a3064A02833a73408l93391C47098a30682m2595M6815j46728M6864H6496k9241
9939E7255a47337a6865A39259c9326I884a07237M6587b901j66488f403j43221
9928a49624A91083H4045d74386b13448A36412l4392c59847a60525K5608M6806
9918h8111q1634A7040d9067k14155k11299a96427O3192A25309c0782k23773j15545
9907c70100a25576j99760a34810L7898l04483J96639g3912B14321E1450h4809
9896a74023l7083H28K02695b80295B39868A8217L90171c39457a60066K4046f2504
$$ plain form
9973 -279700 -401885 -71596 -183436 -169691 141555 174303 -188698 -258858 3493 -64328 -188177
9962 -188177 257196 51126 60525 56805 -423454 -10875 -197563 130117 -173939 -103556 -11823
9950 -13064 102833 -173408 -566799 347098 -130682 -173277 -126462 -273190 -226326 86496 57255
9939 57255 -147337 -16865 139259 -39326 9884 -107237 -60650 -2901 -169389 -6403 -149624
9928 -149624 191083 84045 -474386 -213448 136412 102020 -359847 -160525 -134917 -88111
9918 -88111 -169745 17040 -49067 -263222 -474521 -196427 -133235 125309 -30782 -254555 -370100
9907 -370100 -125576 -325336 -134810 -96912 -401395 -204756 -73912 214321 51450 -84809
9896 -174023 -211106 828 203523 -280295 239868 18217 408388 -339457 -160066 -136020 -62504
9884g939k5782B4439P817J39459j0360d7764A24010a21814j11694h3478m8037
9873a31515o0048j20173G9653d2184j04931M8074j37280e2559k67708a08941c7976
9861I9144c76325A12160a80120j5224N523d8062j46814L9364J6799m2249F4073
9849b96958a25793A85627a09900A09353b45613Q4338D7238a2744A16328e6563
9838c99674J98994q1610e4661k00293A38522b1718G5732i6713j61525p8349P7744
9827b58843A82338a18012B21415H7195b76136D5916h3355l00625J61508a6784
9816a81622R0659O028i966H4004b41623m9334c8054j72874A10359J6644K82234
9805D09237b92434C0302b81588C24081a05089j09462d9315o7580m1366f6088Q074
$$ plain form
9884 -7939 -33721 24439 32256 171715 161355 -47764 124010 -121814 -233508 -83478 -131515
9873 -131515 -191563 -311736 79653 -42184 -147115 -99041 -236321 -52559 -320267 -108941 -37976
9861 99144 -376325 112160 -180120 -195344 -189821 -48062 -194876 -155512 -138713 -180962 64073
9849 -296958 -125793 185627 -109900 109353 -245613 -161275 47238 -12744 116328 -56563
9838 -399674 -200680 -282290 -54661 -254954 138522 -21718 75732 -96713 -258238 -336587 -258843
9827 -258843 182338 -118012 221415 87195 -276136 45916 -83355 -383980 -222472 -16784
9816 -181622 -90963 -84935 -9966 84004 -241623 -290957 -38054 -210928 110359 127003 409237
9805 409237 -292434 30302 -281588 324081 -105089 -214551 -49315 -116895 -158261 -66088 -58014
9794e8014a5735B52551l4579G8909a3988A17738h7007j6492B13726E6633M0046
9783I6679a19174b9329L265m01137D733e5357n2067k7586A8667r275K37307H6146
9770I5617i5449j52812g6327c6025C8248a60656f1011E0969a34354d6466H724
9758A42673Q492E6948g5968L648k74870i179B33139c20722C1347L6506G799a0164
9745a6578A68260b08093a3491j99375m5430q0700i5763j9462l4991f5101j79901
9734b45002A06405a17766M2614p644j05092l43794J23525D1876J12934b9438A7510
9722a70681k934A02261c19507a5440k13669A1492g1134o2194F6930b17901G274
9710g7403r2725N3922o650b6871k45144Q6974l02592a39646A10587q633D9278
$$ plain form
9794 -58014 -15735 252551 217972 78909 -13988 117738 -87007 -103499 213726 56633 96679
9783 96679 -119174 -29329 -26064 -427201 4733 -55357 -107424 -135010 18667 9392 246699 86146
9770 95617 -95449 -248261 -76327 -36025 38248 -160656 -61011 50969 -134354 -46466 8724
9758 142673 151165 56948 -75968 -72320 -347190 -9179 233139 -320722 31347 67853 7799 -10164
9745 -16578 168260 -208093 -13491 -212866 -258296 -338996 -95763 -115225 -150216 -65101 -245002
9734 -245002 106405 -117766 -75152 -82796 -187888 -531682 -408157 41876 154810 -29438 17510
9722 -170681 -173615 102261 -319507 -15440 -229109 11492 -71134 -133328 66930 -217901 7274
9710 -77403 -170128 -116206 -122856 -26871 -272015 -185041 -487633 -139646 110587 101954 49278
9698E1884a04184B12923c02111M9655M6143g1268k73014g4274B09476d7470H1362
9686a47831r0027C80496d01441D4278K43492j10471k4948C9557e3741B46789g9003
9674G8916J39248a56788j50685A9232J24543i0447A60652d15483R6955A23631
9663h612I4352b55206E272a22803A03383K45663d0076D4910i0329k95856E1435
9651b00165M8748k25330J58867G9725a11592D0064a03656B2410E138c34571J17713
9640b16858A33136a51742J7673F9682c19136L7017B06187r1651a22072c2829A80557
9628a40073G830J37134d86928c0936A87022c8570D1781b47767e8933k12651Q0076
9617a91508o8658D7066J77239b57083a9451k7360j50403j04257a15870g555k09291
$$ plain form
9698 51884 -104184 212923 -302111 -252456 -206313 -71268 -344282 -74274 209476 -47470 81362
9686 -147831 -237858 380496 -401441 44278 287770 177299 152351 39557 -53741 246789 -79003
9674 78916 218164 -156788 -307473 19232 143775 -90447 160652 -415483 -318528 123631
9663 -8612 94352 -255206 5272 -122803 103383 349046 -40076 44910 -90329 -386185 51435
9651 -200165 -151417 -376747 -217880 79725 -111592 40064 -103656 22410 5138 -334571 -216858
9640 -216858 133136 -151742 -134069 69682 -319136 -282119 206187 114536 -122072 -32829 180557
9628 -140073 7830 144964 -486928 -30936 187022 -38570 41781 -247767 -58933 -271584 -191508
9617 -191508 -260166 47066 224305 -257083 -19451 -46811 -197214 -301471 -115870 -7555 -216846
9606b16846b7650j34208k58101E8659J00447p6948c1685k65222C3843d9737F9322
9594G2726L4209m6742a0412C9098a9724j40220D3110b69114c0542q8528n7855
9583a76925G3414b42629B04073g1097m319b4085l7662r7008k3600A02624i157
9571c2498m1230K7252j50618Q8302l5058k36050a43133J7711A6171b99333P02
9560b98631A15758g2131B41871D2833O3458b16240d9831O099j68889N1726k51793
9549d12688d6589K1370j98652A60913b24455g4333j17375A65417a62049A1370
9538C30652a05877g87k49238b2260H6847i2770A15945D849J13452a11874j84702
9527b96576c8074J0096N220j16413D0495a15408I9907A6323D712O1101d15240
$$ plain form
9606 -216846 -27650 -161858 -419959 58659 159106 82158 -31685 -296907 33843 -49737 69322
9594 72726 106935 60193 -10412 39098 -19724 -159944 43110 -269114 -30542 -119070 -176925
9583 -176925 73414 -242629 204073 -71097 -75416 -24085 -61747 -158755 -182355 102624 -9157
9571 -32498 -73728 -46476 -197094 -108792 -143850 -379900 -143133 -125422 16171 -299333 -298631
9560 -298631 115758 -72131 241871 42833 106291 -216240 -49831 -43732 -212621 -160895 -412688
9549 -412688 -46589 -25219 -223871 160913 -224455 -74333 -191708 165417 -162049 11370
9538 330652 -105877 -787 -250025 -22260 86847 -92770 115945 4849 118301 -111874 -296576
9527 -296576 -38074 -27978 -22758 -139171 40495 -115408 99907 16323 4712 65813 -415240
9515e215A16637k3016K13994b5296D9230L0094b03392A4196b05366c7767q4583
9504a22350p0204j52169g5100l964L7530k32569b6540r1276p1957D228a16635
9492a9278j15968F260J4282c0724j45372A30852b01687G1401c59558A19154h4508
9480A80116c72418b6767A55146n5867l7029J20869d7596B60861h4676K8975j53186
9469b08887P1271K0916B18743a44864p1042B8124j0332M21182b08801F5137K2219
9458H7356d2219j02329g0851A45584a06474A25940b24806q904J5774J01749k87931
9447d04118A87682m7684a58946e3851B70271K1433C3897Q9234a10598A95232q0611
9436A14621b78092C31687a65310M9331j6301N3135q6343O3795l5580l07358A3740
$$ plain form
9515 -5215 116637 93621 307615 -25296 49230 79324 -203392 14196 -205366 -37767 -122350
9504 -122350 -192554 -344723 -75100 -79064 -41534 -274103 -26540 -117816 -189773 4228 -116635
9492 -19278 -135246 6260 20542 -30724 -176096 130852 -201687 71401 -359558 119154 -84508
9480 180116 -372418 -26767 155146 99279 62250 183119 -47596 260861 -84676 -55701 -208887
9469 -208887 -137616 -116700 218743 -144864 -215906 28124 17792 438974 -208801 65137 87356
9458 87356 -42219 -144548 -70851 145584 -106474 125940 -224806 -233710 -217936 -116187 -404118
9447 -404118 187682 139998 -158946 -53851 270271 291704 33897 123131 -110598 195232 114621
9436 114621 -278092 331687 -165310 -115979 -132280 -79145 -165488 -101693 -137273 -444631 13740
9424h3750N845j22519A53690f53388b50119A67867c31729K2487F109a82090g769
9412a62700A95136b75286a0191l3305B9411a67060b91C4655c14914H571J97181
9401B05752d52184Q7902J76022B03826h6753k0545l3683A36446n4879l2J71969
9390B53504a39084j85298C71977b12504M1872P7999A09189P881b2196j64957A09036
9378C5326J0711b47588L1257A93832a1302k17729A1554a74990k584B09764O1025
9367B70789C3579a71102G8276e46511A11490f3518r9660A28204d60436a16657
9356a13193k29266C1787b44228J06428j01077A33490J06176a44865g1305a5611
9345c71119i1278d4088k1493j2630O922B98383A30939b83876J13573G3929a2456
$$ plain form
9424 -83750 -77905 -200424 153690 -653388 -250119 167867 -331729 -309242 6109 -182090 -7769
9412 -162700 195136 -275286 -10191 -43496 29411 -167060 -291 34655 -314914 8571 205752
9401 205752 -452184 -364282 -188260 203826 -86753 -107298 -140981 136446 81567 81535 253504
9390 253504 -139084 -324382 371977 -212504 -170632 -92633 109189 117070 -22196 -187153 109036
9378 35326 46037 -247588 -216331 193832 -11302 -229031 11554 -174990 -177574 209764 270789
9367 270789 33579 -171102 78276 -546511 111490 -63518 -163178 128204 -460436 -116657
9356 -113193 -342459 31787 -244228 -137800 -238877 133490 239666 -144865 -71305 -15611
9345 -371119 -91278 -44088 -65581 -78211 -71289 298383 130939 -283876 -170303 73929 -12456
9333b68068J30465j26939j335F865L34495b82120G7334J79612E024J08034g5913
9321a02670j10914g4328k50124A45891b82065B52551a90578H3271K3341a09671
9310b8811j16120n7270N5915A59266i2491a3818B86247C321a53998G0090L28875
9299C98965f6447i992k11412A42966i5235A20689C8180A5385d3562J4794k1876
9288e0644k3483K3441k98065a23721I0702L2912a84110D0456a16133o1564B04188
9276a61524k48326A86075d954j57829A12137M06422e0809j37840P85J647D20263
9264A04006e0611B05236p6792J29777f9027B14J14216a10155m5026C36168c1827
9252e579j10193C44904b89850a11186H8117k1028J6939d16956A69370j9375J61118
$$ plain form
9333 -268068 -137603 -264542 -265877 6865 341360 -282120 77334 256946 5024 113058 -75913
9321 -102670 -213584 -74328 -324452 145891 -282065 252551 -190578 83271 106612 -109671
9310 -28811 -144931 -202201 -146286 159266 -92491 -13818 286247 3321 -153998 70090 398965
9299 398965 -66447 -9992 -221404 142966 -95235 120689 38180 15385 -43562 -28768 -50644
9288 -50644 -74127 -50686 -348751 -123721 90702 123614 -184110 40456 -116133 -177697 204188
9276 -161524 -409850 186075 -4954 -162783 112137 518559 -50809 -188649 -187864 -186217 420263
9264 104006 -50611 205236 128444 258221 -69027 214 114430 -110155 -155181 336168 -31827
9252 -5579 -115772 344904 -289850 -111186 88117 67089 84028 -416956 169370 149995 311113
9241C11113c06719B04175H8981L3049m1722c62578J30216P9193O2190k03426R5757
9230a98648Q9454j53649m1781b2120D8195a50153H2987J3002i2213A26538b9629
9218a34262C7788J14869a8556q0412B95121a77720p3711N543M5640A44869i8338
9206B40931A9233b91541j52996A37042J47409d0504k79129a3216k75898j49836
9196d38950a5841j1606B53250b24650A951J89361E512Q0633a09325J1772A58458
9184A06536g2176k19313o996i6475j56996a4856j74176n2689A14440a80392m7710
9173b28102A38446e48884K22570a23613A95411o0149F400b57293G4693a28615
9162b4740k76076A70518e3118p874C3913K08027a98786A14663g0249j1326b0824
$$ plain form
9241 311113 -306719 204175 88981 122030 80308 -362578 -232362 -153169 -90979 -294405 -198648
9230 -198648 -109194 -262843 -304624 -22120 48195 -150153 82987 95989 -92213 126538 -29629
9218 -134262 37788 152657 -18556 -98968 295121 -177720 -251431 -245888 -200248 144869 -98338
9206 240931 19233 -291541 -444537 137042 284451 -40504 -319633 -13216 -289114 -438950
9196 -438950 -15841 -27447 253250 -224650 1951 191312 5512 86145 -109325 -97553 158458
9184 106536 -72176 -291489 -298485 -96475 -253471 -14856 -189032 -241721 114440 -180392 -228102
9173 -228102 138446 -548884 -326314 -123613 195411 135262 6400 -257293 74693 -128615
9162 -24740 -300816 170518 -53118 -60992 33913 241940 -198786 114663 -70249 -81575 -20824
9150b27004q7Q5281D965c65678a78778k4729N2667l1511Q4969j34450A48877b20817
9137A2750a99936M9133j53516J38996c7992j90324A30685e4941A05563d8924r9643
9126a48567E7055b87549f4619I9962a38527D0902a23185J6692r16K436a1220F5051
9113b66455G0672K6575j3150P9736b0876B34011a41725j74187A33266h592k34734
9102b43326A15745b92415A85454m5015a07975e2832p8075f358m3320I5896J17970
9091B13866m2208a88633m8312j35272a42415A31456a12155c7189A40064A0495
9080A05484h2813k0818N0790B30410G298J00706p76D2305f7877L1337j89822h9646
9067a98602d0115o4391F7285a4915A74882b10591c7556b231j87550c8710k03980
$$ plain form
9150 -227004 -227091 -141810 4965 -365678 -178778 -203507 -150840 -182351 -97382 -231832 148877 -220817
9137 12750 -199936 -150803 -304319 -165323 -37992 -228316 130685 -54941 105563 -48924 -148567
9126 -148567 57055 -287549 -64619 99962 -138527 40902 -123185 -106493 -107409 -104973 -11220 65051
9113 -266455 70672 97247 84097 163833 -20876 234011 -141725 -315912 133266 -8592 -243326
9102 -243326 115745 -292415 185454 140439 -107975 -52832 -130907 -6358 -49678 95896 213866
9091 213866 171658 -188633 -236945 -372217 -142415 131456 -112155 -37189 140064 10495
9080 105484 -82813 -103631 -52841 230410 7298 108004 107228 42305 -67877 -36540 -226362 -89646
9067 -198602 -40115 -104506 67285 -14915 174882 -210591 -37556 -2231 -189781 -38710 -242690
9056b42690k32570D9294e0894J4306n1087B98564d8250j13898I7010m1638i8162
9044d7713j48218c0501p0388A17216c95336J41780G0014a01777q5511B2083c58458
9032G5534b49532A7240c67657E2775d6631m1226B07893a68396j7664m2329r892
9021b38281a8619k56187B30337a38744k4081f8987k2152A13896J7908a09887A29970
9009A0946h3947K8238E2189K6804p598a46864j78512a07005c1163m7310o9465
8998a47938g3671j22643C38347a39325e8496B07882a16848b9166j40652C4610
8987h9295j28670Q2127M1510j34086i7372A87954d1991j25052N4393j42847J18600
8976a36897c4623o2687n6283m9784B7545a14261K6674j4965j10427j178A72416
$$ plain form
9056 -242690 -475260 49294 -50894 -36588 -87675 298564 -48250 -162148 97010 55372 -98162
9044 -47713 -195931 -30501 -100889 117216 -395336 -253556 70014 -101777 -187288 22083 -358458
9032 75534 -249532 17240 -367657 52775 -46631 -87857 207893 -168396 -186060 -228389 -238281
9021 -238281 -18619 -274806 230337 -138744 -162825 -68987 -91139 113896 131804 -109887 129970
9009 10946 -83947 -55709 52189 78993 71395 -146864 -325376 -107005 -31163 -78473 -147938
8998 -147938 -73671 -196314 338347 -139325 -58496 207882 -116848 -29166 -169818 34610
8987 -89295 -217965 -135838 -94328 -228414 -97372 187954 -41991 -167043 -112650 -255497 -136897
8976 -136897 -34623 -97310 -153593 -203377 27545 -114261 -87587 -102552 -212979 -214157 172416
8964I5909c5954j14980A63207a32984N1720J74L5242k5577A46533b66184a07205
8952a95860f9946m2644k3265A55545a4550B43555K8813I2735a53497L114j2382
8941a62765q1149B6832K51720h2042M140B05936F5022M4967f1296j53036a9764
8929B18402r8521E9444L91970A61375J915632J106713K232346M287644J016944
8920A0720654C707596A023468l89999l09996o9167m8508J20971C6231P0201K35543
8910C41975G8279K04109R5853A41262P7417c9220j35783C41035A8354c4426B81292
8898A95406a1163B2857e476j00324N2707F9922J4700b76013n6160a57277f1013
$$ plain form
8964 95909 -35954 -150934 163207 -132984 -81264 -81090 -45848 -71425 146533 -266184 -107205
8952 -195860 -69946 -112590 -135855 155545 -14550 243555 272368 92735 -153497 -150383 -162765
8941 -162765 -243914 26832 278552 -82042 -77902 205936 65022 109989 -61296 -214332 -19764
8929 218402 119881 59444 451414 161375 2077007 3183720 5416066 9703710 10720654
8920 10720654 3707596 1023468 633469 323473 254306 205798 326769 36231 106432 341975
8910 341975 78279 282388 378241 141262 218679 -39220 -175003 341035 18354 -34426 281292
8898 195406 -11163 22857 -5476 -105800 -53093 69922 84622 -276013 -332173 -157277 -61013
$$ [...]
##END NTUPLES=NMR SPECTRUM
##END=
