##TITLE=AC1543_ROEFFECT0012_8215216_BSwHfQL54B
##JCAMPDX= 6.0         $$ Bruker NMR JCAMP-DX V2.0
##DATA TYPE= NMR SPECTRUM
##DATA CLASS= NTUPLES
##ORIGIN= BRUKER
##OWNER= Administrator
$$ 1.72 TOPSPIN		Version 2.1
$$ 2014-08-04 23:22:05.273 -0700  Administrator@X
$$ Compression mode = diff/dup
##.OBSERVE FREQUENCY= 400.02188249412
##.OBSERVE NUCLEUS= ^1H
##.ACQUISITION MODE= SIMULTANEOUS (DQD)
##.ACQUISITION SCHEME= undefined
##.AVERAGES= 8
##.DIGITISER RES= 22
##SPECTROMETER/DATA SYSTEM= spect
##.PULSE SEQUENCE= zg30
##.SOLVENT NAME= COFFEE_meoh
##.SHIFT REFERENCE= INTERNAL, COFFEE_meoh, 1, 14.98509
##AUDIT TRAIL= $$ (NUMBER, WHEN, WHO, WHERE, PROCESS, VERSION, WHAT)
$$ ##TITLE= Audit trail, TOPSPIN		Version 2.1
$$ ##JCAMPDX= 5.01
$$ ##ORIGIN= Bruker BioSpin GmbH
$$ ##OWNER= Administrator
$$ $$ E:\/data/COFFEE/nmr/AC1543_ROEFFECT0012_8215216_BSwHfQL54B/20/pdata/1/auditp.txt
$$ ##AUDIT TRAIL=  $$ (NUMBER, WHEN, WHO, WHERE, PROCESS, VERSION, WHAT)
(   1,<2014-08-04 23:21:57.524 -0700>,<Administrator>,<X>,<go>,<TOPSPIN 2.1>,
      <created by zg
	started at 2014-08-04 23:21:00.197 -0700,
	POWCHK enabled, PULCHK disabled,
       configuration hash MD5:
       16 EA D6 F4 BB 67 03 14 9B FF E7 A0 43 5B 48 2E
       data hash MD5: 64K
       6E 87 B3 45 35 03 00 26 F0 60 5A 4A 79 A2 6C 49>)
(   2,<2014-08-04 23:22:00.905 -0700>,<Administrator>,<X>,<proc1d>,<TOPSPIN 2.1>,
      <Start of raw data processing
       efp LB = 0 FT_mod = 6 PKNL = 1 PHC0 = 0 PHC1 = 0 SI = 32K 
       data hash MD5: 32K
       6E 40 C2 55 03 42 42 C2 5C CC 73 01 6F 57 9D C6>)
(   3,<2014-08-04 23:22:01.243 -0700>,<Administrator>,<X>,<proc1d>,<TOPSPIN 2.1>,
      <pk PHC0 = 91.87317 PHC1 = 0 
       data hash MD5: 32K
       41 8B 47 56 D7 D1 4E A8 40 EE 08 9C 30 E0 75 76>)
(   4,<2014-08-04 23:22:01.386 -0700>,<Administrator>,<X>,<proc1d>,<TOPSPIN 2.1>,
      <abs ABSG = 1 
       data hash MD5: 32K
       4E D1 A6 24 7E 86 67 4C 70 9D 41 5D B9 75 D1 B5>)
(   5,<2014-08-04 23:22:01.474 -0700>,<Administrator>,<X>,<proc1d>,<TOPSPIN 2.1>,
      <abs ABSG = 2 
       data hash MD5: 32K
       6C E4 B8 2C 66 2D 70 99 2D 87 60 67 C0 F2 80 8D>)
(   6,<2014-08-04 23:22:01.563 -0700>,<Administrator>,<X>,<proc1d>,<TOPSPIN 2.1>,
      <abs ABSG = 3 
       data hash MD5: 32K
       BF 82 38 FA 16 B2 11 47 A5 6A D5 5E 09 D4 AF 12>)
(   7,<2014-08-04 23:22:01.652 -0700>,<Administrator>,<X>,<proc1d>,<TOPSPIN 2.1>,
      <abs ABSG = 4 
       data hash MD5: 32K
       4A 6F 33 E2 1C 71 96 9A 97 A5 05 B0 5B 9D 6A DB>)
(   8,<2014-08-04 23:22:01.706 -0700>,<Administrator>,<X>,<proc1d>,<TOPSPIN 2.1>,
      <abs ABSG = 5 
       data hash MD5: 32K
       63 79 C3 BA 55 B2 5E A8 7E E1 D3 66 5D 70 3A D4>)
$$ ##END=
$$ 
$$ $$ hash MD5
$$ $$ E8 C2 32 29 9C 60 F4 0B 07 29 4F 6A 3A EC 72 3F
##$RELAX= 
##$RELAX= 
##$RELAX= 
##$RELAX= 
##$RELAX= 
##$RELAX= 
##$RELAX= 
$$ Bruker specific parameters
$$ --------------------------
##$DU= <E:\>
##$EXPNO= 20
$$ [...]
150 150 150 150 150 150 150 150
##$TP07= 0
##$TPNAME0= <>
##$TPNAME1= <>
##$TPNAME2= <>
##$TPNAME3= <>
##$TPNAME4= <>
##$TPNAME5= <>
##$TPNAME6= <>
##$TPNAME7= <>
##$TPOAL= (0..7)
0.5 0.5 0.5 0.5 0.5 0.5 0.5 0.5
##$TPOFFS= (0..7)
0 0 0 0 0 0 0 0
##$TUNHIN= 0
##$TUNHOUT= 0
##$TUNXOUT= 0
##$USERA1= <user>
##$USERA2= <user>
##$USERA3= <user>
##$USERA4= <user>
##$USERA5= <user>
##$V9= 5
##$VALIST= <valist>
##$VCLIST= <CCCCCCCCCCCCCCC>
##$VD= 0
##$VDLIST= <DDDDDDDDDDDDDDD>
##$VPLIST= <PPPPPPPPPPPPPPP>
##$VTLIST= <TTTTTTTTTTTTTTT>
##$WBST= 1024
##$WBSW= 4
##$XGAIN= (0..3)
0 0 0 0
##$XL= 0
##$YL= 0
##$YMAX_a= 651475
##$YMIN_a= -560369
##$ZGOPTNS= <>
##$ZL1= 120
##$ZL2= 120
##$ZL3= 120
##$ZL4= 120
##$ABSF1= 14.98509
##$ABSF2= -5.573092
##$ABSG= 5
##$ABSL= 3
##$ALPHA= 0
##$AQORDER= 0
##$ASSFAC= 0
##$ASSFACI= 0
##$ASSFACX= 0
##$ASSWID= 0
##$AUNMP= <proc_prof1d_extract_pilot.lims>
##$AXLEFT= 0
##$AXNAME= <>
##$AXNUC= <1H>
##$AXRIGHT= 0
##$AXTYPE= 0
##$AXUNIT= <>
##$AZFE= 0.1
##$AZFW= 0.1
##$BCFW= 0
##$BC_mod= 0
##$BYTORDP= 0
##$COROFFS= 0
##$CY= 15
##$DATMOD= 1
##$DC= 0
##$DFILT= <>
##$DTYPP= 0
##$F1P= 0
##$F2P= 0
##$FCOR= 0.5
##$FTSIZE= 32768
##$FT_mod= 6
##$GAMMA= 0
##$GB= 0
##$INTBC= 1
##$INTSCL= 1
##$ISEN= 128
##$LB= 0
##$LEV0= 0
##$LPBIN= 0
##$MAXI= 10000
##$MC2= 0
##$MEAN= 0
##$ME_mod= 0
##$MI= 0
##$NCOEF= 0
##$NC_proc= -8
##$NLEV= 6
##$NOISF1= 0
##$NOISF2= 0
##$NSP= 0
##$NTH_PI= 0
##$NZP= 0
##$OFFSET= 14.98509
##$PC= 1
##$PHC0= 91.87317
##$PHC1= 0
##$PH_mod= 1
##$PKNL= yes
##$PPARMOD= 0
##$PPDIAG= 0
##$PPIPTYP= 0
##$PPMPNUM= 2147483647
##$PPRESOL= 1
##$PSCAL= 4
##$PSIGN= 0
##$PYNMP= <proc.py>
##$REVERSE= no
##$SF= 400.02
##$SI= 32768
##$SIGF1= 0
##$SIGF2= 0
##$SINO= 400
##$SIOLD= 32768
##$SPECTYP= <>
##$SREGLST= <1H.CDCl3>
##$SSB= 0
##$STSI= 32768
##$STSR= 0
##$SW_p= 8223.68421052631
##$SYMM= 0
##$S_DEV= 0
##$TDeff= 65536
##$TDoff= 0
##$TI= <>
##$TILT= no
##$TM1= 0
##$TM2= 0
##$TOPLEV= 0
##$USERP1= <user>
##$USERP2= <user>
##$USERP3= <user>
##$USERP4= <user>
##$USERP5= <user>
##$WDW= 1
##$XDIM= 32768
##$YMAX_p= 471103079
##$YMIN_p= -767617
##$CURPLOT= <Network HP LaserJet P1505>
##$CURPRIN= <$Network HP LaserJet P1505>
##$DFORMAT= <normdp>
##$LAYOUT= <+/1D_H.xwp>
##$LFORMAT= <normlp>
##$PFORMAT= <normpl>
##$SURQMSG= 1
$$ End of Bruker specific parameters
$$ ---------------------------------
##NTUPLES= NMR SPECTRUM
##VAR_NAME=  FREQUENCY,     SPECTRUM/REAL,   SPECTRUM/IMAG
##SYMBOL=    X,             R,               I
##VAR_TYPE=  INDEPENDENT,   DEPENDENT,       DEPENDENT
##VAR_FORM=  AFFN,          ASDF,            ASDF
##VAR_DIM=   32768,         32768,           32768
##UNITS=     HZ,            ARBITRARY UNITS, ARBITRARY UNITS
##FACTOR=    0.250966925370066, 1,           1
##FIRST=     8223.43324360094, -90246,       -146289
##LAST=      0,             40951,           -223360
##MIN=       0,             -767617,         0
##MAX=       8223.43324360094, 471103079,    0
$$ Real data points
##PAGE= N=1
##DATA TABLE= (X++(R..R)), XYDATA
$$ [...]
23785 14999 203593 235776 28995 -19896 -243796 138179 -89720 181493 -280722 124494
23774 197801 -204000 130734 -426216 252294 -110897 -101759 -400791 -87057 -149837 221745
23763 -132145 106513 -378794 236640 287523 239822 -89857 10407 45219 54091 -126344 -66571
23752 -66571 94435 -93232 178509 -4707 221718 12969 363234 -166539 -287851 31314 -131225
23740 -70470 135520 -88235 -271012 123424 -33533 -309837 -121468 32736 101081 -248689
23729 82434 91969 -81377 -200196 218889 61079 -99887 -164441 -98279 -69375 -196227 35184
23717 72632 -345910 -40885 -52981 -245842 24202 -158041 105498 -44514 265803 43672 103142
23706 103142 -88274 152778 58348 -180572 83316 7019 -6157 57458 21712 -113343 -192288
23695 -192288 53272 -148395 -355651 -231120 -15169 -184767 46132 -201908 24042 -32063
23684 91281 74989 228842 -13816 -184316 84346 49327 -46574 52686 -245384 -65011 9470
23672 94806 204865 -155218 -316618 498 -24257 -243573 111076 -205820 -61050 84020 -145168
23660 -129587 73168 -29147 -125380 -261287 -168444 -333213 -83299 264818 -182451 -36234 89042
23648 -18123 -96028 -106918 183390 -112968 26724 -100795 274342 -127672 107534 7309 25302
23637 25302 -103410 53271 -303386 -72493 -196185 146407 140465 -383145 -164558 -45984 -159533
23626 -159533 52897 35473 -18351 -27654 -81319 48327 -181048 -168240 -141290 -275243 -5222
23614 26913 210861 -177435 38536 4894 -488426 45206 227462 -89682 77525 329509 -462754
23602 -73946 93552 107424 45876 -289896 99741 -47310 230916 -114684 35184 47977 173605
23591 173605 2269 295532 -295288 115210 -119359 163155 62198 -244131 18836 -161795
23580 -145696 14022 177702 -57458 3828 -29920 307829 -226141 299997 -325097 -217629
23570 -217629 -107178 144587 143123 21976 -246395 -180309 173860 291454 -10740 52360 -76207
23558 161299 -219539 -233300 -147506 -221971 42194 91640 109226 132441 -62068 -59240 -127382
23547 -127382 -15609 -34966 -190751 -82688 334312 -171800 308548 8930 164969 -155870
23536 -250235 -11844 -42180 -86097 206893 330086 144078 -359062 -479321 83747 -7631 -150784
23525 -150784 -212548 207494 -138728 -80889 -49652 -13909 -239975 248646 111334 -145346
23514 -210769 -245111 8608 194720 -223008 10252 -120152 88232 -334431 154708 -159310
23503 38650 65851 121043 -26538 17732 -110909 430913 119612 320526 -18125 240537 -57600
23491 -341890 6841 244051 412033 125830 -249316 -47415 255879 -282837 -24976 -316666
23481 -316666 -27318 47389 -303859 9919 -100212 93066 476795 -135359 -225895 109269 -199102
23469 -290114 157265 35083 312904 67657 -156049 -4976 -258013 -106284 -248965 252023
23458 -143683 363951 -161534 23153 4590 -50217 -225271 -102515 -72973 39064 211643 155895
23447 155895 -348467 107129 -142266 -75546 52723 24811 -145099 -107882 440416 433738 136148
23435 -73186 -33859 253740 137648 -66327 -111874 -262969 -195887 167474 -318273 -6102 -237776
23424 -237776 131132 -7719 -219103 -287279 -152653 -216203 -78509 -131033 -181625 45520 118255
23413 118255 -256233 -92813 54333 -86894 169821 67876 253728 -205142 125177 -183196
23402 22771 359717 -193901 -76997 -106588 4192 43938 82407 167745 -209090 63257 -97771
23390 -127667 -152016 -125049 -70822 17622 -153598 -243790 -103466 -174543 71201 1877 246977
23379 246977 -98783 49582 -128032 148541 156186 -182310 229018 -101943 56620 261025
23369 261025 -185026 41202 -24505 -65809 -154636 -27128 225441 -155663 -230836 41609 -193829
23357 -164366 146417 44764 243681 -272155 -192186 -147240 122101 10617 -269425 98595
23346 -269496 -125810 307235 -213868 82005 313685 115759 593 -93464 -69208 146847 146961
23335 146961 -113198 -280544 -22094 -162188 -474434 -2466 141687 -61111 121687 -135245
23324 -25273 178008 -49639 -270677 88156 31698 -175871 113798 76908 40728 -238521 -103937
23312 292256 76340 186717 -302727 -122877 101408 -70009 -147605 -123114 -358501 -374070
23302 -374070 -327106 22334 -30436 -333451 -379293 -406242 146556 86462 155048 -32217 96567
23290 -136152 -71538 -144739 129737 82959 -23629 -333210 -135887 175786 54899 -305214
23279 -13570 47223 79686 -18965 73711 -348029 -230593 -3390 237954 16819 -293375 -309658
23268 -309658 136930 83313 73927 -94515 380151 -165237 -12166 185421 6010 126419 233732
23257 233732 162122 134037 -197079 76259 53266 158962 -208039 11657 -190192 -74306 -380762
23246 -380762 175449 -88232 -264337 -221686 -128975 -161178 -47730 133898 126186 -279361 198193
23234 -127885 264359 -251867 148328 -40216 -313935 -27575 12574 -287728 66457 193360
23224 193360 118986 137613 95592 -411431 144452 127034 306311 125288 147916 317365
23214 317365 156851 71441 179913 -129705 -76684 99960 -24538 65685 169339 -27377 198376
23202 158053 -55037 -156896 138939 -9085 -145088 66229 -202210 157140 63274 374946
23192 374946 -178802 185479 -326948 58933 -4156 -70157 -261350 -16553 98209 -170898 -120947
23181 -120947 -40804 332224 -174947 -185984 -229170 -261069 36983 -259075 -73689 -94563 -172148
23170 -172148 -87651 -323731 -16950 -270193 -134012 -46520 131516 283895 -155739 -78493
23160 -78493 54131 -73256 -83064 -627988 73112 306852 124115 -97727 -33556 49092 -134754
23148 83507 -76683 12726 233584 20098 221279 114819 40087 -55689 -308826 73943 -140352
23136 110105 31039 75311 243897 -219836 -135733 -132058 160489 -152240 -102249 -14165 -280229
23125 -280229 -42981 93337 -282599 -78472 -100305 30911 -247296 78399 -256997 90337 -222797
23113 -148494 187078 -280274 -138078 260954 -14206 -7242 199666 -216103 -474365 -72710
23102 188937 56632 12960 -277158 -111714 -74967 -345049 265321 79575 -278674 -107098
23091 10273 7205 10671 190849 -258674 40863 9971 10846 -56760 61916 -108799 5733 -98535
23078 109167 344710 213542 51656 251138 -468349 -9037 -87092 102272 179112 206176 -97298
23066 416548 53368 13275 218271 -7972 350792 -139102 32894 147508 -1114 -132188 404692
23054 -6871 119962 57841 -155055 -161273 -92252 252770 -32233 54990 -168486 -127210 -55705
23042 -232494 -64944 -14585 -211926 -431205 -374766 -122151 -238576 163155 -259458 213969
23031 324109 159744 4551 100027 -309436 -145551 -127265 -347844 -112660 -513503 170941
23020 -182489 112734 146734 216537 78364 296472 108234 -72506 120660 -130810 -85854
23010 -85854 -223195 -106600 -189824 103926 -180439 -4509 56997 267316 186655 113542 86120
22999 86120 -176287 104027 -78332 -23371 -282687 327770 238772 73274 125845 121351 -211032
22987 257299 -8006 -168911 -112224 -137367 86021 -72396 -234292 -216061 -95250 -109454 88753
22975 -67562 -204002 199380 -253501 -36667 207754 -225841 -85789 -118561 36205 28945 302510
22964 302510 -26648 -122280 -204591 -305335 167823 -343419 213814 127406 -158904 -121506
22954 -121506 259174 88467 290163 -129686 76863 -157765 349938 -105238 -255646 -152594
22944 -152594 -1549 -101703 63836 30242 -278248 83632 284544 -12752 -24218 1077 135190
22933 135190 -64046 106267 -75960 -211122 154865 -327192 -148690 -155756 174450 74853
22922 -577523 253856 -454744 94844 -196127 76102 8232 10697 120391 -201688 37598 278971
22911 278971 -326539 -261636 -75354 258867 -227665 -137758 -108045 -121157 -199301 -87098 82261
22899 40756 -331434 34482 -248756 98183 138282 132998 293836 -28310 67243 141274 48076
22887 -81599 147473 180658 -58715 -31327 -108641 -236577 -359016 -99556 45131 -388399 -42437
22875 147159 242052 83274 95796 184069 -84186 239323 48859 126725 84683 -135149 21961
22863 327752 -466764 -320906 -338901 -258535 -35785 -153302 109887 93325 359222 72246
22852 -25736 134698 -111447 8288 -174252 -413523 -206519 226691 -156829 321756 -36207
22841 -200974 -17622 94405 353384 301646 61189 47905 -246368 -63560 140133 198298 18742
22829 -257211 -164065 48460 -78806 201201 22342 194489 147398 -244471 -376479 -75725 135806
22817 17187 -155529 63696 163229 8583 -87612 -36640 103990 -162381 -260917 -282741 -155490
22806 -155490 -167211 -143191 145888 -323835 -71440 -89970 -106328 -269277 -130410 -81714 263811
22794 246824 -98867 -122694 132361 -34483 -81031 -114306 -153114 -111909 237901 90358 -4486
22782 141452 308842 -182190 -39680 174665 -272602 106515 -361905 -89882 8639 171125
22772 171125 15347 144827 313556 -190419 -1996 -6768 214146 -379214 -157701 -175084 89706
22760 -86165 -296985 151104 -265512 -56474 92469 238365 -29092 -131735 -407739 88091
22749 342505 143605 -139008 -40973 -50759 225386 -248643 -287806 -27688 -1586 20567 46222
22738 46222 24883 -350737 117289 151467 -103600 -263870 166161 115784 -81941 -150127 313802
22726 -200401 -79617 -273067 34146 -129028 96387 700946 105042 -131934 -235566 -63436
22715 -183538 28777 -335902 -366635 -23945 61767 -11154 68741 -7313 118224 -31501 -164328
22704 -164328 -19753 17752 225317 42551 45696 -89061 -400861 -6051 105893 17692 174516
22693 174516 -317378 274361 -130945 -65016 -128310 35139 -5084 43129 -77846 128426 -238512
22681 -370445 -294366 -246411 -140759 -449921 164826 -60578 63363 -38577 -27098 -10463 53857
22669 19473 -237605 -276371 90839 21459 -91364 24251 -274247 88189 -276511 -61129 17333
22657 -17016 -368732 42418 -22040 -22329 298279 -347826 -204396 -134140 46898 196566 -92448
22645 -119200 -113171 -28 74292 64178 -197377 32350 -340066 -67852 175604 -74767 -196574
22634 -196574 56887 273856 -335 66615 -111403 -8460 -237564 -78559 -8905 -394576 -244319
22623 -244319 23163 -63654 -50966 -37700 -111282 -150895 -413410 -478305 -144347 -122323 -171066
22612 -171066 -99813 292110 191862 -84050 42759 -40598 -80966 -340494 43216 -39714 -353597
22601 -353597 -347044 -275580 -134278 15656 -67395 -304827 173391 -183923 -15358 -82277 147738
22589 -104802 7366 294297 212771 40188 247061 267748 -124660 -50902 117300 -118275 -368265
22578 -368265 -111638 208492 4007 -45926 156825 -81107 76532 83288 268699 37846 79097
22567 79097 9096 131633 -115321 -15717 102771 -291784 -138853 -46288 -15565 -319480 94507
22555 -145851 11314 -162492 -426153 243822 -416821 230834 77225 74549 56899 -23821 294708
22543 234380 -71633 116616 -293739 122799 -171070 -225952 -176942 -58044 -100472 172376
22532 -190562 -194440 -80869 40970 128506 30940 207281 -448876 -3917 235068 -292804 -378098
22521 -378098 40689 -62232 338487 -349971 37314 -92378 -190382 -296951 -53229 -78835 -180061
22510 -180061 -218823 151360 62466 -55597 -128490 -220869 57620 279125 -404276 135939 -178730
22498 -99351 -257994 -90326 176509 24059 72983 -21691 41049 -401586 -253028 -124384 121569
22486 -77621 77376 -43102 95861 271110 -102767 50973 112600 -261269 -253651 175671 32016
22474 -76120 -43389 -195543 103970 -125543 -149910 173705 -193968 195900 40939 -61882
22463 -157080 -127432 -246771 61476 -88694 311658 275217 -156756 -152215 -235945 4353 -14283
22451 -111950 31751 -202737 189446 136377 266990 135456 103107 -112312 -18067 -453793
22441 -453793 146639 -28014 58075 -99348 -47211 74390 -179192 42797 -282941 -121735 252171
22429 138611 42168 203628 37432 -127331 -18104 39243 17308 -218711 -228804 -108624 -189392
22418 -189392 57121 -191905 -88266 -208947 376460 -143620 -187944 -143439 -152226 -17924 5650
22406 187269 124110 43851 -183447 -5371 -95987 -7158 20741 4442 -163280 441551 -52341
22394 118889 169101 -142914 106863 75288 41899 -35890 240606 8691 -144188 -406834 -232104
22383 -232104 -181102 -118475 34067 -289865 -185435 -322569 -14420 -71895 39245 -19360 13773
22371 254969 184507 -12970 31931 -340206 -12897 -167318 -258946 69600 -74228 -127490 -47534
22359 -178000 -269118 40822 181295 -402285 -116217 -156496 364561 177051 -48890 99862
22348 49461 94509 44945 72700 153340 -55380 -153016 21442 167040 165345 217908 144424 233687
22336 233687 6983 90805 -311100 112595 115013 74879 78645 50225 -170329 -123316 15998
22324 4927 -154627 -172625 66135 -160354 -142993 22173 -432990 47399 -116066 56577 -74387
22312 -57497 -45217 -380137 62115 130737 69702 -393261 -15985 42941 -219492 -205213 164185
22300 428158 -44951 -87367 -266183 -196341 -33251 119728 -139959 -243717 -130585 -277730
22290 -277730 -43574 150092 -109999 27028 -430829 -387735 -30641 -244823 -22329 68965 44251
22279 44251 131505 -56802 -111686 -115969 -241427 -143680 -101259 -152481 67843 130150 -119572
22267 -92159 -179845 67855 11267 184269 33445 -174606 6879 -152231 -250877 -124756 264229
22255 234740 -88339 -487254 117362 74935 -69250 112304 18811 -67484 59109 -58442 -58692
22244 -58692 -163505 158612 134413 -155139 -213288 -160007 279533 -232011 -235356 -18527 -128189
22233 -128189 210141 -172265 60437 82492 153609 -285417 128658 92178 137788 -160326
22222 -59875 -129724 180142 -276868 -125178 156660 -120056 -224013 -148897 82937 -58955
22211 26823 284771 42273 156199 -108099 -214898 228984 -156077 -332006 54632 -223193
22200 13199 29810 16904 168497 89822 -204054 298248 -366464 182536 -222582 -344427
22190 -344427 -973 -155414 -211898 46208 -79041 81249 110437 259561 -95121 -55060 -72024
22179 -72024 -77773 -41160 -68895 -238707 -139940 49234 -70203 -81421 16870 -81305 168034
22167 -349822 334927 -19805 128200 -21124 -185256 166397 -92224 -30927 -3789 -180870 226980
22155 -116660 239205 -96780 -123620 94122 139136 -67026 323283 -82142 -112683 48491 44636
22144 44636 -217947 -32847 -202190 -118279 -387807 134325 -208039 -109399 16951 -147920
22133 -50833 -339141 -87222 -255343 41531 105343 -88165 407522 -109178 -3725 138169 177660
22122 177660 -155772 24042 -80026 -67302 -37481 55279 -140526 37867 -304383 100437 -100276
22110 39024 266549 -220059 -411261 -102345 -106731 19333 -103161 25292 -19881 -401152 296778
22098 4812 -118914 -317074 -343594 -235817 -4861 112273 -141566 -291054 54262 -209366 103989
22086 96738 243180 -361132 -256133 -129374 64150 -93274 -152982 330652 56459 -101238
22075 -172195 -87066 -117712 39415 -47551 -13360 76371 150336 -198120 -56075 -26110 84555
22063 -427677 227250 -40621 -137968 -255742 -8073 96262 -192771 22423 -262651 -113048 48946
22051 -24724 -199436 84243 -275153 -74990 -183580 41574 145341 -63570 -101871 -93111 -8153
22039 -98349 36580 138788 13504 -34936 -136751 32011 -398375 -342364 114203 -332135 -115102
22027 -193157 -343127 -63488 301732 107978 -294028 177123 -76703 -214590 27236 126986
22017 126986 -7297 -283891 -309511 -28521 4499 -2717 269990 -215123 9557 -401907 -102043
22005 150740 -117260 -56414 -212174 160655 184770 -18902 -64836 -212314 -395157 58412
21994 120777 -228610 -71961 331498 -102595 94631 240092 -98822 306911 -35359 211877
21983 -174099 350177 49084 -225163 101072 261340 -172239 -68471 -102351 69040 -114116
21972 133507 -248105 -191050 -136611 -95466 166923 -141769 25647 -269723 -26138 -17064 -180658
21961 -180658 -249457 -242580 129954 -96216 43848 227134 -298448 -3930 169159 -114647 -246422
21950 -246422 -200421 -325919 242784 -25185 -232903 214858 119454 -227446 -41704 -159375
21940 -159375 -180164 -236854 11034 -96124 -125592 61268 338576 -107636 431068 96995 343519
21929 343519 -305640 -58095 -569784 -73405 -343103 4579 301257 363170 149362 216024 -229916
21917 -109855 -31781 43752 12058 -354353 117639 183568 -12935 -175543 -248343 -155349 -113107
21906 -113107 -57714 239837 -62180 -164234 285185 -4098 -178838 203586 -89943 -309871
21896 -309871 -178783 87125 137638 -45439 20165 70182 -199132 70768 33099 -207013 -45771
21884 38602 -215407 160385 83903 -185735 220523 268230 63682 1630 -275678 -137067 15206
21872 321273 209168 -200891 -198031 -183448 -285369 -93603 -16958 -5281 -181000 191532 -231923
21860 -187156 138156 44273 68060 54940 189319 97002 -122820 -231332 5315 -208274 173254
21848 -2228 177176 43560 4358 -165774 -82559 44202 53837 -199235 -16905 -333308 -64451
21836 -402563 61023 -95054 -96518 67783 -158818 -147128 -53067 138052 -32453 -324238 -139806
21824 146192 -196972 -35172 192552 -17076 -65434 -240513 -202249 -45762 91371 -260423 -232523
21813 -232523 -119313 -104278 8220 -197654 69098 57175 97342 77456 -5516 -245549 -393501
21802 -393501 -100429 167997 -555998 156470 40332 -459989 11113 252163 -586162 -125038
21791 -97044 14582 36242 62875 -66194 -65753 -34868 262153 -55534 24707 257672 136985
21780 136985 36574 -136005 -90490 -112168 -34195 -140647 -240791 -147717 116469 -262385
21769 194257 -12987 3072 -153810 18622 -101655 -44679 -35631 -99367 -90018 36900 107702 46457
21756 -157303 -240037 -199875 -91247 -164430 -105185 -182808 151272 1344 135888 246701 -378779
21744 -80527 -395298 -38678 -428026 45872 52866 202295 -150802 -220771 82406 209361 -167492
21732 102921 -43372 -26984 169887 -219353 115147 130853 -43750 -123369 -30147 7508 8087
21721 8087 197958 52056 120305 -174315 -19333 62055 377391 -22883 -178922 1142 -43953
21709 -94176 -416877 165151 110185 206606 -96233 17453 -277474 -78005 -172731 -73603 -31685
21697 73071 -177367 -140293 -209442 20568 -217600 21740 -32922 -148720 193418 -36430 180601
21685 -34439 32138 -276428 -125609 -60218 -10882 163067 43218 -88227 -484820 90146 -101783
21673 174237 -50926 -179308 -36291 -75872 -9825 -8203 -6881 178807 -11539 -94566 -87551 164660
21660 77986 -155780 -293952 47753 -84134 -299418 128577 -252133 56509 -82752 -51545 -259469
21649 -259469 -69375 118793 -5095 -20453 -234126 162139 182106 -56789 80051 -52917 -187796
21638 -187796 -304576 -2382 -275821 204369 -3758 -69557 -28266 -146644 142844 64993 3753
21626 -107261 -32720 -107863 174544 -250603 -108697 -176012 -129172 72532 -150734 -254690
21616 -254690 -197068 249864 3158 -18695 -77104 -314569 -411641 -15945 162256 -326505 -239008
21605 -239008 -98092 3418 401817 112799 -32161 209468 -298364 -52083 388777 195636
21595 195636 -38947 -135580 -101120 58682 -4383 99753 -403459 -87129 -79518 -85255 -101249 -273516
21583 -273516 -99414 -163480 -220095 -159700 18759 103691 -11504 -180630 -206113 202154 684
21571 120209 -58200 212617 -946 62701 -54411 -256508 34759 -64322 -107736 81314 430489
21560 430489 -164119 71794 33768 -319557 178264 33852 -32354 -126077 -61305 -118347 16888
21548 -36223 -148494 -371862 -222091 -148544 -216944 -175873 519246 184202 67293 37586 62075
21537 62075 -138313 10838 -60728 -249311 48395 -204755 168683 180604 -96506 30851 176111
21526 176111 -194674 108605 -123405 -61941 -30213 12295 -12413 140060 89673 -107437
21515 -2859 -209319 112836 147604 -222703 -36922 -35580 86819 -133734 6665 -185343 55770
21503 -253878 4886 -49932 32626 -98360 56122 184977 46388 -103090 3115 -208761 43421
21491 -160478 -462168 187749 -14502 -83343 -179953 -133832 -204652 -11612 -186897 -204068 213119
21479 -530760 77462 -94064 332851 70885 226049 102857 55899 -45682 48927 104618 129389
21468 129389 -194309 309294 179998 47364 -39172 83804 113960 -216756 -191615 160058
21457 -311626 -169482 -40499 -206479 -218928 -270882 -49129 29975 -173432 -93687 153894 -228740
21445 4264 -136888 162441 145788 137909 142596 147018 202642 135624 -237317 -2658 -261161 -54363
21432 -252628 38235 -229783 -148335 -270607 927 -31582 -18515 -217091 227507 -195491 227506
21420 -1946 265004 211941 62649 18453 -150301 67710 -113059 234186 443268 316903 326703
21409 326703 116771 53709 -11748 -211929 -407280 157535 -17253 231915 -53761 -15510
21398 -70833 -46251 -41470 -53642 -297792 50422 -245148 285216 101726 -25957 -223607 8683
21386 -59569 -387724 -261730 -246682 69905 -220630 -220711 29013 237982 -5719 -142199 98034
21374 42347 63462 213290 -233779 52228 -208332 -146171 67838 -221615 -269035 135935 60106
21362 -26659 -4253 -30397 -41925 68683 157654 128177 -166594 83704 -351930 326148 -285687
21350 8074 -218359 -184047 97963 -165930 57803 237720 -85526 41803 -76019 -101367 -12372
21338 94664 -78624 159916 144135 -112663 163702 214841 -79087 -319113 4687 -221055 79745
21326 -74160 -283709 -26779 126978 -190615 -226444 -145723 -104969 -214579 99921 -14053 78131
21314 -220160 -208863 -129527 -192102 92044 170236 171927 160490 -42805 -292322 -45311 -169865
21303 -169865 152657 171606 -475389 -257275 145699 -6147 169129 6011 33166 -52483 326260
21291 30860 214981 -99141 441332 -334379 -59327 -366616 85225 559307 -288140 208025
21280 -21309 76034 33193 -5418 -290421 -22335 -421215 -35717 59094 -202500 140503 88948
21269 88948 371940 -93990 -216580 -122757 -159066 -193677 -521641 -138249 259542 -199964
21258 -150494 -200754 185806 -116735 417464 -162477 -199087 222635 -98892 -12578 149641
21247 -101166 -154133 186686 -78484 -395588 -86844 300496 40206 -22927 54788 184691 -218120
21235 -150895 151402 176293 -44659 95107 -16328 98506 -45429 185942 -206304 -339650 -106094
21223 -161616 13104 9649 -274853 132838 109631 -163274 -240634 -162910 288021 258001 -168771
21211 -175643 -101077 124584 -198359 105606 -73316 -276527 -152885 92001 51797 -312668
21200 48111 -78521 93837 6782 -13922 -129047 -280530 -121656 -6321 84990 -380753 -270917
21189 -270917 -132289 -29426 -90952 -16084 -351627 121441 283888 -87346 -63242 89000 100972
21178 100972 -160490 -64323 101751 -138360 -113386 -191955 290326 -408756 -292181 27182
21167 17774 -423415 -85591 -197454 -85798 125715 -103758 -373254 -70172 84068 13085 63084
21156 63084 178897 -64532 -236278 134727 -168662 29697 -148883 130754 101206 -17887
21145 -370697 -5917 -227904 159832 -280145 -252708 -298024 -246289 -165601 -64567 -113689 -262636
21134 -262636 -421346 -382856 -294924 -88976 -365218 -97642 -150725 -74254 -390092 -166498 191937
21122 -259992 -80882 70088 -89596 155434 -23323 -245035 -204802 -53626 33463 -6418 -39034
21111 -39034 -5584 181512 54472 -317382 -248911 125783 77566 -45821 -8857 142740 -127619
21099 -225542 -330740 -43189 -132181 213638 -232453 -88691 406338 105786 -114198 196946
21088 74921 10125 -175919 -86834 -10475 -144109 -70261 -5134 -354153 129737 37512 -44755
21076 -121491 -200796 -382218 -57436 -131743 208029 13529 -48738 -431365 -167054 181467
21065 -64568 -381712 41945 49920 280126 -311889 -146912 -47646 -90767 137816 164406 20500
21053 -390815 150231 -76908 77660 -198713 82056 -86845 -1772 49907 57059 -144202 25041
21041 121494 -121242 49683 112234 -211442 -563751 -168620 -97497 -92286 -284403 141368
21030 -186455 -201009 44132 -108080 -128766 -201088 -68460 24848 -120250 -64577 73132 -40070
21018 131295 -29412 167438 -261742 -176032 -23676 -18593 -140830 176786 350845 -66790 -152040
21007 -152040 246166 -155667 201715 -114096 38609 476062 -49965 -355246 -298594 -92604
20996 -34037 -143957 74503 47747 5491 68128 -494931 188838 -247372 174101 -308709 39540
20984 246240 -138252 -77217 -183466 50496 -96780 125813 -87746 -203069 53259 -343272
20973 139470 -49006 -119639 -20743 115943 199280 35230 309615 86547 -127092 -128174 196341
20961 -430395 -40455 108371 -191923 -21986 180573 -233959 -87294 -150106 103120 139602
20951 139602 -330725 -365209 -88990 149136 372988 451287 198879 -302262 -28502 104013
20940 -263072 -273618 49524 -157326 -116754 -344768 -64727 159470 -188392 -76308 11539 -89542
20928 -93623 -434497 -151179 -108505 -250315 -103268 -238642 162579 48866 97437 -32133
20917 -233803 -43244 -471 -92543 -202176 75262 -38239 -354277 139732 -103046 -134566 -49239
20905 -399195 -24694 -259214 -98238 148594 -10598 -304009 -3639 -166385 -72764 204974 -410390
20893 -207701 -13261 205801 -194475 49364 25621 -15357 -17433 -194182 -113678 -297315 -262884
20882 -262884 -29957 -7008 64067 -478586 382898 -72808 6103 -186253 -260973 74590 327245
20871 327245 -16967 -177358 38555 -423541 102910 -75170 -144749 -212120 -5165 291031 -103601
20859 -189335 115181 -19682 -343262 -272550 -101519 -224612 105554 75756 -68356 121707
20848 -169490 40331 -32730 236742 -163551 -48376 35914 -79687 18909 -32933 93287 4410
20836 33882 18007 -463444 -13001 -157766 -161450 -10526 200620 -337606 78212 -319944 -63894
20824 -190019 53159 9758 -63685 90093 -139752 -6693 -81122 -185618 148960 -89864 217657
20812 397536 -63492 -160962 -211488 -193914 -149298 124142 5154 117920 69463 -274831 -116182
20800 160241 -148488 -173695 170818 -11502 -24977 -228526 -13475 199125 211685 -197694
20789 -400057 -122059 -173901 -108460 40097 45140 -223603 -12002 78837 -165965 -161163 43506
20777 -76481 -46657 -216299 -138035 -85947 -276216 257317 -153077 62548 -171468 144796
20766 -69123 -173230 -257109 -81568 -227743 -241317 -23700 -17019 -245862 -89295 -152365 92083
20754 -222449 1591 60012 162168 -271829 -8538 149197 -61257 -141082 10650 -127529 -115847
20743 -115847 -24445 80036 174217 70515 69598 -52068 -220229 -67862 -206376 260265 123101
20731 -109089 -466521 68311 -34768 57128 -197050 90741 -659147 92984 -228133 82181 21798
20719 28520 -19553 -144310 -117570 -39715 -300561 -40802 305458 206632 -29126 92200 -204949
20707 -116357 -204647 77131 -151791 -61098 -39093 -153571 -53477 229203 -53651 -246800 179931
20695 62607 -203369 -51914 143127 -228947 -163411 -128021 -369566 -38552 80818 49343 -43975
20683 165375 -523044 -103851 -35923 -308641 -27954 -150093 -92304 48465 47692 68002 -90935
20671 -319488 -363657 -47105 444225 -83576 -113896 -130071 -63160 44753 -295991 -234308 -255721
20660 -255721 -279246 139129 176015 -225272 -43376 -48177 -290 41400 -262512 204647 28248
20648 -256145 -128326 -25787 -126839 -32221 84889 174501 171784 -224446 32244 17967 -380439
20636 90334 -605609 16097 -62498 71329 117609 -45521 -130214 189574 198803 -157862 -41388
20624 -103051 189101 -122313 2316 55448 157301 -95451 287700 -304045 6326 -231925 -96544
20612 227731 85562 -229175 44014 237077 -206184 -74762 -26900 -45217 -58227 -68457 118820
20600 156093 -220886 -83771 -73817 -55852 -352660 -245549 -24797 -83796 -12861 -199351 -108325
20589 -108325 -66392 -282330 -96556 -94730 118332 -87211 186896 -51615 -93978 -285787 -164069
20578 -164069 -101525 115231 -124748 -178498 128386 -109925 -112691 -239 46681 -92119 201758
20566 94267 28434 -497875 -86056 27457 83976 -130802 63754 139323 -71795 -190828 33380
20554 -192387 178814 16867 95638 156861 514773 81009 -226022 395360 38780 228676
20544 228676 108050 -231671 7776 159948 -167785 68544 -142627 -194220 -334966 -117958
20533 -88050 -164392 -249781 77330 -332105 -239921 -17370 -11222 -74109 -438983 173763 -84016
20521 371204 -547722 73445 -16998 309846 -64511 41822 -19604 -219310 113815 -13787 -162222
20510 -162222 -297770 -219170 -110575 -309583 -141514 57828 -146311 -141845 -53984 -208749
20500 -208749 -20506 -332415 -109272 14300 147403 -198740 -45594 -1206 40820 -13631 -341045
20489 -341045 -157344 215980 242065 -163572 -234407 -321861 32952 35646 209659 -127642 8511
20477 79761 -176551 -141853 -242079 -68252 -209176 7594 -88069 -343022 -21415 -207818 -45288
20465 -148920 -268543 -378615 287820 -526350 -100667 81234 -326176 -216313 -340099 -274956
20455 -274956 154357 305475 83857 61857 -138689 -117236 -35481 175995 172337 20273 -187520
20443 -79004 163487 39816 22796 -128878 138341 -30832 -6364 -24182 83951 101492 468274
20432 468274 21622 98934 112507 121328 -282454 202490 189553 173797 -155433 -143712 15925
20420 -196083 50420 -152080 55625 -142523 -23431 257296 -170186 123571 50363 -46783
20409 -221569 -245320 -98356 -202848 -40388 -32049 -39851 -200838 -136988 -92008 349290 -25735
20397 -332916 -10961 -102524 -35264 -85767 -123505 -310537 -372783 -20470 185508 15283 34181
20386 34181 66754 29230 -47155 -97917 -164540 -71312 -35830 1128 42444 126034 -165412 92819
20373 -13617 136935 -97411 -47587 -105739 68055 -84534 -413361 -256 117535 90938 -88519
20361 222643 -62001 153453 -144935 30755 -132282 141795 426505 -97563 254951 -125203
20350 42245 -26664 -20559 -23412 217157 -1982 62373 -251262 45038 233002 -90000 -91163 -71741
20338 -71741 -84095 -76191 28922 -268661 99119 -155803 26438 -302873 -82891 -62600 -292896
20327 -292896 -89106 212037 -16994 -1273 63342 -285184 -63625 -249338 -115882 109274 -410909
20315 -31158 -311631 -52875 26542 -16261 48758 27351 125263 166424 -129998 -406224 89386
20303 -22824 -107386 -142848 -43994 -62770 54186 66956 -365103 -69150 229664 -304761 29832
20291 -68209 -14867 -49582 -56657 -177481 -147343 119565 -57329 14526 -381126 -1105 -19307
20280 -19307 254119 103225 -61384 -42987 -226880 -63662 -323185 -146734 -207732 269217
20269 100617 123391 -158591 -39276 -22599 96268 18943 -5899 -273914 -91331 -58920 -331307
20258 -331307 -147338 -27182 6899 173036 28428 -52733 109281 43223 -151648 7814 144967
20247 144967 -61831 -297679 158500 265727 -109786 279743 25026 126025 -290340 -64674
20236 326756 -58095 89917 -62985 -70481 -108531 71528 -447774 -297833 -130131 -244199 -227303
20225 -227303 132834 -30113 197231 -201589 -263370 -316265 -63913 -229520 -62373 17137 -145006
20213 57305 -11177 -322476 16360 -195333 -75330 -90719 113572 185984 50446 -60201 148151
20201 58146 -88056 -240921 -214454 159264 -265904 100000 -113449 -340605 119659 -4865
20190 369521 31829 -36834 -214385 37473 -340781 -247256 129122 -289820 -360162 153389
20179 2418 -294114 29685 -329445 185437 144140 44496 -12154 78932 -146507 4552 -375657
20167 -272492 -95664 107896 -151169 -320966 2671 -156096 -108139 -213723 -642 55867 172391
20156 172391 15027 197502 17609 -181671 105682 -14008 247829 -168100 43480 -263511
20145 -148417 78738 -237303 -228156 -311544 -300485 -100043 -28833 237450 17504 -213333 -584577
20134 -584577 -87138 -345946 -156370 -105703 -238235 -15664 119144 -643 249947 175913 71767
20122 401484 111289 -177804 -285066 -175929 181 109848 75554 -37125 -175563 -85904 -54568
20111 -54568 9221 156628 102136 -14565 -220203 -211601 -142375 82274 -399152 56033 -239670
20099 -282027 222977 -232846 -91074 73985 5041 133851 -130525 120477 -57033 297642
20088 89858 -111134 -91267 334607 11703 -14251 -111282 -111712 -17867 165784 -133017 191864
20076 11943 125605 146363 -112331 336620 -191366 163942 -288395 1154 64153 -75787 -120808
20065 -120808 -17617 -103156 -156318 -63036 -253189 45486 74040 206660 50638 -136612 -101211
20054 -101211 -72407 -246852 32266 -151455 94628 151678 11994 -31598 289272 -51932 207863
20042 -71127 46920 -110667 31456 277671 -2098 142099 -84063 -23622 -22725 47346 -156989
20030 -464036 -225977 -132015 -162811 -304277 68599 -148544 -273209 -224379 -318008 -161320
20020 -161320 -186695 -61955 41777 -148142 264720 -99161 128770 135991 157664 -279750 12615
20008 -60054 -191194 -70940 334087 260652 -1047 -81126 -475326 61626 -324632 -272032 254009
19996 -234949 -338245 84940 20407 -145961 163705 -91129 -10639 -175802 357209 -145995
19985 16223 -304573 112865 203297 -278904 -108574 178615 -107789 134236 -110039 -36762
19974 -53257 203387 -161649 -143875 15324 209480 -89739 185543 89872 -80652 226588 -152152
19962 27738 82467 -48253 -119033 214667 192530 -160271 265320 -176300 -124752 335905 -53196
19950 63561 27517 274102 -152446 -237475 -259749 -311863 31971 -72600 153666 206648 -2071
19938 223017 173811 -231925 -379870 -145872 163752 -179419 277261 41502 -239257 194356
19927 -265782 -119870 -203283 -158860 150863 -185346 -185131 -289736 122807 -103968 -283689
19917 -283689 -39624 26322 123609 276649 79782 -3753 -194294 14744 -83092 -29484 -372699
19906 -372699 175494 -128062 49264 -62060 138682 -201733 -154620 -185256 -159322 -125959 -71067
19895 -71067 156565 56461 -185402 -386596 223789 -199376 -82518 -56929 -450472 25684
19884 -110322 -179392 228929 52049 -477966 -402927 -153857 304130 -406704 -460106 -161142
19873 -75920 -243552 189895 -127347 -309854 145794 -16773 -7121 61785 155004 -331408 223447
19861 -124417 -33338 -209108 -131503 -142748 6568 -280420 -114882 -144026 -473370 -305690 -387013
19850 -387013 -227638 -521019 -270774 99889 72345 -390855 165655 -55109 46036 -62455
19839 -172308 73742 98303 -297063 122531 -48023 75466 -90979 -302024 -111262 341283
19828 -110096 214203 -199681 161352 -330019 -150259 108572 -40339 -133708 -4799 -51307
19818 -51307 190217 71547 -193170 307570 -164522 -173721 -173659 -231212 95608 32695 53299 -232380
19805 -315663 -67765 -223245 -64509 -262636 82576 -241147 188640 -213112 55506 -56051
19794 -251820 -148961 -3303 71969 51844 142643 -11606 -37160 112532 268161 -218876 -108859
19782 187952 -227664 63276 181142 -47531 -214091 38410 -182558 11627 -184650 25303
19771 -375509 62876 -198079 100969 -535838 -79862 -59155 60525 -356432 15431 -249522
19760 105835 -248627 -122788 -209311 -172821 -285302 9269 49240 376899 -56218 -211812 25037
19748 123208 104318 100041 295236 181138 -95281 -56498 -6353 175101 -190220 14433 -335052
19736 -239153 -44599 70958 -233380 98022 -164567 -129774 89641 -88600 6152 265682 -157337
19724 369393 -102492 385079 -83266 71640 -226141 85452 -185768 -189804 25251 27024 -105221
19712 -147775 264002 -19177 48202 -343262 -127246 -23782 287496 133395 -436505 162708
19701 25718 65388 -123543 73271 18068 -135558 227698 -46435 131039 19185 99068 -350214
19689 -6758 -122923 -109246 -34300 48929 207054 -440706 -301241 -60433 -79041 -55487 -134338
19678 -134338 166198 176736 -52211 193248 -17168 150469 -195045 -92607 -91722 149936 43117
19666 4009 -106833 -72705 -219896 -4242 276001 -174755 -155382 267572 -124599 74231 41875
19655 41875 -441969 247209 231458 42309 -289648 125244 -240966 33626 -17924 100728
19644 -196751 -179293 -143991 -69965 -102476 92993 -126932 -337730 -45718 -87737 57137 -4332
19632 -211593 -277453 53147 -182127 -117138 368112 -130619 -158154 -170495 -138512 -322458 47458
19620 -5588 -71359 -75682 166655 -228865 -54506 257984 -379899 -142678 -33205 -251873 3646
19608 450518 -231034 -161345 -78447 191619 95861 -6689 19217 307675 27391 -192329 178887
19596 30116 -75496 -116519 172279 -218025 -321403 -89980 -101454 191033 -313346 -159460
19586 -159460 98224 125173 -57639 -232444 258761 -291533 -28580 -110345 -109001 -57028 -211632
19575 -211632 515539 -181110 -160520 114958 -152555 41552 -255726 58214 82895 9879 -4587
19563 56111 4175 -234168 -75955 -376613 183979 169442 -304309 -19091 -294482 233343 -63320
19551 26594 -40036 -13928 -36615 78354 -337155 -104582 -219835 -401347 189834 196948 -89486
19539 -46659 -150270 165171 179778 156424 -157897 -165526 -110240 -69119 -153176 -214862 73162
19527 -149009 -242833 -191332 237561 -115217 -307930 -272304 -66718 -59461 304492 -30667 -292874
19516 -292874 -58063 256684 -141154 -223350 -182223 94673 -368019 116719 -767617 -96770
19505 2021 141470 112969 130538 -89043 -193428 -78238 -24364 -259786 -194122 -7920 -23084
19494 -23084 84565 -176385 18563 -46389 -105514 -385152 -32353 -236639 -27513 -45225 140836
19482 194806 -314088 -90502 196288 170700 71915 -64956 -59201 -15407 -150996 -151494 -7449 303076
19469 8045 127282 -222472 -75982 -28924 -49923 -216991 -310327 87034 -309533 145944 -85418
19457 122275 387937 62460 3004 148247 164741 -259831 -206161 -269468 59085 -71296 -214735
19446 -214735 -209188 -205911 68652 -37856 32974 -13248 -470277 -300291 -183821 -7400 47513
19434 -186539 5706 -88325 -181310 -172368 -23672 5284 -77729 -90410 -294800 -241672 -159254 -114691
19422 -114691 -56755 31905 8326 -236766 173902 -91766 273540 -124706 -194456 43626 248769
19411 248769 66538 31813 -234968 158818 -77847 -104168 41768 -256450 -180950 19285 -58458
19399 -130012 -127779 104709 -121298 175590 261024 5003 73612 130330 -202782 158706 -204715
19387 -180464 -27149 246342 -172313 -453655 -82333 90768 -40362 101920 -72976 -408192
19377 -408192 99478 -155579 44926 137352 134867 354661 -256627 -477623 72344 -204421 -253244
19366 -253244 -303441 88855 -334093 -5409 -89011 -523463 103616 -104860 -119867 228721 -166801
19354 116597 142415 -48533 156534 -511707 -204484 13153 19790 -190968 330569 -65241 -64918
19343 -64918 149333 -7557 5057 -321964 76920 -80584 48759 -310605 -89750 -193368 -63370
19331 -364011 244068 -58974 -11036 -45415 209263 -176074 -173634 -273528 -172216 53405 -100419
19319 -102279 4692 -116130 -202373 211701 -3874 32488 -55569 -303198 -59536 42752 -268502
19307 64249 -231504 -261907 -104711 -78692 -74398 -96456 20383 -17097 -119813 122505 -164694
19295 -35162 23603 147459 -119781 265173 -110716 -320240 -134050 -194542 -214991 -136770
19285 -136770 -25688 -125718 -204586 -125056 112275 -67860 161488 -225844 -195652 -137325 59059
19273 -47583 329015 -90608 109749 87349 -261430 -89233 -94642 -41975 -219883 -101388 -201873
19262 -201873 30426 58727 -50553 -169966 -254808 -145802 -253682 56137 203360 -136306
19251 439690 -97719 1244 42375 -282669 -186004 -70508 -134708 335411 224321 178207 -338286
19239 119197 80651 -227465 -96426 -3119 -39705 -161985 -28096 26773 197250 -130548 -34459
19227 125558 -120792 -157895 215331 -24686 -129628 29494 -48090 168623 -56542 294951
19216 -244741 254600 -27001 -92019 -357454 -37268 169566 -242469 -21512 -144714 199339
19205 -596461 -268704 191034 223668 -254210 -493511 -138177 -265545 -218732 141652 -37675
19194 -45449 -219344 -270907 -326688 -320744 -274958 -66636 111202 352302 172300 -314850 21935
19182 -219162 -173050 56588 89519 -7837 115828 23150 181807 -32543 20777 -145940 -275846
19171 -275846 -244567 -176308 -166354 9776 -140014 275933 -23339 90499 83114 -66717 -20874 305198
19158 -223228 51938 -213642 -264802 -104633 85375 -72834 -304792 -548506 46258 -244517
19147 190094 163230 -45607 -212371 -188750 -146605 148570 -333043 207426 19413 15776 -53265
19135 -255469 -176079 99909 28907 34536 -8935 174157 -76803 -5719 -131488 -376448 36070
19123 350276 78268 -205935 215246 108077 32533 -95396 -88673 -151167 -114294 71167 127257
19112 127257 -217050 101139 102257 -93016 -96006 -201471 -222036 87044 146475 -246052 -490195
19101 -490195 -153870 -401229 -171832 -249391 -152152 -406693 -36674 37968 -83602 -205920
19091 -205920 7153 -124577 436069 -213191 79737 301334 -132477 -45596 -149609 206210
19080 61925 -222274 -298287 -28579 -339946 -64668 -8097 -302577 -174907 51645 -103307 147117
19068 257025 391084 -377894 76106 59817 29859 -13340 149585 -183780 146591 -34652
19057 -67046 20638 -164220 -119962 -149601 214715 273852 130337 -222195 -234643 305186 141889
19045 -231442 66871 -81333 289847 -189000 -187429 -114419 -458179 -357750 398914 1267 -517181
19033 -97725 237781 87439 6190 -43842 -57664 -88367 47518 -25788 -11386 51276 -9924 -319180
19021 -319180 104251 273601 -92221 25516 92874 65135 -156549 -130301 -155524 -307757 -309705
19010 -309705 -129506 -182501 65693 100445 104809 -324397 -22277 30811 117845 -11741 153446
18998 -111899 -177546 4427 136539 607093 155903 74570 -178106 85895 -26767 -159839 116511
18986 269818 -101464 88084 -33557 -124438 29403 -2391 167213 -287350 -4617 -26485 181866
18974 -230424 -133720 -196517 -57074 160842 -150626 -227620 -107108 -71004 -146185 -151577 -387197
18963 -387197 21064 -119500 -81076 -257962 -163477 -193466 104025 -177883 -49519 -155420
18953 -155420 -269317 217593 133233 -123990 -18026 -33491 -91331 -181912 157238 -62254 183758
18941 -300451 -390952 -37548 -90663 -157835 -231992 -160594 -168265 -65961 -154677 54562 -98630 102645
18928 -32855 102588 75129 -78521 -94024 -301185 -75425 -34800 -224867 -321654 48259 222985
18917 222985 -45769 -223003 -158013 133634 95398 32568 -126631 -321013 -317466 28001 11757
18905 -326103 -77284 94010 70034 212869 -104977 274112 53531 27242 -182965 -139754 14664
18893 30862 -153601 -50997 -212465 -104545 -100983 128631 119512 -243217 21519 31191 -103827
18881 202971 -263556 111059 -337034 -151791 -31113 230634 -289506 -88314 289375 -347389
18870 -165691 -1828 92760 -28243 -99613 112473 -181579 259008 58758 -175247 168799 83268
18858 -81385 68136 -318090 94077 365577 -22473 -182136 -18683 -130495 51796 -591444 32320
18846 -274255 -166778 -33203 27972 217698 66611 87064 -212740 -175895 -234754 -121065 -118779
18835 -118779 179174 -295299 -145952 -369151 -252220 -57723 -26250 97082 84235 -98682
18824 -69263 -41498 -411520 115189 -66300 -55640 -22833 381247 -29007 -154536 -201665 -106524
18813 -106524 173878 -32153 -27552 -15665 -186105 -121153 345111 -113005 -51964 -177616 298378
18801 58698 -108919 67967 527052 -312580 26300 -529935 -228631 -32032 195621 203992 198380
18790 198380 -107568 -140591 -53111 -143171 68734 237562 115689 168152 137491 255945 144571
18779 144571 -67381 -251242 411042 -157424 -76413 -242364 -141177 76097 158899 -171940
18768 -153487 158594 -66253 -228021 -37115 -193786 -11798 157213 -47678 -338187 -12703
18757 -53922 144790 395549 143363 -156581 -186658 -360998 -130812 -249096 -166922 -21849
18746 -93640 -220916 -392387 -154972 -62530 -99001 -232392 -76266 199741 -330973 239307
18735 -132337 -143405 19937 222291 -151349 299666 124064 -234806 -178641 -174304 82719 -148040
18723 170150 80650 -105582 63557 277220 -278608 -155116 -322043 -507515 -199962 88843
18712 -49435 -141398 -92339 -45377 173679 -93238 -128166 33341 -443299 -209926 -399211 -113770
18700 25254 167458 -210143 160205 -41698 185710 20093 354211 -298386 59091 75375
18690 75375 131029 -102733 -546685 46598 -5837 24834 107469 -136453 176790 95861 -382714
18678 -248213 276198 -191836 -262735 -36311 -466948 -314142 -101639 -36483 44198 -143112
18667 206948 169031 208964 202882 198397 13655 126004 -181155 -266403 -86889 -375216 173894
18655 421977 116967 -51360 -175969 -75298 16298 23941 -174460 -105827 126658 -263553 -80980
18643 -36502 8457 -326819 -44582 46557 -208924 158195 -176839 -346901 205052 501 -37123
18631 -21401 45514 -153552 -122144 -31187 -8474 57730 -190856 -29509 -306911 144440 -253501
18619 76776 51357 -289174 122231 212587 133196 58167 -80784 -261811 -32681 249074 -156495
18607 -133320 -204768 -393897 -266065 -722 136730 -3160 78614 -276454 645 -292436 -128600
18595 172951 82236 -484476 114447 104059 -44337 -123658 -86692 146160 -140787 -274826
18585 -274826 -81283 54691 -302144 -298015 -128047 -272943 -97586 -18841 -127232 -101562 -205438
18574 -205438 -212087 -105027 -50022 -46309 211715 -147889 -228216 33483 203944 222195 -68508
18562 24435 323802 -280398 -142689 -162927 73965 157344 -69996 288860 -7197 26439 -177954
18550 -450001 61706 120039 14365 -187072 -100124 218670 121901 67214 64705 -195013 28380
18538 63227 -92175 100751 -326917 -72632 63439 -80312 -247351 25801 -100179 2214 -398300
18526 248594 39001 -127794 -203184 -157199 102067 -68508 109398 -11595 -420600 -286162
18516 -286162 -110558 -540258 -29361 58342 104392 -330787 -119142 -184686 153177 -58327
18505 -306567 143749 -188744 -71909 41397 -96085 104092 83665 98717 -4432 -60332 37352
18493 3690 -110695 -260264 -78377 129246 257434 -60977 63177 -344567 216247 -251781
18482 -39831 428100 2657 123047 -20763 -64818 -158737 -93037 -80711 -393121 -75424 99222
18470 98304 252524 212332 -136619 -67143 227748 -88623 260570 229065 -327362 397936
18459 -198505 -187295 -178973 72958 -198495 148881 -430485 -146814 -155894 -361 64377 -137735
18447 -83832 73162 -67771 341358 123935 -442517 81266 -393353 68486 73291 -272466 205473
18435 190779 110745 -235938 -217240 83431 -164624 12453 -257856 -252252 -1654 -385150 -48738
18423 -82062 -390273 -70170 42779 -43485 -155456 197392 -27415 -138863 -37466 -56981 -170193
18412 -170193 63885 -88248 -130234 152991 -138845 -111377 -406026 -345481 -146312 -180831 -110723
18401 -110723 -268225 -213416 435170 -26407 1408 -68551 -168029 -249505 -242760 -35726 -122954
18390 -122954 283457 199093 -164420 -66527 -158719 -94907 13871 107014 248087 165699 154777
18379 154777 177250 223447 82345 -142100 -60632 126732 -46872 45721 -150256 54231 1896
18367 66554 -23428 -67464 97582 -20388 106847 237751 -30741 -16603 -298692 -208237 -146832
18356 -146832 -229048 110216 -172476 -91382 166607 181227 -125626 147735 53607 106867
18346 106867 424545 -310882 -219616 -70642 -13662 -130699 210792 74511 -34140 -201335
18336 -201335 -97228 -123092 114235 -148166 247820 -130540 -11392 -109974 -106620 -280766 -461454
18325 -461454 58856 -204968 -475970 -110854 251173 -91786 -404633 -231957 4458 -109502
18314 2573 -54902 -323092 -88879 12716 -307727 -11353 56661 39696 25417 14805 -230914
18302 91712 41964 -93731 1941 11572 156105 -106806 62294 -494571 63658 22994 -114671
18290 88789 -171315 38159 -59975 -260843 -146721 -44030 -123882 -112201 1137 -234599 291435
18278 -272984 -72335 300834 -112164 128290 -65627 379273 -76965 -59387 -75236 -122901 7587
18266 -57262 28538 -167263 83440 -120875 -370482 -245640 272742 87327 396077 -60340
18255 14796 45150 -18012 -372817 -142203 -61289 -593201 139170 43973 30442 17310 -142101
18243 -271754 -36088 -250848 27128 -412017 -217585 169859 -159633 -40047 24328 179070
18233 179070 342334 88421 -104292 -172132 213462 -121962 -46821 -20257 183481 -256927
18222 63985 24377 207597 -54418 62641 37028 -46708 78311 -210891 60152 -334912 -218198
18211 -218198 1415 -40063 -238031 27845 367439 175605 -49438 -244078 196473 -196960
18200 -404992 17005 -64060 -170228 69185 110349 340866 -60734 -14060 -69609 -13069 -84126
18189 -84126 320134 -237257 -182733 -40994 -462005 -352601 -10233 234740 -363303 -106430
18178 -218820 1588 284350 -222127 99965 -28980 -219245 -138477 -6510 -365180 268996 93448
18166 -81630 187881 -23319 -69105 -12704 -177213 -290860 -45004 -116692 -281114 -66509 -305572
18155 -305572 107746 125959 -91456 106471 -33330 334607 282522 -9370 -194918 71754 -87479
18143 112350 -13109 -9688 259617 134556 -17911 134023 172032 -104645 -21598 -108410 -324707
18132 -324707 -211678 103864 106744 -347729 212331 25907 -982 -196979 -96196 8923 -56253
18120 -298983 -281252 104148 70198 -414336 -155304 285945 57644 -31568 466496 -179528
18109 204126 46929 142185 -235946 -208549 121140 166604 93134 -119411 -194941 -213248 -9805
18097 28414 181262 69983 87494 210904 -432088 24538 -89387 -45925 -41495 -7794 -160934
18086 -160934 -58512 -8254 32833 21494 107206 -406199 44228 70150 84177 -275210 -261177
18075 -261177 -130585 24806 -12184 192810 -139358 -103875 63963 -45109 -99268 232355 107908
18063 -262558 -55938 7155 -36357 -52687 -76162 223008 -43577 193223 -123165 155081 35832
18051 -65996 27776 319780 1771 -337664 -96800 -104935 -10292 -52520 18324 -125757 -81202
18040 -81202 -127173 -198228 -96139 -124947 258968 247837 102206 -178169 -58346 -92213 -145119
18029 -145119 -310734 30415 79893 99920 -93248 123577 -207 328049 -271704 43175 46517
18018 46517 94920 -88166 146160 241465 238822 -140224 -127954 31282 102194 -145625 51749
18006 66723 216627 -179050 -147648 -158313 -126190 -178365 50494 257021 -48013 -214488 71657
17994 100601 -216475 -218890 -179314 -106668 38457 -96553 166481 -81454 -108202 337462 35553
17982 -177858 33207 223464 -22104 -124216 -123241 -198252 3582 -142387 199716 87461 8158
17970 55413 514837 -164290 73381 120473 94679 -94465 63824 269461 110778 -508394 137980
17958 -122834 -172807 50138 -36612 -18425 60179 -280660 -134131 118419 -138094 119724
17947 90897 150641 33961 -63507 35231 56123 -155487 -222874 82509 -58844 42178 -90113
17935 -295367 158817 72306 64046 181331 -116891 33652 45561 -118962 -498379 -66780 -191444
17924 -191444 397006 -41194 21147 199464 -62645 40105 257414 -68629 -145484 -24398 190330
17912 -96370 -418587 116528 238010 -176207 -183630 -178634 27473 138020 -208382 -118089 -148907
17901 -148907 209963 -160995 150660 -450129 -115105 217155 231664 -50412 -139605 107877
17890 -156233 -252010 -218433 95058 23427 -286660 16121 -128662 -91899 -326960 144917 836
17878 27629 253373 -107958 100880 43971 -206211 -55461 -157324 50657 37333 222857
17868 222857 179478 109117 174968 -62909 118177 -40043 -132595 252424 242829 236219 18271
17856 449257 30946 100177 -136330 189052 25601 -192625 -331336 34074 -278628 -51884
17845 -3298 -404627 -185544 -17340 8333 98599 -280379 -10016 82823 232938 -63010 160252
17833 -173475 -76402 158872 -128488 262055 33893 -51190 267168 34072 183970 -146932
17822 143920 91700 31467 -70668 209275 242197 177805 38031 -137521 -37040 -104615 256585
17810 -253223 -144047 -22663 58213 -92157 -118147 270029 88842 -89106 141124 -148061 306744
17798 40355 219739 -220193 104893 -487819 223865 -299991 -223680 -24308 -240712 46718
17787 184835 2347 186330 146799 93492 48169 80128 -69306 -306331 -10356 -32636 195136
17775 184860 56600 266491 81134 29168 -125753 -275004 146038 -144201 -7698 -206026
17765 -206026 17770 -157066 489568 -141760 -254037 -165850 170808 514115 -297887 65335
17754 -338196 20340 -152309 -25542 165861 419770 145521 269192 -113415 -18790 -270651
17744 -270651 15996 11096 -24865 -97724 10953 -157162 -329211 124251 -73966 -23736 149682
17732 -29882 34022 85298 195166 19995 166328 8113 269383 201867 83494 301397 -132595
17720 -11278 -82336 -267315 -39897 268653 53954 64375 -96984 177988 153035 -71349 -126595
17709 -126595 14585 438164 160011 -165178 223209 34974 431 -353644 -216276 344797
17698 -199771 161578 -122064 -184707 211292 -142708 18 3790 48229 -63849 -11241 139804
17686 -460664 215108 171538 -65764 191100 109363 -40595 66983 -117923 133311 -68845 -33440
17674 -129234 179594 10818 39291 54455 94601 -70682 30701 95602 -131336 108944 -372597
17662 -56819 101082 25040 313004 36803 -68706 -342076 404620 81216 35837 120502 -55781
17650 -269084 307221 151952 42918 -387385 -327805 -460495 82177 165630 167781 -250142 -181753
17639 -181753 -373037 -111757 202789 108062 31514 -226250 95289 -12571 157492 -257953
17628 -38586 -155674 42219 -113754 71474 -29596 346496 96020 -46253 106297 78488 22833
17616 28141 -139782 23580 -30452 -364151 202849 130676 -277559 -72088 155213 -195204
17605 274312 13451 -40775 116938 99889 173473 302476 240489 -185913 -72206 8843 -119637
17593 230176 257676 -15771 -292803 66735 270692 -290576 49488 108740 -79892 248241 -20057
17581 83703 53846 88541 285755 190528 191211 30599 -225422 69427 172257 435144 173411
17569 -182713 -149263 58911 175259 85114 -46998 47138 32939 -72956 -48785 250652 -91894
17557 73093 -223630 -292244 103271 -150541 -230088 244000 -157981 46464 314102 55173
17546 108978 -89044 -161924 253072 -117980 377663 58014 -205169 51580 17142 371130
17536 371130 126505 -291419 -146181 479 -106730 -203770 -416084 69509 146697 -63250 -18691
17524 -139936 45940 159955 -200273 -23359 182470 168733 103978 -123777 -208036 140735
17513 -125678 182835 349290 31783 82066 87059 2861 216747 77192 151019 -145300 -35211
17501 76365 254726 198053 -63080 253605 -78124 59467 132 250462 -192523 266374 111331
17489 -76421 3482 -126450 254532 392055 -148466 -97861 -117593 172047 -38410 -47269 -103329
17478 -103329 13641 249145 221216 -219672 -133517 236052 -248030 161423 28477 75965
17468 75965 263037 288628 14574 160353 273896 117055 -217153 -248775 138922 44174
17457 161590 181990 272458 301748 294667 330378 190903 182796 89444 508798 357391 -34042
17445 143816 318060 296407 311108 121499 304628 70497 527094 83112 290715 -134246
17434 364877 449232 -209316 62543 347357 220606 202533 130021 297751 303762 314813 162009
17423 162009 313421 358647 235810 545776 339540 162856 181025 101887 483434 317313
17413 317313 147667 320364 180515 595889 563092 341695 114514 109675 123539 62476
17403 62476 499424 126472 177882 88036 102720 370195 263281 -148710 373982 400925
17393 400925 311013 -128298 282570 341356 116570 303929 29009 136283 388004 311060
17383 311060 101963 344905 183099 -98580 -8199 234210 1941 265454 326784 100300 -77955
17371 -43563 237689 207705 180874 210621 53284 328175 -240599 234665 225403 272502 163343
17360 163343 9733 -136488 382017 573080 64597 182731 578938 104697 -67984 93840
17349 51717 240914 117372 188678 -6895 -71043 77209 -2728 137139 270819 -75843 513086
17337 144598 -68967 290281 596848 287112 365070 374394 321914 64266 390135 -88945 -8160
17325 268208 276856 138643 286663 66712 -290261 -217468 -126860 261039 74831 261675 346
17313 153128 20578 -99940 169550 17154 107946 68916 389164 194887 287113 264957 122823
17301 -53633 -63716 -62777 136615 32427 85390 -33459 -221783 320479 199806 -98365 102104
17289 336697 245170 172604 313416 101141 82022 28768 269646 192936 175375 216597 30096
17277 24291 496469 228797 105856 89376 172495 163841 167518 -24000 54053 132299 222015
17266 222015 -2347 82739 439826 171707 182491 339587 116861 355286 182909 -155524
17255 58078 415157 158894 132668 287277 82839 188697 71571 351558 243420 311551
17245 311551 59137 71540 286216 -36659 202878 171433 266551 -2259 583071 75501 308328
17234 308328 382184 -156549 183641 456056 -163959 324784 590412 83389 93317 171365
17224 171365 353523 191200 -11178 42068 215315 60248 224634 338235 540535 71960
17213 409157 163788 301613 440329 352906 546156 -187455 292877 137850 163283 381509
17203 381509 317814 181623 126415 194336 423727 602156 209473 390681 246419 277261
17193 277261 188164 401819 374467 53191 10793 341476 213063 289605 211936 492682 -83186
17181 -59807 214845 24162 284536 549337 19691 314230 425623 734427 315620 194981
17171 194981 254124 328023 166837 369618 185621 562125 305070 232671 289265 205273
17161 205273 232433 480812 401537 173205 419984 496319 98972 310096 414408 349442
17151 349442 265097 263261 426308 253849 149890 376310 342295 253794 410735 394306 274345
17140 274345 312565 217789 77038 430478 501707 393877 318413 302374 90856 133847 198884
17129 198884 591044 376469 595800 785620 145373 306896 612091 372911 185954 778993
17119 778993 466480 341894 152833 350067 325240 503188 830553 202098 193912 354839
17109 354839 390476 157508 260108 673249 458417 446663 382367 525373 521845 697757
17099 697757 466650 686659 617412 430733 638710 304018 306390 205284 597731 195687
17088 727386 703814 304277 501537 605023 342372 569418 407906 482916 465825 743847
17078 743847 393816 524785 841556 525487 462157 925430 161076 702855 358331 621208
17068 621208 465700 416490 375823 703434 438189 568342 382065 545381 633503 614657
17058 614657 542834 449019 460451 510002 367933 523006 347992 394737 511685 337908
17048 337908 688578 410755 520882 386789 479968 907280 539552 671407 1180914 72559
17037 558652 607334 597246 692418 597446 534997 528549 521881 546936 332423 741931 855029
17026 855029 449543 323055 830377 549084 693608 629925 444657 753171 738283 785079
17016 785079 687580 434537 788030 733101 654307 901344 847840 771488 850286 1014377 605116
17005 605116 512528 867959 693402 723999 736772 543170 700548 607767 541215 720427
16995 720427 631822 725586 741035 506860 805724 953792 925287 677177 918876 877334
16985 877334 939022 893145 947321 788698 826446 652414 891751 904359 736724 846192
16975 846192 1083162 887033 1103535 899039 922491 860265 743126 981761 836405 544142
16965 544142 915656 904653 1077448 851803 946449 707702 1005094 982762 671778 1546372
16955 1546372 840277 958638 1230254 1268946 831575 1157195 981117 1232469 1139797 1188721
16945 1188721 791444 1023168 1240883 848558 1047037 864974 1202501 1220937 1061907 1157902
16935 1157902 1185454 1143658 1255232 1342098 1107975 1226973 964205 1245135 1428853 1395358
16925 1395358 1213147 1090631 1392632 1524766 1215903 1498787 1375182 1261791 1255339 1444015
16915 1444015 1404328 1322869 1507850 1561260 1369799 1404355 1457795 1661071 1377074 1809476
16905 1809476 1486371 1665420 1799331 1406532 1183617 1681893 1857817 1636847 1384518
16896 1384518 1706634 1687602 1696856 1369153 1442722 1802392 1782528 1524913 1711730 2009805
16886 2009805 1810418 1864371 1745559 2227049 2066247 1685613 2120771 2128357 1876926 1925360
16876 1925360 2442318 2108143 2372998 1931101 2253395 2288876 2021039 2391030 2302847 2255368
16866 2255368 2523005 2502699 2140506 2552633 2488459 2628352 2524689 2643515 2330003 2505346
16856 2505346 2689222 2874284 2648912 2625137 2728728 2819805 2507681 3131172 2591057 2894237
16846 2894237 2995648 2797049 2942789 2929041 2879294 2870478 3195570 2813275 3396588 3032146
16836 3032146 3291075 3551083 3579585 3557070 3128011 3505747 3541568 3498347 3834055 3870330
16826 3870330 3829899 3866926 4136340 3766933 4125894 4086670 4085489 4286639 4079448 4098633
16816 4098633 4409639 4876186 4528032 4647148 4578616 5173774 4624784 4822703 5090954 4882984
16806 4882984 5349669 5168818 5294907 5346576 5672127 5324486 5508684 5756474 6040788 6233887
16796 6233887 6112730 6020701 6399879 6368866 6515735 6817374 6497131 6901090 6955311 7051180
16786 7051180 7388226 7274425 7722953 8142859 8108369 8202189 8634672 8525014 9046444 8975321
16776 8975321 8918364 9417495 9709593 9873020 9857448 10513983 10573481 10486637 10728502 11275379
16766 11275379 11596302 11698536 11967300 12171398 12484533 12818035 13368506 13902088 13952660
16757 13952660 14435303 14377591 15177311 15306766 16029326 16541510 17203859 17790197 18108266
16748 18108266 19102447 19110666 20134603 20861430 21290796 21900686 22600336 23450562 24130392
16739 24130392 25255809 25803864 26982458 27950580 29089574 30076520 31247061 32383109
16731 32383109 33910751 35084329 36551838 38162715 39718571 41696929 42659928 45373752
16723 45373752 47402236 49516237 51847233 54340148 56898069 59336003 62190271 65523635
16715 65523635 68696601 71561704 75512583 79324662 83278519 87489555 91855612 96543311
16707 96543311 101645013 106214071 111561915 116909271 122154161 127701545 133084412 138646307
16699 138646307 143462320 148814945 153397384 157423955 161685740 164548063 167558162 168677393
16691 168677393 170160943 170183852 169886033 168606537 166456936 163413783 160257079 156122982
16683 156122982 151660322 146939924 141696394 136268751 130774677 125386142 119925568 114632116
16675 114632116 109085984 103707886 98876637 93870371 89326472 84580300 80640733 76737993
16667 76737993 72964345 69582099 66303469 62674056 59821260 57060972 54161107 51988380
16659 51988380 49324952 47156022 45134296 43011143 41049186 39337043 37727235 36042459
16651 36042459 34589598 33106857 31806410 30560459 29358061 28376262 27229674 26514296
16643 26514296 25194045 24386411 23565423 22665265 22022133 21090063 20049145 19916547 18763537
16634 18763537 18243190 18136619 17280758 16447527 15856978 15820489 15399628 14825553 14210496
16625 14210496 13663830 13502697 13122878 12641301 12380706 11983769 11965342 11269802 11518514
16616 11518514 10897938 10829753 10068073 9959156 9911446 9914426 9354933 9164674 8798645 8499301
16606 8499301 8349448 8364231 8154261 7705917 7479156 7609307 7254276 7064464 7242520 7032413
16596 7032413 6409445 6887411 6770768 6323303 6138383 6421083 6362048 5820773 5966231 5387774
16586 5387774 5532570 5643924 5247004 5170276 4996712 5119952 4984479 4948051 4907700 4692643
16576 4692643 4366806 4364030 4292861 4674490 4102485 3932893 4341938 3972609 3967255 4083324
16566 4083324 3788944 3597244 3611894 3686674 3673300 3363833 3260966 3359226 3016074 3480337
16556 3480337 3225840 3203683 2830041 3374694 2859670 3024867 2986577 2969713 2892714 2625069
16546 2625069 2557299 2638729 2705400 2561808 2753735 2699024 2581188 2572734 2481131 2749782 2250761
16535 2250761 2487797 2137528 2310658 2503967 2202330 1951751 2029712 2252039 1940211 2080200
16525 2080200 2476764 2117635 1881513 2134841 2151188 1688530 1617786 2184068 1905266 1751336
16515 1751336 1803057 1877889 2126325 1995691 1668414 2121198 1835821 1632649 1969671 1416064
16505 1416064 1518378 1579775 1836725 1223025 1567727 1512610 1485158 1518293 1463444 1337772
16495 1337772 1402462 1427220 1256857 1439115 1179753 1348325 1610318 1337583 1407777 1569422
16485 1569422 1388475 1361218 1459976 1362585 1206123 1103437 1519349 1261590 993189 1277774
16475 1277774 1349290 1367882 1140095 996455 1069023 1150860 986695 1247470 857754 1158614
16465 1158614 887983 948300 994614 1159571 935167 811901 1240454 777518 739842 834040
16455 834040 919271 668389 647757 997462 683873 866981 750135 920792 675592 563833
16445 563833 746995 851606 783518 935091 1167262 808608 788787 733005 774105 828498
16435 828498 680659 821556 771670 693273 767818 976608 613252 874858 831956 979217
16425 979217 583339 600101 458785 553453 824256 822255 535470 625605 737084 930770
16415 930770 708370 879758 716347 528703 710453 508075 548325 576195 875558 503361
16405 503361 298343 557456 651516 654426 456834 785022 664863 539961 661881 694227
16395 694227 673215 596013 228259 597526 233733 486106 623899 644446 822365 685983
16385 685983 746026 595561 320191 481425 680044 218980 678729 416641 339018 520749
16375 520749 57583 460457 128211 677404 512707 251798 569598 418305 376961 369257
16365 369257 234992 484780 484829 631232 388615 126261 318825 169091 276551 188156
16355 188156 -45059 436471 292742 602213 208102 661621 392720 410196 450776 336218
16345 336218 -287895 560220 698456 403386 91355 365706 112773 457398 362771 373077
16335 373077 193465 319291 215158 349038 343166 586197 216862 329432 281099 147286
16325 147286 411834 193560 137283 305102 345107 45863 457969 182493 238357 252836
16315 252836 297229 164213 305708 685397 165853 287819 126414 146465 223878 387074
16305 387074 291498 490727 422922 131105 274869 356237 322486 -87780 -33061 104611 446385
16294 446385 190934 34947 190922 134811 41150 45352 -12374 -158838 142538 606636 222916
16282 232457 207837 298603 315998 30270 354453 45998 86769 -97126 260728 -41264 269894
16270 314008 275691 -88514 169265 295760 507632 285019 34413 184383 173279 349216
16260 349216 163144 153453 73107 90250 20028 46115 95748 -146041 122870 493868 126805
16248 315507 319632 117446 87338 58624 253405 17162 88491 183625 261288 -21756 87764
16236 110951 269245 21374 226527 217545 136252 265175 -140114 17490 -55802 221121 213008
16225 213008 -75792 8419 217507 -106783 168466 358040 142913 -101416 -27507 154566
16214 104575 194027 222855 69085 100407 -242252 280311 -61854 237867 123383 -321810
16203 -270290 342495 -237823 167111 -27773 119021 55240 -32840 -28512 84380 25359 75718
16192 75718 372273 30421 49261 158926 155742 426094 -169452 258215 223367 256024 158424
16181 158424 -110647 -230577 -224040 124343 182252 106778 -49469 67360 101659 -134613 -137181
16170 -137181 28134 240097 266733 206545 52314 180719 226246 65998 358575 1989 212652
16159 212652 279318 9884 68377 -9260 239591 -189036 -139836 -42141 116862 371947 131097
16147 -40172 139379 255552 63978 34493 211385 118581 -79230 107934 296286 105709
16136 239648 -136566 -70881 89559 67104 114213 22996 -256373 30990 286461 17983 -210935
16124 -46299 71527 350272 367860 251969 -56856 -44958 -97263 -91591 -199798 282959 2707
16112 -247283 -315152 135804 -82598 -34325 102857 -4462 116963 359565 195689 -20082 -119508
16101 -119508 -84049 89272 -37441 194908 -43740 169428 216657 -123106 53987 75264 -125822
16089 -211670 229947 158292 62314 -2816 -54622 -70991 -34841 178514 -266163 -141152 -171795
16078 -171795 -51197 -83248 136410 364877 92355 3741 243581 130115 239451 327915 87554
16066 -108265 -213324 153471 -80700 -61116 127725 -5072 41866 162440 137576 -62937 133610
16054 -312819 -156454 255845 9809 -185539 222517 310629 -410906 -22414 567825 -197192
16043 49205 502083 -448945 84444 -39935 -76108 -194395 -485676 -197798 -49902 137667
16032 -30997 -190392 132004 70839 29671 275708 -310860 -33748 -274162 -46643 -73707 171987
16020 -75345 -56732 53078 -253106 -272898 -120022 133576 224486 -222702 -119622 227313
16009 182034 -280021 -380949 1452 84704 106698 -317549 -206848 -93246 -264173 -349310 -165256
15997 240817 395864 -81684 135526 -249644 -177747 -133289 -236389 210294 116117 -24980
15986 -10863 78159 102760 -227455 -150178 80273 226697 117774 -174683 -289280 -118434
15975 -496335 -326884 41943 -69201 11196 -44301 -7273 336946 267715 -209489 -306303 62577
15963 316744 -109370 -66626 334133 -28040 163787 560363 171069 271903 509959 162384
15952 270319 55456 -61500 -66454 -137349 47879 -125550 -170410 -326865 116709 190411 -31274
15940 150026 -107387 240397 164272 -80747 294132 156057 -115765 68411 360398 -127095
15929 221109 25021 -163352 -58701 31632 -118250 90865 149818 94715 203005 59121 100232
15918 100232 98309 295729 212391 118989 253274 -61363 -288629 -218847 198720 176540 -37439
15906 291335 -55923 -54309 -41291 -260428 -281459 -43392 123122 175306 -274988 121569 -175621
15894 -70263 221244 436228 -233251 -27478 340049 -151667 -64379 -26828 -296274 -29209
15883 377149 83522 399776 -55279 183397 24569 -145626 -129850 -234590 55258 -132405
15872 -40341 -11023 -50402 51213 -127342 241109 -15631 -389351 -188083 -3023 249704 154478
15861 154478 94383 -193253 78497 171600 225971 -297491 23659 -118295 -7480 -332590 6007
15849 206119 -129574 -244339 -151603 -262076 -81996 363841 348717 -47172 -80037 222819
15838 -219417 443980 154523 -83224 -125097 239538 51156 -119056 -110303 95062 156703 240049
15827 240049 -215000 211239 166930 -167350 30821 -254031 -204419 263093 -44239 24778
15816 23647 -239531 99951 118081 -184510 122407 206486 -91422 62120 22603 49160 -17557
15804 -104424 -83493 23247 245662 172635 29713 71744 144687 201172 -94586 83505 312480
15793 312480 -224575 -171656 96147 -362194 -119720 -213804 -307891 355931 -43985 -136241 -276039
15782 -276039 -13955 283739 -118548 -276393 206246 212004 -30350 217670 -200442 98215
15771 -280826 125852 -83467 57780 -422344 -253017 219164 -11828 59864 -52751 -202355
15761 -202355 -28245 -17008 -221027 -133975 -144994 -97285 -221026 224613 -218316 -232373 -199455
15750 -199455 -85956 167919 -36537 -18698 -62204 -150925 -60472 190992 -127006 103151 43184
15738 264360 289723 -160351 -86166 -249781 328768 -120315 -62028 -127791 -21807 200828
15727 330343 367653 2656 27029 216754 -213706 -6320 384273 289094 -70233 182854 161191
15716 161191 321443 211385 9561 351755 38335 52008 -290151 -161038 -157789 108934 -69680
15704 113626 51039 -175632 -70711 -132476 23400 110116 43885 30096 -52977 -102045 -137160
15693 -137160 -41701 265198 -345471 14756 74974 -210524 -226584 -100143 131788 242084
15683 242084 147915 223175 -185506 -276491 -94455 -186466 -4301 -100172 23740 -189097 -163330
15672 -163330 -208173 105107 7586 -110757 258856 -167925 264852 206322 203059 253508 20362
15660 -191016 -9480 -170937 -105986 205292 -152185 -329965 22541 -82985 22435 -208534 423907
15648 -1262 -54913 155798 114633 35147 87223 40830 -153944 132344 -137157 -295090 76699
15636 189381 -270946 -293981 -72310 33461 -149976 -48744 -15177 -44621 94117 139490 6694
15624 -50868 58183 -88732 -143826 225612 -53079 -71611 80894 225311 -31849 87747 -11255
15612 38830 133259 27180 163044 -194175 100687 -26310 37649 -236900 126305 -40580 -124836
15601 -124836 -128293 -69770 12833 -15366 214605 94241 233488 -121502 123903 -236780 -111202
15589 81546 -6130 -142037 73609 236431 -88029 113572 110273 35654 -260304 2467 -189715
15577 -159632 -188586 -80946 80774 -332842 -262131 -11661 46026 -370452 -100266 37380 96596
15566 96596 119788 68895 19980 -10034 105840 -75810 143196 37379 -96178 9120 -94689
15554 -213029 168214 238734 -175515 -217542 -73583 -8952 9055 -120181 -129274 83059 232120
15543 232120 -199520 159215 -11250 -50242 55219 244554 113885 -118521 29068 13741
15532 -318994 -237820 43212 126630 -104009 -104210 196059 2441 -152163 289537 155475 -60666
15520 -203939 -251800 -90486 87886 433314 121033 -390026 108398 285763 -71363 151114
15509 -370309 116232 69177 -56471 -24109 25625 -122324 -178602 -109679 -262075 239649 386896
15498 386896 -37083 -236239 -115594 79972 244471 453910 -118305 374974 72821 -113285
15487 192576 364201 -172551 -93128 228180 -478212 280555 247656 -289023 125825 -124755
15476 827508 -151684 124808 -303379 244414 -254237 68310 -282191 -82573 63662 -76274
15465 178103 126427 -15556 -102958 169729 -95146 -175279 89529 160721 15939 -3330 -93371
15454 -93371 -184065 -91022 -120821 117122 585 -983 156846 411204 -120822 46091 96889 -150925
15441 -154018 160873 -47670 113950 -318963 288759 -12506 -207148 -100264 -157891 295337
15430 29479 -73082 -6095 -21050 -77225 -181144 154361 207726 93075 -148349 29885 -4386
15418 -132140 -159736 202406 15649 -5129 -120805 -32601 256344 -148273 354152 -37572 252044
15406 128528 38211 -158448 289625 394420 -152440 -67320 27454 -117823 -375450 99408
15395 -33308 133245 -62588 -115094 86509 96149 -8461 -172419 -275843 -130085 178277 221670
15384 221670 -257326 -253620 -186050 -9795 429461 85359 -25894 38574 -132644 -22509 -123061
15373 -123061 -283134 -87711 -527759 71949 -12981 -286755 242672 302540 -12998 -99728 -48395
15361 132738 -67239 -6365 156813 -21684 211880 47872 286345 -139222 -47605 46005 303781
15350 303781 -165068 51509 288919 -81090 15973 149342 -123839 -353493 -6443 61063 -44028
15338 -149276 246464 129539 151847 -104690 1900 -233025 -257 -215105 107596 54053 -118157
15326 356481 21140 176214 -206152 -290154 115868 -46686 57622 -41876 -187479 111917
15315 35885 -30681 136472 191564 22295 397001 155623 -55992 139196 -140596 -20221 -301807
15304 -301807 -266040 -257834 -20253 -106126 -294336 4238 -118788 -55486 252440 -121016 95444
15292 66489 -122725 -61419 -80918 220133 118407 268078 101918 -165444 13284 30043
15282 30043 141717 356456 16680 -112405 254898 101606 -158044 219591 189510 52576
15271 141489 213476 46789 -188815 207705 269566 406542 -201043 307742 -47500 90962
15260 72476 48822 -8427 128668 194314 154983 120212 46722 -133629 154811 232081 39943
15248 -119192 -59462 -110131 -213947 214990 -299046 -73389 73501 -250152 -114798 191602
15237 -130343 214568 24263 54954 41984 136317 235198 118917 266307 -148596 537742
15226 138539 120263 128979 385301 717410 1508781 1490736 1336553 1534154 1044049 456321
15215 287861 209317 199114 -143065 272345 -124102 369270 147504 -8705 -154477 62907
15204 284319 229383 -26358 109198 125819 50214 -230129 -121550 180266 -17390 143201
15193 316297 -253840 -252671 -25665 37197 222802 79227 108566 -171996 -28892 250752 -156453
15181 137917 -102417 91728 112159 -97029 70521 -211945 -192476 -258979 -196233 231624 -47413
15169 -117057 329831 -38556 85198 85185 35835 195070 -5886 80979 58054 -118638 148092
15157 -204151 -213679 -23730 53000 -3676 157720 -36089 230988 381954 -357224 56828 -218058
15145 76556 16708 8266 85483 300898 -223 85542 134140 37816 202926 34630 226126 -87050
15132 279346 -334243 215406 186163 25594 233056 128596 371649 92511 -149708 139044
15121 -57394 -197086 405772 327701 -17104 73993 -45958 197268 -59624 134074 264608 255412
15110 255412 20975 -937 222695 72202 29869 108652 72329 117801 419631 -254504 667949
15098 143039 199906 38116 98598 398135 354776 98490 125189 431925 10052 -209579 27700
15086 159694 110138 86390 -171984 217666 269437 347673 111261 335985 20270 -230438
15075 -16022 338971 24017 222832 28494 403207 344709 219786 307238 469612 63216 220650
15064 220650 207892 102841 27578 189160 316373 296450 -130798 309400 163989 425293
15054 425293 504850 -71774 -80248 248581 326276 212532 182072 208693 -6922 124736 370203
15043 370203 -163804 222073 227919 109506 207359 55831 190656 132303 105080 263331 91590
15031 49190 180712 266130 230212 520265 -130917 288430 162348 18033 187643 -35366
15020 200909 213579 49159 3757 560013 322519 165387 303453 151376 -44128 223014
15009 227386 353152 182349 260994 -203046 265698 18979 -225031 -146986 359014 173054
14998 430800 318891 512312 -107888 -12137 196681 164231 183435 366021 176459 362184
14988 362184 -62547 125816 13202 552054 -18621 277919 20577 301771 241763 116501
14977 -182770 275331 -32759 325215 353853 -23562 339338 263133 290765 272105 -41852 144522
14965 132026 343746 244003 103077 334594 138941 130052 380784 28450 338256 220469
14955 220469 321005 266359 157360 -71780 346144 477177 424862 301819 270293 267331 285946
14944 285946 467902 333096 249007 291381 395957 -16144 288628 170397 300147 298248
14934 298248 373353 51964 358998 419846 178306 239088 416844 362237 165763 279990
14924 279990 88222 230733 281923 247848 254723 495748 96906 167154 186329 23033 515089
14913 515089 430282 471286 214941 414765 310659 120878 115640 94692 284438 380015 136721
14901 220220 230516 329427 -8206 -39535 478359 421724 407729 365533 327952 465252 281700
14890 281700 553170 400422 133286 221563 360872 409940 369670 289626 533740 276157
14880 276157 505496 374109 241778 -31528 142675 330798 363889 189700 234048 312374
14870 312374 216690 386321 486353 443689 481956 276972 149625 451022 -8812 379320
14859 489567 273037 345231 246804 67704 347077 605334 356108 326896 233971 384850
14849 384850 472675 478261 262447 488932 462544 185119 378876 305655 204183 515624
14839 515624 295645 318658 490485 422702 272902 299476 472539 691107 234063 289046
14829 289046 335870 432958 440476 612078 463482 265683 201725 197399 596051 495132 433007
14818 433007 363141 257513 240608 329589 322681 658565 473565 379531 530556 476098 525322
14807 525322 669937 568438 190334 560551 284895 482595 576649 612828 463610 801379
14797 801379 420348 207340 437097 233049 549619 218111 367789 579060 154770 398306
14787 398306 685370 235956 592947 417346 388864 219633 458822 637886 453859 595827
14777 595827 394908 540342 664605 617225 495691 510222 293751 414158 797398 214745
14766 663218 454739 405304 229951 462095 417242 306206 341470 582954 584292 780471
14756 780471 602790 576150 732810 346560 499058 174853 887675 405471 668836 690882
14746 690882 944136 588156 295498 329231 769225 501691 822508 749521 843988 327948
14735 670413 683364 582850 787204 469607 367102 430456 560499 619961 704689 752658
14725 752658 672797 621606 548974 1042519 507414 629291 524114 648894 806316 952621
14715 952621 530768 796779 894275 782328 817565 869941 702871 534220 741293 949259
14705 949259 774387 513660 866742 997507 730923 701889 707863 708212 760659 577121 896955
14694 896955 453631 468245 841648 752951 913533 766089 1103644 850841 858895 992330
14684 992330 926721 922178 1037009 1108818 706614 948418 902565 971366 1003370 1055923 1053783
14673 1053783 908410 905050 709633 927330 777260 774622 1056430 1082382 1030245 970394 1160683
14662 1160683 902420 990187 1023894 927615 981817 1031446 1254186 882082 1319003 1009752
14652 1009752 677531 1142842 1055941 892701 973482 1339865 1272818 1097185 915762 713637
14642 713637 1350782 1403757 1126489 1314992 740053 1227966 1146986 1057464 924164 984675
14632 984675 1237079 802996 1105385 1392655 1318540 1246515 1178445 1138498 939674 1372404
14622 1372404 1140282 1021322 1186517 1066256 1410693 1125485 1131401 1163549 1315610 1661675
14612 1661675 1349977 1439782 1170591 1190871 1260166 1202325 1491493 1348238 1393958 1361959
14602 1361959 1261810 1208160 1583686 1459494 1478609 1355912 1416872 1384670 1139542 1477345
14592 1477345 1478286 1528415 1396008 1378240 1651722 1661708 1425257 1305912 1533733 1252582 1524790
14581 1524790 1479242 1542256 1723619 1513613 2089646 1837909 1682132 1330314 1820307 1825544
14571 1825544 1603844 1289119 1523039 1574990 1658273 1786348 1714940 2075134 1643113 1531393
14561 1531393 1732931 1928186 1982051 1779858 2109391 1904495 1926732 2209807 1885329 1911011
14551 1911011 2046299 1860502 1905334 2071817 1998846 2167045 2155474 2172755 2448021 2344579
14541 2344579 2000866 2348462 2405561 2528117 2447183 2519678 2779947 2833359 2783106 2948611
14531 2948611 3170697 3371597 3525918 3575704 3941330 4517938 5353977 6918459 10518741
14522 10518741 15398183 25705518 46257076 36318974 17760462 8842939 4233582 3015067
14514 3015067 2182716 2079041 1921500 1933438 2154774 1622801 2226279 1919123 2113421 2269076
14504 2269076 2445473 2073914 2311663 2354857 2156394 2143750 2531627 2418729 2692066 2377059
14494 2377059 2481972 2658070 2369171 2722508 2522681 2696126 2513339 2736924 2646335 2771474
14484 2771474 2911574 3200042 2878115 2924252 3170701 3023440 2899464 2864246 2560980 3061885
14474 3061885 3113377 3249693 3292574 3040861 3227835 3374437 3633505 3462575 3558040 3314169
14464 3314169 3545231 3490226 3494186 3596612 3688578 3759738 3966774 3608599 4169181 3792205
14454 3792205 3836775 4151282 3957219 4216711 4196742 4052593 4356005 4174935 4079075 4580368
14444 4580368 4127913 4495835 4276120 4330931 4415157 4286976 4507705 4475174 4718344 4694740
14434 4694740 4832013 4874868 4903209 4989408 5086605 5271685 4989172 5349998 5301512 5270284
14424 5270284 5571774 5456732 5537987 5395497 6001243 5929988 5809156 6310838 5728668 5722948
14414 5722948 6203011 6083209 6248209 6456390 6482652 6705491 6459473 6501928 6909523 6457877
14404 6457877 7097203 7161546 7172018 7406926 7244529 7102533 7822066 7438445 7779189 7891391
14394 7891391 8181056 8140286 8341968 8738807 8433135 8963265 8957248 8947458 9135726 9157386
14384 9157386 9202931 9441269 9394284 9545513 10016261 10044469 10071576 10415400 10543981 10609938
14374 10609938 11090094 10917745 11063733 11288828 11571872 11736575 11880150 11940543 12273457
14365 12273457 12263353 12442209 12735583 13066957 13148628 13476576 13744757 14103866 14458574 14701512
14355 14701512 14615033 14966057 15069959 15565714 15960151 16356274 16409343 16474853 17188276 17319712
14345 17319712 17919995 18200184 18352788 18931581 19227866 19650819 20394593 20519534 21092541
14336 21092541 21535071 21799229 22203702 22695782 23446096 23934680 24393747 24924329 25733898
14327 25733898 26041190 26825847 27750219 27875940 28890082 29406182 30358767 31084872 31950781
14318 31950781 32645522 33276070 34345044 35483127 36443354 37451197 38522221 39564250
14310 39564250 40794395 41800702 43009216 44069212 45622564 47168169 48500770 49751003
14302 49751003 51621185 53219522 54907403 57019621 58790790 60660986 62964550 65305973
14294 65305973 67715391 69922062 72434257 75623172 78394736 81271252 84621602 87985298
14286 87985298 91884923 95611925 99615547 103734974 108107678 112853549 118227589 123675044
14278 123675044 129435460 135317084 142077781 148867318 156353833 163847399 172227061 180521160
14270 180521160 189681886 198969694 209014728 219637174 231468522 243205762 255595188
14263 255595188 268944063 282912434 296974333 311425759 326901933 342351814 358199730
14256 358199730 373973679 389373687 404608043 418956046 432731072 445133774 456412785
14249 456412785 465301169 469866960 469883689 469425633 470326169 471103079 469527092 461904938 457112411
14240 457112411 449309051 439165462 427264552 414375750 400258986 385553621 369853018
14233 369853018 353665893 337397381 321515953 305704025 290804018 277483023 263653197
14226 263653197 250435195 237821205 225671189 214566993 203755473 193751470 184147238
14219 184147238 175487570 167325155 159441469 151991527 144788765 138082913 131836601 126549009
14211 126549009 121071898 115582716 110863468 106091007 101553912 97899522 94419187 90213347
14203 90213347 86709999 83216599 79994303 77139364 74196283 71804891 68872278 66454129
14195 66454129 64072239 62022188 59969607 58189905 56135859 54368040 52780266 51287382
14187 51287382 49863261 48166658 46492979 45118643 43626587 42522829 42161122 40937116
14179 40937116 39303686 38094061 36701850 36303301 35525114 34839822 33247772 32527187 31865917
14170 31865917 30930776 30472207 29631872 28674208 28056825 27427191 26648471 26286422 25261357
14161 25261357 24430476 24009830 24022596 23348051 22811350 22184368 21883277 21254898 21061372
14152 21061372 20439393 19842157 19576545 19168913 19035146 18688113 17961037 17926144 17261693
14143 17261693 16936534 17115271 16559094 15967704 15925997 15219477 15371520 15004497 14743706
14134 14743706 14498663 13811243 13567851 13801122 13823474 13100307 12944818 12650371 12356641
14125 12356641 12422583 11889973 11767530 11758318 11423074 11157109 11000662 10884239 11059603 10897051
14115 10897051 10353327 10423094 10235407 10081362 9948990 9750298 9802307 9618940 9114171 9049951
14105 9049951 8885608 8678848 8747318 8762750 8875630 8283798 8311586 8233175 7921037 7832313
14095 7832313 7877167 7676005 7857326 7629188 7420065 7227502 7197588 7490871 7015915 7170682
14085 7170682 7293830 6876968 7010002 6817173 6549309 6521086 6561959 6190204 6299307 6240966
14075 6240966 6367807 6000051 5942660 6209571 6102219 5826087 5796322 5727059 5799885 5258369
14065 5258369 5557241 5860035 5319549 5452499 5213258 5239746 4986687 5058390 5184106 5263476
14055 5263476 4792932 4826412 5106084 4397897 4586787 4744380 4848161 4688315 4852706 4689561
14045 4689561 4355572 4376917 4100651 4432070 4220143 4055194 4311376 4239431 4179687 4093551
14035 4093551 4014333 4082776 3968522 3787419 4291476 3893646 3966453 4031068 3852831 3869722
14025 3869722 3565770 3958578 3807054 3692538 3429703 3409778 3570215 3450706 3282758 3474192
14015 3474192 3181098 3458148 3384528 3330343 3176179 3081584 3144837 3213644 3014920 3124283
14005 3124283 3053970 3054525 2982554 2825788 3212658 3088501 2937412 2471309 2560060 2485244 2979846
13994 2979846 2810783 2763999 2559164 2602371 2687221 2686856 2605159 2580657 2452444 2550880 2581926
13983 2581926 2683513 2504969 2500851 2490932 2316038 2441996 2126706 2014477 2363737 2347183
13973 2347183 2278355 2315159 1791003 2355948 1833469 2001785 2407270 2583275 2679088 3501014
13963 3501014 5767352 9230297 17438631 38267308 42148352 21591434 12548287 7752946
13955 7752946 5932758 4730098 3978958 3470601 3220167 2948213 2708008 2997392 2641965
13946 2641965 2651431 2747219 2663665 2178004 2522965 2444795 2584220 2169462 2275671 2130190
13936 2130190 2246995 2063399 2275901 2556217 2475486 2145923 2279895 2188066 2245722 1850581
13926 1850581 1933918 2050534 2053436 1922415 1674674 1907045 1871441 1569308 1771209 2202410
13916 2202410 1691672 1838690 1921106 1656122 1677403 1618919 1563164 1515511 1830712 1583979
13906 1583979 1608177 1770577 1549062 1494785 1509119 1682605 1596601 1754199 1397946 1252247
13896 1252247 1569880 1739305 1843913 1430092 1421962 1517523 1696719 1361483 1517343 1812843
13886 1812843 1428877 1282471 1741034 1265330 1808983 1564568 1459008 1301852 1448345
13877 1448345 1524519 1518141 1213451 1373302 1357571 1489828 1016065 1368147 1486832 1573886
13867 1573886 1620073 1486330 1399729 867367 1311299 1251440 1307667 1067049 1382946 1081632
13857 1081632 1238332 1230125 1226275 1375726 1135050 1046037 1242883 1029922 1260519 1574470
13847 1574470 1106700 1279786 1106448 1163703 1169874 1278591 1457835 1242520 1286943 1164910
13837 1164910 958159 1538753 1197126 1161142 1215063 1169706 1130946 1146252 1289741 1146659
13827 1146659 1115570 974710 1271482 1086209 1049468 952126 1266082 1012648 1257996 1093257
13817 1093257 985760 1018599 1057854 1011941 791293 1328442 967707 938565 736842 1004295
13807 1004295 643293 875365 615798 1181828 698691 1123434 947115 684343 864605
13798 864605 745191 1194982 664488 820357 893656 1059321 901631 818728 798209 590268
13788 590268 686017 934214 905938 707862 854633 852159 1285818 664472 766473 611250
13778 611250 944135 613337 1147699 972479 885226 719025 878893 734475 901065 1033906
13768 1033906 1140116 1124497 712334 710713 773897 827038 770314 739228 969686 584561 690516
13757 690516 827501 580018 859264 654808 609534 601571 814843 549317 920706 629517
13747 629517 951665 804305 606803 944777 962967 528840 366613 500687 708997 476755
13737 476755 507873 436185 321295 721388 507848 909550 748874 859485 639551 422961
13727 422961 1040114 617714 458632 416249 980661 609062 466878 297257 656321 729761
13717 729761 766951 703522 527495 484282 692078 774130 735577 451016 513077 758852 410117
13706 410117 720094 288181 564005 431950 557723 588642 280070 685733 628808 500546
13696 500546 423634 199632 606136 653170 545136 422355 657555 213681 455824 604129
13686 604129 359063 283764 495569 354317 653214 672821 716079 529803 596448 83680
13675 553404 698658 432308 539070 246266 499155 652156 658614 301603 574678 405280
13665 405280 605844 532570 831399 665958 522417 532459 260373 543311 611666 464868
13655 464868 609036 406966 511681 468992 682250 611805 576741 358561 329426 191992
13645 191992 679587 486196 84811 392392 469117 388423 719769 604984 419508 714722
13635 714722 218096 422749 674634 620902 188549 112393 141236 377000 499747 534364
13625 534364 481137 127665 467740 547092 84169 414860 328202 756048 376490 515276
13615 515276 256847 -50762 364678 631666 320627 128818 188653 564639 362073 321731
13605 321731 646337 363516 275963 468178 273944 299186 364030 479750 302183 317090
13595 317090 163410 468515 186398 457790 236776 347144 371938 466271 428695 25502
13584 487423 617606 518887 441856 450896 693071 847397 335424 233963 561171 249948
13573 315019 271923 401771 405333 277573 384649 339702 381343 461403 324157 432346 456606
13562 456606 740926 697973 335391 458625 446343 365808 87619 114445 158483 396148 416685
13551 416685 482844 -47886 439590 460848 257119 458123 146809 356806 133990 16642
13540 618627 420795 338667 675289 -83403 267395 335860 396763 380010 47951 282591 337363
13529 337363 112508 449772 480268 245678 245489 380425 380995 357945 541280 350394 489912
13518 489912 477620 131274 168288 335963 476317 284998 33725 502912 628483 146736
13507 269894 285570 390497 245852 399097 94293 483150 225752 93185 -33787 216221
13496 398090 86526 393440 352389 314663 318796 300409 244467 149997 156875 104482 170927 306544
13484 306544 398037 234535 375124 251853 342876 -31600 35728 143930 91006 -45340 186676
13472 598574 361442 439696 215107 172973 254535 257987 34385 644950 512561 205639 212436
13461 212436 394991 -181628 357089 319820 121750 300392 286433 501577 -180666 215317
13450 236502 506655 61455 518739 56983 210746 -6416 172 168717 182437 4728 96726
13439 96726 132560 316687 341756 325580 208280 136096 289919 69870 338551 71841 542336
13428 542336 337314 388369 299192 219711 48842 308412 4466 266136 368384 322902 461540
13417 461540 346700 104890 264091 190216 467163 132172 223068 308166 277843 329434
13407 329434 212512 253982 90530 370077 125735 -421 -41776 236374 214702 355389 234362
13396 234362 162283 177492 243188 234424 184547 191053 245299 429042 37255 409342 41208
13384 166273 518336 162504 462413 394655 343265 116847 396229 280486 125114 528281
13374 528281 180848 217924 361871 147668 196107 226410 -319671 148296 -111249 157174
13363 144137 318227 112390 356265 28587 220978 203368 82460 121409 -21143 342526
13352 351272 114535 495079 438782 237924 141996 192894 -27857 -42415 295704 112014
13341 389600 326557 442104 78939 -2730 75911 463541 117919 284768 452359 253112
13331 253112 405422 358249 -55933 568683 70630 193702 -54463 330888 172541 -56656
13320 269315 231163 449634 -63230 299056 686530 282264 274518 255501 610717 424555
13310 424555 338538 372941 366251 28613 307066 73042 366504 -95364 543215 -146550 122609
13298 120727 -107158 41844 287890 -24869 166827 572059 -202008 328225 376695 -224251
13287 234743 196201 359611 145732 59923 79455 112912 241856 64192 9886 45390 77578
13276 77578 398690 139927 35821 340502 -35684 259339 200181 11940 -182 91735 147464
13265 147464 31198 -291048 297189 289462 169259 379680 145391 268838 244898 -115420
13254 385061 103636 416931 -16253 163263 140835 -20592 326021 -9340 118976 206417 438076
13243 438076 56997 50753 268798 -19299 115111 474825 -15520 243755 400740 320238 199882
13232 199882 233431 70094 -14098 -26613 223725 19662 95564 23020 -125991 280247 228782
13221 228782 300139 -166635 196264 606609 109512 3924 4752 385819 264078 52567 -104448
13209 126182 -26848 -95478 341760 83438 320400 496992 58583 285282 186304 348209
13199 348209 305085 421966 335776 19928 -172250 12629 321578 33718 -52052 -39297 -92011
13188 -92011 -62702 -140250 146092 168133 9772 -291754 252306 373868 -57824 177015 100137
13177 100137 21213 55768 299652 -114839 291970 363882 195414 119387 46215 304602
13167 304602 -119538 -204726 316631 294845 -16144 373839 125533 69119 -14984 -164641
13157 -164641 223374 77294 194312 436508 363782 -41452 46010 64100 578423 219379
13146 214342 79657 351842 305777 99573 58870 54860 -72855 230762 -133797 55467 122755
13135 122755 20097 201105 316395 156267 -35294 65998 73577 -119354 233971 -56186 -60688
13124 -60688 319525 -62386 122874 -231344 181222 28171 174713 120173 -202041 156468
13113 70674 281918 54153 -153363 148361 396929 322796 125833 358214 93852 134222
13103 134222 126477 -127711 -30800 221236 -6651 -53350 149229 242132 -69737 -43355 -64560
13092 -64560 14780 -264083 43369 -77446 194368 -131118 136246 27829 307668 56593 92849
13081 92849 150697 -3926 172301 396159 182569 209190 10976 94460 601981 -140741 -277129
13070 -277129 -112509 347451 -36399 84720 87114 253998 218451 -132064 -13162 -83534 93093
13058 -106552 268890 -170532 -96697 149804 357933 43795 97906 14908 117439 -132907
13047 -260931 22994 140952 269940 140504 -89002 333030 -90331 -144898 -22357 308858
13036 74689 169479 -84462 546654 -44796 -176679 233673 -94048 -11399 142777 -47473 72061
13024 62019 163891 -72445 -143905 294372 170739 299437 293020 99644 151022 143749 13373
13012 -181483 -129122 314894 323227 235918 17840 -173079 126543 4384 71631 376930 21259
13000 187124 215393 -26344 234989 43178 -98567 330461 13095 225635 134047 121980 372190
12989 372190 -58872 82205 51938 164633 135529 196186 -23758 44382 315792 140893 164632
12978 164632 -185377 225667 189560 96080 247310 45229 16982 -89507 597 196013 362565
12967 362565 158415 263895 166160 38776 294013 326922 -35940 177808 353650 61457
12956 257500 -42837 65436 -110124 -32411 -39990 39065 11772 -77973 38670 -172005 -20860
12944 -176288 76175 47895 -109844 -10371 297086 -138163 -169808 168806 -31185 -139149
12934 -139149 -107946 41223 90475 86058 173047 -84615 156987 166308 -270270 195206 74871
12922 94448 -178805 -103833 -340886 -33365 111848 551147 197604 -317183 305715 310109
12912 310109 37741 -38730 30805 118606 -74493 236447 59135 -298678 -93751 34947 76568
12901 76568 -31551 -58867 175896 -101906 125526 112527 174882 279058 -126282 179325
12890 130964 157552 123643 64974 208826 213765 -2248 35960 95546 255983 -112657 58766
12878 -166159 30693 119611 121765 -94213 255723 -22162 179793 85188 -83895 -311667 273088
12866 -7896 -241769 -84573 -61021 68295 38267 327350 -144639 -209221 204049 -367625 -317162
12855 -317162 27206 -101540 241562 19148 104036 -339067 -76808 -98436 -98405 152896 236527
12844 236527 -195368 -63454 298296 -187331 268946 57019 140656 258527 -141208 273793
12833 234543 -57984 -157577 -88851 199654 159145 10222 175756 143416 -4572 92966 252088
12822 252088 96876 114657 120879 -10359 145577 -169165 163226 174361 -137476 -413381 119842
12810 -186414 175561 -291846 129418 405401 158570 226992 -211736 -46138 -8244 11750
12799 -91670 125292 140575 -86524 -180766 131596 -166460 -147645 -4717 174441 99702 -156503
12787 100186 41798 -30976 -214711 51765 182985 -122300 10645 202603 200782 82009 84785
12776 84785 -104569 182859 -134703 51316 -196137 -115945 327287 -243552 29195 6286 182812
12765 182812 53487 89162 39166 97704 -85933 -183935 -66982 -19504 -264406 27541 -109350
12753 159570 34265 -236166 -46398 -59386 -193860 -176186 -56184 47296 -46738 -75663 53368
12741 156334 -54712 -245328 223202 460506 178416 252563 -236705 161892 24016 -301548
12730 -106238 307571 91274 67668 -19645 105713 6707 226207 225275 -49155 -50440 -28323 77152
12717 -148126 -206619 -155881 -99656 -72796 194159 -184236 341094 -89467 237705 -75685 199959
12705 -145999 40392 234480 -20007 -15363 -131750 -47481 -10485 159368 -86343 -6258 145308
12693 70364 -64344 103207 322588 128048 250978 -103467 14413 167084 104047 248397
12683 248397 211233 -43019 66822 464853 162686 35389 339464 -94414 435478 143144
12672 -111532 -207056 -21835 -59208 286979 -51359 215404 -146082 13172 -11756 -25062 273296
12660 -19877 30445 32117 449243 106180 -184011 100616 52785 313579 220827 -23270 59303
12648 192410 226636 257361 50929 210213 -105181 -93764 437948 123261 94756 211529
12638 211529 167742 4459 33335 45432 302984 226749 213670 -305476 261339 79567 325332
12627 325332 231188 157378 225376 -250177 124669 -255746 262303 -23312 95898 -12897 -437788
12616 -437788 203785 -345097 254278 -111427 -128628 242687 78318 -64850 -43130 -215804
12606 -215804 28237 -42479 262274 354009 523195 -267610 -94832 -309061 345350 -201061
12595 61658 328146 194719 19327 63442 354754 237650 -146062 242249 -46598 -163163
12585 -163163 185144 194452 -265615 213905 384102 -108201 189173 31295 75124 60997
12575 60997 203284 180918 337614 242365 -33040 80459 151157 -70565 25320 58287 272836
12564 272836 39353 -17587 121659 -66159 -164020 -119027 -212020 -192261 -65624 -223274 -252637
12553 -252637 -170298 162629 -7093 74221 59516 -1945 19623 -84579 181530 -78933 -458706
12542 -458706 227471 23626 -8652 223408 14935 217141 11847 529899 -246373 41153 -265923
12530 -219285 245060 5708 238902 -18426 277521 -32493 -96761 417996 -152773 274713
12519 95372 193760 100823 327810 -100863 -59428 -99165 -188239 -219708 29176 -57665 109278
12507 -105764 -25213 294519 -74947 25313 41124 74350 -44206 50420 206869 -99114 -108507
12496 -108507 340660 -181881 -89532 16993 136736 -290668 -428108 -145437 -139035 -231970
12486 -231970 165115 -213035 63346 131445 153298 -108599 -265702 -77222 -1745 -179490 364732
12474 -1015 -54537 -50972 187962 -481428 109772 -149493 107373 -36053 -222571 -167481 -4826
12462 222558 209693 137805 20504 -110228 136863 -81377 218745 48020 -183730 49962 -129414
12450 15713 358635 -121004 -26881 -358815 -4838 158962 -151108 -79851 272823 -237296
12439 98690 -145279 -142167 -81531 182749 27007 -87893 -251293 -70439 179021 139251 -79488
12427 178072 441270 161926 217675 113299 -200185 103153 414710 -8814 74643 -60902
12416 183407 -170779 -14169 19723 101294 118548 115867 -306504 168512 70799 -33249 -172902
12405 -172902 -133510 -7005 -86955 73685 -302013 -13342 144275 -228914 145580 384084 -22233
12393 65873 226516 -185026 -387783 174389 -70350 5509 -342487 -51824 -98307 148152 336778
12382 336778 -370545 127254 316796 103517 275708 -524569 127032 103793 21809 142244
12372 142244 207069 -49530 6356 -408411 -154355 554902 -44372 170783 59942 -240311 -102717
12360 -297910 20180 -127897 -37117 161211 -220185 -223463 -72895 -61386 -213939 225336 32169
12348 -53957 -122231 -57526 -79949 15025 27680 84679 111543 162188 -54400 24373 -88112 -92328
12336 -92328 -65936 -101784 83211 -483813 9757 12976 -143137 -217701 131451 147426 202964
12325 202964 386596 -118799 -476398 2810 307023 186041 147433 -63340 277231 -229709
12314 42992 23259 -122695 -2766 -133209 -186106 92461 -122505 93841 44722 -37012 56552
12302 -40142 -56927 32798 -192179 -267910 -2755 220141 91406 -227372 156879 -185757 -24444
12290 228749 -63875 168951 19405 -103086 288669 269804 -70711 522669 -238761 -18290
12279 -94895 105555 -221919 17846 -341562 -167308 -130772 237686 81371 118674 -297629
12268 -361679 -189441 230435 -162936 -123312 89608 135078 -155452 -43039 4593 -1501 92297
12256 113135 60602 -81093 -98217 3354 -376764 201448 -83413 282108 333476 117024 116857
12245 116857 182828 -172281 -39288 92781 -230227 64990 25250 19576 -11194 101744 2847
12233 94851 281528 30972 38534 -239450 273729 292885 208148 97232 58797 -104534 -223761
12222 -223761 -193368 3768 311661 -38909 220482 126797 304816 33364 -345515 19331 93479
12211 93479 336175 144122 11714 120118 -21107 61742 127336 35096 48929 55968 88959
12200 88959 317108 -33669 400589 -62523 264428 51503 114238 214226 421682 151596 610140
12189 610140 107143 153995 491329 229324 242789 -84683 184496 145144 107228 255236
12179 255236 36669 -10008 -72204 -149513 187597 -7463 444205 -122665 333016 112717 266779
12168 266779 253181 130098 100814 289522 -168190 320842 306463 246215 333374 28701 95745
12157 95745 12248 -151290 143310 -281484 160483 66081 247637 54624 88746 255927
12147 255927 165452 218997 -41476 -214716 -117414 14662 340320 -46092 61301 111305 -49891
12135 147536 200238 313746 18575 86305 111052 173396 136959 212481 54952 246752 -883
12123 53585 -173250 -155831 16 -10321 198763 129061 416274 -168774 -3955 -46210 147826
12111 177144 119846 -29824 165089 39105 6558 -57135 130965 109878 -52687 -28188 142552
12099 -126636 168806 105965 -66297 -221040 95539 -119775 143075 38984 291832 -211849
12088 -106176 -133667 229830 323827 -47457 197234 85178 229959 11669 25675 315068 101101
12076 111487 -411128 -265972 102861 67455 -212366 316295 144238 -52207 -67057 -199913
12066 -199913 15396 135658 -69342 144984 95685 108523 5008 27329 84866 302961 245211
12055 245211 362269 1206928 2395833 1037721 649666 217094 183688 297323 365239 -158076
12044 -15581 114770 63907 293717 -447859 254496 146323 -180330 36047 -114197 11433
12033 196898 -34306 114764 -164983 64185 135765 155972 276723 296020 -12063 23205 -291430
12021 62120 -192103 30748 191168 -33070 -129046 46994 247510 283768 -221557 -242433 -47344
12009 -84362 -167970 39929 90211 -36072 22106 -33595 -118726 -112452 70344 -188739 -11952 223715
11996 22379 138171 -255163 165328 -114832 16482 132096 -149743 62014 -217214 -148517
11986 -148517 293965 135625 -131971 95081 360798 -4570 130221 -136262 -213381 -83988
11975 -186738 31779 29915 -133754 58042 -196144 -144864 186893 33806 -40663 -46677 2298
11963 193069 171416 -199133 156720 131873 72435 -426997 -3709 336989 -85945 287954 -61520
11951 -141795 -142160 -140241 -10093 -240287 8509 -130091 -193528 -38443 127907 -176892 386281
11939 -5433 143277 341224 -250402 181976 76113 21087 -137534 96277 -19552 -76279 -78760
11928 -78760 115559 -47 -231283 308473 -149682 82320 132228 -136042 106629 -16176 -227399
11917 -227399 -271632 174550 -85628 -152326 26578 202598 48216 -190722 -230108 -324518 -83723
11905 -431313 232186 219329 -243719 -53631 70015 80836 -420361 13152 -18707 61798 -113379
11893 -109769 105719 176362 144944 -157208 -48683 -365695 247724 90494 -224751 90606
11882 -52939 185295 -4483 135158 -106306 159556 59636 -68643 99931 -56574 -34643 -123636
11871 -123636 98147 164650 -354185 -168030 47383 -79693 -237388 -212126 -93556 -76003 30393
11859 186324 -226450 -127936 -39317 -34912 -217281 -67314 -125261 91416 -1723 99397 57507
11848 57507 -60342 12712 92447 -274147 -23424 -267853 -265279 130389 361621 -91685 44903
11836 -8647 176388 117742 -140861 -214606 -71988 56950 226428 -95773 -208982 193967 -113766
11824 1804 -203004 61178 147244 142776 -71765 -218817 204642 -225233 68256 -461833 19315
11812 -6459 -70779 279075 -77118 305776 105587 133974 10303 -183919 -152987 55276 -252528
11800 -543498 119221 -242449 -48811 -13398 13096 -79833 129222 59633 -70382 153315 -66278
11788 78504 -108391 -297342 -57572 -114204 83309 132686 -251689 -144669 151532 -78233 416894
11776 -307228 77322 -69145 158585 25211 -212744 13341 -194454 -100855 161269 109109 66440
11765 66440 -20523 309713 -117130 31358 26938 88463 -387496 154440 -35242 188445 -242256
11753 26727 -70425 75796 -16537 -75113 -211723 -274618 122408 -29696 -282939 -20793 -195053
11742 -195053 328315 106042 -56525 -92891 122524 -50388 -198751 196714 -219581 183657
11731 -11497 14164 104418 18847 198939 294325 174355 -107040 -199734 116536 -36344 -327019
11720 -327019 -45126 64742 -160740 -193945 227122 58284 358801 -75956 467622 -19609 -164847
11709 -164847 -69543 -15945 67623 -95749 259825 301257 104626 -115716 84667 -244674 -194110
11698 -194110 -2123 200362 -57722 -168017 175404 -40163 -56766 -203983 68133 -44859 222752
11686 155841 -226907 164925 156464 -181054 514542 162108 82741 -92592 144040 -154052
11675 162989 69069 -27034 223248 148815 -246440 611479 226965 -129287 222004 -284885
11664 156785 -133837 168939 15879 -72671 17034 68692 -142044 116694 -169780 170919
11653 156477 -60209 114037 -147656 -176466 187188 107344 39749 -110349 -3303 160605 185691
11642 185691 119024 120868 -153348 11087 -387939 -24301 -8723 94357 68579 -216962 161661
11630 -86557 -153826 -29788 -65597 -2889 215222 175712 -168892 24441 -115409 -179089 52921
11618 384743 -302128 167677 -232420 161206 349856 -168179 254593 -157362 534606 -44648
11607 -102874 -106070 11998 186096 64542 -25117 311139 -48985 95815 91801 -28865 -60479
11596 -60479 145001 -91151 99817 -190257 69613 -105981 132247 114328 -34177 -169942 113427
11584 -163332 -17499 131903 -61354 -90917 48940 -55384 67884 -1112 246080 164142 -92685
11572 261482 51446 -253529 231719 -18238 108385 28040 -106787 92897 -154306 13523
11561 -314927 103802 237385 63567 -64279 190392 192495 91729 -221770 102206 139915 4852
11549 -222951 -20795 -139636 4001 57744 94884 -276884 -78543 291350 186164 195516 38544
11537 423934 -29051 36288 -265600 49159 60925 -233644 7749 67542 329362 -132986 380513
11525 224439 -407574 -59193 44841 -60535 20178 467893 195483 205813 471295 355148
11515 355148 191423 282289 -50148 447821 159963 -219247 133945 14427 -1649 34507 89316
11504 89316 159683 133865 260282 -53777 -121934 2630 19401 236257 393285 291090 192349
11493 192349 315335 -21191 286897 -7036 -166409 -246669 12910 -91706 27740 297921 -76704
11481 327241 151933 21179 207554 197479 -71727 412874 173966 65758 -266572 -255547
11471 -255547 -3705 69957 150103 -6921 -5866 185422 212893 235259 229314 -49737 310806 263779
11459 263779 15636 107652 184096 -83489 131251 275585 -162876 431004 -15173 23272 3125
11447 295339 160127 25077 -105545 388224 -11540 92103 55074 73807 106058 275095 489456
11436 489456 363033 -48818 135759 11272 160335 520558 33401 108418 31690 21097 101895
11425 101895 -134391 -186347 -90029 -28620 399167 178508 227711 -147375 214185 120222
11415 120222 -77241 132396 311344 -80630 -54505 15961 -66982 147518 -210360 -266910 -5330
11403 53980 18698 -140410 90786 -184087 -8803 7904 -180108 -279752 -42653 181613 106437
11392 106437 162528 -211502 45206 -304670 -9707 -57880 138570 -47477 2750 288085 67922
11380 -147986 134363 207026 -260708 158491 121551 217072 21899 10684 201250 80390 -133940
11368 -59954 118129 69026 -27069 -118067 95304 -26682 -208364 93609 88302 299778 79045
11356 -35223 -282377 -42820 172790 20983 11352 -276564 5423 -990 107231 186217 26234 -162466
11343 -79493 -413334 139216 37556 -263139 -174593 -356534 83557 -53068 -71614 -51276 -25301
11331 -292113 -246953 -222940 -29232 -161320 -184084 79192 -307276 99301 24443 41334 -43206
11319 42149 -7517 193947 140959 65128 95979 -147137 -147623 341565 -626722 168135 -228827
11307 158971 -169416 -144064 -32927 218773 -147526 109976 133191 192342 107281 -236672
11296 -60842 -53515 73086 269881 -188254 115265 -80379 78049 -225576 -275197 -75801 -72089
11285 -72089 -99976 -172625 -130508 48772 31751 110544 -261133 -28535 -106702 40398 64117
11274 64117 -290368 85100 248520 -98650 -84256 176009 -277240 166795 59570 -42655 -373117
11263 -373117 159866 -362943 -395860 105834 -96406 249319 -20170 -170416 -245371 -241800 266738
11251 80806 -176964 -4548 -80018 -73714 -15394 111928 75272 -38140 140304 -318656 -247865
11240 -247865 -133401 6367 41225 128885 -248444 -365152 -42057 35184 -165752 150687 200910
11229 200910 87453 -98574 -55196 -28288 -44469 -1086 79059 -286895 -238610 168338 -17636
11217 81847 -364265 277390 48485 -225327 -178706 -185813 -72314 -65527 -87699 -40537 -46870 102140
11204 -197795 -32446 -31976 112330 252031 -274604 -128220 59508 233747 251516 -347668 90893
11192 -39527 151880 90254 -88791 -191990 -112439 -203694 -202543 -59097 -149240 -354277 -254775
11181 -254775 -121922 -49792 -307105 -143016 258815 -222634 -152310 37897 74142 94011
11171 94011 -246680 -5908 -100138 54304 127935 -200646 -32148 163314 166881 127985 -117445
11159 -89660 53956 -95880 260641 -25317 231639 -142819 -366587 -138510 146428 197722
11149 197722 -406922 -313320 -40863 55866 -223580 -195337 -250174 145697 -96057 -190186 157109
11137 -9578 189903 -176390 10904 276562 266577 -3047 -358135 -284501 94425 -74763 -148034
11126 -148034 234971 185571 -140367 141369 -18460 -199454 -439060 -93248 81886 -148671
11115 -78833 -9691 189835 -217544 65161 -35921 -366587 -59782 130865 57486 -63241 22277
11103 -299904 77131 -43284 33740 -141777 -16541 122647 150589 246025 -22475 238142 -7242
11091 -37482 97198 -214850 74176 -232398 -98959 -110901 -110798 316370 105676 249309 134623
11080 134623 102276 84468 -22273 -35779 226536 245765 105196 249391 76845 -82473 -157656
11069 -157656 202412 246797 -208496 182476 329493 351639 358886 299900 101811 306948
11059 306948 303841 494593 -13530 115420 21972 -124724 350301 122535 25201 194939
11049 194939 204423 313310 198343 205280 118740 153075 110744 371190 133092 219656 311390
11038 311390 186609 223909 268640 470877 415172 769056 494786 494639 590095 567975 413775
11027 413775 549420 478413 626787 605408 443104 966248 339808 772498 801856 779814
11017 779814 876912 643702 601543 658820 932784 918710 642845 237470 727208 536339
11007 536339 222578 759385 889548 719829 593027 574054 516737 386121 588324 209031
10996 578612 767140 444582 627561 542660 559902 554849 505936 560077 690984 531654 725444
10985 725444 531773 483912 716817 603055 920462 728554 696043 457595 517215 890845
10975 890845 887608 675856 752252 847317 809143 908258 262732 518463 390119 257979 563628
10964 563628 649354 665904 859412 418876 728072 736137 577993 1044223 696406 997485
10954 997485 995848 1098270 1238325 1258081 1478669 1915617 1664067 2258774 2472979 2326901
10944 2326901 2341810 2453254 2444721 2351264 1873933 2054496 1765906 1622889 1441429 962184
10934 962184 1822132 1612392 1551103 1557054 1693159 1966235 1632678 1553239 1584361 1113654
10924 1113654 1315910 429327 842749 709069 373257 495370 152705 281433 -133771
10914 22366 99228 536266 189506 182996 114670 225872 236114 421687 -91007 -2616 417721
10902 -190337 246921 306604 194250 150275 103867 -263876 54507 83037 -96904 118018 -131813
10890 -323112 7395 106928 -226049 -264928 -168123 189278 -193724 -214699 -22995 30800 240111
10879 240111 -295559 -6400 117846 214474 -150081 -65905 54658 181792 -25144 -23987 205602
10867 43121 208757 -124587 -15633 -93218 42578 202019 -78489 -59576 -43226 140024 59016
10855 -31258 -2565 -270733 -254644 157683 -168319 12232 85446 9167 172186 -329850 4721
10843 -77743 -462946 -87882 18172 145013 386405 -119072 -223442 28025 -223022 -251377
10833 -251377 -54033 42981 -130199 -154556 296309 54995 -121151 -113528 45701 -64616 -187753
10822 -187753 117035 -306581 -359384 -43033 -234808 -116393 121694 91927 -24637 23504
10811 63377 -139858 -63981 25258 208854 -274694 -231371 -80924 85144 -278548 286645 -340431
10799 -129410 -71127 -213610 -118127 82942 273079 92175 -53177 244163 63662 -139950 -113061
10788 -113061 -184223 -235668 71284 50973 -144128 38576 -90552 27542 146232 -323670 10
10776 64387 -240604 -46437 -75277 -70612 93850 46642 46113 -24456 -137554 -180036 -50456 323823
10763 16070 -105667 96965 -21309 -164950 -247896 -330519 6425 -12284 277151 -9847 153217
10751 142545 -197766 -93091 -161691 -118433 -268419 197799 253497 204381 -215342 -336379
10741 -336379 41592 -15889 401932 207643 210778 -238570 -195473 -161018 232840 -183268 -414195
10730 -414195 -96979 -185540 -113900 42544 -50937 98738 -85858 -293447 -20490 37231 56062
10719 56062 56106 -43975 -277205 -83263 16429 195616 -253954 381910 -33338 175780 23604
10707 -12016 -360906 178229 -30271 -36118 -123525 13205 264129 -269978 -264932 -69459 -73841
10696 -73841 -152578 -189573 248415 -127870 211313 -264438 -237553 -293200 -266579 29744 93160
10685 93160 104034 -193116 -147418 -291788 -133590 -91725 -110423 189809 191098 132292 4671
10673 -153832 -324161 -182182 115675 -255622 184065 -83530 286885 8350 -74345 -111516
10663 -111516 -102014 137058 -146407 45263 173328 -163687 -167522 236002 -13919 -95779 -66419
10652 -66419 -195815 25935 -116194 34725 1232 -193189 36563 -166182 -302240 59365 -243101
10640 -43010 75737 -205974 81060 -32743 72482 -120807 -192641 -93907 -166877 50985 -101530
10628 -142261 52974 -48250 -416657 -312040 70713 39916 19375 -29296 338882 142868 143348
10617 143348 20706 365286 69452 -68481 -236941 -7819 60123 -35714 -107038 -345379 -20397
10605 109200 26726 -174556 75449 -122654 -25566 273602 7489 -190246 -142609 -151330 -378882
10594 -378882 305679 -6783 -118555 -152088 149865 -281913 279831 -91700 -401382 -13912
10583 50408 -170356 -85806 -130263 -81621 -273077 -129625 -372 209899 90335 198873 204779
10572 204779 -40119 11854 -125042 152370 -30750 926 131417 19516 187698 78836 -7645
10560 -97030 -283715 -75742 -189782 194028 36081 -139733 97497 -159670 -296775 -135800
10549 313326 -47614 -80414 203215 -17706 -96497 -131486 -310495 -77310 -102722 13923 -129844
10537 240772 106040 -198312 -48607 -49514 -140516 -166750 -229169 117121 -19344 -87317 127527
10525 -180307 -212161 -115311 -129551 36651 -61374 -263895 -168075 190364 116029 281628 191947
10514 191947 -281878 -164882 -87247 320441 -115224 -72298 27159 -220387 -121265 -326519
10504 -326519 5311 362077 133307 176373 486489 120361 -192181 -131376 -72346 210873
10493 40763 199326 -101736 79986 -64149 180480 155099 -93474 -140522 -66294 -321666 -257347
10482 -257347 -90090 102771 -233350 9461 -47739 -61545 137804 -5784 147024 -243167 137681
10470 -35329 -78743 -224798 -68310 -188613 -143794 -69469 201714 54588 226686 209634 141305
10459 141305 80781 -10060 278257 276085 469717 316000 453391 644017 266881 177822
10449 177822 300188 -192699 -40180 156658 -119039 -143528 -166444 -52065 -253489 -36490
10438 -254018 -66907 77339 -13847 172889 -34415 178704 -182801 -119548 -97336 89218 -53806
10426 76981 244420 -477630 -12710 54655 -249575 -183678 -3104 107209 -103558 158262 336992
10415 336992 126414 -236243 -17053 -4959 -75721 -86812 119988 -45321 -210231 -163283 -82134
10404 -82134 104704 202041 -102512 405304 -278465 -10636 139977 75370 -228695 -411506
10394 -411506 127351 -243564 257610 24310 -237719 -134077 -103302 -167387 46528 -198332
10383 -15753 57601 -86886 -407244 -61992 130932 -97302 6965 12259 262655 98193 -211694
10371 118669 15573 314920 -29806 -211615 178022 -107716 294692 -132580 -235955 11905
10360 42606 423061 -147994 288202 92000 -146223 -119178 44511 302964 -20133 480259
10349 -139129 128881 -113360 406228 -156677 633937 111007 283852 69750 209104 390928
10339 390928 349005 542225 131099 397433 301265 -87800 193598 136338 95122 440706
10329 440706 -80084 115840 145012 68034 649070 -191892 350207 282250 268871 289078 186565
10318 186565 271787 462091 467398 358007 562951 335911 -168664 293191 -219441 267057
10307 457114 390070 51178 21787 -152736 351363 -83697 -107949 -122673 102684 150823 -1042
10295 433907 -127824 439040 93428 206041 -62459 138060 120268 -154096 -197301 22149
10284 252326 86296 38230 -108937 176047 -207266 63766 5835 -1313 486428 -53134 -279215
10273 -279215 228030 114206 111569 91509 355909 -387791 95553 -134615 -117330 50944 45281
10262 45281 102435 -46696 -9330 40213 -87882 -175387 -74788 -181954 -225691 38343 66270 -154104
10249 254715 -318089 -6985 -85291 -180944 -176086 272513 -217499 32385 101314 -234395 -28479
10237 411577 -116648 162899 104315 304242 71845 18610 420565 191243 529878 30612
10226 -16544 128990 30256 191396 157870 -1100 24790 367132 211195 160025 -185540 -109596
10215 -109596 -264764 278068 57165 -179579 136469 -93945 -25829 -76722 34874 -70578 -225661
10204 -225661 336436 -139375 3038 -171131 99969 -216121 71994 6306 200783 306490 -149828
10192 96934 -153126 -239849 -247872 259149 54604 -141432 -214572 277178 -63954 -22185 529
10180 132466 -329438 -41900 1583 43304 499 -150068 170065 -59156 -117928 -32687 -176451
10169 -176451 -294807 -182108 142439 -40320 113347 -156333 21929 121005 37017 101143
10159 101143 -109856 -33052 -71725 -280950 250782 -245143 111164 -105606 -128424 -43558
10148 -34199 -30288 195077 -168448 16892 21218 -61765 -2487 -24343 -445376 145073 -178604
10136 152540 28839 202143 -13608 66786 74902 37012 -272182 50669 -224536 -83230 -68684
10125 -68684 -400022 -30720 -31519 8660 -172662 -104362 -182594 -6456 -11562 -56862 -259575 -173344
10113 -173344 -270113 -220528 226637 -3965 -6283 -34666 115219 50820 -29299 -74667 168546
10101 -61319 88747 324900 -244624 -401503 -204947 -365754 303501 -217623 127771 -48556
10090 -95498 -88350 -285953 347450 -163419 -324062 -235423 -92517 -201086 255925 -9208 -189221
10079 -189221 -352003 -142386 5090 -212417 90077 -107584 -187356 -66346 -216365 84668 196868
10068 196868 -84353 127602 -122611 -31819 154851 -155977 -226188 -112252 64431 -62509
10057 11477 62721 -41252 889 -83038 116671 -90522 24030 -325993 -156968 229266 58655
10045 -267559 -32595 55815 -230520 34392 -70840 3265 234939 -10264 -5821 -172827 -87905
10034 -87905 -189325 3142 261749 -470078 -48459 -80440 -13001 -193275 69376 -175132 -233505
10023 -233505 -162409 -226753 -155232 -324435 -237756 -169410 -441339 217951 91680 -108939 201587
10011 1265 -195274 69038 -275623 -144141 -319349 19369 397970 213614 -80279 -144066 -13498
9999 133989 55558 -408591 -305859 153049 -40881 -223557 2750 -151097 51606 -138309 93448
9987 -273458 -125267 -27389 -272827 42453 -65805 84967 -184970 -122750 -112114 -300826 -213893
9976 -213893 -117960 -167841 -151912 -69784 -162558 -67841 -171814 -201209 68597 -204910 155805
9964 -36472 -77312 -252104 -70991 83909 -103881 -263119 -235241 -507072 -128684 73078 20987
9952 -113571 -296092 -450246 -15081 -48327 -267000 10219 140603 -210660 -101671 -200371
9942 -200371 -209681 36544 -435463 -292145 -56331 106722 31172 251605 -86120 -255331 -383687
9931 -383687 89596 -80947 -55957 -54280 -24477 221496 40450 160942 -213927 -164780 13122
9919 175982 -118324 167152 -117789 -1883 -106727 -76053 -472255 -257066 -12860 -357905
9909 -357905 9841 33274 -191542 65110 28411 -34484 -140798 -107935 -145124 -232966 136071
9897 -193794 -107463 215861 529780 -220601 291041 -126296 96090 98582 -61140 177099 -96982
9885 -287411 -34828 212318 -103368 22188 -357986 130863 -88568 -191308 -363832 -166976
9874 -176757 -150865 -118674 42445 51653 -173458 50112 -184392 19909 -189909 -195239 -505209
9863 -505209 172795 297685 -85262 -94331 -213235 70650 36421 144309 152105 -250371 -240031
9852 -240031 337128 -92334 207586 -134872 6470 -30259 -32335 -65705 -177656 -248534 130378
9840 -54667 129778 -97058 -148313 43726 -251453 -32227 -150581 -71008 87560 -188175 -196632
9829 -196632 -215525 82062 -21777 -152614 -426456 275957 -354285 186965 -864 50095 49127
9818 49127 -9369 134964 45075 252925 -447138 -228466 56933 31976 -388128 -15436 -140123
9807 -140123 -192341 -51567 -41565 -108053 -94714 135324 -88488 163007 133627 82346 47044
9796 47044 -347215 -52334 58514 -286370 -55874 -404074 48052 148773 96037 77706 -98609
9784 -202196 -77761 85656 -314931 -125312 -139482 249131 66051 -12545 -273482 -148827 -150236
9773 -150236 197689 -90669 -209541 -233664 3320 163611 -54749 96356 23833 -79649 -43630
9762 -43630 -258928 188806 29441 191804 -280915 33809 -107206 -377765 208200 -26192
9751 354452 -203325 -131862 -443378 -37048 -185197 11025 -204164 -24260 -319633 -52537 512405
9739 -287622 -91656 293482 -79356 -191320 -184428 -183221 -50586 -234256 86927 -255398 -106596
9727 -76608 -100119 -80301 -38602 -1105 -94392 -267683 -8743 -184639 -328884 63361 67948 -333674
9714 -144392 295266 4558 -210059 -148880 -336908 88957 433736 -245625 -50362 -109991 -310382
9703 -310382 -282374 -260830 -181250 -112654 -427029 -221667 -150233 41596 62424 -66707 -153322
9692 -153322 -22378 -61388 -123715 163184 96528 -12295 17602 -22477 -429696 -94319 -143981
9681 -143981 -14262 138856 164981 -289396 67498 -199226 41852 131920 -521341 -282559 479148
9669 -151707 -65079 -418533 79991 -192431 -211342 -194200 -320020 -166965 -5934 252783 351045
9658 351045 32721 -246357 -174012 41906 145829 -198490 -187026 -98411 32298 131787 -281765
9646 25264 -170964 124879 -320618 23604 118697 -271748 -261910 -150181 -134863 -93031 -27411
9634 -243667 -190387 -90632 -283340 -80490 -90174 136714 5409 -271020 -87925 -158035 -595519
9623 -595519 -248968 -163910 -75869 -54932 -23741 -250557 -2660 -204397 218592 355979 136965
9611 51091 147988 30967 111488 -129397 122269 -232852 -224778 -3521 -9846 34103 -66108 58957
9598 -267746 -350823 263814 31997 135301 -331815 -170336 193679 -258480 211240 -88674
9587 73606 57373 -33737 20265 37978 15010 -68016 51477 5984 92360 -115329 9845 141612
9575 141612 162824 -130044 -166805 -30034 -215778 -19459 -42330 180422 6531 118291 -46670
9563 -173901 -336926 -104107 -136794 -22668 107022 -146923 -211179 -58634 -39061 170543 40335
9551 -288798 -176560 -91529 -83146 286223 296782 -25559 17935 -105439 -494776 61874 -32464
9539 -1753 -1548 216181 -115942 -232788 129842 -42405 -81616 -320045 -36679 -113825 -162021
9528 -162021 214663 -114572 217896 -377098 -194538 181309 152520 -567410 93480 225921
9518 225921 -126241 -21676 -9591 -78421 -2658 124842 131144 -51361 -126133 -109256 -306478 -99064
9505 -87381 -220448 -311430 -15943 140969 97188 -7123 102812 -201254 101343 -268354 19166
9493 22313 -168504 22328 -220331 -37452 -69830 -145225 -168194 -175243 -326456 -20923 55104
9481 -16100 -112848 -105141 -110515 -111091 -214314 256408 -77791 -78462 -141639 -50498 180603 -126117
9468 -134083 103249 161391 -156273 -56304 143493 146346 -269919 -31737 -113957 -8056 -328336
9457 -328336 -119923 166223 -144729 -355920 -22308 -9806 455818 101142 214998 -158718
9446 -188609 -11874 7125 -12947 14336 -47199 27157 -284278 95766 -138580 -113927 -81792
9435 -81792 19074 36148 -349117 207833 -89536 -330553 64591 62662 49256 106430 -142135
9423 75632 -42450 -42172 363782 -425187 -28382 -41410 -449394 107611 -354301 -318393 -39025
9411 -25026 -43249 -252440 60130 -119956 -105695 286572 59328 -173402 -125611 -356888 1688
9399 76636 -25702 -146274 -339279 -319621 -45913 -36971 7643 -89256 -125523 -11217 276801 -153450
9386 -30609 -406615 -207078 -468338 -152296 -128378 -176686 -289390 -131718 -364661 -147307
9375 -267977 6855 144210 206028 -158738 6874 55690 -122662 234011 -41648 -62855 281238
9363 79129 480184 -321189 -63544 -192725 -316460 -66105 -138929 -134341 -368257 -322461 -164010
9352 -164010 48786 50506 -19697 -22623 -241761 194915 -41003 30834 1499 -76921 -96692 -251473
9340 -251473 -103209 -167381 184334 200551 -56598 -313105 -74263 -176089 15613 -67302 60767
9328 -83743 173685 174548 -25614 81099 21150 -63301 -1627 -282330 -9619 89129 -242007 -9310
9315 9655 -2682 154423 -218138 142885 -13546 -114578 -369755 -26407 -105457 -52859 -225721
9304 -225721 -172868 341636 -218581 44044 96108 77007 -205818 4827 -168943 34389 -227630
9292 154435 78003 -146669 -159393 85363 148979 -143086 -330712 43414 -355327 -277637 -33970
9280 -155425 -352620 183607 -63189 133347 -11357 54816 -360683 -175613 -110349 36757 100244
9269 100244 2499 -32626 -149098 38413 -129965 103132 -82414 -277205 -98301 45668 -156277
9257 -13698 98047 37950 -6488 -180188 -16970 229327 194890 16421 -189334 96796 -225218
9245 -220264 284943 -110470 -360693 -97774 -166006 -254594 58125 322405 -145511 -385129
9235 -385129 127616 142934 38143 -332048 -96139 -257871 -294041 73714 -223415 -1245 38654
9223 -318965 318127 41737 43608 -203170 114472 -241112 -2701 96205 -311000 -226511 -220909
9212 -220909 -197597 -263690 328326 -132359 -50651 59883 -376388 32624 -71870 -198796 261971
9200 -137787 91044 -59638 -42295 -251146 22741 -205349 -274683 274652 92316 143895 -170964
9188 -239515 -230199 -286363 6173 -196850 -166738 42646 -140328 252318 -1795 -153140 -52807
9176 -52426 -181363 155949 -88926 -164 -185731 -281616 -326340 -50058 187328 528732 -51255
9164 -212084 -381419 -206236 496047 -213934 -166019 -19261 -124582 -320132 113610 -365777
9153 -16721 219795 -487570 141490 23613 -17854 301927 -76214 120923 -334870 -281714 -85350
9141 -121141 -15169 -102492 -70723 -101461 -140703 90364 -132799 -319151 -221880 134543 -121236
9129 295736 237534 -332377 -225359 -9213 97305 65974 -281511 89153 -238735 -219006 -155198
9118 -155198 44426 -44104 -240503 -133977 -335896 21295 119049 95321 -108711 102387 -172025
9106 -50365 20350 148931 -122329 167881 -66954 61260 -355357 149194 33396 -372843 -106187
9094 76231 86868 -45915 -8093 -57530 -55645 2257 188794 243513 -123640 42490 7239 -94263
9081 -75717 -139237 -9589 42816 125086 -159315 -202475 149232 -57093 -245197 -124901 75054
9069 -89833 -219260 -209846 461730 -128332 -413902 -35058 57394 -59964 -122340 87664 -207906
9057 -20811 -259611 -109844 -97510 -191537 -253249 -142960 94181 -183774 -2432 430009 243665
9046 243665 -242314 -146084 -134207 -27218 156532 -165860 114252 -393402 -81191 -251906
9036 -251906 -51504 67706 45506 315985 186081 69354 -349719 -70962 -100462 -102082 -224265
9025 -224265 -351537 45219 -119542 191796 -1723 -78758 -104125 -64162 -51577 173958 -137804
9013 -3440 -148923 200628 -131061 -89746 -156007 119495 -33191 177963 -24676 -161259 -37361
9001 156129 139446 -20770 133714 -11018 -37181 -211381 51943 -309187 -352842 -341160 -51383
8989 9791 108682 -96647 86653 -171485 -15814 -215705 -31608 -152662 -328180 7247 -88211
8977 195018 -509534 -28121 -236700 -304184 74158 -1880 -73415 -591798 -115600 228560 199632
8966 199632 -194477 15824 -85847 -252513 -179595 -226482 -41388 -44405 14847 251693 -241484
8954 -104570 -620 176182 23676 219987 -173781 -169062 -147585 -236036 -178574 138543 158909
8943 158909 223511 -354722 -8205 137961 -36883 294270 -77906 367106 123181 27467 -335926
8931 -309353 -249095 -86980 172285 -183193 -73946 94109 58555 -254185 -267642 -6056 -276038
8920 -276038 113850 227180 -167296 -132848 59495 24612 -143593 17482 -429159 -218604
8910 -218604 32786 78159 -66037 32971 -208889 -302240 -58740 -322042 74742 -256697 88267
8898 -172138 234689 -143734 42017 335688 -28859 -131270 -140283 233352 190101 206985 -290761
8886 5199 223732 -187117 -105388 1442 -177617 256229 57904 -136645 -243627 192393 161613
8875 161613 187093 209538 -53694 97468 129103 199699 -24626 -248893 121084 -38235 -312169
8864 -312169 -8266 -83478 20675 -195846 55739 82870 -301491 -275280 42086 -49494 -144561
8853 -144561 19816 128927 -59947 -192508 -409100 -182185 -19050 -32624 1496 -160538 129431
8841 42132 -82965 -158436 272917 138867 2869 60473 69288 25283 -323777 -261228 -64426 41725
8828 25807 -127459 -34139 -47056 -14621 116325 -296884 -108219 -137395 -100505 35389 -163229
8816 7950 -120877 108142 -279766 104362 -448405 76953 -507848 29101 -193597 -180825 -186652
8805 -186652 80428 -198326 96014 -185540 -138744 248964 49971 -1242 220397 -8472 -129971
8794 -129971 99400 213317 192815 -32231 44075 -157338 -19196 87385 176135 125909 -13165
8782 118698 242859 -68578 -115149 -148506 -187309 157008 76153 71432 -193348 34326 -45865
8770 -142407 66850 25695 -255092 -285800 -20383 -36375 -81985 71617 114751 -173059 -292462
8759 -292462 100537 -313577 90420 -118568 128058 -149188 -267557 -166644 -189318 42920
8748 -185434 3555 -125876 137552 1410 -160383 144712 -197223 -237206 153216 6465 37774
8737 37774 145696 -245785 -170336 -12198 -324174 117766 -401364 -364237 244012 -15260 129752
8725 4455 -107171 -96369 -103301 -163708 -108466 -119040 90136 -74702 -119074 85295 -248677 -39246
8712 274737 -233171 -322250 -225436 -71791 -242389 -105357 38091 -12915 207939 -206066 -182028
8701 -182028 6320 -30167 -183654 -293516 -42934 65907 68220 -94370 12938 -1111 -41844 -113575
8689 -113575 95246 263867 12230 -332525 -82597 -43876 -214571 -239807 -189592 -198131 -162601
8678 -162601 -183217 74345 -222639 -208624 58528 -246563 -161566 -146719 211841 -9410 197469
8666 -357664 -120813 -150698 -231342 -368883 95742 -394770 -147281 -67083 50171 -120376 215329
8654 -116732 -125845 46364 409 -243790 -37271 42332 -128721 -225634 -200441 55498 107482 -23499
8641 146572 86476 -18736 -194949 -76547 -52044 -296680 167633 -81936 -191639 252439 163396
8630 163396 -25680 -189332 -299618 -168887 141481 -255317 67743 40392 -104537 91653
8619 63457 -355392 95788 -133326 -287962 69374 22562 -193789 -173234 185218 -133296 -75621
8608 -75621 -49113 9301 253084 -337410 -90171 42864 -112510 -35641 183842 45615 -18751
8596 -112707 -31293 71248 98761 -126260 -163218 -234408 202974 52884 3620 -112249 101144
8584 -185829 -90348 -180061 379787 185290 192832 -141008 127520 -1726 -40582 -234958 152849
8572 113406 74648 31029 -41434 -416720 -81135 -103593 57551 56250 -198505 -83871 -95115
8561 -95115 -119653 216944 -95451 347395 84086 35685 -376249 -125315 -172397 -86069 181790
8549 76065 -48922 -301853 386307 55863 -15898 132754 -266435 -59058 -63890 85700 -2215
8537 174090 99317 -95036 -292 113561 -93037 -57944 -114683 -237979 -124514 169978 -101236
8525 -24554 -135945 -295352 -311044 -292399 14132 350543 -66869 15370 -263136 -214923 -225195
8514 -225195 -267805 -165732 70184 210110 204141 2160 -155059 -132462 -3319 129643 239947
8503 239947 -164134 -216790 -61827 -49037 -262690 64440 -41747 292071 -75294 -33853 -98424
8492 -98424 -158992 13138 -70230 98184 46827 50837 -197669 -61945 -9380 -71858 254351 -63599
8479 -271191 6663 5058 103891 -285813 -12519 208247 246400 126434 -161487 155415 -34810
8467 -208281 -201675 -117333 -187068 -356755 -27176 154027 -384825 113245 -304001 -37282 -111560
8456 -111560 -30700 -15761 -325152 -225831 -240949 77935 176970 14645 -106448 -34533 -29573
8445 -29573 -46147 109734 291136 -67025 -32708 -132560 -20682 89324 -276874 305144 -143736
8433 -94851 149779 -51045 -144965 -71569 -67034 185283 209393 -53540 32785 -210158 133841
8421 137610 178610 -123295 39852 -39815 209226 -34565 -98323 -158510 -200119 -104929 -169464
8410 -169464 -41909 50463 -90405 6057 365449 172035 -103977 173612 272788 -93888 -282443
8399 -282443 7357 -159672 -205363 25760 -3102 -403529 85073 207690 -148615 106234 29109
8387 -117548 -74875 -225455 161705 -205045 -172365 21408 -10657 -5740 -183377 -141134 -10559
8375 159252 -577803 -96010 -325290 -193273 36167 -248166 120387 -141046 -216309 153370
8364 123487 -129813 -137044 -145262 -33758 -106313 -72058 -63260 -24489 193934 -10911 203131 -77446
8351 73149 -13924 -115537 63722 -42381 -340358 -290492 226415 131376 -87381 38163 366562
8340 366562 -20823 92479 -31343 144725 -145461 80258 -292869 82867 -99852 54156 -177962
8328 -242715 -153645 353743 115983 -127610 -86901 186897 -52618 272078 197038 -102368
8317 -60816 147554 -69905 -301740 63118 -251851 226477 195961 -55596 -214883 -186616 -37452
8305 229063 61917 -296779 -79746 -121880 -2992 -44346 -42004 -199017 -84524 157746 118105
8294 118105 113402 -44695 -248989 -168191 61201 -134288 -21886 -190328 -9024 61098 -66902
8282 -23211 -86986 43074 64435 56729 112640 -85527 197580 15315 51393 -151200 -31057 360115
8269 270860 22860 138016 146499 58387 -17582 -11901 -277007 -158523 -35827 -131657 25080
8257 -270233 181504 2846 -303465 236856 -64861 -225623 -132146 9231 -155386 -252033 -126562
8246 -126562 10724 -59829 -93655 -56192 34294 -142143 66595 -180139 101656 -73398 48139
8234 -56054 67093 -199314 -263438 24214 -5495 -17610 -136192 -6323 -71826 -31361 -258384 -278355
8222 -278355 -43569 141890 -40169 214283 -375441 -124394 -168144 -308265 -52341 21003 97551
8211 97551 -232721 159895 37458 -371319 -127215 39127 -67575 -380345 -129669 -69980 -271041
8200 -271041 -47725 13356 221543 -119694 186076 125689 111325 106074 -246851 -245505 -193972
8189 -193972 153910 89621 -113773 163976 47057 88258 -345675 -659 -96129 -219378 48947
8177 275982 19328 99824 15861 -13602 -114225 332069 -56614 -246326 -171441 -297583 264027
8165 -81563 75053 -116374 121169 150863 -293637 39459 201249 107440 -167162 -41397 94681
8153 -21440 79408 -84507 -135277 207230 -174817 182924 -126395 -90501 -79234 -196704 -484674
8142 -484674 117820 25812 -330139 29988 -338708 -54545 72693 -28525 9501 -437566 -129091
8130 103998 -180534 -108055 -263798 -84188 2429 311678 -222640 -111959 34102 84275 -120905
8118 -192735 -10348 253201 -491 51963 -185265 48752 -339649 22771 -326881 -61418 -106560
8107 -106560 -79588 1937 292510 -18458 -112476 -61941 -315968 356262 -179319 -167109 -163972
8096 -163972 -2726 71510 -223767 319677 422208 -165591 -148335 -167190 91772 -174049 102088
8084 271201 -33859 199960 -66989 82125 45957 -123055 -100204 -205325 5437 -207657 161241
8072 -103373 -13796 -260024 -28079 157109 -239989 286746 204620 140487 248874 -253743
8061 28770 -65138 -104563 -238529 -97677 -30084 180645 -129746 -162624 -110270 -130144 -269653
8050 -269653 -193913 -126566 -112890 -48512 -271194 162246 -171667 50725 236066 -38076 145562
8038 -95222 -86516 -231402 206014 -144514 244571 184134 137715 -96684 215025 -99072 146393
8026 -108946 -124024 89885 -185979 399686 -21526 228530 151622 -133559 -210769 -69174 47207
8014 -75442 -220299 -224047 -165109 98564 -57145 72965 -59076 -208639 -132 -65907 -85714 -170187
8002 -170187 76446 39992 22828 116708 34107 174533 57000 225145 38243 41555 -161068
7990 -113025 -223045 38917 -30945 -179220 144043 111255 -84060 -128795 -216933 7948 45194
7979 45194 -313587 -116379 215799 27573 22866 -50637 -357469 -161285 -27884 1655 -371307
7967 -7816 -173570 -544942 26168 -293676 -102879 159103 336254 -9152 19536 22305 -64324
7955 -167246 44829 -143356 -131321 -170133 -22026 -76741 32705 -147116 278736 146583 -125992
7943 -32943 -24839 146829 98489 -294258 -223545 4654 -34514 -187920 249263 4594 3908 -119121
7930 63069 321105 -229496 107649 -416777 110180 -39219 -188725 146851 -359194 -51365
7919 -212386 86893 21375 18869 221624 -55096 -339919 16142 269505 -155372 -117758 -99937
7908 -99937 9927 3880 -2699 -23335 -347809 -121025 -45683 -45631 -41414 20123 -212496 -145638 -205344
7895 -205344 -344126 -135516 218906 -16258 61068 369031 60014 -7639 52900 -152327 166075
7883 34044 56351 -134076 -112482 -12829 179763 -80900 -151092 -339873 -109887 -375582 -305317
7872 -305317 363742 -338988 72304 -156572 -304320 -52140 -272901 -130289 162696 -23321
7861 -52999 -270255 -117917 338887 -81675 -240269 186591 84724 -402 -96155 68031 115998
7850 115998 177464 -19095 27833 -169504 -282744 334555 -517177 -387718 -135685 -143253 37447
7838 -161013 -181236 -335291 -232383 -72823 -51574 97834 191460 -166314 192367 -32994 52136
7826 -104236 93608 -256873 136369 11251 174519 -71496 -48356 -6081 77247 -282685 117136
7814 -121104 345411 -297479 -155485 -223541 48519 -117988 -72375 60490 42832 -234537 -310346
7803 -310346 19470 -88002 -44147 -277407 96508 213278 272825 120291 63890 -6495 -27859
7792 -27859 -43096 -70906 8296 111052 -67940 -21836 -361506 245757 320817 25554 44880
7781 44880 -77655 -84864 -33472 -178252 230670 455 388990 -181920 118083 148813 27809
7769 -156950 -205968 -198987 -447834 155055 -77046 111786 164800 512969 34507 132779 -136154
7757 -57422 -146803 -226987 -2116 -156353 104404 221623 105325 -11287 -99969 56415 182478
7746 182478 246519 -368824 -194600 -221686 -57226 370629 114090 -367962 -5369 -82020 -161853
7735 -161853 -182897 -6525 -299597 189969 218976 -117354 164370 224565 227651 101378 -63198
7723 -239279 -76797 -193392 87074 64615 -39078 -340165 191326 -150311 -53620 16261 230204
7712 230204 -171530 -49574 -51789 26856 -162199 -362710 -250958 61231 88209 -2760 -357877
7701 -357877 -290125 -1584 52380 -53604 -141539 124374 -126930 -110023 -198422 203508 -19849
7689 -60053 -188229 -356897 -127168 -275331 230399 38686 28922 -270031 -157043 47061 -231665
7677 33608 -67923 -84791 -347511 78021 5710 -256095 -43646 -317338 199313 -263827 -105277
7665 -12154 132875 73746 5863 170835 15785 64665 -112755 121132 -57411 110477 96594
7654 96594 -504081 -123269 128776 78419 -7185 173805 313846 -44333 -116752 74308 16506
7642 -82952 -51244 -110897 112036 5520 192004 -339218 -90537 367667 -86025 204749 -95816
7630 163918 -193639 34269 -59045 -11319 -53732 -170570 276283 -170097 59828 -78247 -164047
7619 -164047 -331477 338360 -243326 -61438 -57285 -6636 -204226 82855 -54759 -241773 -136874
7608 -136874 -337138 -200414 -117196 88186 36435 -131758 -202301 -320295 -213434 79362 31869
7596 16191 -9153 -10534 11984 352873 -116084 156782 187044 -137373 63430 -147870 -341860
7585 -341860 101063 -71225 -483245 -224873 -193399 106268 18630 92070 157949 150185 -273283
7573 116252 -255944 14826 -45220 161280 96652 -162655 -48558 -252982 4283 149174 27981
7561 -55785 -32358 -114072 150509 -260904 -65690 -310925 -91155 199975 150726 348223 -1214
7549 56305 -12942 -131924 153305 -34864 -348976 -55135 8614 -177013 -76307 -85671 -257664
7538 -257664 -140837 -132911 36891 -179221 96293 -198767 -131033 24967 -194067 106141 -116873
7526 -13385 -378384 -84486 101166 50364 -187152 -108931 67155 -117534 117212 -31309 6131
7514 182562 18008 -29364 -320040 -376715 281507 128177 -120267 104733 -253367 44394
7503 76074 -42780 -249006 123830 -320881 124199 150624 -103832 88008 181713 -143719 155670
7491 92849 -153408 267602 -267732 289562 123111 -186859 -8899 17838 -129044 -2073 93543
7479 -111290 -6639 -44557 254085 -35806 -121447 484349 233960 -193888 -40295 -168963 116806
7467 -224627 127633 -136276 258097 78328 -153677 -115496 584419 98591 -178847 -246475
7457 -246475 -85973 180597 -15313 4296 204563 171084 107231 -96558 56443 -107793 -262026
7446 -262026 -67903 83292 -272578 77684 61261 -220498 -9383 -128375 -62326 24434 94358
7435 94358 -171776 279049 -170435 126804 -179903 241226 254238 -147673 62963 -80688
7424 -218080 -191725 -15893 -96892 -22622 -25148 158975 12339 -107021 -52699 206613 -46139
7412 -25810 -360782 -152445 -76170 46299 59687 103617 93525 -146533 74378 -144705 -74532
7401 -74532 -249459 203499 -75583 76067 -114974 -236743 -106185 211083 -212433 -130459
7391 -130459 -175659 -54549 -143252 -296293 16418 -99187 -259237 146706 12729 26623 -171935
7379 -137295 -21316 -118851 -50661 -40552 -248628 171449 -53664 180527 -210947 -32563 207909
7367 -61353 -132342 -242609 271276 167356 -40133 240426 18012 90870 84000 1402 -101782
7355 2062 52759 -96183 66537 45025 -223956 -259263 81179 98492 31262 121025 228050 288477
7343 288477 330356 14916 115985 -51462 43146 -311626 359438 138862 54075 -78211 223012
7331 186665 65816 -86387 -60706 -48095 -23469 33228 -180060 -199512 -179210 36563 252380
7320 252380 77394 -106073 -93118 -59150 -197368 -52777 75363 56979 -156548 14216 103093
7309 103093 19867 43798 36404 57525 139098 -220946 -58969 -38184 -40744 244551 151431 123103
7297 123103 -143975 -32433 -31888 -29458 -282493 -304876 -143692 143394 79010 -78539 37102
7285 120846 63660 -40991 104220 66146 -18901 18539 331545 -63941 -95080 -95070 -11516 27686
7272 136756 -31148 -293263 -19896 185979 302585 -5446 -439580 -65833 1202 128288 -157168
7260 164440 88257 15032 62121 -260293 -81127 138657 290618 -64806 -297825 -67829 -110743
7249 -110743 223453 -15821 -327105 -173032 87395 14556 -163693 -332918 -176260 -21248
7238 206194 134107 -245674 -21821 -11261 -90932 -293057 -346896 209921 -71468 -113878 -81821
7227 -81821 1206 -27953 442960 546 51050 10404 33274 94797 -24852 103990 -99130 134598
7214 192804 -54557 62249 -83825 70142 -84607 -131714 -151613 212513 -31546 17369 -171705
7202 293818 -187985 -195073 34317 26704 26234 -61980 -31866 -50961 215364 78874 -219765 -321632
7190 -321632 -194390 -218609 -142506 203201 -12306 -33931 254574 401739 143056 -223433
7179 189500 16855 83137 -58981 -157541 -127346 92408 -22473 -18326 -148712 -52406 162789
7167 -238416 242681 -136453 -109568 -51907 -32577 192648 88748 -198415 -85870 -170772 -118905
7156 -118905 564555 -47945 -140054 88312 -130830 -223935 72914 195722 6539 -109447 -42552
7144 -554677 -110571 -217969 170029 88421 -191044 -134850 -189784 30828 -374180 103391
7133 29323 122436 61328 -60840 -199887 177057 22152 -335530 -63799 123130 205407 -60542
7121 -31047 -201152 288056 165766 -33513 -135445 -97133 586663 -374496 -9245 77794 71802
7110 71802 1116 -323086 -102104 -190282 36018 91137 -358281 -103022 91235 280679 -30238
7098 119630 4320 -126350 216255 -12820 19701 207519 -198030 29852 165046 69043 -331538
7086 107115 163817 -43683 -184386 -25009 -401444 98368 85400 -86183 194876 206392 -195027
7074 -242774 -104640 -77494 376361 136654 41254 41314 6658 133220 -35816 291689 260271
7063 260271 172230 220918 -137332 -15510 -98003 -261081 -129647 -29269 -84503 -362659 -7903
7051 171496 -175112 -83308 167908 79665 221521 -190346 -221324 61346 124395 -61487 143343
7039 -153225 -5637 165380 -83557 89176 -174413 256024 -10335 -256151 145495 218923 -278521
7027 -161101 14422 170197 -28185 -213687 -24020 338301 92810 -140286 33559 36659 189731
7016 189731 182382 251678 -56581 327713 240173 -46002 82757 345484 161934 -215144 15140
7004 -83021 144031 82301 150525 -93113 19243 -63932 -3194 95519 217005 67160 40173 166996
6992 166996 160996 86086 -22433 100558 -49355 -39994 -84581 135223 -336814 -292793 152350
6980 186256 -500868 -208410 -172720 -121399 37720 -195019 465535 45226 -317327 -18559 -37879
6969 -37879 51045 -203615 -57909 -310988 33468 -468543 -213197 -86085 -270131 -77169 -30045
6957 54449 -149240 75719 3002 168200 29420 -62055 -83291 37666 -283804 205661 306359
6946 306359 -165450 95562 -478846 -30257 120779 -58525 -167324 -75386 -148161 65514 -280514
6934 -44306 -93427 -40525 238642 -99670 -104610 76821 70682 8624 -51310 45564 -111517 194011
6921 -197618 -120778 8632 386499 -207429 -8335 -116962 112653 -183965 113837 245207 196982
6910 196982 -108173 169749 -251895 -135666 -180938 114483 86667 183867 -72454 41799 -95466
6898 -50420 -126077 -34346 -130910 -73548 -4413 59267 -16344 -53534 15837 111164 -39424 -164276
6886 -164276 101125 -121571 -186450 263 -308155 67967 -373800 105590 276356 40201 -137640
6874 39172 -16081 6788 -64730 6867 155048 -1802 87644 -252078 171783 -270800 -136613
6863 -136613 -154665 9731 -199858 -138270 -10744 -81828 -70200 315281 5243 100839 88284 -150359
6850 -32957 -149997 17012 -71115 11126 37841 -12231 -68120 195997 46262 -62425 3550 8685
6838 8685 -48920 23063 -32126 -139948 7886 181719 -187482 145657 57988 12171 -180083
6826 -216157 65017 56765 38854 -77637 -150132 11782 54287 56662 -129288 28342 279466 -310685
6813 -49945 149023 -58344 -233917 305815 -84734 -55715 -41805 161143 -2950 156128 -574570
6801 83465 182602 -282410 -313509 -101098 4980 39742 -135076 115670 174976 -305109 -248861
6790 -248861 -61218 -38737 -128450 216754 -41731 105620 163830 -225035 -145078 87809 19950
6778 192466 119906 -63080 89922 116692 -231427 -89318 -121137 -138249 -43316 -20092 134723
6766 197419 324828 -76176 -69705 -89038 -232835 -215777 121026 139629 -39449 94058 -229862
6754 -29462 -270454 -365623 -346368 -94804 25990 -91270 -298113 -112850 -68764 298763 -91260
6742 -84030 49231 122349 -173289 336760 -28123 -57581 269782 101085 124636 -169479 -69428
6730 -229464 46182 -241303 -367337 -29425 188250 24305 436701 -30414 126578 13471 93618
6719 93618 175364 33853 84605 122479 177524 102414 -96753 -67302 -169683 -50856 138939
6707 159249 54930 29083 -541980 82877 -273791 -43366 353155 -134879 -113340 46854 189651
6696 189651 -58757 42549 25922 -24239 69355 40588 -148317 53564 -78812 -31773 207204
6684 -91419 317484 -301767 21052 -164825 84556 481656 -108868 85155 -169088 -91244 -404846
6673 -404846 -500936 -8372 444612 351575 -147907 9394 146528 4030 12045 -460654 -109273
6661 -517238 26709 -207 -16028 -193199 -132081 -43153 -191212 119808 -140916 -61577 -191675
6650 -191675 193803 -6758 -338305 85631 -7505 39273 -154058 61736 206560 -15684 -130414
6639 -130414 155701 -124758 -185215 -111261 -111230 105186 -132097 -462460 -37691 -119831 -83668
6628 -83668 88599 193913 68845 106101 -343182 115433 -29210 -101847 -179051 -151615 126023
6616 -212384 209158 186401 191690 264766 369948 97118 -184174 -120559 136898 -42949 -23430
6605 -23430 350075 152653 134931 69986 148225 -217166 -111236 -111543 -3085 -464740 85727
6593 63955 241211 227017 -78730 54755 115493 -60652 -29285 298096 -90477 95775 -157513
6581 -31982 24413 -87155 91254 -343352 81703 -33554 -12589 -104183 -118688 -148554 -84477 195633
6568 -50072 -159826 37874 -27772 94029 89135 -425430 61954 -187830 75847 263611 -35653
6556 -253618 238421 -132728 14050 -90444 -31065 -105345 126875 182200 -142557 33269 -106864
6544 -111563 -106242 -82550 30432 -62765 -42663 114107 534134 -21658 228455 -203246 -24077
6532 11615 -358487 98708 -170100 -4137 -374046 21067 -77483 112584 -55520 107905 18559
6520 -194333 -99474 -243228 -236281 52668 14017 -110752 -10641 -118604 -79017 119795 -113492
6508 -253695 181165 140604 -250244 60400 42183 -270122 57070 104595 -221636 84661 -91220
6496 151775 -223180 197672 -28906 -121071 -138101 33806 334243 -252862 -31886 33536 -162497
6484 97962 213167 -41491 264156 65782 -180683 -234004 -158800 -9502 -34856 -90041 -256203
6473 -256203 -196016 22404 -16296 -1286 423561 -87123 -506 -46174 191735 177884 -143663 342236
6460 117567 92367 -104639 -287616 111518 -104156 -245319 485162 98540 -10039 -78170
6450 -78170 -177575 113780 -303307 339523 -219343 1512 169615 193645 274935 -61261 -58318
6439 -58318 -340638 -38838 -131690 331571 263278 -215751 15979 -65234 120506 -215193 -55753
6427 -100605 -124886 -307848 45387 387707 27748 -131792 57884 -179950 -86359 -141264 181191
6415 2437 162128 -53104 -210865 87115 -99323 170739 84702 -244743 83537 16241 -294661
6403 167332 -174869 -73746 127193 -185219 71204 71786 -30369 101800 -77568 -115003 173586
6391 -254258 -44664 357194 29613 133516 109670 -395356 -168224 295853 -35797 -142873
6381 -142873 203765 -43939 59222 10861 199707 -180841 -98806 -19188 -116769 8487 209964
6370 209964 238280 -107339 -188522 -14279 177278 221823 175676 -257187 -240951 -29831 133986
6358 -28804 -38299 -65856 79939 -71954 -239995 -187240 -47664 48035 -205109 144239 249760
6347 249760 56257 -261088 140857 -21380 163889 24871 -225670 127812 211701 -347137
6336 -426222 -63104 133132 -202275 -88940 -222733 436003 -77726 -269400 -80543 -106647 -43272
6324 115354 103669 -149594 92259 39255 -8034 -170300 28955 -3186 -446627 -111964 -225826
6313 -225826 -71266 -54572 21322 -165797 -44840 -197939 -54703 74896 21076 -112428 246421
6301 174557 25937 -204454 207005 -130785 100448 -210972 203894 -50643 236861 -281750
6290 113493 96760 103272 48532 -54037 130182 39876 -43643 -151721 47402 -185499 -449762
6279 -449762 90594 39244 -90982 -12259 -19893 -157835 -5646 -150632 310572 -167204 -299528
6268 -299528 -369912 -37881 -15573 -264516 -34406 232428 15176 -23279 108279 -85980 -169545
6257 -169545 324546 14285 -37081 213243 288680 163064 -212799 214814 143797 64722 89552
6246 89552 9637 -200126 -119753 -113672 -125521 112595 100400 225486 26394 227695 -215469
6234 239367 125077 -176316 -6610 -101602 84953 169710 49354 72654 -134532 82629 100625
6223 100625 -234309 -5429 285483 84474 -288092 219189 -37317 -110038 310818 -167529 356296
6211 127750 23320 129638 -250016 135452 -121208 134621 51860 -34128 71877 205558
6201 205558 60352 -208473 -206229 -222278 22932 187405 76277 121455 -137141 122908 281113
6190 281113 -227827 -212945 -156227 -92684 111476 -98437 33681 -81068 -40077 -9686 263188
6178 243132 -61972 28687 47138 188373 194439 110278 -358590 -15086 233455 213034 -178653
6166 4990 90049 -125653 -18380 165006 36370 46668 -45860 -258103 -71223 12492 90259
6155 90259 -93018 -103866 -99873 98732 -39188 -106618 -120641 -129335 113760 -77005 -151254 48186
6142 -303200 -196298 -38141 -784 91321 90366 67653 262422 -223125 -148571 -174572 -90512 318455
6129 -59062 -136009 -50509 10997 -2890 73685 -53159 -38644 -79024 -163915 27654 128786 67783
6117 67783 71542 191597 -200788 306307 -54151 375760 358312 58719 -168491 -37110 35699
6105 -97541 -67725 198123 104829 129986 -88736 117377 -126071 143398 105140 -86077 89237
6093 179039 -216210 -91654 -16723 -53741 152359 -57867 -85688 71185 158010 116324 173214
6082 173214 110872 -249582 158233 -380701 29420 40947 -301762 -118568 7711 -38904 231476
6070 36020 -10767 -49522 119914 -530495 -192361 -112551 -304222 -26585 192959 302466 410232
6059 410232 -25569 -142398 50376 -150857 -130933 -77325 -286940 48689 298418 -276207 -62951
6047 68872 -12232 -152583 -52653 113018 -358294 -150409 -193068 -468772 5417 -110800 -143442
6036 -143442 -87699 -80344 60311 -111227 15260 159333 -595 -67306 89882 -323572 12939 166889
6024 166889 -1785 -24012 -157644 -306921 13249 -71785 -146077 -194238 -111972 -117795 228048
6012 -8555 81988 -172779 -115382 56660 -181336 -269918 35890 -34532 -129775 246935 -163512
6000 90785 206217 -128717 117041 -41114 221212 -92604 -154387 132990 -366604 -179014
5989 22542 -139357 382802 -370165 -31372 -37450 319722 102413 -192943 58546 -262316 107848
5977 -367447 63461 38992 46619 85915 164550 -224876 238805 227389 -133090 222182 22323
5965 66896 -222696 -15646 -93333 53718 189033 51625 -123441 75840 -67068 -69821 202918
5953 131460 303959 198494 21089 -34677 729 -265224 -95514 -89989 54555 132024 128887 -91459
5940 284392 -33802 75133 -132084 -196832 -12707 120111 182792 -103230 388578 100551 -129023
5928 -195415 -52966 -147527 196318 14015 -123012 -204936 729 197364 -179323 127118 67802
5917 67802 15483 -193217 265506 -110910 334364 246610 287795 -139968 96331 -219370 -205382
5906 -205382 132906 156029 105999 -77925 15949 -5758 -271804 200941 101521 60451 46568
5895 46568 36606 -98556 88816 32028 136552 -11019 48825 -58344 -94155 64866 -156064 -26082
5882 173139 -152586 -47339 343189 237270 -110667 -195038 -176603 -138208 89289 6762 29906
5871 29906 162994 -149257 38529 -79264 -241848 230381 -225339 -8279 29288 149646 291270
5860 291270 10709 2673 -26720 -402851 238184 -188388 -65496 -188154 -73603 55519 -301845
5848 -13892 242565 188033 -113084 -73240 -261501 -157383 -104138 207925 -253634 -345776 255134
5836 215144 34381 235560 52105 -44794 -318421 -29945 -16279 385556 139392 31835 18192
5825 18192 -350878 -124204 -18957 451 -46714 17498 70382 -103543 117738 -47504 -9609 -38752
5813 -38752 -13346 174886 249028 320421 -75178 5720 116669 -266940 -23117 -43834 -190033
5802 -190033 -108334 -145722 -117701 -221067 -443226 -72226 353058 115652 -80904 -127758 -10962
5790 -156418 -69971 39989 -196061 -141482 103545 73954 -75480 223098 176536 -107033 336657
5778 229941 -3236 339465 315639 5044 411260 -151883 13886 26890 46578 -237832 -226633
5767 -226633 -19399 -65122 -19740 -165316 -225515 163428 24927 77836 61138 113479 87423
5756 87423 -125567 191686 135976 120507 -29656 147053 -26014 643 165751 -269567 108849
5744 26772 -5815 -337946 2676 -98924 214675 177400 -118371 -263305 -135323 277413 127519
5732 -33925 14995 240561 -232831 -136199 14783 359924 295506 151063 -68542 -492669 55402
5720 26592 28002 -57221 64730 -42721 227972 -184633 -269446 -37588 -25094 -88902 -42165 242253
5707 226061 -47707 -230253 323152 -163444 -121266 46579 -25623 -138136 93096 74009 116214
5696 116214 59901 246719 162371 -245357 -85428 -173853 -88275 -11281 -194935 -120217 -82745
5685 -82745 68051 -99978 -222943 -222235 111051 291289 -48796 -103950 -49159 290572 91807
5673 -52306 168201 75609 -159811 239921 35438 84462 43253 323322 63053 36134 -336577
5661 -128889 -18202 -29221 66734 -188242 367280 239954 -26393 -103686 54308 4282 -47019
5649 42727 -310581 29124 57570 -33275 -170174 162375 63170 160518 -118846 -195188 -36976
5637 -302561 -101927 92707 -71596 -66621 -78992 -58261 -129667 77429 -359300 -91735 120829
5625 -49137 -167626 -103383 130002 51116 92326 116664 -59325 23649 -312461 -23515 76281
5613 -83481 133421 -43572 -134510 -201729 24072 -150678 73958 -81031 -417231 10432 -59563
5601 -43476 -319236 152927 227340 297971 -40626 -171882 -208600 -78700 -124303 -115544 184737
5589 195396 -308928 -48046 -297575 39057 -135704 294053 -297185 -126477 -266614 315865
5578 68615 152986 -215283 -262317 287405 179025 9323 -109496 -190491 -21074 -30073 466602
5566 -129249 -124214 87729 -22785 158289 253937 -47970 -116832 36859 -67649 -108410 -85945 71475
5553 -72764 -247328 131529 92516 -216055 81757 315968 50806 21728 -155654 16453 199015
5542 199015 74045 -89948 234596 -304264 121071 18653 -134735 45576 171770 -219695
5531 16380 -155781 -142259 330099 30295 -158412 131361 -87244 71134 154936 11888 -150568
5519 -336979 22960 -82025 109414 -59803 125480 170828 -64217 197423 23762 459977 10466
5507 -204017 218850 115507 -103194 -105517 111278 -4018 23359 -13271 -71523 -19472 341360
5495 -168174 -108384 -44316 157844 -261397 5353 -127631 -24528 266709 106834 72131 222984
5484 222984 -205472 30672 79972 -218660 -257782 254947 227644 112003 126147 -186057 157761
5472 155472 748 -68137 -162808 122472 -6915 55676 -212716 146607 8057 -144030 -245579
5461 -245579 -293852 155335 -365930 302778 -22713 181530 144461 313139 -145915 -96015
5451 -96015 205489 -296577 378886 -224992 148229 -113074 -56107 101793 -95875 112537
5440 265037 170601 -34910 -284845 28754 -125677 251769 47812 190032 -44328 -6339 48288
5428 -216037 124453 -236713 -45203 76758 292780 -463928 175387 2238 -149344 -36639 -222714
5417 -222714 57633 -20322 6574 -297680 196119 82815 251692 193164 -244474 -88850 327078
5405 -75555 69981 104716 25745 -207679 279498 92606 175142 137688 -47260 425268 20073
5393 314209 -92684 -217131 76447 -154770 -241603 88322 146710 72793 366147 -194529 -84439
5381 102044 114006 250153 120875 136326 -84729 -59701 25878 209140 -21613 -20829 -98185
5370 -98185 133266 54358 -27143 308812 19846 -91863 156726 -188568 -42576 51184 375699
5359 375699 -80341 16822 -71946 24355 -329967 -148239 -35275 -231098 -218214 -80155 79768
5347 108840 -18338 278184 -176838 -17950 -134608 -41921 109667 -151020 -147108 102855 -76660
5335 -278006 3513 -374287 -236433 128414 122493 200509 -56741 264076 -24697 276962 268634
5324 268634 -220591 -41593 -118952 -328788 232459 -103710 -297815 -242909 -120470 6184 -234923
5312 449550 -224951 -1223 -240803 -19308 -42478 -59026 -265385 -163272 170421 -93439 152823
5300 -71279 101009 -181919 -103024 -105706 160308 30574 -168987 -98085 -300067 -110254 275811
5288 110895 17559 211705 276586 165017 -14223 -224280 72817 92966 12004 18686 -138788
5276 103287 232781 -251328 -193571 253517 244135 67188 223666 249340 -71872 310076 -158467
5264 -200884 -19772 68424 161943 -107734 -231230 169017 -119802 258565 242755 -222337
5253 -148869 -84040 -86390 52574 -164245 66086 -312439 -240359 348553 -80924 -100452 -299103
5242 -299103 174400 397150 -242865 -159190 -99545 -152837 126814 108459 -112511 3593 18278
5231 18278 73354 263991 84260 53916 62466 343119 -14828 173035 -85006 -235129 304163
5219 239422 -265370 136325 137482 501639 109189 -76702 82487 131228 95045 -45913 -107196
5208 -107196 -278313 -159476 273710 37699 -153430 -15957 84214 -255917 345648 58137
5197 17441 -147746 -364187 128399 -222719 -65543 150143 -67823 -18558 26201 85704 -147329
5185 -187273 80130 -191486 -51738 152017 -373822 48265 26756 -8371 -361171 -167938 -247965
5174 -247965 -381088 154571 180638 68665 128216 -80549 -16659 63110 193618 -22878 -35313
5163 -35313 37345 -126385 161115 195335 39155 -71137 368771 139036 -127912 -76431 -173577
5152 -173577 380390 48533 -138134 -237453 -209 -82476 212852 -114683 -8398 201766 -37406
5140 -94644 186025 -59699 62220 -175405 238662 174347 44511 -45228 -93403 86378 116091
5129 116091 105556 -126020 482800 -168162 -172656 131698 3942 58377 -43702 -100430 -262816
5118 -262816 -133091 -27224 -356895 -109981 161168 -98351 -73142 -34361 298953 -278874
5107 45246 -170338 -235337 78343 21077 108187 172985 -296399 -77189 50245 191377 210701
5096 210701 -82255 62231 137422 295285 -139082 233951 -37559 -362441 -78404 140032 -33614
5084 116554 -123248 124008 -148353 99473 142744 -249161 -1768 452350 -258117 88775 195564
5073 195564 165520 55828 4224 -126718 -290375 -172401 443662 -170276 -110508 295748 -134623
5061 -148062 -164581 -73536 129314 -161919 116660 121208 29170 -184092 -253383 -16643 16809
5049 140903 -234712 234295 -69726 14230 -393907 -89880 78838 234629 -270979 -97406 151831
5037 -65528 -258644 -201509 -265755 -9703 -111557 116352 272563 -190644 -208606 68131 -304890
5025 93296 74487 26042 153531 98355 129574 -539006 227288 -177035 112949 -1846 168978
5013 137559 14913 231483 -185221 -84967 -147254 215325 -14841 -506714 -50390 -127828 -107278
5002 -107278 36016 -142403 -87311 4948 279077 -86042 -102951 -223807 -170964 24898 -50656
4990 129082 95638 -76403 139434 -55780 -7941 106585 -152447 371049 137888 148651 299525
4979 299525 -117182 -76350 -4419 227230 -308225 -172639 236688 -199974 -155143 -225032 -93095
4967 48541 -43711 -191640 -591020 -230917 -506735 164025 46019 -300282 160922 41466
4956 439862 -11891 108459 160537 -272705 83424 -165668 43771 65306 192978 35029 -135828
4944 263104 -391079 352327 255519 131552 -127493 91176 125172 140882 38014 -234582 166535
4932 128774 4337 224660 187019 -54535 -410086 7075 3503 81224 78251 -193449 -131901 499238
4919 137495 292432 18137 43989 235007 115112 22848 186322 67597 137601 -7234 -25579
4908 -25579 -119455 68334 73952 33375 -87891 2455 76266 -39776 104069 -221904 386058 219645
4896 219645 -18166 109345 -376862 211859 60938 -58083 120303 162856 190765 -135469 -27997
4884 136851 120871 55291 237525 98996 -44179 70526 -119934 -334770 25832 199497 -93840
4872 78269 104503 262819 -69061 -74169 125627 -107500 80595 172230 4647 -71732 -238044
4861 -238044 -90610 183648 -142368 136123 98323 -223552 441677 185468 23063 14694 -109801
4849 205063 147021 162269 -97665 -78145 91819 162109 71035 102537 63606 -187247 -174670
4838 -174670 254847 190013 -84061 32205 -192894 114457 11535 309660 -194646 -63543 -158686
4827 -158686 -215444 139350 -75708 -271148 42878 38473 -74073 -20842 -10628 -79781 -21324
4815 25845 40391 24768 70839 364884 26380 -379671 -110828 -276977 127243 -139221 158820
4803 74212 169448 -374699 124522 -165202 -81124 -103201 131171 -16138 156846 -72927 141088
4791 -127382 101125 -169229 218167 -79518 142713 -190286 175574 189524 -82818 -53067
4781 -53067 172645 -96251 -64466 -135170 87486 222043 65732 7208 -137815 4686 -92036 69101
4768 -18834 27946 -8994 71237 244889 -101320 -121893 -30719 -157307 -112008 355055 272772
4757 272772 199388 97218 157715 425741 -339843 -311530 -265591 65150 110014 -128797 -85431
4746 -85431 -183650 -11761 241676 -3827 -349218 -220982 171454 196761 -80431 208565 -15907
4734 50762 258567 195088 60722 -133257 -208619 276106 -80851 98568 -277566 -41314 266765
4722 -26624 -34772 -38639 357305 39661 -113276 130683 -43675 189142 -25813 358044 -229635
4710 -33412 320012 -7350 65416 84053 -23746 -43029 -207923 80130 237008 354904 -52047
4698 84096 -82801 243974 233119 -144712 -28342 42927 120891 168783 -221701 342325 -58151
4686 388224 109804 81998 -24580 -194983 172266 29162 82124 -185102 -304297 -90731 20272
4674 -304152 282586 385106 115297 92994 -89705 294409 -228423 -118809 -95751 122527
4663 -437109 141483 20119 1178 64125 -75258 -75197 -50888 -229948 -118790 -163757 -116157 105101
4650 300087 67872 208516 122098 86795 58426 -223158 40481 434565 106687 -294853 -31071
4638 97277 72671 -162900 -215128 430778 77283 -33040 -141684 -78120 215058 -37980 -124148
4627 -124148 67401 -15676 -299235 -217626 99874 405275 -5226 100727 25550 263210 446664
4616 446664 -175615 273662 -157271 -46194 12109 144847 -164895 -243631 209153 -62450
4605 219983 21694 180047 76713 -54883 141326 -37322 298728 -40592 -203140 -159850 77348
4593 -262575 -188166 97068 189093 89583 168224 154228 -367693 -374117 -64517 -9216 130155 -118911
4580 -203975 81609 -192934 335956 -105489 -202203 17380 185656 109512 121543 94993 131591
4569 131591 242797 -44817 219541 22367 -63187 -225299 -128384 -4411 143898 254037 -171916
4557 -82911 222032 -223108 242277 73293 -93581 8524 55221 -157306 -10664 249884 428612
4546 428612 296825 129229 163295 -83838 81017 178726 450712 -85650 149286 259727 -178865
4534 196944 -13862 121534 197119 225765 175678 145276 -101880 36454 -98410 -153892 110313
4522 -137819 310159 50723 136415 103101 -31806 -57727 -131599 -60413 106694 -141788 -164594
4511 -164594 93018 -33420 240089 -63601 -217409 2307 144079 343817 339146 37946 -209082
4499 205745 40897 -199062 -13312 248723 30454 -68129 -177023 264841 147399 20378 45065
4488 45065 -98574 228244 -118603 302965 299081 -97125 -47925 -46917 -421934 -80310 -11239
$$ [...]
##END NTUPLES=NMR SPECTRUM
##END=
