##TITLE=AC1547_ROEFFECT0013_8268726_AxEuISjyBX
##JCAMPDX= 6.0         $$ Bruker NMR JCAMP-DX V2.0
##DATA TYPE= NMR SPECTRUM
##DATA CLASS= NTUPLES
##ORIGIN= BRUKER
##OWNER= Administrator
$$ 1.72 TOPSPIN		Version 2.1
$$ 2013-10-12 13:59:58.207 -0700  Administrator@X
$$ Compression mode = diff/dup
##.OBSERVE FREQUENCY= 400.02188249412
##.OBSERVE NUCLEUS= ^1H
##.ACQUISITION MODE= SIMULTANEOUS (DQD)
##.ACQUISITION SCHEME= undefined
##.AVERAGES= 64
##.DIGITISER RES= 22
##SPECTROMETER/DATA SYSTEM= spect
##.PULSE SEQUENCE= noesygpps1d.comp
##.SOLVENT NAME= COFFEE_meoh
##.SHIFT REFERENCE= INTERNAL, COFFEE_meoh, 1, 14.96102
##AUDIT TRAIL= $$ (NUMBER, WHEN, WHO, WHERE, PROCESS, VERSION, WHAT)
$$ ##TITLE= Audit trail, TOPSPIN		Version 2.1
$$ ##JCAMPDX= 5.01
$$ ##ORIGIN= Bruker BioSpin GmbH
$$ ##OWNER= Administrator
$$ $$ E:\/data/COFFEE/nmr/AC1547_ROEFFECT0013_8268726_AxEuISjyBX/12/pdata/1/auditp.txt
$$ ##AUDIT TRAIL=  $$ (NUMBER, WHEN, WHO, WHERE, PROCESS, VERSION, WHAT)
(   1,<2013-10-12 13:59:51.868 -0700>,<Administrator>,<X>,<go>,<TOPSPIN 2.1>,
      <created by zg
	started at 2013-10-12 13:48:20.977 -0700,
	POWCHK enabled, PULCHK disabled,
       configuration hash MD5:
       C8 4E 4E 5D D3 5C D8 9E 9F 52 82 E0 59 8A DE 15
       data hash MD5: 64K
       57 CE 8B 56 FA 5D CD B6 13 CB 44 C8 0F 45 B9 11>)
(   2,<2013-10-12 13:59:54.835 -0700>,<Administrator>,<X>,<proc1d>,<TOPSPIN 2.1>,
      <Start of raw data processing
       efp LB = 0.3 FT_mod = 6 PKNL = 1 PHC0 = 0 PHC1 = 0 SI = 128K 
       data hash MD5: 128K
       B0 D0 FB D1 4B E4 33 DF B4 C7 B9 09 82 F5 E1 96>)
(   3,<2013-10-12 13:59:55.763 -0700>,<Administrator>,<X>,<proc1d>,<TOPSPIN 2.1>,
      <pk PHC0 = -81.04065 PHC1 = 0 
       data hash MD5: 128K
       54 39 79 1D 74 E0 A5 33 A2 27 FD 4B D0 BC 92 D1>)
(   4,<2013-10-12 13:59:56.660 -0700>,<Administrator>,<X>,<proc1d>,<TOPSPIN 2.1>,
      <abs ABSG = 1 
       data hash MD5: 128K
       22 6C FA F1 A0 D3 EE 87 FF DC 43 10 D1 8D 6C D0>)
(   5,<2013-10-12 13:59:56.861 -0700>,<Administrator>,<X>,<proc1d>,<TOPSPIN 2.1>,
      <abs ABSG = 2 
       data hash MD5: 128K
       C2 FC 2B 1F 6D D9 57 0B 38 01 0E 54 0D 6A 93 72>)
(   6,<2013-10-12 13:59:57.093 -0700>,<Administrator>,<X>,<proc1d>,<TOPSPIN 2.1>,
      <abs ABSG = 3 
       data hash MD5: 128K
       E2 4D C6 FA 47 5A 09 83 4A CB 65 23 DE 97 C4 C9>)
(   7,<2013-10-12 13:59:57.310 -0700>,<Administrator>,<X>,<proc1d>,<TOPSPIN 2.1>,
      <abs ABSG = 4 
       data hash MD5: 128K
       30 B6 65 14 F0 AE C8 19 ED 8B 7D 8F BA 08 35 D7>)
(   8,<2013-10-12 13:59:57.588 -0700>,<Administrator>,<X>,<proc1d>,<TOPSPIN 2.1>,
      <abs ABSG = 5 
       data hash MD5: 128K
       15 F1 82 B2 DF C2 42 08 DF 17 2A 2D 15 87 F4 A9>)
$$ ##END=
$$ 
$$ $$ hash MD5
$$ $$ 21 3B 7A 5E FE 13 E2 10 7D A8 36 E8 4C 19 56 9B
##$RELAX= 
##$RELAX= 
##$RELAX= 
##$RELAX= 
##$RELAX= 
##$RELAX= 
##$RELAX= 
##$RELAX= 
$$ Bruker specific parameters
$$ --------------------------
##$DU= <E:\>
##$EXPNO= 12
$$ [...]
##$TP07= 0
##$TPNAME0= <>
##$TPNAME1= <>
##$TPNAME2= <>
##$TPNAME3= <>
##$TPNAME4= <>
##$TPNAME5= <>
##$TPNAME6= <>
##$TPNAME7= <>
##$TPOAL= (0..7)
0.5 0.5 0.5 0.5 0.5 0.5 0.5 0.5
##$TPOFFS= (0..7)
0 0 0 0 0 0 0 0
##$TUNHIN= 0
##$TUNHOUT= 0
##$TUNXOUT= 0
##$USERA1= <user>
##$USERA2= <user>
##$USERA3= <user>
##$USERA4= <user>
##$USERA5= <user>
##$V9= 5
##$VALIST= <valist>
##$VCLIST= <CCCCCCCCCCCCCCC>
##$VD= 0
##$VDLIST= <DDDDDDDDDDDDDDD>
##$VPLIST= <PPPPPPPPPPPPPPP>
##$VTLIST= <TTTTTTTTTTTTTTT>
##$WBST= 1024
##$WBSW= 4
##$XGAIN= (0..3)
0 0 0 0
##$XL= 0
##$YL= 0
##$YMAX_a= 6543996
##$YMIN_a= -13632453
##$ZGOPTNS= <>
##$ZL1= 120
##$ZL2= 120
##$ZL3= 120
##$ZL4= 120
##$ABSF1= 14.96102
##$ABSF2= -5.597161
##$ABSG= 5
##$ABSL= 3
##$ALPHA= 0
##$AQORDER= 0
##$ASSFAC= 0
##$ASSFACI= 0
##$ASSFACX= 0
##$ASSWID= 0
##$AUNMP= <proc_prof1d_extract.lims>
##$AXLEFT= 0
##$AXNAME= <>
##$AXNUC= <1H>
##$AXRIGHT= 0
##$AXTYPE= 0
##$AXUNIT= <>
##$AZFE= 0.1
##$AZFW= 0.1
##$BCFW= 0
##$BC_mod= 0
##$BYTORDP= 0
##$COROFFS= 0
##$CY= 15
##$DATMOD= 1
##$DC= 0
##$DFILT= <>
##$DTYPP= 0
##$F1P= 0
##$F2P= 0
##$FCOR= 0.5
##$FTSIZE= 131072
##$FT_mod= 6
##$GAMMA= 0
##$GB= 0
##$INTBC= 1
##$INTSCL= 1
##$ISEN= 128
##$LB= 0.3
##$LEV0= 0
##$LPBIN= 0
##$MAXI= 10000
##$MC2= 0
##$MEAN= 0
##$ME_mod= 0
##$MI= 0
##$NCOEF= 0
##$NC_proc= -2
##$NLEV= 6
##$NOISF1= 0
##$NOISF2= 0
##$NSP= 0
##$NTH_PI= 0
##$NZP= 0
##$OFFSET= 14.96102
##$PC= 1
##$PHC0= -81.04065
##$PHC1= 0
##$PH_mod= 1
##$PKNL= yes
##$PPARMOD= 0
##$PPDIAG= 0
##$PPIPTYP= 0
##$PPMPNUM= 2147483647
##$PPRESOL= 1
##$PSCAL= 4
##$PSIGN= 0
##$PYNMP= <proc.py>
##$REVERSE= no
##$SF= 400.020009628891
##$SI= 131072
##$SIGF1= 0
##$SIGF2= 0
##$SINO= 400
##$SIOLD= 131072
##$SPECTYP= <>
##$SREGLST= <1H.CDCl3>
##$SSB= 0
##$STSI= 131072
##$STSR= 0
##$SW_p= 8223.68421052631
##$SYMM= 0
##$S_DEV= 0
##$TDeff= 65536
##$TDoff= 0
##$TI= <>
##$TILT= no
##$TM1= 0
##$TM2= 0
##$TOPLEV= 0
##$USERP1= <user>
##$USERP2= <user>
##$USERP3= <user>
##$USERP4= <user>
##$USERP5= <user>
##$WDW= 1
##$XDIM= 131072
##$YMAX_p= 351022949
##$YMIN_p= -12520
##$CURPLOT= <Network HP LaserJet P1505>
##$CURPRIN= <$Network HP LaserJet P1505>
##$DFORMAT= <normdp>
##$LAYOUT= <+/1D_H.xwp>
##$LFORMAT= <normlp>
##$PFORMAT= <normpl>
##$SURQMSG= 1
$$ End of Bruker specific parameters
$$ ---------------------------------
##NTUPLES= NMR SPECTRUM
##VAR_NAME=  FREQUENCY,     SPECTRUM/REAL,   SPECTRUM/IMAG
##SYMBOL=    X,             R,               I
##VAR_TYPE=  INDEPENDENT,   DEPENDENT,       DEPENDENT
##VAR_FORM=  AFFN,          ASDF,            ASDF
##VAR_DIM=   131072,        131072,          131072
##UNITS=     HZ,            ARBITRARY UNITS, ARBITRARY UNITS
##FACTOR=    0.0627417313425164, 1,          1
##FIRST=     8223.62146879497, 313,          -65541
##LAST=      0,             1662,            -65395
##MIN=       0,             -12520,          0
##MAX=       8223.62146879497, 351022949,    0
$$ Real data points
##PAGE= N=1
##DATA TABLE= (X++(R..R)), XYDATA
$$ [...]
$$ plain form
63746 412623 409429 404481 397511 388409 378007 367631 358083 349439 341673 335076 330067 326867 325360 325092
63732 325092 325462 326149 327336 329369 332247 335610 339133 342723 346445 350530 355361 361085 367186 372805 377581
63717 377581 381984 386720 392086 397891 403633 408571 412079 414200 415580 416578 416764 415612 413332 410578 407597
63702 407597 404195 400370 396408 392397 388244 384206 380805 378112 375619 373017 370600 368719 367347 366426
63688 366426 366133 366459 366957 367318 367806 368718 369779 370557 371121 371759 372348 372624 372861 373616 374857 376029 377058
63671 377058 378640 381319 384832 388658 392747 397318 402210 406892 411044 414876 418860 423225 427656 431439
63657 431439 434022 435495 436418 437205 437771 437761 436892 435046 432271 428823 425085 421427 418254 416138 415689 417228
63641 417228 420702 425882 432488 440216 448944 458950 470605 483761 497584 511079 523613 534994
$$ packed form
63746D12623l194m948o970r102j0402j0376r548q644p766o597n009l200j507k68
63732C25092L70O87J187K033K878L363L523L590L722M085M831N724O101N619M776
63717C77581M403M736N366N805N742M938L508K121J380R98J86j152k280k754k981
63702D07597l402l825l962m011m153m038l401k693k493k602k417j881j372r21
63688C66426k93L26M98L61M88R12J061P78N64O38N89K76K37P55J241J172J029
63671C77058J582K679L513L826M089M571M892M682M152L832L984M365M431L783
63657D31439K583J473R23P87N66j0q69j846k775l448l738l658l173k116m49J539
63641D17228L474N180O606P728Q728J0006J1655J3156J3823J3495J2534J1381
$$ plain form
63629 534994 545245 554301 561727 566841 569419 570157 570059 569391 567681 564724 561035 557207 553496 550322 548590
63614 548590 549041 551641 556042 562268 570516 580685 592641 606621 622736 640281 658298 676813 696822
63601 696822 718901 742445 766545 790964 815773 840334 863236 883171 899480 911799 919646 922701
63589 922701 921455 917277 911656 905339 898231 890001 880604 870307 859426 848037 835651 821188 803743
63576 803743 783626 762367 741369 720886 700665 681184 663541 648237 634789 622745 612479
63565 612479 604652 599311 595937 594080 593528 594001 595141 596912 599746 604163 610265 617647 625886 635154 646321
63550 646321 660175 676562 694580 713813 735117 759926 788937 821729 857540 896098 937774
63539 937774 983345 1033616 1088663 1146724 1203694 1254051 1292829 1317235 1327079 1324248 1311904 1293648
$$ packed form
63629E34994J0251R056P426N114K578P38r8o68j710k957l689l828l711l174j732
63614E48590M51K600M401O226Q248J0169J1956J3980J6115J7545J8017J8515K0009
63601F96822K2079K3544K4100K4419K4809K4561K2902J9935J6309J2319P847L055
63589I22701j246m178n621o317p108q230r397j0297j0881j1389j2386j4463j7445
63576H03743k0117k1259k0998k0483k0221j9481j7643j5304j3448j2044j0266
63565F12479p827n341l374j857n52M73J140J771K834M417O102P382Q239R268J1167
63550F46321J3854J6387J8018J9233K1304K4809K9011L2792L5811L8558M1676
63539I37774M5571N0271N5047N8061N6970N0357L8778K4406R844k831j2344j8256
$$ plain form
63527 1293648 1272692 1251345 1231041 1212638 1196423 1181839 1167647 1152709 1136547 1118980 1099435
63516 1099435 1076996 1051216 1022640 992522 962296 933339 906751 882997 861805 842614 825005
63505 825005 808577 792674 776712 760724 745217 730290 715192 699022 681783 664469 648055
63494 648055 632551 617184 601412 585556 570400 556426 543732 532612 523709 517303 512698 508785
63482 508785 505258 502942 502791 504839 508311 512466 516993 521792 526858 532524 539397 547747 557070 566556
63468 566556 575966 585778 596450 607778 619106 629933 640096 649489 657953 665511 672530 679494 686625
63455 686625 693675 699942 704548 707002 707631 707231 706103 703614 698931 692046 683834 675383 667707 662004 659511
63440 659511 660734 665165 672060 681217 692735 706451 722184 740321 761570 786096 813531 844018
$$ packed form
63527A293648k0956k1347k0304j8403j6215j4584j4192j4938j6162j7567j9545
63516A099435k2439k5780k8576l0118l0226k8957k6588k3754k1192j9191j7609
63505H25005j6428j5903j5962j5988j5507j4927j5098j6170j7239j7314j6414
63494F48055j5504j5367j5772j5856j5156j3974j2694j1120q903o406m605l913
63482E08785l527k316j51K048L472M155M527M799N066N666O873Q350R323R486
63468E66556R410R812J0672J1328J1328J0827J0163R393Q464P558P019O964P131
63455F86625P050O267M606K454O29m00j128k489m683o885q212q451p676n703k493
63440F59511J223M431O895R157J1518J3716J5733J8137K1249K4526K7435L0487
$$ plain form
63428 844018 878738 919000 964944 1015081 1066459 1114809 1155066 1182817 1195873 1194639 1181334 1159208
63416 1159208 1132159 1104203 1078651 1057733 1042899 1035071 1034405 1040089 1050743 1065043 1081946 1100508
63404 1100508 1119657 1138082 1154243 1166649 1174319 1176983 1174869 1168509 1158843 1147147 1134506 1121330
63392 1121330 1107532 1093004 1077579 1060558 1040757 1017332 990457 961011 929764 897203 864136
63381 864136 832054 802436 775628 750785 727111 704990 685517 669093 655018 642639 632386
63370 632386 625194 621239 619799 620287 622842 627802 635155 644830 657030 671874 688985 707957 729182
63357 729182 753727 782334 814807 850422 888534 928669 970368 1013260 1057123 1101632 1146157
63346 1146157 1189898 1232025 1271392 1306336 1335265 1357590 1373872 1384954 1391223 1392814 1390307 1384906
$$ packed form
63428H44018L4720M0262M5944N0137N1378M8350M0257K7751J3056j234j3305k2126
63416A159208k7049k7956k5552k0918j4834p828o66N684J0654J4300J6903J8562
63404A100508J9149J8425J6161J2406P670K664k114o360r666j1696j2641j3176
63392A121330j3798j4528j5425j7021j9801k3425k6875k9446l1247l2561l3067
63381H64136l2082k9618k6808k4843k3674k2121j9473j6424j4075j2379j0253
63370F32386p192l955j440M88K555M960P353R675J2200J4844J7111J8972K1225
63357G29182K4545K8607L2473L5615L8112M0135M1699M2892M3863M4509M4525
63346A146157M3741M2127L9367L4944K8929K2325J6282J1082O269J591k507n401
$$ plain form
63334 1384906 1377963 1370421 1362546 1353963 1343833 1331114 1314786 1294045 1268541 1238529 1204713 1167911
63322 1167911 1129033 1089423 1050918 1015281 983627 956480 934171 916909 904710 897599 895614 897831
63310 897831 901097 900336 890887 870852 841326 804904 764425 722783 682927 647199 616593 590744
63298 590744 568630 549245 531928 516488 503133 492079 483060 475319 468120 461161 454410 447769 441182
63285 441182 434952 429604 425324 421811 418712 415890 413117 409987 406531 403591 402002 401541 401251 400782 400806
63270 400806 401916 403728 405467 406997 408790 411113 413694 416053 417791 418745 419218 419997 421700 424134 426652
63255 426652 429103 432004 435748 440153 444994 450526 457085 464379 471598 478165 484141 489829 495258 500132
63241 500132 504208 507645 510986 514769 519089 523577 527818 531781 535843 540481 545941 552046 558216 563800
$$ packed form
63334A384906o943p542p875q583j0130j2719j6328k0741k5504l0012l3816l6802
63322A167911l8878l9610l8505l5637l1654k7147k2309j7262j2199p111j985K217
63310H97831L266p61r449k0035k9526l6422m0479m1642l9856l5728l0606k5849
63298E90744k2114j9385j7317j5440j3355j1054r019p741p199o959o751o641o587
63285D41182o230n348m280l513l099k822k773l130l456k940j589m61k90m69K4
63270D00806J110J812J739J530J793K323K581K359J738R54M73P79J703K434K518
63255D26652K451K901L744M405M841N532O559P294P219O567N976N688N429M874
63241E00132M076L437L341L783M320M488M241L963M062M638N460O105O170N584
$$ plain form
63227 563800 568605 573163 578354 584719 592146 600173 608476 617091 626303 636383 647411 659285 671880
63214 671880 685061 698449 711299 722918 733289 743006 752375 760839 767539 772236 775265 776646 775780
63201 775780 772189 766137 758256 748947 738518 727551 716629 705841 695147 685230 677442 672704 670856
63188 670856 671226 673496 677801 684319 693117 704194 717435 732645 749805 769093 790511 813750 838616
63175 838616 865265 893555 922370 950009 975214 997459 1016371 1031464 1042650 1050583 1056178 1059927
63163 1059927 1061845 1061859 1059958 1056003 1049594 1040224 1027524 1011404 991997 969494 943988 915541 884340
63150 884340 850869 816001 780993 747198 715515 686101 658696 633169 609658 588358 569450
63139 569450 553159 539481 527797 517128 506998 497853 490387 484627 479903 475587 471545 467902 464639
$$ packed form
63227E63800M805M558N191O365P427Q027Q303Q615R212J0080J1028J1874J2595
63214F71880J3181J3388J2850J1619J0371R717R369Q464O700M697L029J381q66
63201G75780l591o052p881r309j0429j0967j0922j0788j0694r917p788m738j848
63188F70856L70K270M305O518Q798J1077J3241J5210J7160J9288K1418K3239K4866
63175H38616K6649K8290K8815K7639K5205K2245J8912J5093J1186P933N595L749
63163A059927J918J4j901l955o409r370j2700j6120j9407k2503k5506k8447l1201
63150H84340l3471l4868l5008l3795l1683k9414k7405k5527k3511k1300j8908
63139E69450j6291j3678j1684j0669j0130r145p466n760m724m316m042l643l263
$$ plain form
63126 464639 461598 458764 456346 454535 453171 451723 449653 446905 443998 441588 439945 438853 437963 437131 436429
63111 436429 435954 435715 435727 436116 437030 438442 440075 441690 443508 446214 450404 455991 462309 468891 475982 484145
63095 484145 493556 503965 515334 528123 542777 559235 577190 596519 617078 638175 658666 677493
63083 677493 693700 705893 712221 711273 702913 688205 668816 646651 623671 601631 581857 565153
63071 565153 551694 540995 532364 525551 520749 517967 516853 517233 519290 522953 527676 533149 539695 547499
63057 547499 555987 564617 573801 584322 596244 609295 624032 641494 661668 683302 705453 728320
63045 728320 752248 776879 801816 827376 854015 881507 909284 937159 965224 993367 1021403
63034 1021403 1049332 1077030 1104026 1130061 1155552 1181020 1206400 1231305 1255491 1278338 1298256
$$ packed form
63126D64639l041k834k418j811j364j448k070k748k907k410j643j092q90q32p02
63111D36429m75k39J2L89R14J412J633J615J818K706M190N587O318O582P091Q163
63095D84145R411J0409J1369J2789J4654J6458J7955J9329K0559K1097K0491J8827
63083F77493J6207J2193O328r48q360j4708j9389k2165k2980k2040j9774j6704
63071E65153j3459j0699q631o813m802k782j114L80K057L663M723N473O546P804
63057E47499Q488Q630R184J0521J1922J3051J4737J7462K0174K1634K2151K2867
63045G28320K3928K4631K4937K5560K6639K7492K7777K7875K8065K8143K8036
63034A021403K7929K7698K6996K6035K5491K5468K5380K4905K4186K2847J9918
$$ plain form
63023 1298256 1313497 1323477 1328628 1329033 1324113 1313772 1298959 1280704 1259294 1234948 1208849 1182859
63011 1182859 1158386 1136005 1116088 1099397 1086944 1079526 1077506 1080899 1089578 1103376 1122035 1145194
62999 1145194 1172557 1204114 1239944 1279613 1321765 1364360 1405435 1443742 1478805 1510474 1538519
62988 1538519 1562809 1583881 1603022 1621506 1639707 1657052 1672715 1686184 1697264 1705793 1711368 1713116
62976 1713116 1709669 1699601 1682031 1656857 1624499 1585596 1540888 1491247 1437749 1381775 1324884
62965 1324884 1268372 1212925 1158810 1106333 1055909 1007885 962632 920808 883156 849872 820357
62954 820357 793696 769215 746600 725775 706799 689653 673960 658996 644176 629461 615314
62943 615314 602343 590942 581016 572027 563487 555413 548031 541052 533718 525786 518028 511374 505856 500848
$$ packed form
63023A298256J5241R980N151M05m920j0341j4813j8255k1410k4346k6099k5990
63011A182859k4473k2381j9917j6691j2453p418k020L393Q679J3798J8659K3159
62999A145194K7363L1557L5830L9669M2152M2595M1075L8307L5063L1669K8045
62988A538519K4290K1072J9141J8484J8201J7345J5663J3469J1080Q529N575J748
62976A713116l447j0068j7570k5174l2358l8903m4708m9641n3498n5974n6891
62965A324884n6512n5447n4115n2477n0424m8024m5253m1824l7652l3284k9515
62954H20357k6661k4481k2615k0825j8976j7146j5693j4964j4820j4715j4147
62943F15314j2971j1401r926q989q540q074p382o979p334p932p758o654n518n008
$$ plain form
62929 500848 496112 492089 489103 486822 484706 482680 481119 480303 480110 480204 480440 481014 482139 483612 484907 485910
62913 485910 487350 490214 494861 501010 508368 516711 525423 533704 541548 549791 558723 567148 573467 577218
62899 577218 578825 578207 574760 568782 561878 555508 549912 544904 540894 538380 536963 535724 534320 532998
62885 532998 531716 530066 527999 525869 523713 521221 518574 516595 515788 515816 516188 516890 517975 519110 520038 521027
62869 521027 522339 523535 523784 522684 520329 516872 512501 507694 502962 498403 493928 489822 486591 484283
62855 484283 482404 480556 478785 477288 476180 475647 475945 477007 478280 479138 479449 479688 480525 482226 484387 486440
62839 486440 488438 490995 494231 497256 499197 500374 501850 503975 506142 507918 509695 512001 514843 517970
62825 517970 521273 524656 528004 531557 535835 540910 546224 551422 556840 562757 568640 573674 577596 580454
$$ packed form
62929E00848m736m023k986k281k116k026j561q16j93R4K36N74J125J473J295J003
62913D85910J440K864M647O149P358Q343Q712Q281P844Q243Q932Q425O319L751
62899E77218J607o18l447n978o904o370n596n008m010k514j417j239j404j322
62885E32998j282j650k067k130k156k492k647j979q07K8L72P02J085J135R28R89
62869E21027J312J196K49j100k355l457m371m807m732m559m475m106l231k308
62855D84283j879j848j771j497j108n33K98J062J273Q58L11K39Q37J701K161K053
62839D86440J998K557L236L025J941J177J476K125K167J776J777K306K842L127
62825E17970L303L383L348L553M278N075N314N198N418N917N883N034L922K858
$$ plain form
62811 580454 581895 581461 579428 576655 573540 569783 565353 561117 558149 556766 556520 556970 558124 560185 563093
62796 563093 566485 570078 574007 578646 584204 590690 598269 607190 617168 627305 637132 647500 659849
62783 659849 674708 691501 709808 730135 753152 778814 806737 837008 870028 905688 943334
62772 943334 982589 1023682 1066732 1111025 1155257 1198275 1239360 1277980 1313614 1345719 1373532
62761 1373532 1395849 1411352 1419423 1420473 1415336 1404508 1388167 1366665 1340534 1309994 1274879 1235340
62749 1235340 1192495 1148164 1103914 1060404 1017602 975607 935211 897523 863022 831227 801514
62738 801514 773991 749216 727282 707779 690587 676070 664352 654957 647392 641492 636822 632390
62726 632390 627520 622631 618588 615627 613484 612179 611932 612513 613473 614998 617755 621845 626635 631812 637913
$$ packed form
62811E80454J441m34k033k773l115l757m430m236k968j383k46M50J154K061K908
62796E63093L392L593L929M639N558O486P579Q921R978J0137R827J0368J2349
62783F59849J4859J6793J8307K0327K3017K5662K7923L0271L3020L5660L7646
62772I43334L9255M1093M3050M4293M4232M3018M1085L8620L5634L2105K7813
62761A373532K2317J5503Q071J050n137j0828j6341k1502k6131l0540l5115l9539
62749A235340m2845m4331m4250m3510m2802m1995m0396l7688l4501l1795k9713
62738H01514k7523k4775k1934j9503j7192j4517j1718r395p565n900m670m432
62726F32390m870m889m043k961k143j305k47N81R60J525K757M090M790N177O101
$$ plain form
62711 637913 645527 654596 664858 676409 689453 703939 719990 738291 759563 783756 810205 838490
62699 838490 868919 902319 939578 981147 1026702 1075372 1126577 1180437 1237202 1296521 1357534
62688 1357534 1419381 1481229 1541990 1600485 1655830 1707218 1753298 1792184 1822206 1842488 1852738
62677 1852738 1852739 1842161 1820777 1788835 1747284 1697619 1641411 1580041 1514934 1447851 1380726 1315294
62665 1315294 1252893 1194329 1139604 1087980 1038763 992112 948913 909880 875000 843669 815105
62654 815105 788709 764372 742409 722960 705554 689581 674997 662077 650571 639738 629354
62643 629354 620002 612107 605157 598312 591385 584756 578639 572936 567709 563287 559909 557623 556508 556625
62629 556625 557630 558757 559359 559313 558782 557767 556095 553806 551334 549181 547446 545783 543861 541797 540050
$$ packed form
62711F37913P614R069J0262J1551J3044J4486J6051J8301K1272K4193K6449K8285
62699H38490L0429L3400L7259M1569M5555M8670N1205N3860N6765N9319O1013
62688A357534O1847O1848O0761N8495N5345N1388M6080L8886L0022K0282J0250
62677A852738Jj0578k1384l1942m1551m9665n6208o1370o5107o7083o7125o5432
62665A315294o2401n8564n4725n1624m9217m6651m3199l9033l4880l1331k8564
62654H15105k6396k4337k1963j9449j7406j5973j4584j2920j1506j0833j0384
62643F29354r352p895o950o845o927o629o117n703n227m422l378k286j115J17
62629E56625J005J127O02m6n31j015j672k289k472k153j735j663j922k064j747
$$ plain form
62614 540050 539005 538755 539132 539747 540129 540138 540264 541195 543072 545454 548033 550948 554284 557773 561306 565367
62598 565367 570492 576582 583196 590367 598621 608289 619263 631432 644929 659818 675853 692668 709995
62585 709995 727650 745526 763632 781893 799918 817150 833162 847498 859270 867333 871026 870498
62573 870498 866228 858522 847620 833966 818128 800563 781597 761580 740978 720390 700360 681056
62561 681056 662289 644125 627292 612539 599654 587642 575929 564891 555095 546643 539516 533896
62549 533896 529679 526208 523050 520642 519535 519286 518773 517479 515836 514400 513378 512977 513515 514946 516844
62534 516844 519126 522290 526590 531376 535606 538864 541578 544440 547847 551721 555635 559220 562690 566927
62520 566927 572882 580988 591201 603424 617710 634193 653026 674282 697775 723135 750250 779497
$$ packed form
62614E40050j045k50L77O15L82RJ26R31J877K382K579K915L336L489L533M061
62598E65367N125O090O614P171Q254R668J0974J2169J3497J4889J6035J6815J7327
62585G09995J7655J7876J8106J8261J8025J7232J6012J4336J1772Q063L693n28
62573H70498m270p706j0902j3654j5838j7565j8966k0017k0602k0588k0030j9304
62561F81056j8767j8164j6833j4753j2885j2012j1713j1038r796q452p127n620
62549E33896m217l471l158k408j107k49n13j294j643j436j022m01N38J431J898
62534E16844K282L164M300M786M230L258K714K862L407L874L914L585L470M237
62520E66927N955Q106J0213J2223J4286J6483J8833K1256K3493K5360K7115K9247
$$ plain form
62508 779497 811263 845236 880402 915803 951099 986321 1021175 1054761 1086003 1114329 1139771
62497 1139771 1162265 1180872 1193995 1200510 1200542 1195057 1184941 1170806 1153476 1134185 1114167 1094338
62485 1094338 1075499 1058522 1044045 1032118 1022412 1014716 1009097 1005668 1004417 1005125 1007128 1009146 1009716
62472 1009716 1008056 1004344 998979 991744 981895 968961 953122 934794 914100 890899 865166 837283
62460 837283 808088 778729 750259 723156 697224 672163 648212 626177 606781 590124 575779
62449 575779 563307 552570 543625 536498 531139 527429 525033 523296 521542 519623 517993 517081 516716 516362
62435 516362 515729 514924 514137 513570 513620 514632 516309 517741 518250 517965 517334 516384 514795 512462 509647 506646 503611
62418 503611 500664 497890 495268 492835 490872 489781 489751 490631 491978 493095 493262 492216 490356 488263 486207
$$ packed form
62508G79497L1766L3973L5166L5401L5296L5222L4854L3586L1242K8326K5442
62497A139771K2494J8607J3123O515L2n485j0116j4135j7330j9291k0018j9829
62485A094338j8839j6977j4477j1927r706p696n619l429j251P08K003K018N70
62472A009716j660l712n365p235r849j2934j5839j8328k0694k3201k5733k7883
62460H37283k9195k9359k8470k7103k5932k5061k3951k2035j9396j6657j4345
62449E75779j2472j0737q945p127n359l710k396j737j754j919j630r12l65l54
62435E16362o33q05p87n67N0J012J677J432N09k85o31r50j589k333k815l001l035
62418E03611k947k774k622k433j963j091l0Q80J347J117J67j046j860k093k056
$$ plain form
62403 486207 484321 482945 482338 482168 481787 481084 480692 481359 483367 486532 490381 494311 497978 501588 505533 509820
62387 509820 514281 519209 525104 531671 537754 542603 546675 550815 555175 559454 563779 568651 574156 579821
62373 579821 585239 590479 595833 601525 607736 614682 622594 631654 641788 652484 663231 674503 687898
62360 687898 704711 724491 745647 767489 791053 817722 847717 880389 915550 953774 995355
62349 995355 1039533 1084985 1130855 1176927 1222893 1267691 1309700 1347391 1379662 1405689 1424801
62338 1424801 1436579 1440940 1438117 1428768 1414050 1395160 1372455 1345314 1313206 1276784 1237614 1196971
62326 1196971 1155322 1112965 1070692 1029646 990828 954957 922433 893056 865921 840017 815018
62315 815018 791299 769237 748829 730080 713338 698867 686217 674451 662983 651915 641596
$$ packed form
62403D86207j886j376o07j70l81p03l92O67K008L165L849L930L667L610L945M287
62387E09820M461M928N895O567O083M849M072M140M360M279M325M872N505N665
62373E79821N418N240N354N692O211O946P912R060J0134J0696J0747J1272J3395
62360F87898J6813J9780K1156K1842K3564K6669K9995L2672L5161L8224M1581
62349I95355M4178M5452M5870M6072M5966M4798M2009L7691L2271K6027J9112
62338A424801J1778M361k823r349j4718j8890k2705k7141l2108l6422l9170m0643
62326A196971m1649m2357m2273m1046l8818l5871l2524k9377k7135k5904k4999
62315H15018k3719k2062k0408j8749j6742j4471j2650j1766j1468j1068j0319
$$ plain form
62304 641596 632334 624624 619036 615415 612610 609558 606388 603857 602023 600250 598465 597443 597596 598333 599042
62289 599042 599911 601214 602491 603327 604405 606818 610487 614165 617064 619705 622990 627052 631221 634601 636555
62274 636555 637075 636886 636693 636274 634794 632183 629568 628044 627557 627526 628084 630155 634539 641494 651115 663521
62258 663521 678656 696298 716414 739268 765140 794279 827118 864119 905150 949293 995504
62247 995504 1043329 1092651 1142814 1192280 1239179 1281870 1318894 1348794 1370488 1383820 1389421 1387974
62235 1387974 1379906 1365775 1346409 1322274 1293043 1258304 1218681 1175912 1131833 1087635 1044039
62224 1044039 1001745 961459 923775 889259 858462 831604 808308 787832 769522 753011 738076
62213 738076 724463 711887 700104 688920 678141 667649 657626 648577 640833 633998 627225 620265
$$ packed form
62304F41596r262p710n588l621k805l052l170k531j834j773j785j022J53P37P09
62289E99042Q69J303J277Q36J078K413L669L678K899K641L285M062M169L380J954
62274F36555N20j89j93m19j480k611k615j524m87l1N58K071M384O955R621J2406
62258F63521J5135J7642K0116K2854K5872K9139L2839L7001M1031M4143M6211
62247I95504M7825M9322N0163M9466M6899M2691L7024K9900K1694J3332N601j447
62235A387974q068j4131j9366k4135k9231l4739l9623m2769m4079m4198m3596
62224A044039m2294m0286l7684l4516l0797k6858k3296k0476j8310j6511j4935
62213G38076j3613j2576j1783j1184j0779j0492j0023r049p744o835o773o960
$$ plain form
62201 620265 613851 608710 604513 600361 596125 592660 590638 589815 589691 590322 592042 594790 598177 602041 606515
62186 606515 611673 617537 624423 632856 642950 654041 665092 675408 684885 693655 701678 708777 715000
62173 715000 720686 726037 730766 734408 736958 739048 741652 745840 752643 762666 775728 791249 809142
62160 809142 830068 854614 882520 912927 945129 978790 1013518 1048428 1082098 1112843 1139167
62149 1139167 1160118 1175349 1184968 1189481 1189611 1185746 1177515 1164322 1146400 1124962 1101252 1075904
62137 1075904 1049374 1022477 996122 970928 947517 926927 910320 898457 891649 889875 892573 898736
62125 898736 907742 919867 935547 954378 975358 997808 1021488 1046032 1070982 1096259 1121812 1146766
62113 1146766 1169694 1189955 1208127 1224861 1239891 1252444 1261977 1268092 1270378 1269003 1265209 1260685
$$ packed form
62201F20265o414n141m197m152m236l465k022q23j24O31J720K748L387L864M474
62186F06515N158N864O886Q433J0094J1091J1051J0316R477Q770Q023P099O223
62173G15000N686N351M729L642K550K090K604M188O803J0023J3062J5521J7893
62160H09142K0926K4546K7906L0407L2202L3661L4728L4910L3670L0745K6324
62149A139167K0951J5231R619M513J30l865q231j3193j7922k1438k3710k5348
62137A075904k6530k6897k6355k5194k3411k0590j6607j1863o808j774K698O163
62125H98736R006J2125J5680J8831K0980K2450K3680K4544K4950K5277K5553K4954
62113A146766K2928K0261J8172J6734J5030J2553R533O115K286j375l794m524
$$ plain form
62101 1260685 1256627 1253801 1253190 1255953 1262724 1273349 1287247 1303674 1321767 1340940 1361350 1383634
62089 1383634 1408027 1433990 1460779 1488100 1516139 1545333 1576267 1609446 1644846 1681892 1720236
62078 1720236 1760460 1803663 1850314 1899765 1950918 2002983 2055326 2106819 2155811 2200869 2241267
62067 2241267 2276606 2306178 2328966 2344261 2352077 2353079 2348462 2340030 2330072 2320793 2313806 2310273 2311431
62054 2311431 2318738 2333382 2355672 2384832 2419195 2456631 2495001 2532415 2567122 2597249 2620860
62043 2620860 2636348 2642617 2638735 2623609 2596275 2556525 2505013 2442752 2370792 2290514 2203909 2113235
62031 2113235 2020421 1927090 1835001 1746021 1661417 1581379 1505518 1433757 1366577 1304415 1247143
62020 1247143 1194275 1145520 1100872 1060142 1022653 987610 954646 923778 894890 867634 841950
$$ packed form
62101A260685m058k826o11K763O771J0625J3898J6427J8093J9173K0410K2284
62089A383634K4393K5963K6789K7321K8039K9194L0934L3179L5400L7046L8344
62078A720236M0224M3203M6651M9451N1153N2065N2343N1493M8992M5058M0398
62067B241267L5339K9572K2788J5295P816J002m617q432r958r279o987l533J158
62054B311431P307J4644K2290K9160L4363L7436L8370L7414L4707L0127K3611
62043B620860J5488O269l882j5126k7334l9750n1512o2261p1960q0278q6605r0674
62031B113235r2814r3331r2089q8980q4604q0038p5861p1761o7180o2162n7272
62020A247143n2868m8755m4648m0730l7489l5043l2964l0868k8888k7256k5684
$$ plain form
62009 841950 818321 797247 778641 762089 747492 735095 725010 717161 711614 708408 707024 706609 706962
61996 706962 708805 712654 717841 723035 727373 730578 732285 731914 729208 724430 717964 710047 700900 690722
61982 690722 679569 667553 655158 642998 631257 619783 608738 598694 589936 582143 574973 568538
61970 568538 563016 558175 553694 549714 546636 544492 542870 541406 540055 538922 538162 538015 538628 539692 540516
61955 540516 540644 540416 540831 542834 546665 551757 557276 562861 568911 576152 584979 595201 606359 618265
61941 618265 631331 646443 664367 685126 707966 732030 757030 783228 810874 839785 869367
61930 869367 898850 927560 955118 981422 1006309 1029276 1049655 1067051 1081491 1093160 1102171 1108597
61918 1108597 1112503 1113818 1112297 1107789 1100512 1091068 1080333 1069448 1059699 1052117 1047125 1044825 1045628 1050345
$$ packed form
62009H41950k3629k1074j8606j6552j4597j2397j0085p849n547l206j384m15L53
61996G06962J843L849N187N194M338L205J707l71k706m778o466p917r147j0178
61982F90722j1153j2016j2395j2160j1741j1474j1045j0044q758p793p170o435
61970E68538n522m841m481l980l078k144j622j464j351j133p60j47O13J064Q24
61955E40516J28k28M15K003L831N092N519N585O050P241Q827J0222J1158J1906
61941F18265J3066J5112J7924K0759K2840K4064K5000K6198K7646K8911K9582
61930H69367K9483K8710K7558K6304K4887K2967K0379J7396J4440J1669R011O426
61918A108597L906J315j521m508p277r444j0735j0885r749p582m992k300Q03M717
$$ plain form
61904 1050345 1059440 1072366 1087923 1105231 1124043 1144050 1164172 1182762 1198366 1210039 1217041 1218636
61892 1218636 1214412 1204697 1190484 1172772 1151937 1127738 1100063 1069707 1038331 1007534 978063 949987
61880 949987 923385 898577 875768 854865 835641 817819 800951 784599 768837 754277 741435
61869 741435 730339 720939 713542 708367 704871 701990 699236 697327 697668 701274 708071 717067 727279 738649
61855 738649 752003 767979 786269 806271 828280 853485 882746 915829 951989 990841 1032363
61844 1032363 1076348 1122128 1168730 1215062 1260127 1303201 1343705 1380789 1413223 1439828 1459860
61833 1459860 1472896 1478717 1477617 1470648 1459312 1445160 1429841 1415258 1403175 1394730 1390510 1390990 1396547
61820 1396547 1407153 1422301 1441252 1463056 1486389 1509574 1530638 1547246 1556998 1558370 1551322 1536501
$$ packed form
61904A050345R095J2926J5557J7308J8812K0007K0122J8590J5604J1673P002J595
61892A218636m224r715j4213j7712k0835k4199k7675l0356l1376l0797k9471k8076
61880I49987k6602k4808k2809k0903j9224j7822j6868j6352j5762j4560j2842
61869G41435j1096r400p397n175l496k881k754j909L41L606O797Q996J0212J1370
61855G38649J3354J5976J8290K0002K2009K5205K9261L3083L6160L8852M1522
61844A032363M3985M5780M6602M6332M5065M3074M0504L7084L2434K6605K0032
61833A459860J3036N821j100o969j1336j4152j5319j4583j2083q445m220M80N557
61820A396547J0606J5148J8951K1804K3333K3185K1064J6608R752J372p048j4821
$$ plain form
61808 1536501 1513952 1483230 1444817 1400780 1353756 1305700 1257765 1210791 1165436 1122151 1081417
61797 1081417 1043774 1009393 977887 948804 921976 897148 873645 850885 828939 808259 789100
61786 789100 771617 756178 743007 731685 721528 712378 704489 697684 691198 684392 677167 669652 661981
61773 661981 654452 647427 640919 634654 628661 623284 618440 613329 607249 600409 593665 587678 582614 578355
61759 578355 574686 571351 568200 565280 562701 560521 558836 557777 557265 556991 556815 557032 558034 559803 561885
61744 561885 563803 565371 566708 568076 569709 571712 574148 577153 580811 584972 589333 593781 598531 603987
61730 603987 610629 618864 628670 639407 650326 661327 672934 685552 699120 713506 728717 744487
61718 744487 760027 774478 787451 798999 809354 818726 827017 833648 838071 840549 841888 842214 840601
$$ packed form
61808A536501k2549l0722l8413m4037m7024m8056m7935m6974m5355m3285m0734
61797A081417l7643l4381l1506k9083k6828k4828k3503k2760k1946k0680j9159
61786G89100j7483j5439j3171j1322j0157r150p889o805o486o806p225p515p671
61773F61981p529p025o508o265n993n377m844n111o080o840o744n987n064m259
61759E78355l669l335l151k920k579k180j685j059n12k74j76K17J002J769K082
61744E61885J918J568J337J368J633K003K436L005L658M161M361M448M750N456
61730F03987O642Q235R806J0737J0919J1001J1607J2618J3568J4386J5211J5770
61718G44487J5540J4451J2973J1548J0355R372Q291O631M423K478J339L26j613
$$ plain form
61705 840601 836272 829640 821662 812682 802530 791400 779909 768443 757011 745745 735068 725350
61693 725350 716797 709608 703978 699968 697585 696736 696822 696769 695926 694712 693931 693776 693993 694634 695884 697360 698422
61676 698422 699171 700299 701852 702987 703244 703367 704376 706302 708209 709144 708741 707238 705185 702986 700548
61661 700548 697534 693929 690020 685875 681369 676780 672762 669467 666174 662078 657105 651783 646766 642723
61647 642723 640178 639004 638407 637734 637030 636568 636258 635878 635503 635275 635049 634662 634256 633932 633381 632308 630951
61630 630951 629655 628101 625507 621574 616766 611706 606730 601988 597499 593050 588465 584112 580795 578962
61616 578962 578212 577717 576989 576248 576192 577344 579393 581172 581529 580154 577405 573569 568793 563626 558895 554772
61600 554772 550454 545265 539756 535254 532461 530984 530270 530487 532113 534924 537777 539569 540306 541184 543623
$$ packed form
61705H40601m329o632p978q980j0152j1130j1491j1466j1432j1266j0677r718
61693G25350q553p189n630m010k383q49Q6n3q43j214p81j55K17O41J250J476J062
61676F98422P49J128J553J135K57J23J009J926J907R35m03j503k053k199k438
61661G00548l014l605l909m145m506m589m018l295l293m096m973n322n017m043
61647F42723k545j174n97o73p04m62l10l80l75k28k26l87m06l24n51j073j357
61630F30951j296j554k594l933m808n060m976m742m489m449m585m353l317j833
61616E78962p50m95p28p41n6J152K049J779L57j375k749l836m776n167m731m123
61600E54772m318n189n509m502k793j477p14K17J626K811K853J792P37Q78K439
$$ plain form
61585 543623 548204 554385 561058 567366 573110 578568 583946 588917 592703 594681 594985 594390 593514 592163 589686
61570 589686 585961 581772 577986 574510 570333 564559 557181 548860 540280 531793 523320 514433 504796 494822
61556 494822 485666 478283 472639 468044 463983 460254 456561 452577 448407 444487 440969 437650 434571 432174
61542 432174 430626 429401 427811 425590 422795 419564 416445 414601 415013 417402 420342 422550 423788 424430 424608
61527 424608 424155 423220 422395 422004 421541 420165 417680 414684 411752 408922 406144 403732 401942 400380 398344
61512 398344 395672 392884 390510 388662 387186 385910 384784 384011 383826 383884 383211 381284 378832 376922 375585
61497 375585 374188 372884 372526 373045 373147 371994 370182 368518 366883 365062 363735 363621 364207 364333 363649 362675
61481 362675 361836 361323 361584 362930 364729 365914 366308 366676 367474 368316 368768 368968 369294 370034 371482 373803 376642
$$ packed form
61585E43623M581O181O673O308N744N458N378M971L786J978L04n95q76j351k477
61570E89686l725m189l786l476m177n774p378q321q580q487q473q887r637r974
61556D94822r156p383n644m595m061l729l693l984m170l920l518l319l079k397
61542D32174j548j225j590k221k795l231l119j844M12K389K940K208J238O42J78
61527D24608m53r35q25l91m63j376k485k996k932k830k778k412j790j562k036
61512C98344k672k788k374j848j476j276j126p73j85N8o73j927k452j910j337
61497C75585j397j304l58N19J02j153j812j664j635j821j327j14N86J26o84r74
61481C62675q39n13K61J346J799J185L94L68P98Q42M52K00L26P40J448K321K839
$$ plain form
61464 376642 379356 381694 383708 385047 385017 383612 381895 381081 381576 383002 384613 385573 385414 384594 384197 384825
61448 384825 386107 387493 388985 390741 392428 393495 393891 394126 394770 396175 398485 401518 404708 407454 409612
61433 409612 411551 413797 416725 420386 424405 428115 431009 433139 434985 436941 438978 440843 442525 444370
61419 444370 446658 449163 451368 453157 455000 457331 460138 463356 467259 471908 476463 479649 480963 480935 480210
61404 480210 478833 476510 473099 468659 463367 457566 451626 445682 439790 434368 429991 426591 423328 419580
61390 419580 415766 412789 410830 409091 406777 404112 402183 401753 402377 402872 402684 402392 402673 403180 402985 401946
61374 401946 401030 401251 402746 404885 406790 407688 407349 406409 405854 406098 406853 407832 409033 410360 411741 413711
61358 413711 417050 421477 425550 428449 431067 434621 438880 442821 446593 451626 458725 467059 475384 483463
$$ packed form
61464C76642K714K338K014J339l0j405j717q14M95J426J611R60j59q20l97O28
61448C84825J282J386J492J756J687J067L96K35O44J405K310L033L190K746K158
61433D09612J939K246K928L661M019L710K894K130J846J956K037J865J682J845
61419D44370K288K505K205J789J843K331K807L218L903M649M555L186J314k8p25
61404D80210j377k323l411m440n292n801n940n944n892n422m377l400l263l748
61390D19580l814k977j959j739k314k665j929m30O24M95j88k92K81N07j95j039
61374D01946r16K21J495K139J905Q98l39r40n55K44P55R79J201J327J381J970
61358D13711L339M427M073K899K618L554M259L941L772N033P099Q334Q325Q079
$$ plain form
61344 483463 491875 501009 510861 521476 532973 545193 557752 570509 583647 597108 610151 621743
61332 621743 631381 639233 645388 649316 650437 649019 645994 641915 636638 630183 623311 616794 610523 603912
61318 603912 596980 590507 585126 580767 577059 573866 571183 568851 566690 564824 563630 563285 563484 563707 563767
61303 563767 564021 564978 566794 569248 572086 575183 578454 581915 585829 590456 595548 600420 604684 608549 612106
61288 612106 614597 614857 612440 608054 602879 597705 592740 588010 583739 580289 577741 575736 573970 572774
61274 572774 572846 574350 576624 578974 581415 584390 588062 592228 596713 601481 606467 611662 617292 623628 630570
61259 630570 637728 644917 652422 660722 670102 680481 691554 703156 715585 729426 744887 761442
61247 761442 778269 794788 810438 824077 834089 839320 839793 836384 829930 820756 808991 795129 780130
$$ packed form
61344D83463Q412R134R852J0615J1497J2220J2559J2757J3138J3461J3043J1592
61332F21743R638P852O155L928J121j418l025m079n277o455o872o517o271o611
61318F03912o932o473n381m359l708l193k683k332k161j866j194l45J99K23O0
61303E63767K54R57J816K454K838L097L271L461L914M627N092M872M264L865L557
61288F12106K491K60k417m386n175n174m965m730m271l450k548k005j766j196
61274E72774P2J504K274K350K441K975L672M166M485M768M986N195N630O336O942
61259F30570P158P189P505Q300R380J0379J1073J1602J2429J3841J5461J6555
61247G61442J6827J6519J5650J3639J0012N231M73l409o454r174j1765j3862j4999
$$ plain form
61234 780130 764927 750058 735906 723036 711930 702417 693859 685962 679065 673490 669053 665487 662934
61221 662934 661702 661833 663224 665899 669810 674650 680229 686715 694054 701386 707577 712231 715752 718540
61207 718540 720691 722454 724360 726710 729319 731952 734739 738101 742548 748564 756380 765796 776588 789077
61193 789077 803945 821408 841001 862344 885720 911645 940216 971111 1003919 1038128 1073037
61182 1073037 1108018 1142698 1176594 1208719 1238020 1264107 1287215 1307449 1324543 1338536 1350257
61171 1350257 1360650 1369733 1376539 1380033 1379698 1375287 1366558 1353599 1337077 1317700 1295601 1270632 1243081
61158 1243081 1213602 1182492 1149615 1115188 1080134 1045433 1011574 978932 948196 919995 894352
61147 894352 870947 849695 830734 814072 799704 787868 778757 772034 767066 763550 761524 760867 761157
$$ packed form
61234G80130j5203j4869j4152j2870j1106r513q558p897o897n575m437l566k553
61221F62934j232J31J391K675L911M840N579O486P339P332O191M654L521K788
61207G18540K151J763J906K350K609K633K787L362M447O016P816R416J0792J2489
61193G89077J4868J7463J9593K1343K3376K5925K8571L0895L2808L4209L4909
61182A073037L4981L4680L3896L2125K9301K6087K3108K0234J7094J3993J1721
61171A350257J0393R083O806L494l35m411q729j2959j6522j9377k2099k4969k7551
61158A243081k9479l1110l2877l4427l5054l4701l3859l2642l0736k8201k5643
61147H94352k3405k1252j8961j6662j4368j1836r111o723m968l516k026o57K90
$$ plain form
61134 761157 762043 763369 764985 766854 769347 773085 778430 785428 794172 804842 817377 831611 847858
61121 847858 867014 889923 916894 947862 982587 1020554 1061103 1103985 1149487 1197764 1248266
61110 1248266 1300120 1352812 1406117 1459442 1511705 1562033 1610342 1656979 1701758 1743490 1780569
61099 1780569 1812024 1837883 1858502 1873778 1883208 1886572 1884173 1876337 1862921 1843519 1818010 1786745
61087 1786745 1750246 1708915 1663167 1613806 1562069 1509182 1455923 1402786 1350481 1299977 1251941
61076 1251941 1206378 1162904 1121230 1081371 1043707 1009004 978005 950764 926604 904944 885844
61065 885844 869517 855654 843708 833560 825447 819339 814805 811459 809246 808390 809266 812127 816685 822281
61051 822281 828838 837275 848439 861974 876850 892747 910145 929289 949953 972301 997094 1024798
$$ packed form
61134G61157Q86J326J616J869K493L738N345O998Q744J0670J2535J4234J6247
61121H47858J9156K2909K6971L0968L4725L7967M0549M2882M5502M8277N0502
61110A248266N1854N2692N3305N3325N2263N0328M8309M6637M4779M1732L7079
61099A780569L1455K5859K0619J5276R430L364k399p836j3416j9402k5509l1265
61087A786745l6499m1331m5748m9361n1737n2887n3259n3137n2305n0504m8036
61076A251941m5563m3474m1674l9859l7664l4703l0999k7241k4160k1660j9100
61065H85844j6327j3863j1946j0148q113o108m534l346k213q56Q76K861M558N596
61051H22281O557Q437J1164J3535J4876J5897J7398J9144K0664K2348K4793K7704
$$ plain form
61039 1024798 1055154 1087817 1122706 1159511 1197630 1236909 1277737 1319983 1362502 1404261 1445360
61028 1445360 1486386 1527275 1567526 1607161 1646655 1685993 1724531 1761957 1798856 1836060 1873669
61017 1873669 1910943 1947219 1982906 2019560 2058992 2102596 2151913 2209611 2279282 2364241 2467328
61006 2467328 2592246 2744454 2930187 3155132 3424660 3744785 4121763 4560479 5063728
60997 5063728 5633392 6272440 6986470 7784003 8675277 9670586 10780634 12018337 13394764
60988 13394764 14901418 16484197 18030482 19389116 20418864 21037243 21243646 21113792
60980 21113792 20778137 20390236 20081787 19911832 19837564 19731329 19436949 18831369 17862415
60971 17862415 16557434 15010645 13354624 11721971 10211951 8877379 7732280 6767054
$$ packed form
61039A024798L0356L2663L4889L6805L8119L9279M0828M2246M2519M1759M1099
61028A445360M1026M0889M0251L9635L9494L9338L8538L7426L6899L7204L7609
61017A873669L7274L6276L5687L6654L9432M3604M9317N7698O9671Q4959J03087
61006B467328J24918J52208J85733K24945K69528L20125L76978M38716N03249
60997E063728N69664O39048P14030P97533Q91274R95309J110048J237703J376427
60988A3394764J506654J582779J546285J358634J029748O18379K06403j29854
60980B1113792l35655l87901l08449j69955p4268j06235k94380o05580r68954
60971A7862415j304981j546789j656021j632653j510020j334572j145099r65226
$$ plain form
60963 6767054 5960247 5286203 4721052 4245858 3845719 3507586 3219903 2973275 2760099
60954 2760099 2573731 2408747 2261616 2130217 2012672 1907076 1811945 1726220 1648908 1579240
60944 1579240 1517014 1462174 1413928 1370659 1330624 1292355 1254549 1216293 1177690 1139822 1103772
60933 1103772 1069787 1037474 1006550 977202 949872 924927 902403 881911 862803 844541 826954
60922 826954 810161 794430 780069 767222 755614 744686 734251 724852 717150 711038 705706 700599
60910 700599 695831 691586 687603 683671 680179 677606 675634 673448 670914 668802 667594 666590 664600 661175
60896 661175 656764 651953 647016 642043 637004 631584 625353 618241 610639 602986 595455 588111 581154 574802
60882 574802 569028 563562 558185 552992 548329 544463 541264 538247 534912 531059 526845 522691 519170 516762
$$ packed form
60963F767054q06807o74044n65151m75194m00139l38133k87683k46628k13176
60954B760099j86368j64984j47131j31399j17545j05596r5131q5725p7312o9668
60944A579240o2226n4840m8246m3269m0035l8269l7806l8256l8603l7868l6050
60933A103772l3985l2313l0924k9348k7330k4945k2524k0492j9108j8262j7587
60922H26954j6793j5731j4361j2847j1608j0928j0435r399p702o112n332n107
60910G00599m768m245l983l932l492k573j972k186k534k112j208j004j990l425
60896F61175m411m811m937m973n039n420o231p112p602p653p531p344o957o352
60882E74802n774n466n377n193m663l866l199l017l335l853m214m154l521k408
$$ plain form
60868 516762 515542 515074 514776 514371 513952 513706 513695 513953 514667 516143 518546 521730 525337 529076 532860 536762
60852 536762 540971 545771 551259 556888 561540 564363 565526 565955 566470 567381 568718 570347 571839 572618 572352
60837 572352 570906 567947 563067 556398 548692 540585 532205 523744 515975 509727 505034 501167 497406 493536
60823 493536 489780 486563 484312 483174 482914 483148 483568 483892 483832 483345 482785 482566 482718 482923 482945 482930 483339 484578
60805 484578 486620 489032 491531 494363 497839 501686 505297 508561 511843 515143 518012 520449 523098 526178
60791 526178 528983 530995 532792 535076 537364 538521 538256 537228 535862 534034 531888 530074 528929 528087 527129
60776 527129 526027 524705 522754 519949 516746 513919 511800 510030 507907 504958 501356 497801 494822 492289
60762 492289 489779 487241 484976 483136 481586 480178 478783 477191 475397 473903 473295 473514 474013 474616 475774
$$ packed form
60868E16762j220m68k98m05m19k46j1K58P14J476K403L184L607L739L784L902
60852E36762M209M800N488N629M652K823J163M29N15R11J337J629J492P79k66
60837E72352j446k959m880o669p706q107q380q461p769o248m693l867l761l870
60823D93536l756l217k251j138k60K34M20L24o0m87n60k19J52K05K2j5M09J239
60805D84578K042K412K499K832L476L847L611L264L282L300K869K437K649L080
60791E26178K805K012J797K284K288J157k65j028j366j828k146j814j145q42r58
60776E27129j102j322j951k805l203k827k119j770k123k949l602l555k979k533
60762D92289k510k538k265j840j550j408j395j592j794j494o08K19M99O03J158
$$ plain form
60747 475774 477840 480469 482897 484543 485371 485940 487079 489199 491868 494314 496173 497482 498173 498169 497859 497841
60731 497841 498085 497941 497156 496377 496372 497168 498204 499065 499855 501047 503051 505793 508705 511323 513741 516202 518489
60714 518489 520148 521123 521635 521596 520847 519867 519465 519654 519554 518632 517333 516232 515244 514024 512521 510766 508636
60697 508636 506191 503769 501450 498972 496459 494574 493498 492393 490409 487732 485092 482778 480746 479274
60683 479274 478738 478990 479560 480298 481252 482177 482743 483077 483569 484307 485224 486604 488763 491330 493510 495151 497015
60666 497015 499814 503383 506893 509588 511201 511983 512524 513412 515030 517594 521084 524883 527830 529080 528848
60651 528848 528102 527749 528352 530185 532928 535474 536763 536880 536869 537440 538364 539100 539408 539186 538265 536694 534893
60634 534893 533315 532199 531757 532140 533023 533668 533748 533819 534596 536047 537620 539173 541131 543667 546264 548371
$$ packed form
60747D75774K066K629K428J646Q28N69J139K120K669K446J859J309O91ml10j8
60731D97841K44j44p85p79nP96J036Q61P90J192K004K742K912K618K418K461K287
60714E18489J659R75N12l9p49r80m02J89j00r22j299j101r88j220j503j755k130
60697E08636k445k422k319k478k513j885j076j105j984k677k640k314k032j472
60683D79274n36K52N70P38R54R25N66L34M92P38R17J380K159K567K180J641J864
60666D97015K799L569L510K695J613P82N41Q88J618K564L490L799K947J250k32
60651E28848p46l53O03J833K743K546J289J17j1N71R24P36L08k22r21j571j801
60634E34893j578j116m42L83Q83O45Q0P1P77J451J573J553J958K536K597K107
$$ plain form
60618 548371 550231 552619 555834 559333 562468 565216 567857 570180 571538 571771 571640 572117 573507 575482 577634
60603 577634 579650 581171 581992 582417 583070 584213 585464 586301 586656 586885 587260 587668 587820 587731 587851 588675 590286
60586 590286 592396 594741 597212 599626 601642 602936 603251 602368 600429 598298 597026 596732 596443 595380 593947
60571 593947 593065 592994 593267 593434 593313 592829 592327 592835 595240 599171 603305 606834 610060 613498 617101 620684
60555 620684 624492 628908 633863 638875 643455 647272 650140 652104 653414 654317 655032 655913 657331 659330 661731
60540 661731 664682 668676 673756 679087 683651 687283 690692 694578 698945 703201 706717 709313 711322 713200
60526 713200 715110 717052 719321 722475 726634 731108 735031 738339 741893 746648 752789 759647 766417 773006
60512 773006 780107 788350 797481 806722 815859 825444 835728 845968 855313 864022 873193 883393 894159
$$ packed form
60618E48371J860K388L215L499L135K748K641K323J358K33j31M77J390J975K152
60603E77634K016J521Q21M25O53J143J251Q37L55K29L75M08J52q9J20Q24J611
60586E90286K110K345K471K414K016J294L15q83j939k131j272k94k89j063j433
60571E93947q82p1K73J67j21m84n02N08K405L931M134L529L226L438L603L583
60555F20684L808M416M955N012M580L817K868J964J310R03P15Q81J418J999K401
60540F61731K951L994N080N331M564L632L409L886M367M256L516K596K009J878
60526G13200J910J942K269L154M159M474L923L308L554M755O141O858O770O589
60512G73006P101Q243R131R241R137R585J0284J0240R345Q709R171J0200J0766
$$ plain form
60499 894159 904909 915744 927143 939345 952411 966539 981848 997966 1014241 1030377 1046555
60488 1046555 1062898 1079064 1094405 1108272 1120062 1129210 1135324 1138207 1137651 1133470 1125912 1115880 1104424
60475 1104424 1092027 1078536 1063713 1047686 1031005 1014511 999050 984949 971734 958639 945451
60464 945451 932586 920381 908653 897061 885487 873840 861840 849262 836277 823284 810568
60453 810568 798189 786042 773929 761810 750015 738916 728276 717402 706125 695162 685145
60442 685145 675767 666344 656822 647683 639165 631173 623744 616903 610193 603002 595386 587992 581172 574767
60428 574767 568833 563847 559919 556334 552252 547578 542867 538645 535007 531661 528235 524729 521690 519725
60414 519725 518803 518308 517706 516817 515566 514037 512757 512303 512408 512002 510432 508202 506263 505000 504163 503335
$$ packed form
60499H94159J0750J0835J1399J2202J3066J4128J5309J6118J6275J6136J6178
60488A046555J6343J6166J5341J3867J1790R148O114K883n56m181p558j0032j1456
60475A104424j2397j3491j4823j6027j6681j6494j5461j4101j3215j3095j3188
60464I45451j2865j2205j1728j1592j1574j1647j2000j2578j2985j2993j2716
60453H10568j2379j2147j2113j2119j1795j1099j0640j0874j1277j0963j0017
60442F85145r378r423r522r139q518p992p429o841o710p191p616p394o820o405
60428E74767n934m986l928l585m082m674m711m222l638l346l426l506l039j965
60414E19725r22m95o02q89j251j529j280m54J05m06j570k230j939j263q37q28
$$ plain form
60398 503335 502208 500868 500104 500884 503124 505439 506584 506691 506634 506700 506592 506383 506567 507226 507832 507956 507590 506752
60380 506752 505423 504031 503430 504002 505099 505627 505028 503612 502195 501560 502018 503265 504746 506253 508052 510323
60364 510323 512646 514189 514365 513270 511517 509641 507741 505734 503874 502709 502493 502918 503571 504247 504583 503944
60348 503944 502268 500719 500695 502177 503776 504492 504735 505388 506615 508111 509863 511981 514133 515924 517703
60333 517703 520305 523932 527880 531503 534879 538342 541902 545502 549382 553671 557827 561015 563027 564350
60319 564350 565282 565420 564212 561630 558065 553842 549240 544863 541578 539926 539746 540453 541586 543107 545357
60304 545357 548742 553392 559081 565556 572890 581366 591030 601479 612037 621954 630471 637058 641665 644508
60290 644508 645375 643311 637295 627317 614774 601827 590317 581075 573970 568491 564222 560838 557901 555056
$$ packed form
60398E03335j127j340p64P80K240K315J145J07n7O6j08k09J84O59O06J24l66q38
60380E06752j329j392o01N72J097N28n99j416j417o35M58J247J481J507J799K271
60364E10323K323J543J76j095j753j876j900k007j860j165k16M25O53O76L36o39
60348E03944j676j549k4J482J599P16K43O53J227J496J752K118K152J791J779
60333E17703K602L627L948L623L376L463L560L600L880M289M156L188K012J323
60319E64350R32J38j208k582l565m223m602m377l285j652j80P07J133J521K250
60304E45357L385M650N689O475P334Q476R664J0449J0558R917Q517O587M607K843
60290F44508Q67k064o016r978j2543j2947j1510r242p105n479m269l384k937k845
$$ plain form
60276 555056 552382 550226 548542 546701 544143 540969 537659 534472 531434 528758 526786 525485 524340 522940
60262 522940 521470 520501 520375 520907 521668 522442 523356 524570 525992 527459 529135 531399 534240 537076 539476 541860
60246 541860 545114 549551 554593 559443 563686 567144 569566 570821 571202 571176 570781 569476 566732 562690 558161
60231 558161 554056 550934 549036 548450 548978 550001 550892 551725 553306 556323 560616 565454 570262 574840 579058
60216 579058 582803 586276 590032 594552 599902 605777 611731 617395 622719 628061 633845 640095 646458 652699
60202 652699 658948 665439 672226 679238 686348 693244 699405 704435 708351 711408 713773 715493 716678 717503
60188 717503 718002 718001 717290 715820 713733 711251 708557 705773 703039 700551 698412 696427 694130 691094 687279
60173 687279 683128 679319 676284 673819 671274 668317 665452 663539 662841 662783 662704 662592 662964 664297 666673 669760
$$ packed form
60276E55056k674k156j684j841k558l174l310l187l038k676j972j301j145j400
60262E22940j470r69j26N32P61P74R14J214J422J467J676K264K841K836K400K384
60246E41860L254M437N042M850M243L458K422J255L81k6l95j305k744m042m529
60231E58161m105l122j898n86N28J023Q91Q33J581L017M293M838M808M578M218
60216E79058L745L473L756M520N350N875N954N664N324N342N784O250O363O241
60202F52699O249O491O787P012P110O896O161N030L916L057K365J720J185Q25
60188G17503M99jp11j470k087k482k694k784k734k488k139j985k297l036l815
60173F87279m151l809l035k465k545k957k865j913o98n8p9j12L72J333K376L087
$$ plain form
60157 669760 672899 675452 677375 679333 682025 685461 689116 692590 695840 698864 701646 704505 708098 712871
60143 712871 718715 725359 732847 741400 751041 761583 772837 784493 795944 806719 817148 828160
60131 828160 840106 852063 862570 870884 877124 881336 882975 881546 877410 871598 865018 858185 851575
60118 851575 845734 840889 836779 833154 830194 828168 826885 825917 825296 825510 826641 827923 828531 828547 828689 829190
60102 829190 829422 828735 827211 825309 823102 820250 816595 812409 808125 804113 800746 798294 796645 795485 794902
60087 794902 795537 797913 801882 807004 813239 820820 829553 838679 847485 855657 862918 868758 872875 875486
60073 875486 876742 875980 872108 864861 855222 844433 832929 820564 807572 794783 782874 771828 761290
60060 761290 751163 741683 733104 725550 719075 713623 708968 704883 701392 698705 696888 695708 694807 693929
$$ packed form
60157F69760L139K553J923J958K692L436L655L474L250L024K782K859L593M773
60143G12871N844O644P488Q553R641J0542J1254J1656J1451J0775J0429J1012
60131H28160J1946J1957J0507Q314O240M212J639j429m136n812o580o833o610
60118H51575n841m845m110l625k960k026j283r68o21K14J131J282O08J6J42N01
60102H29190K32o87j524j902k207k852l655m186m284m012l367k452j649j160n83
60087G94902O35K376L969N122O235P581Q733R126Q806Q172P261N840M117K611
60073H75486J256p62l872p247r639j0789j1504j2365j2992j2789j1909j1046j0538
60060G61290j0127r480q579p554o475n452m655m085l491k687j817j180r01q78
$$ plain form
60046 693929 693051 692442 692613 693956 696345 699195 702001 704708 707527 710657 714348 718980 724785 731423 738091
60031 738091 743987 748561 751433 752455 751931 750394 747944 743991 737910 729794 720281 709738 697988 684899
60017 684899 670927 656883 643354 630543 618468 607059 596118 585507 575516 566889 560304 555808
60005 555808 552748 550239 547744 545320 543393 542294 542071 542637 543886 545536 547127 548496 550120 552614 555905
59990 555905 559316 562518 565875 569651 573471 577013 580763 585372 590464 594894 598208 601130 604321 607333
59976 607333 609219 609767 609579 609194 608598 607526 605769 603194 599852 596168 592782 590086 588091 586702 585861
59961 585861 585404 585020 584459 583575 582131 579892 577086 574489 572633 571103 569009 566165 563337 561163 559331
59946 559331 557260 555248 554336 555036 556751 558552 559948 560654 560222 558485 556046 553653 551242 548131 544099
$$ packed form
60046F93929q78o09J71J343K389K850K806K707K819L130L691M632N805O638O668
60031G38091N896M574K872J022n24j537k450l953o081q116r513j0543j1750j3089
60017F84899j3972j4044j3529j2811j2075j1409j0941j0611r991q627o585m496
60005E55808l060k509k495k424j927j099k23N66J249J650J591J369J624K494L291
59990E55905L411L202L357L776L820L542L750M609N092M430L314K922L191L012
59976F07333J886N48j88l85n96j072j757k575l342l684l386k696j995j389q41
59961E85861m57l84n61q84j444k239k806k597j856j530k094k844k828k174j832
59946E59331k071k012r12P00J715J801J396P06m32j737k439k393k411l111m032
$$ plain form
59931 544099 539696 535459 531389 527386 523623 520277 517370 515126 513969 513829 513891 513518 513028 513110 513736 514237
59915 514237 514274 514192 514468 515349 517014 519563 522695 525821 528643 531284 533819 536080 538171 540781 544699 550122
59899 550122 556528 562995 568569 572744 575922 579150 583056 587190 590763 593906 597738 603180 610100 617754
59885 617754 625694 633881 642222 650397 658181 665596 672669 679340 685712 692082 698406 703970 707942 710211
59871 710211 711292 711415 710117 706892 701840 695352 687433 677767 666467 654431 642866 632583 623769
59858 623769 616296 610174 605672 602940 601558 600695 599876 599432 600068 602127 605465 609802 614943 620769 627303
59843 627303 634685 642800 651086 659103 667206 676111 685632 694301 700577 704260 706481 708490 710687 712765
59829 712765 714552 716585 719798 724539 729867 733988 735412 733650 728945 721731 712482 701722 689852 677048
$$ packed form
59931E44099m403m237m070m003l763l346k907k244j157j40O2l73m90Q2O26N01
59915E14237L7q2K76Q81J665K549L132L126K822K641K535K261K091K610L918N423
59899E50122O406O467N574M175L178L228L906M134L573L143L832N442O920P654
59885F17754P940Q187Q341Q175P784P415P073O671O372O370O324N564L972K269
59871G10211J081J23j298l225n052o488p919r666j1300j2036j1565j0283q814
59858F23769p473o122m502k732j382q63q19m44O36K059L338M337N141N826O534
59843F27303P382Q115Q286Q017Q103Q905R521Q669O276L683K221K009K197K078
59829G12765J787K033L213M741N328M121J424j762m705p214r249j0760j1870j2804
$$ plain form
59815 677048 663539 649878 636805 624897 614459 605588 598191 592025 586897 582746 579450 576737 574476
59802 574476 572867 572144 572173 572573 573102 573670 574040 573835 572860 571181 568878 565997 562745 559417 556053 552428
59786 552428 548525 544729 541422 538644 536304 534436 533009 531827 530942 530888 531981 533520 534273 533902 533437 534114
59770 534114 536129 538841 541830 545299 549484 554082 558400 561910 564596 566822 568895 570798 572405 573866
59756 573866 575504 577296 578822 579921 581093 582856 584944 586542 587275 587546 587924 588582 589410 590291 591097 591665
59740 591665 591966 592135 592241 592165 591768 590993 589874 588641 587844 588043 589307 591199 593250 595193 596771 597821
59724 597821 598704 600279 603099 606818 610500 613359 615158 616277 617556 619698 622546 625202 627054 628333
59710 628333 629449 630276 630514 630464 630891 632239 634285 636382 637690 637487 635823 633742 632327 631500 630218 627845
$$ packed form
59815F77048j3509j3661j3073j1908j0438q871p397o166n128m151l296k713k261
59802E74476j609p23K9M00N29N68L70k05r75j679k303k881l252l328l364l625
59786E52428l903l796l307k778k340j868j427j182q85n4J093J539P53l71m65O77
59770E34114K015K712K989L469M185M598M318L510K686K226K073J903J607J461
59756E73866J638J792J526J099J172J763K088J598P33K71L78O58Q28Q81Q06N68
59740E91665L01J69J06p6l97p75j119j233p97J99J264J892K051J943J578J050
59724E97821Q83J575K820L719L682K859J799J119J279K142K848K656J852J279
59710F28333J116Q27K38n0M27J348K046K097J308k03j664k081j415q27j282k373
$$ plain form
59694 627845 624881 622255 620380 619067 618053 617321 617056 617422 618307 619288 619891 619904 619394 618596 617878 617521 617338
59677 617338 616764 615618 614466 613814 613223 611698 608820 604980 600730 596516 592943 590530 589034 587662 586139
59662 586139 584956 584419 584130 583823 584109 585815 588918 592615 596252 599731 603166 606572 609914 613214 616626
59647 616626 620442 624812 629289 632879 634796 635022 634012 632175 629818 627280 624664 621660 618049 614291
59633 614291 611189 609023 607418 606152 605684 606712 609405 613214 617237 620664 623072 624591 625790 627178
59619 627178 628796 630400 632045 634306 637739 642206 646857 650738 653327 654655 655267 656044 657686 660131 662773
59604 662773 665364 668385 672274 676672 680803 684261 686892 688146 687273 684205 679738 674726 669533 664354
59590 664354 659504 655076 650682 645820 640328 634409 628495 623211 619099 616147 613791 611522 609266 607093
$$ packed form
59694F27845k964k626j875j313j014p32k65L66Q85R81O03J3n10p98p18l57j83
59677F17338n74j146j152o52n91j525k878l840m250m214l573k413j496j372j523
59662E86139j183n37k89l07K86J706L103L697L637L479L435L406L342L300L412
59647F16626L816M370M477L590J917K26j010j837k357k538k616l004l611l758
59633F14291l102k166j605j266m68J028K693L809M023L427K408J519J199J388
59619F27178J618J604J645K261L433M467M651L881K589J328O12P77J642K445K642
59604F62773K591L021L889M398M131L458K631J254q73l068m467n012n193n179
59590F64354m850m428m394m862n492n919n914n284m112k952k356k269k256k173
$$ plain form
59576 607093 604857 602268 599159 595647 592318 590175 589956 591341 593229 594905 596526 598381 600259 601855
59562 601855 603340 605144 607506 610544 614327 618500 622185 624756 626436 627749 628700 628987 628789 628790 629508 631033
59546 631033 633340 636367 639827 643369 646987 650983 655586 660965 667562 675924 686118 697678 710368
59533 710368 724724 741576 761074 782274 803612 823699 841689 857051 869254 878056 884182 889431
59521 889431 895709 903875 913459 923272 932146 939304 944371 947122 947147 943852 936873 926352 912683 896172
59507 896172 877211 856729 836181 816913 799520 783814 769385 756189 744586 734872 726973 720682
59495 720682 715899 712413 709717 707477 706014 705864 706995 708992 711914 716199 721669 727434 733140 739566
59481 739566 747516 756746 766544 776854 788139 800510 813695 827671 842671 858613 874996 891365
$$ packed form
59576F07093k236k589l109l512l329k143k19J385J888J676J621J855J878J596
59562F01855J485J804K362L038L783M173L685K571J680J313R51K87j98JP18J525
59546F31033K307L027L460L542L618L996M603N379O597Q362J0194J1560J2690
59533G10368J4356J6852J9498K1200K1338K0087J7990J5362J2203Q802O126N249
59521H89431O278Q166R584R813Q874P158N067K751K5l295o979j0521j3669j6511
59507H96172j8961k0482k0548j9268j7393j5706j4429j3196j1603r714p899o291
59495G20682m783l486k696k240j463j50J131J997K922M285N470N765N706O426
59481G39566P950R230R798J0310J1285J2371J3185J3976J5000J5942J6383J6369
$$ plain form
59469 891365 907508 923242 938267 952087 963863 972647 978197 981465 984121 987791 993823 1003184 1016119
59456 1016119 1032314 1051775 1075102 1102530 1133303 1166655 1202772 1241862 1282664 1322919 1361191
59445 1361191 1397419 1431853 1464411 1494947 1522845 1545837 1559907 1560884 1545997 1514318 1467022 1407813
59433 1407813 1342374 1276537 1214764 1159882 1113188 1074339 1041776 1013969 990210 970298 954185
59422 954185 942285 935530 934521 938836 947495 959784 975293 993446 1013435 1034468 1055820 1076671
59410 1076671 1095974 1112516 1125341 1134550 1141453 1147133 1150525 1148490 1138207 1119296 1093603 1063646
59398 1063646 1031790 1000313 971412 946884 927944 915037 907442 903087 899097 892686 881825 865706
59386 865706 845044 821729 797859 774979 754117 736043 721164 709379 700262 693229 687501 682379
$$ packed form
59469H91365J6143J5734J5025J3820J1776Q784N550L268K656L670O032R361J2935
59456A016119J6195J9461K3327K7428L0773L3352L6117L9090M0802M0255L8272
59445A361191L6228L4434L2558L0536K7898K2992J4070R77j4887l1679m7296n9209
59433A407813o5439o5837o1773n4882m6694l8849l2563k7807k3759j9912j6113
59422I54185j1900o755j009M315Q659J2289J5509J8153J9989K1033K1352K0851
59410A076671J9303J6542J2825R209O903N680L392k035j0283j8911k5693k9957
59398A063646l1856l1477k8901k4528j8940j2907p595m355l990o411j0861j6119
59386H65706k0662k3315k3870k2880k0862j8074j4879j1785r117p033n728n122
$$ plain form
59374 682379 677777 674143 671562 669310 666672 663849 661664 660601 660607 661637 663816 667045 670916 675210 680205
59359 680205 686394 694062 703306 714268 727173 742055 758593 776453 795891 817822 843026 871331
59347 871331 901768 933419 965819 998668 1031587 1064248 1096302 1127071 1155643 1181297 1203443
59336 1203443 1221095 1232954 1238253 1237074 1229628 1215770 1195575 1169895 1139900 1106399 1070070 1031992
59324 1031992 993432 955285 918183 882917 850289 820659 794092 770774 750805 733685 718544
59313 718544 704970 693232 683669 676186 670346 665612 661514 657969 655454 654561 655300 657162 659837 663456
59299 663456 668059 673311 679037 685652 693695 703075 713203 723788 735122 747358 759681 770386 777765
59286 777765 780912 779915 775575 769049 761520 754008 747450 742884 741297 743124 748080 755721 766037 779220
$$ packed form
59374F82379m602l634k581k252k638k823k185j063OJ030K179L229L871M294M995
59359F80205O189P668R244J0962J2905J4882J6538J7860J9438K1931K5204K8305
59347H71331L0437L1651L2400L2849L2919L2661L2054L0769K8572K5654K2146
59336A203443J7652J1859N299j179p446j3858k0195k5680k9995l3501l6329l8078
59324A031992l8560l8147l7102l5266l2628k9630k6567k3318j9969j7120j5141
59313G18544j3574j1738r563p483n840m734m098l545k515q93P39J862K675L619
59299F63456M603N252N726O615Q043R380J0128J0585J1334J2236J2323J0705P379
59286G77765L147r97m340o526p529p512o558m566j587J827M956P641J0316J3183
$$ plain form
59272 779220 794983 812560 831331 851155 872009 893566 915182 936006 955117 971900 986325
59261 986325 998412 1007272 1011159 1008837 1000671 988200 972848 955310 935889 915105 893957 873726
59249 873726 855381 839245 825387 814212 806162 800847 797183 794689 794089 796210 800902 807557 816213
59236 816213 827370 840948 856134 872108 888251 903682 917372 928867 938283 945300 948694 947256
59224 947256 940902 930558 917165 901102 882488 861727 839645 817154 794846 772995 751966 732464
59212 732464 715234 700594 688381 678190 669442 661361 653310 645279 637826 631411 625912 620841 615914
59199 615914 611286 607330 604285 602088 600505 599349 598503 597781 596972 596112 595598 595879 597045 598760 600544 602105
59183 602105 603535 605263 607725 611009 614922 619402 624640 630753 637631 645320 654343 665266 678020 691886
$$ packed form
59272G79220J5763J7577J8771J9824K0854K1557K1616K0824J9111J6783J4425
59261I86325J2087Q860L887k322q166j2471j5352j7538j9421k0784k1148k0231
59249H73726j8345j6136j3858j1175q050n315l664k494o00K121M692O655Q656
59236H16213J1157J3578J5186J5974J6143J5431J3690J1495R416P017L394j438
59224I47256o354j0344j3393j6063j8614k0761k2082k2491k2308k1851k1029j9502
59212G32464j7230j4640j2213j0191q748q081q051q031p453o415n499n071m927
59199F15914m628l956l045k197j583j156q46p22q09q60n14K81J166J715J784J561
59183F02105J430J728K462L284L913M480N238O113O878P689R023J0923J2754J3866
$$ plain form
59169 691886 706232 721083 736935 754187 772896 792987 814413 836846 859268 880238 898741
59158 898741 914550 927610 937422 943393 945418 943548 937408 926725 912369 896023 878698 860385
59146 860385 841362 822808 805572 789196 773008 757584 744164 732968 723003 713414 704150 695298
59134 695298 686584 677756 668927 660334 652196 644923 639037 634695 631690 630024 630121 632267 636083 640729 645513
59119 645513 650292 655528 661942 669899 679067 688842 698993 709694 721012 732769 744913 757648 770990
59106 770990 784417 797102 808434 818307 827069 835323 843656 852332 861076 869166 875950 881482 886429
59093 886429 891024 894342 895200 893790 891755 890418 889546 888181 886010 883358 880390 877000 873118 868405 861965
59078 861965 853042 841866 829169 815143 799634 783238 767335 752912 739971 728160 717322 707344
$$ packed form
59169F91886J4346J4851J5852J7252J8709K0091K1426K2433K2422K0970J8503
59158H98741J5809J3060R812N971K025j870o140j0683j4356j6346j7325j8313
59146H60385j9023j8554j7236j6376j6188j5424j3420j1196r965r589r264q852
59134F95298q714q828q829q593q138p273n886m342l005j666R7K146L816M646M784
59119F45513M779N236O414P957R168R775J0151J0701J1318J1757J2144J2735J3342
59106G70990J3427J2685J1332R873Q762Q254Q333Q676Q744Q090O784N532M947
59093H86429M595L318Q58j410k035j337q72j365k171k652k968l390l882m713o440
59078H61965q923j1176j2697j4026j5509j6396j5903j4423j2941j1811j0838r978
$$ plain form
59066 707344 698137 689987 683361 678171 673764 669788 666539 664231 662459 660692 658779 656694 654156 650951
59052 650951 647316 643719 640439 637535 634941 632440 629794 627074 624587 622351 619983 617312 614771 612924
59038 612924 611842 611195 610702 610299 610092 610431 611819 614525 618369 623056 628528 634824 641801 649203 656889
59023 656889 664857 673227 682403 693025 705431 719167 733273 747077 760525 773743 786494 798235
59011 798235 808535 817194 823979 828587 831149 832577 834096 836427 839724 844254 850652 859316 869948 882003
58997 882003 895403 910517 927651 946714 967177 988152 1008684 1028099 1045802 1060817 1072128
58986 1072128 1079702 1084519 1087122 1086731 1082218 1073380 1060701 1044671 1026307 1007786 991325 977549 965895
58973 965895 956384 949786 946128 944369 943963 945641 950106 956920 965311 975382 987765 1002528 1018923
$$ packed form
59066G07344r207q150o626n190m407l976l249k308j772j767j913k085k538l205
59052F50951l635l597l280k904k594k501k646k720k487k236k368k671k541j847
59038F12924j082o47m93m03k07L39J388K706L844M687N472O296O977P402P686
59023F56889P968Q370R176J0622J2406J3736J4106J3804J3448J3218J2751J1741
59011G98235J0300Q659O785M608K562J428J519K331L297M530O398Q664J0632J2055
58997H82003J3400J5114J7134J9063K0463K0975K0532J9415J7703J5015J1311
58986A072128P574M817K603l91m513q838j2679j6030j8364j8521j6461j3776j1654
58973I65895r511o598l658j759m06J678M465O814Q391J0071J2383J4763J6395
$$ plain form
58960 1018923 1035870 1052267 1067191 1080226 1091317 1100063 1105441 1106432 1102601 1093949 1080785 1063995
58948 1063995 1044881 1024292 1002249 978770 954731 931648 910916 893434 879504 868750 860433
58937 860433 854226 850394 849086 849816 851877 854791 857950 860192 860191 857171 851019 841993 830574 817434 803310
58922 803310 788985 775325 763027 752280 742971 735244 729508 725888 724116 723887 724852 726395 728181 730929
58908 730929 735787 742774 750734 759099 768728 780490 793985 808468 824260 842345 863102 886347
58896 886347 912228 941084 972529 1005511 1039311 1073908 1109461 1145986 1183584 1222554 1263258
58885 1263258 1306141 1351587 1399298 1447907 1495550 1540618 1581546 1616208 1642257 1658267 1664207
58874 1664207 1660749 1648317 1626763 1595774 1555698 1508146 1455605 1400333 1343845 1287455 1232825
$$ packed form
58960A018923J6947J6397J4924J3035J1091Q746N378R91l831q652j3164j6790
58948A063995j9114k0589k2043k3479k4039k3083k0732j7482j3930j0754q317
58937H60433o207l832j308P30K061K914L159K242jl020o152r026j1419j3140j4124
58922H03310j4325j3660j2298j0747r309p727n736l620j772k29R65J543J786K748
58908G30929M858O987P960Q365R629J1762J3495J4483J5792J8085K0757K3245
58896H86347K5881K8856L1445L2982L3800L4597L5553L6525L7598L8970M0704
58885A263258M2883M5446M7711M8609M7643M5068M0928L4662K6049J6010N940
58874A664207l458j2432k1554l0989m0076m7552n2541n5272n6488n6390n4630
$$ plain form
58863 1232825 1181586 1134761 1092762 1055611 1022892 993947 968404 946040 925905 906352 886566
58852 886566 867482 850470 835545 821652 808272 795808 784569 774298 764807 756301 748914 742479
58840 742479 736838 731883 727256 722500 717589 712882 708493 704088 699347 694253 688901 683368 677841 672642
58826 672642 668046 664204 661103 658473 655974 653736 652486 652835 654674 657519 661147 665520 670456 675783
58812 675783 681556 687645 693411 698215 702000 704907 706773 707542 707775 708041 708075 707248 705618 703783 701912 699812
58796 699812 697780 696472 695888 695323 694431 693507 692650 691527 690227 689505 689835 690966 692852 696308 702194 710386
58780 710386 719965 729944 739448 747743 754731 761077 767263 772726 776441 778265 779179 780210 781521 782675
58766 782675 783428 784014 784725 785458 785776 785405 784480 783308 782045 780827 780077 780420 782265 785633 790366 796327
$$ packed form
58863A232825n1239m6825m1999l7151l2719k8945k5543k2364k0135j9553j9786
58852H86566j9084j7012j4925j3893j3380j2464j1239j0271r491q506p387o435
58840G42479n641m955m627m756m911m707m389m405m741n094n352n533n527n199
58826F72642m596l842l101k630k499k238j250L49J839K845L628M373M936N327
58812F75783N773O089N766M804L785K907J866P69K33K66L4q27j630j835j871k100
58796F99812k032j308n84n65q92r24q57j123j300p22L30J131J886L456N886Q192
58780G10386R579R979R504Q295O988O346O186N463L715J824R14J031J311J154
58766G82675P53N86P11P33L18l71r25j172j263j218p50L43J845L368M733N961
$$ plain form
58750 796327 803412 811551 820732 830907 841821 852867 863133 871831 879045 885991 894041 903405 913188
58737 913188 922755 932303 941779 950193 956778 962265 968060 974509 980820 986495 991906 997542 1003626 1010586
58723 1010586 1019066 1029168 1040220 1051362 1061799 1070583 1077092 1081979 1086892 1092792 1099190 1105348 1111583
58710 1111583 1118786 1127049 1135368 1142576 1148193 1152429 1155553 1157176 1156138 1151304 1142460 1130126 1114593
58697 1114593 1095690 1073598 1049298 1023899 997940 971685 945714 920855 897751 876759 858121
58686 858121 841991 828453 817538 808909 801393 793229 783177 771293 758556 746027 734524 724751
58674 724751 717229 712064 709012 707768 708065 709582 711990 715275 720017 727156 737199 749566 762937 776392
58660 776392 790037 804317 818974 832963 845161 854865 861728 865716 867137 866539 864585 862095 859778
$$ packed form
58750G96327P085Q139R181J0175J0914J1046J0266Q698P214O946Q050R364R783
58737I13188R567R548R476Q414O585N487N795O449O311N675N411N636O084O960
58723A010586Q480J0102J1052J1142J0437Q784O509M887M913N900O398O158O235
58710A111583P203Q263Q319P208N617M236L124J623j038m834q844j2334j5533
58697A114593j8903k2092k4300k5399k5959k6255k5971k4859k3104k0992j8638
58686H58121j6130j3538j0915q629p516q164j0052j1884j2737j2529j1503r773
58674G24751p522n165l052j244K97J517K408L285M742P139J0043J2367J3371J3455
58660G76392J3645J4280J4657J3989J2198R704O863L988J421n98j954k490k317
$$ plain form
58647 859778 857617 854877 851201 847336 844200 841584 838572 835038 831829 829446 827484 825713 824929 826223
58633 826223 829874 835339 841928 849098 856417 863661 870801 877664 883779 888776 892825 896548 900505 904819
58619 904819 909290 914027 919997 928596 940395 954696 970645 988374 1008420 1030420 1053099 1075256
58607 1075256 1095782 1112898 1124538 1129921 1129957 1125836 1117952 1106624 1093033 1078741 1064658 1050946
58595 1050946 1037691 1025309 1014485 1005896 999726 995400 992219 990322 990547 993249 997917 1004211 1012696
58582 1012696 1024069 1038066 1053667 1070151 1087521 1106036 1125499 1144936 1162928 1178495 1191708
58571 1191708 1203174 1213069 1221201 1227963 1234535 1241946 1250558 1260650 1272820 1287355 1303770 1321471
58559 1321471 1340444 1360809 1381921 1402374 1420732 1435962 1447303 1454086 1455766 1452147 1443703 1431622
$$ packed form
58647H59778k161k740l676l865l136k616l012l534l209k383j962j771p84J294
58633H26223L651N465O589P170P319P244P140O863O115M997M049L723L957M314
58619I04819M471M737N970Q599J1799J4301J5949J7729K0046K2000K2679K2157
58607A075256K0526J7116J1640N383L6m121p884j1328j3591j4292j4083j3712
58595A050946j3255j2382j0824q589o170m326l181j897K25K702M668O294Q485
58582A012696J1373J3997J5601J6484J7370J8515J9463J9437J7992J5567J3213
58571A191708J1466R895Q132O762O572P411Q612J0092J2170J4535J6415J7701
58559A321471J8973K0365K1112K0453J8358J5230J1341O783J680l619q444j2081
$$ plain form
58547 1431622 1417240 1401414 1384660 1367696 1351336 1335883 1321129 1306889 1293037 1278996 1263897
58536 1263897 1247435 1230076 1212335 1194438 1176782 1160136 1145130 1132083 1121477 1113999 1109834 1108468
58524 1108468 1109424 1112672 1118123 1125318 1133898 1143894 1155199 1167190 1179017 1189874 1198882 1205283 1208934
58511 1208934 1210205 1209367 1206668 1202951 1199345 1196173 1192993 1189870 1187643 1186586 1185823 1184675 1183781 1184222 1186159
58496 1186159 1188970 1192116 1195228 1197819 1199529 1200330 1200165 1198873 1196843 1195065 1193999 1192892 1190729 1187384
58482 1187384 1183421 1179363 1175725 1173241 1172388 1173012 1174887 1178239 1183236 1189302 1195399 1200599 1204069 1204906 1202477
58467 1202477 1196662 1187606 1175747 1162213 1148493 1135406 1122980 1111583 1102245 1095408 1090218 1085730
58455 1085730 1082100 1079940 1079179 1079326 1080380 1082716 1086362 1090865 1095458 1098967 1100074 1098213 1093824 1087541
$$ packed form
58547A431622j4382j5826j6754j6964j6360j5453j4754j4240j3852j4041j5099
58536A263897j6462j7359j7741j7897j7656j6646j5006j3047j0606p478m165j366
58524A108468R56L248N451P195Q580R996J1305J1991J1827J0857R008O401L651
58511A208934J271q38k699l717l606l172l180l123k227j057p63j148q94M41J937
58496A186159K811L146L112K591J710Q01j65j292k030j778j066j107k163l345
58482A187384l963m058l638k484q53O24J875L352M997O066O097N200L470Q37k429
58467A202477n815r056j1859j3534j3720j3087j2426j1397r338o837n190m488
58455A085730l630k160p61J47J054K336L646M503M593L509J107j861m389o283
$$ plain form
58441 1087541 1079747 1071125 1062740 1055134 1048259 1042723 1039986 1040575 1043171 1046415 1050691 1057140 1065769 1075743
58427 1075743 1086870 1099539 1113623 1128614 1144551 1161784 1180025 1198481 1216669 1234287 1250611
58416 1250611 1264819 1276629 1285930 1292240 1295309 1295840 1294730 1291987 1287184 1280548 1272608 1263120 1251349
58403 1251349 1237368 1222251 1207110 1192599 1179242 1167564 1157955 1150760 1146166 1143630 1141944 1140404
58391 1140404 1139422 1139456 1139981 1140082 1139335 1137423 1133666 1127888 1121049 1113994 1106155 1096453 1085075 1073405 1062626
58376 1062626 1053291 1045833 1040526 1037217 1035853 1036934 1040747 1046696 1054083 1062980 1073555 1085214 1097316
58363 1097316 1110133 1124223 1139440 1155427 1172342 1190154 1207910 1224726 1240832 1256573 1271047
58352 1271047 1282837 1291530 1297438 1300499 1300603 1298459 1295072 1290925 1286590 1283376 1282308 1283248 1286027 1291434
$$ packed form
58441A087541p794q622q385p606o875n536k737N89K596L244M276O449Q629R974
58427A075743J1127J2669J4084J4991J5937J7233J8241J8456J8188J7618J6324
58416A250611J4208J1810R301O310L069N31j110k743m803o636p940r488j1771
58403A251349j3981j5117j5141j4511j3357j1678r609p195m594k536j686j540
58391A140404r82L4N25J01p47j912l757n778o839p055p839r702j1378j1670j0779
58376A062626r335p458n307l309j364J081L813N949P387Q897J0575J1659J2102
58363A097316J2817J4090J5217J5987J6915J7812J7756J6816J6106J5741J4474
58352A271047J1790Q693N908L061J04k144l387m147m335l214j068R40K779N407
$$ plain form
58338 1291434 1299864 1310071 1320783 1332627 1346895 1363219 1380163 1397268 1414812 1432253 1448770
58327 1448770 1464752 1480948 1496626 1510291 1521700 1531405 1538912 1543216 1544838 1545507 1546194 1547154 1549316
58314 1549316 1553650 1559578 1566101 1574159 1585853 1601549 1619739 1639505 1660998 1683642 1706102 1728226
58302 1728226 1751075 1774891 1798719 1822008 1844873 1866896 1887419 1906726 1925211 1941965 1956307
58291 1956307 1970161 1986414 2005183 2024290 2043287 2064278 2088495 2114788 2142072 2170755 2200976
58280 2200976 2231699 2262481 2294332 2328105 2363507 2400054 2437531 2475446 2513567 2552866 2594321
58269 2594321 2637282 2680909 2726456 2775796 2828263 2881630 2935739 2992334 3051688 3112512 3175120
58258 3175120 3241437 3311602 3383560 3456291 3530530 3606152 3681968 3758438 3837545 3919759 4004221
$$ packed form
58338A291434Q430J0207J0712J1844J4268J6324J6944J7105J7544J7441J6517
58327A448770J5982J6196J5678J3665J1409R705P507M304J622O69O87R60K162
58314A549316M334N928O523Q058J1694J5696J8190J9766K1493K2644K2460K2124
58302A728226K2849K3816K3828K3289K2865K2023K0523J9307J8485J6754J4342
58291A956307J3854J6253J8769J9107J8997K0991K4217K6293K7284K8683L0221
58280B200976L0723L0782L1851L3773L5402L6547L7477L7915L8121L9299M1455
58269B594321M2961M3627M5547M9340N2467N3367N4109N6595N9354O0824O2608
58258C175120O6317P0165P1958P2731P4239P5622P5816P6470P9107Q2214Q4462
$$ plain form
58247 4004221 4091994 4185725 4285758 4390079 4498543 4613765 4737492 4869735 5011869 5166696
58237 5166696 5334700 5513957 5704425 5908495 6126768 6357431 6600707 6859970 7137641
58228 7137641 7434007 7750798 8091744 8458895 8852753 9276631 9736367 10235420 10775362
58219 10775362 11361721 12003853 12708644 13480456 14328359 15267430 16312513 17478075 18785976
58210 18785976 20266983 21954452 23885670 26112761 28706616 31751592 35347043 39613854
58202 39613854 44683847 50674327 57678515 65776179 75030471 85462464 97044715 109736421
58194 109736421 123522957 138425011 154495517 171825059 190534071 210736951 232494125
58187 232494125 255717337 279932068 303927006 325574976 342137746 351022949 350593226
$$ packed form
58247D004221Q7773R3731J00033J04321J08464J15222J23727J32243J42134J54827
58237E166696J68004J79257J90468K04070K18273K30663K43276K59263K77671
58228G137641K96366L16791L40946L67151L93858M23878M59736M99053N39942
58219A0775362N86359O42132P04791P71812Q47903R39071J045083J165562J307901
58210A8785976J481007J687469J931218K227091K593855L044976L595451M266811
58202C9613854N069993N990480P004188Q097664R254292J0431993J1582251J2691706
58194A09736421J3786536J4902054J6070506J7329542J8709012K0202880K1757174
58187B32494125K3223212K4214731K3994938K1647970J6562770Q885203m29723
$$ plain form
58180 350593226 340629023 322336561 298006666 270455230 242385263 215867241 192101334
58173 192101334 171465662 153731668 138336724 124650219 112170802 100606365 89854396
58166 89854396 79942104 70956742 62969143 55977248 49905887 44648828 40100477 36158527
58158 36158527 32724653 29716866 27074137 24745225 22681759 20844756 19207369 17745634
58150 17745634 16432957 15246622 14172163 13197293 12307525 11490879 10741067 10052741 9418600
58141 9418600 8833697 8297350 7807974 7360440 6950680 6578165 6241417 5935344 5655240
58132 5655240 5399298 5165117 4947729 4743247 4550806 4369148 4195126 4027421 3867990
58123 3867990 3717833 3574818 3437499 3307519 3186138 3071659 2962293 2858451 2760292 2666029
$$ packed form
58180C50593226r964203j8292462k4329895k7551436k8069967k6518022k3765907
58173A92101334k0635672j7733994j5394944j3686505j2479417j1564437j0751969
58166H9854396r912292q985362p987599o991895o071361n257059m548351l941950
58158C6158527l433874l007787k642729k328912k063466j837003j637387j461735
58150A7745634j312677j186335j074459r74870q89768q16646p49812o88326o34141
58141I418600n84903n36347m89376m47534m09760l72515l36748l06073k80104
58132E655240k55942k34181k17388k04482j92441j81658j74022j67705j59431
58123C867990j50157j43015j37319j29980j21381j14479j09366j03842r8159r4263
$$ plain form
58113 2666029 2574735 2488076 2407342 2331263 2258485 2189611 2125191 2064172 2005930 1951395 1900645
58102 1900645 1851896 1804326 1759375 1717794 1677948 1638618 1600924 1565812 1532189 1499342 1468708
58091 1468708 1441274 1415427 1389408 1363915 1340303 1318074 1296081 1274535 1253939 1233641 1213208
58080 1213208 1193708 1175872 1158378 1139624 1119892 1100236 1080598 1060625 1041072 1022821 1005533
58069 1005533 988668 972724 958217 944495 930809 917543 905283 893782 882850 873064 864573 856353
58057 856353 847637 838943 830804 822787 814591 806672 798850 789913 779717 770096 762374 755419 747521 738763
58043 738763 730171 721951 714186 708004 704262 701899 699148 695679 692212 688866 685325 681894 678949 675800
58029 675800 671301 665187 657961 650111 642282 635425 629754 624264 618172 612136 607216 603486 600523 598319
$$ packed form
58113B666029r1294q6659q0734p6079p2778o8874o4420o1019n8242n4535n0750
58102A900645m8749m7570m4951m1581l9846l9330l7694l5112l3623l2847l0634
58091A468708k7434k5847k6019k5493k3612k2229k1993k1546k0596k0298k0433
58080A213208j9500j7836j7494j8754j9732j9656j9638j9973j9553j8251j7288
58069A005533j6865j5944j4507j3722j3686j3266j2260j1501j0932r786q491q220
58057H56353q716q694q139q017q196p919p822q937j0196r621p722o955p898q758
58043G38763q592q220p765o182l742k363k751l469l467l346l541l431k945l149
58029F75800m499o114p226p850p829o857n671n490o092o036m920l730k963k204
$$ plain form
58015 598319 596715 594780 591806 588220 584644 580824 576375 571755 567558 563606 559634 556045 553120 550336
58001 550336 547382 544993 543909 543851 544343 545489 547010 547530 545973 542836 539107 534926 530283 525982 522614
57986 522614 519574 516289 513504 512033 511171 509781 508070 506811 505614 503608 501253 499843 499531 499312 498646
57971 498646 497706 496392 494502 492663 491642 490907 489197 486452 483870 482167 481043 480373 480590 481640 482645
57956 482645 482939 482601 481825 480490 478601 476518 474586 472931 471483 469828 467327 463909 460406 457595 455345
57941 455345 453208 451244 449574 447736 445378 443121 441842 441501 441527 441901 442981 444669 446666 449108 451938
57926 451938 454151 454785 454400 454445 455329 456175 456339 456097 455833 455497 454954 454069 452487 450060 447451 445541 444320
57909 444320 443008 441088 438547 435364 431622 427986 425225 423313 421643 419933 418244 416356 413975 411387
$$ packed form
58015E98319j604j935k974l586l576l820m449m620m197l952l972l589k925k784
58001E50336k954k389j084n8M92J146J521N20j557l137l729m181m643m301l368
57986E22614l040l285k785j471q62j390j711j259j197k006k355j410l12k19o66
57971D98646r40j314j890j839j021p35j710k745k582j703j124o70K17J050J005
57956D82645K94l38p76j335j889k083j932j655j448j655k501l418l503k811k250
57941D55345k137j964j670j838k358k257j279l41K6L74J080J688J997K442K830
57926D51938K213O34l85M5Q84Q46J64k42k64l36n43q85j582k427k609j910j221
57909D44320j312j920k541l183l742l636k761j912j670j710j689j888k381k588
$$ plain form
57895 411387 409131 407147 404980 402608 400411 398542 397059 396330 396452 396540 395491 393302 390850 388650 386627
57880 386627 384789 383177 381419 379316 377534 376664 375862 373770 370676 368412 367839 367628 365976 362563 358402
57865 358402 354594 351664 349450 347187 344150 340468 336962 334208 332240 331054 330701 330882 331103 331345 332080
57850 332080 333734 336581 340882 346337 351661 355598 358364 361268 365014 369210 373429 377715 381906 385429
57836 385429 388051 390139 391914 393090 393342 392516 390350 386726 382274 378017 374249 370382 365893 360827 355413
57821 355413 349943 345024 341228 338455 336324 334991 334766 335060 334829 334062 333756 334256 334731 334587 334257 334137 333695
57804 333695 332251 329792 326405 321568 314717 306138 296862 288004 280386 274279 269230 264535 260134 256584
57790 256584 254069 251998 249731 247220 244793 242788 241375 240250 238578 235975 233464 232637 233830 235968
$$ packed form
57895D11387k256j984k167k372k197j869j483p29J22Q8j049k189k452k200k023
57880C86627j838j612j758k103j782q70q02k092l094k264n73k11j652l413m161
57865C58402l808k930k214k263l037l682l506k754j968j186l53J81K21K42P35
57850C32080J654K847M301N455N324L937K766K904L746M196M219M286M191L523
57836C85429K622K088J775J176K52q26k166l624m452m257l768l867m489n066n414
57821C55413n470m919l796k773k131j333k25K94k31p67l06N00M75j44l30j20m42
57804C33695j444k459l387m837o851q579r276q858p618o107n049m695m401l550
57790B56584k515k071k267k511k427k005j413j125j672k603k511q27J193K138
$$ plain form
57776 235968 238159 240436 242871 245145 247400 250405 254352 258409 262035 265812 270343 275145 279384 282959
57762 282959 286134 288684 290196 290853 291203 291479 291602 291569 291378 290852 289889 288577 286878 284674 282336 280668
57746 280668 279989 279796 279624 279592 279766 279728 279296 279001 279229 279444 278903 277711 276530 275587 274540 273146 271639 270574
57728 270574 270488 271381 272414 272682 272449 272931 274649 276779 278562 280431 282967 285556 287042 287277 287051 286747
57712 286747 285964 284407 282343 280117 277800 275385 272887 270191 267176 264057 261427 259952 260006 261266 262590
57697 262590 262786 261809 260839 260835 261435 261602 260902 259714 258575 257824 257550 257407 256704 255253 253974 254223 256609 260748
57679 260748 266086 272690 281328 292960 307955 325680 345114 365912 388489 413101 439541 468010
57667 468010 499634 535580 575908 619366 663438 703929 735105 751369 749355 728904 692830 646111
$$ packed form
57776B35968K191K277K435K274K255L005L947M057L626L777M531M802M239L575
57762B82959L175K550J512O57L50K76J23l3j91n26r63j312j699k204k338j668
57746B80668o79j93j72l2J74l8m32k95K28K15n41j192j181r43j047j394j507j065
57728B70574q6Q93J033K68k33M82J718K130J783J869K536K589J486K35k26l04
57712B86747p83j557k064k226k317k415k498k696l015l119k630j475N4J260J324
57697B62590J96r77r70mO00J67p00j188j139p51k74j43p03j451j279K49K386M139
57679B60748N338O604Q638J1632J4995J7725J9434K0798K2577K4612K6440K8469
57667D68010L1624L5946M0328M3458M4072M0491L1176J6264k014k0451l6074m6719
$$ plain form
57655 646111 594462 542631 493723 449799 412202 380981 354868 332647 314134 299384 287636
57644 287636 277766 269288 262220 256409 251655 248004 245213 242389 238982 235698 233642 232953 233064 233843 235406
57629 235406 237081 237732 237193 236446 236227 236214 235720 234530 232929 231470 230671 230392 229604 227439 224412 221862 220199
57612 220199 218506 215971 212973 210441 208730 207474 206135 204502 202894 201948 201896 202134 201846 200956 200061 199565
57596 199565 199373 199252 198890 197678 195178 191856 188777 186431 184393 182131 179558 176697 173460 170042 167015
57581 167015 164730 162998 161497 160086 158527 156310 153142 149424 146057 143773 142602 141846 140720 139147
57567 139147 137723 136685 135360 133102 130346 128130 126821 126060 125732 126123 127137 128210 129159 130336 131719
57552 131719 132617 132535 131742 130696 129603 128809 128944 130152 131693 132782 133417 133938 134165 133583 132226 130878 130368
$$ packed form
57655F46111n1649n1831m8908m3924l7597l1221k6113k2221j8513j4750j1748
57644B87636r870q478p068n811m754l651k791k824l407l284k056o89J11P79J563
57629B35406J675O51n39p47k19j3m94j190j601j459p99k79p88k165l027k550j663
57612B20199j693k535k998k532j711j256j339j633j608r46n2K38k88q90q95m96
57596A99565j92j21l62j212k500l322l079k346k038k262k573k861l237l418l027
57581A67015k285j732j501j411j559k217l168l718l367k284j171p56j126j573
57567A39147j424j038j325k258k756k216j309p61l28L91J014J073R49J177J383
57552A31719Q98q2p93j046j093p94J35J208J541J089O35N21K27n82j357j348n10
$$ plain form
57535 130368 130873 131914 132860 133473 133966 134504 134850 134729 134400 134391 134752 135011 134837 134275 133336 131990 130752 130659 132269
57516 132269 134991 137633 139360 140072 140295 140876 142282 143971 144860 144554 143704 143027 142603 142357 142559 143263 143765
57499 143765 143241 141720 139934 138374 136925 135282 133352 131304 129482 128083 126777 124937 122464 120068
57485 120068 118442 117506 116827 116378 116333 116427 116149 115496 114911 114467 113630 111964 109640 107140 104841 103024 101862
57468 101862 101106 100068 98270 95992 93985 92707 92027 91564 91068 90391 89375 88043 86795 86169 86360 87134
57452 87134 88269 89776 91518 92907 93375 93061 92660 92610 92731 92700 92483 92195 91899 91687 91691 91804 91639 90994 90126
57433 90126 89403 88882 88450 88147 88073 88161 88326 88760 89743 91184 92614 93648 94234 94446 94293 93835 93269 92707 92021
57414 92021 91059 89919 88869 87999 87169 86276 85359 84409 83315 82147 81242 80764 80404 79829 79236 79010 79015 78841
$$ packed form
57535A30368N05J041R46O13M93N38L46j21l29rL61K59j74n62r39j346j238r3J610
57516A32269K722K642J727P12K23N81J406J689Q89l06q50o77m24k46K02P04N02
57499A43765n24j521j786j560j449j643j930k048j822j399j306j840k473k396
57485A20068j626r36o79m49m5R4k78o53n85m44q37j666k324k500k299j817j162
57468A01862p56j038j798k278k007j278o80m63m96o77j016j332j248o26J91P74
57452H7134J135J507J742J389M68l14m01n0J21l1k17k88k96k12MJ13j65o45q68
57433I0126p23n21m32l03p4Q8J65M34R83J441J430J034N86K12j53m58n66n62o86
57414I2021r62j140j050q70q30q93r17r50j094j168r05m78l60n75n93k26Nj74
$$ plain form
57396 78841 78694 79245 80366 80865 80081 79083 79479 81412 83576 85028 86110 87616 89856 92721 95949 98971
57380 98971 101034 101838 101784 101410 100899 100271 99646 99110 98579 97928 97042 95721 93878 91885 90335 89371 88625 87858
57362 87858 87211 86727 86161 85481 85057 85066 85179 85172 85427 86377 87760 88859 89336 89401 89346 89256 89138 89027 88970 89032 89223
57341 89223 89338 89095 88547 88111 87953 87651 86811 85819 85591 86590 88374 90097 91232 91788 92095 92495 93136 93967
57323 93967 94844 95591 95978 95815 95205 94646 94742 95708 97121 98194 98450 98196 98187 98738 99352 99362 98654 97513 96083
57304 96083 94401 92789 91677 91070 90639 90261 90035 89816 89349 88911 89193 90320 91554 92232 92533 92984 93619
57287 93619 94066 94206 94349 94797 95457 95867 95553 94451 92862 90889 88163 84571 80995 78638 77600 76782
57271 76782 75311 73433 71815 70697 70059 69965 70302 70662 70936 71570 72874 74542 76247 78170 80448 82570
$$ packed form
57396G8841j47N51J121M99p84r98L96J933K164J452J082J506K240K865L228L022
57380I8971K063Q04n4l74n11o28o25n36n31o51q86j321j843j993j550r64p46p67
57362H7858o47m84n66o80m24RJ13pK55R50J383J099M77O5n5r0j18j11n7O2J91
57341H9223J15k43n48m36j58l02q40r92k28R99J784J723J135N56L07M00O41Q31
57323I3967Q77P47L87j63o10n59R6R66J413J073K56k54rN51O14J0p08j141j430
57304I6083j682j612j112o07m31l78k26k19m67m38K82J127J234O78L01M51O35
57287I3619M47J40J43M48O60M10l14j102j589j973k726l592l576k357j038q18
57271G6782j471j878j618j118o38r4L37L60K74O34J304J668J705J923K278K122
$$ plain form
57255 82570 83931 84670 85384 86235 86922 87363 87916 88955 90532 92360 93900 94712 94973 95399 96400 97630 98607
57238 98607 99382 100254 101235 102242 103497 105295 107618 110266 113001 115246 116171 115636 114670 114411 114864 115255 115263
57221 115263 115266 115652 116528 117957 119818 121548 122591 123025 123242 123176 122385 120827 118990 117315 115989 115221 115211
57204 115211 115857 116891 118196 119678 121059 122303 123942 126411 129288 131819 133970 136241 138636 140647
57190 140647 142242 144016 146239 148570 150950 153999 158173 163111 168232 173497 179211 185437 191970 198655
57176 198655 205464 212449 219787 227701 236307 245719 256178 267747 279952 292243 304837 318658 334389
57163 334389 352037 371545 393362 418212 446806 480043 519162 565319 619040 679996 746977
57152 746977 818026 891130 965101 1039668 1114513 1188404 1259337 1325415 1385569 1439660 1488073
$$ packed form
57255H2570J361P39P14Q51O87M41N53J039J577J828J540Q12K61M26J001J230R77
57238I8607P75Q72R81J007J255J798K323K648K735K245R25n35r66k59M53L91Q
57221A15263LL86Q76J429J861J730J043M34K17o6p91j558j837j675j326p68j0
57204A15211O46J034J305J482J381J244J639K469K877K531K151K271K395K011
57190A40647J595J774K223K331K380L049M174M938N121N265N714O226O533O685
57176A98655O809O985P338P914Q606R412J0459J1569J2205J2291J2594J3821J5731
57163C34389J7648J9508K1817K4850K8594L3237L9119M6157N3721O0956O6981
57152G46977P1049P3104P3971P4567P4845P3891P0933O6078O0154N4091M8413
$$ plain form
57141 1488073 1531317 1570301 1607151 1645374 1688776 1740193 1801374 1873346 1955981 2047182 2143291
57130 2143291 2240638 2336497 2428900 2516571 2599499 2679093 2757288 2835645 2915384 2997792 3084206
57119 3084206 3175706 3272992 3376500 3486640 3604138 3730152 3865965 4012849 4172688 4348697
57109 4348697 4545268 4767341 5020504 5311713 5649579 6044096 6506772 7051299 7693835
57100 7693835 8452381 9345686 10391837 11606546 13001518 14583295 16352317 18302368
57092 18302368 20421636 22695465 25108444 27643768 30280422 32989051 35725811 38425808
57084 38425808 41002017 43352960 45373636 46962643 48028087 48500125 48347664 47585697
57076 47585697 46266719 44466227 42274536 39793457 37128781 34378003 31621834 28923852
$$ packed form
57141A488073M3244L8984L6850L8223M3402N1417O1181P1972Q2635R1201R6109
57130B143291R7347R5859R2403Q7671Q2928P9594P8195P8357P9739Q2408Q6414
57119C084206R1500R7286J03508J10140J17498J26014J35813J46884J59839J76009
57109D348697J96571K22073K53163K91209L37866L94517M62676N44527O42536
57100G693835P58546Q93305J046151J214709J394972J581777J769022J950051
57092A8302368K119268K273829K412979K535324K636654K708629K736760K699997
57084C8425808K576209K350943K020676J589007J065444M72038j52461p61967
57076D7585697j318978j800492k191691k481079k664676k750778k756169k697982
$$ plain form
57068 28923852 26333750 23889145 21616284 19531532 17643034 15951632 14451717 13132500
57060 13132500 11978989 10972723 10093377 9321134 8638224 8029127 7480606 6982055 6525399
57051 6525399 6104456 5714666 5353285 5018950 4710538 4426475 4164915 3924000 3701691
57042 3701691 3495676 3303493 3122624 2950698 2786102 2628445 2478188 2336092 2203290
57033 2203290 2081286 1970987 1871831 1782658 1703314 1634598 1576636 1528287 1488410 1456746 1433067
57022 1433067 1416376 1405914 1402647 1408675 1424402 1445883 1464553 1469728 1452680 1410145 1345287 1265687
57010 1265687 1180002 1095400 1016699 946601 886051 834342 789542 749658 713809 682127 654523
56999 654523 630112 608151 588943 573141 560437 549544 539357 529540 520159 511467 504027 498318
$$ packed form
57068B8923852k590102k444605k272861k084752j888498j691402j499915j319217
57060A3132500j153511j006266q79346p72243o82910o09097n48521m98551m56656
57051F525399m20943l89790l61381l34335l08412k84063k61560k40915k22309
57042C701691k06015j92183j80869j71926j64596j57657j50257j42096j32802
57033B203290j22004j10299r9156q9173p9344o8716n7962m8349l9877l1664k3679
57022A433067j6691j0462l267O028J5727K1481J8670N175j7048m2535o4858p9600
57010A265687q5685q4602p8701p0098o0550n1709m4800l9884l5849l1682k7604
56999F54523k4411k1961j9208j5802j2704j0893j0187r817r381q692p440n709
$$ plain form
56987 498318 494049 490409 487103 484637 483428 483236 483531 483721 482734 479014 471563 460785 448028 434535
56973 434535 420976 407616 394622 382458 372056 364266 359019 355494 353185 352285 352828 354216 356075
56960 356075 359001 363839 370628 378799 387960 397660 406636 413079 415693 413996 407818 397361 383908 369714
56946 369714 356758 345850 337010 330135 325118 321832 320446 321435 324966 330561 337729 346639 357715 370769
56932 370769 384998 399815 415167 430807 445500 457127 463570 463532 456788 443928 426028 404568
56920 404568 381543 359178 339127 321920 307369 295358 285927 278598 272232 265865 259456 253520 248272
56907 248272 243470 238978 235007 231738 228964 226261 223388 220481 217994 216442 216058 216689 218169 220726 224729
56892 224729 230029 235896 241819 248164 255713 264690 274501 284371 293858 302580 309779 314608 316814 316759 314633
$$ packed form
56987D98318m269l640l306k466j209j92K95J90r87l720p451j0778j2757j3493
56973D34535j3559j3360j2994j2164j0402p790n247l525k309r00N43J388J859
56960C56075K926M838O789Q171R161R700Q976O443K614j697o178j0457j3453j4194
56946C69714j2956j0908q840o875n017l286j386R89L531N595P168Q910J1076J3054
56932C70769J4229J4817J5352J5640J4693J1627O443l8o744j2860j7900k1460
56920D04568k3025k2365k0051j7207j4551j2011r431p329o366o367o409n936n248
56907B48272m802m492l971l269k774k703k873k907k487j552l84O31J480K557M003
56892B24729N300N867N923O345P549Q977R811R870R487Q722P199M829K206n5k126
$$ plain form
56877 314633 310150 303455 296040 290059 286667 285543 286150 288728 293700 300768 309324 319357 331222 344754
56863 344754 359436 375404 393486 414043 436318 459049 481039 500836 516387 525474 526497 519068
56851 519068 504521 485979 467154 450606 437323 427861 423080 423483 428666 438001 451298 468285 488086
56838 488086 510014 534462 562290 593545 627452 663328 700535 737298 770103 794488 806448
56827 806448 803654 786251 756817 719320 677896 636415 598290 565744 539244 518218 502340 491731
56815 491731 486220 485188 488201 495158 505751 519435 536077 555973 578834 603181 626945 648128
56803 648128 664452 672938 670731 656739 632370 600765 565472 529720 496310 467359 443684 424583
56791 424583 408770 395701 385764 379266 375829 375105 377410 382996 391056 400186 409769 420113 431054
$$ packed form
56877C14633m483o695p415n981l392j124O07K578M972P068Q556J0033J1865J3532
56863C44754J4682J5968J8082K0557K2275K2731K1990J9797J5551R087J023p429
56851E19068j4547j8542j8825j6548j3283r462m781M03N183R335J3297J6987J9801
56838D88086K1928K4448K7828L1255L3907L5876L7207L6763L2805K4385J1960
56827H06448k794j7403k9434l7497m1424m1481l8125l2546k6500k1026j5878j0609
56815D91731n511j032L013O957J0593J3684J6642J9896K2861K4347K3764K1183
56803F48128J6324Q486k207j3992k4369l1605l5293l5752l3410k8951k3675j9101
56791D24583j5813j3069r937o498l437p24K305N586Q060R130R583J0344J0941
$$ plain form
56778 431054 441002 447622 449185 445109 435646 421424 403255 382198 359663 337158 315771 296015
56766 296015 278283 263025 250212 239039 228750 219493 211776 205334 199249 193162 187611 183096 179420
56753 179420 176120 172979 169947 167106 164895 163807 163620 163382 162392 160762 158840 156672 154333 152307 151010
56738 151010 150233 149448 148511 147717 147273 146987 146449 145367 143840 142313 141155 140286 139425 138635 138290 138535 139132
56721 139132 139903 140911 142174 143627 145421 147758 150243 151948 152439 152399 152844 154026 155354 156166 156238 155753
56705 155753 155130 154773 154741 154752 154585 154385 154472 155031 155980 156935 157241 156395 154612 152720 151349 150379 149340 148123
56687 148123 147133 146891 147544 148687 149669 150230 150708 151430 152149 152442 152426 152490 152510 152033 151276 151123 151954 153199 154295
56668 154295 155366 156538 157353 157479 157452 158061 159381 160962 162605 164322 165811 166647 166876 166877 166730 166292 165872
$$ packed form
56778D31054R948O620J563m076r463j4222j8169k1057k2535k2505k1387j9756
56766B96015j7732j5258j2813j1173j0289r257p717o442o085o087n551m515l676
56753A79420l300l141l032k841k211j088j87k38r90j630j922k168k339k026j297
56738A51010p77p85r37p94m44k86n38j082j527j527j158q69q61p90l45K45N97
56721A39132P71J008J263J453J794K337K485J705M91m0M45J182J328Q12P2m85
56705A55753o23l57l2J1j67k00Q7N59R49R55L06q46j783j892j371r70j039j217
56687A48123r90k42O53J143R82N61M78P22P19K93j6O4K0m77p57j53Q31J245J096
56668A54295J071J172Q15J26k7O09J320J581J643J717J489Q36K29Jj47m38m20
$$ plain form
56651 165872 166273 167952 170465 172869 174561 175708 176978 178778 180678 181721 181419 180223 178911 177829 176981
56636 176981 176496 176554 176981 177348 177470 177532 177717 177961 178087 177980 177587 176868 175817 174534 173275 172322 171751 171393
56618 171393 171182 171331 171909 172454 172436 172008 171743 171673 171184 170027 168826 168290 168385 168608 168656 168558 168453 168510 168800 169063
56598 169063 168973 168701 168770 169240 169652 169925 170599 171831 172843 172919 172368 171961 171903 171992 172336 173174 174289 175239 175990
56579 175990 176815 177742 178572 179281 179994 180820 182011 183888 186223 188190 189443 190782 193090 196068 198746 200870
56563 200870 203003 205523 208392 211763 215969 220912 226219 231972 238552 245652 252154 257117 260393 262227
56549 262227 262860 262653 262062 261315 260426 259528 258825 258339 258092 258279 258721 258480 256829 254485 252999 252839 252952 252394
56531 252394 251478 250926 250669 250107 249040 247711 246173 244155 241504 238446 235406 232654 230050 227210 224091
$$ packed form
56651A65872M01J679K513K404J692J147J270J800J900J043l02j196j312j082q48
56636A76981m85N8M27L67J22O2J85K44J26j07l93p19j051j283j259r53n71l58
56618A71393k11J49N78N45j8m28k65p0m89j157j201n36R5K23M8r8j05N7K90K63
56598A69063r0k72O9M70M12K73O74J232J012P6n51m07n8Q9L44Q38J115R50P51
56579A75990Q25R27Q30P09P13Q26J191J877K335J967J253J339K308K978K678K124
56563B00870K133K520K869L371M206M943N307N753O580P100O502M963L276J834
56549B62227O33k07n91p47q89q98p03m86k47J87M42k41j651k344j486j60J13n58
56531B52394r16n52k57n62j067j329j538k018k651l058l040k752k604k840l119
$$ plain form
56516 224091 221274 219330 218054 216784 215415 214522 214383 214465 214120 213280 212237 211182 210248 209656 209407 209069 208130
56499 208130 206529 204659 203033 202044 201839 202294 203169 204291 205430 206125 205999 205281 204694 204770 205484 206528 207590
56482 207590 208346 208583 208468 208435 208696 209073 209366 209614 209921 210265 210550 210705 210743 210866 211404 212468 213848 215444
56464 215444 217525 220112 222457 223714 223991 224094 224294 224032 222927 221342 219814 218556 217774 217820 218620 219483
56448 219483 219903 220161 220754 221602 222220 222386 222208 221745 220981 220088 219377 219062 219243 219946 220919 221495 221073 219788
56430 219788 218567 218363 219358 220904 222162 222773 222939 223025 223357 224359 226453 229492 232568 234728 235793 236218
56414 236218 236355 236221 235877 235604 235716 236419 237777 239509 240998 241883 242473 243260 244170 244760 244896 244697 244004 242578
56396 242578 240781 239395 238676 238215 237819 237878 238651 239791 240854 241781 242593 243101 243231 243254 243389 243444 243228 243086
$$ packed form
56516B24091k817j944j276j270j369q93j39Q2l45q40j043j055r34n92k49l38r39
56499B08130j601j870j626r89k05M55Q75J122J139O95j26p18n87P6P14J044J062
56482B07590P56K37j15l3K61L77K93K48L07L44K85J55L8J23N38J064J380J596
56464B15444K081K587K345J257K77J03K00k62j105j585j528j258p82M6Q00Q63
56448B19483M20K58N93Q48O18J66j78m63p64q93p11l15J81P03R73N76m22j285
56430B19788j221k04R95J546J258O11J66Q6L32J002K094L039L076K160J065M25
56414B36218J37j34l44k73J12P03J358J732J489Q85N90P87R10N90J36j99o93j426
56396B42578j797j386p19m61l96N9P73J140J063R27Q12N08J30K3J35N5k16j42
$$ plain form
56378 243086 243735 245610 248445 251435 253834 255574 257230 259228 261271 262775 263602 263990 264060 263939 264159 265260
56362 265260 267065 268953 270751 272709 274674 276090 276912 277690 278589 279098 278985 278867 279382 280376 281267 281755 281864
56345 281864 281726 281655 282059 283048 284443 286245 288670 291577 294371 296610 298303 299631 300891 302699 305473
56330 305473 308625 310987 312272 313368 314958 316703 318111 319357 320659 321589 321686 321286 321102 321386 321949 322609
56314 322609 323081 322803 321413 319226 316966 315317 314851 315863 317960 320302 322533 325009 327815 330266 331801
56299 331801 332805 333985 335415 336758 338029 339584 341589 343952 346543 349230 351949 354896 358237 361482
56285 361482 363777 365051 366249 368077 370240 372384 375085 379185 384620 390537 396212 401394 406156 410898
56271 410898 416127 421837 427515 433042 438950 445384 451535 456759 461575 466832 472409 477580 482282 487230
$$ packed form
56378B43086O49J875K835K990K399J740J656J998K043J504Q27L88P0j21K20J101
56362B65260J805J888J798J958J965J416Q22P78Q99N09j13j18N15R94Q91M88J09
56345B81864j38p1M04R89J395J802K425K907K794K239J693J328J260J808K774
56330C05473L152K362J285J096J590J745J408J246J302R30R7m00j84K84N63O60
56314C22609M72k78j390k187k260j649m66J012K097K342K231K476K806K451J535
56299C31801J004J180J430J343J271J555K005K363K591K687K719K947L341L245
56285C61482K295J274J198J828K163K144K701M100N435N917N675N182M762M742
56271D10898N229N710N678N527N908O434O151N224M816N257N577N171M702M948
$$ plain form
56257 487230 492998 499643 507033 514972 523268 532172 542470 554656 568431 583487 600357 619805 641803
56244 641803 665762 691501 719293 749171 780813 813955 848402 883740 919424 954930 989550
56233 989550 1022371 1052786 1080580 1105192 1125459 1140477 1150107 1154201 1152150 1143891 1130618 1113617
56221 1113617 1092969 1068304 1040320 1010524 979800 948214 916021 883941 852552 822217 793531
56210 793531 767097 742906 720513 699701 680458 662563 645833 630517 616905 604796 593863
56199 593863 584195 575891 568535 561748 555825 551116 547140 543099 538977 535421 532790 531000 529977 529594
56185 529594 529498 529623 530490 532315 534289 535512 536202 537185 538736 540760 543521 547081 550448 552515 553642 555215
56169 555215 557816 560891 564077 567678 571762 575823 579529 583063 586662 590504 594968 600310 606157 611999
$$ packed form
56257D87230N768O645P390P939Q296Q904J0298J2186J3775J5056J6870J9448K1998
56244F41803K3959K5739K7792K9878L1642L3142L4447L5338L5684L5506L4620
56233I89550L2821L0415K7794K4612K0267J5018R630M094k051q259j3273j7001
56221A113617k0648k4665k7984k9796l0724l1586l2193l2080l1389l0335k8686
56210G93531k6434k4191k2393k0812j9243j7895j6730j5316j3612j2109j0933
56199E93863r668q304p356o787n923m709l976m041m122l556k631j790j023l83
56185E29594r6J25Q67J825J974J223O90R83J551K024K761L560L367K067J127J573
56169E55215K601L075L186L601M084M061L706L534L599L842M464N342N847N842
$$ plain form
56155 611999 617951 624403 631228 638158 645571 654028 663307 672816 682632 693167 704056 714497 724602
56142 724602 735454 747920 762226 778522 796934 817282 839675 865103 894498 927584 963797
56131 963797 1004039 1050224 1103205 1162303 1226804 1296548 1370865 1447983 1525595 1601095 1671425
56120 1671425 1733963 1787896 1833903 1872573 1904074 1929090 1948715 1963107 1971283 1972421 1966596 1954318
56108 1954318 1936358 1914063 1888883 1861449 1831697 1799480 1764109 1723776 1676807 1623525 1566030
56097 1566030 1506522 1446927 1389567 1336598 1288845 1246453 1210371 1181705 1159838 1142782 1129363
56086 1129363 1119532 1112741 1107799 1104386 1102914 1102693 1102009 1100430 1099465 1100431 1103120 1106989 1112265 1119370 1128391
56071 1128391 1139455 1152544 1166812 1181231 1195934 1211684 1228229 1244692 1261365 1279332 1298250
$$ packed form
56155F11999N952O452O825O930P413Q457R279R509R816J0535J0889J0441J0105
56142G24602J0852J2466J4306J6296J8412K0348K2393K5428K9395L3086L6213
56131I63797M0242M6185N2981N9098O4501O9744P4317P7118P7612P5500P0330
56120A671425O2538N3933M6007L8670L1501K5016J9625J4392Q176J138n825j2278
56108A954318j7960k2295k5180k7434k9752l2217l5371m0333m6969n3282n7495
56097A566030n9508n9595n7360n2969m7753m2392l6082k8666k1867j7056j3419
56086A129363r831o791m942l413j472k21o84j579r65R66K689L869N276P105R021
56071A128391J1064J3089J4268J4419J4703J5750J6545J6463J6673J7967J8918
$$ plain form
56060 1298250 1316372 1333099 1349803 1367745 1386758 1406237 1425855 1444987 1462979 1480278 1497903
56049 1497903 1515753 1532957 1549805 1567647 1587011 1607583 1629738 1653999 1679212 1703689 1728164
56038 1728164 1755157 1785261 1816627 1848332 1881607 1917288 1954806 1994225 2036565 2081356 2126567
56027 2126567 2171730 2218436 2267085 2316053 2364985 2415897 2469817 2525238 2581268 2639407 2700725
56016 2700725 2764061 2828655 2895996 2967448 3042419 3120298 3201777 3286937 3374639 3465189 3560972
56005 3560972 3663225 3770932 3884064 4004707 4133612 4269018 4410647 4561540 4724072
55996 4724072 4897534 5081624 5278783 5490772 5716209 5953899 6205462 6472637 6755566
55987 6755566 7056062 7378931 7727539 8101707 8502504 8935285 9405433 9915212 10467833
$$ packed form
56060A298250J8122J6727J6704J7942J9013J9479J9618J9132J7992J7299J7625
56049A497903J7850J7204J6848J7842J9364K0572K2155K4261K5213K4477K4475
56038A728164K6993L0104L1366L1705L3275L5681L7518L9419M2340M4791M5211
56027B126567M5163M6706M8649M8968M8932N0912N3920N5421N6030N8139O1318
56016B700725O3336O4594O7341P1452P4971P7879Q1479Q5160Q7702R0550R5783
56005C560972J02253J07707J13132J20643J28905J35406J41629J50893J62532
55996D724072J73462J84090J97159K11989K25437K37690K51563K67175K82929
55987F755566L00496L22869L48608L74168M00797M32781M70148N09779N52621
$$ plain form
55978 10467833 11070702 11731752 12456836 13253880 14135627 15115738 16207459 17429875 18811364
55969 18811364 20384914 22187008 24266030 26687821 29532305 32893597 36886171 41638245
55961 41638245 47268740 53874654 61540006 70336766 80300476 91415237 103640415 116952053
55953 116952053 131356760 146886960 163607039 181619529 201045584 221980987 244402158
55946 244402158 267938885 291522496 313161001 330167135 339864684 340407442 331295608
55939 331295608 313454114 288965339 260561988 230985960 202422188 176235977 153048403
55932 153048403 132971038 115818624 101256694 88909813 78428025 69503405 61866001
55925 61866001 55289004 49593520 44636877 40298493 36479921 33107481 30122911 27472790
$$ packed form
55978A0467833O02869O61050P25084P97044Q81747R80111J091721J222416J381489
55969A8811364J573550J802094K079022K421791K844484L361292L992574M752074
55961D1638245N630495O605914P665352Q796760R963710J1114761J2225178J3311638
55953A16952053J4404707J5530200J6720079J8012490J9426055K0935403K2421171
55946B44402158K3536727K3583611K1638505J7006134R697549N42758r111834
55939C31295608j7841494k4488775k8403351k9576028k8563772k6186211k3187574
55932A53048403k0077365j7152414j4561930j2346881j0481788q924620p637404
55925F1866001o576997n695484m956643m338384l818572l372440k984570k650121
$$ plain form
55917 27472790 25110332 23000202 21113870 19423352 17903811 16537330 15308450 14199254
55909 14199254 13193028 12278874 11448265 10690411 9995123 9356941 8772345 8235545 7740550
55900 7740550 7284610 6866145 6481649 6127667 5803199 5507128 5235669 4985097 4754508
55891 4754508 4543228 4348105 4166173 3997464 3842239 3697702 3560320 3429304 3305085
55882 3305085 3186469 3072184 2963453 2862226 2768348 2680836 2600137 2526475 2457409 2389626
55872 2389626 2321964 2254652 2187081 2118716 2050868 1985187 1921548 1859443 1800156 1745245 1693954
55861 1693954 1644411 1596565 1551890 1510933 1473001 1437592 1404445 1372881 1342637 1314580 1289209
55850 1289209 1265343 1241549 1217797 1194359 1170416 1145334 1120124 1095942 1072289 1048345 1024949
$$ packed form
55917B7472790k362458k110130j886332j690518j519541j366481j228880j109196
55909A4199254j006226r14154q30609p57854o95288o38182n84596n36800m94995
55900G740550m55940m18465l84496l53982l24468k96071k71459k50572k30589
55891D754508k11280j95123j81932j68709j55225j44537j37382j31016j24219
55882C305085j18616j14285j08731j01227r3878q7512q0699p3662o9066o7783
55872B389626o7662o7312o7571o8365o7848o5681o3639o2105n9287n4911n1291
55861A693954m9543m7846m4675m0957l7932l5409l3147l1564l0244k8057k5371
55850A289209k3866k3794k3752k3438k3943k5082k5210k4182k3653k3944k3396
$$ plain form
55839 1024949 1003425 983484 964140 945751 929204 913863 898351 882842 868699 856229 844498
55828 844498 833025 822047 811401 800662 790153 780429 770991 760751 749521 737942 726339 714771
55816 714771 703758 693805 684592 675695 667589 660878 655020 648982 642667 636617 630869 625213 620094 616151
55802 616151 613324 611412 610925 612321 615009 618124 621669 625794 629716 632582 634738 636832 638288 638020 636084
55787 636084 633231 629297 623499 615970 607676 599105 590344 582073 575138 569356 563878 558355 552519 545180
55773 545180 535247 523504 511908 501316 491353 482291 475282 470555 467025 464030 462069 461401 461227 460775
55759 460775 460162 459597 458624 456642 453492 449212 443814 437498 430448 422379 413014 403018 393669 385498 377983
55744 377983 370596 363367 356388 349632 343437 338382 334492 331205 328271 325987 324398 322923 320996 318581
$$ packed form
55839A024949k1524j9941j9344j8389j6547j5341j5512j5509j4143j2470j1731
55828H44498j1473j0978j0646j0739j0509r724r438j0240j1230j1579j1603j1568
55816G14771j1013r953r213q897q106o711n858o038o315o050n748n656n119l943
55802F16151k827j912m87J396K688L115L545M125L922K866K156K094J456k68j936
55787F36084k853l934n798p529q294q571q761q271o935n782n478n523n836p339
55773E45180r933j1743j1596j0592r963r062p009m727l530k995j961o68j74m52
55759D60775o13n65r73j982l150m280n398o316p050q069r365r996r349q171p515
55744C77983p387p229o979o756o195n055l890l287k934k284j589j475j927k415
$$ plain form
55730 318581 316003 313698 312093 311273 310821 310462 310573 311486 312556 312701 311662 310002 308113 306146 304671 304351
55714 304351 304816 304798 303561 301478 299192 297006 295195 294063 293483 293050 292790 293024 293496 293390 292316 290554
55698 290554 288250 285163 281347 277327 273401 269430 265493 262005 258966 255835 252449 249444 247480 246545
55684 246545 246265 246396 246789 247327 248070 249084 250095 250767 251241 251874 252463 252390 251523 250346 249221 248262 247896 248656
55666 248656 250200 251394 251657 251551 251793 252432 253310 254605 256485 258855 261831 265808 270604 275145 278556
55651 278556 281145 283821 286966 290368 293868 297473 301006 304138 306711 308726 310049 310354 309322 306875
55637 306875 303348 299380 295381 291116 286125 280501 274889 269717 264921 260427 256401 252881 249628 246591
55623 246591 244090 242385 241393 240947 240881 240748 239969 238577 237444 237412 238410 239572 240049 239541 238277 236628 234617
$$ packed form
55730C18581k578k305j605q20m52l59J11R13J070J45j039j660j889j967j475l20
55714C04351M65j8j237k083k286k186j811j132n80m33k60K34M72j06j074j762
55698B90554k304l087l816m020l926l971l937l488l039l131l386l005j964r35
55684B46545k80J31L93N38P43J014J011O72M74O33N89p3q67j177j125r59l66P60
55666B48656J544J194K63j06K42O39Q78J295J880K370K976L977M796M541L411
55651B78556K589K676L145L402L500L605L533L132K573K015J323L05j032k447
55637C06875l527l968l999m265m991n624n612n172m796m494m026l520l253l037
55623B46591k501j705r92m46o6j33p79j392j133l2R98J162M77n08j264j649k011
$$ plain form
55606 234617 231847 228106 223900 220018 216677 213523 210399 207531 204978 202505 200162 198368 197170 195881
55592 195881 193810 190991 188027 185500 183693 182515 181541 180457 179571 179487 180262 181312 182266 183402 185025 186889
55576 186889 188524 189778 190800 191794 193000 194590 196414 198180 200021 202544 206142 210510 214940 218786
55562 218786 221688 223784 225760 228162 230481 231429 230360 227957 225327 222882 220433 217868 215321 212921
55548 212921 210717 208707 206789 204897 203241 202037 200920 199077 196175 192761 189518 186568 183739 181065
55534 181065 178647 176342 173959 171651 169886 169092 169331 170118 170669 170674 170685 171287 172080 172201 171809 172053 173333 174512
55516 174512 174348 172952 171224 169549 167748 165781 163769 161674 159655 158376 158269 158692 158525 157542 156653 156769
55500 156769 157800 158754 158583 157122 155382 154660 155101 155545 155043 153976 153279 153216 153603 154639 156527 158535 159444
$$ packed form
55606B34617k770l741m206l882l341l154l124k868k553k473k343j794j198j289
55592A95881k071k819k964k527j807j178r74j084q86q4P75J050R54J136J623J864
55576A86889J635J254J022R94J206J590J824J766J841K523L598M368M430L846
55562B18786K902K096J976K402K319R48j069k403k630k445k449k565k547k400
55548B12921k204k010j918j892j656j204j117j843k902l414l243k950k829k674
55534A81065k418k305k383k308j765p94K39P87N51NJ1O02P93J21l92K44J280J179
55516A74512j64j396j728j675j801j967k012k095k019j279j07M23j67r83q89J16
55500A56769J031R54j71j461j740p22M41M44n02j067o97o3L87J036J888K008R09
$$ plain form
55483 159444 158938 157777 156600 155471 154704 155149 157148 159828 161946 163057 163494 163626 163589 163508 163513 163583 163603 163459
55465 163459 162987 162054 160957 160437 160916 161791 161951 161096 160199 160450 161976 163869 165299 166175 166683 166629 165586
55448 165586 163487 160756 158038 156053 155495 156506 158277 159659 160284 160631 160940 160692 159525 158051 157189 157026
55432 157026 156923 156573 156241 156026 155647 155244 155745 157802 160600 162326 162001 160417 158999 158170 157359 156442 156352
55415 156352 157894 160566 163209 165442 167734 170179 172106 173104 173690 174559 175706 176697 177357 177680 177456 176525
55399 176525 175246 174179 173337 172190 170429 168430 166877 166179 166363 167329 168923 170690 171744 171264 169359
55384 169359 167187 165935 165768 166017 166098 165776 164840 163282 161786 161240 161592 161849 161465 161021 161222 161909 162506 162793
55366 162793 162747 162195 161233 160478 160293 160221 159809 159488 159872 160566 160539 159491 158069 156915 156251 156283 157128 158271 158916
$$ packed form
55483A59444n06j161j177j129p67M45J999K680K118J111M37J32l7q1NP0K0j44
55465A63459m72r33j097n20M79Q75J60q55q97K51J526J893J430Q76N08n4j043
55448A65586k099k731k718j985n58J011J771J382O25L47L09k48j167j474q62j63
55432A57026j03l50l32k15l79m03N01K057K798J726l25j584j418q29q11r17r0
55415A56352J542K672K643K233K292K445J927R98N86Q69J147R91O60L23k24r31
55399A76525j279j067q42j147j761j999j553o98J84R66J594J767J054m80j905
55384A69359k172j252j67K49Q1l22r36j558j496n46L52K57l84m44K01O87N97K87
55366A62793m6n52r62p55j85p2m12l21L84O94k7j048j422j154o64L2Q45J143O45
$$ plain form
55347 158916 159058 159458 160344 160808 159963 158179 156719 156395 156925 157449 157343 156635 155824 155327 155042 154500 153389 151833
55329 151833 150253 149116 148705 148971 149614 150428 151411 152475 153286 153660 153877 154298 154833 155082 154853 154225 153288 152230
55311 152230 151558 151754 152645 153451 153594 153275 153234 154034 155550 157066 157923 158083 157913 157569 157008 156592 156997 158280
55293 158280 159626 160432 161040 161931 162862 163452 164067 165225 166581 167411 167783 168250 168592 167975 166391 164929 164418
55276 164418 164652 165123 165636 165961 165698 164873 164014 163344 162555 161597 160940 160755 160539 159965 159378 159061 158715 158184 158034
55257 158034 158796 160142 161437 162584 163727 164587 164779 164543 164401 164289 163661 162388 161035 160233 160138 160436 160551
55240 160551 159976 158744 157456 156622 156200 156011 156203 156864 157501 157542 157158 156970 157010 156577 155213 153296 151551 150416
55222 150416 150029 150368 151150 151893 152364 152801 153532 154565 155686 156729 157539 157828 157408 156515 155738 155576 156178 157464
$$ packed form
55347A58916J42M00Q86M64q45j784j460l24N30N24j06p08q11m97k85n42j111j556
55329A51833j580j137m11K66O43Q14R83J064Q11L74K17M21N35K49k29o28r37j058
55311A52230o72J96Q91Q06J43l19m1Q00J516J516Q57J60j70l44n61m16M05J283
55293A58280J346Q06O08Q91R31N90O15J158J356Q30L72M67L42o17j584j462n11
55276A64418K34M71N13L25k63q25q59o70p89r58o57j85k16n74n87l17l46n31j50
55257A58034P62J346J295J147J143Q60J92k36j42j12o28j273j353q02r5K98J15
55240A60551n75j232j288q34m22j89J92O61O37M1l84j88M0m33j364j917j745j135
55222A50416l87L39P82P43M71M37P31J033J121J043Q10K89m20q93p77j62O02J286
$$ plain form
55204 157464 159241 161042 162104 161879 160621 159219 158375 158142 158332 158982 160110 161309 162009 162059 161653 160850 159599
55187 159599 158236 157387 157287 157587 157920 158217 158371 158147 157664 157472 157850 158402 158724 159026 159701 160634 161493 162434
55169 162434 163921 165883 167588 168465 168700 168921 169558 170564 171546 172103 172170 172077 172256 172940 174114 175581 176996
55152 176996 178037 178676 179094 179259 178891 177953 176813 175683 174298 172476 170651 169425 168847 168589 168577 168893 169245
55135 169245 169147 168631 168229 168156 168019 167487 166785 166321 166167 166101 165892 165394 164637 163971 163810 164136 164540 164837 165262 165860
55115 165860 166090 165424 164050 162598 161352 160198 159259 159032 159708 160800 161698 162369 163149 163962 164245 163776 163259
55098 163259 163686 165204 166930 167935 168134 168059 168070 168066 167854 167448 166967 166512 166257 166501 167399 168640 169524 169477 168544
55079 168544 167380 166642 166392 166130 165408 164308 163249 162555 162324 162595 163377 164512 165696 166706 167555 168404 169345
$$ packed form
55204A57464J777J801J062k25j258j402q44k33J90O50J128J199P00N0m06q03j251
55187A59599j363q49j00L00L33K97J54k24m83j92L78N52L22L02O75R33Q59R41
55169A62434J487J962J705Q77K35K21O37J006R82N57O7r3J79O84J174J467J415
55152A76996J041O39M18J65l68r38j140j130j385j822j825j226n78k58j2L16L52
55135A69245r8n16m02p3j37n32p02m64j54o6k09m98p57o66j61L26M04K97M25N98
55115A65860K30o66j374j452j246j154r39k27O76J092Q98O71P80Q13K83m69n17
55098A63259M27J518J726J005J99p5J1mk12m06m81m55k55K44Q98J241Q84m7r33
55079A68544j164p38k50k62p22j100j059o94k31K71P82J135J184J010Q49Q49R41
$$ plain form
55062 169345 170275 170932 171119 170948 170823 171119 171867 172711 173104 172637 171389 170032 169316 169312 169329 168728 167581 166384
55044 166384 165401 164655 164412 165178 167133 169806 172412 174316 175223 175176 174438 173261 171799 170425 169893 170760 172608
55027 172608 174269 174965 174904 174646 174388 174180 174420 175512 177118 178260 178284 177401 176191 174938 173634 172420 171711
55010 171711 171855 172872 174483 176259 177695 178328 177961 176832 175518 174602 174397 174892 175884 177088 178132 178591
54994 178591 178245 177389 176783 177048 178043 178959 179158 178833 178675 179009 179458 179505 179118 178645 178315 178059 177775 177496 177248
54975 177248 176946 176586 176412 176692 177307 177744 177627 177179 176996 177388 178127 178875 179587 180314 180837 180904 180736 180901 181546
54956 181546 182101 181995 181367 180867 180929 181584 182795 184523 186448 187993 188886 189479 190282 191278 191937 191917 191549 191481
54938 191481 191929 192476 192617 192338 192043 192062 192421 193005 193665 194193 194448 194599 195032 195954 197274 198987 201388 204705
$$ packed form
55062A69345R30O57J87j71j25K96P48Q44L93m67j248j357p16mJ7o01j147j197
55044A66384r83p46k43P66J955K673K606J904R07m7p38j177j462j374n32Q67J848
55027A72608J661O96o1k58k58k08K40J092J606J142K4q83j210j253j304j214p09
55010A71711J44J017J611J776J436O33l67j129j314r16k05M95R92J204J044M59
54994A78591l46q56o06K65R95R16J99l25j58L34M49M7l87m73l30k56k84k79k48
54975A77248l02l60j74K80O15M37j17m48j83L92P39P48P12P27N23O7j68J65O45
54956A81546N55j06o28n00O2O55J211J728J925J545Q93N93Q03R96O59k0l68o8
54938A91481M48N47J41k79k95J9L59N84O60N28K55J51M33R22J320J713K401L317
$$ plain form
54920 204705 208684 212742 216464 219860 223274 227161 231771 236863 241816 246178 249937 253164 255612 256925
54906 256925 257019 255968 253686 250065 245350 240088 234738 229634 225177 221681 218970 216517 214021 211590 209350
54891 209350 207212 205171 203432 202059 200797 199500 198539 198475 199454 201166 203316 205887 208920 212245 215581
54876 215581 218836 222179 225743 229337 232615 235587 238854 243092 248325 253741 258211 260939 261826 261360 260068
54861 260068 257899 254275 248940 242569 236242 230449 225046 220136 216380 214242 213287 212497 211060 208730 205820
54846 205820 203081 201256 200389 199746 198680 197361 196364 195795 195238 194496 193889 193790 194159 194647 194939 194933 194735 194536
54828 194536 194418 194320 194297 194655 195578 196686 197267 197044 196509 196427 197123 198291 199310 199716 199506 199052 198693 198459 198262
54809 198262 198171 198223 198088 197296 195822 194140 192646 191444 190739 190906 191868 192833 193156 193144 193481 194077 194189 193664
$$ packed form
54920B04705L979M058L722L396L414L887M610N092M953M362L759L227K448J313
54906B56925R4j051k282l621m715n262n350n104m457l496k711k453k496k431k240
54891B09350k138k041j739j373j262j297r61o4R79J712K150K571L033L325L336
54876B15581L255L343L564L594L278K972L267M238N233N416M470K728Q87m66j292
54861B60068k169l624n335o371o327n793n403m910l756k138r55p90j437k330k910
54846B05820k739j825q67o43j066j319r97n69n57p42o07r9L69M88K92oj98j99
54828A94536j18r8k3L58R23J108N81k23n35q2O96J168J019M06k10m54l59k34j97
54809A98262r1N2j35p92j474j682j494j202p05J67R62R65L23j2L37N96J12n25
$$ plain form
54791 193664 193337 193862 194695 194765 193836 192734 192367 192932 194024 195095 195740 195878 195825 196027 196637 197550 198879 201058
54773 201058 204266 207930 211054 213075 214291 215558 217666 220852 224707 228571 232216 236113 240934 246784
54759 246784 253137 259457 265602 271466 276537 280143 282085 282699 282220 280378 276831 271806 266031 260054 253988
54744 253988 247987 242590 238276 234887 231839 228884 226297 224308 222752 221485 220786 220970 221802 222630 223089
54729 223089 223380 223831 224472 225151 225839 226683 227876 229555 231776 234501 237719 241543 246001 250738 255148 258981
54713 258981 262578 266281 269689 271786 271815 269864 266582 262618 258446 254422 250661 246862 242627 238056 233870
54698 233870 230723 228506 226494 224099 221313 218452 215761 213365 211395 209938 208955 208422 208524 209483 211121
54683 211121 212727 213531 213364 212786 212476 212474 212134 210919 209187 207970 207889 208475 208717 208159 207277 206846 207148 207856
$$ packed form
54791A93664l27N25Q33P0r29j102l67N65J092J071O45J38n3K02O10R13J329K179
54773B01058L208L664L124K021J216J267K108L186L855L864L645L897M821N850
54759B46784O353O320O145N864N071L606J942O14m79j842l547n025n775n977o066
54744B53988o001n397m314l389l048k955k587j989j556j267o99J84Q32Q28M59
54729B23089K91M51O41O79O88Q44J193J679K221K725L218L824M458M737M410L833
54713B58981L597L703L408K097K9j951l282l964m172m024l761l799m235m571m186
54698B33870l147k217k012k395k786k861k691k396j970j457r83n33J02R59J638
54683B11121J606Q04j67n78l10kl40j215j732j217q1N86K42n58q82m31L02P08
$$ plain form
54665 207856 208495 208904 209280 209830 210384 210406 209502 207906 206386 205617 205672 206101 206397 206406 206370 206618 207198 207825 208231 208473
54645 208473 208754 209016 208956 208478 207909 207613 207570 207517 207398 207464 207948 208810 209785 210507 210604 209943 208845 207870 207267 206763
54625 206763 206109 205631 205965 207227 208715 209535 209419 208875 208628 208901 209120 208375 206427 204266 203375 204262 205999
54608 205999 207314 207806 207821 207553 206787 205463 203974 202859 202524 203154 204493 205728 206085 205623 205064 204836 204786
54591 204786 204834 205190 205691 205642 204841 204188 204625 205863 206765 206717 205956 204839 203591 202710 202772 203671 204600 205020 205088
54572 205088 205005 204566 203691 202857 202552 202653 202769 202902 203298 203821 203967 203540 202976 202919 203621 204766 205752 206185 206210
54553 206210 206323 206784 207385 207863 208275 208667 208590 207446 205387 203416 202365 202103 202029 202062 202605 203631 204416 204471
54535 204471 204253 204522 205273 205834 205896 205885 206257 207003 207988 209236 210595 211608 212110 212523 213148 213571 213328 212768
$$ packed form
54665B07856O39M09L76N50N54K2r04j596j520p69N5M29K96Rl6K48N80O27M06K42
54645B08473K81K62o0m78n69k96m3n3j19O6M84Q62R75P22R7o61j098r75o03n04
54625B06763o54m78L34J262J488Q20j16n44k47K73K19p45j948k161q91Q87J737
54608B05999J315M92J5k68p66j324j489j115l35O30J339J235L57m62n59k28n0
54591B04786M8L56N01m9q01o53M37J238R02m8p61j117j248q81O2Q99R29M20O8
54572B05088q3m39q75q34l05J01J16J33L96N23J46m27n64n7P02J145R86M33K5
54553B06210J13M61O01M78M12L92p7j144k059j971j051k62p4L3N43J026P85N5
54535B04471k18K69P51N61O2j1L72P46R85J248J359J013N02M13O25M23k43n60
$$ plain form
54517 212768 212597 212781 212646 212065 211714 212050 212701 213134 213318 213435 213423 213181 212820 212385 211690 210799 210243 210389 210919
54498 210919 211357 211793 212563 213433 213736 213343 212995 213469 214720 216009 216606 216234 215100 213698 212527 211779 211267
54481 211267 210688 209992 209466 209461 210043 210944 211869 212736 213571 214272 214625 214523 214054 213420 212969 213159 214240 215924 217581
54462 217581 218709 219082 218604 217459 216392 216294 217281 218502 219120 219203 219443 220243 221339 222102 222029 221121 219953 219130
54444 219130 218527 217360 215282 213094 211972 212178 212911 213293 213141 212786 212552 212499 212458 212152 211409 210334 209222
54427 209222 208369 207986 208216 209058 210303 211606 212698 213560 214445 215570 216659 216955 216002 214302 212836 212074
54411 212074 211886 212330 213714 215729 217310 217866 218021 218599 219449 219912 219990 220171 220418 220239 219693 219464 219786 220059
54393 220059 219809 219407 219536 220411 221810 223474 225145 226529 227558 228477 229430 230148 230240 229603 228419 226967 225658
$$ packed form
54517B12768j71J84j35n81l51L36O51M33J84J17j2k42l61m35o95q91n56J46N30
54498B10919M38M36P70Q70L03l93l48M74J251J289N97l72j134j402j171p48n12
54481B11267n79o96n26nN82R01R25Q67Q35P01L53j02m69o34m51J90J081J684J657
54462B17581J128L73m78j145j067r8R87J221O18Q3K40Q00J096P63p3r08j168q23
54444B19130o03j167k078k188j122K06P33L82j52l55k34n3m1l06p43j075j112
54427B09222q53l83K30Q42J245J303J092Q62Q85J125J089K96r53j700j466p62
54411B12074j88M44J384K015J581N56J55N78Q50M63P8J81K47j79n46k29L22K73
54393B20059k50m02J29Q75J399J664J671J384J029R19R53P18R2o37j184j452j309
$$ plain form
54376 225658 225093 225721 227342 229054 229861 229484 228631 228306 228774 229365 229428 229118 228990 229077 228893 228201 227292 226502 225957
54357 225957 225864 226513 227769 228954 229527 229648 229838 230330 230928 231307 231225 230628 229746 228986 228569 228367 228159 227852 227396
54338 227396 226729 225969 225473 225423 225500 225206 224530 224075 224411 225343 225993 225701 224748 224007 223934 224180 224264 224227 224405 224902
54318 224902 225655 226723 228025 229056 229410 229468 229956 230880 231551 231698 231865 232470 233178 233606 234073 235082 236437
54301 236437 237400 237643 237616 238002 239070 240515 241676 241943 241109 239327 236897 234327 232464 232022 232782 233704 234061
54284 234061 234107 234376 234784 234883 234701 234792 235569 236943 238576 240122 241282 241919 242089 241849 241125 239988 238876 238317
54266 238317 238538 239407 240585 241547 241756 241108 239982 238687 237178 235576 234490 234332 234568 234273 233259 232126
54250 232126 231273 230503 229613 228787 228224 227896 227889 228496 229684 230838 231392 231508 231811 232657 233943 235464 237093 238581
$$ packed form
54376B25658n65O28J621J712Q07l77q53l25M68N91O3l10j28Q7j84o92r09p90n45
54357B25957r3O49J256J185N73J21J90M92N98L79q2n97q82p60m17k02k08l07m56
54338B27396o67p60m96n0P7k94o76m55L36R32O50k92r53p41p3K46Q4l7J78M97
54318B24902P53J068J302J031L54N8M88R24O71J47J67O05P08M28M67J009J355
54301B36437R63K43k7L86J068J445J161K67q34j782k430k570j863m42P60R22L57
54284B34061M6K69M08R9j82R1P77J374J633J546J160O37J70k40p24j137j112n59
54266B38317K21Q69J178R62K09o48j126j295j509j602j086j58K36k95j014j133
54250B32126q53p70q90q26n63l28pO07J188J154N54J16L03Q46J286J521J629J488
$$ plain form
54232 238581 239479 239433 238493 237064 235572 234199 232967 232011 231648 232092 233176 234484 235750 237062 238586 240184
54216 240184 241343 241576 240901 239873 239036 238472 237980 237621 237734 238430 239358 240069 240324 239912 238610 236586 234553
54199 234553 233173 232492 232189 232103 232144 232001 231429 230707 230370 230510 230717 230621 230126 229277 228343 227936 228502 229689 230680
54180 230680 231138 231298 231198 230620 229885 229890 230920 232100 232636 232984 234060 235715 236821 236747 235970 235185 234564 234080
54162 234080 233890 233977 233893 233329 232715 232796 233678 234659 235034 234810 234541 234693 235240 235725 235614 234740 233580 232985 233439
54143 233439 234539 235395 235576 235517 235954 237146 238793 240477 241930 242994 243619 243928 244085 244037 243571 242669 241659
54126 241659 241002 241033 241850 243195 244462 245117 245249 245488 246346 247870 249969 252656 255684 258277 259750 260306
54110 260306 260870 262109 263909 265788 267433 268658 269181 268855 268100 267814 268656 270422 272209 273199 273214 272543 271448
$$ packed form
54232B38581Q98m6r40j429j492j373j232r56l63M44J084J308J266J312J524J598
54216B40184J159K33o75j028q37n64m92l59J13O96R28P11K55m12j302k024k033
54199B34553j380o81l03q6M1j43n72p22l37J40K07r6m95q49r34m07N66J187R91
54180B30680M58J60j00n78p35NJ030J180N36L48J076J655J106p4p77p85o21m84
54162B34080j90Q7q4n64o14Q1Q82R81L75k24k69J52N47M85j11q74j160n95M54
54143B33439J100Q56J81n9M37J192J647J684J453J064O25L09J57m8m66r02j010
54126B41659o57L1Q17J345J267O55J32K39Q58J524K099K687L028K593J473N56
54110B60306N64J239J800J879J645J225N23l26p55k86Q42J766J787R90J5o71j095
$$ plain form
54093 271448 270064 268689 267772 267407 267080 266210 264844 263512 262483 261499 260288 258981 257847 256891 255976 255185
54077 255185 254707 254461 254162 253861 254021 254829 255660 255675 254948 254569 255400 257019 258232 258517 258538 259132 260240 261127
54059 261127 261398 261346 261369 261448 261369 261143 260916 260686 260461 260624 261740 263836 266189 268120 269886 272414 276184 280704
54041 280704 285235 289697 294515 299727 304706 308954 312837 317202 322418 328120 333916 339952 346548 353431
54027 353431 359731 364805 368865 372686 376822 381168 385131 388103 389933 391180 392734 394915 396967 397735
54013 397735 396794 394628 391738 388104 383688 378946 374382 369847 364787 359028 352927 346914 341338 336633
53999 336633 332990 329793 326015 321436 317013 313684 311254 308822 305942 302860 299909 297221 295016 293656
53985 293656 293276 293649 294422 295258 295816 295966 296008 296331 296871 297235 297391 297750 298438 298946 298758 297902 296570 294610
$$ packed form
54093B71448j384j375r17l65l27q70j366j332j029r84j211j307j134r56r15p91
54077B55185m78k46k99l01J60Q08Q31J5p27l79Q31J619J213K85K1N94J108Q87
54059B61127K71n2K3P9p9k26k27k30k25J63J116K096K353J931J766K528L770M520
54041B80704M531M462M818N212M979M248L883M365N216N702N796O036O596O883
54027C53431O300N074M060L821M136M346L963K972J830J247J554K181K052P68
54013C97735r41k166k890l634m416m742m564m535n060n759o101o013n576m705
53999C36633l643l197l778m579m423l329k430k432k880l082k951k688k205j360
53985B93656l80L73P73Q36N58J50M2L23N40L64J56L59O88N08j88q56j332j960
$$ plain form
53967 294610 291860 288777 286224 284707 284210 284629 285812 287208 288003 287878 287252 286679 286376 286511 287388 288939
53951 288939 290393 291049 291241 292010 293805 296007 297890 299583 301797 304799 308133 311286 314338 317722 321513
53936 321513 325232 328510 331746 335746 340648 345575 349640 353090 357022 362066 367777 373443 379071 385284
53922 385284 392512 400567 408904 417066 424886 432449 439805 446722 452855 458292 463711 469749 476383 483146
53908 483146 489839 496623 503425 509637 514605 518200 520716 522396 523215 523025 521635 518842 514687 509744 504880
53893 504880 500464 495937 490399 483607 476208 469000 462213 455586 448820 441675 433846 425164 415958 406946
53879 406946 398702 391407 384993 379254 373849 368600 363847 360130 357384 354869 352035 349057 346198 343144
53865 343144 339452 335387 331807 329327 328011 327687 327979 328086 327150 325049 322442 319902 317351 314491 311395
$$ packed form
53967B94610k750l083k553j517m97M19J183J396P95j25o26n73l03J35Q77J551
53951B88939J454O56J92P69J795K202J883J693K214L002L334L153L052L384L791
53936C21513L719L278L236M000M902M927M065L450L932N044N711N666N628O213
53922C85284P228Q055Q337Q162P820P563P356O917O133N437N419O038O634O763
53908D83146O693O784O802O212M968L595K516J680Q19j90j390k793m155m943m864
53893E04880m416m527n538o792p399p208o787o627o766p145p829q682r206r012
53879D06946q244p295o414n739n405n249m753l717k746k515k834k978k859l054
53865C43144l692m065l580k480j316l24K92J07r36k101k607k540k551k860l096
$$ plain form
53850 311395 308450 305986 304204 303211 302901 302950 303131 303478 304090 304923 305894 306951 307957 308696 309153 309559 310005
53833 310005 310277 310247 310152 310187 310083 309476 308590 308065 308030 307780 306627 304811 303299 302738 302854 302958 302791 302698 303094
53814 303094 304051 305498 307495 310007 312588 314734 316647 319211 322907 327035 330402 332739 335090 338690
53800 338690 343725 349298 354467 359097 363712 368732 374017 379158 383995 388687 393313 397644 401367 404349
53786 404349 406567 407931 408390 408178 407728 407337 407007 406622 406057 405023 403040 399854 395871 391838 387941 383517
53770 383517 377903 371469 365413 360532 356517 352527 348106 343395 338874 335172 332761 331404 330144 328325
53756 328325 326449 325468 325322 324809 323025 320393 318048 316694 316303 316450 316524 315916 314519 312977 312135 312258 312952
53739 312952 313704 314325 314949 315849 317156 318616 319700 320069 319880 319569 319495 319895 320900 322415 324095 325645 327019
$$ packed form
53850C11395k945k464j782r93l10M9J81L47O12Q33R71J057J006P39M57M06M46
53833C10005K72l0r5L5j04o07q86n25l5k50j153j816j512n61J16J04j67r3L96
53814C03094R57J447J997K512K581K146J913K564L696M128L367K337K351L600
53800C38690N035N573N169M630M615N020N285N141M837M692M626M331L723K982
53786D04349K218J364M59k12m50l91l30l85n65j034j983l186l983m033l897m424
53770C83517n614o434o056m881m015l990m421m711m521l702k411j357j260j819
53756C28325j876r81j46n13j784k632k345j354l91J47P4o08j397j542q42J23O94
53739C12952P52O21O24R00J307J460J084L69j89l11p4M00J005J515J680J550J374
$$ plain form
53722 327019 328305 329595 331029 332664 334168 334993 335083 335093 335658 336808 338349 340410 343113 346013 348472 350507
53706 350507 352739 355539 358653 361627 364165 366089 367464 368811 370778 373533 376777 380302 384062 387694
53692 387694 390606 392730 394645 396693 398406 399193 399189 399057 399202 399551 399878 399994 399797 399487 399531 400066 400487 400089
53674 400089 398967 397784 396706 395233 393335 392089 392501 393995 394785 393897 392257 391472 391993 393006 393791 394461
53658 394461 395271 395910 395881 395209 394354 393663 393339 393664 394747 396116 397103 397708 398598 400121 401781 402950 403749
53641 403749 404939 407117 410350 414458 419325 424927 431288 438526 446881 456602 467735 480046 493217
53628 493217 507195 522170 538199 555148 573259 593495 616825 643191 671534 700742 730008
53617 730008 758216 783551 804008 817845 823398 819198 805028 782756 755697 727108 699358 673906
$$ packed form
53722C27019J286J290J434J635J504Q25R0J0N65J150J541K061K703K900K459K035
53706C50507K232K800L114K974K538J924J375J347J967K755L244L525L760L632
53692C87694K912K124J915K048J713P87mj32J45L49L27J16j97l10M4N35M21l98
53674D00089j122j183j078j473j898j246M12J494P90q88j640p85N21J013P85O70
53658C94461Q10O39k9o72q55o91l24L25J083J369R87O05Q90J523J660J169P99
53641D03749J190K178L233M108M867N602O361P238Q355R721J1133J2311J3171
53628D93217J3978J4975J6029J6949J8111K0236K3330K6366K8343K9208K9266
53617G30008K8208K5335K0457J3837N553m200j4170k2272k7059k8589k7750k5452
$$ plain form
53605 673906 651361 631604 614412 600005 588661 579896 572636 566285 561176 557759 555740 554326 552998
53592 552998 551698 550391 548852 546950 544914 543083 541464 539684 537466 535009 532738 530698 528404 525354
53578 525354 521551 517439 513543 510185 507310 504416 500938 496895 492950 489561 486361 482735 478760 475109
53564 475109 472170 469831 468086 467204 467118 467181 466906 466522 466453 466547 466295 465664 465218 465364 465794 465871 465354 464591 464003
53545 464003 463580 463041 462517 462828 464789 468294 472331 475982 479228 482755 487279 493107 500057 507602 515306
53530 515306 523276 531982 541512 551272 560659 569750 579056 588867 599256 610557 623334 637766 653367
53517 653367 669368 685232 700898 716831 733814 752332 772119 792575 813606 835731 859346
53506 859346 884232 909848 935681 961234 986107 1010368 1034451 1058481 1082078 1105087 1128040
$$ packed form
53605F73906k2545j9757j7192j4407j1344q765p260o351n109l417k019j414j328
53592E52998j300j307j539j902k036j831j619j780k218k457k271k040k294l050
53578E25354l803m112l896l358k875k894l478m043l945l389l200l626l975l651
53564D75109k939k339j745q82q6O3k75l84o9R4k52o31m46J46M30P7n17p63n88
53545D64003m23n39n24L11J961L505M037L651L246L527M524N828O950P545P704
53530E15306P970Q706R530R760R387R091R306R811J0389J1301J2777J4432J5601
53517F53367J6001J5864J5666J5933J6983J8518J9787K0456K1031K2125K3615
53506H59346K4886K5616K5833K5553K4873K4261K4083K4030K3597K3009K2953
$$ plain form
53495 1128040 1151444 1174914 1197529 1218865 1239278 1259428 1280046 1301894 1325212 1349183 1372618
53484 1372618 1395228 1417570 1439667 1460577 1479716 1497806 1515850 1533727 1550520 1565810 1579791
53473 1579791 1592280 1602558 1610310 1616016 1620195 1622812 1623661 1622812 1620325 1615907 1609154 1599908 1588297 1574796
53459 1574796 1560388 1546111 1532035 1517120 1500554 1482851 1465060 1447190 1428180 1407356 1385218
53448 1385218 1362643 1340012 1317377 1294945 1272915 1251209 1229843 1209383 1190588 1173698 1158449
53437 1158449 1144719 1132741 1122565 1113715 1105610 1098181 1091844 1086951 1083388 1080658 1078298 1076281 1075190
53424 1075190 1075973 1079401 1085626 1094236 1104676 1116602 1129866 1144398 1160271 1177821 1197458 1219221
53412 1219221 1242686 1267459 1293678 1321824 1352122 1384366 1418344 1454088 1491587 1530561 1570815
$$ packed form
53495A128040K3404K3470K2615K1336K0413K0150K0618K1848K3318K3971K3435
53484A372618K2610K2342K2097K0910J9139J8090J8044J7877J6793J5290J3981
53473A579791J2489J0278P752N706M179K617Q49q49k487m418o753r246j1611j3501
53459A574796j4408j4277j4076j4915j6566j7703j7791j7870j9010k0824k2138
53448A385218k2575k2631k2635k2432k2030k1706k1366k0460j8795j6890j5249
53437A158449j3730j1978j0176q850q105p429o337m893l563k730k360k017j091
53424A075190P83L428O225Q610J0440J1926J3264J4532J5873J7550J9637K1763
53412A219221K3465K4773K6219K8146L0298L2244L3978L5744L7499L8974M0254
$$ plain form
53401 1570815 1612654 1656576 1702676 1750728 1800878 1853830 1910141 1969596 2031539 2095661 2162186
53390 2162186 2231363 2303051 2376797 2452072 2528320 2604934 2681373 2757332 2832796 2907839 2982180
53379 2982180 3054718 3123387 3185570 3238738 3280842 3310394 3326584 3329649 3321148 3303741 3280489 3254008
53367 3254008 3225962 3196976 3166861 3134908 3100219 3062144 3020648 2976219 2929307 2879928 2827973
53356 2827973 2773777 2718058 2661169 2602658 2541858 2478933 2415201 2352393 2291645 2233127 2176367
53345 2176367 2120730 2065742 2011257 1957535 1905065 1854207 1805033 1757583 1712098 1668766 1627341
53334 1627341 1587347 1548685 1511738 1476743 1443455 1411676 1381828 1354539 1329754 1306671 1284575
53323 1284575 1263458 1243826 1226201 1210764 1197154 1184569 1172443 1161155 1151795 1145036 1140485 1137207
$$ packed form
53401A570815M1839M3922M6100M8052N0150N2952N6311N9455O1943O4122O6525
53390B162186O9177P1688P3746P5275P6248P6614P6439P5959P5464P5043P4341
53379B982180P2538O8669O2183N3168M2104K9552J6190L065q501j7407k3252k6481
53367C254008k8046k8986l0115l1953l4689l8075m1496m4429m6912m9379n1955
53356B827973n4196n5719n6889n8511o0800o2925o3732o2808o0748n8518n6760
53345B176367n5637n4988n4485n3722n2470n0858m9174m7450m5485m3332m1425
53334A627341l9994l8662l6947l4995l3288l1779k9848k7289k4785k3083k2096
53323A284575k1117j9632j7625j5437j3610j2585j2126j1288r360o759m551l278
$$ plain form
53311 1137207 1134665 1133032 1132857 1134607 1138332 1143587 1149849 1157087 1165743 1176069 1187783 1200505 1214278
53298 1214278 1229413 1246064 1264199 1283814 1304976 1327801 1352482 1379088 1407227 1436221 1465778
53287 1465778 1496132 1527288 1558520 1588952 1618233 1646241 1672515 1696521 1718226 1737826 1755089
53276 1755089 1769499 1780891 1789359 1794653 1796354 1794636 1790255 1783739 1775142 1764621 1752582 1739089 1723729
53263 1723729 1706330 1687336 1667229 1646031 1623585 1599898 1574995 1548890 1521976 1494904 1467753
53252 1467753 1439796 1410498 1380393 1350530 1321334 1292431 1263409 1234322 1205565 1177550 1150464
53241 1150464 1124090 1097959 1071730 1045241 1018148 989987 960793 931319 902313 873914 845966
53230 845966 818586 792141 767067 744066 724043 707284 692869 679342 665818 652266 639130
$$ packed form
53311A137207k542j633j75J750L725N255O262P238Q656J0326J1714J2722J3773
53298A214278J5135J6651J8135J9615K1162K2825K4681K6606K8139K8994K9557
53287A465778L0354L1156L1232L0432K9281K8008K6274K4006K1705J9600J7263
53276A755089J4410J1392Q468N294J701j718m381o516q597j0521j2039j3493j5360
53263A723729j7399j8994k0107k1198k2446k3687k4903k6105k6914k7072k7151
53252A467753k7957k9298l0105k9863k9196k8903k9022k9087k8757k8015k7086
53241A150464k6374k6131k6229k6489k7093k8161k9194k9474k9006k8399k7948
53230H45966k7380k6445k5074k3001k0023j6759j4415j3527j3524j3552j3136
$$ plain form
53219 639130 627062 616513 606981 597026 585721 573803 562696 552660 542811 532845 523681 516144 509866
53206 509866 503938 497965 492010 486047 480105 474618 470023 466039 461714 456232 449550 442374 435665 430048
53192 430048 425474 421422 417451 413524 409903 406878 404566 402786 401169 399547 398103 396951 395802 394379
53178 394379 392977 392094 391628 391022 390221 389825 390078 390393 390270 390132 390678 391747 392394 391986 390824 389660 388975
53161 388975 388689 388354 387602 386468 385261 384099 382786 381203 379545 378030 376659 375468 374714 374469 374258 373455
53145 373455 372005 370500 369581 369463 369936 370586 371033 371119 370911 370468 369802 369091 368711 368842 369233 369532 369647 369596 369240
53126 369240 368535 367869 367749 368110 368216 367333 365398 363088 361353 360742 360977 361250 361083 360804 360983 361590 362040 361961
53108 361961 361651 361704 362406 363522 364511 364984 365071 365270 365767 366120 365851 365151 364638 364543 364589 364695 365348 367043 369646
$$ packed form
53219F39130j2068j0549r532r955j1305j1918j1107j0036r849r966r164p537o278
53206E09866n928n973n955n963n942n487m595l984m325n482o682p176o709n617
53192D30048m574m052l971l927l621l025k312j780j617j622j444j152j149j423
53178C94379j402q83m66o06q01l96K53L15j23j38N46J069O47m08j162j164o85
53161C88975k86l35p52j134j207j162j313j583j658j515j371j191p54k45k11q03
53145C73455j450j505r19j18M73O50M47Q6k08m43o66p11l80J31L91K99J15n1l56
53126C69240p05o66j20L61J06q83j935k310j735o11K35K73j67k79J79O07M50p9
53108C61961l10N3P02J116R89M73Q7J99M97L53k69p00n13r5M6J06O53J695K603
$$ plain form
53089 369646 372445 374608 375503 374911 373288 371669 371067 371789 373327 374879 376032 377063 378600 380872 383411
53074 383411 385604 387460 389529 392154 395112 398023 400745 403232 405328 406905 407963 408443 408208 407403 406522
53059 406522 405857 405050 403524 401188 398430 395556 392563 389425 386253 383189 380438 378452 377667 377911 378304
53044 378304 377991 376841 375383 374204 373560 373336 373143 372545 371430 370163 369207 368582 367857 366710 365321 364124
53028 364124 363286 362613 361915 361301 360982 360912 360823 360641 360678 361262 362345 363744 365652 368532 372366 376373 379744
53011 379744 382501 385333 388787 392944 397697 402844 407830 411895 414740 416682 417936 418094 416705 414114
52997 414114 411244 408601 405848 402409 398221 393803 389782 386393 383339 380191 377045 374617 373478 373294
52983 373294 373160 372622 372054 372028 372644 373564 374387 374898 375232 375869 377183 378897 380301 381112 381783 382793 384032
$$ packed form
53089C69646K799K163Q95n92j623j619o02P22J538J552J153J031J537K272K539
53074C83411K193J856K069K625K958K911K722K487K096J577J058M80k35q05q81
53059D06522o65q07j526k336k758k874k993l138l172l064k751j986p85K44L93
53044C78304l13j150j458j179o44k24j93n98j115j267r56o25p25j147j389j197
53028C64124q38o73o98o14l19p0q9j82L7N84J083J399J908K880L834M007L371
53011C79744K757K832L454M157M753N147M986M065K845J942J254J58j389k591
52997D14114k870k643k753l439m188m418m021l389l054l148l146k428j139j84
52983C73294j34n38n68k6O16R20Q23N11L34O37J314J714J404Q11O71J010J239
$$ plain form
52966 384032 385217 386585 388721 391778 395212 398286 400627 402309 403609 404706 405500 405775 405573 405243 405002
52951 405002 404611 403714 402343 400890 399588 398177 396126 393132 389530 386160 383672 381922 380251 378337 376426
52936 376426 374718 373005 371125 369324 367834 366516 365318 364683 364933 365538 365591 364891 364023 363473 363207 363051 362882
52919 362882 362412 361368 360005 358987 358656 358795 359158 359765 360567 361334 362042 362915 363935 364745 365198 365571 365992
52902 365992 366153 365876 365543 365608 366003 366355 366548 366759 367117 367612 368100 368269 367894 367297 367212 367963 369146 370387 371939
52883 371939 374030 376027 376861 376138 374330 371967 369232 366356 363888 362350 361863 362180 362879 363558 364091 364718
52867 364718 365628 366467 366501 365278 362983 360236 357787 356333 356212 357127 358280 358962 358993 358677 358436 358464 358660 358932
52849 358932 359482 360567 361939 362887 363015 362618 361998 360892 358989 356724 354922 353885 353405 353512 354469 355954
$$ packed form
52966C84032J185J368K136L057L434L074K341J682J300J097P94K75k02l30k41
52951D05002l91q97j371j453j302j411k051k994l602l370k488j750j671j914j911
52936C76426j708j713j880j801j490j318j198o35K50O05N3p00q68n50k66j56j69
52919C62882m70j044j363j018l31J39L63O07Q02P67P08Q73J020Q10M53L73M21
52902C65992J61k77l33O5L95L52J93K11L58M95M88J69l75n97q5P51J183J241J552
52883C71939K091J997Q34p23j808k363k735k876k468j538m87L17O99O79N33O27
52867C64718R10Q39L4j223k295k747k449j454j21R15J153O82L1l16k41K8J96K72
52849C58932N50J085J372R48J28l97o20j106j903k265j802j037m80J07R57J485
$$ plain form
52833 355954 356987 356955 356240 355591 355335 355461 355984 356826 357651 358213 358716 359546 360825 362436 364275 366163 367669
52816 367669 368300 367808 366257 364000 361751 360436 360623 362144 364351 366638 368654 370357 372144 374714 378508
52801 378508 383432 389276 396109 403769 411076 416096 417449 415187 410363 403986 396497 388084 379274 371090
52787 371090 364554 359968 356800 354305 352115 350128 348125 345876 343605 341925 341161 340936 340571 339778 338795
52772 338795 337946 337233 336395 335310 334265 333729 333876 334400 334884 335223 335547 335805 335679 335034 334284 334107 334740 335653
52754 335653 336074 335836 335549 335857 336660 337308 337468 337518 338075 339383 341202 342949 343839 343327 341755 340245 339592
52737 339592 339493 339227 338776 338694 339094 339527 339906 340768 342279 343649 344047 343662 343315 343347 343469 343520 343714 344147 344597
52718 344597 344945 345325 345712 345774 345371 344881 344758 345001 345223 345069 344358 343119 341690 340586 339994 339607 339204 339141
$$ packed form
52833C55954J033l2p15o49k56J26N23Q42Q25N62N03Q30J279J611J839J888J506
52816C67669O31m92j551k257k249j315J87J521K207K287K016J703J787K570L794
52801C78508M924N844O833P660P307N020J353k262m824o377p489q413q810q184
52787C71090o536m586l168k495k190j987k003k249k271j680p64k25l65p93r83
52772C38795q49p13q38j085j045n36J47N24M84L39L24K58j26o45p50j77O33R13
52754C35653M21k38k87L08Q03O48J60N0N57J308J819J747Q90n12j572j510o53
52737C39592r9k66m51q2M00M33L79Q62J511J370L98l85l47L2J22N1J94M33M50
52718C44597L48L80L87O2m03m90j23K43K22j54p11j239j429j104n92l87m03o3
$$ plain form
52700 339141 339805 340798 341222 340795 340156 339960 340171 340457 340758 341069 341124 340780 340500 340923 342066 343407 344687 346164
52682 346164 348065 350218 352273 353898 354690 354398 353369 352415 352002 351857 351624 351525 352147 353764 356098 358537
52666 358537 360429 361485 362156 363304 365252 367448 369350 371184 373310 375241 376033 375575 374727 374122 373564 372841
52650 372841 372490 373213 374957 377018 378803 380094 380775 380797 380405 379962 379447 378373 376375 373788 371533 370455
52634 370455 370720 371813 373073 374229 375398 376708 378122 379643 381436 383613 386031 388406 390509 392172
52620 392172 393285 393998 394776 395994 397459 398470 398397 397168 395269 393406 392105 391483 391303 391321 391549 392088 392718
52603 392718 392853 392056 390625 389518 389587 390841 392531 393923 394897 395803 396892 398093 399189 400034 400634 401201
52587 401201 402093 403500 405223 406880 408248 409207 409498 408952 407950 407275 407356 407986 408836 409888 411097 412036 412251
$$ packed form
52700C39141O64R93M24m27o39j96K11K86L01L11N5l44k80M23J143J341J280J477
52682C46164J901K153K055J625P92k92j029r54m13j45k33r9O22J617K334K439
52666C58537J892J056O71J148J948K196J902J834K126J931P92m58q48o05n58p23
52650C72841l51P23J744K061J785J291O81K2l92m43n15j074j998k587k255j078
52634C70455K65J093J260J156J169J310J414J521J793K177K418K375K103J663
52620C92172J113P13P78J218J465J011p3j229j899j863j301o22j80J8K28N39O30
52603C92718J35p97j431j107O9J254J690J392R74R06J089J201J096Q45O00N67
52587D01201Q92J407J723J657J368R59K91n46j002o75Q1O30Q50J052J209R39K15
$$ plain form
52570 412251 411834 411383 411510 412530 414376 416534 418207 418861 418612 417949 417293 416913 416984 417350 417460 416868 415747
52553 415747 414681 414102 414158 414843 415885 416685 416871 416889 417627 419454 421880 424079 425376 425386 424291 423012 422619
52536 422619 423323 424365 424996 425254 425688 426688 428172 429648 430501 430555 430457 431127 432689 434239 434791 434200 433154
52519 433154 432619 433304 435216 437604 439718 441656 444053 446933 449617 451909 454607 458389 462875 467299 471512
52504 471512 475636 479275 481903 483705 485204 486193 485855 483868 480721 476941 472665 468024 463293 458555 453803
52489 453803 449418 445964 443470 441483 439868 438863 438258 437367 436131 435467 435999 437161 438132 439011 440298 441736
52473 441736 442624 443038 443837 445431 447378 449313 451473 453932 456014 456996 457045 457005 457515 458748 460770 463534
52457 463534 466474 468607 469340 469012 468348 467495 465828 462781 458625 454245 450266 446677 443290 440206 437604
$$ packed form
52570D12251m17m51J27J020J846K158J673O54k49o63o56l80P1L66J10n92j121
52553D15747j066n79N6O85J042Q00J86J8P38J827K426K199J297J0j095j279l93
52536D22619P04J042O31K58M34J000J484J476Q53N4r8O70J562J550N52n91j046
52519D33154n35O85J912K388K114J938K397K880K684K292K698L782M486M424M213
52504D71512M124L639K628J802J499R89l38j987l147l780m276m641m731m738m752
52489D53803m385l454k494j987j615j005o05q91j236o64N32J162R71Q79J287J438
52473D41736Q88M14P99J594J947J935K160K459K082R82M9m0N10J233K022K764
52457D63534K940K133P33l28o64q53j667l047m156m380l979l589l387l084k602
$$ plain form
52442 437604 435346 433186 431295 430174 429971 430243 430477 430530 430381 429834 428824 427771 427211 427182 427383 427798 428661
52425 428661 429731 430194 429556 428245 427041 426302 426105 426770 428588 431116 433339 434650 435323 435926 436689 437613
52409 437613 438834 440587 443028 446302 450620 456076 462476 469480 476864 484604 492805 501550 510582 519111
52395 519111 526121 530896 533054 532212 528084 521085 512453 503567 495364 488384 482831 478393 474576 471567
52381 471567 470214 470788 472309 473694 475077 477286 480408 483676 486542 489034 491163 492925 494916 498105
52367 498105 502731 508099 513542 518819 523376 526127 526469 524916 522304 518961 515068 511186 507812 504854
52353 504854 502139 500016 498887 498532 498520 499004 500465 502798 505317 507608 509874 512461 515503 519041 523089
52338 523089 527553 532372 537683 543591 549966 556788 564425 573154 582604 592167 601827 612118 623365 635535
$$ packed form
52442D37604k258k160j891j121k03K72K34N3j49n47j010j053n60k9K01M15Q63
52425D28661J070M63o38j311j204p39j97O65J818K528K223J311O73O03P63R24
52409D37613J221J753K441L274M318N456O400P004P384P740Q201Q745R032Q529
52395E19111P010M775K158q42m128o999q632q886q203o980n553m438l817l009
52381D71567j353N74J521J385J383K209L122L268K866K492K129J762J991L189
52367D98105M626N368N443N277M557K751L42j553k612l343l893l882l374k958
52353E04854k715k123j129l55j2M84J461K333K519K291K266K587L042L538M048
52338E23089M464M819N311N908O375O822P637Q729R450R563R660J0291J1247J2170
$$ plain form
52324 635535 648685 662930 677898 692784 707118 721037 734732 748104 761070 773720 785949
52313 785949 797414 808071 818418 828993 839959 851323 863172 875479 888040 900829 914032
52302 914032 927534 940775 953372 965453 977068 987710 996899 1004881 1012184 1018657 1023545 1026377 1027232
52289 1027232 1026179 1023126 1018479 1013381 1008833 1004822 1000695 996218 991891 988219 985156 982484 980427 979468
52275 979468 979605 980226 980915 982062 984394 988112 992832 998212 1004219 1010753 1017473 1024184 1031139 1038756 1047264
52260 1047264 1056692 1066968 1077867 1089095 1100604 1112619 1125177 1137858 1150191 1162161 1174111
52249 1174111 1186248 1198406 1210107 1220706 1229662 1236904 1242768 1247476 1250912 1253145 1254812 1256592 1258549
52236 1258549 1260432 1262479 1265315 1269057 1273051 1276727 1280298 1284387 1289279 1294768 1300486 1306091 1311310 1316061
$$ packed form
52324F35535J3150J4245J4968J4886J4334J3919J3695J3372J2966J2650J2229
52313G85949J1465J0657J0347J0575J0966J1364J1849J2307J2561J2789J3203
52302I14032J3502J3241J2597J2081J1615J0642R189P982P303O473M888K832Q55
52289A027232j053l053m647n098m548m011m127m477m327l672l063k672k057r59
52275I79468J37O21O89J147K332L718M720N380O007O534O720O711O955P617Q508
52260A047264R428J0276J0899J1228J1509J2015J2558J2681J2333J1970J1950
52249A174111J2137J2158J1701J0599Q956P242N864M708L436K233J667J780J957
52236A258549J883K047K836L742L994L676L571M089M892N489N718N605N219M751
$$ plain form
52222 1316061 1320484 1324647 1328388 1331698 1335130 1339511 1345098 1351256 1357109 1362446 1367837 1373909 1380676 1387638
52208 1387638 1394430 1401196 1408358 1416204 1424808 1434158 1444162 1454586 1465206 1476064 1487441 1499444
52196 1499444 1511695 1523490 1534281 1544073 1553423 1563037 1573239 1583750 1593958 1603407 1612064 1620127
52184 1620127 1627552 1633728 1637691 1638907 1637810 1635369 1632015 1627298 1620639 1612061 1601909 1590280 1577314
52171 1577314 1563853 1551144 1539783 1529478 1519985 1511776 1505535 1501445 1499267 1498651 1498985 1499409 1499620 1500523
52157 1500523 1503471 1508766 1515280 1521497 1526565 1530362 1533054 1534841 1535822 1535912 1535033 1533499 1531934 1530721 1529747
52142 1529747 1528745 1527574 1526000 1523623 1520411 1517049 1514357 1512361 1510303 1507506 1503859 1499410 1493963 1487459
52128 1487459 1480585 1474612 1470460 1468106 1466986 1466929 1468543 1472755 1480118 1490653 1504140 1520337 1538916
$$ packed form
52222A316061M423M163L741L310L432M381N587O158N853N337N391O072O767O962
52208A387638O792O766P162P846Q604R350J0004J0424J0620J0858J1377J2003
52196A499444J2251J1795J0791R792R350R614J0202J0511J0208R449Q657Q063
52184A620127P425O176L963J216j097k441l354m717o659q578j0152j1629j2966
52171A577314j3461j2709j1361j0305r493q209o241m090k178o16L34M24K11R03
52157A500523K948N295O514O217N068L797K692J787R81R0q79j534j565j213r74
52142A529747j002j171j574k377l212l362k692j996k058k797l647m449n447o504
52128A487459o874n973m152k354j120n7J614M212P363J0535J3487J6197J8579
$$ plain form
52115 1538916 1559504 1581889 1606058 1631868 1658763 1685950 1712767 1738719 1763267 1785804 1805947
52104 1805947 1823771 1839711 1854316 1868124 1881713 1895740 1910793 1927088 1944360 1962120 1979951
52093 1979951 1997407 2013790 2028451 2041445 2053464 2064894 2075184 2083433 2089259 2092628 2093123 2090084
52081 2090084 2083599 2074936 2065815 2057582 2051163 2047404 2047075 2050589 2057689 2067233 2077449 2086843 2095089 2102868
52067 2102868 2110937 2119756 2129900 2142088 2156413 2171963 2187498 2202153 2215353 2226602 2235774 2243173
52055 2243173 2248947 2252909 2255281 2257001 2258625 2259478 2258562 2255871 2251969 2246688 2239355 2230161 2220198 2210003
52041 2210003 2199089 2187158 2174781 2162473 2150024 2137410 2125633 2115883 2108295 2102165 2097067 2093139
52029 2093139 2090513 2088967 2088043 2087096 2085403 2082640 2079188 2075715 2072552 2069525 2066051 2061265 2054611 2046678
$$ packed form
52115A538916K0588K2385K4169K5810K6895K7187K6817K5952K4548K2537K0143
52104A805947J7824J5940J4605J3808J3589J4027J5053J6295J7272J7760J7831
52093A979951J7456J6383J4661J2994J2019J1430J0290Q249N826L369M95l039
52081B090084o485q663r121q233o419l759l29L514P100R544J0216R394Q246P779
52067B102868Q069Q819J0144J2188J4325J5550J5535J4655J3200J1249R172P399
52055B243173N774L962K372J720J624Q53r16k691l902n281p333r194r963j0195
52041B210003j0914j1931j2377j2308j2449j2614j1777r750p588o130n098l928
52029B093139k626j546r24r47j693k763l452l473l163l027l474m786o654p933
$$ plain form
52015 2046678 2038957 2032214 2025483 2017257 2007396 1997174 1987656 1978696 1969581 1960006 1950143 1940106 1929596
$$ packed form
52015B046678p721o743o731q226r861j0222r518q960r115r575r863j0037j0510
$$ [...]
##END NTUPLES=NMR SPECTRUM
##END=
