##TITLE=AC1553_ROEFFECT0015_8269100_z1duvgGJgS
##JCAMPDX= 6.0         $$ Bruker NMR JCAMP-DX V2.0
##DATA TYPE= NMR SPECTRUM
##DATA CLASS= NTUPLES
##ORIGIN= BRUKER
##OWNER= Administrator
$$ 1.72 TOPSPIN		Version 2.1
$$ 2013-10-12 18:43:15.380 -0700  Administrator@X
$$ Compression mode = diff/dup
##.OBSERVE FREQUENCY= 400.02188249412
##.OBSERVE NUCLEUS= ^1H
##.ACQUISITION MODE= SIMULTANEOUS (DQD)
##.ACQUISITION SCHEME= undefined
##.AVERAGES= 64
##.DIGITISER RES= 22
##SPECTROMETER/DATA SYSTEM= spect
##.PULSE SEQUENCE= noesygpps1d.comp
##.SOLVENT NAME= COFFEE_meoh
##.SHIFT REFERENCE= INTERNAL, COFFEE_meoh, 1, 14.96052
##AUDIT TRAIL= $$ (NUMBER, WHEN, WHO, WHERE, PROCESS, VERSION, WHAT)
$$ ##TITLE= Audit trail, TOPSPIN		Version 2.1
$$ ##JCAMPDX= 5.01
$$ ##ORIGIN= Bruker BioSpin GmbH
$$ ##OWNER= Administrator
$$ $$ E:\/data/COFFEE/nmr/AC1553_ROEFFECT0015_8269100_z1duvgGJgS/12/pdata/1/auditp.txt
$$ ##AUDIT TRAIL=  $$ (NUMBER, WHEN, WHO, WHERE, PROCESS, VERSION, WHAT)
(   1,<2013-10-12 18:43:10.505 -0700>,<Administrator>,<X>,<go>,<TOPSPIN 2.1>,
      <created by zg
	started at 2013-10-12 18:31:40.327 -0700,
	POWCHK enabled, PULCHK disabled,
       configuration hash MD5:
       C8 4E 4E 5D D3 5C D8 9E 9F 52 82 E0 59 8A DE 15
       data hash MD5: 64K
       05 AC 76 06 ED 5F E6 62 B0 04 47 AC A3 61 43 22>)
(   2,<2013-10-12 18:43:13.489 -0700>,<Administrator>,<X>,<proc1d>,<TOPSPIN 2.1>,
      <Start of raw data processing
       efp LB = 0.3 FT_mod = 6 PKNL = 1 PHC0 = 0 PHC1 = 0 SI = 128K 
       data hash MD5: 128K
       85 E9 2C 34 32 91 54 0D 18 CF BD B2 E0 93 59 23>)
(   3,<2013-10-12 18:43:14.427 -0700>,<Administrator>,<X>,<proc1d>,<TOPSPIN 2.1>,
      <pk PHC0 = -80.94727 PHC1 = 0 
       data hash MD5: 128K
       90 8A 81 63 FC D1 7F 2A 9F EB 38 BF C1 B2 91 15>)
(   4,<2013-10-12 18:43:14.848 -0700>,<Administrator>,<X>,<proc1d>,<TOPSPIN 2.1>,
      <abs ABSG = 1 
       data hash MD5: 128K
       09 89 50 BA EE 6E 31 D2 31 36 45 EA 95 76 1A F1>)
(   5,<2013-10-12 18:43:14.942 -0700>,<Administrator>,<X>,<proc1d>,<TOPSPIN 2.1>,
      <abs ABSG = 2 
       data hash MD5: 128K
       67 A1 56 4B 5B 05 6C 94 76 6E 72 3F D4 54 1F AC>)
(   6,<2013-10-12 18:43:15.036 -0700>,<Administrator>,<X>,<proc1d>,<TOPSPIN 2.1>,
      <abs ABSG = 3 
       data hash MD5: 128K
       57 89 1B 99 49 4A 31 9D AA A9 40 DA EF 68 2B 62>)
(   7,<2013-10-12 18:43:15.114 -0700>,<Administrator>,<X>,<proc1d>,<TOPSPIN 2.1>,
      <abs ABSG = 4 
       data hash MD5: 128K
       35 7F 1E 0B CE A5 F8 E3 98 46 B4 FA A7 DE 9A 95>)
(   8,<2013-10-12 18:43:15.208 -0700>,<Administrator>,<X>,<proc1d>,<TOPSPIN 2.1>,
      <abs ABSG = 5 
       data hash MD5: 128K
       70 E8 72 A0 E5 DA 50 9B 3A 67 BC C4 A0 DD 1F 7B>)
$$ ##END=
$$ 
$$ $$ hash MD5
$$ $$ 7A C6 A4 58 5C 1F 49 1C 41 EA 13 45 40 86 14 B9
##$RELAX= 
##$RELAX= 
##$RELAX= 
##$RELAX= 
##$RELAX= 
##$RELAX= 
##$RELAX= 
##$RELAX= 
$$ Bruker specific parameters
$$ --------------------------
##$DU= <E:\>
##$EXPNO= 12
$$ [...]
##$TP07= 0
##$TPNAME0= <>
##$TPNAME1= <>
##$TPNAME2= <>
##$TPNAME3= <>
##$TPNAME4= <>
##$TPNAME5= <>
##$TPNAME6= <>
##$TPNAME7= <>
##$TPOAL= (0..7)
0.5 0.5 0.5 0.5 0.5 0.5 0.5 0.5
##$TPOFFS= (0..7)
0 0 0 0 0 0 0 0
##$TUNHIN= 0
##$TUNHOUT= 0
##$TUNXOUT= 0
##$USERA1= <user>
##$USERA2= <user>
##$USERA3= <user>
##$USERA4= <user>
##$USERA5= <user>
##$V9= 5
##$VALIST= <valist>
##$VCLIST= <CCCCCCCCCCCCCCC>
##$VD= 0
##$VDLIST= <DDDDDDDDDDDDDDD>
##$VPLIST= <PPPPPPPPPPPPPPP>
##$VTLIST= <TTTTTTTTTTTTTTT>
##$WBST= 1024
##$WBSW= 4
##$XGAIN= (0..3)
0 0 0 0
##$XL= 0
##$YL= 0
##$YMAX_a= 6602231
##$YMIN_a= -13087537
##$ZGOPTNS= <>
##$ZL1= 120
##$ZL2= 120
##$ZL3= 120
##$ZL4= 120
##$ABSF1= 14.96052
##$ABSF2= -5.597662
##$ABSG= 5
##$ABSL= 3
##$ALPHA= 0
##$AQORDER= 0
##$ASSFAC= 0
##$ASSFACI= 0
##$ASSFACX= 0
##$ASSWID= 0
##$AUNMP= <proc_prof1d_extract.lims>
##$AXLEFT= 0
##$AXNAME= <>
##$AXNUC= <1H>
##$AXRIGHT= 0
##$AXTYPE= 0
##$AXUNIT= <>
##$AZFE= 0.1
##$AZFW= 0.1
##$BCFW= 0
##$BC_mod= 0
##$BYTORDP= 0
##$COROFFS= 0
##$CY= 15
##$DATMOD= 1
##$DC= 0
##$DFILT= <>
##$DTYPP= 0
##$F1P= 0
##$F2P= 0
##$FCOR= 0.5
##$FTSIZE= 131072
##$FT_mod= 6
##$GAMMA= 0
##$GB= 0
##$INTBC= 1
##$INTSCL= 1
##$ISEN= 128
##$LB= 0.3
##$LEV0= 0
##$LPBIN= 0
##$MAXI= 10000
##$MC2= 0
##$MEAN= 0
##$ME_mod= 0
##$MI= 0
##$NCOEF= 0
##$NC_proc= -2
##$NLEV= 6
##$NOISF1= 0
##$NOISF2= 0
##$NSP= 0
##$NTH_PI= 0
##$NZP= 0
##$OFFSET= 14.96052
##$PC= 1
##$PHC0= -80.94727
##$PHC1= 0
##$PH_mod= 1
##$PKNL= yes
##$PPARMOD= 0
##$PPDIAG= 0
##$PPIPTYP= 0
##$PPMPNUM= 2147483647
##$PPRESOL= 1
##$PSCAL= 4
##$PSIGN= 0
##$PYNMP= <proc.py>
##$REVERSE= no
##$SF= 400.020009829371
##$SI= 131072
##$SIGF1= 0
##$SIGF2= 0
##$SINO= 400
##$SIOLD= 131072
##$SPECTYP= <>
##$SREGLST= <1H.CDCl3>
##$SSB= 0
##$STSI= 131072
##$STSR= 0
##$SW_p= 8223.68421052631
##$SYMM= 0
##$S_DEV= 0
##$TDeff= 65536
##$TDoff= 0
##$TI= <>
##$TILT= no
##$TM1= 0
##$TM2= 0
##$TOPLEV= 0
##$USERP1= <user>
##$USERP2= <user>
##$USERP3= <user>
##$USERP4= <user>
##$USERP5= <user>
##$WDW= 1
##$XDIM= 131072
##$YMAX_p= 406917562
##$YMIN_p= -11427
##$CURPLOT= <Network HP LaserJet P1505>
##$CURPRIN= <$Network HP LaserJet P1505>
##$DFORMAT= <normdp>
##$LAYOUT= <+/1D_H.xwp>
##$LFORMAT= <normlp>
##$PFORMAT= <normpl>
##$SURQMSG= 1
$$ End of Bruker specific parameters
$$ ---------------------------------
##NTUPLES= NMR SPECTRUM
##VAR_NAME=  FREQUENCY,     SPECTRUM/REAL,   SPECTRUM/IMAG
##SYMBOL=    X,             R,               I
##VAR_TYPE=  INDEPENDENT,   DEPENDENT,       DEPENDENT
##VAR_FORM=  AFFN,          ASDF,            ASDF
##VAR_DIM=   131072,        131072,          131072
##UNITS=     HZ,            ARBITRARY UNITS, ARBITRARY UNITS
##FACTOR=    0.0627417313425164, 1,          1
##FIRST=     8223.62146879497, -227,         -65633
##LAST=      0,             1086,            -66136
##MIN=       0,             -11427,          0
##MAX=       8223.62146879497, 406917562,    0
$$ Real data points
##PAGE= N=1
##DATA TABLE= (X++(R..R)), XYDATA
$$ [...]
63775C10974l117k727k454k573k557j745l72Q51J895L339N282P108Q356R188R821
63760C41269J0065R483P711M577L51m089p672r839j0722j0833j0732j0746j0639
63747B98184r765p962n996m692l846k664j068J56M75K16m7r0J72Q22J654K225
63731B67774K479K829L483M131M530M827N088N047M775M978O106P591Q559Q922
63717C41119R078Q865P687N583L452J946Q25m34j884l262m420n262n618n494n205
63702C46976n008m819m489m085l610k834j716p50l64l11k0O18J332K110L050L759
63686C29839L671L065K841L086K744J210n19j035k50Q10J444J623J372Q26P25
63671C51452J758L352M145L851L691M555N738O036N315M275L303K330J418O59
$$ plain form
63775 310974 307857 305130 302676 300103 297546 295801 295429 296280 298175 301514 306796 313904 322260 331448 341269
63760 341269 351334 360817 368528 373105 373456 369367 361695 351856 341134 330301 319569 308823 298184
63747 298184 288419 280457 274461 269769 265923 263259 262191 262347 262822 263038 262991 262901 263073 263895 265549 267774
63731 267774 270253 273082 276565 280696 285226 290053 295141 300188 304963 309941 316047 323638 332197 341119
63717 341119 350197 359062 366749 372332 375784 377730 378555 378121 376237 372975 368555 363293 357675 352181 346976
63702 346976 341968 337149 332660 328575 324965 322131 320415 319665 319301 318990 318970 319588 320920 323030 326080 329839
63686 329839 333510 336575 339416 342502 345246 346456 345937 344902 344652 345462 346906 348529 349901 350727 351452
63671 351452 353210 356562 360707 364558 368249 372804 378542 384578 389893 394168 397471 399801 401219 401878
63657D01878k48j657l300m573n368o037o640o777o213n157l907k564j208O7J361
63642C49657K862M506N996P239Q460R843J1268J2502J3395J3851J3845J3527J3144
63629D80095J2723J1993J0686Q886O990N332L850K204K95j457k557k968k939k358
63615E30775q45J474L866N935Q093J0771J3703J6446J9087K1842K4411K6467K8388
63602G10413L0618L2520L2727L0681K7030K2479J7081J0872M435j461o224r253
63590I01918j0155r518q813q984r622r993j0408j1968j5219j9574k3917k7238
63578G36509k8841k8515k6669k4118k1561j9277j7129j4781j2138r626p715o090
63566E20049l759l89K959M888N231N027N148N624O260P151Q284R230R656R891
$$ plain form
63657 401878 401630 399973 396673 392100 386732 380695 374055 367278 361065 355908 352001 349437 348229 348296 349657
63642 349657 352519 357025 363021 370260 378720 388563 399831 412333 425728 439579 453424 466951 480095
63629 480095 492818 504811 515497 524383 531373 536705 540555 542759 543054 541597 539040 536072 533133 530775
63615 530775 529930 531404 535270 541205 549298 560069 573772 590218 609305 631147 655558 682025 710413
63602 710413 741031 773551 806278 836959 863989 886468 903549 914421 918856 917395 911171 901918
63590 901918 891763 882245 873432 864448 854826 844833 834425 822457 807238 787664 763747 736509
63578 736509 707668 679153 652484 628366 606805 587528 570399 555618 543480 533854 526139 520049
63566 520049 516290 515901 518860 523748 528979 534006 539154 544778 551038 558189 566473 575703 585359 595250
63552E95250J0665J2407J5104J8633K2889K7682L2864L8595M5236N2985O1785
63541I34095P1352Q0406Q5481Q1473O5082L8506R249j4625k9264l5592l6318l3471
63529A216374k8404k2605j7527j3990j2259j2440j4375j7421k0880k4603k8826
63518A003044l3302l6930l8425l7297l4259l0693k7607k4996k2306j9421j6895
63507F80913j5091j3571j1745r786q378p729p483p592q549j0440j2356j3286j3262
63494E41645j3135j3370j3576j3161j2052j0615r228q042o921n573l862k049m78
63481D29583R05K382L821M701M987N486O851Q586R601R598R241Q962Q343O975
63467E20022N358M402M316M572M849N532P029Q965J0408J0879J0849J1089J1603
$$ plain form
63552 595250 605915 618322 633426 652059 674948 702630 735494 774089 819325 872310 934095
63541 934095 1005447 1085853 1171334 1252807 1317889 1356395 1365644 1351019 1321755 1286163 1249845 1216374
63529 1216374 1187970 1165365 1147838 1133848 1121589 1109149 1094774 1077353 1056473 1031870 1003044
63518 1003044 969742 932812 894387 857090 822831 792138 764531 739535 717229 697808 680913
63507 680913 665822 652251 640506 630720 622342 614613 607130 599538 590989 580549 568193 554907 541645
63494 541645 528510 515140 501564 488403 476351 465736 456508 448466 441545 435972 432110 430061 429583
63481 429583 430488 432870 436691 441392 446379 451865 458716 467302 476903 486501 495742 504704 513047 520022
63467 520022 525380 529782 534098 538670 543519 549051 556080 565045 575453 586332 597181 608270 619873
63454F19873J1499R949P029L511R4k840m956n999o147n903n487m645l135j161
63440F11682Q97K894M972P460J0829J5517K1695K9304L8344M8886O0659P2597
63428I25736Q2227Q5322P7221N6439K7437j428k3722l8252m6709m9810m7118l9490
63416A007853k9462j9082q778J449J0974J9085K5477K9736L1189K9765K6212K0998
63404A145416J3883N141l444r694j2836j3681j3343j2475j1561j1226j2117j4662
63392A049401j8905k4270k9677l4124l7206l8940l9337l8357l6143l3118k9834
63381F89490k6795k4149k1584j8737j5766j3185j1126r107o770m309k007K71K696
63368E38922N031O991Q753J0675J2726J4722J6977K0083K4113K8494L2748L6863
$$ plain form
63454 619873 631372 641321 648350 651861 651955 649115 644159 638160 632013 626110 620623 615978 612843 611682
63440 611682 612579 615473 620445 627905 638734 654251 675946 705250 743594 792480 853139 925736
63428 925736 1007963 1093285 1170506 1226945 1254382 1252954 1229232 1190980 1144271 1094461 1047343 1007853
63416 1007853 978391 959309 950531 951980 962954 982039 1007516 1037252 1068441 1098206 1124418 1145416
63404 1145416 1159299 1164440 1160996 1151302 1138466 1124785 1111442 1098967 1087406 1076180 1064063 1049401
63392 1049401 1030496 1006226 976549 942425 905219 866279 826942 788585 752442 719324 689490
63381 689490 662695 638546 616962 598225 582459 569274 558148 549041 542271 537962 535955 536226 538922
63368 538922 543953 550944 559697 570372 583098 597820 614797 634880 658993 687487 720235 757098
63356G57098M0796M4150M6670M8678N0609N2211N2598N1034M7518M2529L6508
63345A270399K9576K1613J2608L200n155j0872j3376j3292j1486q413m823k500
63333A267479l278p315j3075j9128k5162l1070l6099l9547m1465m1970m0560l6928
63321I31882l1827k6119j9466j0975q09R768J9258K5395K4224J2292r066l2838
63309H91719n0995n9798o0499n6279m9699m2297l4986k8388k3034j9197j6420
63298D50127j3782j1007q775p596o987o269n543n152m799l974k885k193k079k248
63284C66838k586l053l209k685j964j888k351k296j137M55J435J585J503J795
63270C52442K452K964K932K603K587K973L081K386J264M64K13M10J283L048N086
$$ plain form
63356 757098 797894 842044 888714 937392 988001 1040212 1092810 1143844 1191362 1233891 1270399
63345 1270399 1299975 1321588 1334196 1337396 1332241 1321369 1307993 1294701 1283215 1274802 1269979 1267479
63333 1267479 1264201 1256886 1243811 1224683 1199521 1168451 1132352 1092805 1051340 1009370 968810 931882
63321 931882 900055 873936 854470 843495 842686 852454 871712 897107 921331 933623 924557 891719
63309 891719 840724 780926 720427 664148 614449 572152 537166 508778 485744 466547 450127
63298 450127 436345 425338 416563 408967 401980 395711 390168 385016 380217 376243 373358 371165 369086 366838
63284 366838 364252 361199 357990 355305 353341 351453 349102 346806 345669 346124 347559 349144 350647 352442
63270 352442 354894 357858 360790 363393 365980 368953 372034 374420 375684 376148 376361 376771 378054 381102 386188
63255C86188O358O761P326Q733J0260J0601R341P317N758N320N783O387O528O264
63241D88925O173O730P847R013R745R955R971J0166J0558J0854J0928J1082J1737
63228F13684J3040J4769J6404J7287J7106J6319J5736J5643J5669J5678J6124
63217G87459J7261J8631J9720K0536K1022K0482J8315J4872J0928O645J752l613
63205I54010q940j4022j8802k2849k5724k7686k9211k9934k8996k6382k3103j9922
63193F78439j6724j3298r900o755l650l55K985O144R087J1830J4412J7065J9966
63180G09246K2849K5276K7175K8547K8856K7439K4593K1356J8142J4403R890N433
63168I63205K119K91l61m54r11k515n015p347r209j1713j5957k1541k7139l1876
$$ plain form
63255 386188 392546 399307 406633 415366 425626 436227 445568 452885 458643 463963 469746 476133 482661 488925
63241 488925 495098 501828 509675 518688 528433 538388 548359 558525 569083 579937 590865 601947 613684
63228 613684 626724 641493 657897 675184 692290 708609 724345 739988 755657 771335 787459
63217 787459 804720 823351 843071 863607 884629 905111 923426 938298 949226 955871 957623 954010
63205 954010 945070 931048 912246 889397 863673 835987 806776 776842 747846 721464 698361 678439
63193 678439 661715 648417 638517 631762 628112 627757 630742 636886 645973 657803 672215 689280 709246
63180 709246 732095 757371 784546 813093 841949 869388 893981 915337 933479 947882 957772 963205
63168 963205 965324 965615 965254 964800 963889 961374 956359 949012 939803 928090 912133 890592 863453 831577
63154H31577l5386l7108l6583l4392l1915k9979k8260k6085k3366k0575j8120
63143E09808j5948j3680j1075q401o244m908m139l465k699k004j658j841k500
63130D31246l361m171m780m905m184k842j940k259l106l080j921p41k81o1L77
63115C93991N15q2o78l50N22Q16L88K35J027K361L509M173M396M350M478N313
63099D24964O896Q669J0052J1035J2182J4267J7738K2220K6560K9634L1004L0617
63087F45838K8125K2960J5081N262n245j5057k2761k7304k8549k7279k4492k0832
63075E45747j6659j2412q678n919m107k663r08J340L711N825P625R123J0159J0707
63061E42891J1182J2123J3719J5833J8300K0934K3495K5962K8691L1905L5121
$$ plain form
63154 831577 796191 759083 722500 688108 656193 626214 597954 571869 548503 527928 509808
63143 509808 493860 480180 469105 460704 454460 449552 445413 441948 439249 437245 435587 433746 431246
63130 431246 427885 423714 418934 414029 409845 407003 405063 402804 399698 396618 394697 393956 393675 393614 393991
63115 393991 394506 394424 393746 393396 393918 394734 395122 395357 396384 398745 402254 406427 410823 415173 419651 424964
63099 424964 431860 440529 450581 461616 473798 488065 505803 528023 554583 584217 615221 645838
63087 645838 673963 696923 712004 717266 712021 696964 674203 646899 618350 591071 566579 545747
63075 545747 529088 516676 507998 502079 497972 495309 494401 495741 499452 505277 512902 522025 532184 542891
63061 542891 554073 566196 579915 595748 614048 634982 658477 684439 713130 745035 780156
63050G80156L7487L8721L9450M0573M2367M4299M5489M5540M4887M4355M4325
63039A247649M4581M4949M5642M6814M8127M9133M9761N0027M9593M8017M5220
63028A769513M1151L5196K6532J5196K431j0197k1838l2494m2405n1352n8544
63017A673189o3218o5304o5338o3622o0034n4788m8831m2914l6685k9367k1025
63006A122063j2500m212M101J2453K0151K6505L1356L4624L5971L5230L2808K9289
62994A367839K5061K0602J6699J3936J2192J1090J0616J1000J2037J3052J3398
62983A527522J2677J0472O447Q29n553j2051j8782k6152l3886m0930m6467n0652
62971A323474n4083n6790n8105n7593n5631n2933m9779m6054m1812l7496l3546
$$ plain form
63050 780156 817643 856364 895814 936387 978754 1023053 1068542 1114082 1158969 1203324 1247649
63039 1247649 1292230 1337179 1382821 1429635 1477762 1526895 1576656 1626683 1676276 1724293 1769513
63028 1769513 1810664 1845860 1872392 1887588 1890019 1879822 1857984 1825490 1783085 1731733 1673189
63017 1673189 1609971 1544667 1479329 1415707 1355673 1300885 1252054 1209140 1172455 1143088 1122063
63006 1122063 1109563 1105351 1109452 1121905 1142056 1168561 1199917 1234541 1270512 1305742 1338550 1367839
62994 1367839 1392900 1413502 1430201 1444137 1456329 1467419 1478035 1489035 1501072 1514124 1527522
62983 1527522 1540199 1550671 1557118 1557947 1552394 1540343 1521561 1495409 1461523 1420593 1374126 1323474
62971 1323474 1269391 1212601 1154496 1096903 1041272 988339 938560 892506 850694 813198 779652
62960G79652l0037k6816k3787k1055j8785j7048j5765j4802j4014j3291j2615
62949E71637j2155j2087j2218j1970j1021r766q800q127p321o340n576n077m367
62936D56812l261k206j552j038m13M9J47K94Q39J282R75K30p9J49J20o02j516
62919D50230j959j778j092m9R76J579K042L296N738Q524J0443J1173J1111J0291
62905E10525Q144M478J49l589o249q204r744j0473r923q352o573n031l629k312
62891D49217j274m33N98J690K008J138j22p48p48p46p25j25R62J690J659J400
62875D55441J466J703J741J548J234P16o3j011k119l427m588m941m283l208k476
62860D37733k324k543k790k659j874p19R3K42J33K01L03J41p2J50Q53J601K050
$$ plain form
62960 779652 749615 722799 699012 677957 659172 642124 626359 611557 597543 584252 571637
62949 571637 559482 547395 535177 523207 512186 502420 493620 485493 478172 471832 466256 461179 456812
62936 456812 453551 451345 449793 448755 448342 448391 448538 448832 449671 450953 451928 452158 452079 452228 452348 451746 450230
62919 450230 448271 446493 445401 445352 446328 447907 449949 453245 458983 467507 477950 489123 500234 510525
62905 510525 518669 523147 523296 519707 513458 505254 495510 485037 475114 466762 460189 455158 451529 449217
62891 449217 447943 447510 448108 449798 451806 452944 452822 452074 451326 450580 449855 449730 450692 452382 454041 455441
62875 455441 456907 458610 460351 461899 463133 463849 463786 462775 460656 457229 452641 447700 443417 440209 437733
62860 437733 435409 432866 430076 427417 425543 424824 424917 425159 425292 425493 425796 425937 425865 426015 426868 428469 430519
62843D30519K257K416K470K068R27o70j817j698m06J153K162K451K305K113K248
62828D48498K803L368L478L378L876N270O921Q092Q615Q469P343N189K743Q46
62814E18889m84j764l024l663l255k069p46J63M69M68P50J585K600L333L932M886
62798E22070O229P485Q363R097R982J1032J2162J3347J4443J5241J5903J7103
62786F62457J9454K2876K6742L0504L4063L7650M1570M6061N1196N6827O2696
62775A092096O8563P4171P9080Q2713Q4708Q5030Q3599P9890P3339O4115N3160
62764A920464M1244K8332J4246m25j4555k7475l9251m9935n9121o6363p1630p5137
62752A600394p6988p7239p6120p4032p1403o8537o5405o1630n6942n1635m6285
$$ plain form
62843 430519 432776 435192 437662 439730 440657 439987 438170 436472 436066 437219 439381 441832 444137 446250 448498
62828 448498 451301 454669 458147 461525 465401 470671 477592 485684 494299 502768 510111 515300 518043 518889
62814 518889 518405 516641 513617 509954 506699 504630 503884 504047 504516 504984 505734 507319 509919 513252 517184 522070
62798 522070 528299 535784 544147 553244 563226 574258 586420 599767 614210 629451 645354 662457
62786 662457 681911 704787 731529 762033 796096 833746 875316 921377 972573 1029400 1092096
62775 1092096 1160659 1234830 1313910 1396623 1481331 1566361 1649960 1729850 1803189 1867304 1920464
62764 1920464 1961708 1990040 2004286 2003861 1989306 1961831 1922580 1872645 1813524 1747161 1675531 1600394
62752 1600394 1523406 1446167 1370047 1296015 1224612 1156075 1090670 1029040 972098 920463 874178
62741H74178m1124l6121l1540k7820k4888k2193j9602j7564j6108j4444j1999
62730F10775r336p414o396n735n106m585m164l670l113k567j859p99L73J279K041
62715E59724L080M392N519O261O934P856R056J0523J2329J4419J6654J9227K2551
62702F98525K6595L0654L4071L6950L9948M3573M7777N2101N5973N9037O1308
62691A186512O2980O4036O4114O2764N9719N4907M8360M0136L0295J8959O517
62680A699299o311j8791l0501m1172n0229n6911o0960o3016o4082o4674o4565
62669A178087o3210o0324n6075n1076m6189m2150l9059l6295l3213k9928k7102
62658F93466k4928k2745j9979j7056j4827j3407j2179j0775r339p887o302n040
$$ plain form
62741 874178 833054 796933 765393 737573 712685 690492 670890 653326 637218 622774 610775
62730 610775 601439 594025 587629 581894 576788 572203 568039 564369 561256 558689 556830 556031 556404 557683 559724
62715 559724 562804 567196 572715 578976 585910 593766 602822 613345 625674 640093 656747 675974 698525
62702 698525 725120 755774 789845 826795 866743 910316 958093 1010194 1066167 1125204 1186512
62691 1186512 1249492 1313528 1377642 1440406 1500125 1555032 1603392 1643528 1673823 1692782 1699299
62680 1699299 1692988 1674197 1643696 1602524 1552295 1495384 1434424 1371408 1307326 1242652 1178087
62669 1178087 1114877 1054553 998478 947402 901213 859063 820004 783709 750496 720568 693466
62658 693466 668538 645793 625814 608758 593931 580524 568345 557570 548231 540344 534042 529002
62646E29002m915n812o448n933m845m126l769l280k795k687k664k190j461r31
62632D77146k34J233K869L248K099O34k84j096k252l139l072k406j858j429q30
62617D70629l49l72m64J62J401K284K281J878J820K258K844L309L819M820O509
62602E02829Q392R710J0383J1179J2720J4784J6869J8981K1343K3792K6126K8755
62590G05863L2213L6081L9037M0101L9417L7809L5936L3848L0848K5958J8953
62579A076064J0913L230l832j0986j8452k5406l0920l4701l6798l7387l7193l7195
62567H17337l7404l6601l3944l0274k7108k4836k2726k0313j7949j6034j4454
62556E35694j2927j1311r617q091p129o675n980m605l335l200l832l827k840k057
$$ plain form
62646 529002 524087 518275 511827 505894 501049 496923 493154 489874 487079 484392 481728 479538 478077 477146
62632 477146 476912 478145 481014 484262 486361 486995 486711 485615 483363 480224 477152 474746 472888 471459 470629
62617 470629 470280 469908 469444 469606 471007 473291 475572 477450 479270 481528 484372 487681 491500 496320 502829
62602 502829 511221 520931 531314 542493 555213 569997 586866 605847 627190 650982 677108 705863
62590 705863 738076 774157 813194 853295 892712 930521 966457 1000305 1031153 1057111 1076064
62579 1076064 1086977 1090207 1086375 1075389 1056937 1031531 1000611 965910 929112 891725 854532 817337
62567 817337 779933 743332 709388 679114 652006 627170 604444 584131 566182 550148 535694
62556 535694 522767 511456 501839 493748 486619 479944 473964 469359 466024 462824 458992 455165 452325 450268
62542D50268k261k563j828l70P09J178J668K431L108L524L830L905L444K571J769
62527D71383J257J132J838L625N683O820P151Q046J0159J2524J4133J5410J7356
62514E76517J9973K2509K4767K7220L0007L2660L4823L6580L7940L8536L7953
62503I19485L5960L2383K7180K0713J3672O625j47o468j2261j7616k2558k6673
62491I70295k9335l0346k9978k8370k5382k1285j7140j3977j1738r465o550l325
62479G43404l13K586N686Q648J0713J1787J2564J3221J2730J0045N610R52k925
62466H34708o084q820j1268j3876j7270k1249k4600k6355k6671k6199k5261k4054
62454F03001k2921k1856k0307j8051j5736j3978j2471j0678q827p455o381n046
$$ plain form
62542 450268 448007 445444 443616 443246 443955 445133 446801 449232 452340 455864 459694 463599 467043 469614 471383
62527 471383 472640 473772 475610 479235 484918 491738 498889 506935 517094 529618 543751 559161 576517
62514 576517 596490 618999 643766 670986 700993 733653 768476 805056 842996 881532 919485
62503 919485 955445 987828 1015008 1035721 1049393 1056018 1055871 1049403 1037142 1019526 996968 970295
62491 970295 940960 910614 880636 852266 826884 805599 788459 774482 762744 753279 746729 743404
62479 743404 743091 745677 751363 760011 770724 782511 795075 808296 821026 831071 836681 837633 834708
62466 834708 828624 819804 808536 794660 777390 756141 731541 705186 678515 652316 627055 603001
62454 603001 580080 558224 537917 519866 504130 490152 477681 467003 458176 450721 444340 439294
62442D39294l508k269j348m40K35J99l25n92m46l23k83J2K98j54j204j703j095
62425D26348k28r7n87j034j256j427j500j426j448j646j568q54J65R18J251J234
62409D16845P94po76q62q25r04q58l07M94R82J145J404J778J815J400J091J485
62392D24794K626M103N407O131O089N404M373L210K000Q64N5p6P59K464M367N607
62376D78177N891N666N505N665O287P553R240J0498J0564R669Q870R094J0474
62363E83153J2490J4481J6223J8129K0804K4291K8040L1673L5379L9387M3520
62352H67570M7590N1740N5878N9139O0396N9148N5458M9377M0981L0884K0179
62341A398340R880O74p036j3401j9253k5407l1790l7587m2162m5410m7351m7928
$$ plain form
62442 439294 435786 433517 432169 431729 431964 432163 431838 431246 430800 430477 430194 430206 430504 430350 429146 427443 426348
62425 426348 426120 426023 425436 424402 423146 421719 420219 418793 417345 415699 414131 413277 413442 414360 415611 416845
62409 416845 417639 417632 416956 416094 415269 414365 413507 413200 413694 414676 415821 417225 419003 420818 422218 423309 424794
62392 424794 427420 431523 436930 443061 449150 454554 458927 462137 464137 465001 465056 464980 465739 468203 472570 478177
62376 478177 484068 489734 495239 500904 507191 514744 523984 534482 545046 554715 563585 572679 583153
62363 583153 595643 610124 626347 644476 665280 689571 717611 749284 784663 824050 867570
62352 867570 915160 966900 1022778 1081917 1142313 1201461 1256919 1306296 1347277 1378161 1398340
62341 1398340 1408220 1408894 1401858 1388457 1369204 1343797 1312007 1274420 1232258 1186848 1139497 1091569
62329A091569m7240m5539m2971l9637l5882l2174k8761k5780k3531k2215k1422
62318G26417k0448j9115j7861j7011j6408j5791j5087j4240j3174j2051j1150
62307E54081j0399r339p674n636l785k643k452k896l147k621j700j291j729k493
62293D96276k928k742j834l14J243K131K315K385K665K908L063L581M643N684
62279E19076O134O081N821N230M160K995K210J713J159P45J029K075L307M237
62265E65972M960N846P109Q740J0660J2935J5851J9620K3959K8292L2530L7295
62253G73769M3008M9125N4735N9493O3359O5611O4947O0696N3414M4138L3598
62242A365893K2427J1590K074n843j2706j9323k6167l3151l9760m5379m9590n2286
$$ plain form
62329 1091569 1044329 998790 955819 916182 880300 848126 819365 793585 770054 747839 726417
62318 726417 705969 686854 668993 651982 635574 619783 604696 590456 577282 565231 554081
62307 554081 543682 534343 526669 521033 517248 514605 512153 509257 506110 503489 501789 500498 498769 496276
62293 496276 493348 490606 488772 488458 489701 491832 494147 496532 499197 502105 505168 508749 513392 519076
62279 519076 525210 531291 537112 542342 546502 549497 551707 553420 554579 555324 556353 558428 561735 565972
62265 565972 570932 576778 583887 592627 603287 616222 632073 651693 675652 703944 736474 773769
62253 773769 816777 865902 920637 980130 1043489 1109100 1174047 1234743 1288157 1332295 1365893
62242 1365893 1388320 1399910 1401984 1396141 1383435 1364112 1337945 1304794 1265034 1219655 1170065 1117779
62230A117779n3531n3418n1943m9067m4903m0006l5232l1132k7552k4002k0371
62219F86622j7039j4361j2284j0574r159q097p373o798o234n783n737o178o694
62206E70311o686o025n192m605m110l388k592k094j754j024J79J226J654J835
62192E37735K448L577M755N675O456P269Q079Q789R362R776J0070J0495J1292
62179F35778J2189J2408J1356R206O582L962J642N4m57k08R2M64K063N882J1400
62164G12413J7071K2078K6898L2113L7400M1949M5257M6976M6548M3634L8696
62153A111033L2534K5468J7531R378K194l438q019j2298j6493k0572k4658k8754
62141A083906l2335l4698l5525l4771l2297k8067k2595j6762j1156n798m95M847
$$ plain form
62230 1117779 1064248 1010830 958887 909820 864917 824911 789679 758547 730995 706993 686622
62219 686622 669583 655222 642938 632364 623205 615108 607735 600937 594703 588920 583183 577005 570311
62206 570311 563625 557600 552408 547803 543693 540305 537713 535619 533865 532841 533020 534246 535900 537735
62192 537735 540183 543760 548515 554190 560646 567915 575994 584783 594145 603921 613991 624486 635778
62179 635778 647967 660375 671731 680937 687519 691481 693123 693177 692720 692512 692604 693068 695131 701013 712413
62164 712413 729484 751562 778460 810573 847973 889922 935179 982155 1028703 1072337 1111033
62153 1111033 1143567 1169035 1186566 1195944 1198138 1194700 1186681 1174383 1157890 1137318 1112660 1083906
62141 1083906 1051571 1016873 981348 946577 914280 886213 863618 846856 835700 829902 829407 834254
62129H34254J0127J5067J9326K2957K6614L0975L5922M0608M4389M7316M9607
62118A177162N1012N1061M9718M7362M4171L9689L3174K4284J3570K437p365j4491
62106A511784j8488j9782j9237j7685j5739j3864j2326j0918q732m641J637R005
62094A381014J5877K1552K6332L0372L2958L3344L1812K9398K6774K3912K0771
62083A674116J7706J5065J2951J1586J1561J3327J6553K0347K3966K7209L0136
62072A874523L2622L4118L3834L1314K6900K1481J5658R462L061k631o492q155
62060B065695p949n969j809M589J2269J9755K5975L0494L3231L4395L4544L4208
62048B279428L3275L0918K6258J8948R185k620j5977l0198m4383n7612o9232p8977
$$ plain form
62129 834254 844381 859448 878774 901731 928345 959320 995242 1035850 1080239 1127555 1177162
62118 1177162 1228174 1279235 1328953 1376315 1420486 1460175 1493349 1517633 1531203 1533640 1526275 1511784
62106 1511784 1493296 1473514 1454277 1436592 1420853 1406989 1394663 1383745 1375013 1370372 1372009 1381014
62094 1381014 1396891 1418443 1444775 1475147 1508105 1541449 1573261 1602659 1629433 1653345 1674116
62083 1674116 1691822 1706887 1719838 1731424 1742985 1756312 1772865 1793212 1817178 1844387 1874523
62072 1874523 1907145 1941263 1975097 2006411 2033311 2054792 2070450 2079912 2082973 2080342 2073850 2065695
62060 2065695 2057746 2051777 2049968 2054557 2066826 2086581 2112556 2143050 2176281 2210676 2245220 2279428
62048 2279428 2312703 2343621 2369879 2388827 2398012 2395392 2379415 2349217 2304834 2247222 2177990 2099013
62036B099013q6862r2932r7136r9360r9562r7844r4489q9852q4154p7387o9600
62025A109835o1332n3498m6735m1005l6030l1810k8534k6074k4037k2244k0841
62014G17695j9828j8896j7890j7001j6232j4985j2686r706p056n192l544j384
62002E73295J295L995O393Q374R667J0024R665R014P974N901K597j183m532p304
61988F35175r796j1824j2851j3023j3261j4029j4566j3948j2475j1330j0998j0752
61976D86322r805q321o936n868m921m042l351k749k039j354j053j147j189p91
61962D32756L9J047J885K106J535P51P69J953L507M334M137L472L093L486M751
61947D69621O517Q146R414J0753J2576J4633J6486J8315K0636K3422K6119K8427
$$ plain form
62036 2099013 2012151 1919219 1822083 1722723 1623161 1525317 1430828 1340976 1256822 1179435 1109835
62025 1109835 1048503 995005 948270 907265 871235 839425 810891 784817 760780 738536 717695
62014 717695 697867 678971 661081 644080 627848 612863 600177 590471 583415 578223 574679 573295
62002 573295 574590 578585 584978 593352 603019 613043 622708 631722 639696 645597 648194 647011 642479 635175
61988 635175 625379 613555 600704 587681 574420 560391 545825 531877 519402 508072 497074 486322
61976 486322 476517 468196 461260 455392 450471 446429 443078 440329 438290 436936 435883 434736 433547 432756
61962 432756 432795 433842 435727 437833 439368 440119 440888 442841 446348 450682 454819 458291 461384 464870 469621
61947 469621 476138 484284 493698 504451 517027 531660 548146 566461 587097 610519 636638 665065
61935F65065L0419L1896L2417L1995L1134L0024K8418K6513K4963K3644K1280
61924I77768J7131J2285Q310N179J530l217q136j2166j5156j7250j8135j7448
61912I30695j5347j2177p964k694L102Q547J3125J7025K0758K4500K7684K9256
61900A036510K8467K5396K0579J4343O958p35p515j2868j7393k1798k5879k8820
61888A017245l0256l0603l0487l0210k9710k8848k7630k6186k4471k2255j9648
61877G16941j7452j6440j6324j5979j4859j3482j2326j0976q885o354m077k141
61865E77646k92J243K060K550L648N553P530R100J0666J2725J5227J8104K1704
61852F87464K6147L0742L4690L8043M1459M5198M8865N1944N4087N4958N4249
$$ plain form
61935 665065 695484 727380 759797 791792 822926 852950 881368 907881 932844 956488 977768
61924 977768 994899 1007184 1015494 1020673 1022203 1018986 1010850 998684 983528 966278 948143 930695
61912 930695 915348 903171 895207 892513 895615 904162 917287 934312 955070 979570 1007254 1036510
61900 1036510 1064977 1090373 1110952 1125295 1132253 1131518 1124003 1111135 1093742 1071944 1046065 1017245
61888 1017245 986989 956386 925899 895689 865979 837131 809501 783315 758844 736589 716941
61877 716941 699489 683049 666725 650746 635887 622405 610079 599103 590218 583864 579787 577646
61865 577646 577354 578597 580657 583207 586855 592408 599938 609038 619704 632429 647656 665760 687464
61852 687464 713611 744353 779043 817086 858545 903743 952608 1004552 1058639 1113597 1167846
61841A167846N1920M8059M2603L5553K7363J8717R881P78q171j5779k0905k3263
61829A334602k3196k0983j6772j0953m166L066J0421J7421K3312K7431K9494K9458
61817A399135K7255K2727J5776O522m490j6233k7548l7707m6514n3793n9032o1743
61805A164355o1938o0028n6445n1654m6359m1217l6366l1658k7362k4164k2243
61794G04921k0909j9382j7636j6084j4795j3516j2242j1203j0377r473q465p648
61782E43191p114o556n731m786l947l275k854k892l286l481l126k651k705l218
61768D87569l504l279l013l048k951k211j253j114k038k986k771j405J22J111
61754D59229J725K301K602K214J423J210K189L838N027N269N129N418O269P194
$$ plain form
61841 1167846 1219766 1267825 1310428 1345981 1373344 1392061 1401942 1402720 1394549 1378770 1357865 1334602
61829 1334602 1311406 1290423 1273651 1262698 1258532 1261598 1272019 1289440 1312752 1340183 1369677 1399135
61817 1399135 1426390 1449117 1464893 1471415 1466925 1450692 1423144 1385437 1338923 1285130 1226098 1164355
61805 1164355 1102417 1042389 985944 934290 887931 846714 810348 778690 751328 727164 704921
61794 704921 684012 664630 646994 630910 616115 602599 590357 579154 568777 559304 550839 543191
61782 543191 536077 529521 523790 519004 515057 511782 508928 506036 502750 499269 496143 493492 490787 487569
61768 487569 484065 480786 477773 474725 471774 469563 468310 467196 465158 462172 459401 457996 458118 459229
61754 459229 460954 463255 465857 468071 469494 470704 472893 476731 481758 487027 492156 497574 503843 511037
61740E11037P892Q523R214R708R778R698R826R917R329P975O586N829N564N294
61726F26170N015N129N671O086N904N297M718M296L798L156K651K506K461K109
61712F84967J532J272J501J558O47j272l583n818p822r246r609r017q188p509
61698F29413o610n234l906l223k938k365j365l23N35J174J341Q56J69n6M6k69
61682F07245j176k035k460k869l689m654n282n504n489n275m946m781m859m903
61668E49323m760m648m639m371l648k934k766k976k936k370j543q36m71m69n84
61653E09372m36L2N36R77J597K327K525J881J113J146J926K756L435M290N222
61638E38699N564N041M205L643L320K837J952O55q58k188l094l827m748n543n425
$$ plain form
61740 511037 518929 527452 536666 546374 556152 565850 575676 585593 594922 602897 609483 615312 620876 626170
61726 626170 631185 636314 641985 648071 653975 659272 663990 668286 672084 675240 677891 680397 682858 684967
61712 684967 686499 687771 689272 690830 691477 690205 686622 680804 672982 663736 654127 645110 636922 629413
61698 629413 622803 617569 613663 610440 607502 605137 603772 603449 603984 605158 606499 607355 607524 607468 607514 607245
61682 607245 606069 604034 601574 598705 595016 590362 585080 579576 574087 568812 563866 559085 554226 549323
61668 549323 544563 539915 535276 530905 527257 524323 521557 518581 515645 513275 511732 510896 510425 509956 509372
61653 509372 508936 508968 509504 510481 512078 514405 516930 518811 519924 521070 522996 525752 529187 533477 538699
61638 538699 544263 549304 553509 557152 560472 563309 565261 565916 565058 562870 559776 555949 551201 545658 540233
61623E40233m186k590j446p46J6J105K395L660M644N107N083M917M756M196K712
61608E69856M31j827l258l724l719l749l812l563k898k151j575r06J36J196J551
61593E41988J089M08q8p39j995l598m706m740l943l234l507m876o589p881q692
61578D88897r318r672r419q715q061p452o427n058m100l827l561k810k121k190
61564D06166k840l514m194n060n737n749n384n151m738l478j752q45j236j993
61550C54495k104j664j267r71m37L33R45J098Q60N45N05Q30J236J498J886K757
61534C60545L720L902L214K658K914L316K789J370J4q33j713l164m902o176o470
61519C61184n768m470l258k607k348j945j298q62q48p77j99N49Q18N76L10R3n60
$$ plain form
61623 540233 536047 533457 532011 531265 531281 532386 534781 538441 543085 548192 553275 558192 562948 567144 569856
61608 569856 570287 568460 565202 561478 557759 554010 550198 546635 543737 541586 540011 539105 539241 540437 541988
61593 541988 543077 543485 543397 542658 540663 537065 532359 527619 523676 520442 516935 512059 505470 497589 488897
61578 488897 479579 469907 460488 451773 443712 436260 429833 424775 420675 416848 413287 410477 408356 406166
61564 406166 403326 399812 395618 390558 384821 379072 373688 368537 363799 360321 358569 357724 356488 354495
61550 354495 352391 350727 349460 348489 348052 348385 349330 350428 351288 351833 352338 353168 354404 355902 357788 360545
61534 360545 364265 368167 371381 374039 376953 380269 383058 384428 384442 383609 381896 378732 373830 367654 361184
61519 361184 355416 350946 347688 345081 342733 340788 339490 338628 337780 337003 336804 337353 338171 338747 339057 339150 338590
61502C38590j733k727k961k775k783k833k321j307n83n26o31l94j9J51L14P26
61486C18188R63M28n71r55k47P95J164P71L12K84N42O87N74K76j63p46j289j380
61468C19633q11j7K43k55q55p84q3M76L43k26n35j78N92J121R92M97L23P05J146
61449C22327J228J287J862K671K806J938P62J21K23Q61J875L009L818M137M417
61434C53342N120N953O156N445M289L290K605K047J468Q12J1r24j699j814j000
61419C85101L76J539K049K312L116M664O271O980O420M943L201J614K09j150k406
61404D25239l269l694m125n031o172o759o441n747n392n405n157m124k442q61
61390C60620k58r36k264l157l094k475j908j497j042n85l06j16J96M59K86k37
$$ plain form
61502 338590 336857 334130 331169 328394 325611 322778 320457 319150 318567 318041 317410 317016 316997 317148 317462 318188
61486 318188 319151 319579 319008 318053 317806 318601 319765 320536 320848 321132 321674 322361 322935 323211 323048 322302 321013 319633
61468 319633 318822 318805 319048 318793 317938 317154 317071 317547 317890 317664 317129 316951 317543 318664 319656 320153 320476 321181 322327
61449 322327 323555 324842 326704 329375 332181 334119 334881 335002 335225 336086 337961 340970 344788 348925 353342
61434 353342 358462 364415 370571 376016 380305 383595 386200 388247 389715 390527 390538 389614 387915 386101 385101
61419 385101 385477 387016 389065 391377 394493 399157 405428 412408 418828 423771 426972 428586 428795 427645 425239
61404 425239 421970 418276 414151 409120 402948 396189 389748 384001 378609 373204 368047 363923 361481 360620
61390 360620 360362 359426 357162 354005 350911 348436 346528 345031 343989 343404 343098 342982 343178 343637 343923 343686
61374C43686n03j96K32K46K7J76P13R46M54j68NJ062K178K678K681K638K677K708
61356C62240K778K933L019L026L363M293N298N594N267N255O103P426Q707J0065
61342D35367J1732J3349J4259J4285J3757J2968J1984J0859R711Q553P283N794
61330E69901M059K201N38p17j831l326n209o820p647p894p978p834p106n805m373
61315E10159l252k641k495k399j831q92m31r91j901k004j072J04R00J428J923
61300D94605K341K823L861N552P123P661P073N927M533K743O01j356k662l545
61286E37280m595n891o837o926o344n601m847l936k978k263j672p22O53J932K796
61271D90049L565M492N195N297N154N353N819O075O067O095O038N443M421L809
$$ plain form
61374 343686 343183 342987 343219 343465 343492 343668 344381 345327 345781 345613 345618 346680 348858 351536 354217 356855 359532 362240
61356 362240 365018 367951 370970 373996 377359 381652 386950 392544 397811 403066 409169 416595 425302 435367
61342 435367 447099 460448 474707 488992 502749 515717 527701 538560 548271 556824 564107 569901
61330 569901 573960 576161 576699 575982 574151 570825 565616 558796 551149 543255 535277 527443 520337 514532 510159
61315 510159 506907 504266 501771 499372 497541 496649 496218 495227 493326 491322 490250 490354 491254 492682 494605
61300 494605 496946 499769 503630 509182 516305 523966 531039 536966 541499 544242 544843 543487 540825 537280
61286 537280 532685 526794 519957 513031 506687 501086 496239 492303 489325 487062 485390 484668 485321 487253 490049
61271 490049 493614 498106 503301 508598 513752 519105 524924 530999 537066 543161 549199 554642 559063 562872
61257E62872M291N795P838R985J1946J3696J5582J7803J9718K0214J8834J6128
61245G24702J2785R011M954J052k395n548q579j1258j3296j4707j5495j5431j4567
61232F51228j3525j2741j1794j0066p821o023n074m445l611k696j971j222q3J324
61218E71480K578L591M630N646O081N502M265L251K976L184L247K892K410K310
61204F24043K755L371L558L075K257J670J661K342L813O088Q832J1517J3988J6599
61190G05569J9628K2813K5650K7992L0066L2004L3542L4198L3694L2145K9954
61179A027255K7472K4918K2595K0965K0122J9434J8141J6234J4192J1942Q833
61168A232103M829Q75k382n510r237j3140j6231j8499k0981k4285k7831l0587
$$ plain form
61257 562872 567163 572958 580796 590781 602727 616423 632005 649808 669526 689740 708574 724702
61245 724702 737487 746498 751452 752504 750109 744561 735982 724724 711428 696721 681226 665795 651228
61232 651228 637703 624962 613168 603102 595281 589258 584184 579739 576128 573432 571461 570239 570156 571480
61218 571480 574058 577649 582279 587925 594006 599508 603773 607024 610000 613184 616431 619323 621733 624043
61204 624043 626798 630169 633727 636802 639059 640729 642390 644732 648545 654633 663465 674982 688970 705569
61190 705569 725197 748010 773660 801652 831718 863722 897264 931462 965156 997301 1027255
61179 1027255 1054727 1079645 1102240 1123205 1143327 1162761 1180902 1197136 1211328 1223270 1232103
61168 1232103 1236932 1237807 1235425 1229915 1220678 1207538 1191307 1172808 1151827 1127542 1099711 1069124
61156A069124l2092l2585l2638l2676l2603l1910l0411k8572k6786k4662k1609
61145G42580j7856j4253j1231q652o447m638k914j089K4p95l363n801o450n466
61131F53649m031k705j200P38K954N186P188Q699R841J1435J4393J8648K3014
61118G47809K6401K8925L1616L5104L8920M2165M4585M6687M8897N1065N2747
61107A194921N3615N3557N2758N1750N0788M9160M5802M0880L5941L1994K8271
61096A689437K3478J7538J1189M560k706j0283j7291k3412k8991l4090l8414m1994
61084A549021m5117m7613m9090m9729m9990m9738m8542m6694m4883m3038m0562
61073A034025l7593l4901l2522k9717k6341k3023j9937j6611j3176j0535q970
$$ plain form
61156 1069124 1037032 1004447 971809 939133 906530 874620 844209 815637 788851 764189 742580
61145 742580 724724 710471 699240 690588 684141 679503 676589 675500 675524 674729 671366 665565 659115 653649
61131 653649 649618 646913 645713 646451 649405 654591 661779 670478 680319 691754 706147 724795 747809
61118 747809 774210 803135 834751 869855 908775 950940 995525 1042212 1091109 1142174 1194921
61107 1194921 1248536 1302093 1354851 1406601 1457389 1506549 1552351 1593231 1629172 1661166 1689437
61096 1689437 1712915 1730453 1741642 1746202 1743496 1733213 1715922 1692510 1663519 1629429 1591015 1549021
61084 1549021 1503904 1456291 1407201 1357472 1307482 1257744 1209202 1162508 1117625 1074587 1034025
61073 1034025 996432 961531 929009 899292 872951 849928 829991 813380 800204 789669 780699
61062G80699p735o351n118m031k450l36J405K361L307M866O594P950R178J0604
61048H00943J2013J3314J4913J6904J8730K0173K1829K4221K7279L0912L5125
61037A036356L9320M2573M4875M6999M9073N0485N1304N2276N3404N4203N5390
61026A576258N8232O1893O3717O2724O0599N8626N6343N4239N4788N9125O5297
61015B231841P1627P9241Q9186R9809J09558J20075J34054J52582J77365K12922
61005C478260K63113L27812M06417N02044O18526P56473R17410J108918J339812
60996I718785J611865J917903K232523K481677K526640K223585J548072O70278
60988B4931328j19427n86473o70306m55288p1074L48537O37638O08089J55436
$$ plain form
61062 780699 772964 766613 761495 757464 755014 754678 756083 758444 761751 766617 773211 781161 790339 800943
61048 800943 812956 826270 841183 858087 876817 896990 918819 943040 970319 1001231 1036356
61037 1036356 1075676 1118249 1163124 1210123 1259196 1309681 1360985 1413261 1466665 1520868 1576258
61026 1576258 1634490 1696383 1760100 1822824 1883423 1942049 1998392 2052631 2107419 2166544 2231841
61015 2231841 2303468 2382709 2471895 2571704 2681262 2801337 2935391 3087973 3265338 3478260
61005 3478260 3741373 4069185 4475602 4977646 5596172 6352645 7270055 8378973 9718785
60996 9718785 11330650 13248553 15481076 17962753 20489393 22712978 24261050 24931328
60988 24931328 24811901 24225428 23555122 23099834 23028760 23377297 24014935 24623024 24778460
60979B4778460o31090j490305k147117k466281k477679k291653k011833j707149
60971I555353j419839j171134r63241p89452o45157n27973m33091l55034k92079
60962B958353k44309k08868j80940j58012j39682j24643j11135r9279q9828q1505
60952A520152p2322o2602n3912m6023l7874l0754k7345k7809k9460l0319l0478
60941A071254l0048k8393k5766k3557k2333k1325k0035j8809j7729j6532j5646
60930H31081j5787j6457j6353j5211j3880j2757j1607j0753j0772j1082j0514
60919F85908r294q809r299r439q452p085o169n634n314n392n665n489m802m198
60905E90867l868l577l556m212m970m752l671k933k975l097k995l166l565l467
$$ plain form
60979 24778460 24147370 22657065 20509948 18043667 15565988 13274335 11262502 9555353
60971 9555353 8135514 6964380 6001139 5211687 4566530 4038557 3605466 3250432 2958353
60962 2958353 2714044 2505176 2324236 2166224 2026542 1901899 1790764 1691485 1601657 1520152
60952 1520152 1447830 1385228 1331316 1285293 1247419 1216665 1189320 1161511 1132051 1101732 1071254
60941 1071254 1041206 1012813 987047 963490 941157 919832 899797 880988 863259 846727 831081
60930 831081 815294 798837 782484 767273 753393 740636 729029 718276 707504 696422 685908
60919 685908 676614 667805 658506 649067 640615 633530 627361 621727 616413 611021 605356 599867 595065 590867
60905 590867 586999 583422 579866 575654 570684 565932 562261 559328 556353 553256 550261 547095 543530 540063
60891E40063k980l228m500n674n994o014o279o388o097n939o051n619m322l170
60877D67808l073l557l762l639l463l104k622k587k963k704j323O9L68J34N26
60862D36108J439K002K324L292M910O162O446O078N361M205K851K030K165K986
60848D88359M065N097N672N356M227K815J399j60j781k974l562m097n155o468
60834D92793p266p365p370p792q308q283p638o822o031n054l947l279l341l585
60820D06712l335k703k239j956j359l86L67M59J26r8J18Q49J944K995L617L832
60804D08943L976M231M522M780N013N148N106M940M656M114L433L121L449L896
60790D69328L738K964K070J322P63N67O74L62q57k187k385j595j298k268l622
$$ plain form
60891 540063 537083 533855 529355 523681 517687 511673 505394 499006 492909 486970 480919 475300 470978 467808
60877 467808 464735 461178 457416 453777 450314 447210 444588 442001 439038 436334 435011 435080 435448 435582 436108
60862 436108 437547 439549 441873 445165 450075 456237 462683 468761 474122 478327 481178 483208 485373 488359
60848 488359 492424 497521 503193 508549 512776 515591 516990 516830 515049 512075 508513 504416 499261 492793
60834 492793 485527 478162 470792 463000 454692 446409 438771 431949 425918 420864 416917 413638 410297 406712
60820 406712 403377 400674 398435 396479 395120 394734 395101 395560 395686 395588 395706 396555 398499 401494 405111 408943
60804 408943 412919 417150 421672 426452 431465 436613 441719 446659 451315 455429 458862 461983 465432 469328
60790 469328 473066 476030 478100 479422 480185 480752 481426 481788 480931 478744 476359 474764 473466 471198 467576
60775D67576m207m036l870m116m621m999m900m323l870m154m862m995m141k911
60761D07571k009j602j700k317l008l011k233j446j185j142r03n19p5O24J510
60746C88555K121K367K753L455L908L717L288L015K596J718P75K65M9j34K6R49
60730D19423K324L390L747L465K784K180K302L264M308M632M225L513K659J682
60716D63898Q92N75N31L56nl86p69j151j364j360j388j621j944k323k920l606
60700D47415l922l812l786m010l949l407l114l596m173l940l187k886l122l067
60686C97444k353j533j151j098r92o36l1O51J083J160J274J868K855L759M242
60671D06542M205L689L015K734L033L508L754L833L837L586L140L026L305L142
$$ plain form
60775 467576 463369 459333 455463 451347 446726 441727 436827 432504 428634 424480 419618 414623 410482 407571
60761 407571 405562 403960 402260 399943 396935 393924 391691 390245 389060 387918 387015 386496 386421 387045 388555
60746 388555 390676 393043 395796 399251 403159 406876 410164 413179 415775 417493 418268 418533 418582 418448 418474 419423
60730 419423 421747 425137 428884 432349 435133 437313 439615 442879 447187 451819 456044 459557 462216 463898
60716 463898 464790 465365 465896 466252 466247 465861 465092 463941 462577 461217 459829 458208 456264 453941 451021 447415
60700 447415 443493 439681 435895 431885 427936 424529 421415 417819 413646 409706 406519 403633 400511 397444
60686 397444 395091 393558 392407 391309 390317 389681 389650 390301 391384 392544 393818 395686 398541 402300 406542
60671 406542 410747 414436 417451 420185 423218 426726 430480 434313 438150 441736 444876 447902 451207 454349
60657D54349K012P48M25P79P30N0o74j350k349l231k927j428n4M08O19J186J405
60640D50698M89r11j484j164j094j839k651k695k186j786j550r96l7Q67J447J986
60624D37094K666L129L066K882L164L676L644K990K518K664K849K399J495P10
60610D74946K70K55Q81J931K471J970J231J372K187K518K038J616J840K156J840
60595D99522J098P38J182K126K923L115K779K426K372K370K060J571J228R03K20
60580E26633p09j372j656j913k238k294j994j735j778j928j993k062k052j536
60566E01373l40J091K252L142L962M593M799M679M516M298L692K552J176O5m86
60551E41364n49l95j51K99J070J968K643K943L040L181L503M037M681N156N181
$$ plain form
60657 454349 456361 457109 457534 458313 459043 459093 458419 457069 454720 451489 448562 447134 447080 447488 448107 449293 450698
60640 450698 451187 450276 448792 447628 446534 444695 442044 439349 437163 435377 433827 432831 432794 433661 435108 437094
60624 437094 439760 442889 445955 448837 452001 455677 459321 462311 464829 467493 470342 472741 474236 474946
60610 474946 475216 475471 476352 478283 480754 482724 483955 485327 487514 490032 492070 493686 495526 497682 499522
60595 499522 500620 501358 502540 504666 507589 510704 513483 515909 518281 520651 522711 524282 525510 526413 526633
60580 526633 525924 524552 522896 520983 518745 516451 514457 512722 510944 509016 507023 504961 502909 501373
60566 501373 501033 502124 504376 507518 511480 516073 520872 525551 530067 534365 538057 540609 541785 541850 541364
60551 541364 540815 540420 540269 540568 541638 543606 546249 549192 552232 555413 558916 562953 567634 572790 577971
60536E77971M715L982L277K833K764K930K930K464J726J322J746K940M383N557
60522F21540O402P255Q262R009R050Q680Q735R575J0764J1860J2964J4193J5144
60509G53433J5376J5062J4750J4742J5020J5410J5528J4997J4120J3911J5004
60498I17353J6919J8809K0463K1971K3013K3215K2804K2127K0799J8172J4411
60487A140056J0189N524j82o895j3635j9515k4327k8007l0356l1465l1734l1277
60475I38376k9924k7935k6078k4706k3457k2071k0900k0279j9923j9337j8459
60464F85307j7518j6553j5375j3846j2078j0530r781r898j0121r621q481p551
60452E43954p370p745q262q597q369p393o156n416n270n123m686m245l962l646
$$ plain form
60536 577971 582686 586668 589945 592778 595542 598472 601402 603866 605592 606914 608660 611600 615983 621540
60522 621540 627942 635197 643459 652468 661518 670198 678933 688508 699272 711132 724096 738289 753433
60509 753433 768809 783871 798621 813363 828383 843793 859321 874318 888438 902349 917353
60498 917353 934272 953081 973544 995515 1018528 1041743 1064547 1086674 1107473 1125645 1140056
60487 1140056 1150245 1155769 1155587 1148692 1135057 1115542 1091215 1063208 1032852 1001387 969653 938376
60475 938376 908452 880517 854439 829733 806276 784205 763305 743026 723103 703766 685307
60464 685307 667789 651236 635861 622015 609937 599407 589626 579728 569607 559986 551505 543954
60452 543954 536584 528839 520577 511980 503611 496218 490062 484646 479376 474253 469567 465322 461360 457714
60438D57714l453l923n011n780n579m830m203l665k931k300k333k913l280k965
60424D04548k237j654j478j518j362q13j01M61R00J345J541J125L18k23l42m53
60408D00057o15k64O86J298P15o42j537j272j18J210J985J746O50n06j000p78
60392D01615k06M81J191J810K358L009L646L742L021J943J102M95j61p02p22l50
60376D22272k41p34j494k048k277k213j729o99O57J777K145J641N70n50j184r99
60360D14894j16Q09J064O60L53O80J274J461J192R35R03R61J066J164Q68K4n66
60343D27626J24J801L039L186L094L625M401M672M597M809N380O016O851Q126
60329D87347R348R526Q277O087L573R89j572l994o188q002r088r137q221o739
$$ plain form
60438 457714 454261 450338 445327 439547 433968 429138 424935 421270 418339 416039 413706 410793 407513 404548
60424 404548 402311 400657 399179 397661 396299 395486 395385 395846 396746 398091 399632 400757 401075 400852 400510 400057
60408 400057 399442 399178 399864 401162 401877 401235 399698 398426 398308 399518 401503 403249 403899 403393 402393 401615
60392 401615 401409 401890 403081 404891 407249 410258 413904 417646 420667 422610 423712 424207 424046 423344 422622 422272
60376 422272 422031 421297 419803 417755 415478 413265 411536 410837 411494 413271 415416 417057 417627 417077 415893 414894
60360 414894 414778 415587 416651 417311 417664 418344 419618 421079 422271 423206 424109 425070 426136 427300 428168 428192 427626
60343 427626 427750 429551 432590 435776 438870 442495 446896 451568 456165 460974 466354 472370 479221 487347
60329 487347 496695 506221 514498 520585 524158 525147 523575 519581 513393 505391 496303 487166 478945 472206
60315D72206n124l696k610j768r80k78K01O72J666L227M733N810P033R275J2506
60300E02873J5597J7180J6566J4104J0878P689M179o01o582j2181j5731j6919
60288E37052j6446j4901j2593j0034p786n951m313k879j832j136o17k66o6K26
60274D58458O40O16m06k017l022k754j805j328j710k131j537M1J442J897K073
60259D48457L023M511N420N678O403P838Q558P505N570M069K653J69l110n619
60245E01125o637o924p208p292o828o018n186m383l584k769j824q21k43k91k36
60230D40881O59J833K037J248R08J986L769M920M988M474M064M164M682M935M237
60215D89785K804J624J375J892K768L725M342M170L487L222L746M335M280L915
$$ plain form
60315 472206 467082 463386 460776 459008 458028 457750 457951 458623 460289 463516 468249 474059 481092 490367 502873
60300 502873 518470 535650 552216 566320 577198 584887 589066 588465 581883 569702 553971 537052
60288 537052 520606 505705 493112 483078 475292 469341 465028 462149 460317 459181 458564 458298 458232 458458
60274 458458 459098 459714 459308 457291 454269 451515 449710 448382 446672 444541 443004 443045 444487 446384 448457
60259 448457 451480 455991 461411 467089 473492 481330 489888 497393 502963 507032 509685 509854 506744 501125
60245 501125 494488 487564 480356 473064 466236 460218 455032 450649 447065 444296 442472 441651 441408 441117 440881
60230 440881 441540 443373 445410 446658 447566 449552 453321 458241 463229 467703 471767 475931 480613 485548 489785
60215 489785 492589 494213 495588 497480 500248 503973 508315 512485 515972 519194 522940 527275 531555 535470
60201E35470M052M777N398N319M587L721L315L521L783L350K221J225R57J157
60187E82853J337J511J841J957J285j33j570k358k370j916j507j647k490l618
60173E73175m400m593m415m109l629k852j898j092o02k70J25N55Q47J060J478
60158E49380K204L044L902M870N772O085N651N082M899M682L630J795J4j137j617
60143E98256j312j2J883L467M481N683P728J0269J2481J3940J4571J4277J3077
60130F98789J1286R060O075K059k551o741r607j0769j0394r148p803o686n622
60117F57948m494l500k739k033j367j020r56o08L53J401J849J742J524J263Q01
60102F50164M27N56Q44M28q10j870j836r11N4N82P35O67O21J100K496M374N710
$$ plain form
60201 535470 539522 544299 549697 555016 559603 563324 566639 570160 573943 577293 579514 580739 581696 582853
60187 582853 584190 585701 587542 589499 590784 590651 589081 586723 584353 582437 580930 579283 576793 573175
60173 573175 568775 564182 559767 555658 552029 549177 547279 546187 545585 545315 545440 545995 546842 547902 549380
60158 549380 551584 554628 558530 563400 569172 575257 580908 585990 590889 595571 599201 600996 601010 599873 598256
60143 598256 596944 596932 598815 602282 606763 612446 620174 630443 642924 656864 671435 685712 698789
60130 698789 710075 719135 725210 727269 724718 717977 708370 697601 687207 678059 670256 663570 657948
60117 657948 653454 649954 647215 645182 643815 642795 641839 641231 641584 642985 644834 646576 648100 649363 650164
60102 650164 650591 651147 651991 652419 651609 649739 647903 646992 647046 647628 648363 649030 649651 650751 653247 657621 663331
60085F63331O075O200O997Q239Q729P825O269N255N000M670L535J724j64j772
60071G31913l059m032m697n197n820o836q373j0212j1663j1892j0687q875p679
60058F32891p559p874p777p218o784o740o649o043n079m188l417k507j496o82
60044E58878j5Q89K046K958L410L854M640N413N687N611N590N535N045M158L307
60029F17006K597J753O65m62j598k964m635o373p957r322j0421j1248j1914j2403
60015E42724j2440j1913j1225j0737j0138q915p249n813m773l729k570j664j124
60002D50434o17k8L15K72J20P1J24M74J328K248K509K315K723M048N282N665N834
59985D83117O702P939Q591Q525Q268P757O345L998J513n32k259l802m928n575
$$ plain form
60085 663331 669406 675606 682603 690842 699571 707396 713665 718920 723920 728590 732125 733849 733685 731913
60071 731913 728854 724822 720125 714928 709108 702272 693899 683687 672024 660132 649445 640570 632891
60058 632891 625332 617458 609681 602463 595679 588939 582290 576247 571168 566980 563563 561056 559560 558878
60044 558878 558863 559752 561798 564756 568166 572020 576660 582073 587760 593371 598961 604496 609541 613699 617006
60029 617006 619603 621356 622021 621559 619961 616997 612362 605989 598032 588710 578289 567041 555127 542724
60015 542724 530284 518371 507146 496409 486271 477356 470107 464294 459521 455792 453222 451558 450434
60002 450434 449817 449789 450104 450376 450496 450567 450691 451165 452493 454741 457250 459565 462288 466336 471618 477283 483117
59985 483117 489819 497758 506349 514874 523142 530899 537244 541242 542755 542223 539964 536162 531234 525659
59971E25659o105o700o928o327n126m052l562l469l280k689j749p80j46n7m61
59956D74228r88j189r73p42q69j098q97k80J34K1j77J8M29N80M06J81j5l03p15
59937D67751j248k043l107l987m231m069m181m715m999m437l296k363j993j827
59923D21255j374o25K4L46N50R39J441J677J501J227J276J705K215K581K920L488
59907D41146M242M719M474L620K739K260K178K421L016L702L830L152K333K171
59893D86003K574K906L025L262L581L652L750M570O021P110P302P191P431P834
59879E56212Q052Q316Q941R660J0061J0113R710Q305N672K532k60k708n188p524
59865F21894r306j0707j2080j3022j2731j1213r330p734o458n424m602l629k077
$$ plain form
59971 525659 519554 512854 505926 499599 494473 490421 486859 483390 480110 477421 475672 474892 474746 474689 474228
59956 474228 473240 472051 471078 470336 469467 468369 467472 467192 467326 467347 467170 467188 467617 468197 468603 468784 468769 468466 467751
59937 467751 466503 464460 461353 457366 453135 449066 444885 440170 435171 430734 427438 425075 423082 421255
59923 421255 419881 419256 419280 419626 420176 421115 422556 424233 425734 426961 428237 429942 432157 434738 437658 441146
59907 441146 445388 450107 454581 458201 460940 463200 465378 467799 470815 474517 478347 481499 483832 486003
59893 486003 488577 491483 494508 497770 501351 505003 508753 513323 519344 526454 533756 540947 548378 556212
59879 556212 564264 572580 581521 591181 601242 611355 621065 629370 635042 637574 637314 634606 629418 621894
59865 621894 612588 601881 589801 576779 564048 552835 543505 535771 529313 523889 519287 515658 513581
59852E13581j22J660L166M778O566Q216R783J1641J3484J4177J2958J0142O462
59839F16492K449j144l168l041j476L69K020L398L915K823M14j957l249l585l533
59824F10727l245k757k625l561n412p199q289r110j0328j1679j2113j1079r140
59811E14190p218n652m265l044k318k205k231j723n38P45J427J415J137P86L3
59796D90539j291k613l260l396l768m487m787m141k957j896j083m03p4k93o87
59781D55403o78k73L0Km1K24O94R49O89K3n58o11j38N62J345K171K715K613K131
59762D67252J949K127J978J269P84J176K032K621K919L113K811J718O19N74J389
59747D94331J866J472Q65P68J202J853K361K249J318K07k12K0J39p7j07K15L93
$$ plain form
59852 513581 513459 515119 518285 523063 529629 537845 547628 559269 572753 586930 599888 610030 616492
59839 616492 618941 617797 614629 611588 610112 610481 612501 615899 619814 622637 623051 621094 617845 614260 610727
59824 610727 607482 604725 602100 598539 593127 585928 577639 568529 558201 546522 534409 523330 514190
59811 514190 506972 501320 497055 494011 491693 489488 487257 485534 484996 485741 487168 488583 489720 490506 490539
59796 490539 489248 486635 483375 479979 476211 471724 466937 462796 459839 457943 456860 456457 456383 456090 455403
59781 455403 454725 454452 454482 454484 454443 454667 455361 456310 456999 457022 456464 455853 455715 456277 457622 459793 462508 465121 467252
59762 467252 469201 471328 473306 474575 475359 476535 478567 481188 484107 487220 490031 491749 492368 492942 494331
59747 494331 496197 497669 498534 499302 500504 502357 504718 506967 508285 508492 508280 508300 508439 508362 508255 508470 508863
59730E08863K31J82M05M16P0KO06J337J564J376J085O43J12K6N18P80J88n55l35
59711E17514P07J431J395J208J209Q65r7q69n60N24J256J132O62K95k73j391k496
59694E22512k556j440j99K05l4k10k40n57j069j120n07J87M70N71Q40J164J325
59677E19342J480J820K060J796J051J29q89k114l479m781n845o360n868m347k566
59662D91429j374p11J44J458K717L398L503L229K657K021J810K243K906L285L423
59647E22138L687M043L967L108J658j0j733l394m638n130m984m630m254l619k497
59632E03712j041L64J426K078K438K750L146L420L225K647K260K492L104L540
59618E35561L517L085K360J413K38j312l179m557m312k410k90Q85J753L552N885
$$ plain form
59730 508863 509094 509276 509681 510097 510167 510169 510775 512112 513676 515052 516137 516780 516892 516918 517436 518216 518404 517849 517514
59711 517514 518221 519652 521047 522255 523464 524329 524232 523363 522803 523327 524583 525715 526377 526672 526399 525008 522512
59694 522512 519956 518516 518317 518522 518488 518278 518038 517481 516412 515292 514785 514972 515442 516013 516853 518017 519342
59677 519342 520822 522642 524702 526498 527549 527678 526789 524675 521196 516415 510570 504210 498342 493995 491429
59662 491429 490055 489344 489488 490946 493663 497061 500564 503793 506450 508471 510281 512524 515430 518715 522138
59647 522138 525825 529868 533835 536943 538601 538591 536858 533464 528826 523696 518712 514082 509828 506209 503712
59632 503712 502671 503035 504461 506539 508977 511727 514873 518293 521518 524165 526425 528917 532021 535561
59618 535561 539078 542163 544523 545936 546174 544862 541683 537126 532814 530404 530114 530999 532752 536304 542189
59603E42189P026O397N297M790M236K674N17j186k358l537m530m686m290m416
59589E48123n290n892n489m623m179m282m552m796m873m389l154j737r21q04r21
59574D92221j054j363j807j994j787j509j355r84k5J283K337K886L160L346L298
59559D96653K881K280J819J590J465J444J791K658L612L755K659J113N11J290
59545E25521K341K446J901K077L517N315O579P670R492J2222J5478J9143K3000
59532F36702K5579K4470J8464R189L22m894n539k983O89M246P602J0875J3695
59519G38417J5586J6561J6806J6016J3721J0161O238K452j523n950j0275j3703
59507H04507j6121j7971j9373j9907j9332j8075j6784j5607j4173j2311j0411
$$ plain form
59603 542189 549215 555612 560909 565699 569935 572609 573126 571940 569582 566045 561515 556829 552539 548123
59589 548123 542833 536941 531452 526829 522650 518368 513816 509020 504147 499758 496604 494867 493946 493142 492221
59574 492221 491167 489804 487997 486003 484216 482707 481352 480368 480343 481626 483963 486849 490009 493355 496653
59559 496653 499534 501814 503633 505223 506688 508132 509923 512581 516193 519948 522607 523720 524231 525521
59545 525521 527862 530308 532209 534286 537803 543118 549697 557367 566859 579081 594559 613702 636702
59532 636702 662281 686751 705215 714404 714726 709832 704293 701310 701999 706245 713847 724722 738417
59519 738417 754003 770564 787370 803386 817107 827268 833506 835958 834435 828485 818210 804507
59507 804507 788386 770415 751042 731135 711803 693728 676944 661337 647164 634853 624442
59496F24442q945p824o565n040l596k377r83Q90K827M096M487M430M400M620N144
59481F20006N908O790P907R660J2127J4614J6325J7323J8334J9559K0183J9213
59469G87949J6399J2284P676L245n40l225m191k982PL512O531R191J2222J5954
59455H64032K0339K5534L1556L7598M2592M6517N0489N5475O1585O8324P4481
59444A378522P7491P3945O1430L9770J0941k1288n1686p5104q8772r2925q9292
59433A223032q0032o8165n7286m9454m3983l9118l4291k9912k5857k1364j6102
59422G57468j0366m461J363O692J1446J6218K1326K5986K9297L1462L3041L3662
59410I53134L2914L1929L1935L1032K4645J0508q023k4701l5449l9819l8986l4337
$$ plain form
59496 624442 615497 607673 601108 596068 592472 590095 589112 590002 592829 596925 601412 605842 610242 614862 620006
59481 620006 625914 632704 640611 650271 662398 677012 693337 710660 728994 748553 768736 787949
59469 787949 804348 816632 824308 827553 827013 823788 819597 816615 816622 820134 826665 835856 848078 864032
59455 864032 884371 909905 941461 979059 1021651 1068168 1118657 1174132 1235717 1304041 1378522
59444 1378522 1456013 1529958 1591388 1631158 1642099 1620811 1569125 1494021 1405249 1312324 1223032
59433 1223032 1143000 1074835 1017549 968095 924112 884994 850703 820791 794934 773570 757468
59422 757468 747102 742641 744004 750696 762142 778360 799686 825672 854969 886431 919472 953134
59410 953134 986048 1017977 1049912 1080944 1105589 1116097 1108074 1083373 1047924 1008105 969119 934782
59398I34782k7635k0467j3067n094J836L829j781j3104k4805l2388l4791l3423
59386G33892l0009k5772k1615j8056j5050j2369j0039q227o934o097n765n749
59374E68210n381m194k664j711j504j339p52o4L40N77Q20Q85P55J002K149L911
59358E61040N579O933Q290R775J1141J2245J3283J4538J6260J8724K2038K5784
59346G25630K9177L1726L3558L4997L6075L6571L6332L5383L3685L0995K7005
59335A091134K1639J5073P563o01q872j6442k2743k7842l2088l5504l7780l8756
59323I14781l8528l7244l5217l3106l1339k9384k6286k2076j7971j4925j2684
59312F16021j0598q645p095n773m334k895j702m95J165L179N162P140R408J1786
$$ plain form
59398 934782 907147 886680 873613 868519 870355 874184 872403 859299 834494 802106 767315 733892
59386 733892 703883 678111 656496 638440 623390 611021 600982 592755 585821 579724 573959 568210
59374 568210 562829 558635 555971 554260 552756 551417 550665 550601 550941 551518 552338 553223 553978 554980 557129 561040
59358 561040 566619 573552 581842 591617 602758 615003 628286 642824 659084 677808 699846 725630
59346 725630 754807 786533 820091 855088 891163 927734 964066 999449 1033134 1064129 1091134
59335 1091134 1112773 1127846 1135409 1134808 1125936 1109494 1086751 1058909 1026821 991317 953537 914781
59323 914781 876253 839009 803792 770686 739347 709963 683677 661601 643630 628705 616021
59312 616021 605423 596778 589683 583910 579576 576681 574979 574484 575649 578828 583990 591130 600538 612324
59298F12324J3724J5176J6681J8315J8901J6634J0509J396q141j5308j8783j9128
59286F62300j7588j4906j1471p962n083k914j135L15J384K532M486P267J0128
59273F27353J2538J4676J6818J8855K0695K2608K4724K6532K7205K6340K4090
59262H62434K0738J6412J1216N495k48n618j0510j4895j8536k1096k2505k2894
59250G99993k2217k0344j7687j5166j3179j1072q202n099k855j590k73J879M558
59237F88746P062R203J1258J3417J5536J7220J8026J7832J6967J5675J3563J0052
59225H54557N370N28l880q198j2782j7080k0232k2161k3475k4359k4231k2667
59213F81390k0178j7731j5739j3879j1894j0134r084q652q285p748p311p041o423
$$ plain form
59298 612324 626048 641224 657905 676220 695121 711755 722264 723660 715519 700211 681428 662300
59286 662300 644712 629806 618335 610373 605290 602376 601241 601556 602940 605472 609958 617225 627353
59273 627353 639891 654567 671385 690240 710935 733543 758267 784799 812004 838344 862434
59262 862434 883172 899584 910800 916295 916047 910429 899919 885024 866488 845392 822887 799993
59250 799993 777776 757432 739745 724579 711400 700328 692126 687027 684172 682582 682309 684188 688746
59237 688746 695808 705011 716269 729686 745222 762442 780468 798300 815267 830942 844505 854557
59225 854557 859927 860455 856575 848377 835595 818515 798283 776122 752647 728288 704057 681390
59213 681390 661212 643481 627742 613863 601969 591835 582751 574099 565814 558066 550755 543714 537291
59200E37291m984l112j774j545k103k696k788k319j586r48n47k56K3K09L01O00
59184E13766J403K572L609M088L914L324K833K978L828M799N267N293N539O491
59170E69704Q047R785J1512J3431J5847J8680K1370K3353K4543K5102K4831K3307
59158G89512K0611J7335J3731R503M723J96l572p117j0997j4631j7046j8319j9294
59145G64635k0048j9764j8180j6225j4874j4125j3467j2728j2064j1537j1093
59134F00530j0595r693q044n868l958k880k492k323k104j720j013K3J132K124
59120E53119L167M463N840O889P507Q004Q690R472R983J0072J0007J0092J0244
59107F57549J0184R988J0021J0288J0318R872R333R020Q669Q013P373P058O560
$$ plain form
59200 537291 532307 529195 527421 525876 523773 521077 518289 515970 514384 513436 512889 512633 512656 512865 513166 513766
59184 513766 515169 517741 521350 525438 529352 532676 535509 538487 542315 547114 552381 557674 563213 569704
59170 569704 577751 587536 599048 612479 628326 647006 668376 691729 716272 741374 766205 789512
59158 789512 810123 827458 841189 850692 855415 855611 852039 844922 833925 819294 802248 783929 764635
59145 764635 744587 724823 706643 690418 675544 661419 647952 635224 623160 611623 600530
59134 600530 589935 580242 572198 566330 562372 559492 557000 554677 552573 550853 549840 549863 550995 553119
59120 553119 556286 560749 566589 573478 580985 588989 597679 607151 617134 627206 637213 647305 657549
59107 657549 667733 677721 687742 698030 708348 718220 727553 736573 745242 753255 760628 767686 774246
59094G74246N170L197J750J260J038M22l12n50k23K13L72R5p23k167m181o509
59078G73098q778j0727j2424j4070j5475j6002j5285j3779j2264j1152j0473j0156
59066F22513r803q658o529m453l645l957m137l520k596j995j766j857k406l287
59052E63904m029m459m826n123m929m229l699l841m242m134l246j926p35j21o1
59037E14304Q3Q97K039K571K216J684J643K039K651L572M796N950O873P885R078
59022E68281R989J0392J0888J2163J4057J5849J6973J7103J6007J3841J1189Q410
59010G25142N390K325Q2q41j107j480j502k40K008L891M950O199Q473J1093J2874
58995G77257J3711J4408J5267J5674J5117J3920J2710J1569J0086P991N331K151
$$ plain form
59094 774246 779416 782613 784363 785623 786661 787083 786771 786221 785998 786211 786583 786678 785955 783788 779607 773098
59078 773098 764320 753593 741169 727099 711624 695622 680337 666558 654294 643142 632669 622513
59066 622513 612710 604052 597523 593070 589425 585468 581331 577811 575215 573220 571454 569597 567191 563904
59052 563904 559875 555416 550590 545467 540538 536309 532610 528769 524527 520393 517147 515221 514486 514365 514304
59037 514304 514387 515284 517323 519894 522110 523794 525437 527476 530127 533699 538495 544445 551318 559203 568281
59022 568281 578270 588662 599550 611713 625770 641619 658592 675695 691702 705543 716732 725142
59010 725142 730532 732857 732939 732098 730991 729511 728009 727769 729777 733668 738618 744817 753290 764383 777257
58995 777257 790968 805376 820643 836317 851434 865354 878064 889633 899719 907710 913041 915192
58983I15192j602n697r547j2694j5095j6712j7155j6111j3938j1452r143o951
58971G79095m691k360l1K213M260O087P785R220R975J0022J0159J1166J2640J3365
58957H68905J2711J1080Q887N943K051k451p027j1359j5107j7799j9251j9673
58945H16910j9155j7539j5039j2398r949p050k962J949O302Q910R449Q174N412
58932G73014J422l420q447j2778j5715j7116j7308j6729j5753j4665j3437j1743
58920F27325r519p353n899n063m270l365k608j921q41P52K491M134N666O801P230
58905F13560P421Q346J0158J1991J3379J4993J7458K0240K2265K3084K2859K1787
58893H07541K0090J8221J6625J5659J5946J8147K2034K6486L0832L5386M0094
$$ plain form
58983 915192 913590 907893 898346 885652 870557 853845 836690 820579 806641 795189 786046 779095
58971 779095 774404 772044 772013 774226 778486 784573 792358 801578 811553 821575 831734 842900 855540 868905
58957 868905 881616 892696 901583 907526 909577 907126 900099 888740 873633 855834 836583 816910
58945 816910 797755 780216 765177 752779 742830 735780 732818 734767 741069 749979 759428 767602 773014
58932 773014 774436 771016 762569 749791 734076 716960 699652 682923 667170 652505 639068 627325
58920 627325 617806 610453 604554 599491 595221 591856 589248 587327 586486 587238 589729 593863 599529 606330 613560
58905 613560 620981 629327 639485 651476 664855 679848 697306 717546 739811 762895 785754 807541
58893 807541 827631 845852 862477 878136 894082 912229 934263 960749 991581 1026967 1067061
58882A067061M3538M4200M2038L7960L2267K4878J6626Q941K097n091j3466k2326
58870A278723l0432l7358m3142m7194m8451m6645m2817l8405l4154l0093k6187
58859H53845k2637j9673j7467j6216j5918j6035j5819j5152j4507j3933j2739
58848F73749j0635q506p314o811o183n444n142n109m678l978l762l996l867l314
58834E95010l230l820m097l490k770k743l099l251l346l690m025m029l834l425
58820E46161k338n51J145K302L446M940O056O066N400M876M489L865L212K907
58806E91976K715K270J829J677J399N61m15r17j103j383j528j223r63j374k115
58791E91406k409k255k060j590l55J296K524L308M330N677O710P117P253P366
$$ plain form
58882 1067061 1110599 1154799 1196837 1234797 1267064 1291942 1308568 1317509 1319606 1314515 1301049 1278723
58870 1278723 1248291 1210933 1167791 1120597 1072146 1025501 982684 944279 910125 880032 853845
58859 853845 831208 811535 794068 777852 761934 745899 730080 714928 700421 686488 673749
58848 673749 663114 654608 647294 640483 634300 628856 623714 618605 613927 609949 606187 602191 598324 595010
58834 595010 591780 587960 583863 580373 577603 574860 571761 568510 565164 561474 557449 553420 549586 546161
58820 546161 543823 543272 544417 546719 550165 555105 561161 567227 572627 577503 581992 585857 589069 591976
58806 591976 594691 596961 598790 600467 601866 602427 602012 601095 599992 598609 597081 595858 594895 593521 591406
58791 591406 588997 586742 584682 583092 582737 584033 586557 589865 594195 599872 606582 613699 620952 628318
58777F28318P271O779N837M434K886J919J795J664O31r58k038k328k334k234j815
58762F49827j360j513k218k717k660k421k260j904j100J04J684L657N732P426
58748F50277Q481Q820Q345P317O583O742P448Q037Q478Q932Q931P990O694O112
58734G59187O225O012N064M103L755L764L736L862M516N660O896P811Q159P946
58720H36696P415O728N971N448N608O339O944P156P579Q668R953J0824J1311J1431
58706I48071J0667Q843O709M713K097j757n998r554j2809j6633k0492k3130k4527
58693H66200k5528k5970k4972k2799k0590j8368j5127j1026p671o014n520n665
58681F76950o619q086r125r520r894j0079q980o645m808m529m641l486j022J640
$$ plain form
58777 628318 635589 642368 648205 652639 655525 657444 659239 660903 661534 660576 658538 656210 653876 651642 649827
58762 649827 648467 646954 644736 642019 639359 636938 634678 632774 631674 631778 633462 637119 642851 650277
58748 650277 658758 667578 675923 683240 689823 696565 704013 712050 720528 729460 738391 746381 753075 759187
58734 759187 765412 771424 776488 780591 784346 788110 791846 795708 800224 805884 812780 820591 828750 836696
58720 836696 844111 850839 856810 862258 867866 874205 881149 888305 895884 904552 914505 925329 936640 948071
58706 948071 958738 967581 974290 979003 981100 979343 973345 963791 950982 934349 913857 890727 866200
58693 866200 840672 814702 789730 766931 746341 727973 712846 701820 694149 688135 682615 676950
58681 676950 670331 662245 653120 643600 633706 623627 614647 608002 603194 598665 594024 590538 589516 591156
58667E91156L831N548O964Q505J0675J3206J5078J5795J5835J5377J3678J0301
58655G25949O097K258p83k924l756l144j869r42o78q94j465k223k837l241l707
58640G05841m228m416m195l927l535k325p6K416M356N843P267Q346Q346P020M991
58625G31724L334K657K364J161j155k869k210M22L169N272P555J0491J3499J6280
58611G91694J9219K1946K3006K1668J8754J5084J0480N083K56k909m877o480p418
58598I05506p080o064n563n769n863n260m097k803j843j507j391n29J409L606
58584H62752N223O529Q339J0777J3137J4664J5066J4629J4009J3534J2587J0320
58572A001566O998L884J780N95L97J685M202O678Q367R924J2112J4652J6863J8581
$$ plain form
58667 591156 594987 600535 607499 616004 626679 639885 654963 670758 686593 701970 715648 725949
58655 725949 732046 734304 733521 730597 726841 723697 721828 720886 720208 719314 717849 715626 712789 709548 705841
58640 705841 701613 697197 693002 689075 685540 683215 683139 685555 689911 695754 703021 711367 719713 726733 731724
58625 731724 735058 737715 740079 741240 740085 737216 735006 735428 738597 743869 751424 761915 775414 791694
58611 791694 810913 832859 855865 877533 896287 911371 921851 926934 927190 924281 919404 912924 905506
58598 905506 898426 892362 886799 881030 875167 869907 865810 863007 861164 859657 858266 857737 859146 862752
58584 862752 867975 874504 882843 893620 906757 921421 936487 951116 965125 978659 991246 1001566
58572 1001566 1008564 1012448 1014228 1014823 1015220 1016905 1021107 1027785 1036152 1046076 1058188 1072840 1089703 1108284
58558A108284J9707J9812J8832J7346J5513J2543P982K680k237o532j0277j2921
58546A190732j3910j3627j2907j2035j0931r827r126r044r864j1923j4814j7231
58534A045493j8256j8252j8012j7599j6534j4564j1789q517n321k642j57K709
58522I16559N546P262P829Q514R881J0881J0544R348Q008O157L356M22j408k007
58508A000892k003j593o64M04J047J294J506J781K216L186M803O561Q039R342
58494A036811J0462J0927J0571R827Q850P197M907K816J217p16l426n950p301
58481A086192p784p999p513n643k830j68J897L498M514M664L952K403o6l122o006
58466A065989q434j0701j2551j3106j2363j1477j1032j0331r014p873p168n767
$$ plain form
58558 1108284 1127991 1147803 1166635 1183981 1199494 1212037 1220019 1222699 1220462 1213930 1203653 1190732
58546 1190732 1176822 1163195 1150288 1138253 1127322 1117495 1108369 1099325 1089461 1077538 1062724 1045493
58534 1045493 1027237 1008985 990973 973374 956840 942276 930487 921970 916649 914007 913850 916559
58522 916559 922105 929367 937196 945710 955591 966472 977016 986364 994372 1000529 1003885 1004307 1002899 1000892
58508 1000892 998889 997296 996632 997036 998083 999377 1000883 1002664 1004880 1008066 1012869 1019430 1027469 1036811
58494 1036811 1047273 1058200 1068771 1078598 1087448 1094645 1099552 1102368 1103585 1102869 1099443 1093493 1086192
58481 1086192 1078408 1070409 1062896 1057253 1054423 1054255 1056152 1059650 1064164 1068828 1072780 1075183 1075117 1071995 1065989
58466 1065989 1057555 1046854 1034303 1021197 1008834 997357 986325 975994 966980 959107 951939 946172
58454I46172l026j09J780L051M376N165M863M359M369L703R78k946o019p642q425
58439I50649q234o497l980k191j217J85K418M524N822O648P460Q270Q983R491
58425I82331R726J0209J1938J4914J7592J8751J9035J9477J9435J7432J3338Q404
58413A162582L723j3k009k204k095l342n800q107r670j0878j1847j2275j2173
58400A085892j1593j0100p478m415j544J468M903P964R844J0876J1429J0731Q165
58387A116142M710J723p76l244n157o087p117r327j1765j2756j2422j2092j1924
58374A029908j1110r806q833p870n842k859r9J907L466M608N351O471Q526J0681
58360A024499J1962J2944J4622J6428J7136J6908J6718J6351J4879J2440R799
$$ plain form
58454 946172 943146 943037 944817 947868 952244 957409 962272 966631 971000 974703 975681 972735 966716 959074 950649
58439 950649 942415 935918 931938 929747 928530 928715 931133 935657 941479 948127 955587 963857 972840 982331
58425 982331 992057 1002266 1014204 1029118 1046710 1065461 1084496 1103973 1123408 1140840 1154178 1162582
58413 1162582 1166305 1166292 1164283 1162079 1159984 1156642 1150842 1142735 1133065 1122187 1110340 1098065 1085892
58400 1085892 1074299 1064199 1056721 1052306 1050762 1052230 1057133 1065097 1074941 1085817 1097246 1107977 1116142
58387 1116142 1120852 1122575 1121799 1118555 1113398 1107311 1100194 1090867 1079102 1066346 1053924 1041832 1029908
58374 1029908 1018798 1008992 1000159 992289 986447 983588 983489 985396 988862 993470 998821 1005292 1013818 1024499
58360 1024499 1036461 1049405 1064027 1080455 1097591 1114499 1131217 1147568 1162447 1174887 1184686
58349A184686O790K994o86k860l437l029j486J220L788N188O434Q859J1787J3970
58335A234218J5966J8672K0777K0499J8895J8494J9355J9370J7912J6274J4885
58324A435317J2932J0563Q793P482N814M430M482N156M809M076M959P266Q944
58311A525023R611J0791J2853J4675J6245J8609K1300K2735K3163K4282K6093
58300A725380K6967K6703K6531K6285K4686K2204K0540J9424J7227J4605J4027
58289A964579J5690J7445J8763K1158K4469K6578K7312K8869L1699L3610L3795
58278B243967L4174L5814L7316L7680L7723L7892L7682L7652L9031M1033M1843
58267B661807M2285M4910M9316N2407N3631N5869O0439O5316O9180P3141P7559
$$ plain form
58349 1184686 1191476 1194470 1193784 1190924 1187487 1184458 1182972 1184192 1187980 1193168 1199602 1208461 1220248 1234218
58335 1234218 1250184 1268856 1289633 1310132 1329027 1347521 1366876 1386246 1404158 1420432 1435317
58324 1435317 1448249 1458812 1467605 1475087 1480901 1485331 1489813 1494969 1499778 1503854 1508813 1516079 1525023
58311 1525023 1534634 1545425 1558278 1572953 1589198 1607807 1629107 1651842 1675005 1699287 1725380
58300 1725380 1752347 1779050 1805581 1831866 1856552 1878756 1899296 1918720 1935947 1950552 1964579
58289 1964579 1980269 1997714 2016477 2037635 2062104 2088682 2115994 2144863 2176562 2210172 2243967
58278 2243967 2278141 2313955 2351271 2388951 2426674 2464566 2502248 2539900 2578931 2619964 2661807
58267 2661807 2704092 2749002 2798318 2850725 2904356 2960225 3020664 3085980 3155160 3228301 3305860
58256C305860Q0955Q3125Q5578Q8145Q8956Q8351Q8915R1172R3322R5587J00292
58245D290258J07266J13790J19670J27403J36876J45121J51925J60278J70450
58236E523037J79401J87044J97154K10788K24784K38195K53965K72781K91592
58227G578741L09934L31260L56302L81825M07729M38319M74651N13005N52991
58218A1344757N99292O53242P11002P72666Q44396R28661J021699J124017J243707
58209A9243439J385581J547398J731157J947565K204823K504611K854603L273110
58201C6692287L776078M373671N087288N956660P023447Q323701R903752J1822393
58193I2959277J4122932J6819930J9923303K3444313K7336343L1398481L5162819
$$ plain form
58256 3305860 3386815 3469940 3555518 3643663 3732619 3820970 3909885 4001057 4094379 4189966 4290258
58245 4290258 4397524 4511314 4630984 4758387 4895263 5040384 5192309 5352587 5523037
58236 5523037 5702438 5889482 6086636 6297424 6522208 6760403 7014368 7287149 7578741
58227 7578741 7888675 8219935 8576237 8958062 9365791 9804110 10278761 10791766 11344757
58218 11344757 11944049 12597291 13308293 14080959 14925355 15854016 16875715 17999732 19243439
58209 19243439 20629020 22176418 23907575 25855140 28059963 30564574 33419177 36692287
58201 36692287 40468365 44842036 49929324 55885984 62909431 71233132 81136884 92959277
58193 92959277 107082209 123902139 143825442 167269755 194606098 226004579 261167398
58186B61167398L7747324L7787873L3757079K4804006J1653882l255333j6754548
58179C86907681k6445308l1659550l3296881l2859395l1495667k9649862k7322071
58172A74178947k4509335k1409890j8323120j5473666j2960444j0810522r019075
58165F1672895p548743o341213n348235m538932l880693l335208k876076k492897
58157B5310898k175015j905922j675681j483925j326609j191942j072694r71054
58149A3508056q87573q15258p48095o86422o30488n77001n25169m78622m38316
58140G721112m00333l62983l29568l02085k78766k59522k47071k40404k33476
58131E066904k22800k10615j98755j85455j70400j57017j47094j38211j28763
$$ plain form
58186 261167398 298914722 336702595 370459674 395263680 406917562 403662229 386907681
58179 386907681 360462373 328802823 295505942 262646547 231150880 201501018 174178947
58172 174178947 149669612 128259722 109936602 94462936 81502492 70691970 61672895
58165 61672895 54124152 47782939 42434704 37895772 34015079 30679871 27803795 25310898
58157 25310898 23135883 21229961 19554280 18070355 16743746 15551804 14479110 13508056
58149 13508056 12620483 11805225 11057130 10370708 9740220 9163219 8638050 8159428 7721112
58140 7721112 7320779 6957796 6628228 6326143 6047377 5787855 5540784 5300380 5066904
58131 5066904 4844104 4633489 4434734 4249279 4078879 3921862 3774768 3636557 3507794
58122C507794j20523j14261j07811j00703r5717r3610r1061q6203q1558p9089
58112B537258p6743p2568o8121o5128o2534n9400n7107n6231n4716n1613m9252
58101A863845m9161m9100m6780m3553m1739m0895l9391l7383l5804l4273l2268
58090A413498l0496k9298k7505k4486k1553j9822j8602j7272j6764j7632j8658
58079A171410j8806j8777j9261j9484j8836j8184j8179j8029j7169j6466j6545
58068I71674j6531j5646j4479j3587j2429j0691r152q315p674p118p410q548r289
58055H30805r167r213j0011j0691j0657j0475j0399r716q395p523p412p003n921
58042G14222n208n341n395m919m727m988m634l505l028l767m430m329m705o354
$$ plain form
58122 3507794 3387271 3273010 3165199 3064496 2968779 2875169 2784108 2697905 2616347 2537258
58112 2537258 2460515 2387947 2319826 2254698 2192164 2132764 2075657 2019426 1964710 1913097 1863845
58101 1863845 1814684 1765584 1718804 1675251 1633512 1592617 1553226 1515843 1480039 1445766 1413498
58090 1413498 1383002 1353704 1326199 1301713 1280160 1260338 1241736 1224464 1207700 1190068 1171410
58079 1171410 1152604 1133827 1114566 1095082 1076246 1058062 1039883 1021854 1004685 988219 971674
58068 971674 955143 939497 925018 911431 899002 888311 879159 870844 863170 856052 848642 840094 830805
58055 830805 821638 812425 802414 791723 781066 770591 760192 750476 742081 734558 727146 720143 714222
58042 714222 709014 703673 698278 693359 688632 683644 679010 675505 672477 668710 664280 659951 655246 648892
58028F48892p941q159p692p609p488o639n649n219m854l948l004k584k392k318
58014E73396k942m029m107k665j199r65j279j206j225j900k466k192j747j810
58000E43664j755j086p85j763l223m026m526n581o931p918q706r421r220p638
57986D71085n784m778m066k662j022j77J4K77M09j18p79o89o5K66K44K78K49j03
57968D52579m11l64m27q94j021k74N22M22l0K48J022J211O19p7o39j344k144k747
57950D46251l247l821m144l914l499l366l419l472l673l830l241j893r03r26j054
57935D01849j75J540L319M939O166O200M862L370K827K740K184J412J044O78k95
57920D42660j365j835k279l632n447o544o793o830o621n776m710m113l656k662
$$ plain form
58028 648892 640951 632792 625100 617491 610003 603364 597715 592496 587642 583694 580690 578106 575714 573396
58014 573396 570454 566425 562318 559653 558454 557489 556210 555004 553779 551879 549413 547221 545474 543664
58000 543664 541909 540823 540038 538275 535052 531026 526500 520919 513988 506070 497364 487943 478723 471085
57986 471085 465301 460523 456457 453795 452773 452596 452610 452887 453296 453178 452399 451710 451645 451911 452155 452433 452682 452579
57968 452579 452168 451804 451377 450483 449462 449188 449710 450132 450102 450350 451372 452583 453202 453125 452486 451142 448998 446251
57950 446251 443004 439183 435039 431125 427626 424260 420841 417369 413696 409866 406625 404732 403829 402903 401849
57935 401849 401674 403214 406533 411472 417638 423838 428700 432070 434897 437637 439821 441233 442277 442955 442660
57920 442660 441295 439460 437181 433549 428102 421558 414765 407935 401314 395538 390828 386715 383059 380397
57906C80397j538j130j147p16q1j66q28j115j079j680k933l671l257k252j358
57891C57446q70j098k037k672j893j49J015J092R85J307J611J507J280J050M68
57876C59042m50j180j657k420l527m235m111l646l543l932m543n001m892m142
57862C11763l312k901k563j672m50L27N36P01R61J023J098J780K981L917M240
57847C18429M285M263M124M199M906N743N665M632L628K987J852k16k255l162
57833C59080l122l073l453m025m503m728m581m117l521k809j969j367j475k044
57819C14293k220j620p65k00J73O90J394K154K753K657J217j536m705p304q894
57804B98087r457r171q484p866p274o299m930l733l112k852k591k292k061j867
$$ plain form
57906 380397 378859 377729 376582 375866 375785 375619 374791 373676 372597 370917 367984 364313 361056 358804 357446
57891 357446 356576 355478 353441 350769 348876 348727 349742 350834 351819 353126 354737 356244 357524 358574 359042
57876 359042 358592 357412 355755 353335 349808 345573 341462 337816 334273 330341 325798 320797 315905 311763
57862 311763 308451 305550 302987 301315 300865 301192 301728 302429 303390 304413 305511 307291 310272 314189 318429
57847 318429 322714 326977 331101 335300 340206 345949 351614 356246 359874 362861 364713 364497 362242 359080
57833 359080 355958 352885 349432 345407 340904 336176 331595 327478 323957 321148 319179 317812 316337 314293
57819 314293 312073 310453 309688 309488 309661 310351 311745 313899 316652 319309 320526 318990 314285 306981 298087
57804 298087 288630 279459 270975 263109 255835 249536 244606 240873 237761 234909 232318 230026 227965 226098
57790B26098j684j550j405j151q99q03p32m56j63k70p07q75l91N15J441K232K914
57773B22114L585M346N154N743O009O150O101N331L735K249J723J582N75j390
57759B73007l265m540n600o291n646l599j735j454k277k790k482j837j165m40
57745B29886P3k3m85n78r1L99L39j44o39j127j950l130l983l758k636j701j612
57728B08840j718r97M39J486J574J230J083J145J254J484J684J305J46j214k169
57713B15572k713k992k805k102j493j621k300k807k741k229j583j169j258j573
57699A86186j345l30O54Q02N03O72J227J238N14LL39R52J107J010J212J528J398
57682A97670J049J462L099N336P324Q833J0159J1729J4097J7796K2768K8271L3891
$$ plain form
57790 226098 224414 222864 221459 220308 219409 218606 217874 217418 217255 216985 216278 215403 215012 215527 216968 219200 222114
57773 222114 225699 230045 235199 240942 246951 253101 259202 264533 268268 270517 272240 273822 274397 273007
57759 273007 269742 265202 259602 253311 247665 244066 242331 240877 238600 235810 233328 231491 230326 229886
57745 229886 229959 229936 229451 228873 228782 229181 229520 229376 228737 227610 225660 222530 218547 214789 212153 210452 208840
57728 208840 207122 206125 206564 208050 209624 210854 211937 213082 214336 215820 217504 218809 218955 217741 215572
57713 215572 212859 209867 207062 204960 203467 201846 199546 196739 193998 191769 190186 189017 187759 186186
57699 186186 184841 184511 185165 185967 186470 187142 188369 189607 190121 190124 190463 191415 192522 193532 194744 196272 197670
57682 197670 198719 200181 203280 208616 215940 224773 234932 246661 260758 278554 301322 329593 363484
57669C63484M0243M8072N6512O2691O2974N4534L6511J1031j6583l9782n4230
57658F25457n9664n8585n3750m7108m0070l3540k7697k2377j7764j4297j1993
57647B38612j0382r011p624o010m160k549j708j571j605j556j550j542j249o90
57633A87405k50p0M9J04j84p35j000q04p12j122j531j340r50j310k437l226k925
57616A68962k095j673j608j175l09J43k65q34o98m6K66Ok82k74k49m33n87n24
57598A58325m04l74l60l78m95m53qK43o67k466l497k788j391q42j140j211p36
57581A41358l81n47r74j367j588j416r82j026j873k552k016q58n47j226j651j311
57565A21043j028j190r66R9J062J059O48P42J069P94J14K4Q08J679J955J796J690
$$ plain form
57669 363484 403727 451799 508311 571002 633976 688510 725021 736052 719469 679687 625457
57658 625457 565793 507208 453458 406350 366280 332740 305043 282666 264902 250605 238612
57647 238612 228230 219219 211595 205585 201425 198876 197168 195597 193992 192436 190886 189344 188095 187405
57633 187405 187155 187085 187134 187238 187054 186319 185319 184515 183803 182681 181150 179810 178860 177550 175113 171887 168962
57616 168962 166867 165194 163586 162411 162102 162245 161980 161146 160448 160402 160668 160674 160392 160118 159869 159436 158849 158325
57598 158325 157921 157547 157187 156809 156314 155861 155853 156096 155429 152963 149466 146678 145287 144445 143305 142094 141358
57581 141358 140977 140430 139456 138089 136501 135085 134103 133077 131204 128652 126636 125778 125231 124005 122354 121043
57565 121043 120015 118825 117859 117958 119020 120079 120727 121469 122538 123332 123446 123470 124278 125957 127912 129708 131398
57548A31398J724J584J012J20p52j409j922k259k010r36M50J250J185P80O02P84
57532A31601J170J377Q41m89j650j603o69j74o47j257j191o07K9O23J016Q27K37
57515A29434J34R18J798J837J019o2r05j067l20P40J030M45P0M19O19L1m69m3
57497A35628M50k58j660k193j615j118j263j335q98m70m54n37n33p80j330j649
57481A19985j500j282j245j105p25m13k73j3L22K32k83n01j51k5p45j696j871
57464A08711j287p33m54k2O91J192J192J053J177J365J165N87J32J31L63M31L32
57447A16026M10P43R42P25M28N97J175J491J094K37n10q13o02J12J150K023K178
57430A27406J496M43k79l09J17M85N21L58J69r9n02q09p40l50N2L16M88N20K04
$$ plain form
57548 131398 133122 134706 135718 135838 135086 133677 131755 129496 127486 126550 127000 128250 129435 130215 130817 131601
57532 131601 132771 134148 134989 134500 132850 131247 130578 130404 129757 128500 127309 126702 126731 127354 128370 129197 129434
57515 129434 129568 130486 132284 134121 135140 135078 134173 133106 132786 133526 134556 135001 135071 135490 136109 136140 135671 135628
57497 135628 136078 135820 134160 131967 130352 129234 127971 126636 125738 125268 124814 124277 123744 122964 121634 119985
57481 119985 118485 117203 115958 114853 114128 113715 113442 113429 113751 113983 113700 113199 113048 113023 112278 110582 108711
57464 108711 107424 106691 106237 106215 106906 108098 109290 110343 111520 112885 114050 114637 114769 114900 115263 115694 116026
57447 116026 116436 117179 118121 118846 119274 119871 121046 122537 123631 123868 123358 122545 121943 122055 123205 125228 127406
57430 127406 128902 129345 129066 128757 128874 129359 129880 130238 130407 130308 129806 128997 128257 127907 127959 128275 128763 129283 129487
57411A29487m37j040j215q89k18O19J413J842J631Q75J13n8M80J252J688J633
57395A37176J283P75J79k24n7O42J366J723J729J451Q32R3j61L54J129J505J447
57378A51242J298J093P04L19K15K15p8o23r96j071j026q46l46K87N61L66J17J83
57360A51614N65J171J870K328K266J898J633J392Q37K35K94J004J484J242Q38
57345A70671R00J147R83M72J41J92M98R34J309J298R68R44J546K173K188J982
57329A88346K335L005K943J903Q77O96J033J173J120J360J951K438K506K358K480
57314B16524L185M282N089N010M225L524L300L116K544J980K176L174M242M840
57300B67211N093N263N278N031M765M755M921N030N180N677O510P263P654P869
$$ plain form
57411 129487 129050 128010 126795 125906 125688 126307 127720 129562 131193 132068 132181 132123 132603 133855 135543 137176
57395 137176 138459 139234 139413 139189 139132 139774 141140 142863 144592 146043 146875 146968 146807 147161 148290 149795 151242
57378 151242 152540 153633 154337 154656 154871 155086 155008 154385 153389 152318 151292 150446 150100 150387 150948 151314 151431 151614
57360 151614 152179 153350 155220 157548 159814 161712 163345 164737 165574 165809 166103 167107 168591 169833 170671
57345 170671 171571 172718 173701 174173 174314 174506 175004 175938 177247 178545 179513 180457 182003 184176 186364 188346
57329 188346 190681 193686 196629 198532 199409 200105 201138 202311 203431 204791 206742 209180 211686 214044 216524
57314 216524 219709 223991 229080 234090 238315 241839 245139 248255 250799 252779 254955 258129 262371 267211
57300 267211 272304 277567 282845 287876 292641 297396 302317 307347 312527 318204 324714 331977 339631 347500
57286C47500Q206Q607Q744Q439P846P288P021P151P538P798P581P002O655P042
57272D54418Q018Q977R576J0083J0912J2006J2985J3743J4531J5376J5827J5542
57260F01994J4831J4300J4124J4016J3734J3209J2223J0612Q791P582P248P166
57248G39830O705O037N688N761O010O367O857P263P407P599Q191Q832Q825Q210
57234H39582P765P855Q082Q393R602J2135J4837J6023J5519J4854J5327J6632
57222I86606J7643J7869J7589J7041J6233J5544J5775J7150J8672J9012J8082
57211A177216J7235J7742J9367K0773K1092K0683K0377K0459K0633K0714K0976
57200A397267K1818K3238K4736K5691K5879K5573K5188K4925K4790K4823K5007
$$ plain form
57286 347500 355706 364313 373057 381496 389342 396630 403651 410802 418340 426138 433719 440721 447376 454418
57272 454418 462436 471413 480989 491072 501984 513990 526975 540718 555249 570625 586452 601994
57260 601994 616825 631125 645249 659265 672999 686208 698431 709043 717834 725416 732664 739830
57248 739830 746535 752572 758260 764021 770031 776398 783255 790518 797925 805524 813715 822547 831372 839582
57234 839582 847347 855202 863284 871677 881279 893414 908251 924274 939793 954647 969974 986606
57222 986606 1004249 1022118 1039707 1056748 1072981 1088525 1104300 1121450 1140122 1159134 1177216
57211 1177216 1194451 1212193 1231560 1252333 1273425 1294108 1314485 1334944 1355577 1376291 1397267
57200 1397267 1419085 1442323 1467059 1492750 1518629 1544202 1569390 1594315 1619105 1643928 1668935
57189A668935K5092K4795K4284K4073K4412K5010K5512K5952K6447K6754K6496
57178A947762K5742K5054K4898K5232K5694K5924K5721K5056K4068K2987K1994
57167B220132K1164K0552K0225K0174K0278K0409K0599K1086K2102K3512K4829
57156B455062K5647K6079K6613K7567K8857L0186L1305L2069L2571L3192L4237
57145B783385L5498L6443L6743L6335L5053L2759K9926K7290K4779K1525J7459
57134C117195J4076J2909J3847J5825J8593K2640K7622L2118L5066L6505L6766
57123C383162L5970L4554L3283L2350L1369L0607L1236L3758L7172M0445M4065
57112C767971M9132N5622O2548O9553P7348Q6705R7858J10926J26398J45208J68877
$$ plain form
57189 1668935 1694027 1718822 1743106 1767179 1791591 1816601 1842113 1868065 1894512 1921266 1947762
57178 1947762 1973504 1998558 2023456 2048688 2074382 2100306 2126027 2151083 2175151 2198138 2220132
57167 2220132 2241296 2261848 2282073 2302247 2322525 2342934 2363533 2384619 2406721 2430233 2455062
57156 2455062 2480709 2506788 2533401 2560968 2589825 2620011 2651316 2683385 2715956 2749148 2783385
57145 2783385 2818883 2855326 2892069 2928404 2963457 2996216 3026142 3053432 3078211 3099736 3117195
57134 3117195 3131271 3144180 3158027 3173852 3192445 3215085 3242707 3274825 3309891 3346396 3383162
57123 3383162 3419132 3453686 3486969 3519319 3550688 3581295 3612531 3646289 3683461 3723906 3767971
57112 3767971 3817103 3872725 3935273 4004826 4082174 4168879 4266737 4377663 4504061 4649269 4818146
57101D818146J99402K38805K89043L52571M32342N30686O48785P87555R47917
57092I245252J129048J326958J535567J748270J957441K154043K330006K480698
57084B3907283K603357K693461K743315K739971K658066K455557K087745J537993
57076D3426748Q39452O5558p02094j400257j989991k450607k774557k965169l033648
57067B9015435k995920k871512k682921k453179k202855j948808j704057j477275
57059A0678908j272615j091152r32812p97008o82272n86296n06439m39947l84095
57050C986272l36604k95969k61190k31359k05593j83084j63099j45248j29678
57041B034448j16593j05513r5467q5977p7333o9705o2542n5092m7083l8697l0358
$$ plain form
57101 4818146 5017548 5256353 5545396 5897967 6330309 6860995 7509780 8297335 9245252
57092 9245252 10374300 11701258 13236825 14985095 16942536 19096579 21426585 23907283
57084 23907283 26510640 29204101 31947416 34687387 37345453 39801010 41888755 43426748
57076 43426748 44266200 44331758 43629664 42229407 40239416 37788809 35014252 32049083 29015435
57067 29015435 26019515 23148003 20465082 18011903 15809048 13860240 12156183 10678908
57059 10678908 9406293 8315141 7382329 6585321 5903049 5316753 4810314 4370367 3986272
57050 3986272 3649668 3353699 3092509 2861150 2655557 2472473 2309374 2164126 2034448
57041 2034448 1917855 1812342 1716875 1630898 1553565 1483860 1421318 1366226 1319143 1280446 1250088
57030A250088k2544j5182p132L035J5668L0140M6034O2170P3549P1199M8240P088
57018A562353m0202p9478j02590j09569j05310r5330q3552p2078o1793n2988m5607
57007G13856l9342l3898k9281k5628k2785k0310j7914j5723j3990j2749j1857
56996D70379j1210j0740j0272r523q382p113o050n108l840k088k43J400L146N214
56982D05570O801O536L961m1m329q342j1710j3803j4261j3496j2242j0847r330
56969C24467p701n885l753j543J13J013J783L100M891O658Q254R902J1731J3541
56955C66571J4599J3467Q868J405o241j1618j4567j6328j7308j6856j4886j2308
56943B94798r775p130m271j652M79K488M662O761Q595J0495J2802J5393J7917
$$ plain form
57030 1250088 1227544 1212362 1205230 1208265 1223933 1254073 1300107 1362277 1435826 1507025 1555265 1562353
57018 1562353 1522151 1442673 1340083 1230514 1125204 1029874 946322 874244 812451 759463 713856
57007 713856 674514 640616 611335 585707 562922 542612 524698 508975 494985 482236 470379
56996 470379 459169 448429 438157 428634 420252 413139 407089 401981 398141 396053 395810 397210 400356 405570
56982 405570 412371 418907 422868 422827 418498 410156 398446 384643 370382 356886 344644 333797 324467
56969 324467 316766 310881 307128 305585 305698 306711 308494 311594 316485 323143 331397 341299 353030 366571
56955 366571 381170 394637 403505 404910 398669 387051 372484 356156 338848 321992 307106 294798
56943 294798 285023 277893 273622 271970 272449 274937 279599 286360 294955 305450 318252 333645 351562
56930C51562J9974K0694J8734J3211M609n358j4557k1207k4522k4958k3609k1193
56918B93380j7973j4464j1595r863q863p956o996o224n813n786n974n873m963
56905A81037l442k210j800j711j080K62J783K950L642M048M450M959N362N395
56891B03645N261N480O239P339Q817J0980J3436J4743J3553R874M799n46n377
56878B98243r057j1192j1851j1268r481o628l338l47K192M649P345J0402J3875
56865B73544J7644K1340K4842K8594L2908L7125L9903M0180L7255L0321J8938
56854F02594M346j0380k2010k8878l1124k9914k6753k2893j8741j3871p854r73
56842C93549O035J2684J8882K4681L0253L6045M2554M9805N7041O2848O5275O1957
$$ plain form
56930 351562 371536 392230 410964 424175 428784 423426 408869 387662 363140 338182 314573 293380
56918 293380 275407 260943 249348 239485 230622 222666 215670 209446 203633 197847 191873 186000 181037
56905 181037 177595 175385 173585 171874 170794 171056 172839 175789 179431 183479 187929 192888 198250 203645
56891 203645 208906 214386 220625 227964 236781 247761 261197 275940 289493 299367 304166 303620 298243
56878 298243 289186 277994 266143 254875 245394 238766 235428 235081 237273 241922 249267 259669 273544
56865 273544 291188 312528 337370 365964 398872 435997 475900 516080 553335 583656 602594
56854 602594 606940 596560 574550 545672 514548 484634 457881 434988 416247 402376 394522 393549
56842 393549 399584 412268 431150 455831 486084 522129 564683 614488 671529 734377 799652 861609
56830H61609N0785L1282N833k0564m2461n6602o2916o3215n9312n2492m4158l5891
56818E11898k8538k1707j4616p162J58P060J3692K0188K6548L2872L9221M4855
56806F24469M7964M6411L8788K4979O357j4187l2859m6382n3351n4352n1109m5582
56794D91146l9405l3417k7559k1552j5763j0941p117l289J468O942J2158J6454
56782C69125J9776K2212K3647K3688K1466J5750N989o493j8790k8143l3305l4523
56770C80399l2891k9864k6716k3862k0932j7703j4662j2309j0350q152n778l992
56758A73188l208k983k754k580k843l477l931l773l060k061j043l51l37r66j672
56743A38149j941j885j873j790j243n00m95j510k466k142o92O64J178J073P34
$$ plain form
56830 861609 912394 943676 949509 928945 886484 829882 766966 703751 644439 591947 547789 511898
56818 511898 483360 461653 447037 439875 440033 447093 460785 480973 507521 540393 579614 624469
56806 624469 672433 718844 757632 782611 788968 774781 741922 695540 642189 587837 536728 491146
56794 491146 451741 418324 390765 369213 353450 342509 335392 332103 333571 340513 352671 369125
56782 369125 388901 411113 434760 458448 479914 495664 501653 495160 476370 448227 414922 380399
56770 380399 347508 317644 290928 267066 246134 228431 213769 201460 191110 182958 177180 173188
56758 173188 169980 166997 164243 161663 158820 155343 151412 147639 144579 142518 141475 141124 140787 139821 138149
56743 138149 136208 134323 132450 130660 129417 128917 128422 126912 124446 122304 121612 122276 123454 124527 125261
56728A25261K60j37j02L14O73Q92J271J629J250J02o64r9J273K150J968J066j31
56711A36976j271j816j456o89k70k17j2L90O22Q26J561K577K644J129r20j845
56695A38229j216p4M26J29k75j81K71M80K02j16L1N10Q37R00Q77O18j54j029j102
56676A39363k46N19L82j95k64K56O54N11O3l86p68j018r62n83o2M28P37O80K33
56657A39342k72m11j03M04Q41J040R16O41O80J252J862J770Q60k53r54j090p42
56640A45783M2J076J942K216J821J093N30M05M87L32p7k61QK22j14o64o61m1N28
56621A54667O50N54M75L03P3J02L46K52l85r91j041r01j191j743j757r04K65R62
56603A49736Q80L19j02M1N20O58J69m24m96p6L70O65Q90R59P74O57R52J345J216
$$ plain form
56728 125261 125521 125384 125282 125596 126269 127161 128432 130061 131311 131413 130749 130650 131923 134073 136041 137107 136976
56711 136976 135705 133889 132433 131744 131474 131257 131245 131635 132257 133083 134644 137221 139865 140994 140074 138229
56695 138229 137013 136939 137365 137494 137219 137038 137309 137789 137991 137875 137906 138416 139253 140153 141030 141648 141494 140465 139363
56676 139363 139117 139636 140018 139823 139559 139815 140469 140980 141043 140657 139889 138871 137909 137326 137264 137692 138429 139109 139342
56657 139342 139070 138659 138556 138960 139801 140841 141757 142398 143078 144330 146192 147962 148822 148569 147615 146525 145783
56640 145783 145825 146901 148843 151059 152880 153973 154503 154908 155395 155727 155650 155389 155397 155619 155505 154841 154180 154139 154667
56621 154667 155317 155871 156346 156649 156722 156824 157170 157422 157037 156046 155005 154104 152913 151170 149413 148509 148774 149736
56603 149736 150616 150935 150833 150874 151394 152052 152221 151797 151301 151225 151595 152260 153150 154109 154883 155540 156492 157837 159053
56584A59053O88N81J160J623J233L40j56L7N82J199J854K341K333J845J240P46
56568A76699L31J72P08K002L401M133M171M111M394M989N828O944P974P984O342
56553B40183L594R89p32j651j870j235p2N65n2j366k266k399k180j825j162l91
56537B28130j73p53j570k008k078k069k010j790j510j363j412j706k309k983l124
56522B01272k426j381p90q95j272j503j540j419j005k00O84R86K86j036j960j745
56506A86056o64L68Q19Q67P76M45j94p55q24n42l84m74m92k16J60L47K38r5n15
56487A84921q09p76m24j9J77J65J45K78M83N74N02M27M46M37K94K52O27J260J561
56468A90521J309J127J759L028L807L195J501j09q49r95j254j733j855j262l46
$$ plain form
56584 159053 159741 160322 161482 163105 164338 164678 164522 164559 165141 166340 168194 170535 172868 174713 175953 176699
56568 176699 177030 177202 177910 179912 183313 187446 191617 195728 200122 205111 210939 217883 225857 233841 240183
56553 240183 243777 244766 244034 242383 240513 239278 239206 239771 239719 238353 236087 233688 231508 229683 228521 228130
56537 228130 227957 227204 225634 223626 221548 219479 217469 215679 214169 212806 211394 209688 207379 204396 201272
56522 201272 198846 197465 196675 195780 194508 193005 191465 190046 189041 188841 189525 190511 190797 189761 187801 186056
56506 186056 185392 185760 186579 187446 188222 188667 188473 187718 186894 186352 185968 185494 185002 184786 184946 185293 185531 185436 184921
56487 184921 184112 183336 182912 182893 183070 183235 183380 183658 184141 184715 185217 185644 186090 186527 186821 187073 187700 188960 190521
56468 190521 191830 192957 194716 197744 201551 204746 206247 206138 205289 204294 203040 201307 199452 198190 197844
56453A97844K94N54O25M45j25p72r63o49k13K71J101K137K573J937Q01J39K54
56436B06253O82Q38M45l63j075j152o04K5L80O61J009J022K97q23j579j630j134
56419B03252k65Q29J727J915J393O61J10k74n72p12o74o44p69q47m44O05J837
56402B07128K379J756M82l59j93N99J313J606J468R51L08N5M76J164J385Q44o6
56385B21296o86n69K60J323K013K045J563Q92M33O41J645K779L083K429J648J382
56369B42177J322R67M03Kj80j06N08J591K305J960J048O15Q72J120Q78L63o5l36
56351B55444m62m11j66L27J140J933J941R19k64n47M9P18J112J498J848J711J108
56334B67898P34J027J653K075K121J784J099M31L36Q71J397J343Q61M50L31L38
$$ plain form
56453 197844 198138 198692 199317 199762 199637 198865 197902 197253 197040 197311 198412 200549 203122 205059 205860 205999 206253
56436 206253 206935 207773 208218 207855 206780 205628 205024 205049 205429 206090 207099 208121 208418 207595 206016 204386 203252
56419 203252 202987 203816 205543 207458 208851 209512 209622 209348 208776 208064 207390 206746 205977 205130 204686 205291 207128
56402 207128 209507 211263 211745 211386 211193 211792 213105 214711 216179 217130 217438 217493 217969 219133 220518 221362 221296
56385 221296 220610 220041 220301 221624 223637 225682 227245 228137 228570 229211 230856 233635 236718 239147 240795 242177
56369 242177 243499 244466 244869 244871 244691 244585 245093 246684 248989 250949 251997 252612 253484 254604 255482 255845 255780 255444
56351 255444 254982 254571 254405 254732 255872 257805 259746 260665 260401 259854 259903 260621 261733 263231 265079 266790 267898
56334 267898 268632 269659 271312 273387 275508 277292 278391 278822 279158 280029 281426 282769 283630 284080 284411 284749
56318B84749K74J03o1l4K64O41P73N38J68Q6N70J389J827J444P95R36K012K926
56300B99400K817K220K211K865L309L054K468K008J661J230P47M80P60J647K659
56285C29536L102K890K578K423K064J530J718L055M451M559L666L291M155N536
56271C74554O454O608O230N784N824O437P029P159P238P712Q141Q021P949Q770
56257D73910J0043J0657J0752J1516J3221J4882J6023J7388J9516K1978K4386
56246F44272K7023K9978L2731L5014L7144L9069M0091L9942L9263L8481L7072
56235A040080L4334L0158K4676J7990J0661L603k902r373j5962k1919k6543k9955
56223A054848l2536l4358l5479l6115l6205l5430l3894l2055k9935k7272k4465
$$ plain form
56318 284749 285023 285126 285065 285031 285295 285936 286709 287247 287415 287501 288071 289460 291287 292731 293526 294462 296474 299400
56300 299400 302217 304437 306648 309513 312822 315876 318344 320352 322013 323243 323990 324470 325230 326877 329536
56285 329536 332638 335528 338106 340529 342593 344123 345841 348896 353347 357906 361572 364863 369018 374554
56271 374554 381008 387616 393846 399630 405454 411891 418920 426079 433317 441029 449170 457191 465140 473910
56257 473910 483953 494610 505362 516878 530099 544981 561004 578392 597908 619886 644272
56246 644272 671295 701273 734004 769018 806162 845231 885322 925264 964527 1003008 1040080
56235 1040080 1074414 1104572 1129248 1147238 1157899 1161502 1158600 1149227 1133265 1111346 1084803 1054848
56223 1054848 1022312 987954 952475 916360 880155 844725 810831 778776 748841 721569 697104
56212F97104k2335k0790j8870j6415j4489j3643j2974j1593r938q852q227p399
56200E31579o254n156m345l851l601l213k295j183o51p54p14k41J19J90N76J417
56184E01623J814J255N80P96J715K519K848K780K433K195K570L293L469L037L073
56169E36000L955M434L477K012J674K563L500M023M790O182P530P999P590P034
56155F02763O991P461Q029Q628R709J1363J2743J3129J3136J3892J5394J6868
56143G40106J8481K1193K4852K8002K9947L1583L3828L6710M0524M6253N4020
56132A105499O2366O9690P5235P8029P6440O9840N9821M9056L9810L3811L1856
56121A751453L2570L2779L0028K3959J5075L992p333j5583j8936j9047j9188k1568
$$ plain form
56212 697104 674769 653979 635109 618694 604205 590562 577588 565995 556057 547205 538978 531579
56200 531579 525325 520169 515824 511973 508372 505159 502864 501681 501030 500276 499562 499321 499440 499630 500206 501623
56184 501623 503437 504692 505272 506068 507783 510302 513150 515930 518363 520558 523128 526421 529890 532927 536000
56169 536000 539955 544389 547866 549878 551552 554115 557615 561638 566428 572610 580140 588139 595729 602763
56155 602763 609754 617215 625244 633872 643581 654944 667687 680816 693952 707844 723238 740106
56143 740106 758587 779780 804632 832634 862581 894164 927992 964702 1005226 1051479 1105499
56132 1105499 1167865 1237555 1312790 1390819 1467259 1537099 1596920 1645976 1685786 1719597 1751453
56121 1751453 1784023 1816802 1846830 1870789 1885864 1889856 1882523 1866940 1848004 1828957 1809769 1788201
56109A788201k7064l5964m7383n8923o8138p3820p5439p2656o6235n8132m9779
56098A154668m1319l3067k6176k1046j6634j2243q556o039l926j720n1R22K160
56085I86973L821M591M058L843N032O478P068P669R179J0573J0753J0468J0714
56072A081220J0881J0372J0248J1402J2772J3211J3494J4625J5947J6764J7907
56061A228843J9738K0625J9678J8882K0157K2180K2759K2396K2729K3235K2518
56050A463740K1340K1271K1613K0786J9633K0288K2551K4318K4861K5090K5362
56039A710853K5557K6538K9032L1821L3317L3963L4979L6032L6390L6923L8573
56028B073978M0294M1068M2247M5268M8708N0555N1731N4338N7963O0768O2786
$$ plain form
56109 1788201 1761137 1725173 1677790 1618867 1550729 1476909 1401470 1328814 1262579 1204447 1154668
56098 1154668 1113349 1080282 1054106 1033060 1016426 1004183 995627 989588 985662 983942 983891 984813 986973
56085 986973 990794 995385 999443 1003286 1008318 1014796 1021864 1029533 1038712 1049285 1060038 1070506 1081220
56072 1081220 1092101 1102473 1112721 1124123 1136895 1150106 1163600 1178225 1194172 1210936 1228843
56061 1228843 1248581 1269206 1288884 1307766 1327923 1350103 1372862 1395258 1417987 1441222 1463740
56050 1463740 1485080 1506351 1527964 1548750 1568383 1588671 1611222 1635540 1660401 1685491 1710853
56039 1710853 1736410 1762948 1791980 1823801 1857118 1891081 1926060 1962092 1998482 2035405 2073978
56028 2073978 2114272 2155340 2197587 2242855 2291563 2342118 2393849 2448187 2506150 2566918 2629704
56017B629704O5090O7175O8209O9405P2218P5854P9328Q3839R0104R5748R8853
56006C495527J01585J06603J12482J16771J21025J28141J36997J44470J50675
55997D614276J57627J64890J71336J79023J90340K03475K15697K28693K45426
55988F370783K64303K82088L00003L21192L44835L68833L95382M27561M63391
55979I538371N00002N40316N88499O42477O98782P61086Q35363R20568J013384
55970A6038848J118274J242899J387783J551485J741878J970624K241044K554756
55962B9847591K926273L377638L924038M580890N380426O364140P564247R011551
55954G2976794J0753611J2839331J5289031J8103790K1291623K4831938K8569235
$$ plain form
56017 2629704 2694794 2761969 2830178 2899583 2971801 3047655 3126983 3210822 3300926 3396674 3495527
56006 3495527 3597112 3703715 3816197 3932968 4053993 4182134 4319131 4463601 4614276
55997 4614276 4771903 4936793 5108129 5287152 5477492 5680967 5896664 6125357 6370783
55988 6370783 6635086 6917174 7217177 7538369 7883204 8252037 8647419 9074980 9538371
55979 9538371 10038373 10578689 11167188 11809665 12508447 13269533 14104896 15025464 16038848
55970 16038848 17157122 18400021 19787804 21339289 23081167 25051791 27292835 29847591
55962 29847591 32773864 36151502 40075540 44656430 50036856 56400996 63965243 72976794
55954 72976794 83730405 96569736 111858767 129962557 151254180 176086118 204655353
55947B04655353L2090204L4600005L4850838L1364828K3163517J0690165l894611
55940C67520299j7540055k7739671l3486600l5196918l3996251l1071660k7375149
55933A61113995k3553983j9968452j6772211j4015225j1698251r780363q196650
55926E7128860o890943n822358m948238m224068l620310l121596k709672k362062
55918B3429613k065827j817464j609386j429141j270976j135759j019959r15774
55910A2165327q21378p40373o71610o09318n52539n04829m65078m27761l92032
55901F980409l61970l37794l14964k91936k71406k53768k36461k19732k06292
55892D486086j95373j83455j70479j59250j49294j37737j25604j16729j10715
$$ plain form
55947 204655353 236745557 271345562 306196400 337561228 360724745 371414910 367520299
55940 367520299 349980244 322240573 288753973 253557055 219560804 188489144 161113995
55933 161113995 137560012 117591560 100819349 86804124 75105873 65325510 57128860
55926 57128860 50237917 44415559 39467321 35243253 31622943 28501347 25791675 23429613
55918 23429613 21363786 19546322 17936936 16507795 15236819 14101060 13081101 12165327
55910 12165327 11343949 10603576 9931966 9322648 8770109 8265280 7800202 7372441 6980409
55901 6980409 6618439 6280645 5965681 5673745 5402339 5148571 4912110 4692378 4486086
55892 4486086 4290713 4107258 3936779 3777529 3628235 3490498 3364894 3248165 3137450
55883C137450j03330r3735q5141p8488p1941o6782o7164p2957p8708q0867q0776
55872B257561p9662p6193p0526o5656o3032o0858n7993n5594n3888n1265m7693
55861A575201m5249m4294m2612l9293l6038l3841l1699k9354k8061k7864k7163
55850A189733k5619k4637k4480k3881k2870k2931k4003k4188k2903k1465k0371
55839I32385j8831j7157j6679j7031j6449j4847j3751j3206j1831r965r471j0216
55827G62951j0072q746q222q964r095q122q038r673j1078j0846j0172j0338j0729
55814F38856j0570j0302j0115r272p868p061o785n474k855p32j88j66L17Q20J148
55799E69753K136L744M475L738K868K875L053K711K387K407J980P34m58j028j576
$$ plain form
55883 3137450 3034120 2940385 2855244 2776756 2704815 2638033 2570869 2497912 2419204 2338337 2257561
55872 2257561 2177899 2101706 2031180 1965524 1902492 1841634 1783641 1728047 1674159 1622894 1575201
55861 1575201 1529952 1485658 1443046 1403753 1367715 1333874 1302175 1272821 1244760 1216896 1189733
55850 1189733 1164114 1139477 1114997 1091116 1068246 1045315 1021312 997124 974221 952756 932385
55839 932385 913554 896397 879718 862687 846238 831391 817640 804434 792603 782638 773167 762951
55827 762951 752879 744133 735911 726947 717852 709730 701692 692019 680941 670095 659923 649585 638856
55814 638856 628286 617984 607869 598597 590729 583668 576883 571409 568554 567822 567634 567468 567785 568605 569753
55799 569753 571889 575633 580108 583846 586714 589589 592642 595353 597740 600147 602127 602861 602403 601375 599799
55784E99799k489l166l286l469m210n483p662j1178j4989j7073j6855j5543j3984
55771D80412j1975r800q362p376n463k519j23P93P63N5j670l529l670k068r57
55756D24511j604k790l387m211o120q306r774j0853j1968j2427j1664j0310r001
55743C22096p470n648m336l860l415k516j759j460r79j19K82q7l46l6R8l13n40
55726B89592m11j034k806m325m361l533k929k416j505o44m14m23p2M31O76P21
55710B66547N61j26j039j174k61Q03J413J865K057J108r59k704l292l648m644
55695B56507n612n696n288m979m350l049j914j770k066j892j434j368j506j232
55681B14351n25K94J246K323L045L112K766K107Q35q07j869k027k080k555k880
$$ plain form
55784 599799 597310 594144 590858 587389 583179 577696 570034 558856 543867 526794 509939 494396 480412
55771 480412 468437 458637 450275 442899 437436 434917 434794 435587 436350 436405 434735 431206 427536 425468 424511
55756 424511 422907 420117 416730 412519 406399 398093 388319 377466 365498 353071 341407 331097 322096
55743 322096 314626 308978 304642 300782 297367 294851 293092 291632 290653 290534 290816 290729 290383 290347 290445 290132 289592
55726 289592 289181 288147 285341 281016 276655 273122 270193 267777 266272 265628 265214 264791 264719 265150 265826 266547
55710 266547 267108 266982 265943 264769 264508 265311 266724 268589 270646 271754 270795 268091 264799 261151 256507
55695 256507 250895 245199 239911 234932 230582 227533 225619 223849 221783 219891 218457 217089 215583 214351
55681 214351 213826 214120 215366 217689 220734 223846 226612 228719 229554 228747 226878 224851 222771 220216 217336
55666B17336k547k004j699j278m82J83L64N10R33J216J117J098J424J773K158
55651B20102L013L984L960K926K264K616K952K509K013K009J663L88q20r88p37
55636B47854r96j479j719k274l478m298l941l456m118n260n385m548l960l904
55622A99038l734l394l310l223k521j520j131j524k162k734l139l001k295j841
55608A63509k212k714k426j599j025p13l06p6l46o10l97l28j051j867j743j038
55592A45058q10r50n49L33P38M55J41m5n97j498k075k013j478m81Q52J587Q35
55575A39503q03j769j467o41J6N11Q95J028J144J606K112K012J445J192J395J316
55559A49495N42m18q94p69k75K73M93K34j06n8J76k1p09j232j054l79J01j20p92
$$ plain form
55666 217336 214789 212785 211086 209808 209326 209509 209873 210383 211316 212532 213649 214747 216171 217944 220102
55651 220102 223115 227099 231059 233985 236249 238865 241817 244326 246339 248348 250011 250399 249579 248591 247854
55636 247854 246858 245379 243660 241386 237908 233610 229669 226213 222095 216835 211450 206902 202942 199038
55622 199038 195304 191910 188600 185377 182856 181336 180205 178681 176519 173785 170646 167645 165350 163509
55608 163509 161297 158583 156157 154558 153533 152820 152514 152438 152092 151482 151085 150757 149706 147839 146096 145058
55592 145058 144248 143298 142749 143082 143820 144275 144416 144371 143774 142276 140201 138188 136710 136229 137081 138668 139503
55575 139503 138700 136931 135464 134823 134839 135350 136245 137273 138417 140023 142135 144147 145592 146784 148179 149495
55559 149495 150037 149619 148725 147956 147681 147954 148447 148681 148575 148517 148693 148672 147963 146731 145677 145298 145399 145279 144487
55540A44487r67l4J229J347O2j230j373q30n51m51ON25M61L5j1L65O05N62N19
55521A44756M42L8o32j310j963k451k241j223l07l39r24j129q66p04q02r49j257
55504A28139j778j867r66K95P79L76p5j37n4N7L13M83K52m5J95Q75J300J108M76
55485A29726k86p25l43O49J174P32K73P13J336Q98k50o89j65K00j90o91p32n65
55467A31065m97m36l77m56m82k20nj87k81L80J329J533R95N90M33j71j131j428
55449A30654q27l91q18j432j383q48m59l62l98n29o63n72l19k57m43n52m58l40
55431A19603k12M7K62J34j96m06n97r45j052m97K10K67nM18J495K013J439O25
55413A22603L57L07r7o46p88m06J89N87M04l24q82o92k52m45r98p94L13J140R41
$$ plain form
55540 144487 143520 143486 144715 146062 146124 144894 143521 142691 142140 141689 141695 142220 142681 142716 142705 143070 143675 144237 144756
55521 144756 145198 145236 144604 143294 141331 138880 136639 135416 135109 134770 133846 132717 131851 131147 130345 129396 128139
55504 128139 126361 124494 123528 123823 124602 124978 124903 124766 124712 124769 125082 125565 125817 125772 125967 126842 128142 129250 129726
55485 129726 129440 128715 128372 129021 130195 130927 131200 131913 133249 134147 133897 133208 133043 133243 133053 132362 131630 131065
55467 131065 130568 130132 129755 129299 128817 128597 128592 128405 128124 128504 129833 131366 132361 132951 133384 133213 132082 130654
55449 130654 129827 129436 128618 127186 125803 124955 124496 124134 123736 123207 122544 121972 121653 121396 120953 120401 119943 119603
55431 119603 119391 119438 119700 119834 119638 119232 118635 117690 116638 116141 116351 116618 116613 117031 118526 120539 121978 122603
55413 122603 122960 123267 123170 122524 121736 121330 121519 122106 122510 122186 121304 120612 120360 119915 118917 118123 118436 119576 120517
55394A20517L37R3K8k84o49p62p50o81k10P19J431J329O30j08o34q36n12K50R56
55375A20864J253J197Q44J72m17k47O38J305J086K90m78j006j130n02P40J608
55359A26217J303K20n76o68n34p64j289j526j015j9O44M68j85o84r16j024p44
55342A18908K38J371J585O55m80q76m82K31P92Q19J50q58j611j879j756j206l37
55325A15264J95q7m91J19J557K319J570J42p35q04m79k2M65Q09Q99P73M17k7k0
55306A21864P30J511J358M71q1J7J05p7n8R9l69j371j618n64N46M61l50o68l06
55287A21700J36M99R54J211Q83L65L54P40P58J04p59j276j267q45l21p0j56k48
55269A22762r7J64L39M48N06M37L34L85M48K15j71k82k19n01r94r14r2O55P92
$$ plain form
55394 120517 120854 120947 120975 120691 120042 119280 118530 117849 117639 118358 119789 121118 121748 121640 121006 120170 119658 119908 120864
55375 120864 122117 123314 124158 124330 123913 123666 124304 125609 126695 126985 126507 125501 124371 123869 124609 126217
55359 126217 127520 127740 127164 126496 125962 125198 123909 122383 121368 121349 121993 122461 122276 121592 120676 119652 118908
55342 118908 119146 120517 122102 122757 122277 121401 120919 121150 121942 122761 122911 122053 120442 118563 116807 115601 115264
55325 115264 115459 115372 114881 115000 116557 118876 120446 120588 119853 119049 118570 118548 119013 119822 120721 121494 121911 121884 121864
55306 121864 122594 124105 125463 125934 125853 125870 125975 125898 125840 125939 125570 124199 122581 122017 122563 123024 122674 122006 121700
55287 121700 121836 122335 123289 124500 125383 125748 126102 126842 127600 127704 126945 125669 124402 123557 123236 123166 123010 122762
55269 122762 122665 122829 123168 123616 124122 124559 124893 125278 125726 125941 125770 125488 125269 124768 123774 122860 122768 123423 124215
55250A24215P88J036J099N90Lj42j43m08n96k80J63J56j37k62l42o25p31k15M52
55231A24621M51j30m56k64j19l88p35p93p02p08o27k5J163K266K292R64p18j324
55213A24768m81Q55J632J621J085K72m86p86o73n97o09k11O81J342J193N60l1
55196A30135o00j266j691j505q99l03O6J03k11m27N9J020J494J193Q72R09O56
55179A29605j48n12K55J254J331Q01N63L91m34j378j161K02J323J389R17N45K98
55162A35241K11N49J142J373J095P98P48P03N62N59O41M06k26q90j369j697j658
55145A38188r01K84R98P18k31j236j846j759j057n06r19j960k319j343J12Q06
55129A27029N70J74J63L88N24N38N05L01k00o22k19J146K445K456J281K12K6J78
$$ plain form
55250 124215 125003 126039 127138 127728 127731 127589 127446 127038 126442 126162 126325 126481 126344 126082 125740 125115 124384 124169 124621
55231 124621 125072 124942 124486 124222 124103 123715 122980 122187 121485 120777 120150 120125 121288 123554 125846 126810 126092 124768
55213 124768 124287 125142 126774 128395 129480 129752 129266 128480 127807 127210 126601 126390 127071 128413 129606 130166 130135
55196 130135 129535 128269 126578 125073 124174 123871 123937 124040 123829 123402 123461 124481 125975 127168 128040 128949 129605
55179 129605 129457 128945 129200 130454 131785 132586 133149 133540 133106 131728 130567 130769 132092 133481 134398 134943 135241
55162 135241 135452 136001 137143 138516 139611 140409 141157 141860 142422 142981 143622 144028 143802 142912 141543 139846 138188
55145 138188 137287 137571 138569 139287 139056 137820 135974 134215 133158 132652 131733 129773 127454 126111 126223 127029
55129 127029 127599 127773 127936 128324 128848 129386 129891 130192 129992 129370 129151 130297 132742 135198 136479 136691 136717 136895
55111A36895qk71j23J69J41N8L79P80O88L63M42O65K26p27j074l39O90J199J228
55092A41381J020M47l98q38m88Nj99r78j432j053k06M70O51L78j88q23j163q35
55074A35751J25J058J182M87k15k33K16N06M73M23M74M17J33k46n60p33o87m16
55056A38155m8L21P07R98R53O09L35K27l5m52l82M89J391J422P92M33O30Q63P70
55037A48178M48p4q10j307r98j70J84l09r20q12j4P90R88M22m90r75o42jJ65j19
55017A43534j34L63P94O68K24j05k81m55n99o53p33r23j060r08m36J45M43J08
54999A39992p69j540j542p17M66J475J917J646J122J225K162K905K443J303Q92
54984A52980J485J906J326L26k35m47p67j002o70k7J06n29j276j421r49l13J37
$$ plain form
55111 136895 136887 136616 136493 136662 136803 136861 137240 138020 138708 139071 139513 140178 140404 139677 138603 138264 138954 140153 141381
55092 141381 142401 142848 142450 141612 141124 141129 140930 139952 138520 137467 137261 137731 138382 138760 138572 137749 136586 135751
55074 135751 135876 136934 138116 138603 138388 138155 138371 138877 139350 139773 140247 140664 140797 140551 139991 139258 138571 138155
55056 138155 138107 138428 139135 140133 141086 141695 142030 142257 142222 141770 141388 141877 143268 144690 145482 145915 146545 147408 148178
55037 148178 148626 148552 147742 146435 145437 145267 145451 145142 144222 143410 143396 144186 145174 145596 145106 144131 143489 143488 143653 143534
55017 143534 143400 143763 144557 145225 145449 145344 145063 144608 144009 143356 142623 141700 140640 139732 139296 139441 139884 139992
54999 139992 139223 137683 136141 135424 135890 137365 139282 140928 142050 143275 145437 148342 150785 152088 152980
54984 152980 154465 156371 157697 158023 157788 157341 156574 155572 154902 154875 154981 154452 153176 151755 150806 150493 150630
54967A50630L10J59l26q94j112q27l74q5K17P97J331J203N89L89R12J320Q93J37
54949A55269p7J59J19k76m53k48q8o7K96J181J984K008J213J83m55n17l70m87
54931A59374p98q09m76l56n97m23O53J857K181J857J822K200K410K486L027L978
54915A78386M653M992N689O843P543P033N410L041K27k421m203n192n952o402
54901A99647n951m867m269m430m319l342k312k036k066j680j069p45n45j79ql28
54885A61501n48k6P70R64P11R07J741K499K730K691K622K412K149K363L425N004
54869A91915O290O586N721M109K327N95j187k872l992m406m594m966n255m994
54855A85277m263l567l149k867k572k239j913j687j687j862j968j902j800j714
$$ plain form
54967 150630 150940 151099 150773 149879 148767 147940 147566 147481 147698 148495 149826 151029 151618 152007 152919 154239 155132 155269
54949 155269 155192 155351 155470 155194 154741 154493 154405 154338 154634 155815 157799 159807 161020 161203 160748 160231 159861 159374
54931 159374 158576 157767 157291 156935 156338 155915 156568 158425 160606 162463 164285 166485 168895 171381 174408 178386
54915 178386 183039 188031 193720 200563 208106 215139 220549 223590 223817 221396 217193 212001 206049 199647
54901 199647 193696 188829 184560 180130 175811 172469 170157 168121 166055 164375 163306 162561 162016 161837 161829 161501
54885 161501 160953 160927 161697 162661 163372 164279 166020 168519 171249 173940 176562 178974 181123 183486 186911 191915
54869 191915 198205 204791 210512 214621 216948 217543 216356 213484 209492 205086 200492 195526 190271 185277
54855 185277 181014 177447 174298 171431 168859 166620 164707 163020 161333 159471 157503 155601 153801 152087
54841A52087j508j157q12m46J59R02J308J137O46J12l77n69j49O02R87J012J463
54824A55397K398K548J084q43j406m71M72M20j62n06n20l53J23R16J579J662J222
54807A63560O57K96K63L96L14j59o03m78nk2q10j507j134J51J211J197L17o21
54789A63023j103j125q82m82j6L80O65Q75R03N42l9j07Q77K429L388L158K218
54772A74704J407J138J436K154K967L515L860M452N393O150O238N832N370M960
54758B29576M511M123L875L433K339N55j548l580n244o286o693o774o733o361
54744B05193n472m388l585l046k421j749j406j449j535j515j640j897j723p24
54730A72643O02J332J141N96M06P04J100J243J184J346K144L539M865N339M946
$$ plain form
54841 152087 150579 149422 148610 148164 148323 149225 150533 151670 152316 152428 152051 151482 151333 151935 152922 153934 155397
54824 155397 157795 160343 161427 160584 159178 158707 159179 159599 159437 158931 158411 158058 158181 159097 160676 162338 163560
54807 163560 164217 164513 164776 165172 165486 165327 164724 164246 164241 164219 163409 161902 160768 160919 162130 163327 163644 163023
54789 163023 161920 160795 159913 159431 159415 159795 160460 161335 162238 162780 162741 162634 163511 165940 169328 172486 174704
54772 174704 176111 177249 178685 180839 183806 187321 191181 195633 201026 207176 213414 219246 224616 229576
54758 229576 234087 238210 242085 245518 247857 248412 246864 243284 238040 231754 225061 218287 211554 205193
54744 205193 199721 195333 191748 188702 186281 184532 183126 181677 180142 178627 176987 175090 173367 172643
54730 172643 173245 174577 175718 176314 176720 177424 178524 179767 180951 182297 184441 187980 192845 198184 203130
54715B03130M568M898N420M950L175J026o04j789k920l805m098m133m494n040
54701B00284n125m661m203l963l534k689j741r85l75L2k5m81q32q49q60j089j276
54684A67628j202j052r58o93j24M25O87Q38J100J299J195Q65M73mn44r52j153
54667A67828j289j247o55L89J100Q44q4r51j383j320o78L92J222J208N33q9k17
54650A65603Q8O55J326J800J760J210N27J64K99O66O63p3j177j906j975j718j413
54633A66499r42k31M53Q37R32Q09N44M13O15P34J50q97j328o38M19R09P80M07
54615A70465j44p78r60m00L20M95L55O17J321J727J346M35m10q13p78o48p56r67
54597A70427q20k57K06K29N4k8j55m22n15k17K23N48Q67J191J213Q51M52R1n84
$$ plain form
54715 203130 207698 212596 218016 222966 226141 227167 226563 224774 221854 218049 213951 209818 205324 200284
54701 200284 195159 190498 186295 182332 178798 176109 174368 173383 173008 173040 173015 172534 171702 170853 169993 168904 167628
54684 167628 166426 165374 164416 163723 163599 164024 164711 165549 166649 167948 169143 170008 170481 170477 169933 168981 167828
54667 167828 166539 165292 164637 165026 166126 166970 166886 165935 164552 163232 162554 162946 164168 165376 165909 165820 165603
54650 165603 165691 166346 167672 169472 171232 172442 172969 173133 173432 174098 174761 174688 173511 171605 169630 167912 166499
54633 166499 165557 165326 165779 166616 167548 168357 168901 169314 169929 170663 170813 169916 168588 167950 168369 169278 170058 170465
54615 170465 170321 169543 168583 168183 168503 168998 169353 169970 171291 173018 174364 174799 174389 173576 172798 172150 171394 170427
54597 170427 169607 169350 169556 169785 169839 169811 169656 169234 168719 168502 168725 169273 170140 171331 172544 173395 173847 173938 173354
54578A73354j416j506n66L68L24l07o68q24j194j375p75Q3J90l16l77K61P27M68
54560A66451p2l30k64RM21O54L77j57l49r9K25N16R51J333J216N88j14p01j274
54541A69381j675j591j098n06J65R53J428J221P87Q05J080R73P00J061J905K096
54525A77685J225K65J56O19Q47N66Q1k24j29J94J11p25j642j638q01j71k48n42
54507A75629o88r35j298j230n65J28M57P09R74P31k16j110j194o31l7L43N11L52
54489A71930o0k52Q0O48J020J035O43j06p12n44J80N32J94o6K62N82K32l98n11
54470A74689JP51J555K163J873L02j735k886k607j378P2J158J456J103Q88J271
54454A78676J638J144L4o50n10j44j32m01o78q81r32p68o25q33j158r34j9Q06
$$ plain form
54578 173354 171938 170432 169866 170234 170558 170251 169583 168759 167565 166190 165415 165498 165688 165372 164995 165256 165983 166451
54560 166451 166379 166049 165785 165794 166215 166869 167246 167089 166740 166641 166866 167382 168333 169666 170882 171470 171356 170655 169381
54541 169381 167706 166115 165017 164511 164676 165629 167057 168278 169065 169870 170950 171923 172623 173684 175589 177685
54525 177685 178910 179175 179331 179950 180797 181363 181444 181220 181091 181285 181396 180671 179029 177391 176590 176419 176171 175629
54507 175629 174941 174006 172708 171478 170913 171041 171498 172207 173181 173912 173696 172586 171392 170761 170724 171067 171578 171930
54489 171930 171870 171618 171698 172346 173366 174401 175044 174938 174226 173682 173862 174394 174588 174522 174784 175366 175598 175200 174689
54470 174689 174690 175441 176996 179159 181032 181334 179599 176713 174106 172728 172800 173958 175414 176517 177405 178676
54454 178676 180314 181458 181492 180842 180332 180188 180056 179655 178977 178096 177164 176396 175771 174938 173780 172846 172827 173633
54436A73633P39p6q08r23o00k43Q1N71J185J493J205O34L81N36O13L79K63O19
54418A79682J050R45M32K13M94P01M21O7K45Q39J151Q45K63k08o11j064j282q96
54400A83287j32L57L74M45Q86J149N58n29r49j44J121J657J104J27m36l06K50
54383A88819Q76J419J700J373L19q64j327j052r44j449j744r26M96J125N60j59
54367A88222r6M95Q50Q14P93J034J370J450J003Q8q09j159r96q44r73j064p36
54350A89442j24L24L26ql00k43J16L80K72l2j83o9K58P80J254J127K27p43r51
54331A91853m61M9K71L49K29j73l91J01Q50Q85K39o5L16M96n4n42j15P92J198
54312A95827J035J017J451J932K004J561P80Mm48o27q19r75p05p0J36o51j916
$$ plain form
54436 173633 174372 174296 173488 172565 171965 171722 171803 172374 173559 175052 176257 176891 177272 177808 178421 178800 179063 179682
54418 179682 180732 181677 182109 182322 182816 183517 183938 184005 184250 185089 186240 187085 187348 187140 186529 185465 184183 183287
54400 183287 183155 183512 183886 184331 185217 186366 186924 186395 185446 185302 186423 188080 189184 189311 188875 188569 188819
54383 188819 189695 191114 192814 194187 194506 193642 192315 191263 190319 188870 187126 186200 186696 187821 188381 188222
54367 188222 188126 188621 189471 190285 191078 192112 193482 194932 195935 196023 195214 194055 193059 192215 191242 190178 189442
54350 189442 189318 189642 189968 189960 189660 189417 189533 189913 190185 190153 189970 189901 190159 190939 192193 193320 193547 192804 191853
54331 191853 191392 191441 191712 192061 192290 192117 191726 191827 192677 193562 193801 193736 194052 194548 194494 193952 193837 194629 195827
54312 195827 196862 197879 199330 201262 203266 204827 205607 205611 205163 204536 203717 202742 202037 201967 202103 201452 199536
54295A99536k622k316j405o20l94n39m36K49J014J120O23K10J36J18K00P69J533
54278A97176J526O00j64l1L62J58m28p67r27j214j361j023n57m34l77O0N90P08
54260A93897N81N48L01m39r39l44P86J007P2p11l12P74J368R37j79j177j279l74
54242A94517O77Q65J93m23l36K85R95J506J590J139M05k01n69p53n64J31Q62R73
54224B01292M73n6l69o87r81r12n45l86n14l84L13J159J646J714J433P34k34r76
54206B02720j269j492j958k326k096j384p72n19l52J8N65J098J468J490R22k03
54190A95910j292j481m39J188K337K508K019J369P99M51N82J204J861K024J623
54175B10663R35K59j22R0Q55J677K139K344K534K531J993J015L2p52j419j914
$$ plain form
54295 199536 196914 194598 193193 192573 192179 191640 191204 191453 192467 193587 194210 194420 194556 194674 194874 195643 197176
54278 197176 198702 199302 199138 199107 199469 199627 199199 198432 197505 196291 194930 193907 193350 192916 192539 192599 193189 193897
54260 193897 194478 195026 195327 194888 193949 193605 194391 195398 195470 194759 194447 195221 196589 197526 197347 196170 194891 194517
54242 194517 195194 196059 196252 195829 195493 195778 196773 198279 199869 201008 201413 201212 200643 199890 199326 199457 200319 201292
54224 201292 201765 201709 201340 200653 199672 198760 198215 197829 197315 196931 197244 198403 200049 201763 203196 203930 203696 202720
54206 202720 201451 199959 198001 195675 193579 192195 191423 190904 190552 190570 191135 192233 193701 195191 196113 195910
54190 195910 194618 193137 192698 193886 196223 198731 200750 202119 202918 203369 203951 205155 207016 209040 210663
54175 210663 211598 211857 211735 211825 212680 214357 216496 218840 221374 223905 225898 226913 226945 226193 224774 222860
54159B22860k057j952j937k108k223k130j957j834j705j500j264j052q26n50k98
54144A99467k34m52p55o69J9Q29J015M97q8k98l37m25l62r9j01o24j085p89P0
54125A95579P60J047J252J447J308P82L29M18J067J912K503K625K491K422K264
54110B18206J570M59k27o7L31L35K53O11J037P75l1n31m51k99l63l52j07O1j46
54091B21064p52j686k648k904j994n05M37N44N18R09J465J703J475Q44J2n37m28
54074B17517J2J02k46m87l31j9K65N74O55N0j072j830j729j259j071j066o93J99
54056B09571J172J641J360O28N6j2J76L50P66J666K460K202J010J64O09J917K979
54039B28715L219K870K524K679L412M222M534M393M370M756N255N455N192M438
$$ plain form
54159 222860 220803 218851 216914 214806 212583 210453 208496 206662 204957 203457 202193 201141 200315 199765 199467
54144 199467 199233 198781 198026 197357 197376 198205 199220 199717 199629 199331 198994 198569 198207 198108 198007 197383 196298 195509 195579
54125 195579 196339 197386 198638 200085 201393 202175 202504 202922 203989 205901 208404 211029 213520 215942 218206
54110 218206 219776 220235 220008 219941 220272 220607 220860 221471 222508 223283 223252 222721 222270 221971 221608 221256 221149 221210 221064
54091 221064 220312 218626 215978 213074 211080 210575 211012 211556 212074 212983 214448 216151 217626 218470 218482 217945 217517
54074 217517 217529 217631 217385 216898 216567 216548 216813 217387 218042 218092 217020 215190 213461 212202 211131 210065 209372 209571
54056 209571 210743 212384 213744 214372 214428 214416 214592 214942 215708 217374 219834 222036 223046 223210 223819 225736 228715
54039 228715 231934 234804 237328 240007 243419 247641 252175 256568 260938 265694 270949 276404 281596 286034
54025B86034L330K364K056K318K569K525K337K014J315L52m13q24j228j792k260
54010C00697k610l271m408n423n630n056m209l435k741k082j499j101j006j189
53996B57037j445j600j686j729j569j190r26r53r23o35o36j452k490k618j727
53981B35458q49o94r66j190j348j484j454j411j720k200k040q33Q10J899J848
53966B23826O63j013k045j753p50j97k48p2O03J062Q43M13K82L97P14J374J990
53949B26089J823J046Q01J491K134J956J537J630J908J776J551J797K284K492
53935B50315K645L216L965M292M167L987L927M051M538N144N095M139L114K771
53921C05366K714K276J740J741K103K249K231K423K719K957L602M900N916N535
$$ plain form
54025 286034 289364 291728 293784 296102 298671 301196 303533 305547 306862 307214 306801 305977 304749 302957 300697
54010 300697 298087 294816 290408 284985 279355 274299 270090 266655 263914 261832 260333 259232 258226 257037
53996 257037 255592 253992 252306 250577 249008 247818 246892 245939 245016 244381 243745 242293 239803 237185 235458
53981 235458 234609 233915 232949 231759 230411 228927 227473 226062 224342 222142 220102 219269 220079 221978 223826
53966 223826 224489 223476 221431 219678 218928 218731 218483 218411 219014 220076 220919 221332 221614 222011 222725 224099 226089
53949 226089 227912 228958 229759 231250 233384 235340 236877 238507 240415 242191 243742 245539 247823 250315
53935 250315 252960 256176 260141 264433 268600 272587 276514 280565 285103 290247 295342 299481 302595 305366
53921 305366 308080 310356 312096 313837 315940 318189 320420 322843 325562 328519 332121 337021 342937 348472
53907C48472M014K430J084l17j371j356p78r63k070k844k644k298k589l125l271
53892C32374l181l265l470l671m076m738n208n165m793m322l747l272l329l783
53878B76354l807l039k201k133k719l215l229k865k324j759j316r44m98j68m43
53863B45694j309k048k144j920j820j558o58N73J230R26J28n50q85q54n03o1K05
53846B34446L88P93J302J317N81k58l85J47N14K61j96l21k34l49o14o03k54K1
53828B36556N4J76N76Q56N85k7l81k47P7K45Q7m24j131j530j067K87J872K880
53810B39444K981K435J764J348J296J587K236L138L879L992L493K932K735K712
53796B75972K464K057J979K453L084L267K851K191J607R30j61j368j776r13M92
$$ plain form
53907 348472 352486 354916 356000 355683 354312 352956 352178 351215 349145 346301 343657 341359 338770 335645 332374
53892 332374 329193 325928 322458 318787 314711 309973 304765 299600 294807 290485 286738 283466 280137 276354
53878 276354 272547 269508 267307 265174 262455 259240 256011 253146 250822 249063 247747 246803 246305 246137 245694
53863 245694 244385 242337 240193 238273 236453 234895 234237 234810 236040 236966 237094 236544 235659 234805 234302 234241 234446
53846 234446 234834 235627 236929 238246 238827 238569 238184 238331 238845 239106 238910 238589 238355 238006 237392 236789 236535 236556
53828 236556 236610 236786 237362 238218 238803 238776 238395 238148 238225 238470 238557 238133 237002 235472 234405 234692 236564 239444
53810 239444 242425 244860 246624 247972 249268 250855 253091 256229 260108 264100 267593 270525 273260 275972
53796 275972 278436 280493 282472 284925 288009 291276 294127 296318 297925 298855 298694 297326 295550 294637 295129
53781B95129J235R19N0r16j956k939l476l499l437l528l487l103k632k332k046
53766B63982j607j200j017r38q31p83p67m99J10P39J084J137R39N37K89N21Q25
53749B62521M12o29j313j242j096j222q95K87J427J694J668K227K918K791K094
53734B71642J799J908J646J063R46J353J545J429J764K738L613L946M077M185
53720C03654L916L226K591K122J475Q58J119K419L720M131L906L784M055M720
53706C45696N789O980P789Q269R154J0833J2918J5060J7507K0458K3675K7175
53694E11303L1544L6985M2665M7481N0641N0858M5781L3481J4635p227k7523m2556
53682G88068n0546n1902m8685m3259l7157l1128k5727k1412j8230j5829j3752
$$ plain form
53781 295129 296364 297283 297333 296417 294461 291522 288046 284547 281110 277582 274095 270992 268360 266028 263982
53766 263982 262375 261175 260158 259220 258389 257606 256839 256340 256450 257189 258273 259410 260349 260886 261175 261696 262521
53749 262521 262933 262304 260991 259749 258653 257431 256536 256823 258250 259944 261612 263839 266757 269548 271642
53734 271642 273441 275349 276995 278058 279004 280357 281902 283331 285095 287833 291446 295392 299469 303654
53720 303654 307570 310796 313387 315509 316984 317842 318961 321380 325100 329231 333137 336921 340976 345696
53706 345696 351485 358465 366254 374523 383677 394510 407428 422488 439995 460453 484128 511303
53694 511303 542847 579832 622497 669978 720619 771477 817258 850739 865374 858147 830624 788068
53682 788068 737522 685620 636935 593676 556519 525391 499664 478252 460022 444193 430441
53671D30441j1658r467p457n965m927m006l221k903k985k898k484k307k709l124
53657C64330k832j992j363j374j907k657l201k999j907n71J67J68j3J20N95J157
53641C45721J512J451J010M54Mk33p0O98J832K733L137L336L469L161K277J510
53625C72002J567K150K440K316K366K772L039K918K933L568M471M860M535M058
53611D15995M019M392M719M739M579M372L946L198K528K515L115L600L410K695
53597D67822J904J244P81N94N46K44l46o27j68M75L77m85j216j292j194j540k132
53580D64987k316j962j576j528j699j946k419l074l307k691j921k275l890n269
53566D29114m981l342j772r45m96k26n39j372j753r29O27J836K127J556L77q98
$$ plain form
53671 430441 418783 409316 401859 395894 390967 386961 383740 380837 377852 374954 372470 370163 367454 364330
53657 364330 361498 359506 358143 356769 354862 352205 349004 346005 344098 343527 343694 343862 343849 343969 344564 345721
53641 345721 347233 348684 349694 350148 350152 349919 349849 350547 352379 355112 358249 361585 365054 368215 370492 372002
53625 372002 373569 375719 378159 380475 382841 385613 388652 391570 394503 398071 402542 407402 411937 415995
53611 415995 420014 424406 429125 433864 438443 442815 446761 449959 452487 455002 458117 461717 465127 467822
53597 467822 469726 470970 471751 472345 472891 473135 472789 472162 471994 472469 472846 472361 471145 469853 468659 467119 464987
53580 464987 462671 460709 459133 457605 455906 453960 451541 448467 445160 442469 440548 438273 434383 429114
53566 429114 424133 420791 419019 418074 417578 417352 416813 415441 413688 412759 413386 415222 417349 418905 419282 418384
53550D18384j432p93M15J132J035P60J080K163L537M467M507L994L835M508N508
53535D53100O052O152O515P530Q807R678R855R571R390R845J1030J2490J3655
53522E73670J4326J4622J4637J4495J4547J5184J6446J8023J9657K1279K2835
53511G59721K4218K5398K6439K7386K8244K8955K9322K9103K8387K7626K7118
53500A061917K6586K5648K4515K3911K4293K5388K6510K7038K6696K5587K4041
53489A342130K2283K0404J8716J7837J8031J8637J8677J8007J7368J7254J7253
53478A546597J6778J5978J5431J5276J5109J4665J4134J3734J3423J3210J3359
53467A707694J4064J5092J6180J7677K0393K4438K8212K8485K1836O776j4608
$$ plain form
53550 418384 416952 416159 416574 417706 418741 419501 420581 422744 426281 430748 435255 439249 443084 447592 453100
53535 453100 459152 465304 471819 479349 488156 497834 507689 517260 526650 536495 547525 560015 573670
53522 573670 587996 602618 617255 631750 646297 661481 677927 695950 715607 736886 759721
53511 759721 783939 809337 835776 863162 891406 920361 949683 978786 1007173 1034799 1061917
53500 1061917 1088503 1114151 1138666 1162577 1186870 1212258 1238768 1265806 1292502 1318089 1342130
53489 1342130 1364413 1384817 1403533 1421370 1439401 1458038 1476715 1494722 1512090 1529344 1546597
53478 1546597 1563375 1579353 1594784 1610060 1625169 1639834 1653968 1667702 1681125 1694335 1707694
53467 1707694 1721758 1736850 1753030 1770707 1791100 1815538 1843750 1872235 1894071 1900847 1886239
53456A886239l7003n4639o4563o7508o5955o1895n6536n0991m6151m2010l8016
53445A300972l4122l0892k8466k6157k3300k0028j6935j4465j2777j1814j1171
53434A070845j0237q706o677m258j534R77K535L215M132O082Q442J0057J0959
53421A085832J2378J5038J8073J9968K0248J9951K0526K2418K4738K6287K6829
53410A312286K7254K8494L0608L2906L4772L6190L7683L9878M2913M6219M9076
53399A718279N1405N3721N6238N8477O0028O1127O2128O2777O2627O1938O1550
53388B370295O1851O2318O2182O1137N9275N6706N3482M9691M5411M0694L5735
53377B958777L0946K6567K2302J7629J2629Q148M783J882j901p076j2908j8647
$$ plain form
53456 1886239 1849236 1794597 1730034 1662526 1596571 1534676 1478140 1427149 1380998 1338988 1300972
53445 1300972 1266850 1235958 1207492 1181335 1158035 1138007 1121072 1106607 1093830 1082016 1070845
53434 1070845 1060608 1051902 1045225 1040967 1039433 1040410 1042945 1046160 1050292 1056374 1064816 1074873 1085832
53421 1085832 1098210 1113248 1131321 1151289 1171537 1191488 1212014 1234432 1259170 1285457 1312286
53410 1312286 1339540 1368034 1398642 1431548 1466320 1502510 1540193 1580071 1622984 1669203 1718279
53399 1718279 1769684 1823405 1879643 1938120 1998148 2059275 2121403 2184180 2246807 2308745 2370295
53388 2370295 2432146 2494464 2556646 2617783 2677058 2733764 2787246 2836937 2882348 2923042 2958777
53377 2958777 2989723 3016290 3038592 3056221 3068850 3076998 3081781 3083663 3081762 3074686 3061778 3043131
53365C043131k4435l0501l6212m0790m4635m8968n4183n9300o3083o5018o5190
53354B510816o4024o2287o0611n8858n6572n4081n2308n1401n0540m9300m8223
53343A902611m7590m6776m5365m3951m3015m1963m0170l8094l6366l4477l1592
53332A453252k8131k5306k3377k1566j9579j8016j7227j6773j6223j5587j4816
53321A236651j3623j1956j0036p843n234k567n03Q90K141L505M881O583R206J2445
53307A224540J5008J6133J6496J7024J7534J7122J5432J2986J0570Q893Q495R506
53295A389739J1550J4247J7514K1120K4262K6158K6917K7295K7593K7330K6094
53284A639819K4307K2701K1299J9355J6399J2938R816P106M189R04k034m043n596
$$ plain form
53365 3043131 3018696 2988195 2951983 2911193 2866558 2817590 2763407 2704107 2641024 2576006 2510816
53354 2510816 2446792 2384505 2323894 2265036 2208464 2154383 2102075 2050674 2000134 1950834 1902611
53343 1902611 1855021 1808245 1762880 1718929 1675914 1633951 1593781 1555687 1519321 1484844 1453252
53332 1453252 1425121 1399815 1376438 1354872 1335293 1317277 1300050 1283277 1267054 1251467 1236651
53321 1236651 1223028 1211072 1201036 1193193 1187959 1185392 1184889 1185779 1187920 1191425 1196306 1202889 1212095 1224540
53307 1224540 1239548 1255681 1272177 1289201 1306735 1323857 1339289 1352275 1362845 1371738 1380233 1389739
53295 1389739 1401289 1415536 1433050 1454170 1478432 1504590 1531507 1558802 1586395 1613725 1639819
53284 1639819 1664126 1686827 1708126 1727481 1743880 1756818 1766634 1773740 1777929 1778833 1776799 1772756 1767160
53271A767160p581j0072j2319j3871j5126j6724j8860k1250k3403k4890k5704
53260A577360k6471k7958l0264l2784l4887l6269l6767l6340l5440l4836l4806
53249A210538l4792l4157l2931l1515k9948k8019k5943k4451k4005k4216k4320
53238H96241k4015k3617k3395k3157k2561k1570k0234j8398j6026j3730j2280
53227F77258j1606j0940j0079r811j0584j1542j1586j0899j0618j1237j2138j2644
53215E43574j2705j2431j1656j0277q590o984n622m536l879l908m741o082p169
53202D44994p328o751o314o403o450o003n628n942o354n837m612l867l845l505
53188C66155k287j053o97r20j046j169j692k349k582k431k260j979j328p19q37
$$ plain form
53271 1767160 1759579 1749507 1737188 1723317 1708191 1691467 1672607 1651357 1627954 1603064 1577360
53260 1577360 1550889 1522931 1492667 1459883 1424996 1388727 1351960 1315620 1280180 1245344 1210538
53249 1210538 1175746 1141589 1108658 1077143 1047195 1019176 993233 968782 944777 920561 896241
53238 896241 872226 848609 825214 802057 779496 757926 737692 719294 703268 689538 677258
53227 677258 665652 654712 644633 634822 624238 612696 601110 590211 579593 568356 556218 543574
53215 543574 530869 518438 506782 496505 487915 480931 475309 470773 466894 462986 458245 452163 444994
53202 444994 437666 430915 424601 418198 411748 405745 400117 394175 387821 381984 377372 373505 369660 366155
53188 366155 363868 362815 362118 361198 360152 358983 357291 354942 352360 349929 347669 345690 344362 343643 342806
53173C42806j481j633q98j39l05j190j827j787j475j215p88l3N14K05o86j156
53157C28912p83k90m83j149j483j191o35r0M07P08O62N97J016J719J912J326O82
53140C31837P44J455K316L125L950M689N147N366N625O094O668O954O481N080
53126C95531L142J233n71k639n056p238q413q230o919n208l987l656l723l416
53112C40850k680k073j771j313n06R0p2p79j383j505j087k75N09P61M80K09K68
53095C29723M44O66J329K446L168K816J985J764K164K161J312M00K86P49R36N46
53079C52895M4r8K0Pk55n56q05j264k140l137l688l577l134k781k640k602k473
53062C23816k071j409p96m98l09J05N52M13m37j326j591j253p11k78k41q51j826
$$ plain form
53173 342806 341325 339692 338794 338655 338350 337160 335333 333546 332071 330856 330068 330035 330549 330754 330068 328912
53157 328912 328129 327839 327356 326207 324724 323533 322898 322808 323215 323923 324585 325182 326198 327917 329829 331155 331837
53140 331837 332581 334036 336352 339477 343427 348116 353263 358629 364254 370348 377016 383970 390451 395531
53126 395531 398673 399906 399335 396696 391640 384402 375989 367759 360840 355632 351645 347989 344266 340850
53112 340850 338170 336097 334326 333013 332507 332597 332525 331746 330363 328858 327771 327496 328005 328766 329246 329455 329723
53095 329723 330167 330833 332162 334608 337776 340592 342577 344341 346505 348666 349978 350378 350664 351413 352349 352895
53079 352895 352939 352841 352861 352868 352613 352057 351252 349988 347848 344711 341023 337446 334312 331531 328891 326289 323816
53062 323816 321745 320336 319540 319042 318733 318838 319390 319803 319366 318040 316449 315196 314485 314207 313966 313115 311289
53045C11289k280j665m88L03M26L52N01P57P51K60n48j131j002l08K79L64K16
53028C08076J40o9o69j366j663j507j079k56J104K505L072K515J402M60J5L3K33
53011C12946J65l54p88l61Q99K036K246J749J260R94N26l85j345j740j445q92
52995C15511n09l24j76p8j08p5L77J227K007K369K439K432K279J869J454J448
52979C32142J886K381K543K289J763J167O03J00k72l25K4N13P74P94Q33Q52N05
52962C48572k38r14j227j424j709j891j924k253k974l243k326r11m50j174j754
52947C24160j105K12Q00P9j318k389k625k201j677j453j378j063n01j12j25k95
52931C09009m13o30r72j021n11N3l8o09p57j49M47K02o55j195r46k12N84J311
$$ plain form
53045 311289 309009 307344 306856 307159 307585 307937 308438 309195 309946 310206 309658 308527 307525 307217 307496 307860 308076
53028 308076 308216 308147 307478 306112 304449 302942 301863 301607 302711 305216 308288 310803 312205 312665 312680 312713 312946
53011 312946 313111 312757 311969 311608 312507 314543 316789 318538 319798 320792 321318 320933 319588 317848 316403 315511
52995 315511 315002 314678 314502 314424 314316 314241 314618 315845 317852 320221 322660 325092 327371 329240 330694 332142
52979 332142 334028 336409 338952 341241 343004 344171 344774 344874 344602 344277 344301 344814 345588 346382 347215 348067 348572
52962 348572 348334 347420 346193 344769 343060 341169 339245 336992 334018 330775 328449 327538 327088 325914 324160
52947 324160 323055 323267 324067 324146 322828 320439 317814 315613 313936 312483 311105 310042 309541 309429 309304 309009
52931 309009 308596 307966 306994 305973 305462 305515 305477 304868 304111 303962 304409 304611 303956 302761 301815 301603 302187 303498
52913C03498J885K064J739J096M20j29m17l88k72m07p32p81m30j50k40k29L89
52896C06916J187J233M23l08k51J95J53n67j295j332p11j37j70n28m69K04P99
52879C05342O71K0n66r67j354j567j312p58k76J72P16Q99K17q30j176o89k49k83
52861B98010k83lN5k61k38M53J026P43N9k18j16j07j64m7M8j01j41K28N38K83
52841B99764j49q5K68K44n9K4N20Q12P07O37P68P82N63L46J36k67o33m51J02J83
52821C04212n33j351j581j474j677k185k301j474J08J672K454K243J506J058J479
52806C02156K781M374N503O030O664P876Q592O896K414k761o181p413p627p561
52792C21743p010n970m998m363l736k936k286k102k318k653k689j985o27N07P16
$$ plain form
52913 303498 305383 307447 309186 310282 310702 310573 310156 309768 309496 309089 308357 307576 307146 306996 306756 306527 306916
52896 306916 308103 309336 309759 309451 309200 309395 309548 308981 307686 306354 305643 305506 305336 304808 304339 304543 305342
52879 305342 306013 306033 305467 304500 303146 301579 300267 299509 299233 299405 300121 301020 301237 300407 299231 298542 298293 298010
52861 298010 297727 297724 297779 297518 297280 297733 298759 299502 299561 299343 299227 299120 298956 298909 298957 298856 298715 298943 299481 299764
52841 299764 299615 299530 299798 300042 299983 300007 300527 301339 302046 302683 303451 304233 304796 305142 305278 305011 304378 303927 304029 304212
52821 304212 303679 302328 300747 299273 297596 295411 293110 291636 291744 293416 295870 298113 299619 300677 302156
52806 302156 304937 309311 314814 320844 327508 335384 343976 350872 353286 350525 344344 336931 329304 321743
52792 321743 314733 308763 303765 299402 295666 292730 290444 288342 286024 283371 280682 278697 278070 278577 279293
52777B79293M15M15N93K59l82l63M38J033R19Q11J237J497P63n18j205r54l77
52760B83874k8J06J94K21J21l3n3J26K38r1o69o46M13J656J804Q12j09j48L34
52741B88122O64P39O20J84m30p12n56n45r53j112l76Q58J667J708J271O35j2l54
52723B91418k67j10k05k65R2N46M32k16o50m83j78l43q97j256j117q01q07j099
52705B83794j025j35J056J520R42O8l05k12r9k9J70L05N9l19j65O31J374J455
52687B89085J124J055J363J473R31K1n71n15o2L98O88P84P16O46P97J086J108
52670C00127P53N08Q49J578K148K381K439K338K064J984K402K776K126M37j091
52655C23819j411p60n0K90M63P32J145J615J883J582O41m92j246j432j286j120
$$ plain form
52777 279293 279708 280123 280716 280975 280593 280230 280668 281701 282620 283431 284668 286165 286928 286410 285205 284251 283874
52760 283874 283846 283952 284146 284367 284488 284455 284402 284528 284766 284675 284006 283360 283773 285429 287233 288045 287936 287788 288122
52741 288122 288786 289525 290145 290329 289899 289187 288631 288086 287133 286021 285645 286503 288170 289878 291149 291784 291772 291418
52723 291418 291151 291041 290836 290571 290663 291209 291641 291425 290775 290292 290114 289771 288874 287618 286501 285700 284893 283794
52705 283794 282769 282634 283690 285210 286152 286220 285915 285703 285604 285575 285745 286050 286109 285790 285625 286256 287630 289085
52687 289085 290209 291264 292627 294100 295031 295052 294481 293966 293904 294302 294990 295774 296490 297136 297933 299019 300127
52670 300127 300880 301388 302237 303815 305963 308344 310783 313121 315185 317169 319571 322347 324473 324910 323819
52655 323819 322408 321648 321598 321888 322351 323083 324228 325843 327726 329308 329949 329457 328211 326779 325493 324373
52639C24373j070r99o50k5M88N59L80L88O93J184J985L210M368M738M419M307
52623C48348M765N015M165K259Mk018l434l911l435k516j734j284j101j104j105
52608C42914q15j86N50J285K030K474K112J076K12M5J50q3n57p98o50l12NP0k89
52589C49233q18r52n75j44J59O84J453J771J272O09M84O78O65N83P32P57K39l22
52571C56508j50N25P61K86l42o85p58m96J66P68P41K46j45m31j000j566j393n90
52553C52445r8k72m36j72Q9P4K50Q30J178R28Q39J679K892L245K459J347O01K42
52535C68120J28K78O07R19J167J368J312Q45K78L5j2l67j005j280q88l60l44p40
52517C70061r21n64J29Q20J299J465J352J330J896L141M486N163M903M108L264
$$ plain form
52639 324373 323303 322304 321654 321629 322117 322676 323056 323444 324137 325321 327306 330516 334884 339622 344041 348348
52623 348348 353113 358128 362293 364552 364556 362538 359104 355193 351758 349242 347508 346224 345123 344019 342914
52608 342914 342099 341913 342463 343748 345778 348252 350364 351440 351652 351697 351847 351764 351207 350409 349759 349447 349452 349522 349233
52589 349233 348415 347463 346888 346744 346903 347587 349040 350811 352083 352692 353176 353854 354519 355102 355834 356591 356830 356508
52571 356508 356358 356883 357644 357930 357588 356903 356145 355649 355815 356583 357324 357570 357425 356994 355994 354428 353035 352445
52553 352445 352347 352075 351639 351467 351556 351630 351880 352710 353888 354816 355655 357334 360226 363471 365930 367277 367878 368120
52535 368120 368248 368526 369133 370052 371219 372587 373899 374744 375022 375057 375045 374678 373673 372393 371505 371145 370801 370061
52517 370061 369140 368576 368705 369525 370824 372289 373641 374971 376867 380008 384494 389657 394560 398668 401932
52502D01932K357R63j022k993m145m295l959l584l148k612k345k677l231l222
52488C68019k383j147k4P63J028O57K3k25nJ64R6K86Q65J069L85m85n91j73n8
52469C68264j58L03J266J810J686J660K121K505K550K942M068N041M794L459J920
52454D04231N33r15k453l757m577m760m191l101k084j396o68K95R56P89O4o50
52438C78316j298k002k426k217j681j309r35j60O91Q62L29j57j83q8k29m95o24
52421C66394n03p4O08J187J271R08M82K29K39O85J538K322K695L075M135N716
52405C90907P056P944Q925J0316J1704J2523J2457J1088P926L139k218o981j0525
52392D64261j2532j2723j1261r043p111n836m847l613j970k91Q13J057Q28P43
$$ plain form
52502 401932 404289 405252 404230 401237 397092 392797 388838 385254 382106 379494 377149 374472 371241 368019
52488 368019 365636 364489 364465 365228 366256 366913 366936 366711 366706 366870 366966 367252 368117 369186 369571 369086 368495 368322 368264
52469 368264 368106 368409 369675 371485 373171 374831 376952 379457 382007 384949 389017 394058 398852 402311 404231
52454 404231 404764 403849 401396 397639 393062 388302 384111 381010 378926 377530 376862 377157 378113 378902 378966 378316
52438 378316 377018 375016 372590 370373 368692 367383 366448 366288 366979 367841 368170 368013 367830 367742 367513 367018 366394
52421 366394 365891 365817 366425 367612 368883 369791 370273 370502 370741 371426 372964 375286 377981 381056 385191 390907
52405 390907 397963 405907 414832 425148 436852 449375 461832 472920 480846 483985 481767 474786 464261
52392 464261 451729 439006 427745 418702 411591 405755 400908 397295 395325 395034 395847 396904 397732 398475
52378C98475R15R61P22O21J165K322L550M334M605M729N045N427N398M673L393
52363D46335J838K91p66r31o24r08k060k982k623j398l68L51J250J920J383p9
52347D40629q07N9J471K143K263K776L795M662N141N603O232O829P291P703Q000
52332E03790Q094Q355R396J1202J2897J3662J3726J4053J5157J6529J7442J8011
52320F62314J8893K0048K0501J9590J7887J6367J5233J4222J3494J3390J3554
52309H45493J3385J3195J3865J5247J5987J5342J4158J3563J3522J3335J2761
52298I99853J1927J0685Q933P183O014N061L294L11l131n849p159p203o791o823
52284A016305p489q012p490n989m518l949m188m387l736k095oJ825L182M397N770
$$ plain form
52378 398475 399390 400351 401073 401694 402859 405181 408731 413065 417670 422399 427444 432871 438269 442942 446335
52363 446335 448173 448464 447698 446767 446143 445235 443175 440193 437570 436172 435804 436155 437405 439325 440708 440629
52347 440629 439822 439881 441352 443495 445758 448534 452329 456991 462132 467735 473967 480796 488087 495790 503790
52332 503790 511884 520239 529635 540837 553734 567396 581122 595175 610332 626861 644303 662314
52320 662314 681207 701255 721756 741346 759233 775600 790833 805055 818549 831939 845493
52309 845493 858878 872073 885938 901185 917172 932514 946672 960235 973757 987092 999853
52298 999853 1011780 1022465 1031398 1038581 1044595 1049656 1052950 1053261 1050130 1044281 1037122 1029919 1023128 1016305
52284 1016305 1008816 1000804 993314 987325 982807 978858 974670 970283 966547 964452 964446 966271 969453 973850 979620
52269I79620P125Q073Q554Q908R455J0199J0915J1385J1625J1863J2344J3095
52257A103161J3942J4644J4944J4666J3994J3534J3738J4236J4040J2462R661
52246A253022O309L077L95j602l042m034m407m082l508l387l822m214m095l644
52232A222966l293l149l097l021k753k126j281p34q19j263j423q80K81J575K493
52217A203476K918L148L437L748M132M956O243P188P097O608P014Q390R450R470
52203A287275R290R804J0500J0294R200Q190P746P442O884O290O022O052O010
52190A390999N534M566L425K489J735P81n17j900l223m662o154p187p583q006
52176A370297r171j0850j2133j2462j1933j0869r595q418p337n907l830j478N64
$$ plain form
52269 979620 986745 994818 1003372 1012280 1021735 1031934 1042849 1054234 1065859 1077722 1090066 1103161
52257 1103161 1117103 1131747 1146691 1161357 1175351 1188885 1202623 1216859 1230899 1243361 1253022
52246 1253022 1259331 1262408 1262803 1261201 1258159 1254125 1249718 1245636 1242128 1238741 1234919 1230705 1226610 1222966
52232 1222966 1219673 1216524 1213427 1210406 1207653 1205527 1204246 1203512 1202693 1201430 1200007 1199127 1199408 1200983 1203476
52217 1203476 1206394 1209542 1212979 1216727 1220859 1225815 1232058 1239246 1246343 1252951 1259965 1268355 1277805 1287275
52203 1287275 1296565 1306369 1316869 1327163 1336363 1344553 1352299 1359741 1366625 1372915 1378937 1384989 1390999
52190 1390999 1396533 1401099 1404524 1407013 1408748 1409529 1409012 1407112 1403889 1399227 1393073 1385886 1378303 1370297
52176 1370297 1361126 1350276 1338143 1325681 1313748 1302879 1293284 1284866 1277529 1271622 1267792 1266314 1266878
52163A266878K287M066N902P376Q326R061R832J0458J0505R582P584M927K463
52150A359247P67k65r33j111o21L6N7n96j082q26j97Q1k68j134k462m180n870
52133A340643o903p021o544n929n153l717j309J703M645P331J0151J3313J6445
52120A357655J9251K2105K5481K9027L1711L2975L3243L3175L2842L1869L0082
52109A679416K7739K5169K2507J9802J7201J4867J2806J0997R686R259R604R921
52097A868974R537Q714Q228Q281Q329P954P267O363M997L044P01k034n433r198
52083A925724j2128j3171j2441j0657q095m641n34L599P239R922J1128J0847J0094
52070A916886J0040J0787J1678J2632J4220J6390J8014J8135J6961J5284J3537
$$ plain form
52163 1266878 1269165 1273231 1279133 1286509 1294835 1303896 1313728 1324186 1334691 1344273 1351857 1356784 1359247
52150 1359247 1360014 1359749 1358816 1357705 1357084 1357120 1357177 1356581 1355499 1354673 1354476 1354557 1354289 1353155 1350693 1346513 1340643
52133 1340643 1333740 1326719 1320175 1314246 1309093 1305376 1304067 1305770 1310415 1317746 1327897 1341210 1357655
52120 1357655 1376906 1399011 1424492 1453519 1485230 1518205 1551448 1584623 1617465 1649334 1679416
52109 1679416 1707155 1732324 1754831 1774633 1791834 1806701 1819507 1830504 1840190 1849449 1859053 1868974
52097 1868974 1878511 1887225 1895453 1903734 1912063 1920017 1927284 1933647 1938644 1941688 1942389 1940355 1934922 1925724
52083 1925724 1913596 1900425 1887984 1877327 1869232 1864591 1864057 1867656 1874895 1884817 1895945 1906792 1916886
52070 1916886 1926926 1937713 1949391 1962023 1976243 1992633 2010647 2028782 2045743 2061027 2074564
52059B074564J1826J0300Q947P315N038K459L17j038j779k171k460l113m635o981
52045B098589r455j1406j2764j3823j4748j5517j6153j6688j6874j6226j4470
52034A940465j1762q548n434l208k558l399m800n823o339o717p095p430q017r280
$$ plain form
52059 2074564 2086390 2096690 2105637 2112952 2117990 2120449 2120766 2119728 2117949 2115778 2113318 2110205 2105570 2098589
52045 2098589 2089134 2077728 2064964 2051141 2036393 2020876 2004723 1988035 1971161 1954935 1940465
52034 1940465 1928703 1920155 1914721 1911513 1908955 1905556 1900756 1894933 1888594 1881877 1874782 1867352 1859335 1850055
$$ [...]
##END NTUPLES=NMR SPECTRUM
##END=
