##TITLE=AC1557_ROEFFECT0017_8269191_sCcxeRzGRb
##JCAMPDX= 6.0         $$ Bruker NMR JCAMP-DX V2.0
##DATA TYPE= NMR SPECTRUM
##DATA CLASS= NTUPLES
##ORIGIN= BRUKER
##OWNER= Administrator
$$ 1.72 TOPSPIN		Version 2.1
$$ 2013-10-12 23:18:32.017 -0700  Administrator@X
$$ Compression mode = diff/dup
##.OBSERVE FREQUENCY= 400.02188249412
##.OBSERVE NUCLEUS= ^1H
##.ACQUISITION MODE= SIMULTANEOUS (DQD)
##.ACQUISITION SCHEME= undefined
##.AVERAGES= 64
##.DIGITISER RES= 22
##SPECTROMETER/DATA SYSTEM= spect
##.PULSE SEQUENCE= noesygpps1d.comp
##.SOLVENT NAME= COFFEE_meoh
##.SHIFT REFERENCE= INTERNAL, COFFEE_meoh, 1, 14.96081
##AUDIT TRAIL= $$ (NUMBER, WHEN, WHO, WHERE, PROCESS, VERSION, WHAT)
$$ ##TITLE= Audit trail, TOPSPIN		Version 2.1
$$ ##JCAMPDX= 5.01
$$ ##ORIGIN= Bruker BioSpin GmbH
$$ ##OWNER= Administrator
$$ $$ E:\/data/COFFEE/nmr/AC1557_ROEFFECT0017_8269191_sCcxeRzGRb/12/pdata/1/auditp.txt
$$ ##AUDIT TRAIL=  $$ (NUMBER, WHEN, WHO, WHERE, PROCESS, VERSION, WHAT)
(   1,<2013-10-12 23:18:26.425 -0700>,<Administrator>,<X>,<go>,<TOPSPIN 2.1>,
      <created by zg
	started at 2013-10-12 23:06:56.903 -0700,
	POWCHK enabled, PULCHK disabled,
       configuration hash MD5:
       C8 4E 4E 5D D3 5C D8 9E 9F 52 82 E0 59 8A DE 15
       data hash MD5: 64K
       00 7C 9F 1D 6D 54 5F 83 A6 32 B5 C8 00 3E 6D 41>)
(   2,<2013-10-12 23:18:29.743 -0700>,<Administrator>,<X>,<proc1d>,<TOPSPIN 2.1>,
      <Start of raw data processing
       efp LB = 0.3 FT_mod = 6 PKNL = 1 PHC0 = 0 PHC1 = 0 SI = 128K 
       data hash MD5: 128K
       EE 40 6D 04 A3 5C 8E AD F5 4F A8 EC 1F 5F 04 7C>)
(   3,<2013-10-12 23:18:30.889 -0700>,<Administrator>,<X>,<proc1d>,<TOPSPIN 2.1>,
      <pk PHC0 = -80.99121 PHC1 = 0 
       data hash MD5: 128K
       14 05 F5 BB 8B 77 B1 13 A0 46 48 10 53 E8 95 CA>)
(   4,<2013-10-12 23:18:31.360 -0700>,<Administrator>,<X>,<proc1d>,<TOPSPIN 2.1>,
      <abs ABSG = 1 
       data hash MD5: 128K
       D4 93 89 3E 0E 3A 41 F1 CB 38 0E 75 80 9F 40 F7>)
(   5,<2013-10-12 23:18:31.495 -0700>,<Administrator>,<X>,<proc1d>,<TOPSPIN 2.1>,
      <abs ABSG = 2 
       data hash MD5: 128K
       7B 8B 2E 1E B0 62 AA C7 60 A4 D7 69 A0 0D 39 54>)
(   6,<2013-10-12 23:18:31.579 -0700>,<Administrator>,<X>,<proc1d>,<TOPSPIN 2.1>,
      <abs ABSG = 3 
       data hash MD5: 128K
       E5 11 54 6B CF 4E FD 17 A3 A4 A0 3A 32 F8 99 99>)
(   7,<2013-10-12 23:18:31.680 -0700>,<Administrator>,<X>,<proc1d>,<TOPSPIN 2.1>,
      <abs ABSG = 4 
       data hash MD5: 128K
       30 2A DF AD 54 13 60 73 60 A6 3F B6 47 6C 6F CD>)
(   8,<2013-10-12 23:18:31.798 -0700>,<Administrator>,<X>,<proc1d>,<TOPSPIN 2.1>,
      <abs ABSG = 5 
       data hash MD5: 128K
       24 C1 4D 44 5E C5 CA B1 B2 74 F4 A5 C5 A6 F7 55>)
$$ ##END=
$$ 
$$ $$ hash MD5
$$ $$ 48 C5 EC 2F B5 47 01 02 2E 18 0D BD 77 F8 77 B2
##$RELAX= 
##$RELAX= 
##$RELAX= 
##$RELAX= 
##$RELAX= 
##$RELAX= 
##$RELAX= 
##$RELAX= 
$$ Bruker specific parameters
$$ --------------------------
##$DU= <E:\>
##$EXPNO= 12
$$ [...]
150 150 150 150 150 150 150 150
##$TP07= 0
##$TPNAME0= <>
##$TPNAME1= <>
##$TPNAME2= <>
##$TPNAME3= <>
##$TPNAME4= <>
##$TPNAME5= <>
##$TPNAME6= <>
##$TPNAME7= <>
##$TPOAL= (0..7)
0.5 0.5 0.5 0.5 0.5 0.5 0.5 0.5
##$TPOFFS= (0..7)
0 0 0 0 0 0 0 0
##$TUNHIN= 0
##$TUNHOUT= 0
##$TUNXOUT= 0
##$USERA1= <user>
##$USERA2= <user>
##$USERA3= <user>
##$USERA4= <user>
##$USERA5= <user>
##$V9= 5
##$VALIST= <valist>
##$VCLIST= <CCCCCCCCCCCCCCC>
##$VD= 0
##$VDLIST= <DDDDDDDDDDDDDDD>
##$VPLIST= <PPPPPPPPPPPPPPP>
##$VTLIST= <TTTTTTTTTTTTTTT>
##$WBST= 1024
##$WBSW= 4
##$XGAIN= (0..3)
0 0 0 0
##$XL= 0
##$YL= 0
##$YMAX_a= 5754734
##$YMIN_a= -11899188
##$ZGOPTNS= <>
##$ZL1= 120
##$ZL2= 120
##$ZL3= 120
##$ZL4= 120
##$ABSF1= 14.96081
##$ABSF2= -5.597372
##$ABSG= 5
##$ABSL= 3
##$ALPHA= 0
##$AQORDER= 0
##$ASSFAC= 0
##$ASSFACI= 0
##$ASSFACX= 0
##$ASSWID= 0
##$AUNMP= <proc_prof1d_extract.lims>
##$AXLEFT= 0
##$AXNAME= <>
##$AXNUC= <1H>
##$AXRIGHT= 0
##$AXTYPE= 0
##$AXUNIT= <>
##$AZFE= 0.1
##$AZFW= 0.1
##$BCFW= 0
##$BC_mod= 0
##$BYTORDP= 0
##$COROFFS= 0
##$CY= 15
##$DATMOD= 1
##$DC= 0
##$DFILT= <>
##$DTYPP= 0
##$F1P= 0
##$F2P= 0
##$FCOR= 0.5
##$FTSIZE= 131072
##$FT_mod= 6
##$GAMMA= 0
##$GB= 0
##$INTBC= 1
##$INTSCL= 1
##$ISEN= 128
##$LB= 0.3
##$LEV0= 0
##$LPBIN= 0
##$MAXI= 10000
##$MC2= 0
##$MEAN= 0
##$ME_mod= 0
##$MI= 0
##$NCOEF= 0
##$NC_proc= -2
##$NLEV= 6
##$NOISF1= 0
##$NOISF2= 0
##$NSP= 0
##$NTH_PI= 0
##$NZP= 0
##$OFFSET= 14.96081
##$PC= 1
##$PHC0= -80.99121
##$PHC1= 0
##$PH_mod= 1
##$PKNL= yes
##$PPARMOD= 0
##$PPDIAG= 0
##$PPIPTYP= 0
##$PPMPNUM= 2147483647
##$PPRESOL= 1
##$PSCAL= 4
##$PSIGN= 0
##$PYNMP= <proc.py>
##$REVERSE= no
##$SF= 400.02000971271
##$SI= 131072
##$SIGF1= 0
##$SIGF2= 0
##$SINO= 400
##$SIOLD= 131072
##$SPECTYP= <>
##$SREGLST= <1H.CDCl3>
##$SSB= 0
##$STSI= 131072
##$STSR= 0
##$SW_p= 8223.68421052631
##$SYMM= 0
##$S_DEV= 0
##$TDeff= 65536
##$TDoff= 0
##$TI= <>
##$TILT= no
##$TM1= 0
##$TM2= 0
##$TOPLEV= 0
##$USERP1= <user>
##$USERP2= <user>
##$USERP3= <user>
##$USERP4= <user>
##$USERP5= <user>
##$WDW= 1
##$XDIM= 131072
##$YMAX_p= 349595142
##$YMIN_p= -11221
##$CURPLOT= <Network HP LaserJet P1505>
##$CURPRIN= <$Network HP LaserJet P1505>
##$DFORMAT= <normdp>
##$LAYOUT= <+/1D_H.xwp>
##$LFORMAT= <normlp>
##$PFORMAT= <normpl>
##$SURQMSG= 1
$$ End of Bruker specific parameters
$$ ---------------------------------
##NTUPLES= NMR SPECTRUM
##VAR_NAME=  FREQUENCY,     SPECTRUM/REAL,   SPECTRUM/IMAG
##SYMBOL=    X,             R,               I
##VAR_TYPE=  INDEPENDENT,   DEPENDENT,       DEPENDENT
##VAR_FORM=  AFFN,          ASDF,            ASDF
##VAR_DIM=   131072,        131072,          131072
##UNITS=     HZ,            ARBITRARY UNITS, ARBITRARY UNITS
##FACTOR=    0.0627417313425164, 1,          1
##FIRST=     8223.62146879497, 916,          -57499
##LAST=      0,             2322,            -57860
##MIN=       0,             -11221,          0
##MAX=       8223.62146879497, 349595142,    0
$$ Real data points
##PAGE= N=1
##DATA TABLE= (X++(R..R)), XYDATA
$$ [...]
61710D82552O45L85J6n01j258j890j928j650j825k514k880k476j955k045k487
61695D60189k572k258k047k080k084k076k413l064l443l166k601k411k824l485
61681D23665l886l813l410k941k523k152j941k044k301k243j678r83o36o96j008
61666C91410j544k165k379j878j153r62j321j513j144n01J14P90J490J747J253
61651C82244L84k64n23n04j59N61J330J656J505J336J488J824J987J835J551J405
61635C97656J492J585J349O60k85j219j977k469k695k874l299l915m259l966l185
61620C72599k300j492q30n33p44j150j290j217j410j962k339k178j937k279l073
61605C47865l512l206k701k660k981l091k864k759l015l297l294l200l219k970
$$ y = [482552, 483197, 483582, 483598, 483097, 481839, 479949, 478021, 476371, 474546, 472032, 469152, 466676, 464721, 462676, 460189, 457617, 455359, 453312, 451232, 449148, 447072, 444659, 441595, 438152, 434986, 432385, 429974, 427150, 423665, 419779, 415966, 412556, 409615, 407092, 404940, 402999, 400955, 398654, 396411, 394733, 393750, 393114, 392418, 391410, 389866, 387701, 385322, 383444, 382291, 381329, 380008, 378495, 377351, 376850, 376964, 377754, 379244, 380991, 382244, 382628, 382364, 381841, 381337, 381178, 381739, 383069, 384725, 386230, 387566, 389054, 390878, 392865, 394700, 396251, 397656, 399148, 400733, 402082, 402742, 402457, 401238, 399261, 396792, 394097, 391223, 387924, 384009, 379750, 375784, 372599, 370299, 368807, 367977, 367444, 366700, 365550, 364260, 363043, 361633, 359671, 357332, 355154, 353217, 350938, 347865, 344353, 341147, 338446, 335786, 332805, 329714, 326850, 324091, 321076, 317779, 314485, 311285, 308066, 305096]
61591C05096k001p36k65j092k528l535l691l153k225j260o71n78o74p17q53j200
61575B79917j472j477j582k087k433j790l75O51O69L34M71R21R90N35P8J9K02
61558B73571K48l8n03o94k35O74J294J141N21K8j99l28k30L86J259J637J266Q35
61540B80633J065J731K004J571R50P55J052J512J857J975J808J399R26N21J17
61525B99876l78q07q93o23k96j57j93l43o10q60p46j86L12P2r00j803j758n78
61507B89129J108K299K280J142k66j126j352j396j450j252o64p4J8m51j129j574
61491B85242j436o43L25O84J93l95j89O75J142N91l53n51L75J721K534K524K124
61474B94563J853J748J482R52N29O32J182J648J637J260Q34L94k91j186j700j147
$$ y = [305096, 303095, 302359, 302094, 301002, 298474, 294939, 291248, 288095, 285870, 284610, 283939, 283361, 282687, 281970, 281117, 279917, 278445, 276968, 275386, 273299, 270866, 269076, 268701, 269352, 270021, 270355, 270826, 271747, 272737, 273272, 273350, 273369, 273571, 273819, 273781, 273278, 272584, 272349, 273023, 274317, 275458, 275979, 276007, 275808, 275480, 275250, 275636, 276895, 278532, 279798, 280633, 281698, 283429, 285433, 287004, 287954, 288709, 289761, 291273, 293130, 295105, 296913, 298312, 299238, 299759, 299876, 299498, 298691, 297798, 297175, 296879, 296722, 296529, 296186, 295576, 294716, 293970, 293784, 294096, 294168, 293268, 291465, 289707, 289129, 290237, 292536, 294816, 295958, 295692, 294566, 293214, 291818, 290368, 289116, 288452, 288378, 288396, 287945, 286816, 285242, 283806, 283163, 283488, 284172, 284365, 283970, 283781, 284456, 285598, 286189, 285836, 285285, 285660, 287381, 289915, 292439, 294563, 296416, 298164, 299646, 300598, 301127, 301759, 302941, 304589, 306226, 307486, 308320, 308714, 308423, 307237, 305537, 304390]
61458C04390M04J967K489J767M24q02j474j376n47N05J057R51Q00J148J713J848
61442C15264J468J074J007J155J398J796K199K119J349M26J72P94J730K336K507
61427C36794K545K569K311J552N83O4L55J153J796J825J254N26K65Q43J917K564
61411C58916K181J181N12N46O73J63r15j733j664r26k87j98m19n53o59j048j548
61394C54222j496o63K70N08J28j85j74k12n41q57p58k18M76R48P81k11j548k260
61376C48210j816o55L50Q54J157J577J974J946J331M75L1L45J068J493J315Q76
61360C60531N98M72L24L64J042K333L477L778L500L619M607N783O191N872N734
61345D08225O206O631O333N644N295N232M827M058L640L870M079L600K639J888
$$ y = [304390, 304794, 306761, 309250, 311017, 311441, 310639, 309165, 307789, 307242, 307747, 308804, 309755, 310555, 311703, 313416, 315264, 316732, 317806, 318813, 319968, 321366, 323162, 325361, 327480, 328829, 329255, 329427, 330221, 331951, 334287, 336794, 339339, 341908, 344219, 345771, 346354, 346418, 346773, 347926, 349722, 351547, 352801, 353327, 353592, 354435, 356352, 358916, 361097, 362278, 362790, 363336, 364009, 364172, 363257, 361524, 359860, 358934, 358647, 358449, 358030, 357477, 356818, 355770, 354222, 352726, 352063, 352333, 352841, 352969, 352784, 352610, 352398, 351857, 351000, 350242, 350024, 350500, 351448, 352229, 352018, 350470, 348210, 346394, 345739, 346089, 346943, 348100, 349677, 351651, 353597, 354928, 355403, 355434, 355779, 356847, 358340, 359655, 360531, 361129, 361601, 361925, 362289, 363331, 365664, 369141, 372919, 376419, 380038, 384645, 390428, 396619, 402491, 408225, 414431, 421062, 427395, 433039, 438334, 443566, 448393, 452451, 456091, 459961, 464040, 467640, 470279, 472167]
61331D72167J704K013K524K683J825q8k131l221l115k350j506q90o69p39o08J33
61315D67732J223K051K457K854L486M131M570N059O029P518R067J0132J0531J0558
61301E47398J0605J0705J0544R943R024P846O243M255K414J074j69j898l867n254
61287F08863n831o229o901p516p672p585p624p584o999n947n055m785n021n251
61273E18863m898l613j692p5M70J99Q3O24J370J704J699J823K173K412K442K660
61257E26244L368M262M750M656M357M207M179M153M248M610M953M745L850K715
61243E85297J796J054K47n60j128j489j888k306k444k242k052k022j741p92N71
61228E70301J734K575L498M612N378N382N080N386O608Q053Q765Q510P935P819
$$ y = [472167, 473871, 475884, 478408, 481091, 482916, 482828, 480697, 477476, 474361, 472011, 470505, 469615, 468946, 468207, 467599, 467732, 468955, 471006, 473463, 476317, 479803, 483934, 488504, 493563, 499592, 507110, 516177, 526309, 536840, 547398, 558003, 568708, 579252, 589195, 598219, 606065, 612308, 616563, 618977, 620051, 619882, 617984, 614117, 608863, 603032, 596803, 589902, 582386, 574714, 567129, 559505, 551921, 544922, 538975, 533920, 529135, 524114, 518863, 513965, 510352, 508660, 508585, 509055, 509254, 509337, 509961, 511331, 513035, 514734, 516557, 518730, 521142, 523584, 526244, 529612, 533874, 538624, 543280, 547637, 551844, 556023, 560176, 564424, 569034, 573987, 578732, 582582, 585297, 587093, 588147, 588394, 587834, 586706, 585217, 583329, 581023, 578579, 576337, 574285, 572263, 570522, 569730, 570301, 572035, 574610, 578108, 582720, 588098, 593480, 598560, 603946, 610554, 618607, 627372, 635882, 643817, 651636]
61214F51636Q135Q055P035N724N324O062O775O318M880L557K982K936L032L171
61200G25622L355L552L884M485N261O074P183Q954J1135J2896J3739J3885J3698
61187H33723J3226J2430J1392J0087Q429O679N329M384L320K005R33K78n28j773
61173I09914k829l288l918n487p287q103q262r177j0938j1962j1508j0995j1912
61160H04248j3590j4297j3821j3564j4351j5409j5623j4836j3554j2156j0816
61149F52231r729q833p715o127m495l531l400l545l368k853k403k282k368k458
61135E89124k531k653k670k288j380j08J323K861M499O113P521Q649R583J0598
61121F28641J2051J4064J6196J7748J8621J9617K1556K4239K6615K7960K8488
$$ y = [651636, 659771, 667826, 674861, 680585, 685909, 691971, 698746, 705064, 709944, 713501, 716483, 719419, 722451, 725622, 728977, 732529, 736413, 740898, 746159, 752233, 759416, 768370, 779505, 792401, 806140, 820025, 833723, 846949, 859379, 870771, 880858, 889287, 895966, 901295, 905679, 908999, 911004, 911937, 912215, 911687, 909914, 907085, 903797, 899879, 894392, 887105, 879002, 870740, 861563, 850625, 838663, 827155, 816160, 804248, 790658, 776361, 762540, 748976, 734625, 719216, 703593, 688757, 675203, 663047, 652231, 642502, 633669, 625954, 619827, 615332, 611801, 608401, 604856, 601488, 598635, 596232, 593950, 591582, 589124, 586593, 583940, 581270, 578982, 577602, 577494, 578817, 581678, 586177, 592290, 599811, 608460, 618043, 628641, 640692, 654756, 670952, 688700, 707321, 726938, 748494, 772733, 799348, 827308, 855796]
61110H55796K8726K8821K8673K8410K8189K7764K6639K4757K2582K0412J7956
61099A138725J4846J1261P716M395J094k281n558q680j1882j5282j8521k1042
61087A094791k2656k3681k4624k5817k7182k8247k8460k7628k6079k4373k2969
61076H13075k2060k1510k0884j9757j8046j5919j3480j0907q783p729p456o793
61064F39751n044k896j509j113r90m86N97K209L943M960M875M602N458P426R273
61049F71056J0416J1600J3342J4882J5400J5463J6284J8059K0007K1672K3325
61038H51506K5183K7033K8692L0215L1634L2946L4307L5829L7324L8719M0470
61027A213858M2895M5341M6813M7392M8200M9859N1947N4256N7616O2922P0079
$$ y = [855796, 884522, 913343, 942016, 970426, 998615, 1026379, 1053018, 1077775, 1100357, 1120769, 1138725, 1153571, 1164832, 1172548, 1176943, 1178037, 1175756, 1170198, 1161518, 1149636, 1134354, 1115833, 1094791, 1072135, 1048454, 1023830, 998013, 970831, 942584, 914124, 886496, 860417, 836044, 813075, 791015, 769505, 748621, 728864, 710818, 694899, 681419, 670512, 661729, 654000, 646544, 639751, 634707, 631811, 630302, 629189, 628199, 627713, 628310, 630519, 634462, 639422, 644297, 648899, 654357, 661783, 671056, 681472, 693072, 706414, 721296, 736696, 752159, 768443, 786502, 806509, 828181, 851506, 876689, 903722, 932414, 962629, 994263, 1027209, 1061516, 1097345, 1134669, 1173388, 1213858, 1256753, 1302094, 1348907, 1396299, 1444499, 1494358, 1546305, 1600561, 1658177, 1721099, 1791178]
61016A791178P8639Q8883J01577J17178J36063J59189J87630K21677K61282L07204
61006C450500L60856M23072M94112N74851O66631P69838Q84516J012124J150917
60997I787417J282626J365367J352219J229864J039731Q50506P01404N74627M28538
60988A8612299K53365Q3329m7765j49655k62121m03153n46691o58900p46042q52365
60978A5282301j008971j192887j340357j396333j349385j227046j068669r04691
60970E793962p52435o20251n10891m22911l52420k95360k48773k10647j79419
60961B200855j53991j33792j18188j05781r4719q3950p3810o5049n7539n0413
60951A263623m3309l6916l2032k8569k5812k3380k1485k0224j9140j7694j5952
$$ y = [1791178, 1869817, 1958700, 2060277, 2177455, 2313518, 2472707, 2660337, 2882014, 3143296, 3450500, 3811356, 4234428, 4728540, 5303391, 5970022, 6739860, 7624376, 8636500, 9787417, 11070043, 12435410, 13787629, 15017493, 16057224, 16907730, 17609134, 18183761, 18612299, 18865664, 18948993, 18901228, 18751573, 18489452, 18086299, 17539608, 16880708, 16134666, 15282301, 14273330, 13080443, 11740086, 10343753, 8994368, 7767322, 6698653, 5793962, 5041527, 4421276, 3910385, 3487474, 3135054, 2839694, 2590921, 2380274, 2200855, 2046864, 1913072, 1794884, 1689103, 1594384, 1510434, 1436624, 1371575, 1314036, 1263623, 1220314, 1183398, 1151366, 1122797, 1096985, 1073605, 1052120, 1031896, 1012756, 995062, 979110]
60940I79110j4499j3676j3185j2524j1570j0566r668q804p922p155o683o547o600
60927H49711o538o047n108m108l348k549j203N84K086K924L548M433N342N928
60913H45655O650Q355J0999J3561J5336J6649J8024J9273J9946K0197K0593K1170
60901A036408K1381K1024K0679K0830K1023K0324J8466J6087J3832J1629R017
60890A230700N841K369j050m136o675q767j0968j3775j6879j9306k0485k0859
60878A116010k1257k1897k2307k2092k1518k1221k1447k1719k1377k0406j9427
60867H81342j8755j7892j6387j4820j4129j4166j3784j2519j1216j0682j0574
60856G26418j0264r946j0088j0436j0439j0197j0113r980r354q556q340q671q846
$$ y = [979110, 964611, 950935, 937750, 925226, 913656, 903090, 893422, 884618, 876696, 869541, 862858, 856311, 849711, 843173, 837126, 832018, 827910, 824562, 822013, 820810, 821394, 823480, 826404, 829952, 834385, 839727, 845655, 852305, 860660, 871659, 885220, 900556, 917205, 935229, 954502, 974448, 994645, 1015238, 1036408, 1057789, 1078813, 1099492, 1120322, 1141345, 1161669, 1180135, 1196222, 1210054, 1221683, 1230700, 1236541, 1238910, 1237860, 1233724, 1227049, 1218282, 1207314, 1193539, 1176660, 1157354, 1136869, 1116010, 1094753, 1072856, 1050549, 1028457, 1006939, 985718, 964271, 942552, 921175, 900769, 881342, 862587, 844695, 828308, 813488, 799359, 785193, 771409, 758890, 747674, 736992, 726418, 716154, 706208, 696120, 685684, 675245, 665048, 654935, 644955, 635601, 627045, 618705, 610034, 601188]
60843F01188q714q811r197r238q693q086p742p379p015p270q227q864q306p042
60829D86604o194o114o248n998n127l751k361j535j149m22Q79J816J477K69o42
60814D51504p95n68k24K76P10O78L23K39O01J001J169J234J196Q22K45P9O01J221
60796D60312J160L73m65p52n17k88n46j272k011k404k572k767k875k561j902j491
60780D39422j793k643l454l754l493l032k874l213l683l722l202k523k061j800
60766C98175j550j304j203j234j208r91o61l63j34K4L0k11n06m57K1M71M59K35
60748C89593M50J263K151K671K918L137L258L113K716K157J481Q30L74q9r80k211
60732D12832l066l188l158l635m321m412l760k961k526k484k763l315l878m024
$$ y = [601188, 592474, 583663, 574466, 565228, 556535, 548449, 540707, 533328, 526313, 519043, 510816, 501952, 493646, 486604, 480410, 474296, 468048, 462050, 456923, 453172, 450811, 449276, 448127, 447705, 448584, 450400, 451877, 452146, 451504, 450709, 450141, 449917, 450193, 450903, 451581, 451904, 452143, 452744, 453745, 454914, 456148, 457344, 458166, 458411, 458490, 459091, 460312, 461472, 461845, 461380, 460628, 460111, 459823, 459277, 458005, 455994, 453590, 451018, 448251, 445376, 442815, 440913, 439422, 437629, 434986, 431532, 427778, 424285, 421253, 418379, 415166, 411483, 407761, 404559, 402036, 399975, 398175, 396625, 395321, 394118, 392884, 391676, 390685, 390024, 389661, 389527, 389551, 389581, 389370, 388864, 388407, 388428, 388899, 389358, 389593, 390043, 391306, 393457, 396128, 399046, 402183, 405441, 408554, 411270, 413427, 414908, 415738, 416112, 416023, 415043, 412832, 409766, 406578, 403420, 399785, 395464, 391052, 387292, 384331, 381805, 379321, 376558, 373243, 369365, 365341]
60718C65341l569k735j948j707k289l325l916l586k863k471k382k188j948j907
60704C28507j697p66M68Q85K28m76l75J24J25m65r48p11K40J377J969J628P18
60687C30831N4Q0N90J224J907K703L594M479N077M927L927K812K473K852L124
60672C70654L015L171L978M799M848M151L254K486K004K033K476K670K073R50
60658D12562Jm00k56K98Q28N88o44j953k115r52N20J244R32j8r74j423j375j374
60640D05489j856k584l069l284l519l699l437k796k408k605k930k749k048j375
60626C67130j126j147j034o51l12m43j026j518j409p55o6K39J11k43n38n27j98
60609C56487J94M54P17J192J693J701R70q5o93l59P10J645J521K08j331j815r11
$$ y = [365341, 361772, 359037, 357089, 355382, 353093, 349768, 345852, 342266, 339403, 336932, 334550, 332362, 330414, 328507, 326810, 326044, 326512, 327397, 327625, 327149, 326774, 326898, 327023, 326558, 325610, 324899, 325139, 326516, 328485, 330113, 330831, 330885, 330965, 331555, 332779, 334686, 337389, 340983, 345462, 350539, 355466, 359393, 362205, 364678, 367530, 370654, 373669, 376840, 380818, 385617, 390465, 394616, 397870, 400356, 402360, 404393, 406869, 409539, 411612, 412562, 412563, 412163, 411907, 412205, 413033, 413621, 412977, 411024, 408909, 407957, 408477, 409721, 410653, 410635, 409661, 408238, 406863, 405489, 403633, 401049, 397980, 394696, 391177, 387478, 384041, 381245, 378837, 376232, 373302, 370553, 368505, 367130, 366004, 364857, 363823, 363172, 362860, 362417, 361391, 359873, 358464, 357709, 357643, 357882, 357993, 357750, 357212, 356685, 356487, 356681, 357135, 357852, 359044, 360737, 362438, 363408, 363323, 362630, 362271, 362981, 364626, 366147, 366355, 365024, 363209, 362298]
60592C62298M56J176J159J180J638J939J403L73j40J48M20M8m49k40N11J008J207
60575C74135J799K833L350K905K491L316N237P126Q346R035R264Q837P941P159
60561D53774O660N947M663L137J858Q67j09j185k265l233l941m192l928l297k340
60546D52416q86J071L015M274M718M877N373O398P761R154J0245J0733J0616J0280
60532E40045J0042R542Q013N294K284J29r09j488k270l331m329m882m748l984
60518E49408l057k450k172j915j690j869k468k825k243p27J123K756M018N133
60504E41022O488Q269J0230J2006J3668J5658J8129K0815K3536K6395K9226L1452
60492G56894L2732L3240L2921L1039K7007K1292J4891Q276J358n771j2746j9341
$$ y = [362298, 362754, 363930, 365089, 366269, 367907, 369846, 371249, 371622, 371482, 371630, 372050, 372098, 371649, 371409, 371920, 372928, 374135, 375934, 378767, 382117, 385022, 387513, 390829, 396066, 403192, 411538, 420573, 429837, 438674, 446615, 453774, 460434, 466381, 471044, 474181, 476039, 476906, 476797, 475612, 473347, 470114, 466173, 461981, 458053, 454756, 452416, 451530, 452601, 455616, 459890, 464608, 469485, 474858, 481256, 489017, 498171, 508416, 519149, 529765, 540045, 550087, 559629, 567642, 572936, 575220, 575349, 574440, 572952, 570682, 567351, 563022, 558140, 553392, 549408, 546351, 543901, 541729, 539814, 538124, 536255, 533787, 530962, 528719, 527992, 529115, 531871, 535889, 541022, 547510, 555779, 566009, 578015, 591683, 607341, 625470, 646285, 669821, 696216, 725442, 756894, 789626, 822866, 855787, 886826, 913833, 935125, 950016, 958292, 959650, 953879, 941133, 921792]
60480I21792k5360l0213l3286l4763l5508l5984l5755l4204l1380k7983k4795
60469E72561k2172j9875j7344j4404j1611r669q613p900p160o439n818n321n184
60456D31051n680o461o577n459l626k154j646j884k280k402k150j661j180q99
60442C86992q76r92j045r68r70j265j685j783j401q25l53j2J49m2m67o07k19K80
60424C73911M78N28O17L57n73j552j587n75O68J495J777J381K76q16q45K05J137
60407C76882J134P45Q42J297J311O86O9R2O94J290J369R54N58O10R86J317J626
60390C92462K185K850L068K618J913J457J428J821K440K745K337J636J423J641
60376D22024J493Q90P73J539K181J785J018J150K169K866K452J178l20j334j057
$$ y = [921792, 896432, 866219, 832933, 798170, 762662, 726678, 690923, 656719, 625339, 597356, 572561, 550389, 530514, 513170, 498766, 487155, 477486, 468873, 460973, 453813, 447374, 441556, 436235, 431051, 425371, 418910, 412333, 406874, 403248, 401094, 399448, 397564, 395284, 392882, 390732, 389071, 387891, 386992, 386116, 385124, 384079, 383111, 382141, 380876, 379191, 377408, 376007, 375182, 374829, 374817, 374966, 374924, 374457, 373850, 373631, 373911, 374389, 374917, 375534, 375891, 375318, 373766, 372179, 371604, 372272, 373767, 375544, 376925, 377201, 376385, 375540, 375745, 376882, 378016, 378761, 379603, 380900, 382211, 382897, 382966, 383058, 383752, 385042, 386411, 387365, 387923, 388533, 389519, 390836, 392462, 394647, 397497, 400565, 403183, 405096, 406553, 407981, 409802, 412242, 414987, 417324, 418960, 420383, 422024, 423517, 424407, 425180, 426719, 428900, 430685, 431703, 432853, 435022, 437888, 440340, 441518, 441198, 439864, 438807]
60361D38807O57K540K984K027J348K006L161L515L194L450M921O956Q483Q965
60347D93014Q488P390O049M791L809L073K365J422J80j217k611l931n007n483
60333E12332n243m744m590m773m694l973k954k264k194k586l082l303l045k501
60319D62386k118j976j562l84J259K501K944L179M095N833P664Q849R368R812
60305E11850J0776J2508J4820J7064J8291J7897J6232J4228J2274R721N802P91
60293F62254m133q114j1325j4359j7201j9104j9411j8233j6254j4025j1655r180
60281D99260o899n154l882k757j720j154j327j953k424k418k149k106k546l212
60267D59559l547l307k923k940l207k993k001q51k86l07l96l11k15k06j45N1K92
$$ y = [438807, 439464, 442004, 444988, 447015, 448363, 450369, 453530, 457045, 460239, 463689, 468610, 475566, 484049, 493014, 501502, 508892, 514941, 519732, 523541, 526614, 528979, 530401, 530581, 529364, 526753, 522822, 517815, 512332, 507089, 502345, 497755, 492982, 488288, 484315, 481361, 479097, 476903, 474317, 471235, 467932, 464887, 462386, 460268, 458292, 456730, 456346, 457605, 460106, 463050, 466229, 470324, 476157, 483821, 492670, 502038, 511850, 522626, 535134, 549954, 567018, 585309, 603206, 619438, 633666, 645940, 655661, 661463, 662254, 658121, 650007, 638682, 624323, 607122, 588018, 568607, 550374, 534120, 520095, 508440, 499260, 492361, 487207, 483325, 480568, 478848, 477694, 476367, 474414, 471990, 469572, 467423, 465317, 462771, 459559, 456012, 452705, 449782, 446842, 443635, 440642, 438641, 437790, 437504, 437197, 436801, 436490, 436275, 436069, 435924, 435975, 436267]
60250D36267M79N65M84K83K54O27J158J317R30M03K36N20J002J389J537J500J463
60233D50414J523J529J297R83R56J222J280Q17L55P35J964K996K933K124J652
60218D72780J927K335K328K185K398K876L357M146N622P172P550O485N137M681
60204E30979N105N748O299O688O597N902N235N309N828N739M603L065J945J396
60190F00438J096P63L05k33o86r67j297j963k907l766m349m747n054n276n486
60175E65871n683n567m889l989l509l473l190k263j217q13j117j613j906j915
60161E24727j584q82q5L52L21K28M93J079J649K033K338K600K566K026J270R47
60145E40078J389K267L032L487L798M149M581N084N623O154O677P218P609P582
$$ y = [436267, 436746, 437311, 437795, 438078, 438332, 438959, 440117, 441434, 442364, 442767, 443003, 443523, 444525, 445914, 447451, 448951, 450414, 451937, 453466, 454763, 455746, 456702, 457924, 459204, 460021, 460376, 461111, 463075, 466071, 469004, 471128, 472780, 474707, 477042, 479370, 481555, 483953, 486829, 490186, 494332, 499954, 507126, 514676, 521161, 526298, 530979, 536084, 541832, 548131, 554819, 561416, 567318, 572553, 577862, 583690, 589429, 594032, 597097, 599042, 600438, 601534, 602297, 602602, 602369, 601683, 600716, 599419, 597456, 594549, 590783, 586434, 581687, 576633, 571357, 565871, 560188, 554621, 549732, 545743, 542234, 538761, 535571, 533308, 532091, 531278, 530161, 528548, 526642, 524727, 523143, 522261, 522176, 522528, 522849, 523077, 523570, 524649, 526298, 528331, 530669, 533269, 535835, 537861, 539131, 540078, 541467, 543734, 546766, 550253, 554051, 558200, 562781, 567865, 573488, 579642, 586319, 593537, 601146, 608728]
60131F08728P146O587N964M955L540K356J908J759J184K99j45l2j0l04k55O07
60115F44287J714K207K032J749J630J405Q79K84K3K22N60N15j21j007j683k108
60099F52588k466k637k359j858j723k040k321k390k628l034k861j687k24O00Q52
60084F25812J196J750K105K226K462K791K761K267J624R15j30j460k597l408m382
60069F33932n826p257q023q209q503r223r836r496p977o028m757m674n346o003
60055E32774o199n810m819l476k378j882j582r05j5M66N57J029K213L468M155
60040E17596M552N290O285O828O519N664M794M138L598K972K204J457R25M82k11
60025E73093j267k427l500m585n775o865p636q156q546q684q410p818p064o183
$$ y = [608728, 615874, 622461, 628425, 633380, 636920, 639276, 641184, 642943, 644127, 644426, 644281, 644249, 644239, 643935, 643680, 644287, 646001, 648208, 650240, 651989, 653619, 655024, 655903, 656187, 656210, 656432, 656992, 657507, 657386, 656379, 654696, 652588, 650122, 647485, 645126, 643268, 641545, 639505, 637184, 634794, 632166, 629132, 626271, 624584, 624360, 624960, 625812, 627008, 628758, 630863, 633089, 635551, 638342, 641103, 643370, 644994, 645909, 645779, 644319, 641722, 638314, 633932, 628106, 620849, 612826, 604617, 596114, 586891, 577055, 567559, 559582, 553554, 548797, 544123, 538777, 532774, 526575, 520765, 515946, 512470, 510092, 508210, 506628, 505723, 505708, 506174, 506731, 507760, 509973, 513441, 517596, 522148, 527438, 533723, 540551, 547070, 552734, 557528, 561666, 565264, 568236, 570440, 571897, 572822, 573304, 573093, 571826, 569399, 565899, 561314, 555539, 548674, 541038, 532882, 524336, 515652, 507242, 499424, 492360, 486177]
60011D86177n278m629m271l763k835j988j893k365k558k116j507j204j089r37
59997D49744q17p62m78K56J198J994K577K961K995K671K371K389K465K234J901
59982D73699J942K245K222J694J121Q20M92j75j000j685k291k934l323l151k662
59967D67014k363k261j901j141l55K92J136K355L416L657L160K593K292J972J362
59952D81228O49J49j04j87k2M62J004J214J038P57N05J50k92m48p3M46M40k09
59934D86707q79j035r11j151j907k600k549j621k84P77J043N27p4J19J271K588
59918D80021L228L174K964K835K644K523K920L855M684M930M833M741M399L402
59904E31153K051J133Q98Q53N97L50M36P06P56M57K1k54j54M17J336K330L229
$$ y = [486177, 480899, 476270, 471999, 468236, 465401, 463413, 461520, 459155, 456597, 454481, 452974, 451770, 450681, 449744, 448927, 448165, 447687, 447943, 449141, 451135, 453712, 456673, 459668, 462339, 464710, 467099, 469564, 471798, 473699, 475641, 477886, 480108, 481802, 482923, 483743, 484235, 484060, 483060, 481375, 479084, 476150, 472827, 469676, 467014, 464651, 462390, 460489, 459348, 458993, 459285, 460421, 462776, 466192, 469849, 473009, 475602, 477894, 479866, 481228, 481877, 482026, 481922, 481735, 481713, 482175, 483179, 484393, 485431, 486188, 486693, 486843, 486551, 486103, 486030, 486476, 486916, 486707, 485828, 484793, 483882, 482731, 480824, 478224, 475675, 474054, 473770, 474547, 475590, 476117, 476043, 476162, 477433, 480021, 483249, 486423, 489387, 492222, 494866, 497389, 500309, 504164, 508848, 513778, 518611, 523352, 527751, 531153, 533204, 534337, 535235, 536088, 536685, 537035, 537471, 538177, 538933, 539390, 539411, 539157, 539003, 539420, 540756, 543086, 546315]
59887E46315M039M704M992M756M169L602L384L668M359N074N397N228M685L747
59873F08119K344Q53m9k89p08k014l840n274o021o457o710o387n365m203l498
59858E60501l160k636j632m05N91J195J679K424L449M355M769M714M422M038L751
59843E88055L832M217M320L708K736J971J260R8j273j976j816j568j680j597r02
59828E99385k99p38k140l656m813n572n734n161m419m294m691m742m135l543l559
59813E41889l903l984l687l214k604j878j295j115j251j415j480j453j293r83
59799E12334o42m44n23j020j945k915l307k942k315j936j728j331p65m07l85m89
59783D89240o02q51j215j324q87j61K47j3p06j316j546j481j321j082p13l53k29
$$ y = [546315, 550354, 555058, 560050, 564806, 568975, 572577, 575961, 579629, 583988, 589062, 594459, 599687, 604372, 608119, 610463, 611316, 611267, 610978, 610270, 608256, 604416, 599142, 593121, 586664, 579954, 573567, 568202, 563999, 560501, 557341, 554705, 553073, 552668, 553259, 554454, 556133, 558557, 562006, 566361, 571130, 575844, 580266, 584304, 588055, 591887, 596104, 600424, 604132, 606868, 608839, 610099, 610197, 608924, 606948, 605132, 603564, 601884, 600287, 599385, 599086, 598348, 596208, 592552, 587739, 582167, 576433, 571272, 566853, 562559, 557868, 553126, 548991, 545448, 541889, 537986, 534002, 530315, 527101, 524497, 522619, 521324, 520209, 518958, 517543, 516063, 514610, 513317, 512334, 511692, 511248, 510725, 509705, 507760, 504845, 501538, 498596, 496281, 494345, 492617, 491286, 490521, 490114, 489729, 489240, 488638, 487787, 486572, 485248, 484361, 484200, 484447, 484434, 483728, 482412, 480866, 479385, 478064, 476982, 476269, 475916, 475687]
59766D75687l30m25n05q26j318j309k93J218K164K240K206K736L493L728L394
59751D91860L166L572M496N495O183O332N964N423N093M977M800M478M142L755
59737E59736L097K293J850J974K222K117J774J499J187N27m35j421k301k893k645
59722E68581j299K66P02j49r92q14j34q2p90j438j483j163q70o81o01p98j362
59705E56893k035k307j762m50R19J405P13m42j092r91n14J41J140K336K986K481
59689E59421J110j51n64j80M13O71M95J70P3L55P85Q92L91m47j090j480k220l627
59671E55017m960n192m492m046m314m362l462k397k354l142l654l591l538l503
59657E02010k712j125J72N71Q90J963L182L414K726K172K190K240J861J213M90
$$ y = [475687, 475357, 474932, 474427, 473601, 472283, 470974, 470681, 471899, 474063, 476303, 478509, 481245, 484738, 488466, 491860, 495026, 498598, 503094, 508589, 514772, 521104, 527068, 532491, 537584, 542561, 547361, 551839, 555981, 559736, 562833, 565126, 566976, 568950, 571172, 573289, 575063, 576562, 577749, 578276, 577841, 576420, 574119, 571226, 568581, 567282, 567548, 568250, 568101, 567109, 566295, 566161, 566079, 565289, 563851, 562368, 561205, 560335, 559654, 559053, 558255, 556893, 554858, 552551, 550789, 550339, 551258, 552663, 553376, 552934, 551842, 550851, 550337, 550478, 551618, 553954, 556940, 559421, 560531, 560380, 559816, 559636, 560049, 560720, 561215, 561385, 561458, 561813, 562598, 563490, 563881, 563434, 562344, 560864, 558644, 555017, 550057, 544865, 540373, 536327, 532013, 527651, 524189, 521792, 519438, 516296, 512642, 509051, 505513, 502010, 499298, 498173, 498345, 498916, 499806, 501769, 504951, 508365, 511091, 513263, 515453, 517693, 519554, 520767, 521257]
59642E21257l37j070j332j260j424j795j609o65K3l97j198j002K13J107R47M62
59626E11920M47N32J5q43j249j105r76j065j087j022j107j156p26o6J0n17n84
59609E01421L95J556J808J351J172J599K228K796L271L291K479J241M11J31j44
59594E25006n20m94o6o4r39j993k333k041j832j977k200k304k338k245j829j148
59578E00683n32k31k05l40n94q74r43n92P6O28O45J41m37n95j51O94J483J683
59560E00539J143L91J62M60N77K21N0O25J458J708J431J306J485J614J777K490
59544E17437L666M576M949N330O081O856P425Q227R657J1344J2499J2550J1284
59531F21881Q949O423M593L293J478j234l894n418n639m848l128p78J300K400
$$ y = [521257, 520920, 519850, 518518, 517258, 515834, 514039, 512430, 511765, 511788, 511391, 510193, 509191, 509404, 510511, 511458, 511920, 512367, 512899, 512914, 512071, 510822, 509717, 508741, 507676, 506589, 505567, 504460, 503304, 502578, 502512, 502522, 502005, 501421, 501816, 503372, 505180, 506531, 507703, 509302, 511530, 514326, 517597, 520888, 523367, 524608, 525019, 525150, 525006, 524486, 523992, 523926, 523862, 522923, 520930, 518597, 516556, 514724, 512747, 510547, 508243, 505905, 503660, 501831, 500683, 500151, 499920, 499715, 499375, 498781, 497907, 496964, 496372, 496448, 497076, 497721, 497862, 497425, 496830, 496679, 497373, 498856, 500539, 501682, 502073, 502235, 502695, 503272, 503493, 503543, 504168, 505626, 507334, 508765, 510071, 511556, 513170, 514947, 517437, 521103, 525679, 530628, 535958, 542039, 548895, 556320, 564547, 574204, 585548, 598047, 610597, 621881, 630830, 637253, 641846, 645139, 646617, 645383, 641489, 636071, 630432, 625584, 622456, 621678, 622978, 625378]
59517F25378K738K774K374J288j62j537k999m732o162o645o578o927p826q491
59503E82493q465q108p803p398o602n468m338l622l501l556k970j518n4N41N34
59488E20165Q38J616K187K224K173K429K763K827K659K618L099M367O195P810
59474E63970Q614Q806Q834Q502P384N945N304N644N726M351J839l72j187o23N30
59459F33267J522K210K980M068N164N954O740Q013R581J0702J1020J0774J0178
59446G22173R201Q006O847N532L573J031j487l764o193q828j0937j1908j2005
59433G01241j1817j1499j0957j0355r906r393q293o254l390l25K129L728N172
59420F30081P190R361J0644J1122J2151J4412J6855J8357J9391K1013K2818K3077
$$ y = [625378, 628116, 630890, 633264, 634552, 634390, 632853, 629854, 625122, 618960, 612315, 605737, 598810, 590984, 582493, 574028, 565920, 558117, 550719, 544117, 538649, 534311, 530689, 527188, 523632, 520662, 519144, 519090, 519631, 520165, 521003, 522619, 524806, 527030, 529203, 531632, 534395, 537222, 539881, 542499, 545598, 549965, 556160, 563970, 572584, 581390, 590224, 598726, 606110, 612055, 617359, 623003, 628729, 633080, 634919, 634547, 633360, 632737, 633267, 634789, 636999, 639979, 644047, 649211, 655165, 661905, 669918, 679499, 690201, 701221, 711995, 722173, 731374, 739380, 746227, 751759, 755332, 756363, 754876, 751112, 744919, 736091, 725154, 713246, 701241, 689424, 677925, 666968, 656613, 646707, 637314, 629021, 622767, 619377, 619052, 621181, 624909, 630081, 637271, 646632, 657276, 668398, 680549, 694961, 711816, 730173, 749564, 770577, 793395, 816472]
59408H16472K0731J6256J0747N194N20k767n313q391j2056j4482j3767j0169o138
59395G96837m202m983p022q337q317q324j0205j4138j8254k0516k0601j9558j8096
59382F34284j5933j2803r318o377m234k599j381p22m54o4O58J439K081K711L292
59367E90580L473L267L342M110M927M868M066L607M163N304O206O491O294O032
59353F56730O258P297Q879J0394J1554J2468J3140J3422J3447J3591J3952J4387
59341G95519J4942J5587J5538J3736J0362O989M682K721j52l860p256r774j1847
59328H47187j3792j5215j5732j5613j5415j5342j5182j4576j3282j1382r405q017
59316F84234p445p297o954o081m790l506k559j875j019K80J746K778L100L107
$$ y = [816472, 837203, 853459, 864206, 869400, 869920, 867153, 861840, 853449, 841393, 826911, 813144, 802975, 796837, 792635, 787652, 780630, 772293, 763976, 755652, 745447, 731309, 713055, 692539, 671938, 652380, 634284, 618351, 605548, 596230, 589853, 585619, 583020, 581639, 580917, 580463, 580399, 581057, 582496, 584577, 587288, 590580, 594053, 597320, 600662, 604772, 609699, 614567, 618633, 622240, 626403, 631707, 637913, 644404, 650698, 656730, 662988, 670285, 679164, 689558, 701112, 713580, 726720, 740142, 753589, 767180, 781132, 795519, 810461, 826048, 841586, 855322, 865684, 872673, 877355, 880076, 879924, 876064, 868808, 859034, 847187, 833395, 818180, 802448, 786835, 771420, 756078, 740896, 726320, 713038, 701656, 692251, 684234, 676789, 669492, 662538, 656457, 651667, 648161, 645602, 643727, 642708, 642988, 644734, 647512, 650612, 653719]
59302F53719L519M619N813O137N293L917K636J188r97l693o058p866r636j1394
59288F47197j2254j1657j0266q980p755o150m382l011j919o02Q26J783K328L177
59274E88335M531N800O653P570Q953J0339J1006J0917J0594J0360J0073R514Q683
59261G03328P630O198M052J111k043m498n970p103q468r623r774r118q672q739
59247F48311q466p183n392l886k588r34J025K615L442L667L545L308L404M167
59233F45035N221N730N395M748M277L818L016K041J287O27n15k312m144n255n590
59218F63379n757o199o687o691o112n408m999m777m361l630k852k285j988j928
59204E99705k102k445k857l397m206n080n383m710l430k336j775j464j125r31
$$ y = [653719, 657238, 661857, 667670, 673807, 679100, 683017, 685653, 686841, 685844, 682151, 676093, 668227, 658591, 647197, 634943, 623286, 613020, 604040, 596285, 590135, 585753, 582742, 580823, 580221, 581047, 582830, 585158, 588335, 592866, 598666, 605319, 612889, 621842, 632181, 643187, 654104, 664698, 675058, 685131, 694645, 703328, 710958, 717156, 721208, 722319, 720276, 715778, 709808, 702705, 694237, 684614, 674840, 665722, 657050, 648311, 639845, 632662, 627270, 623384, 620796, 619862, 620887, 623502, 626944, 630611, 634156, 637464, 640868, 645035, 650256, 655986, 661381, 666129, 670406, 674224, 677240, 679281, 680568, 681195, 680680, 678368, 674224, 668969, 663379, 657622, 651423, 644736, 638045, 631933, 626525, 621526, 616749, 612388, 608758, 605906, 603621, 601633, 599705, 597603, 595158, 592301, 588904, 584698, 579618, 574235, 569525, 566095, 563759, 561984, 560520, 559395, 558464]
59190E58464j152j626j857j539q52j99J94M36P45J127J394J507J724K235K817
59175E63418L150L360L900M851N776O377O934P778Q679R142R138R182R621J0172
59161F61478J0216R473Q256P116O227N245L777J864k34k501n033p546r450j0525
59147F78363j1049j1193j0827j0082r511r362r249q918q727q871q692p569o007
59134E58306n083m964m822m136l330l007l178l371l089k092n95Q16J812K713L901
59119E29881N125N860O140O412O746O874O795O736O629O346O302O977P940Q166
59105F22929P425O493N955N511M674L379J825L61m02k10J96r4p27n82K81M65o42
59088F56837j964k462k516k773k840k141j265j315k462l998n291o010n967n526
$$ y = [558464, 557312, 555686, 553829, 552290, 551438, 551239, 551433, 551869, 552614, 553741, 555135, 556642, 558366, 560601, 563418, 566568, 569928, 573828, 578679, 584455, 590832, 597766, 605544, 614223, 623365, 632503, 641685, 651306, 661478, 671694, 681167, 689423, 696539, 702766, 708011, 711788, 713652, 713418, 710917, 705884, 698338, 688888, 678363, 667314, 656121, 645294, 635212, 625701, 616339, 607090, 598172, 589445, 580574, 571882, 564313, 558306, 553223, 548259, 543437, 539301, 535971, 532964, 529786, 526415, 523326, 521234, 520639, 521455, 523267, 525980, 529881, 535006, 540866, 547006, 553418, 560164, 567038, 573833, 580569, 587198, 593544, 599846, 606823, 614763, 622929, 630354, 636847, 642802, 648313, 652987, 656366, 658191, 658552, 658150, 657940, 658136, 658042, 657315, 656733, 657014, 657479, 656837, 654873, 652411, 649895, 647122, 644282, 642141, 640876, 639561, 637099, 633101, 627810, 621800, 615833, 610307]
59074F10307n525o156o553o237o064o806p596p019n173l416k485k046j786j694
59060E41751j399m72O13Q20o2j221j975k251k036j378q80j198j966k151j549r94
59044E23652r94j148j070r47q59m78J75N07K64p4j24q8k0N44J708K674K792K577
59026E29091L041M321N711O757P728Q943J0141J0694J0287R396Q956R402R994
59013F34462R397P106L959J218n24j407j714j620j334j106j034r34m22Q28K761
58998F49636M816O289O906O983P050P389P894Q268Q342Q184P854P145N802L980
58984G46538K118L83j314k718l222k779k249k309k532k032o49J146L075N148P166
58969G45770Q788R994J0943J1616J2115J2948J4384J5715J5877J4696J2914J1145
$$ y = [610307, 604782, 598626, 592073, 585836, 579772, 572966, 565370, 558351, 553178, 549762, 547277, 545231, 543445, 541751, 540352, 539880, 540493, 541313, 541251, 540030, 538055, 535804, 533768, 532390, 531510, 530312, 528346, 526195, 524646, 523652, 522658, 521510, 520440, 519493, 518634, 518156, 518331, 518838, 519102, 519028, 518904, 518816, 518796, 519340, 521048, 523722, 526514, 529091, 532132, 536453, 542164, 548921, 556649, 565592, 575733, 586427, 596714, 606110, 615066, 624468, 634462, 643859, 650965, 654924, 656142, 655618, 654211, 652497, 650877, 649543, 648437, 647403, 646469, 646047, 646875, 649636, 654452, 660741, 667647, 674630, 681680, 689069, 696963, 705231, 713573, 721757, 729611, 736756, 742558, 746538, 748656, 749039, 747725, 745007, 741785, 739006, 736757, 734448, 731916, 729884, 729235, 730381, 733456, 738604, 745770, 754558, 764552, 775495, 787111, 799226, 812174, 826558, 842273, 858150, 872846, 885760, 896905]
58957H96905R433P642N617L057j43l531o616r448j2142j4278j5533j6494j7801
58944H26668j8894j8720j7509j6523j6087j5200j3329j1264r791q664p450o361
58932F66876n557m537k907j150k6K72k0o38j150j124p34o45r58j033o18l18m53
58915F45280l87L87J267J423J022Q60J264K026K916L721M201M570N535P302R104
58900F90491J0293J1294J2772J4481J5706J6448J7194J7878J8027J7846J8208
58889H60638J9546K1456K3396K5112K6324K6640K6053K5043K3969K2650K0654
58878A121481J7693J3731Q905L545j915p052j1513j5158j8185k0872k3067k4307
58866A043286k4560k4458k4388k3885k2295j9815j7303j5274j3652j2423j1882
$$ y = [896905, 906338, 913980, 919597, 922654, 922511, 918980, 912364, 902916, 890774, 876496, 860963, 844469, 826668, 807774, 789054, 771545, 755022, 738935, 723735, 710406, 699142, 689351, 680687, 673237, 666876, 661319, 656782, 653875, 652725, 652699, 652971, 652951, 652313, 651163, 650039, 649305, 648660, 647702, 646669, 646051, 645733, 645280, 644893, 645280, 646547, 647970, 648992, 649852, 651116, 653142, 656058, 659779, 663980, 668550, 674085, 681387, 690491, 700784, 712078, 724850, 739331, 755037, 771485, 788679, 806557, 824584, 842430, 860638, 880184, 901640, 925036, 950148, 976472, 1003112, 1029165, 1054208, 1078177, 1100827, 1121481, 1139174, 1152905, 1161810, 1165355, 1163440, 1156388, 1144875, 1129717, 1111532, 1090660, 1067593, 1043286, 1018726, 994268, 969880, 945995, 923700, 903885, 886582, 871308, 857656, 845233, 833351]
58855H33351j2056j2376j2228j1652j1216j1221j1264j0704r471q246p701p763
58843G07453p858p668p319o946o519o133o022o200o424o546o628o631o411n989
58829F14159n502m857l918k986k504k293j695o33K14N45J047K379M097N135N037
58814F08225M311L808M043M841N447N173M202L357L039K834K289J549Q74R8j077
58799F53013k597m110n198n444m810m017l997m756n381n390n271n417n402m773
58785E86450l832k990k094j066m72n74m69Q45K875M133L987L125K237J172l81
58770E92946k122l440m028l975l457k621j731j255j616k653l486l330k327j234
58756E55671l79M56J208J494J535K153L407M199L853L259L595M586M991M346L402
$$ y = [833351, 821295, 808919, 796691, 785039, 773823, 762602, 751338, 740634, 731163, 722917, 715216, 707453, 699595, 691927, 684608, 677662, 671143, 665010, 658988, 652788, 646364, 639818, 633190, 626559, 620148, 614159, 608657, 603800, 599882, 596896, 594392, 592099, 590404, 589771, 589985, 590530, 591577, 593956, 598053, 603188, 608225, 612536, 616344, 620387, 625228, 630675, 635848, 640050, 643407, 646446, 649280, 651569, 653118, 653992, 654090, 653013, 650416, 646306, 641108, 635664, 630854, 626837, 622840, 618084, 612703, 607313, 602042, 596625, 591223, 586450, 582618, 579628, 577534, 576468, 575996, 575422, 574953, 575798, 578673, 582806, 586793, 589918, 592155, 593327, 592946, 590824, 587384, 583356, 579381, 575924, 573303, 571572, 570317, 568701, 566048, 562562, 559232, 556905, 555671, 555292, 555748, 556956, 558450, 559985, 562138, 565545, 569744, 573597, 576856, 580451, 585037, 590028, 594374, 597776]
58741E97776L012L393M337N410O052O012N677N562N660N630N410N222N268N663
58727F70084O340O764O263N006M098M187M654M709M624N108N958O327O064N923
58713G46109O513P708Q937R541R010P429N613M288L274J866k78k940n804q633
58699G92633j1259j3690j5932j7554j8018j7642j7496j7901j7946j7023j5840
58688F12332j5089j4083j1895r101p124o284n767n205m968n058m937m484m064
58675E14273l600k593j151m0M26P27J249J861K496L418M752O315P975R592J0615
58660E56315J0349Q791O730M984L842L130K376J084p06k323l262l733m069m176
58646E79332m035m123m595m688l800k552j934j840j510q91m80j61O22J783K760
$$ y = [597776, 600788, 604181, 608518, 613928, 619980, 625992, 631669, 637231, 642891, 648521, 653931, 659153, 664421, 670084, 676424, 683188, 689451, 694457, 698555, 702742, 707396, 712105, 716729, 721837, 727795, 734122, 740186, 746109, 752622, 760330, 769267, 778808, 787818, 795247, 800860, 805148, 808422, 810288, 810010, 807070, 801266, 792633, 781374, 767684, 751752, 734198, 716180, 698538, 681042, 663141, 645195, 628172, 612332, 597243, 583160, 571265, 562164, 555040, 548756, 542989, 537784, 532816, 527758, 522821, 518337, 514273, 510673, 508080, 506929, 506889, 507315, 508042, 509291, 511152, 513648, 517066, 521818, 528133, 536108, 545700, 556315, 566664, 575455, 582185, 587169, 591011, 594141, 596517, 597601, 596895, 594572, 591310, 587577, 583508, 579332, 575297, 571174, 566579, 561891, 558091, 555539, 553605, 551765, 550255, 549364, 548884, 548723, 549345, 551128, 553888]
58631E53888L548M486N247N205M632M337M225L486K204J520J970K835L353L549
58617F04485L629L602L773M681O161P278P458P014O379N622M843M293L851L023
58603F76092J561l98k687m959o443o706o448o638p059o741n659m784m475l987
58589F10669k840j462k56J043K689M508O367Q303J0007J0987J1282J1276J0872
58576F83445R802Q620Q232Q458Q313P786P981R232J0462J0941J1435J2868J4941
58563H12516J6807J8308J9798K1352K2739K3671K3724K2493K0118J7132J3705
58552A032363R696N457J810r63l329n603p582r105j0173j0486r799q806q649r466
58538I65365j0402j1161j2437j4453j6286j7052j6893j6377j5688j4787j3610
$$ y = [553888, 557436, 561922, 567169, 572374, 577006, 581343, 585568, 589054, 591258, 592778, 594748, 597583, 600936, 604485, 608114, 611716, 615489, 620170, 626331, 633609, 641067, 648081, 654460, 660082, 664925, 669218, 673069, 676092, 677653, 677255, 674568, 669609, 663166, 656460, 650012, 643374, 636315, 629574, 623915, 619131, 614656, 610669, 607829, 606367, 606111, 607154, 609843, 614351, 620718, 629021, 639028, 650015, 661297, 672573, 683445, 693247, 701867, 710099, 718557, 726870, 734656, 742637, 751869, 762331, 773272, 784707, 797575, 812516, 829323, 847631, 867429, 888781, 911520, 935191, 958915, 981408, 1001526, 1018658, 1032363, 1042059, 1047516, 1049326, 1048363, 1045034, 1039431, 1031849, 1022744, 1012571, 1002085, 992286, 983480, 974831, 965365, 954963, 943802, 931365, 916912, 900626, 883574, 866681, 850304, 834616, 819829, 806219]
58527H06219j1851r257o306l841j983k50J301K100K206K330K550K078O27j019
58513G84904k042k322k049j530j465k402l841m803n184n523n676n071m087l725
58499G35184l932l801l367l526m115l965l056k702l133k886j341J02L19J85Q98
58484G00864K123K972L484M117M853N734P202R146J0707J1637J2652J3792J3841
58471H03124J2074R251O213K938l69k793m192n643p523q621q054o580n106l412
58457G81307j351L58J559L339O027Q088Q286P502P048O629N415L762K311N97j904
58442H38973m433o024o956p858q389q066p329o544n013k320M14J924K477L038
58428G83894L775M540N675P169Q091Q021P872Q322Q655Q197P417O573M895K311
$$ y = [806219, 794368, 785111, 778805, 774964, 772981, 772731, 774032, 776132, 778338, 780668, 783218, 785296, 785923, 784904, 782862, 780540, 778491, 776961, 775496, 773094, 769253, 764450, 759266, 753743, 748067, 742996, 738909, 735184, 731252, 727451, 724084, 720558, 716443, 712478, 709422, 706720, 703587, 700701, 699360, 699462, 699781, 699966, 700864, 702987, 705959, 709443, 713560, 718413, 724147, 731349, 740495, 751202, 762839, 775491, 789283, 803124, 815198, 824449, 830662, 833600, 833231, 830438, 826246, 820603, 813080, 804459, 796405, 789825, 784719, 781307, 779956, 780314, 781873, 785212, 791239, 799327, 807613, 815115, 822163, 828792, 834207, 837969, 840280, 840877, 838973, 834540, 828516, 821560, 813702, 805313, 797247, 789918, 783374, 778361, 776041, 776455, 778379, 780856, 783894, 787669, 792209, 797884, 805053, 813144, 821165, 829037, 837359, 846014, 854211, 861628, 868201, 873096, 875407]
58414H75407L19l68j235l476n861o883p302q467r758r875r246q944q508p064n436
58399G83303m814m483l205j724j457j668o11J302K133J697J610K294K490J714
58385G78581Q77L84l74j442j998j855j742k044k492k887k997k197l87J377K398
58370G63202L590N917Q554J0173J0930J1557J1626J0672R964J1008J3084J4335
58358H84612J4491J4543J4490J3604J2210J1121R895P762N496M350L814K526P65
58345I99679j38q3J67Q78K670M667N587N991P252R033J0050J0568J1743J3232
58331A081296J3855J3931J4543J5162J4493J3067J2436J2455J1810J0515R487
58320A223050Q372O461M822M800N288M402K982L311N118O134O117O888Q746J0120
$$ y = [875407, 875726, 875358, 874123, 870647, 864786, 857903, 850601, 842134, 832376, 822501, 813255, 804311, 795803, 788739, 783303, 778489, 774006, 770801, 769077, 767620, 765952, 765341, 766643, 768776, 770473, 772083, 774377, 776867, 778581, 779458, 779842, 779468, 778026, 776028, 774173, 772431, 770387, 767895, 765008, 762011, 759814, 759427, 760804, 763202, 766792, 772709, 781263, 791436, 802366, 813923, 825549, 836221, 846185, 857193, 870277, 884612, 899103, 913646, 928136, 941740, 953950, 965071, 974966, 982728, 988224, 992574, 996388, 998914, 999679, 999541, 999458, 999625, 1000503, 1003173, 1007840, 1013427, 1019418, 1026670, 1035703, 1045753, 1056321, 1068064, 1081296, 1095151, 1109082, 1123625, 1138787, 1153280, 1166347, 1178783, 1191238, 1203048, 1213563, 1223050, 1231422, 1237883, 1242705, 1247505, 1252793, 1257195, 1260177, 1263488, 1268606, 1274740, 1280857, 1287745, 1296491, 1306611]
58306A306611J0704J1696J3081J3703J3860J4818J6051J6047J5436J6070J7432
58295A465509J7410J6348J6602J8262J9005J8332J8262J9513K0603K1068K2135
58284A673049K3859K4897K5372K6684K8481K9129K9116L0366L2357L2723L1712
58273A987745L1996L3987L5433L5893L7366M0108M2064M3007M5030M8327N0645
58262B431601N1563N3174N5875N7744N8646O0702O4013O6257O7117O8744P1309
58251C106745P2684P3000P4827P8276Q0858Q2692Q6717R3083R8676J02959J08797
58240D059314J16725J24022J30370J38598J48801J57835J65635J75822J88875
58231E405997K01286K12733K27193K45534K64122K82406L04364L30689L57349
$$ y = [1306611, 1317315, 1329011, 1342092, 1355795, 1369655, 1384473, 1400524, 1416571, 1432007, 1448077, 1465509, 1482919, 1499267, 1515869, 1534131, 1553136, 1571468, 1589730, 1609243, 1629846, 1650914, 1673049, 1696908, 1721805, 1747177, 1773861, 1802342, 1831471, 1860587, 1890953, 1923310, 1956033, 1987745, 2019741, 2053728, 2089161, 2125054, 2162420, 2202528, 2244592, 2287599, 2332629, 2380956, 2431601, 2483164, 2536338, 2592213, 2649957, 2708603, 2769305, 2833318, 2899575, 2966692, 3035436, 3106745, 3179429, 3252429, 3327256, 3405532, 3486390, 3569082, 3655799, 3748882, 3847558, 3950517, 4059314, 4176039, 4300061, 4430431, 4569029, 4717830, 4875665, 5041300, 5217122, 5405997, 5607283, 5820016, 6047209, 6292743, 6556865, 6839271, 7143635, 7474324, 7831673]
58222G831673L83969M15544M53563M93965N36381N86543O46697P13014P85640
58213A2846989Q71609R74444J091396J224812J385491J580914J812364K088649
58205B3876668K429824K852034L362250L972986M705268N569507O562057P690180
58197F1020774Q979217J0442398J2067626J3849676J5804890J7928926K0173919
58190A60267426K2492276K4814938K6839948K7829190K6812847K3248992J7579839
58183C29885456J1044883M795508q93136o556334j2701179j9039198k4524208
58176B82011792k8091826k9345470k8621316k6570036k3775793k0672229j7599040
58169A07336082j4798456j2376599j0334257q641261p264037o150506n237895
$$ y = [7831673, 8215642, 8631186, 9084749, 9578714, 10115095, 10701638, 11348335, 12061349, 12846989, 13718598, 14693042, 15784438, 17009250, 18394741, 19975655, 21788019, 23876668, 26306492, 29158526, 32520776, 36493762, 41199030, 46768537, 53330594, 61020774, 69999991, 80442389, 92510015, 106359691, 122164581, 140093507, 160267426, 182759702, 207574640, 234414588, 262243778, 289056625, 312305617, 329885456, 340930339, 345725847, 344832711, 338276377, 325575198, 306536000, 282011792, 253919966, 224574496, 195953180, 169383144, 145607351, 124935122, 107336082, 92537626, 80161027, 69826770, 61185509, 53921472, 47770966, 42533071]
58162D2533071m482693l862223l350999k918316k547241k234992j973957j749083
58154A9413567j553265j388532j251029j129425j018996r23620q42680p68559
58146A0537461o98400o36362n82654n31384m81079m36984m00957l68519l37634
58137F063488l11271k89635k68595k47654k31043k19062k06388j90956j76740
58128C922144j65780j54936j42732j32203j24624j17039j08347j01435r7098r1979
58118B685971q4837p8919p5882p3087o9090o6199o5269o3389n9200n5502n4078
58107A940519n2705m9632m6488m4538m2440l9840l8841l9820l9917l7774l5597
58096A472927l4696l3197l0249k8212k8360k8382k6512k4394k3581k2793k1017
$$ y = [42533071, 38050378, 34188155, 30837156, 27918840, 25371599, 23136607, 21162650, 19413567, 17860302, 16471770, 15220741, 14091316, 13072320, 12148700, 11306020, 10537461, 9839061, 9202699, 8620045, 8088661, 7607582, 7170598, 6769641, 6401122, 6063488, 5752217, 5462582, 5193987, 4946333, 4715290, 4496228, 4289840, 4098884, 3922144, 3756364, 3601428, 3458696, 3326493, 3201869, 3084830, 2976483, 2875048, 2777950, 2685971, 2601134, 2522215, 2446333, 2373246, 2304156, 2237957, 2172688, 2109299, 2050099, 1994597, 1940519, 1887814, 1838182, 1791694, 1747156, 1704716, 1664876, 1626035, 1586215, 1546298, 1508524, 1472927, 1438231, 1405034, 1374785, 1346573, 1318213, 1289831, 1263319, 1238925, 1215344, 1192551, 1171534]
58085A171534j9836k0315k0811k0105j9560k0018j9767j7802j6051j6092j6600
58074I64577j6180j5860j6551j6825j5531j4020j3590j3205j1849j0709j0815
58063H09442j0917r811q583q411q369p446o693p202p902p389o319o042o480o975
58049G00903p646q399q222o924n875n741n323l868k612k673l415m212n717p894
58035F22382q948p923o486o389p040p215p300q058q821q769q544q938r355q978
58021E09618q170p437o497n456n236n732n436m040l293l973m266k903j517j926
58007D43736l074l025k138j865j952j317m86o57j315j088k20p3p26j092q83p13
57991D23112o42l23o2l53p89p66o51j009j373j043m79n45j043j203j029j037j221
$$ y = [1171534, 1151698, 1131383, 1110572, 1090467, 1070907, 1050889, 1031122, 1013320, 997269, 981177, 964577, 948397, 932537, 915986, 899161, 883630, 869610, 856020, 842815, 830966, 820257, 809442, 798525, 788714, 780131, 771720, 763351, 755905, 749212, 742010, 734108, 726719, 720400, 714358, 707878, 700903, 693257, 684858, 676636, 669712, 663837, 658096, 652773, 648905, 646293, 643620, 640205, 635993, 630276, 622382, 613434, 605511, 599025, 592636, 585596, 578381, 571081, 563023, 554202, 545433, 536889, 527951, 518596, 509618, 501448, 494011, 487514, 482058, 476822, 471090, 465654, 461614, 458321, 454348, 450082, 447179, 445662, 443736, 440662, 437637, 435499, 433634, 431682, 430365, 429879, 429222, 427907, 426819, 426599, 426526, 425800, 424708, 423825, 423112, 422470, 422147, 422085, 421732, 420943, 420177, 419526, 418517, 417144, 416101, 415622, 415077, 414034, 412831, 411802, 410765, 409544]
57974D09544j319j430j521j156n20o46j679k133j014M99P37j84j100j608j789
57959C94681j231J10J035O08k98m01m1l12j008j144q64j067j639j627q78n8O75
57942C86541J679K724L121K943L023L868N249O617P306O828N653N056N568O278
57928D52454O240N634M870L752K372J661J921J933P21r06j753k124k922l970m717
57913D65166n557o888p749p135n845n367n599n451n030n314o065o075n307m982
57899C82802n388n332m058k335j293j274k015k948l197k174m17R00J258J072R41
57884C56542J229K056L024L325K740K058J839J554O69k28l45RR0o8j14m14j360
57867C72606k378k748k779k990k978k362k028k880l987l697k122q99q05j155j348
$$ y = [409544, 408225, 406795, 405274, 404118, 403598, 402952, 401273, 399140, 398126, 398625, 399362, 399178, 398078, 396470, 394681, 393450, 393560, 394595, 395203, 394905, 394504, 394463, 394151, 393143, 391999, 391135, 390068, 388429, 386802, 385924, 385866, 386541, 388220, 390944, 394065, 397008, 400031, 403899, 409148, 415765, 423071, 429899, 435552, 440608, 446176, 452454, 458694, 464328, 469198, 472950, 475322, 476983, 478904, 480837, 481558, 480652, 478899, 476775, 473853, 469883, 465166, 459609, 452721, 444972, 437837, 431992, 426625, 421026, 415575, 410545, 405231, 399166, 393091, 387784, 382802, 377414, 372082, 368024, 365689, 364396, 363122, 361107, 358159, 354962, 352788, 352371, 353271, 354529, 355601, 356542, 357771, 359827, 362851, 366176, 368916, 370974, 372813, 374367, 375036, 374808, 374463, 374472, 374562, 374494, 374380, 373966, 372606, 370228, 367480, 364701, 361711, 358733, 356371, 354343, 351463, 347476, 343779, 341657, 340758, 339953, 338798, 337450]
57852C37450j368r50J30J054P63k16k81Q62J795J524N86k57j059k026k836l095
57836C32076k763k057j506j868l169m139l668k365j580j318n61O69J240Q55N15
57821C10361P81J124J291J884L019L698L153J900R02M32K30L1l53r82j536j655
57805C24280j537j698k199k715l092l179k528j112P4J60k24P8Q17P24k99r13l77
57788C06260N01Q06O59N32M42K56M5j45k73r3L99N42m4m61L59J835K378J733J234
57769C16965J642K226K266K033J810J201pj307k222k728k698j969j107j058j764
57754C13283k213k013j753j624j051J1P75J081J723K831L275K408J186O82O56
57739C19257M04l4m13j042k117l075l426l490l578l256k247j306j308k017k545
$$ y = [337450, 336082, 335132, 335262, 336316, 337079, 336863, 336582, 337444, 339239, 340763, 341349, 341092, 340033, 338007, 335171, 332076, 329313, 327256, 325750, 323882, 320713, 316574, 312906, 310541, 308961, 307643, 307082, 307751, 308991, 309846, 310361, 311142, 312266, 313557, 315441, 318460, 322158, 325311, 327211, 328113, 328545, 328775, 328806, 328453, 327471, 325935, 324280, 322743, 321045, 318846, 316131, 313039, 309860, 307332, 306220, 306294, 306454, 306230, 306308, 307125, 307849, 307550, 306637, 306260, 306761, 307567, 308226, 308758, 309200, 309456, 309501, 309356, 309083, 308990, 309389, 309931, 309887, 309426, 309785, 311620, 313998, 315731, 316965, 318607, 320833, 323099, 325132, 326942, 328143, 328136, 326829, 324607, 321879, 319181, 317212, 316105, 315047, 313283, 311070, 309057, 307304, 305680, 304629, 304640, 305415, 306496, 308219, 311050, 314325, 316733, 317919, 318601, 319257, 319661, 319627, 319214, 318172, 316055, 312980, 309554, 306064, 302486, 299230, 296983, 295677, 294369, 292352, 289807]
57724B89807k492k033j492j381k153l314l560k460j240j126j739k039k050k525
57710B60203l388l764l359k758k404k159j918j847j919j845j578j422j525j643
57696B28674j503j078m61K67R20J169P37k34j110j198m65M06R27J420K348L410
57680B34229M012M412N538P681J0188J2567J5084J8049K1233K4298K7252L0171
57668D14714L3042L5847L8139L8450L5055K7769J8376Q905n0r098j8749k8554
57656E93846l6995m2099m2789l9860l5193l0065k4870k0119j6558j4152j2092
57645B79054j0068q548p609o597n320m376l907l236k186j520j458j039K08J211
57631B24609J067N60Q10J392J205L76j02j29m53j167j601j544j447j438j210q67
$$ y = [289807, 287315, 285282, 283790, 282409, 280256, 276942, 273382, 270922, 269682, 268556, 266817, 264778, 262728, 260203, 256815, 253051, 249692, 246934, 244530, 242371, 240453, 238606, 236687, 234842, 233264, 231842, 230317, 228674, 227171, 226093, 225632, 225899, 226819, 227988, 228725, 228491, 227381, 226183, 225718, 226124, 227051, 228471, 230819, 234229, 238241, 242653, 248191, 255872, 266060, 278627, 293711, 311760, 332993, 357291, 384543, 414714, 447756, 483603, 521742, 560192, 595247, 623016, 641392, 650297, 650247, 641149, 622400, 593846, 556851, 514752, 471963, 432103, 396910, 366845, 341975, 321856, 305298, 291146, 279054, 268986, 260438, 252829, 246232, 240912, 236536, 232629, 229393, 227207, 225687, 224229, 223190, 223398, 224609, 225676, 226236, 227046, 228438, 229643, 230019, 229917, 229788, 229335, 228168, 226567, 225023, 223576, 222138, 220928, 220061]
57615B20061r21j386j671j484j143j004j126j466j829j785j199o52p01r63o62
57600B02069J11M93J40m16p76j224k010k760k921k451j782j338j265j404j459
57585A83007j332j247j444j826k104k117j885j472j038q58j056j447j741j757
57571A61683j365o23jq9p97j282r47j30M33M65J65k27m47k14M21R50J004P86P00
57552A60485Q63J287K015K741K733J624Q2p98n91J88O40J80j030k041j945q56
57536A65577K70R41J547K300K566J804N03m70r08j066r09k77N49J069J144Q61
57520A75501J88o74j011l17R30J755J759J265P41M94O98J162J365J109Q23Q15
57504A86603O96Q5o34r18r87j375j931k082j822j682j754j612j197j012j325j747
$$ y = [220061, 219140, 217754, 216083, 214599, 213456, 212452, 211326, 209860, 208031, 206246, 205047, 204395, 203694, 202731, 202069, 202180, 202673, 202813, 202397, 201621, 200397, 198387, 195627, 192706, 190255, 188473, 187135, 185870, 184466, 183007, 181675, 180428, 178984, 177158, 175054, 172937, 171052, 169580, 168542, 167684, 166628, 165181, 163440, 161683, 160318, 159695, 159694, 159605, 158808, 157526, 156579, 156449, 156882, 157347, 157512, 157285, 156838, 156624, 157045, 157995, 158999, 159785, 160485, 161348, 162635, 164650, 167391, 170124, 171748, 171830, 171032, 170441, 170629, 171269, 171449, 170419, 168378, 166433, 165577, 165847, 166788, 168335, 170635, 173201, 175005, 175508, 175038, 174130, 173064, 172155, 171878, 172427, 173496, 174640, 175501, 175689, 175015, 174004, 173687, 174617, 176372, 178131, 179396, 180137, 180631, 181329, 182491, 183856, 184965, 185788, 186603, 187299, 187384, 186750, 185832, 184845, 183470, 181539, 179457, 177635, 175953, 174199, 172587, 171390, 170378, 169053, 167306]
57488A67306j811j490j000m99j22j9k22n83q77q85m80K54J039J612J755J224n
57471A65197j407k248k348k139j949j747j552j460j201m53K97J27r07j654j486
57456A45070j013p59l19N38J077P76L15L75M69L1k83L75J392J564J005Q64J427
57439A52904J866J672J107L74m82j005p25o2J53j38m24o53r99r67m8R96Q75k75
57421A54169r97o42PL00M73N90J34p84j126m27M40O27N21Q76J605K083K055J634
57403A61538R16J31k60n3M25P76R24R52R70J178J582J688J117M03M34J141J621
57386A75483J589J647J962J782P79r8J92J418K546L001K903K466J729P15m86j506
57370A96122j653n53J044J723R66k85r14q35o38o16o55o56o50o34n60l87r1K10
$$ y = [167306, 165495, 164005, 163005, 162506, 162384, 162365, 162143, 161560, 160683, 159798, 159318, 159572, 160611, 162223, 163978, 165202, 165197, 163790, 161542, 159194, 157055, 155106, 153359, 151807, 150347, 149146, 148693, 148990, 149117, 148210, 146556, 145070, 144057, 143298, 142979, 143517, 144594, 145370, 145685, 146060, 146529, 146560, 146277, 146652, 148044, 149608, 150613, 151477, 152904, 154770, 156442, 157549, 157923, 157441, 156436, 155711, 155649, 155802, 155664, 155240, 154587, 153588, 152621, 152573, 153569, 154444, 154169, 153172, 152530, 152537, 152837, 153310, 153900, 154034, 153250, 152124, 151697, 152137, 152764, 153285, 154161, 155766, 157849, 159904, 161538, 162454, 162585, 162325, 162272, 162697, 163473, 164397, 165349, 166319, 167497, 169079, 170767, 171884, 172287, 172721, 173862, 175483, 177072, 178719, 180681, 182463, 183242, 183144, 183336, 184754, 187300, 190301, 193204, 195670, 197399, 198114, 197628, 196122, 194469, 193916, 194960, 196683, 197649, 197364, 196450, 195615, 194977, 194361, 193706, 193050, 192400, 191766, 191206, 190819, 190728, 190938]
57352A90938K63K13P38K138L497L599K554J680J673J883J540Q04J91k17n12n83
57336B10399m02k20j37N2L86O61R05J325J623J167J7r37j112q06m12M0L66J27
57318B13042n16o92r0N30N34L28M66O80N33L17M66P24O73N91R07J214P46l72j123
57299B18958q27K30J302J894J929J646J336J048O93M19M88P93R19Q46R51J203
57283B33828J065M43K2K30N94N67L19J76n5n31p94m33J68M04L21L02L82N29J087
57264B38624K189L142L279L045L363M177M448L703K752K725L850N228N585M428
57250B90538K699J984K765L902M232M070M428N406O230O534O570O370N714M958
57236C56400M868N422N677N158M634N091O468P904Q795R136R102Q787Q341Q048
$$ y = [190938, 191201, 191414, 192152, 194290, 197787, 201386, 203940, 205620, 207293, 209176, 210716, 211520, 211711, 211494, 210982, 210399, 209997, 209777, 209640, 209692, 210078, 210739, 211644, 212969, 214592, 215759, 215776, 214839, 213727, 212921, 212509, 212549, 212915, 213042, 212526, 211834, 211744, 212274, 212808, 213136, 213602, 214282, 214815, 215132, 215598, 216322, 216995, 217586, 218493, 219707, 220453, 220081, 218958, 218131, 218361, 219663, 221557, 223486, 225132, 226468, 227516, 228209, 228628, 229116, 229909, 230828, 231674, 232625, 233828, 234893, 235336, 235358, 235588, 236182, 236749, 237068, 237244, 237189, 236658, 235864, 235431, 235599, 236003, 236324, 236626, 237008, 237537, 238624, 240813, 243955, 247234, 250279, 253642, 257819, 262267, 265970, 268722, 271447, 275297, 280525, 286110, 290538, 293237, 295221, 297986, 301888, 306120, 310190, 314618, 320024, 326254, 332788, 339358, 345728, 351442, 356400, 361268, 366690, 372367, 377525, 382159, 387250, 393718, 401622, 410417, 419553, 428655, 437442, 445783, 453831]
57222D53831Q181Q752R430R704R346Q727Q548R189J0387J1636J2782J4049J5469
57209E90031J6430J6219J5032J4081J4402J5778J7205J8030J8135J7371J5735
57198G68449J4056J3602J4695J6361J7540J8009J7958J7549J7304J8065J9949
57187I53537K1897K2789K2557K1764K0841K0156K0193K0920K1525K1403K0907
57176A188489K0558K0149J9387J8753J8752J8845J8173J7056J6717J7638J9138
57165A393655K0486K1555K2286K2519K2556K3165K4710K6795K8874L0663L1912
57154A669176L2378L2277L2241L2550L2847L2794L2711L3225L4545L6230L7707
57143B038681L8932M0632M3708M8244N3156N6912N8527N7984N6108N4025N2121
$$ y = [453831, 462012, 470764, 480194, 489898, 499244, 507971, 516519, 525708, 536095, 547731, 560513, 574562, 590031, 606461, 622680, 637712, 651793, 666195, 681973, 699178, 717208, 735343, 752714, 768449, 782505, 796107, 810802, 827163, 844703, 862712, 880670, 898219, 915523, 933588, 953537, 975434, 998223, 1020780, 1042544, 1063385, 1083541, 1103734, 1124654, 1146179, 1167582, 1188489, 1209047, 1229196, 1248583, 1267336, 1286088, 1304933, 1323106, 1340162, 1356879, 1374517, 1393655, 1414141, 1435696, 1457982, 1480501, 1503057, 1526222, 1550932, 1577727, 1606601, 1637264, 1669176, 1701554, 1733831, 1766072, 1798622, 1831469, 1864263, 1896974, 1930199, 1964744, 2000974, 2038681, 2077613, 2118245, 2161953, 2210197, 2263353, 2320265, 2378792, 2436776, 2492884, 2546909, 2599030]
57132B599030M9172M3084L2890J9793O145n851j4053j6125j0680J389J7414L4634
57120B756842N0957O4804P5394Q3210Q9366R4466R8618J02324J06528J11849J18559
57109C752917J27261J38950J54376J74148J99439K31843K72464L21938L81521
57100E754857M53397N39547O40888P57626Q89749J036752J197327J369807J552422
57091A4192372J742379J934247K119227K286003K422746K519351K570240K578556
57083C2365121K559646K537192K527175K517812K464964K314178K034947J637525
57075E0958560J157925O27624N7603n51237j185965j810835k376253k837250l166376
57066D0873796l355525l411574l351755l199881k982264k724106k447636k171149
$$ y = [2599030, 2648202, 2691286, 2724176, 2743969, 2750114, 2744263, 2730210, 2714085, 2703405, 2704794, 2722208, 2756842, 2807799, 2872603, 2947997, 3031207, 3120573, 3215039, 3313657, 3415981, 3522509, 3634358, 3752917, 3880178, 4019128, 4173504, 4347652, 4547091, 4778934, 5051398, 5373336, 5754857, 6208254, 6747801, 7388689, 8146315, 9036064, 10072816, 11270143, 12639950, 14192372, 15934751, 17868998, 19988225, 22274228, 24696974, 27216325, 29786565, 32365121, 34924767, 37461959, 39989134, 42506946, 44971910, 47286088, 49321035, 50958560, 52116485, 52744109, 52801712, 52250475, 51064510, 49253675, 46877422, 44040172, 40873796, 37518271, 34106697, 30754942, 27555061, 24572797, 21848691, 19401055, 17229906]
57058A7229906j907728j664700j445323j251212j082925r39195q17336p14842
57050G406645o29809n59858n01874m53162m12108l77357l47269l20493k96358
57041C508357k74189k52882k31712k10974j91311j72641j54209j35537j16984
57032A767918r9389q3170o7643n1520l4554j8757p581l677p313j6406k7732l8712
57020A311464m8893n9463p0630p9975q4316q2863p7362o9539o0019m9870m1264
57009E87270l5537l1653k7712k3251j9290j6662j5278j4602j4017j2932j1148
56998C65188r152p672p026o952o813n890l993j871n23P5R67K774M974O794Q040
56983C38920Q601P967N882K951L0k652n280p897j0396j2669j4275j4501j3206
$$ y = [17229906, 15322178, 13657478, 12212155, 10960943, 9878018, 8938823, 8121487, 7406645, 6776836, 6216978, 5715104, 5261942, 4849834, 4472477, 4125208, 3804715, 3508357, 3234168, 2981286, 2749574, 2538600, 2347289, 2174648, 2020439, 1884902, 1767918, 1668529, 1585359, 1517716, 1466196, 1431642, 1412885, 1405304, 1401627, 1394314, 1377908, 1350176, 1311464, 1262571, 1203108, 1132478, 1052503, 968187, 885324, 807962, 738423, 678404, 628534, 587270, 551733, 520080, 492368, 469117, 449827, 433165, 417887, 403285, 389268, 376336, 365188, 356036, 348364, 341338, 334386, 327573, 321683, 317690, 315819, 315296, 315371, 316338, 319112, 324086, 330880, 338920, 347521, 355488, 361370, 364321, 364351, 361699, 356419, 348522, 338126, 325457, 311182, 296681, 283475]
56970B83475j1155r084o954m561k194q3K253N280Q475J0908J2575J4309J6373
56957C19617J7799J7286J4441J0025N280Q98l372q017j2664j6177j7906j8253
56945C08957j7705j6106j3312r941o685l439J53L710O563Q869J1413J4445J7481
56932C04403K0065K1847K1918J9164J3653O961O95m826j0106j5264j9820k3304
56920C35386k5543k6387k5680k3601k0722j7663j4775j2275j0441r303q358o985
56908A33653n283m114l924l961l156j535j14M80O17Q13J098J448K196L548N191
56893A26957O808Q555J0610J2663J4331J5722J7107J8165J8075J6328J3156R273
56881B87750N451K145p03l440o089q129q988q481o706l867l83L156O501R946J3819
$$ y = [283475, 272320, 263236, 256282, 251721, 249527, 249444, 251697, 256977, 265452, 276360, 288935, 303244, 319617, 337416, 354702, 369143, 379168, 384448, 385346, 381974, 373957, 361293, 345116, 327210, 308957, 291252, 275146, 261834, 251893, 245208, 241769, 241922, 245632, 252195, 261064, 272477, 286922, 304403, 324468, 346315, 368233, 387397, 401050, 408011, 408706, 403880, 393774, 378510, 358690, 335386, 309843, 283456, 257776, 234175, 213453, 195790, 181015, 168740, 158299, 148996, 140638, 133653, 128370, 124256, 120332, 116371, 113215, 111680, 111566, 112046, 112663, 113476, 114574, 116022, 118218, 121766, 126957, 133765, 142320, 152930, 165593, 179924, 195646, 212753, 230918, 248993, 265321, 278477, 287750, 293201, 295346, 294643, 291203, 285114, 276985, 267997, 259516, 252810, 248943, 248560, 251716, 258217, 268163, 281982]
56866B81982J8004K2165K6206L0233L4270L8046M0718M0857L7245L0141K1345
56855F21212J2693M777k800j0404j7843k4234k8099k8172k4616j9051j2957o512
56843D63994O27Q174J5519K2709L0189L7873M5244N2210N8864O4228O5881O1386
56831I26898N0150L4115J6795J223j1877k3961l6435m8596n7971o2409o1459n6057
56819F70416m7651l7752k7654j8052q970j36Q600J7081K4995L2141L8502M3720
56807F95240M6413M4539L7051K5194J1843o13j1691k2266l2865m2630m9857n3359
56795F46999n3073m9510m3286l5483k7732k1091j5206r265l400J775O546J1678
56783D08952J6725K0186K1487K1267J9392J4537O637j849q556j3885j9643k5925
$$ y = [281982, 299986, 322151, 348357, 378590, 412860, 450906, 491624, 532481, 569726, 599867, 621212, 633905, 638682, 635882, 625478, 607635, 583401, 555302, 527130, 502514, 483463, 470506, 463994, 464621, 472795, 488314, 511023, 541212, 579085, 624329, 676539, 735403, 799631, 865512, 926898, 977048, 1011163, 1027958, 1029181, 1017304, 993343, 956908, 908312, 850341, 787932, 726473, 670416, 622765, 585013, 557359, 539307, 530337, 530201, 538801, 555882, 580877, 613018, 651520, 695240, 741653, 786192, 823243, 848437, 860280, 859667, 847976, 825710, 792845, 750215, 700358, 646999, 593926, 544416, 501130, 465647, 437915, 416824, 401618, 392353, 388953, 390728, 397274, 408952, 425677, 445863, 467350, 488617, 508009, 522546, 529183, 527334, 518778, 504893, 485250, 459325]
56771D59325l1001l3681l4229l3234l0976k7944k4758k1573j8338j5454j3282
56760A74855j1344r058o979o137o303o089m883l525k880k774k587k110j480r04
56746A07802o50p75q90o43l28m61r43j297j424j444j151m68n9m72j000n32O98
56729I5963J467J497J652K099J863O39l22P8J271J981J878J535J383J413J491
56714A15888J381Q65J50k03l3K34L08L44L59J07k39OR97J886J914J374J009R37
56696A27284P00N4p47j283j310j025r79j400j687j100L0N78K20r3L96J140J165
56679A21943M08l93p08n74k61l3k2o5P9K96K65J41M52J206J735J757J810K269
56661A30305K566K043J030M25N64J070J556J944K187K199K025J799J617J554J576
$$ y = [459325, 428324, 394643, 360414, 327180, 296204, 268260, 243502, 221929, 203591, 188137, 174855, 163511, 154453, 147474, 141337, 135034, 128945, 124062, 120537, 117657, 114883, 112296, 110186, 108706, 107802, 107152, 106377, 105487, 104844, 104516, 104055, 103112, 101815, 100391, 98947, 97796, 97328, 97269, 96797, 95797, 95265, 95963, 97430, 98927, 100579, 102678, 104541, 105180, 104858, 104936, 106207, 108188, 110066, 111601, 112984, 114397, 115888, 117269, 118134, 118284, 118081, 118048, 118282, 118590, 118934, 119293, 119400, 119161, 119167, 120164, 122050, 123964, 125338, 126347, 127284, 127984, 128038, 127291, 126008, 124698, 123673, 122694, 121294, 119607, 118507, 118537, 119115, 119335, 119242, 119638, 120778, 121943, 122351, 121958, 121250, 120676, 120415, 120382, 120360, 120295, 120374, 120670, 120935, 121076, 121528, 122734, 124469, 126226, 128036, 130305, 132871, 134914, 135944, 136369, 136933, 138003, 139559, 141503, 143690, 145889, 147914, 149713, 151330, 152884, 154460]
56646A54460J405P99P4p1N00J079J038N64J74l4k84n74o62m21J08P62J174R60
56628A61051K31l86n07m36o07r51j177j317j585j903j958j692j372j222j222j232
56612A43715j192j157j170j116p94k11L10M47K14k17p22j111j052n57j82l26n24
56595A34355k1J052J761J541P87K00R2L09M96M25L18O64J427J853J506R91J000
56578A48756J243J137R71J274J547R65J5L1J112J982K005J939K414L067L631M511
56562A76600N813O909P529Q128Q709Q501P276N860M755L452J714K85l62q06j451
56547B42912j734j394j294k023k760k631k114k085k362k442k685l511m207l796
56533B07874k564j570j102p65n26o04p37n97n33j000j638j801j489j017l84K87
$$ y = [154460, 155865, 156664, 156738, 156667, 157167, 158246, 159284, 159848, 160022, 159988, 159704, 159130, 158468, 158047, 158155, 158917, 160091, 161051, 161282, 160896, 160389, 159953, 159346, 158395, 157218, 155901, 154316, 152413, 150455, 148763, 147391, 146169, 144947, 143715, 142523, 141366, 140196, 139080, 138286, 138075, 138385, 138832, 139046, 138829, 138107, 136996, 135944, 135387, 135205, 134879, 134355, 134334, 135386, 137147, 138688, 139475, 139675, 139767, 140076, 140572, 140997, 141315, 141979, 143406, 145259, 146765, 147756, 148756, 149999, 151136, 152107, 153381, 154928, 155893, 155908, 155939, 157051, 159033, 161038, 162977, 165391, 168458, 172089, 176600, 182413, 189322, 196851, 204979, 213688, 222189, 229465, 235325, 240080, 243532, 245246, 245531, 245169, 244363, 242912, 241178, 239784, 238490, 236467, 233707, 231076, 228962, 226877, 224515, 222073, 219388, 215877, 211670, 207874, 205310, 203740, 202638, 201873, 201347, 200743, 200006, 199409, 198876, 197876, 196238, 194437, 192948, 191931, 191547, 191834]
56517A91834L61k90o82j50L95j80j415j977j643j203j018r49j297k329l222k863
56501A73372j525m58p9J83N17N38L51N00Q98R21M96L1m52j086j347p60pl1m10
56482A71652q1P17Q59M37N23R71M67q61j098N51K377K728K214K172K382J746L43
56465A88099o32n02L27J054J071K86o12o70J15P13N26J32J81L70K21J0J90N01
56447A91380M69K60L08N07M41J75J10L37O23Q63J068J186J212J250J216Q55L42
56430B02602L16R06J254N85n86j034m37K51N5q45j403r03L85J612K196K086J436
56413B08476M18n30q05m12k00p81j541j369k21Q25R88N43J34R0N39J472K417K656
56395B12699K070J272P67M45J13j09j44k20m19m81k59M5L95J157K425L455L325
$$ y = [191834, 192195, 191905, 191223, 191073, 191468, 191288, 189873, 187896, 186253, 185050, 184032, 183083, 181786, 179457, 176235, 173372, 171847, 171389, 171310, 171493, 172010, 172548, 172899, 173399, 174297, 175218, 175714, 175745, 175293, 174207, 172860, 172100, 172093, 172062, 171652, 171571, 172288, 173147, 173584, 174107, 175078, 175545, 174684, 173586, 174137, 176514, 179242, 181456, 183628, 186010, 187756, 188099, 187467, 186965, 187292, 188346, 189417, 189703, 189091, 188421, 188536, 189249, 189775, 189907, 190088, 190458, 190679, 190689, 190879, 191380, 191849, 192109, 192417, 192924, 193365, 193540, 193650, 193987, 194610, 195473, 196541, 197727, 198939, 200189, 201405, 202260, 202602, 202918, 203824, 205078, 205663, 205077, 204043, 203606, 203857, 203912, 203067, 201664, 200761, 201146, 202758, 204954, 207040, 208476, 208894, 208364, 207559, 207147, 206947, 206166, 204625, 203256, 203035, 203860, 204848, 205391, 205525, 205615, 206154, 207626, 210043, 212699, 214769, 216041, 216808, 217253, 217366, 217257, 217113, 216893, 216474, 215993, 215734, 215779, 216174, 217331, 219756, 223211, 226536]
56378B26536K024N63k4L82J077J411J399J412J419R84L7q15r98n78P0P49J284
56361B36932J344Q87L78J88K03L93J043J969K281J644R88J115J430J068N24Q05
56345B53192J573J645R46N05O83R37J226K075L200L539L011K737L244L731L549
56330B85793L129K939K770K528K628L048L054K350J557J177J033R78J127J070
56316C15181J07j326j814r90j21r4j53N20J271J143M86K61O03J063J640K486L190
56299C23453L363L441M063M951N282M889M393M310M544M602L997K806J900K161
56285C78155L340M385M985N905P449Q703Q831Q297Q118Q588R355J0145J0803J1160
56271D88219J1356J1834J2689J3546J4351J5584J7430J9404K1092K2624K4182
$$ y = [226536, 228560, 229123, 229099, 229481, 230558, 231969, 233368, 234780, 236199, 237183, 237220, 236405, 235407, 234829, 234899, 235648, 236932, 238276, 239163, 239541, 239729, 239932, 240325, 241368, 243337, 245618, 247262, 248250, 249365, 250795, 251863, 252387, 253192, 254765, 256410, 257356, 257861, 258544, 259481, 260707, 262782, 265982, 269521, 272532, 275269, 278513, 282244, 285793, 288922, 291861, 294631, 297159, 299787, 302835, 305889, 308239, 309796, 310973, 312006, 312984, 314111, 315181, 315288, 313962, 312148, 311158, 311037, 310943, 310790, 311310, 312581, 313724, 314210, 314471, 315074, 316137, 317777, 320263, 323453, 326816, 330257, 334320, 339271, 344553, 349442, 353835, 358145, 362689, 367291, 371288, 374094, 375994, 378155, 381495, 385880, 390865, 396770, 404219, 412922, 421753, 430050, 438168, 446756, 456111, 466256, 477059, 488219, 499575, 511409, 524098, 537644, 551995, 567579, 585009, 604413, 625505, 648129, 672311]
56260F72311K5904K8320L2014L6639M1229M5614N0513N6121O1898O7994P5398
56249A193955Q4208R3162J01441J09612J18023J25750J31906J36685J40307J42198
56239B377247J42017J40069J35832J27606J14735R8787Q1359O2173M0659J7917
56229C338401m508k6537m8480o9132q6749j01192j13330j23011j29302j32279
56219B503881j32935j31736j28671j24338j19442j13704j06619r8910r1772q5126
56209A370628p8115p0961o4698n9298n3735m8010m3470m0730l8560l5363l0959
56198H06729k6522k3327k1727k0908j9620j7432j5031j3111j1546j0060q860p982
56186F10603o869n344m223m089m280m018l615l567l390k521j580j434j692j464
$$ y = [672311, 698215, 726535, 758549, 795188, 836417, 882031, 932544, 988665, 1050563, 1118557, 1193955, 1278163, 1371325, 1472766, 1582378, 1700401, 1826151, 1958057, 2094742, 2235049, 2377247, 2519264, 2659333, 2795165, 2922771, 3037506, 3136293, 3217652, 3279825, 3320484, 3338401, 3333893, 3307356, 3258876, 3189744, 3102995, 3001803, 2888473, 2765462, 2636160, 2503881, 2370946, 2239210, 2110539, 1986201, 1866759, 1753055, 1646436, 1547526, 1455754, 1370628, 1292513, 1221552, 1156854, 1097556, 1043821, 995811, 952341, 911611, 873051, 837688, 806729, 780207, 756880, 735153, 714245, 694625, 677193, 662162, 649051, 637505, 627445, 618585, 610603, 603734, 598390, 594167, 590078, 585798, 581780, 578165, 574598, 571208, 568687, 567107, 565673, 563981, 562517]
56172E62517r24p83p93j58R92J811K097K315K632K947L401L892L833L307L585
56157E90671N307P145P658P491Q132R399J0077J0354J1602J3987J6262J7853J9475
56144G35413K1711K4432K7633L1427L5303L8723M2202M6558N1350N5322N7994
56133A168068N9451N9194N6923N4000N2275N1473M9439M5059L9329L3500K7752
56122A696463K1989J6551J1715P384L423m91n078j0648j6493k1939k7428l3531
56110A641917l9618m4753m9088n3058n5910n6588n5350n3088m9741m4938l9384
56099A100401l4016k8561k2606j7105j3094r840o319l452k577k647j461R70K846
56086I62539L795N050O779P900Q331R013R731R467Q646Q639R227R097Q605R366
$$ y = [562517, 561593, 560810, 560017, 559859, 560851, 562662, 564759, 567074, 569706, 572653, 576054, 579946, 583779, 587086, 590671, 595978, 603123, 610781, 618272, 626404, 635803, 645880, 656234, 667836, 681823, 698085, 715938, 735413, 757124, 781556, 809189, 840616, 875919, 914642, 956844, 1003402, 1054752, 1110074, 1168068, 1227519, 1286713, 1343636, 1397636, 1449911, 1501384, 1550823, 1595882, 1635211, 1668711, 1696463, 1718452, 1735003, 1746718, 1754102, 1757525, 1757034, 1751956, 1741308, 1724815, 1702876, 1675448, 1641917, 1602299, 1557546, 1508458, 1455400, 1399490, 1342902, 1287552, 1234464, 1184723, 1139785, 1100401, 1066385, 1037824, 1015218, 998113, 985019, 975179, 968860, 965408, 962831, 960184, 958723, 959693, 962539, 966334, 971384, 978163, 986063, 994394, 1003407, 1013138, 1022605, 1031251, 1039890, 1049117, 1058214, 1066819, 1076185]
56072A076185J1236J2374J2332J2423J3043J3300J3354J4313J5670J5702J4583
56061A224515J4283J5209J5855J5997J7160J9396K0730K0413J9861J9690J8858
56050A421967J7427J7146J8348J9138J8702J8604J9795K1058K1504K2041K3258
56039A638988K4311K4913K6057K7925K9332K9948L0812L2202L3328L4378L6300
56028A968494L8493L9556M0302M2813M6474M8544M8792M9846N2523N4801N6000
56017B486638N7912O0907O3073O4258O6778P1033P4578P6758Q0001Q5173R0004
56006C277113R3519R7694J03202J08042J11904J17308J24784J31676J37389J44797
55996D447428J54681J63966J71529J80505J92497K05046K17162K31768K50005
$$ y = [1076185, 1087421, 1099795, 1112127, 1124550, 1137593, 1150893, 1164247, 1178560, 1194230, 1209932, 1224515, 1238798, 1254007, 1269862, 1285859, 1303019, 1322415, 1343145, 1363558, 1383419, 1403109, 1421967, 1439394, 1456540, 1474888, 1494026, 1512728, 1531332, 1551127, 1572185, 1593689, 1615730, 1638988, 1663299, 1688212, 1714269, 1742194, 1771526, 1801474, 1832286, 1864488, 1897816, 1932194, 1968494, 2006987, 2046543, 2086845, 2129658, 2176132, 2224676, 2273468, 2323314, 2375837, 2430638, 2486638, 2544550, 2605457, 2668530, 2732788, 2799566, 2870599, 2945177, 3021935, 3101936, 3187109, 3277113, 3370632, 3468326, 3571528, 3679570, 3791474, 3908782, 4033566, 4165242, 4302631, 4447428, 4602109, 4766075, 4937604, 5118109, 5310606, 5515652, 5732814, 5964582, 6214587]
55987F214587K68846K87148L08233L33586L60162L86949M17830M54785M94977
55978I527103N37917N88249O47850P12945P83245Q65797R65342J079790J210453
55969A6918691J367445J559298J787804K060308K396568K815535L326328L939888
55961C6171865M675448N544609O543866P676077Q962712J0418258J2031008J3790389
55953A05814232J5710987J7799585K0023584K2348002K4736683K6958695K8326824
55946B61718592K7787079K4550508J8811200J1795299M932464j157475o905428
55939C41532239j3031014j9537090k5437830k9430160l0807184k9799803k7218739
55932A66270419k3904234k0449489j7209635j4370987j1983866j0009233q387512
$$ y = [6214587, 6483433, 6770581, 7078814, 7412400, 7772562, 8159511, 8577341, 9032126, 9527103, 10065020, 10653269, 11301119, 12014064, 12797309, 13663106, 14628448, 15708238, 16918691, 18286136, 19845434, 21633238, 23693546, 26090114, 28905649, 32231977, 36171865, 40847313, 46391922, 52935788, 60611865, 69574577, 79992835, 92023843, 105814232, 121525219, 139324804, 159348388, 181696390, 206433073, 233391768, 261718592, 289505671, 314056179, 332867379, 344662678, 349595142, 348437667, 341532239, 328501225, 308964135, 283526305, 254096145, 223288961, 193489158, 166270419, 142366185, 121916696, 104707061, 90336074, 78352208, 68342975, 59955463]
55925E9955463p069866o004323n131931m408101l808879l312340k891517k528952
55917B4799554k220869j961730j738189j541682j373265j231373j106706r93485
55909A2632255q94684q11596p38270o70421o10532n59830n13774m69653m30614
55900F932881l98072l67690l36868l09032k86522k65897k44326k24367k08379
55891D291728j93954j78744j64527j52954j42107j30691j20823j13635j06837
55882B987456r9458r4164r1967q9501q4721q0499p9355p9079p6999p4290p2588
55871B064835p0363o6189o1992n9552n7144n2994m8843m6846m5893m4055m1871
55860A469093m0360l8589l5949l3999l3437l2123k8821k5945k5814k7001k7260
$$ y = [59955463, 52885597, 46881274, 41749343, 37341242, 33532363, 30220023, 27328506, 24799554, 22578685, 20616955, 18878766, 17337084, 15963819, 14732446, 13625740, 12632255, 11737571, 10925975, 10187705, 9517284, 8906752, 8346922, 7833148, 7363495, 6932881, 6534809, 6167119, 5830251, 5521219, 5234697, 4968800, 4724474, 4500107, 4291728, 4097774, 3919030, 3754503, 3601549, 3459442, 3328751, 3207928, 3094293, 2987456, 2887998, 2793834, 2701867, 2612366, 2527645, 2447146, 2367791, 2288712, 2211713, 2137423, 2064835, 1994472, 1928283, 1866291, 1806739, 1749595, 1696601, 1647758, 1600912, 1555019, 1510964, 1469093, 1428733, 1390144, 1354195, 1320196, 1286759, 1254636, 1225815, 1199870, 1174056, 1147055, 1119795]
55849A119795k7185k7930k8096k6177k3824k3350k3976k3554k2188k1215k0366
55838H51934j8771j7211j6741j6527j5482j4383j4148j3727j2036j0212r598r339
55826F83759q327p663q541r535q767p283p405r008j0134j0240j0240j0286r947
55813E66383r726j0164j0249q768o340m264k541q31l0o65j179l7J700K238K108
55798E17635K887M088M108L334L456M310M132K653J330O84k27j695k848l295l461
55783E37091l469l387m204o697r581j0730r962q870q252p574o660n891m833k537
55769D44444O61L245M363M204K901O57j405k368l207n570r019j1377j1706j1100
55755D04723j0471r526q220p356p202p064o734o942p856q506q189p349o534n642
$$ y = [1119795, 1092610, 1064680, 1036584, 1010407, 986583, 963233, 939257, 915703, 893515, 872300, 851934, 833163, 815952, 799211, 782684, 767202, 752819, 738671, 724944, 712908, 702696, 693098, 683759, 675432, 667769, 659228, 649693, 640926, 633643, 626238, 617230, 607096, 596856, 586616, 576330, 566383, 556657, 546493, 536244, 527476, 521136, 516872, 514331, 513500, 513470, 512805, 511626, 511589, 513289, 515527, 517635, 520522, 524610, 528718, 532052, 535508, 539818, 543950, 546603, 547933, 548617, 548390, 546695, 543847, 540552, 537091, 533622, 530235, 526031, 519334, 509753, 499023, 489061, 480191, 471939, 464365, 457705, 451814, 446981, 444444, 445105, 448350, 452713, 456917, 459818, 460475, 459070, 456702, 453495, 447925, 438906, 427529, 415823, 404723, 394252, 384726, 376506, 369150, 361948, 354884, 348150, 341208, 333352, 324846, 316657, 309308, 302774, 297132]
55741B97132m585l716l111k332j320p27r55j541j830j750j732k213l255m305m611
55726B59149m249m201m919n516n160m397m071l731k472p55K00M48J113K339L059
55711B26837K895K736L117L456L310L137L226K977J787q9k051l765n002n524n497
55696B31550n467n698n966o028n847n392m743m192l745k889j476m08m99j067o97
55681A77436Q19K367L193L510L518K975J987J056K38q40j903k041j117j65p5o80
55665A90278j450k171k595k246j132L7P19J070J253J010L98K29J085K337K865
55650A91687K521K196K472K870K619J817J304J407J381M28j025j764j418j027
55636B05468j716l444n257o267o085m973l872l670m133m235l752l527l803l468
$$ y = [297132, 292547, 288831, 285720, 283388, 282068, 281341, 280386, 278845, 277015, 275265, 273533, 271320, 268065, 263760, 259149, 254900, 250699, 245780, 240264, 235104, 230707, 226636, 222905, 220433, 219678, 219878, 220326, 221439, 223778, 226837, 229732, 232468, 235585, 239041, 242351, 245488, 248714, 251691, 253478, 253389, 251338, 247573, 242571, 237047, 231550, 226083, 220385, 214419, 208391, 202544, 197152, 192409, 188217, 184472, 181583, 180107, 179699, 179200, 178133, 177436, 178255, 180622, 183815, 187325, 190843, 193818, 195805, 196861, 197099, 196259, 194356, 192315, 191198, 191033, 190958, 190278, 188828, 186657, 184062, 181816, 180684, 180721, 181440, 182510, 183763, 184773, 185171, 185400, 186485, 188822, 191687, 194208, 196404, 198876, 201746, 204365, 206182, 207486, 208893, 210274, 210702, 209677, 207913, 206495, 205468, 203752, 200308, 195051, 188784, 182699, 177726, 173854, 170184, 166051, 161816, 158064, 154537, 150734, 147266]
55622A47266j851j74J0j029j806j753j461j317j194j219j626j939j463m78om19
55606A29541j156j633j678j332r00r33j362j281l36L66j92j286j616j363j501
55591A13338j751j131j06j56j189j438k11J091J216O10J13k63n94m63J59O28Q27
55574A10680J404K269K251J006r4J10R30J099N97K02J40K59P12J417J468J66j776
55557A22840k964k920k203j380o25p4J45J19J8n4R5N86R53M74o50j246p85j94
55539A12135m22r85q09P2P05P57P83J106J319J055N66K58J52Qk79n65o85o85q10
55520A13676j140j327j014m73m51j201k039k103j295l08N2m74j381j766j160m9
55504I7547O15M19k47p86q73n31p6K4k91m91k42m8n17j307j639j558j689j837
$$ y = [147266, 145415, 145241, 145251, 144222, 142416, 140663, 139202, 137885, 136691, 135472, 133846, 131907, 130444, 129966, 129960, 129541, 128385, 126752, 125074, 123742, 122842, 121909, 120547, 119266, 118930, 119296, 119104, 117818, 116202, 114839, 113338, 111587, 110456, 110350, 110194, 109005, 107567, 107356, 108447, 109663, 110273, 110386, 110123, 109529, 109066, 109225, 109853, 110680, 112084, 114353, 116604, 117610, 117516, 117626, 118556, 119655, 120252, 120454, 120594, 120853, 121565, 122982, 124450, 124616, 122840, 119876, 116956, 114753, 113373, 112748, 112674, 112819, 112938, 112956, 112902, 112997, 113583, 114536, 115010, 114360, 113114, 112329, 112135, 111713, 110728, 109919, 109991, 110696, 111453, 112236, 113342, 114661, 115716, 116282, 116540, 116692, 116700, 116421, 115856, 115171, 114486, 113676, 112536, 111209, 110195, 109722, 109271, 108070, 106031, 103928, 102633, 102325, 102377, 101903, 100522, 98756, 97596, 97547, 98162, 98581, 98334, 97548, 96675, 96144, 96068, 96092, 95801, 95310, 95068, 95020, 94503, 93196, 91557, 89999, 88310, 86473]
55486H6473j046P21K098K033J044J81l90j009j429j030Q6R90R74L12q5L49J280
55469I1552J878J782J400J135P80J52k53ML82P4o58q84n84o02j053j040k63L44
55451I4146P3n04n08O4O09P18K67n94j255j106m23n9j45j8M64O20J70l06m63n72
55431I1178n77j6P53O67k02m18M72R78J12q84n76K98K04n82o59L2L20pK9P57J383
55410I3262J430J265J118P89M07L60M00j07r67j289r01n82p54r50q51q25j123
55393I0682j339j099n92j04L92Q73J044P79L49N0l4J13M76P91P79N19K41j07o48
55374I3165j095j057p29o69r00q93m16J54M48M52K15k07m65j61M76P50M56J14
55356H9638P2km46q73o25K90J113J172N74M6J26O22Q70N52ol70n08o01o55o10
$$ y = [86473, 85427, 86148, 88246, 90279, 91323, 91504, 91114, 90105, 88676, 87646, 87732, 88722, 89696, 90008, 89923, 90272, 91552, 93430, 95212, 96612, 97747, 98527, 98679, 98426, 98430, 98812, 98886, 98228, 97344, 96760, 96158, 95105, 94065, 93802, 94146, 94219, 93715, 93207, 93271, 93880, 94598, 94865, 94271, 93016, 91910, 91487, 91428, 91283, 91265, 91729, 92349, 92519, 92213, 91750, 91178, 90601, 90585, 91338, 92005, 91803, 91385, 91857, 92835, 92947, 92063, 91487, 91785, 91989, 91407, 90748, 90780, 91100, 91093, 91122, 91879, 93262, 94692, 95957, 97075, 97864, 98271, 98631, 99031, 98924, 97957, 96668, 95767, 95185, 94431, 93481, 92630, 91805, 90682, 89343, 88244, 87652, 87548, 87940, 88813, 89857, 90636, 90985, 91035, 91001, 91114, 91590, 92381, 93160, 93679, 93920, 93813, 93165, 92070, 91013, 90284, 89615, 88715, 87822, 87406, 87560, 88008, 88460, 88675, 88468, 88003, 87842, 88318, 89068, 89524, 89638, 89710, 89708, 89262, 88389, 87764, 88054, 89167, 90339, 90913, 90959, 91085, 91707, 92577, 93129, 93123, 92753, 92245, 91644, 90989, 90379]
55336I0379n83o40n50j05N03Q93R19O26P0m95n83p2M87N43K81J59P0m06j083j240
55316H9173o64J3J64q0j53K05P18R39P22M05M14O74O83K44k13k77j33j04n8K54
55296I2926O05N87L32L07N18M72m3o65r57q77o17l23l8K03K67n4p31j215q91N0
55276H9856O78N18J41K47O87R22R28J014J101Q85M28jm18r01j133p63k5N79J000
55257I5743J417J576J044oq52j099r75q59r35j185j362j108m78n5j96m80m29k38
55239H9523k97m59m28m08n79m18N47J715K069J553Q73K33n88j161p13N44J453
55222I3459J489J203R87N32k94j003j315j505j671j465q51l06L1M64Q94P72K78
55205I1699M37J512K350J940P82l0k86l97l60P5O10O59J91l17n44m77j68J78J38
$$ y = [90379, 89796, 89156, 88606, 88501, 89004, 89897, 90816, 91442, 91512, 91017, 90434, 90362, 90849, 91392, 91673, 91832, 91902, 91496, 90413, 89173, 88509, 88522, 88686, 88606, 88453, 88658, 89376, 90315, 91037, 91442, 91856, 92530, 93213, 93457, 93244, 92967, 92834, 92730, 92672, 92926, 93531, 94118, 94450, 94757, 95275, 95747, 95704, 95039, 94082, 93205, 92588, 92265, 92227, 92430, 92697, 92643, 91912, 90697, 89806, 89856, 90534, 91052, 91193, 91440, 92127, 93049, 93977, 94991, 96092, 96977, 97405, 97404, 96986, 96085, 94952, 94189, 94164, 94743, 95743, 97160, 98736, 99780, 99774, 98922, 97823, 96848, 95989, 95054, 93869, 92507, 91399, 90921, 90866, 90670, 90190, 89761, 89523, 89226, 88767, 88339, 87931, 87352, 86934, 87481, 89196, 91265, 92818, 93691, 93924, 93336, 92175, 91462, 92006, 93459, 94948, 96151, 97138, 97670, 97376, 96373, 95058, 93553, 91882, 90417, 89566, 89260, 89291, 89755, 90649, 91421, 91699, 92136, 93648, 95998, 97938, 98720, 98690, 98404, 98007, 97647, 97722, 98332, 98991, 99182, 98865, 98321, 97844, 97676, 97854, 97992]
55186I7992m20r50q73l40P8J96K59L59K73j07n53o90l21L21O11J23o96q58q2P45
55166I5067O99k9n37l97R1N79R66J110Q10K27j12J28P30J222J338J073N28r4m52
55147A02947l49l7m1n07r39p92j85L29M95M96L71j16q34j140o80J37Q41J506K192
55128A03694K354J522J91o98r17r34r57q01n49n87r52j250j186p35P3R82J387
55111A00637J050O28Q28J308J219N13j65o07j033j163n06M97Q41N48O44J386J809
55094A08434J335O16K64l3n25o69j16N32P03O95Q45P62J49l83j94L95P68R82J308
55075A15868J401Q21q6o84r27j091j099q31o71q94j045o04O8K57K9N0M99R46J082
55056A13089R00L41o21j597k070j909j313m93J98L15o2k56J3R4m98j097q08J05
$$ y = [97992, 97572, 96622, 95749, 95409, 95487, 95683, 95942, 96301, 96574, 96467, 95914, 95224, 94903, 95224, 95835, 95958, 95262, 94404, 94322, 95067, 95766, 95737, 95200, 94803, 94894, 95473, 96439, 97549, 98359, 98586, 98474, 98602, 99332, 100554, 101892, 102965, 103493, 103399, 102947, 102598, 102561, 102520, 102013, 101074, 100282, 100097, 100426, 100921, 101417, 101788, 101672, 100838, 99698, 99018, 99155, 99996, 101502, 103694, 106048, 107570, 107761, 107063, 106146, 105212, 104255, 103454, 102905, 102318, 101366, 100116, 98930, 98195, 98268, 99250, 100637, 101687, 102315, 103143, 104451, 105670, 106183, 106018, 105411, 104378, 103215, 102709, 103206, 104047, 104595, 105239, 106625, 108434, 109769, 110385, 110649, 110616, 110091, 109422, 109306, 109838, 110541, 111236, 112081, 112843, 112992, 112609, 112415, 112810, 113578, 114560, 115868, 117269, 118090, 118004, 117320, 116393, 115302, 114203, 113372, 112701, 111807, 110762, 110158, 110226, 110483, 110512, 110562, 111061, 112007, 113089, 113989, 114330, 113709, 112112, 110042, 108133, 106820, 106327, 106525, 106840, 106778, 106522, 106535, 106629, 106131, 105034, 104226, 104331]
55038A04331O52O08N56P21P58O31P51J046Q59l7r70j237q98m70k49j77j37j32
55020A06606k61n21o69m89k21l77r80j433j386j158r88m55P05J839K075J528J039
55003A04854J012J131J116J034R77R75J127J380J386R70N17M16M76L45J37J20
54987A17973J67J18L01Q95J282Q00j08m24n6J71j77o73r03r29q14m87j47j31l30
54968A16528l57k46k79k91J14O80P58L87K60N17N44J21j80J0K86K82K18K40k2
54949A19570o81j035m11Q53J771J777J102L09k30n70r30j145o26O59J580J017
54933A23010m35j022j32J016J281J093J425K231K731K671K381K060J736J660K031
54918A43737K555K811K893L134L512L758L863L865L450K373J099L33q0j076l013
$$ y = [104331, 104983, 105591, 106147, 106868, 107626, 108257, 109008, 110054, 110913, 110876, 109906, 108669, 107771, 107301, 107052, 106875, 106738, 106606, 106345, 105824, 105155, 104666, 104445, 104068, 103088, 101655, 100269, 99111, 98123, 97668, 98373, 100212, 102287, 103815, 104854, 105866, 106997, 108113, 109147, 110124, 111099, 112226, 113606, 114992, 115962, 116479, 116895, 117371, 117716, 117853, 117973, 118140, 118258, 118559, 119454, 120736, 121536, 121428, 121004, 120948, 121119, 120942, 120269, 119366, 118437, 117623, 117136, 116989, 116858, 116528, 116171, 115925, 115646, 115355, 115469, 116149, 116907, 117294, 117554, 118071, 118615, 118736, 118556, 118566, 118852, 119134, 119352, 119592, 119570, 118889, 117854, 117443, 118296, 120067, 121844, 122946, 123255, 123025, 122455, 121525, 120380, 119754, 120413, 121993, 123010, 122575, 121553, 121421, 122437, 123718, 124811, 126236, 128467, 131198, 133869, 136250, 138310, 140046, 141706, 143737, 146292, 149103, 151996, 155130, 158642, 162400, 166263, 170128, 173578, 175951, 177050, 177383, 177303, 176227, 173214]
54903A73214m945n614m888l871l650m191m498l755k191p87k74n55r98j037n39
54888A31421J59N24M02K42M99Q81P80L25L57J167J996K225K320K967L881M269
54872A54415M124M144M443M361L627K870K539K116R46o43j754k220k740l743m700
54857A67785m821m044l031k395k251k408k697l044l376l569l464k947k102j219
54843A26417n29l7K66J47n56j400j555p06N03J176J047M89q4m50m72j80O6j51
54825A23991p68j266j327j200j244j288p75M40J600J690O21n08n51L58J056P51
54809A21580j75q14p01K4Q97J326R58J91n7N41J181R67O6o50q02p51q47j032j134
54790A20768j045o68r2K67J83Q8N29J270J586J429J522K171K652K167R25j80o18
$$ y = [173214, 168269, 162655, 157767, 153896, 150246, 146055, 141557, 137802, 135611, 134824, 134550, 133995, 132997, 131960, 131421, 131580, 132104, 132506, 132748, 133247, 134128, 134908, 135233, 135590, 136757, 138753, 140978, 143298, 146265, 150146, 154415, 158539, 162683, 167126, 171487, 175114, 177984, 180523, 182639, 183585, 182942, 181188, 178968, 176228, 172485, 167785, 162964, 158920, 155889, 153494, 151243, 148835, 146138, 143094, 139718, 136149, 132685, 129738, 127636, 126417, 125888, 125851, 126117, 126264, 125708, 124308, 122753, 122047, 122550, 123726, 124773, 125262, 125178, 124728, 124256, 124076, 124142, 123991, 123223, 121957, 120630, 119430, 118186, 116898, 116123, 116563, 118163, 119853, 120474, 119966, 119415, 119773, 120829, 121580, 121405, 120591, 119890, 119914, 120811, 122137, 123095, 123286, 123229, 123770, 124951, 125918, 125984, 125334, 124532, 123781, 122934, 121902, 120768, 119723, 119055, 118963, 119230, 119413, 119501, 120030, 121300, 122886, 124315, 125837, 128008, 130660, 132827, 133752, 133572, 132954]
54773A32954n00KR82K405L675M029L423K778L014L937M510M218L608L366L498
54758A75899L688L880L927L290J748pj206k005k943l859m245m304m638m995m530
54743A59700l293k372k304k467k297k089k118j917j209o87j034j721j646o37M48
54728A34357R73J216J754K678L530L793L374K660K143K019K187K513K881L092
54714A69170L091L121L304L238K459J225J99n61j630l115m295m567m151l624l270
54699A60594l227l619m235m492m076l279k395j330q8Q30R20K79n82j252j488j187
54683A31373n49k3J70K00K08P6j70j98J77O85R12O69m6j025j729j638q98k10m4
54664A27940l72j042j780j862o68J243K415K158J244O92O35P25Q36Q50N05p8l26
$$ y = [132954, 132454, 132456, 133438, 135843, 139518, 143547, 146970, 149748, 152762, 156699, 161209, 165427, 169035, 172401, 175899, 179587, 183467, 187394, 190684, 192432, 192425, 191219, 189214, 186271, 182412, 178167, 173863, 169225, 164230, 159700, 156407, 154035, 151731, 149264, 146967, 144878, 142760, 140843, 139634, 138947, 137913, 136192, 134546, 133909, 134357, 135330, 136546, 138300, 140978, 144508, 148301, 151675, 154335, 156478, 158497, 160684, 163197, 166078, 169170, 172261, 175382, 178686, 181924, 184383, 185608, 185807, 185246, 183616, 180501, 176206, 171639, 167488, 163864, 160594, 157367, 153748, 149513, 145021, 140945, 137666, 135271, 133941, 133853, 134683, 135603, 135882, 135300, 134048, 132560, 131373, 130824, 130801, 130971, 131171, 131379, 131455, 131285, 131087, 131264, 131949, 132861, 133530, 133484, 132459, 130730, 129092, 128194, 127984, 127940, 127568, 126526, 124746, 122884, 122216, 123459, 125874, 128032, 129276, 129968, 130603, 131328, 132164, 133014, 133519, 133441, 133115]
54647A33115j10k6l53n56k98j04m07p31n81l62n78q32n55j02j37m10j97M40Q18
54628A28034P92P94R03P92M55J60k15r89j934k426k287j803j127k80M24O60O30
54611A22583O55N38L9l19J61J098J321M44o88j174r14k58M34P65N46J78K19O13
54593A26241Q50Q23Q28Q42O17L29L46L93q4p85q02j53Q1n33j024n65K07K38l33
54574A27516n20n5L27M5n53p14j79N95R53P31M05M84Q79J064P60J55m49q51q81
54555A29712n22p5J67L21N94P41M25k5O2O88J147J121J003R90O72q5o56n14rK33
54535A35990J75J52K11J99J25L2k12n93p54n25k84l84n14j80M63Q22P49O70P71
54516A36913O50p8j097j605j148r3P16P56K15m11r06j274j350q81p0N04N75M47
$$ y = [133115, 133005, 132979, 132626, 132070, 131772, 131668, 131261, 130530, 129949, 129587, 129009, 128177, 127622, 127520, 127383, 126973, 126776, 127216, 128034, 128826, 129620, 130523, 131315, 131770, 131930, 131715, 130726, 128792, 126366, 124079, 122276, 121149, 120869, 121293, 121953, 122583, 123238, 123776, 123815, 123496, 123657, 124755, 126076, 126520, 125832, 124658, 123744, 123486, 123920, 124685, 125231, 125409, 125628, 126241, 127091, 127914, 128742, 129584, 130201, 130530, 130876, 131269, 131185, 130400, 129598, 129445, 129526, 128993, 127969, 127404, 127611, 127849, 127516, 126996, 126941, 127268, 127313, 126760, 126046, 125867, 126462, 127415, 128146, 128551, 129035, 129914, 130978, 131738, 131893, 131444, 130593, 129712, 129190, 129115, 129282, 129603, 130197, 130938, 131363, 131338, 131400, 132088, 133235, 134356, 135359, 136349, 137021, 136936, 136280, 135766, 135757, 135990, 136165, 136317, 136528, 136727, 136852, 136884, 136672, 136079, 135325, 134800, 134516, 134132, 133618, 133438, 133901, 134723, 135472, 136142, 136913, 137563, 137485, 136388, 134783, 133635, 133542, 134258, 135014, 135229, 134818, 133912, 132638, 131288, 130407, 130337, 130841, 131416, 131863]
54498A31863M18L93L00L26M43J58p23j473j171Q4J276J667J419J004O06K37Rj0
54480A36826Q4K58O91J408J954J762Q66n9l93k00J9j1q0J22N40P97O19J64j06
54461A45261P6M43M45n8n31m14J91O67O86M90L88M11M51M11J08n27j080r44j75
54442A46299M24L56K2n0lk39o74r47j018r84p06j98Lm45r15n63M32J136J157Q61
54422A43948M40k14p29l96O63J365J074L39o3j04o0J23M75N85J88k40l2P49J388
54403A49499J304M41q41j879j934p56J102K728L469L141J991O81k6J19O78J038
54387A60755R29M43o9j07M93J106Q50k43j157j251j063j272j588j314o34l97q07
54370A54674j063n38M24J140J497J768J895J466M80l99n86k77KK79J051K221K840
$$ y = [131863, 132281, 132674, 132974, 133300, 133743, 133901, 133178, 131705, 130534, 130618, 131894, 133561, 134980, 135984, 136590, 136827, 136836, 136826, 136910, 137168, 137859, 139267, 141221, 142983, 143849, 143790, 143397, 143197, 143216, 143205, 143125, 143247, 143787, 144584, 145203, 145367, 145261, 145337, 145780, 146225, 146167, 145636, 145222, 145413, 146080, 146766, 147256, 147644, 148055, 148506, 148917, 149025, 148498, 147418, 146474, 146299, 146723, 147079, 147101, 147051, 147048, 146809, 146135, 145188, 144170, 143186, 142480, 142282, 142285, 141840, 140925, 140362, 140794, 141930, 143087, 143948, 144388, 144174, 143445, 143049, 143712, 145077, 146151, 146490, 146427, 146323, 146263, 146386, 146861, 147446, 147634, 147394, 147362, 148111, 149499, 150803, 151244, 150403, 148524, 146590, 145834, 146936, 149664, 153133, 156274, 158265, 158946, 158920, 159039, 159717, 160755, 161684, 162127, 162058, 161951, 162444, 163550, 164400, 164157, 163000, 161749, 160686, 159414, 157826, 156512, 155878, 155481, 154674, 153611, 153073, 153497, 154637, 156134, 157902, 159797, 161263, 161743, 161344, 160758, 160481, 160483, 160762, 161813, 164034, 166874]
54353A66874K299J286R61J538K291K737L064L423L607L506L254K822J988Q93P8
54338B00621k21l48o99j341k256l370m204m174l394k648k381k257j899j395q79
54323A69155k89J21k11j262k101j994j230m26L55J203J662J147j82j538k267k115
54307A60028j175k2N16K34j54l3J96j69j028j679j830j714j431q61j35M30P79
54290A51952J035J082P68L22Q5n7m71j064j299r46l30J51M67Q68J575K501L099
54273A59738K771J610M40j35l48o09p66n26j50o7j39j8J02j95o52o02n2L24K97
54254A61023L94R29J476J589J417J252J030O08J44j45k42j16L66R98J139M82l18
54237A72026l28M28R15L56p79j403j154p03o99r27p91k93K0q1k54k16q2L4K21
$$ y = [166874, 169173, 170459, 171420, 172958, 175249, 177986, 181050, 184473, 188080, 191586, 194840, 197662, 199650, 200543, 200621, 200400, 200052, 199353, 198012, 195756, 192386, 188182, 184008, 180614, 177966, 175585, 173328, 171429, 170034, 169155, 168866, 168987, 168776, 167514, 165413, 163419, 162189, 161763, 162118, 163321, 164983, 166130, 165948, 164410, 162143, 160028, 158853, 158831, 159347, 159581, 159427, 159394, 159590, 159421, 158393, 156714, 154884, 153170, 151739, 150878, 150743, 151173, 151952, 152987, 154069, 154837, 155159, 155244, 155187, 154716, 153652, 152353, 151407, 151077, 151228, 151695, 152563, 154138, 156639, 159738, 162509, 164119, 164559, 164424, 164076, 163467, 162701, 162175, 162025, 161958, 161819, 161801, 161903, 161708, 161056, 160454, 160402, 160726, 161023, 161417, 162346, 163822, 165411, 166828, 168080, 169110, 169718, 169862, 169717, 169475, 169359, 169725, 170723, 171862, 172344, 172026, 171698, 172126, 173041, 173397, 172618, 171215, 170061, 169358, 168659, 167732, 166941, 166648, 166668, 166587, 166333, 166117, 166035, 166069, 166290]
54218A66290L70J36m48q53q45q70j212j347o89M64J255J276P42On64n67m2L18
54200A63420Qm50j75P64J386J086L05j72n1L67N61K11n26j152j317j022l58M68
54182A63353P99K4j276j532k08J261J335M11r5N2j1m26l97K32O30L60j11m82j012
54163A62907j608j624r84l94j93O3N12O31L13K10M80L30n45j256j151r29j289
54146A55473j508n63J061J894J474O39J08j36j90M2L85M98M96Q34J496J916J716
54129A65635J102M61M0q5n2j76m75m82N4O24O39L33L19N03K87k91n29k13J45L30
54109A68169Q17J732K337K048J311Q29M97j05p21p39k73n4k46k12M24J146J231
54092A78191N94k99q97p42K80J499J843J027m5m59m15n91r04p41r2L86M51N09
$$ y = [166290, 166660, 166796, 166348, 165495, 164650, 163780, 162568, 161221, 160532, 160996, 162251, 163527, 164269, 164275, 163711, 163144, 163102, 163420, 163428, 162978, 162803, 163567, 164953, 166039, 166344, 166172, 166121, 166488, 167049, 167260, 166734, 165582, 164265, 163243, 162885, 163353, 164152, 164176, 162900, 161368, 161160, 162421, 163756, 164167, 164072, 164124, 164113, 163687, 163290, 163522, 164152, 164512, 164401, 163919, 162907, 161299, 159675, 158691, 158297, 158104, 158167, 158679, 159310, 159623, 159833, 160313, 160643, 160098, 158842, 157691, 156762, 155473, 153965, 153402, 154463, 156357, 157831, 158470, 158578, 158442, 158252, 158294, 158679, 159177, 159673, 160507, 162003, 163919, 165635, 166737, 167198, 167238, 167153, 167101, 166925, 166450, 165968, 166022, 166646, 167285, 167618, 167937, 168440, 168727, 168436, 167907, 167694, 167839, 168169, 168986, 170718, 173055, 175103, 176414, 177243, 177740, 177635, 176914, 176175, 175902, 175848, 175602, 175390, 175814, 176960, 178191, 178785, 178486, 177589, 176847, 177127, 178626, 180469, 181496, 181451, 180992, 180577, 179986, 179082, 178341, 178249, 178635, 179086, 179595]
54074A79595P27Q01P56J094J823K220J958J661J843K104K071K251L139M202M755
54059B11000N230O448Q005Q624P972O992O380N822M900L782K734J683N68n88k004
54044B77548l883n694o462n935m745l395j877l61O86J282J975K815L231L180L409
54029B61774M165M631M234L505K973K202Q79j10J63J031J016o8j030j172j115
54014B83078j556k173k279j889j712k220l142l792l891l892m314m878m778l827
54000B38735k708j914j199m58l11j138k175k415j945j550j401j099p48q88j395
53985B17391j475r00l43k80l72k55k02n18q81p91l23J3rj55j29J30N34J036J653
53966B14124K313K770K893K991L563M464M805M082L099L103M155M956M377K603
$$ y = [179595, 180322, 181123, 181879, 182973, 184796, 187016, 188974, 190635, 192478, 194582, 196653, 198904, 202043, 206245, 211000, 216230, 222678, 230683, 239307, 247279, 254271, 260651, 266473, 271373, 275155, 277889, 279572, 280140, 279552, 277548, 273665, 267971, 261509, 255574, 250829, 247434, 245557, 245196, 245882, 247164, 249139, 251954, 255185, 258365, 261774, 265939, 270570, 274804, 278309, 281282, 283484, 284363, 284253, 284416, 285447, 286463, 286395, 285365, 284193, 283078, 281522, 279349, 277070, 275181, 273469, 271249, 268107, 264315, 260424, 256532, 252218, 247340, 242562, 238735, 236027, 234113, 232914, 232456, 232145, 231007, 228832, 226417, 224472, 222922, 221521, 220422, 219674, 218786, 217391, 215916, 215016, 214673, 214393, 214021, 213766, 213564, 213046, 212165, 211374, 211051, 211064, 211055, 210900, 210771, 210901, 211435, 212471, 214124, 216437, 219207, 222100, 225091, 228654, 233118, 237923, 242005, 245104, 248207, 252362, 257318, 261695, 264298]
53952B64298O58o57j143j036q22r59j456j876j846j408q40k94K23P59J412K242
53936B57255L130L805M096M007L636L085K482J937J532J423J811K592L297L649
53922B97737L966M692N632O176O210O289O790P396P700P826Q152Q697R166R495
53908C95924R941J0581J1119J1319J1398J1670J1896J1314R481O813M089J648
53896E07193p08l246o174r739j3799j7331j9088j8971j8099j7246j5959j3703
53884C53130j1062r076p894o913n896n056m380l776l602m142m630l970k471j732
53870B78530k460l490l523k883k721l215l519l136k474k107k152k411k647k675
53856B39117k483k280k191k065j783j545j506j427j055o74p39j104j142o75k33
$$ y = [264298, 264956, 264299, 263156, 262120, 261298, 260339, 258883, 257007, 255161, 253753, 252913, 252619, 252842, 253601, 255013, 257255, 260385, 264190, 268286, 272293, 275929, 279014, 281496, 283433, 284965, 286388, 288199, 290791, 294088, 297737, 301703, 306395, 312027, 318203, 324413, 330702, 337492, 344888, 352588, 360414, 368566, 377263, 386429, 395924, 405865, 416446, 427565, 438884, 450282, 461952, 473848, 485162, 494643, 501456, 505545, 507193, 506485, 503239, 497065, 487326, 473527, 456196, 437108, 418137, 400038, 382792, 366833, 353130, 342068, 332992, 325098, 318185, 312289, 307233, 302853, 299077, 295475, 291333, 286703, 282733, 280262, 278530, 276070, 272580, 269057, 266174, 263453, 260238, 256719, 253583, 251109, 249002, 246850, 244439, 241792, 239117, 236634, 234354, 232163, 230098, 228315, 226770, 225264, 223837, 222782, 222108, 221369, 220265, 219123, 218448, 218215]
53841B18215k42m47m74m97q99j472j496p04K67O15K71k01m23n02n62l92J91R05
53823B12153J235J050P89R74J617K163J980J048O4k01K84Q83J176J356J634J778
53807B29983J656J883L127M877N712M995L765L430M115M729M473L681L145L160
53793B82731L427L587L543L317K901K330J747J253P60J31n73j105j338j438j700
53778B99573k290l162m052m578m501l978l436l199l323l700m056l971l306k661
53764B49360k830l697m135l361j879p37l66n84j239k140k684k333j387o60m28
53749B20900l37k22l18n88n91j48L64O40Q21J006R43N19R0RJ31J32K7Q6M35R26
53729B24825J312J424J319J270J388J399J079Q10J116J790K090J825J554J569
$$ y = [218215, 217973, 217526, 217052, 216555, 215656, 214184, 212688, 211984, 212251, 212866, 213137, 212936, 212513, 212011, 211449, 211057, 211248, 212153, 213388, 214438, 215227, 216201, 217818, 219981, 221961, 223009, 223073, 222872, 223156, 224039, 225215, 226571, 228205, 229983, 231639, 233522, 236649, 241526, 247238, 252233, 255998, 259428, 263543, 268272, 272745, 276426, 279571, 282731, 286158, 289745, 293288, 296605, 299506, 301836, 303583, 304836, 305596, 305727, 305154, 304049, 302711, 301273, 299573, 297283, 294121, 290069, 285491, 280990, 277012, 273576, 270377, 267054, 263354, 259298, 255327, 252021, 249360, 246530, 242833, 238698, 235337, 233458, 232721, 232355, 231771, 230532, 228392, 225708, 223375, 221988, 221328, 220900, 220563, 220341, 220023, 219435, 218844, 218696, 219060, 219700, 220521, 221527, 222470, 222989, 223079, 223088, 223219, 223351, 223378, 223464, 223899, 224825, 226137, 227561, 228880, 230150, 231538, 232937, 234016, 234826, 235942, 237732, 239822, 241647, 243201, 244770]
53715B44770J512J235J218J613J663Q80Q9M06J603K520K785L036L452L302K348
53700B72432J631K044K877K707J458O11J310L036M454M941M749M144L102J819
53686C11315Q09K74j34o90j113j089q77r77j397j770j955k065k001j561r93q67
53670B94909j235j484j187o89n49q71j317j508j167k92O01Q03K20n05p87o95n20
53653B83727k81J8J65J43K87N90L91o48j673j537k54J152K043K617L050L105K765
53636B95660K437K249J834J107O72R88J630J908J845J941K286K504K484K563K888
53621C24996L151L122L069L330L797M048L861L372K890K739L124L856M357M218
53607C73930L755L614L873L930L359K507J971J899K083K426K837K987K654K208
$$ y = [244770, 246282, 247517, 248735, 250348, 252011, 252891, 252980, 253386, 254989, 257509, 260294, 263330, 266782, 270084, 272432, 274063, 276107, 278984, 281691, 283149, 283760, 285070, 288106, 292560, 297501, 302250, 306394, 309496, 311315, 312124, 312398, 312264, 311574, 310461, 309372, 308495, 307518, 306121, 304351, 302396, 300331, 298330, 296769, 295776, 294909, 293674, 292190, 291003, 290314, 289765, 288894, 287577, 286069, 284902, 284610, 285211, 286014, 286234, 285729, 284942, 284247, 283727, 283446, 283464, 283629, 283772, 284059, 284649, 285040, 284392, 282719, 281182, 280928, 282080, 284123, 286740, 289790, 292895, 295660, 298097, 300346, 302180, 303287, 303959, 304947, 306577, 308485, 310330, 312271, 314557, 317061, 319545, 322108, 324996, 328147, 331269, 334338, 337668, 341465, 345513, 349374, 352746, 355636, 358375, 361499, 365355, 369712, 373930, 377685, 381299, 385172, 389102, 392461, 394968, 396939, 398838, 400921, 403347, 406184, 409171, 411825, 414033]
53593D14033K178K461K450J971J473J230J002O55M75N01J56r17k165k877l283
53578D19343m160n518o416o192n263m453m001l590k999k380k054k239k821l198
53564C64059k555p76J068J601O90l09j42Q89J533J306R13R66J132R31O40Q15J368
53547C74129J853K303L030L852M238M136L900L549K928K579L356N035O344O716
53533D27948O893P372P415O565O020P209R616J1379J1757J1641J1799J1956J1926
53520E49496J2386J3786J5371J6060J5883J5867J6726J8182J9492K0249K0583
53509G34081K0803K1051K1302K1616K2146K2755K2937K2370K1326K0280J9305
53498I69972J8279J7362J6786J6365J5769J5207J5149J5498J5644J5443J5399
$$ y = [414033, 416211, 418672, 421122, 423093, 424566, 425796, 426798, 427453, 427928, 428429, 428585, 427668, 425503, 422626, 419343, 415183, 409665, 403249, 397057, 391794, 387341, 383340, 379750, 376751, 374371, 372317, 370078, 367257, 364059, 361504, 360728, 361796, 363397, 364087, 363778, 363636, 364525, 366058, 367364, 368277, 369243, 370375, 371306, 371946, 372761, 374129, 375982, 378285, 381315, 385167, 389405, 393541, 397441, 400990, 403918, 406497, 409853, 414888, 421232, 427948, 434841, 442213, 449628, 456193, 462213, 469422, 479038, 490417, 502174, 513815, 525614, 537570, 549496, 561882, 575668, 591039, 607099, 622982, 638849, 655575, 673757, 693249, 713498, 734081, 754884, 775935, 797237, 818853, 840999, 863754, 886691, 909061, 930387, 950667, 969972, 988251, 1005613, 1022399, 1038764, 1054533, 1069740, 1084889, 1100387, 1116031, 1131474, 1146873]
53487A146873J5701J5888J5653J5386J5418J5379J4798J3836J2873J1823J0466
53476A304094R089Q061P022N254K837N99j141l029n539q018r527j0153j0842j2018
53462A276689j3064j3375j3285j3594j4487j5443j6090j6639j7350j8006j8222
53451A107134j7990j7635j7372j7176j6974j6683j6136j5209j3995j2670j1243
53440I34051r723q325p197o086m634l025j813j087k92R69K390L516M360N146N863
53425I14113O534P582R332J1328J2708J3308J3833J4869J6263J7645J9100K0933
53413A077548K3089K5160K6789K7774K8068K8054K8657L0621L3618L6421L8125
53402A403924L8941L9721M1028M2774M4458M5546M5886M5967M6544M7802M9110
$$ y = [1146873, 1162574, 1178462, 1194115, 1209501, 1224919, 1240298, 1255096, 1268932, 1281805, 1293628, 1304094, 1313183, 1321244, 1328266, 1333520, 1336357, 1336956, 1335815, 1332786, 1327247, 1319229, 1309702, 1299549, 1288707, 1276689, 1263625, 1250250, 1236965, 1223371, 1208884, 1193441, 1177351, 1160712, 1143362, 1125356, 1107134, 1089144, 1071509, 1054137, 1036961, 1019987, 1003304, 987168, 971959, 957964, 945294, 934051, 924328, 916003, 908806, 902720, 898086, 895061, 893248, 892161, 891869, 892838, 895228, 898744, 903104, 908250, 914113, 920647, 928229, 937561, 948889, 961597, 974905, 988738, 1003607, 1019870, 1037515, 1056615, 1077548, 1100637, 1125797, 1152586, 1180360, 1208428, 1236482, 1265139, 1295760, 1329378, 1365799, 1403924, 1442865, 1482586, 1523614, 1566388, 1610846, 1656392, 1702278, 1748245, 1794789, 1842591, 1891701]
53391A891701M9772M9666M8968M7677M5866M4060M2701M1475L9740L7498L5218
53380B374342L2849K9822K6132K2511J9219J5593J1186O505K102k418p613j3140
53368B517090j8272k2967k7585l1888l5413l8500m1882m5282m7579m8496m9028
53357B110198m9810n0127m9137m7247m5527m4301m3099m1585l9890l8216l6770
53346A624489l5894l5710l5717l5185l3899l2139l0107k7849k5652k3946k2775
53335A285616k1730k0560j9364j8117j6449j4250j2209j1219j1388j1900j1983
53324A116447j1651j1337j1089j0479r329q107p365p008o421n291l947k852k029
53311A019542j134jJ176K147K952L857N065O569Q290J0183J2097J3692J4777J5726
$$ y = [1891701, 1941473, 1991139, 2040107, 2087784, 2133650, 2177710, 2220411, 2261886, 2301626, 2339124, 2374342, 2407191, 2437013, 2463145, 2485656, 2504875, 2520468, 2531654, 2538159, 2540261, 2537843, 2530230, 2517090, 2498818, 2475851, 2448266, 2416378, 2380965, 2342465, 2300583, 2255301, 2207722, 2159226, 2110198, 2060388, 2010261, 1961124, 1913877, 1868350, 1824049, 1780950, 1739365, 1699475, 1661259, 1624489, 1588595, 1552885, 1517168, 1481983, 1448084, 1415945, 1385838, 1357989, 1332337, 1308391, 1285616, 1263886, 1243326, 1223962, 1205845, 1189396, 1175146, 1162937, 1151718, 1140330, 1128430, 1116447, 1104796, 1093459, 1082370, 1071891, 1062562, 1054455, 1047090, 1040082, 1033661, 1028370, 1024423, 1021571, 1019542, 1018408, 1018407, 1019583, 1021730, 1024682, 1028539, 1033604, 1040173, 1048463, 1058646, 1070743, 1084435, 1099212, 1114938]
53297A114938J7152J9066K0725K1614K2170K3124K4337K4960K4632K3898K3301
53286A359917K2649K1464J9759J7961J6311J4620J2508R669O175K654j33k114
53274A501440m067o681r620j1969j3411j4561j6137j8124j9968k1260k2066k2681
53262A320895k3292k3904k4479k5006k5424k5607k5560k5568k5919k6455k6606
53251A043075k5954k4657k3273k2246k1670k1377k1180k1017k0929k0817k0378
53240G99577j9449j8363j7625j7211j6566j5407j4151j3247j2455j1201r497q035
53228F26370p364p289p234o953o783p247q461r903j0820j0956j0784j0897j1310
53215E10369j1553j1348j0914j0594j0457j0323r914q956p423n869n172n649o542
$$ y = [1114938, 1132090, 1151156, 1171881, 1193495, 1215665, 1238789, 1263126, 1288086, 1312718, 1336616, 1359917, 1382566, 1404030, 1423789, 1441750, 1458061, 1472681, 1485189, 1494858, 1501033, 1503687, 1503554, 1501440, 1497373, 1490692, 1481072, 1469103, 1455692, 1441131, 1424994, 1406870, 1386902, 1365642, 1343576, 1320895, 1297603, 1273699, 1249220, 1224214, 1198790, 1173183, 1147623, 1122055, 1096136, 1069681, 1043075, 1017121, 992464, 969191, 946945, 925275, 903898, 882718, 861701, 840772, 819955, 799577, 780128, 761765, 744140, 726929, 710363, 694956, 680805, 667558, 655103, 643902, 634405, 626370, 619006, 611717, 604483, 597530, 590747, 583500, 575039, 565136, 554316, 543360, 532576, 521679, 510369, 498816, 487468, 476554, 465960, 455503, 445180, 435266, 426310, 418887, 413018, 407846, 402197, 395655]
53202C95655o761o077n186m676m379m042m096n079o490o972n883m158l179l234
53188C25443l518l393k986k614k262j906j750j902k044j855j487j295j247j042
53174B96142p12o77j074j453j382j052r53j141j283j311j522j854j677p36J29
53159B79444j3p94r61l17j49j268k533k282p23L15j44j084j126l46J79p6o78j110
53141B66334j303j348j201q21l35P1K81K36j6k36q3N60J384J846J667J105O40
53124B68781M45L32J61Q0K05M25P22J307K091K400J773Q60Q07J751K553K239J092
53107B88024Q7k64j62j3j19n61j097j316j131r65j257j971k714l117k956k267
53091B68201j453j023r97r20n89l52m52m85O9J042J720J647R89K68l9J43L79J99
$$ y = [395655, 388894, 382817, 377631, 372955, 368576, 364534, 360438, 355359, 348869, 341897, 336014, 331856, 328677, 325443, 321925, 318532, 315546, 312932, 310670, 308764, 307014, 305112, 303068, 301213, 299726, 298431, 297184, 296142, 295430, 294753, 293679, 292226, 290844, 289792, 288839, 287698, 286415, 285104, 283582, 281728, 280051, 279315, 279444, 279431, 278637, 277676, 277359, 277210, 275942, 273409, 271127, 270404, 270719, 270575, 269491, 268365, 268019, 268198, 268122, 267444, 266334, 265031, 263683, 262482, 261661, 261326, 261397, 261678, 261914, 261898, 261662, 261579, 262139, 263523, 265369, 267036, 268141, 268781, 269226, 269558, 269719, 269799, 270004, 270429, 271151, 272458, 274549, 276949, 278722, 279582, 280389, 282140, 284693, 286932, 288024, 288111, 287847, 287685, 287672, 287553, 286992, 285895, 284579, 283448, 282483, 281226, 279255, 276541, 273424, 270468, 268201, 266748, 265725, 264728, 263808, 263219, 262867, 262415, 261930, 261999, 263041, 264761, 266408, 267397, 267665, 267626, 267769, 268148, 268347]
53073B68347j89q2O17J010L59q30j488j388j250j574k036k079j517n40M29Q82
53057B58671O25O5l12n83j120j761j871j274m86L3K88K42l83j414j929j313k07
53040B47271K23k06o03l68O5R8r9R5P67J408J622J444R25mj159k006k229j992
53022B45252j466n28O58J295Q59L8%Q18J447J229N88Q4k72m34M5J130J865J529
53004B54137P33N46R18Q71K8r07j180p96j89L11N35M23J02j82k86k26j02j12l52
52985B54272m81M1J104J850J768J359J256J280J071J013J615K363K278J396O65
52970B72850N08N24O00J148K025K362J805J026O55N68N83R04J404J388O34j17
52954B88867k97l66q82j550j869k073k599l231l542l613l592l085j875p18m65
$$ y = [268347, 268158, 268076, 268693, 269703, 270062, 269232, 267744, 266356, 265106, 263532, 261496, 259417, 257900, 257360, 257789, 258671, 259296, 259361, 259049, 258466, 257346, 255585, 253714, 252440, 251954, 251987, 252275, 252517, 252134, 250720, 248791, 247478, 247271, 247494, 247288, 246685, 246317, 246382, 246480, 246381, 246476, 247243, 248651, 250273, 251717, 252642, 252638, 251479, 249473, 247244, 245252, 243786, 243258, 243916, 245211, 246070, 246108, 246108, 246926, 248373, 249602, 250190, 250274, 250002, 249568, 249613, 250743, 252608, 254137, 254870, 255416, 256334, 257205, 257233, 256326, 255146, 254350, 254161, 254472, 255007, 255430, 255532, 255350, 255064, 254838, 254736, 254624, 254272, 253791, 253832, 254936, 256786, 258554, 259913, 261169, 262449, 263520, 264533, 266148, 268511, 270789, 272185, 272850, 273358, 273882, 274482, 275630, 277655, 280017, 281822, 282848, 283503, 284071, 284654, 285558, 286962, 288350, 288984, 288867, 288570, 288204, 287322, 285772, 283903, 281830, 279231, 276000, 272458, 268845, 265253, 262168, 260293, 259575, 259110]
52939B59110p93p85m25m20q15r39p06p82j307j536j083m94k43q6J73J50k67l84
52921B48368K16P57K70r19j550r89K34J262J554R54j19o18J53J433J715O69m99
52904B52891q17p70j099j383q25J14K20n43q75j81N36L68k1M17J303J458Q58N80
52886B52231R30R81K59m09l18q6n58j301j247l22N43P78O25L21j31l31M09J931
52868B54305K979K578J249L19M56J281K095K479K300J690J058P75P48N21j52j019
52852B73662j687k024k141k151k092k084k315k800l230l251k882k460k131j649
52838B40765q83k35j46l44j32N38R12N49L8P8L73J69l70k61P24J444Q28o74j672
52819B41701j504p39k28k35n03o18k87L77Q31O95M07P78J840K655K454J482M38
$$ y = [259110, 258317, 257532, 257107, 256687, 255872, 254933, 254227, 253445, 252138, 250602, 249519, 249025, 248782, 248696, 248869, 249019, 248752, 248368, 248584, 249341, 249611, 248692, 247142, 246153, 246387, 247649, 249203, 250157, 250038, 249420, 249573, 251006, 252721, 253390, 252891, 252074, 251304, 250205, 248822, 247997, 248111, 248331, 247788, 246913, 246732, 247268, 247636, 247615, 248032, 249335, 250793, 251651, 252231, 253161, 254142, 254401, 253992, 253674, 253588, 253030, 251729, 250482, 250160, 250703, 251481, 252106, 252427, 252296, 251965, 252374, 254305, 257284, 259862, 261111, 261430, 261886, 263167, 265262, 267741, 270041, 271731, 272789, 273564, 274312, 274833, 274681, 273662, 271975, 269951, 267810, 265659, 263567, 261483, 259168, 256368, 253138, 249887, 247005, 244545, 242414, 240765, 239882, 239647, 239501, 239157, 239025, 239563, 240475, 241024, 241062, 241140, 241513, 241682, 241312, 241051, 241775, 243219, 244047, 243373, 241701, 240197, 239458, 239230, 238995, 238492, 237874, 237587, 237964, 238795, 239490, 239897, 240675, 242515, 245170, 247624, 249106, 249544]
52802B49544m18j171j646j514q71k33N7Q6M4M3J33K60J62l28r84j417j560j594
52784B38593j474r85k60K04J64m8j4L47Q59J267J218M98m87q57k44O60R16M72
52766B40829L7N7K06k3o40j161j088l05P97J533J454P79J89J09L39M61M01L90
52748B44364N05N50M37L48L83L42J25J05O78J535J891J488Q70N53M59M16O10J075
52730B56734J315R84N69O79J013Q18J72j31J23K85k4m45p02j015j372j299q44
52713B56860q88j792k522j999o78J25N6j13M2Q6l01p59r35r47r00n62J13O55O40
52694B46181K50o2j19J1L95J068J678J665R08j0l37J53J016J660J839J635J181
52677B59112N91Q9j04r0j63l33j96M51J251J649J481R32K98n4K20R72J458J105
$$ y = [249544, 249126, 247955, 246309, 244795, 243924, 243691, 243748, 243834, 243878, 243921, 244054, 244314, 244476, 244148, 243164, 241747, 240187, 238593, 237119, 236134, 235874, 236078, 236242, 236194, 236180, 236527, 237386, 238653, 239871, 240369, 239882, 239025, 238781, 239441, 240357, 240829, 240866, 240923, 241129, 241106, 240466, 239305, 238217, 237912, 238709, 240242, 241696, 242475, 242664, 242773, 243112, 243573, 243974, 244364, 244869, 245419, 245856, 246204, 246587, 246929, 247054, 247159, 247837, 249372, 251263, 252751, 253621, 254174, 254633, 255049, 255659, 256734, 258049, 259033, 259602, 260281, 261294, 262112, 262284, 262153, 262276, 262561, 262537, 262092, 261390, 260375, 259003, 257704, 256860, 255972, 254180, 251658, 249659, 248981, 249106, 249162, 249049, 249091, 249177, 248876, 248117, 247182, 246235, 245335, 244773, 244886, 245541, 246181, 246431, 246369, 246250, 246261, 246656, 247724, 249402, 251067, 251975, 251965, 251628, 251781, 252797, 254457, 256296, 257931, 259112, 259703, 259792, 259688, 259598, 259435, 259102, 258906, 259357, 260608, 262257, 263738, 264670, 264968, 264914, 265134, 266106, 267564, 268669]
52659B68669K26m42o37n90l65K19J010J438J182M89j59l83oP39J059K73j235k235
52641B69252k012j076l32n3j5o6j52l7M23R30J039P74N77P10J030J304J483J561
52623B75340J508J406J441J643J747J453P93Q9m18q37j426k151k627k520j894
52608B73547j059k23M92Q95Q41N28L18K66N5m53r56j101r13n85q9P18J664K248
52590B76193K129J496Q59N34L91O9n20r86q52j15O92J096J109J018R00O44L26
52573B84983K64N36P49M95p0m03l16k06m23p40p45n07m05m55l00P0J69j95m99
52554B82002k81J33J42j96l14m0K63L62M08M48K96kq2R9J5p04j646k095j886j430
52534B75492j040o01J07J002J709J865J448Q40M95M97N06J75m40r34q79j71Q47
$$ y = [268669, 268895, 268453, 267816, 267226, 266861, 267080, 268090, 269528, 270710, 271199, 271040, 270657, 270651, 271390, 272449, 272722, 271487, 269252, 267240, 266164, 265832, 265779, 265764, 265698, 265546, 265509, 265932, 266862, 267901, 268675, 269252, 269962, 270992, 272296, 273779, 275340, 276848, 278254, 279695, 281338, 283085, 284538, 285331, 285420, 285002, 284165, 282739, 280588, 277961, 275441, 273547, 272488, 272265, 272757, 273652, 274493, 275021, 275339, 275605, 275660, 275207, 274251, 273150, 272237, 271652, 271563, 272281, 273945, 276193, 278322, 279818, 280677, 281211, 281602, 281671, 281151, 280165, 279313, 279198, 279890, 280986, 282095, 283113, 284013, 284657, 284983, 285247, 285783, 286532, 287027, 286957, 286554, 286238, 286032, 285609, 284869, 284124, 283617, 283212, 282757, 282457, 282527, 282696, 282501, 282002, 281721, 281854, 281996, 281800, 281486, 281446, 281709, 282071, 282479, 282927, 283223, 283221, 283139, 283238, 283253, 282549, 280903, 278808, 276922, 275492, 274452, 273851, 273958, 274960, 276669, 278534, 279982, 280822, 281317, 281814, 282320, 282495, 282055, 281121, 280242, 280071, 280918]
52517B80918J591J721J427J141J123J476K302L416M124L846L000K558K652K283
52503C13578Q46q49j679j814k276l255l750l081j905j353j642k014j783j074n94
52488B87355q37j553j970j597p41n6K68N28Q55R93Q48P56R16R75N70mj22L61J080
52469B88625J768K412K883K926K690K688L021L141K677K079J900J891J403N19
52455C20623JJ31K80j32q94j568k227l111l943m146l623k818k163j779j655j691
52439B91285j611j219p27m96n51o94r27j323j528j013J08J022J172P82K78k73
52423B84285q15r19k68P86J619K109K587L165L596L762L852M018M232M549N200
52408C21758O259P401Q196Q523Q620Q696Q601P866O115L518P32j619l431n042
$$ y = [280918, 282509, 284230, 285657, 286798, 287921, 289397, 291699, 295115, 299239, 303085, 306085, 308643, 311295, 313578, 314424, 313575, 311896, 310082, 307806, 304551, 300801, 297720, 295815, 294462, 292820, 290806, 289023, 287949, 287355, 286518, 284965, 282995, 281398, 280657, 280601, 280869, 281397, 282252, 283245, 284093, 284849, 285765, 286740, 287310, 287306, 287184, 287545, 288625, 290393, 292805, 295688, 298614, 301304, 303992, 307013, 310154, 312831, 314910, 316810, 318701, 320104, 320623, 320624, 320755, 321035, 320903, 320009, 318441, 316214, 313103, 309160, 305014, 301391, 298573, 296410, 294631, 292976, 291285, 289674, 288455, 287728, 287232, 286681, 285987, 285060, 283737, 282209, 281196, 281304, 282326, 283498, 284280, 284558, 284285, 283470, 282551, 282283, 283069, 284688, 286797, 289384, 292549, 296145, 299907, 303759, 307777, 312009, 316558, 321758, 328017, 335418, 343614, 352137, 360757, 369453, 378054, 385920, 392035, 395553, 396285, 394666, 391235, 386193]
52394C86193o736q377r491r626q759p348n957m811l811k861j998j227m84J14L02
52379C15123J05n4J52N88J046J700K795M007M638M456L973L773L896M028M005
52364C54231L873L550K808J638M64k05l13k74m07n73n61n34p76j038p74j8N21
52347C61612N74Q12J774K792K900K439K777M378O099O768O599O490O663O732O701
52332D26110P059P979R165J0450J1933J3454J4532J5011J5286J5686J6127J6575
52320E79367J7333J8487J9466J9613J8925J7854J6700J5654J5143J5389J5769
52309G69700J5339J4089J2969J2503J2134J1276J0299R833R670R100Q035O996
52297I01943O141N069L575J923L08j340k880l918m445m983n838o752p458q032
$$ y = [386193, 379457, 371080, 361589, 351963, 343204, 335856, 329899, 325088, 321277, 318416, 316418, 315191, 314707, 314821, 315123, 315228, 315174, 315326, 315914, 316960, 318660, 321455, 325462, 330100, 334556, 338529, 342302, 346198, 350226, 354231, 358104, 361654, 364462, 366100, 366564, 366359, 366046, 365772, 365365, 364792, 364231, 363697, 362921, 361883, 361109, 361091, 361612, 362186, 362998, 364772, 367564, 370464, 372903, 375680, 380058, 386157, 392925, 399524, 406014, 412677, 419409, 426110, 433169, 441148, 450313, 460763, 472696, 486150, 500682, 515693, 530979, 546665, 562792, 579367, 596700, 615187, 634653, 654266, 673191, 691045, 707745, 723399, 738542, 753931, 769700, 785039, 799128, 812097, 824600, 836734, 848010, 858309, 868142, 877812, 886912, 894947, 901943, 908084, 913153, 916728, 918651, 918959, 917619, 914739, 910821, 906376, 901393, 895555, 888803, 881345, 873313]
52283H73313q317p734o137m318l088k251j157J83J325K387L915N817P362Q392
52269H69692R582J1186J2364J2369J1720J1509J1951J2323J2138J1644J1212J0893
52257A008583J0688J0680J0660J0076Q670O913N550M804M270L401J943M4j893
52244A084389l538m949o474q224r826j0893j1484j1879j2032j1706j1004j0362
52232I72018r981r678r386r266r134q318o488m303k741k051j768j593j636j879
52218H93796j893j264j8J448K583K978K813K898L887N394O356O302N729N214M764
52203I40987M268M015M261M640M500L699K716K086J969K183K457K640K789K986
52189I86196L137L192L409L968M407L953K532R15k95j293k464l809n219o653p716
$$ y = [873313, 864996, 857262, 851125, 846807, 843719, 841468, 840311, 840494, 841819, 844206, 848121, 853938, 861300, 869692, 879274, 890460, 902824, 915193, 926913, 938422, 950373, 962696, 974834, 986478, 997690, 1008583, 1019271, 1029951, 1040611, 1050687, 1059357, 1066270, 1071820, 1076624, 1080894, 1084295, 1086238, 1086282, 1084389, 1080851, 1075902, 1069428, 1061204, 1051378, 1040485, 1029001, 1017122, 1005090, 993384, 982380, 972018, 962037, 952359, 942973, 933707, 924573, 916255, 909767, 905464, 902723, 900672, 898904, 897311, 895675, 893796, 891903, 890639, 890621, 892069, 894652, 897630, 900443, 903341, 907228, 912622, 918978, 925280, 931009, 936223, 940987, 945255, 949270, 953531, 958171, 962671, 966370, 969086, 971172, 973141, 975324, 977781, 980421, 983210, 986196, 989333, 992525, 995934, 999902, 1004309, 1008262, 1010794, 1011709, 1011414, 1010121, 1007657, 1003848, 998629, 991976, 984260]
52174I84260p705o683n780n782o084n777n022m391l455j437J064K435K294K006
52160I39943K665L730M184M005L778L661L467L114K485J305j93j113r27k56J08
52145I69956L18R75J941K461K272J814J448J211J295J994L095L908M098M069M423
52130A005278N427P124R419J1904J4006J5574J7100J9048K1263K3163K4425K5198
52118A198929K5786K6257K6426K6074K5169K3871K2316K0472J8329J6087J3935
52107A443651J1775R361O812M639L105J787M0k091l746m224l848l639m097m695
52093A454830m740m407m563n595p012q218r229j0313j1287j1609j1114j0288r741
52080A346714r511q960p352m622j569R36K879M909P160Q861R413R396R904J1154
$$ y = [984260, 976555, 969872, 964092, 958310, 952226, 946449, 941427, 937036, 933581, 932144, 933208, 935643, 937937, 939943, 942608, 946338, 950522, 954527, 958305, 961966, 965433, 968547, 971032, 972337, 972144, 971031, 970104, 969848, 969956, 970274, 971249, 973190, 975651, 977923, 979737, 981185, 982396, 983691, 985685, 988780, 992688, 996786, 1000855, 1005278, 1010705, 1017829, 1027248, 1039152, 1053158, 1068732, 1085832, 1104880, 1126143, 1149306, 1173731, 1198929, 1224715, 1250972, 1277398, 1303472, 1328641, 1352512, 1374828, 1395300, 1413629, 1429716, 1443651, 1455426, 1464787, 1471599, 1476238, 1479343, 1481130, 1481170, 1479079, 1475333, 1471109, 1467261, 1463622, 1459525, 1454830, 1450090, 1445683, 1441120, 1435525, 1428513, 1420295, 1411066, 1400753, 1389466, 1377857, 1366743, 1356455, 1346714, 1337203, 1328243, 1320891, 1316269, 1314700, 1315636, 1318515, 1323424, 1330584, 1339445, 1348858, 1358254, 1368158, 1379312]
52066A379312J2422J3160J3551J3838J3820J3233J2179J0844R215P303N394L789
52054A508060K542J630J056M88p64l008n595p572q791r922j1414j2979j4220j5305
52040A424206j6594j7867j8421j8000j7253j7028j7327j7226j5936j3718j1577
52029A243259j0132r108q030p067o900p767r003r654r431q874q652q877r154r181
52015A121429r066r063r114q949q559q310q468q801q883q766q976r827j0934j1650
52001I92063j1834j2006j2711j3971j5301j6119j6072j5184j3882j2804j2264
51990H39915j1929j1199r953q759q171q093p986p642p379p531q033q650r283r909
51976G15398j0371j0573j0732j1106j1436j1008r473p377n662m712m107l230j904
$$ y = [1379312, 1391734, 1404894, 1418445, 1432283, 1446103, 1459336, 1471515, 1482359, 1491574, 1498877, 1504271, 1508060, 1510602, 1512232, 1513288, 1513776, 1513012, 1510004, 1504409, 1496837, 1488046, 1478124, 1466710, 1453731, 1439511, 1424206, 1407612, 1389745, 1371324, 1353324, 1336071, 1319043, 1301716, 1284490, 1268554, 1254836, 1243259, 1233127, 1224019, 1215989, 1208922, 1202022, 1194255, 1185252, 1175598, 1166167, 1157293, 1148641, 1139764, 1130610, 1121429, 1112363, 1103300, 1094186, 1085237, 1076678, 1068368, 1059900, 1051099, 1042216, 1033450, 1024474, 1014647, 1003713, 992063, 980229, 968223, 955512, 941541, 926240, 910121, 894049, 878865, 864983, 852179, 839915, 827986, 816787, 806834, 798075, 789904, 781811, 773825, 766183, 758804, 751273, 743240, 734590, 725307, 715398, 705027, 694454, 683722, 672616, 661180, 650172, 640699, 633322, 627660, 622948, 618841, 615611, 613707]
51963F13707l57J194K729M239N540O342O552O395O176N866N046L352Q77j871m374
51948F61413o279p317p323o474n295m234l281k150o72J124L176N388P440Q823
51934F44339R210Q671P552O259N134M253L207J327j618m983p759r544j0803j2182
51920F43063j3702j4735j4677j3516j1816j0272r225q505p647o305m506k553o54
51907E24950J317L632O294Q881J0938J2518J4149J6138J8009J8865J8244J6455
51895F70390J4058J1150P364K471l126q484j2696j5497j7348j8794j9784j9761
51883E89943j8488j6400j3993j1231p979m723k178k23K014M770P029P802P495
51870E43838P405Q085Q885Q925P900N952L364N77j978m180o080p443p934p762
$$ y = [613707, 613350, 614544, 617273, 621512, 627052, 633394, 639946, 646341, 652517, 658383, 663429, 666781, 667658, 665787, 661413, 655134, 647817, 640494, 634020, 628725, 624491, 621210, 619060, 618388, 619512, 622688, 628076, 635516, 644339, 653549, 662220, 669772, 676031, 681165, 685418, 688625, 689952, 688334, 683351, 675592, 666048, 655245, 643063, 629361, 614626, 599949, 586433, 574617, 564345, 555120, 546615, 538968, 532663, 528157, 525604, 524950, 526267, 529899, 536193, 545074, 556012, 568530, 582679, 598817, 616826, 635691, 653935, 670390, 684448, 695598, 702962, 705433, 702307, 693823, 681127, 665630, 648282, 629488, 609704, 589943, 571455, 555055, 541062, 529831, 521852, 517129, 514951, 514728, 516742, 521512, 528541, 536343, 543838, 551243, 559328, 568213, 577138, 585038, 590990, 594354, 594931, 592953, 588773, 582693, 575250, 567316, 559554]
51856E59554p607p651p222n719l421j112O76J649J512L69r45j531j371j181j449
51841E24551k053k728l340l693l648l463l623m171m578m393l708k815j847q80
51827D79611j25K20J73j21n08q08q85r02j197j885k712l404l873l950l290j807
51811D54537l6J286J952K380K965L503L402K427J088J30l15q49j923l166l871
51796D63510l931l862m006m153m035l724l390l072k826k764k721k298j458p38
51782D20532n95p55n45L21J479K250K083R62m23j124q29j7Q73K000L523M900N472
51765D40107N462N767O770P965Q801R264R514R406Q630P023M575J471j725m266
51751E18764n781o481o768o929p215p730q065p522o006m238k803j435K62J845
$$ y = [559554, 551947, 544296, 537074, 531355, 527934, 526822, 527498, 529147, 530659, 531028, 530083, 528552, 527181, 526000, 524551, 522498, 519770, 516430, 512737, 509089, 505626, 502003, 497832, 493254, 488861, 485153, 482338, 480491, 479611, 479486, 479706, 479879, 479758, 479250, 478442, 477557, 476655, 475458, 473573, 470861, 467457, 463584, 459634, 456344, 454537, 454501, 455787, 457739, 460119, 463084, 466587, 469989, 472416, 473504, 473634, 473319, 472470, 470547, 467381, 463510, 459579, 455717, 451711, 447558, 443523, 439799, 436409, 433337, 430511, 427747, 425026, 422728, 421270, 420532, 419937, 419182, 418637, 418958, 420437, 422687, 424770, 425732, 425309, 424185, 423356, 423339, 424212, 426212, 429735, 434635, 440107, 445569, 451336, 458106, 466071, 474872, 484136, 493650, 503056, 511686, 518709, 523284, 524755, 523030, 518764, 512983, 506502, 499734, 492805, 485590, 477860, 469795, 462273, 456267, 452029, 449226, 447791, 448053, 449898]
51737D49898K611K867L718N396O725O719N966N761O293O547N816M533L349K205
51723E18404O88j074k482l185l411l532l698l838l857l778l806m188m858n301
51709D72084m977l892k585j569r39m64J22R19J782K415K657K662K684K750K724
51694D76373K587K412K133J671J264J342J931K413K092Q99n52j572k071k644l823
51679D84455n195n580m417k615j482j030r9J816L753M607M514M398M678N063N255
51664D98121N188M753L897K906K164J625R60Q8p84j556k180k349j630n3J751L059
51648E15960L496L120K383J902J858J616L46k034m771p089q635r285r039q235
51634D81593p439o907o453n894n280m612l729k661j738j243j202j618k438l172
$$ y = [449898, 452509, 455376, 459094, 464490, 471215, 477934, 483900, 489661, 495954, 502501, 508317, 512850, 516199, 518404, 519092, 518018, 515536, 512351, 508940, 505408, 501710, 497872, 494015, 490237, 486431, 482243, 477385, 472084, 467107, 463215, 460630, 459061, 458122, 457658, 457780, 458699, 460481, 462896, 465553, 468215, 470899, 473649, 476373, 478960, 481372, 483505, 485176, 486440, 487782, 489713, 492126, 494218, 495117, 494565, 492993, 490922, 488278, 484455, 479260, 473680, 469263, 466648, 465166, 464136, 464037, 465853, 469606, 474213, 478727, 483125, 487803, 492866, 498121, 503309, 508062, 511959, 514865, 517029, 518654, 519614, 519702, 518918, 517362, 515182, 512833, 511203, 511150, 512901, 515960, 519456, 522576, 524959, 526861, 528719, 530335, 530681, 528647, 523876, 516787, 508152, 498867, 489828, 481593, 474154, 467247, 460794, 454900, 449620, 445008, 441279, 438618, 436880, 435637, 434435, 432817, 430379, 427207]
51620D27207l093k129j195j149j744k067j845j736k304l163l387k579j233j41
51606C99442M34Q55J516K385L194L887M597N313N879O293O695P049P223P337P615
51591D69714P733O882M843K508R67L25j05p22j368j972k755l621l861k805n53
51576D75210K215M934P487R993J2477J4764J6640J8153J9687K1635K3910K5933
51564F53038K7154K7529K7533K7906K9321L1890L4857L7073L8081L8508L9023
51553A011913L9009L6893L1950K5244J8403J1680L832o080j7279k7824l6188m2003
51541A049550m5637m7545m8013m7140m4940m1624l7790l4084l0643k7166k3586
51530F21382k0364j7902j5992j4140j2297j0850r931r141q121p072o434o180n789
$$ y = [427207, 424114, 421985, 420790, 419641, 417897, 415830, 413985, 412249, 409945, 406782, 403395, 400816, 399583, 399442, 399876, 400731, 402247, 404632, 407826, 411713, 416310, 421623, 427502, 433795, 440490, 447539, 454762, 462099, 469714, 477447, 484329, 489172, 491680, 492647, 492972, 492867, 492145, 490777, 488805, 486050, 482429, 478568, 475763, 475210, 477425, 482359, 489846, 499839, 512316, 527080, 543720, 561873, 581560, 603195, 627105, 653038, 680192, 707721, 735254, 763160, 792481, 824371, 859228, 896301, 934382, 972890, 1011913, 1050922, 1087815, 1119765, 1145009, 1163412, 1175092, 1178924, 1172844, 1155565, 1127741, 1091553, 1049550, 1003913, 956368, 908355, 861215, 816275, 774651, 736861, 702777, 672134, 644968, 621382, 601018, 583116, 567124, 552984, 540687, 529837, 519906, 510765, 502644, 495572, 489138, 482958, 477169]
51517D77169m966m073l607l468l068k187j360j187j571j901j809j377o81K86J223
51502D47423J529J093O25P78J262J278P16K18J42O7l23n38L3J036J393O05o73
51485D56664j504j679j704k022k565l028l381l930m825n611n636m968m563n096
51471D06152n948n979n078m189l748l109j916j037j321k082j961r13j68k95m99
51456C67909l1P87J387J866K502L129L624M353N499O532P031P434Q265R197R692
51441D39176J0087J1006J2029J2081J0956R457Q034O443M737L426K301L44k653
51428E27424n396o667o799o778o747o403o230p105q789r879r395p728n902m530
51414D29076l582k683j461M1J234J622J499J606K200K929L536M074M419M290L924
$$ y = [477169, 472203, 468130, 464523, 461055, 457987, 455800, 454440, 453253, 451682, 449781, 447972, 446595, 445914, 446200, 447423, 448952, 450045, 450670, 451448, 452710, 453988, 454704, 454922, 455064, 455131, 454808, 454270, 454303, 455339, 456732, 457337, 456664, 455160, 453481, 451777, 449755, 447190, 444162, 440781, 436851, 432026, 426415, 420779, 415811, 411248, 406152, 400204, 394225, 389147, 384958, 381210, 378101, 376185, 375148, 373827, 371745, 369784, 368871, 368703, 368408, 367909, 367878, 368665, 370052, 371918, 374420, 377549, 381173, 385526, 391025, 397557, 404588, 412022, 420287, 429484, 439176, 449263, 460269, 472298, 484379, 495335, 504792, 512826, 519269, 524006, 527432, 529733, 530077, 527424, 522028, 515361, 508562, 501784, 495037, 488634, 482404, 475299, 466510, 456631, 447236, 439508, 433606, 429076, 425494, 422811, 421350, 421391, 422625, 424247, 425746, 427352, 429552, 432481, 436017, 440091, 444510, 448800, 452724]
51399D52724M069M956N840O042N905O166O777P083P033P437Q847J0835J2662J4292
51385E60668J6287J8987K2170K5535K9162L3333L8013M2743M7077N1054N4980
51374I40009N8585O0535N9264N4475M7590M0331L2944K4178J2968k03j3711k6057
51362A290908l6466m4674n0756n5110n8137n9765n9549n7418n3975m9939m5527
51351G19592m0612l5333l0257k5903k2293j9038j5887j3130j1345j0626j0186
51340D84982r070p248n620m801m378l659k779k475k888l306l173k815k875l390
51326D26505l872m020l914l638l123k451j982k020k503l020l055k328j095r8J30
51311C89516r4K2O83J289J368J275J587K274K976L651M365M693M097K886J981
$$ y = [452724, 456793, 461749, 467589, 473631, 479536, 485702, 492479, 499562, 506595, 514032, 522879, 533714, 546376, 560668, 576955, 595942, 618112, 643647, 672809, 706142, 744155, 786898, 833975, 885029, 940009, 998594, 1059129, 1118393, 1172868, 1220458, 1260789, 1293733, 1317911, 1330879, 1330676, 1316965, 1290908, 1254442, 1209768, 1159012, 1103902, 1045765, 986000, 926451, 869033, 815058, 765119, 719592, 678980, 643647, 613390, 587487, 565194, 546156, 530269, 517139, 505794, 495168, 484982, 475912, 468664, 463044, 458243, 453865, 450206, 447427, 444952, 442064, 438758, 435585, 432770, 429895, 426505, 422633, 418613, 414699, 411061, 407938, 405487, 403505, 401485, 398982, 395962, 392907, 390579, 389484, 389386, 389516, 389422, 389444, 390127, 391416, 392784, 394059, 395646, 397920, 400896, 404547, 408912, 413605, 417702, 420588, 422569]
51296D22569J675J343N72k47q17j531k614l318k853j659r22j041j370j290p82
51281D07715qR38J745K044J937J830J726J366J008J322K251K787K266J221N34
51266D30682L40L00L95Q11J351J603J538J408J236Q51L50k5l59j023k087l190
51250D34181l943m214m045l594l199l121l172k841j884o81J28J87l17q17p76j32
51234D01760O16Q77N10r8m98n78n43n78n91l57M9J59m00j347j951j808j178n08
51216C93536L6M22N13K88J28N23J526K607L104K725J805J142J400K442L404L571
51200D19172L124K872L341M246M748M210K770J244K84k52r32j800k290k125j816
51185D36796j951k402k572k191j518r38o85p64q95o76n7N12O47M85L52K65J23
$$ y = [422569, 424244, 425587, 426159, 425912, 425095, 423564, 420950, 417632, 414779, 413120, 412198, 411157, 409787, 408497, 407715, 407707, 408645, 410390, 412434, 414371, 416201, 417927, 419293, 420301, 421623, 423874, 426661, 428927, 430148, 430682, 431022, 431322, 431717, 432528, 433879, 435482, 437020, 438428, 439664, 440515, 440865, 440840, 440481, 439458, 437371, 434181, 430238, 426024, 421979, 418385, 415186, 412065, 408893, 406052, 404168, 403487, 403615, 403802, 403485, 402668, 401892, 401760, 402376, 403253, 403763, 403665, 403167, 402589, 402046, 401468, 400877, 400520, 400569, 400728, 400328, 398981, 397030, 395222, 394044, 393536, 393572, 393994, 394507, 394795, 394923, 395446, 396972, 399579, 402683, 405408, 407213, 408355, 409755, 412197, 415601, 419172, 422296, 425168, 428509, 432755, 437503, 441713, 444483, 445727, 446011, 445759, 444827, 443027, 440737, 438612, 436796, 434845, 432443, 429871, 427680, 426162, 425224, 424539, 423775, 422880, 422204, 422147, 422659, 423306, 423791, 424143, 424408, 424531]
51168D24531O5K32L91K68J13M07J102J652J760J707J802J934J831J467J070Q72
51152D41204Q69P26L4j203k391k913k758k365k003j606j131o45r7O59J504J988
51136D29872J765R22j26r98j593k061k547k896k809k309j809j561j280o12K78
51121D12236R02J064Q94M53k47q67p81L18K034L517M047L512K486J777J777K350
51105D35472L188L952M068L109J595P82J135J671J342N22K79P14R88O72P6o28
51089D58937j508k124j762o47J8l53j013j090p20m52k95PK82J62k57m50k1J020
51071D49734K230K864K469J607J502K626M151N134N735O772Q514J0474J2101J3089
51057E29002J3252J2689J1983J1755J2007J2216J2083J1742J1323J0726R984R550
$$ y = [424531, 424596, 424828, 425219, 425487, 425600, 426007, 427109, 428761, 430521, 432228, 434030, 435964, 437795, 439262, 440332, 441204, 442073, 442799, 442833, 441630, 439239, 436326, 433568, 431203, 429200, 427594, 426463, 425818, 425721, 426380, 427884, 429872, 431637, 432559, 432433, 431435, 429842, 427781, 425234, 422338, 419529, 417220, 415411, 413850, 412570, 411958, 412236, 413138, 414202, 415096, 415549, 415302, 414435, 413654, 413972, 416006, 419523, 423570, 427082, 429568, 431345, 433122, 435472, 438660, 442612, 446680, 449789, 451384, 452166, 453301, 454972, 456314, 456836, 457115, 457829, 458817, 459489, 459565, 458937, 457429, 455305, 453543, 452896, 452914, 452561, 451548, 450458, 449738, 449286, 448991, 448998, 449280, 449442, 449185, 448735, 448714, 449734, 451964, 454828, 457297, 458904, 460406, 463032, 467183, 472317, 478052, 484824, 493338, 503812, 515913, 529002, 542254, 554943, 566926, 578681, 590688, 602904, 614987, 626729, 638052, 648778, 658762, 668312]
51045F68312R894J0803J1207R925O724K633q88l053m068m648n514p107r321j1545
51031F73354j3264j4510j5433j5738j5115j4013j3237j2785j1857j0120q108o262
51019E22912m357k258m14R01K067L430M719N710O731P958Q877R201R633J0924
51005E86034J2576J3449J3307J2936J2857J2846J2683J2558J2575J2483J2033
50994G26337J1190R962Q416O879N767N135M719M263L640K892K389K526K980K802
50980G99897J779J116K006M013N758O797P817R261J0891J2712J5166J8183K1116
50967I16512K3839K6988L0836L4771L8334M1801M5377M8674N1460N4009N6119
50956A368720N6700N5233N2887N1117M9714M7259M3196L8343L3445K8361K2910
$$ y = [668312, 678206, 689009, 700216, 710141, 716865, 719498, 718610, 715557, 711489, 706841, 701327, 694220, 684899, 673354, 660090, 645580, 630147, 614409, 599294, 585281, 572044, 559259, 547402, 537282, 529174, 522912, 518555, 516297, 515883, 516784, 518851, 522281, 527000, 532710, 539441, 547399, 556276, 565477, 575110, 586034, 598610, 612059, 625366, 638302, 651159, 664005, 676688, 689246, 701821, 714304, 726337, 737527, 747489, 755905, 762784, 768551, 773686, 778405, 782668, 786308, 789200, 791589, 794115, 797095, 799897, 801676, 802792, 804798, 808811, 814569, 821366, 829183, 838444, 849335, 862047, 877213, 895396, 916512, 940351, 967339, 998175, 1032946, 1071280, 1113081, 1158458, 1207132, 1258592, 1312601, 1368720, 1425420, 1480653, 1533540, 1584657, 1634371, 1681630, 1724826, 1763169, 1796614, 1824975, 1847885]
50945A847885J7631J3194R580O299L054j11l115n999q765j1167j2712j3129j3044
50932A829601j3895j6627k0513k3715k5197k5719k6764k8901l1479l3677l5391
50921A547723l7084l9031m0937m2271m2865m3000m2929m2565m1751m0553l8990
50910A095747l6744l3542k9750k6148k3081k0310j7767j5819j4569j3426j1893
50899H52698j0308r308q789q096p090o309o050n912n479m942m611m265l377j840
50885G66322j06J236J852J785J499J646K492L660M586N123N504N926O459P153
50871H15137P963Q694R366J0407J2139J4111J5491J6120J6777J8292K0756K3737
50859I88990K6913L0247L3765L7523M1698M6471N1791N7348O2899O8613P4931
$$ y = [1847885, 1865516, 1878710, 1888290, 1894589, 1897643, 1897532, 1894417, 1888418, 1879653, 1868486, 1855774, 1842645, 1829601, 1815706, 1799079, 1778566, 1754851, 1729654, 1703935, 1677171, 1648270, 1616791, 1583114, 1547723, 1510639, 1471608, 1430671, 1388400, 1345535, 1302535, 1259606, 1217041, 1175290, 1134737, 1095747, 1059003, 1025461, 995711, 969563, 946482, 926172, 908405, 892586, 878017, 864591, 852698, 842390, 833082, 824293, 816197, 809107, 802798, 796748, 790836, 785357, 780415, 775804, 771539, 768162, 766322, 766216, 767452, 769304, 771089, 772588, 774234, 776726, 780386, 784972, 790095, 795599, 801525, 807984, 815137, 823100, 831794, 841160, 851567, 863706, 877817, 893308, 909428, 926205, 944497, 965253, 988990, 1015903, 1046150, 1079915, 1117438, 1159136, 1205607, 1257398, 1314746, 1377645, 1446258, 1521189]
50848A521189Q1941Q9076R5681J01807J07952J13927J18694J21613J23229J24209
50838B599318J24032J21500J16182J08534R8931Q7503P4832O1659M7878L2857
50828C473226J7050K242j0153k0228k8524l4765l8254l8917l7317l4153l0244
50817C219963k6479k3349k0999k0004k1333k5105l0289l6233m3570n2783o2756
50806B857063p1889p9988q7802r5138j00718j03808j04767j03986j01411r7223
50796A910333r2041q6138p9293p1555o3489n5543m7863m0770l4618k9140k3752
50785A286131j8580j4394j1388q919o711n351n154n407n353n232n700o733p754
50772A179455q504r179r856j0393j0815j1406j2390j3626j4664j5115j5068j5015
$$ y = [1521189, 1603130, 1692206, 1787887, 1889694, 1997646, 2111573, 2230267, 2351880, 2475109, 2599318, 2723350, 2844850, 2961032, 3069566, 3168497, 3256000, 3330832, 3392491, 3440369, 3473226, 3490276, 3492518, 3482365, 3462137, 3433613, 3398848, 3360594, 3321677, 3284360, 3250207, 3219963, 3193484, 3170135, 3149136, 3129132, 3107799, 3082694, 3052405, 3016172, 2972602, 2919819, 2857063, 2785174, 2705186, 2617384, 2522246, 2421528, 2317720, 2212953, 2108967, 2007556, 1910333, 1818292, 1732154, 1652861, 1581306, 1517817, 1462274, 1414411, 1373641, 1339023, 1309883, 1286131, 1267551, 1253157, 1241769, 1232850, 1226139, 1220788, 1215634, 1210227, 1204874, 1199642, 1193942, 1187209, 1179455, 1170951, 1161772, 1151916, 1141523, 1130708, 1119302, 1106912, 1093286, 1078622, 1063507, 1048439, 1033424]
50760A033424j5153j4927j3729j1858j0234r153q043o482m755l106j179J342M074
50747I40221O393Q229R971J1902J4108J6738K0010K3964K8324L2497L5884L8636
50735A186877M1874M6522N1943N6518N9692O2454O5480O7919O8750O8391O7930
50724A844350O7331O5656O2712N9314N5807N1402M5362L7997L0084K1875J3215
50713B355105M235m582j2868k0435k6913l1680l4361l5206l4805l3400l0771k6857
50701B067462k2261j7821j3920j0633q442q126r817j2754j6326k0821k6687l3428
50689A866426l9891m5409n0044n3738n5894n6031n4400n1608m7865m2991l7076
50678A331479l0830k5054j9877j4756r254l603J674O369J0539J4062J6660J8347
$$ y = [1033424, 1018271, 1003344, 989615, 977757, 967523, 958370, 950327, 943845, 939090, 935984, 934805, 936147, 940221, 946614, 954843, 964814, 976716, 990824, 1007562, 1027572, 1051536, 1079860, 1112357, 1148241, 1186877, 1228751, 1275273, 1327216, 1383734, 1443426, 1505880, 1571360, 1639279, 1708029, 1776420, 1844350, 1911681, 1977337, 2040049, 2099363, 2155170, 2206572, 2251934, 2289931, 2320015, 2341890, 2355105, 2359340, 2354758, 2341890, 2321455, 2294542, 2262862, 2228501, 2193295, 2158490, 2125090, 2094319, 2067462, 2045201, 2027380, 2013460, 2002827, 1994385, 1986259, 1976442, 1963688, 1947362, 1926541, 1899854, 1866426, 1826535, 1781126, 1731082, 1677344, 1621450, 1565419, 1511019, 1459411, 1411546, 1368555, 1331479, 1300649, 1275595, 1255718, 1240962, 1231708, 1228105, 1229779, 1236148, 1246687, 1260749, 1277409, 1295756]
50666A295756J9422K0054K0204J9919J9271J8071J6198J4269J3267J3360J3732
50655A483523J3857J4182J5135J6174J6595J6759J7674J9630K2030K4383K6681
50644A686623K8841L0624L2398L5195L9569M4678M8969N1634N3086N4093N4775
50633B160485N4617N3265N0990M8318M5522M2800M0476L8430L5258K8907J8676
50622B617744O319n218j4120k0719k6633l3134l9862m4757m5589m1906l5316k7802
50610B289007k0345j3456q129n307m802n650p445j0585j5261k1031k7492l4602
50598B114902m2110m9290n5505o0563o4302o6258o6147o4359o1586n8166n4041
50587A472575m9303m4464m0100l6278l2494k8296k3921k0125j7321j5198j3337
$$ y = [1295756, 1315178, 1335232, 1355436, 1375355, 1394626, 1412697, 1428895, 1443164, 1456431, 1469791, 1483523, 1497380, 1511562, 1526697, 1542871, 1559466, 1576225, 1593899, 1613529, 1635559, 1659942, 1686623, 1715464, 1746088, 1778486, 1813681, 1853250, 1897928, 1946897, 1998531, 2051617, 2105710, 2160485, 2215102, 2268367, 2319357, 2367675, 2413197, 2455997, 2496473, 2534903, 2570161, 2599068, 2617744, 2624063, 2618845, 2604725, 2584006, 2557373, 2524239, 2484377, 2439620, 2394031, 2352125, 2316809, 2289007, 2268662, 2255206, 2247077, 2241770, 2236968, 2231318, 2223873, 2213288, 2198027, 2176996, 2149504, 2114902, 2072792, 2023502, 1967997, 1907434, 1843132, 1776874, 1710727, 1646368, 1584782, 1526616, 1472575, 1423272, 1378808, 1338708, 1302430, 1269936, 1241640, 1217719, 1197594, 1180273, 1165075, 1151738]
50576A151738j1773j0709r971r170q163o926n262l118r98N35J754L474N909Q410
50562A105730J0479J2373J4387J6120J7049J7514J8488K0370K2470K3861K4411
50551A303252K4698K5096K5354K5161K4733K4449K4228K3722K3122K3091K3832
50540A570738K4835K5963K8145L2396L8472M5122N1457N7510O3605O9820P6104
50529B084167Q2377Q8491R4398J00343J06496J12333J16877J19576J20577J20138
50519C145773J18067J13914J07360R8406Q7337P4577O0325M4511K7237R152q899
50508C877760k6390m2969n8048p0938q1201q8561r2598r3097r0431q5171p7423
50497C070933o7036n4306m0012k4977j0141L146J3706K1316K6208K7896K5338
$$ y = [1151738, 1139965, 1129256, 1119285, 1110115, 1101952, 1095026, 1089764, 1086646, 1085648, 1086183, 1087937, 1091411, 1097320, 1105730, 1116209, 1128582, 1142969, 1159089, 1176138, 1193652, 1212140, 1232510, 1254980, 1278841, 1303252, 1327950, 1353046, 1378400, 1403561, 1428294, 1452743, 1476971, 1500693, 1523815, 1546906, 1570738, 1595573, 1621536, 1649681, 1682077, 1720549, 1765671, 1817128, 1874638, 1938243, 2008063, 2084167, 2166544, 2255035, 2349433, 2449776, 2556272, 2668605, 2785482, 2905058, 3025635, 3145773, 3263840, 3377754, 3485114, 3583520, 3670857, 3745434, 3805759, 3850270, 3877507, 3886659, 3877760, 3851370, 3808401, 3750353, 3679415, 3598214, 3509653, 3417055, 3323958, 3233527, 3148356, 3070933, 3003897, 2949591, 2909579, 2884602, 2874461, 2877607, 2891313, 2912629, 2938837, 2966733, 2992071]
50486B992071J8301P735n378k0637l7370n4096o9453q3066r4980j04703j11374
50475B437050j14596j14647j12168j07940j02675r6621q9603q1661p3370o5325
50465A478444n7689n0500m4074l8666l3989k9465k4867k0526j6848j3779j0704
50454A137337p020k890Q17L609N943Q309J0177J0777J0593J0935J2066J2885J2680
50441A226218J2002J1355J0232Q286O337N287M789L991K882J974J290P40Q85K097
50427A298365L487L886L787M875P645J0818J3309J5557J8404K1788K5236K8793
50415A455950L2685L6598M0008M2895M5633M8450N1313N4056N6225N7197N6839
50404A977849N5702N4173N1818M8061M3190L7979L2478K5875J7738Q736j86q907
$$ y = [2992071, 3010372, 3018107, 3012729, 2992092, 2954722, 2900626, 2831173, 2748107, 2653127, 2548424, 2437050, 2322454, 2207807, 2095639, 1987699, 1885024, 1788403, 1698800, 1617139, 1543769, 1478444, 1420755, 1370255, 1326181, 1287515, 1253526, 1224061, 1199194, 1178668, 1161820, 1148041, 1137337, 1130317, 1127427, 1128244, 1131853, 1137796, 1146105, 1156282, 1167059, 1177652, 1188587, 1200653, 1213538, 1226218, 1238220, 1249575, 1259807, 1268093, 1274430, 1279717, 1284506, 1288497, 1291379, 1293353, 1294643, 1295383, 1296268, 1298365, 1301852, 1305738, 1309525, 1314400, 1322045, 1332863, 1346172, 1361729, 1380133, 1401921, 1427157, 1455950, 1488635, 1525233, 1565241, 1608136, 1653769, 1702219, 1753532, 1807588, 1863813, 1921010, 1977849, 2033551, 2087724, 2139542, 2187603, 2230793, 2268772, 2301250, 2327125, 2344863, 2353599, 2353413, 2344506]
50392B344506j8023k7791l7648m6620n3898n9033o1977o3007o2382n9997n5612
50381A798518m9498m2387l4640k5983j6499p412j36N215R562J3109J4693J3202
50369A677744Q926L074l427j0206j7061k3906l0791l7364m2665m5992m7776m9001
50357A381555m9936m9988m8714m6376m3537m0619l7914l5546l3397l1321k9336
50346I34871k7265k4428k0397j5893j2228r738p483m680j670Q31K862M932P172
50333H26886R292J1203J3029J4693J5892J6557J6920J7027J6561J5207J2984J0163
50321I96414P050L929R71j884m762p457r364j0044r746r134q545p802o815n942
50307I26869n508n219m451l090j694p61k06L96J350K724M323N644O250O363O821
$$ y = [2344506, 2326483, 2298692, 2261044, 2214424, 2160526, 2101493, 2039516, 1976509, 1914127, 1854130, 1798518, 1749020, 1706633, 1671993, 1646010, 1629511, 1622099, 1621963, 1627178, 1636740, 1649849, 1664542, 1677744, 1686670, 1689744, 1686317, 1676111, 1659050, 1635144, 1604353, 1566989, 1524324, 1478332, 1430556, 1381555, 1331619, 1281631, 1232917, 1186541, 1143004, 1102385, 1064471, 1028925, 995528, 964207, 934871, 907606, 883178, 862781, 846888, 834660, 824922, 817439, 812759, 811089, 811920, 814782, 819714, 826886, 836178, 847381, 860410, 875103, 890995, 907552, 924472, 941499, 958060, 973267, 986251, 996414, 1003464, 1007393, 1008364, 1006480, 1001718, 994261, 984897, 974853, 965107, 955973, 947428, 939626, 932811, 926869, 921361, 916142, 911691, 908601, 906907, 906146, 905940, 906336, 907686, 910410, 914733, 920377, 926627, 932990, 939811]
50292I39811Q135R900J1364J2296J2939J3455J3906J4522J5396J5868J4702J1161
50280A093455N834L64l644n746p000q970j2164j5551j7727j8209j7291j5228j2257
50267I65866r064o410m313k363p74k43p07j128q88n59p62j016n08N92J366J532
50251I40621J641K064K545K944L621M742N768O142O238P049R029J1613J3895J5475
50237A033387J6495J7230J7854J8467J8997J9077J8350J6990J5652J4787J4148
50226A221434J3116J1391R155O720M186J372k146o656j1773j6402j9630k1599
50214A189168k3182k4834k6094k6250k5090k2856j9868j6546j3541j1495j0535
50203I68877j0231j0088j0045j0548j2034j4362j6796j8622j9684k0166k0008
$$ y = [939811, 947946, 957846, 969210, 981506, 994445, 1007900, 1021806, 1036328, 1051724, 1067592, 1082294, 1093455, 1099289, 1099653, 1096009, 1090263, 1083263, 1074293, 1062129, 1046578, 1028851, 1010642, 993351, 978123, 965866, 956802, 950392, 946079, 943716, 942942, 942699, 941992, 940864, 939976, 939417, 938655, 937639, 937131, 937723, 939089, 940621, 942262, 944326, 946871, 949815, 953436, 958178, 963946, 970088, 976326, 983375, 992404, 1004017, 1017912, 1033387, 1049882, 1067112, 1084966, 1103433, 1122430, 1141507, 1159857, 1176847, 1192499, 1207286, 1221434, 1234550, 1245941, 1255096, 1261816, 1266002, 1267374, 1265228, 1258572, 1246799, 1230397, 1210767, 1189168, 1165986, 1141152, 1115058, 1088808, 1063718, 1040862, 1020994, 1004448, 990907, 979412, 968877, 958646, 948558, 938513, 927965, 915931, 901569, 884773, 866151, 846467, 826301, 806293]
50192H06293j8847j6645j4080j2068j0985j0433r770q763p742p166p108p244p236
50179F68206o979o443n550m431l520l144l103k899k253j227l3R89J444J311J172
50164F33540J604K454L159L673M470N601O478O790P063P874Q996R835J0301J0729
50150G22567J1109J0996J0174Q951P634O193M579L041J777N23j119k919m043m020
50136G75443l362k826k309r83J448M302O936R558J2557J5554J7862J9642K1813
50123H75635K4809K8115L1062L3472L5456L7133L8754M0553M2255M3257M3403
50112A273904M3095M2484M1261L9496L7894L6718L4989L1478K6035J9392J2027
50101A638773L933m733j3491k1972k9922l6837m2135m5687m7712m8204m6986m4315
$$ y = [806293, 787446, 770801, 756721, 744653, 733668, 723235, 713465, 704702, 696960, 689794, 682686, 675442, 668206, 661227, 654784, 649234, 644803, 641283, 638139, 635036, 632137, 629884, 628657, 628624, 629613, 631057, 632368, 633540, 635144, 637598, 640757, 644430, 648900, 654501, 660979, 667769, 674832, 682706, 691702, 701537, 711838, 722567, 733676, 744672, 754846, 763797, 771431, 777624, 782203, 785244, 787021, 787544, 786425, 783506, 779463, 775443, 772081, 769255, 766946, 765963, 767411, 771713, 778649, 788207, 800764, 816318, 834180, 853822, 875635, 900444, 928559, 959621, 993093, 1028549, 1065682, 1104436, 1144989, 1187244, 1230501, 1273904, 1316999, 1359483, 1400744, 1440240, 1478134, 1514852, 1549841, 1581319, 1607354, 1626746, 1638773, 1642706, 1637973, 1624482, 1602510, 1572588, 1535751, 1493616, 1447929, 1400217, 1352013, 1305027, 1260712]
50089A260712m0852l6881l2194k6971k2259j8985j6853j4779j2386j0514r993
50078A018045j0381j0397r545q653q590r057r120q629q302q521q876r024r163
50065H99787r351r123q325p665p764q248q454q454q547q225o793m803l624l472
50051G96939l053j483M66J636K080K640L560M387M983N778O990Q194Q797Q684
50037H50598Q335Q363Q915R455R387Q869Q620Q832Q758P751O231N097M486L726
50023I57423K402R19r4m57m77n92j082j889k632l028l197l409l568l339k648j788
50007I32544r74j45Q75K346M675Q011J1732J4805J6938J8956K1815K5506K9174
49994A086258L1942L3435L3790L3544L3185L2495L0633K7184K2792J8284J3434
$$ y = [1260712, 1219860, 1182979, 1150785, 1123814, 1101555, 1082570, 1065717, 1050938, 1038552, 1028038, 1018045, 1007664, 997267, 987722, 979069, 970479, 961422, 952302, 943673, 935371, 926850, 917974, 908950, 899787, 890436, 881313, 872988, 865323, 857559, 849311, 840857, 832403, 823856, 815631, 808838, 804035, 800411, 796939, 793886, 792403, 792869, 794505, 796585, 799225, 802785, 807172, 812155, 817933, 824923, 833117, 841914, 850598, 858933, 867296, 876211, 885666, 895053, 903922, 912542, 921374, 930132, 937883, 944114, 949211, 953697, 957423, 959825, 960744, 960650, 960193, 959716, 959124, 958042, 956153, 953521, 950493, 947296, 943887, 940319, 936980, 934332, 932544, 931570, 931425, 932300, 934646, 939321, 947332, 959064, 973869, 990807, 1009763, 1031578, 1057084, 1086258, 1118200, 1151635, 1185425, 1218969, 1252154, 1284649, 1315282, 1342466, 1365258, 1383542, 1396976]
49983A396976P323k15q191j5619k2359k8631l4342l9246m3299m6382m7996m7666
49971A070353m5494m2018l7756l3157k8769k4976k1709j8757j6193j4161j2395
49960G74968j0399q109o000m472l453k570j410M05K984N899Q384J0008J0976J1682
49946G88893J2246J2577J2665J2566J2202J1353R883P892N648L314Q32j837m365
49933H83869o327p902r947j2982j6321j8686j9557j9478j9168j8817j8260j7277
49921F99147j5611j3174j0381p837n653l519j515k61O7J94P89J567J872J778K052
49906F49515L195N025P047Q877J0352J1596J2906J4323J5430J5788J5355J4305
49894G83714J2853J1442J0728J0692J0169P934M178K98k711n062p238r107j0272
$$ y = [1396976, 1404299, 1404084, 1395893, 1380274, 1357915, 1329284, 1294942, 1255696, 1212397, 1166015, 1118019, 1070353, 1024859, 982841, 945085, 911928, 883159, 858183, 836474, 817717, 801524, 787363, 774968, 764569, 756460, 750460, 745988, 742535, 739965, 738555, 738960, 741944, 747843, 756227, 766235, 777211, 788893, 801139, 813716, 826381, 838947, 851149, 862502, 872385, 880277, 885925, 889239, 890071, 888234, 883869, 877542, 869640, 859693, 846711, 830390, 811704, 792147, 772669, 753501, 734684, 716424, 699147, 683536, 670362, 659981, 652144, 646491, 642972, 641457, 641196, 641263, 641457, 642246, 643813, 645685, 647463, 649515, 652710, 657735, 664782, 673659, 684011, 695607, 708513, 722836, 738266, 754054, 769409, 783714, 796567, 808009, 818737, 829429, 839598, 847532, 851710, 852008, 849297, 844235, 836997, 827890, 817618]
49881H17618j0946j1909j3683j5974j7905j8716j8343j7287j5994j4489j2800
49870F49572j1316j0317r296p403m626j992l55N35J433K502L327L774M259N117
49856F25214O200P271Q412R775J1176J2363J3482J4780J5837J5682J4010J1780
49844G65982J0132R049P711N783L615J301j407m228o304p460q539j0013j1123
49831G54499j1059j0217r489q953q213p380o716n718l770j364M21J573L029N057
$$ y = [817618, 806672, 794763, 781080, 765106, 747201, 728485, 710142, 692855, 676861, 662372, 649572, 638256, 627939, 618643, 611240, 606614, 604622, 604267, 604802, 606235, 608737, 612064, 615838, 620097, 625214, 631414, 638685, 647097, 656872, 668048, 680411, 693893, 708673, 724510, 740192, 754202, 765982, 776114, 785163, 792874, 798657, 802272, 803573, 802166, 797938, 791634, 784174, 775635, 765622, 754499, 743440, 733223, 723734, 714781, 706568, 699188, 692472, 686754, 682984, 681620, 682041, 683614, 686643, 691700]
$$ [...]
##END NTUPLES=NMR SPECTRUM
##END=
