##TITLE=AC1561_ROEFFECT0018_8270796_OJMknnd640
##JCAMPDX= 6.0         $$ Bruker NMR JCAMP-DX V2.0
##DATA TYPE= NMR SPECTRUM
##DATA CLASS= NTUPLES
##ORIGIN= BRUKER
##OWNER= Administrator
$$ 1.72 TOPSPIN		Version 2.1
$$ 2014-08-04 16:51:52.146 -0700  Administrator@X
$$ Compression mode = diff/dup
##.OBSERVE FREQUENCY= 400.02188249412
##.OBSERVE NUCLEUS= ^1H
##.ACQUISITION MODE= SIMULTANEOUS (DQD)
##.ACQUISITION SCHEME= undefined
##.AVERAGES= 8
##.DIGITISER RES= 22
##SPECTROMETER/DATA SYSTEM= spect
##.PULSE SEQUENCE= zg30
##.SOLVENT NAME= COFFEE_meoh
##.SHIFT REFERENCE= INTERNAL, COFFEE_meoh, 1, 14.98509
##AUDIT TRAIL= $$ (NUMBER, WHEN, WHO, WHERE, PROCESS, VERSION, WHAT)
$$ ##TITLE= Audit trail, TOPSPIN		Version 2.1
$$ ##JCAMPDX= 5.01
$$ ##ORIGIN= Bruker BioSpin GmbH
$$ ##OWNER= Administrator
$$ $$ E:\/data/COFFEE/nmr/AC1561_ROEFFECT0018_8270796_OJMknnd640/20/pdata/1/auditp.txt
$$ ##AUDIT TRAIL=  $$ (NUMBER, WHEN, WHO, WHERE, PROCESS, VERSION, WHAT)
(   1,<2014-08-04 16:51:44.849 -0700>,<Administrator>,<X>,<go>,<TOPSPIN 2.1>,
      <created by zg
	started at 2014-08-04 16:50:38.912 -0700,
	POWCHK enabled, PULCHK disabled,
       configuration hash MD5:
       16 EA D6 F4 BB 67 03 14 9B FF E7 A0 43 5B 48 2E
       data hash MD5: 64K
       3F EB 73 BF 00 2F F4 9C B7 4E 95 46 DF 98 16 1D>)
(   2,<2014-08-04 16:51:47.959 -0700>,<Administrator>,<X>,<proc1d>,<TOPSPIN 2.1>,
      <Start of raw data processing
       efp LB = 0 FT_mod = 6 PKNL = 1 PHC0 = 0 PHC1 = 0 SI = 32K 
       data hash MD5: 32K
       0E 2E 69 93 50 6A 9D ED 1B D2 DE 76 3B 87 7A 16>)
(   3,<2014-08-04 16:51:48.318 -0700>,<Administrator>,<X>,<proc1d>,<TOPSPIN 2.1>,
      <pk PHC0 = 89.06616 PHC1 = 0 
       data hash MD5: 32K
       AC 80 E2 B2 23 D3 CF A2 41 F7 FB F1 F1 3E 0F D6>)
(   4,<2014-08-04 16:51:48.521 -0700>,<Administrator>,<X>,<proc1d>,<TOPSPIN 2.1>,
      <abs ABSG = 1 
       data hash MD5: 32K
       D8 E5 F5 DE 87 1F 4D 0E 82 F3 7C C8 D6 22 2B A8>)
(   5,<2014-08-04 16:51:48.599 -0700>,<Administrator>,<X>,<proc1d>,<TOPSPIN 2.1>,
      <abs ABSG = 2 
       data hash MD5: 32K
       38 A4 2C B4 B4 58 5D 3B 43 3F 98 7D AB 41 1E 40>)
(   6,<2014-08-04 16:51:48.677 -0700>,<Administrator>,<X>,<proc1d>,<TOPSPIN 2.1>,
      <abs ABSG = 3 
       data hash MD5: 32K
       77 77 B0 B5 1B 18 D8 99 61 66 2E 25 0B 5A A5 EC>)
(   7,<2014-08-04 16:51:48.818 -0700>,<Administrator>,<X>,<proc1d>,<TOPSPIN 2.1>,
      <abs ABSG = 4 
       data hash MD5: 32K
       AA CC 44 29 A9 4A 00 A6 FA 6B DC E1 78 4C 81 AB>)
(   8,<2014-08-04 16:51:48.927 -0700>,<Administrator>,<X>,<proc1d>,<TOPSPIN 2.1>,
      <abs ABSG = 5 
       data hash MD5: 32K
       C4 E1 B7 08 54 CD A8 B7 87 77 CF F6 43 BA B6 09>)
$$ ##END=
$$ 
$$ $$ hash MD5
$$ $$ FA 1B 3A E9 95 99 8F 32 94 F8 29 A7 88 2C 23 EF
##$RELAX= 
##$RELAX= 
##$RELAX= 
##$RELAX= 
##$RELAX= 
##$RELAX= 
##$RELAX= 
$$ Bruker specific parameters
$$ --------------------------
##$DU= <E:\>
##$EXPNO= 20
$$ [...]
##$TP= (0..7)
150 150 150 150 150 150 150 150
##$TP07= 0
##$TPNAME0= <>
##$TPNAME1= <>
##$TPNAME2= <>
##$TPNAME3= <>
##$TPNAME4= <>
##$TPNAME5= <>
##$TPNAME6= <>
##$TPNAME7= <>
##$TPOAL= (0..7)
0.5 0.5 0.5 0.5 0.5 0.5 0.5 0.5
##$TPOFFS= (0..7)
0 0 0 0 0 0 0 0
##$TUNHIN= 0
##$TUNHOUT= 0
##$TUNXOUT= 0
##$USERA1= <user>
##$USERA2= <user>
##$USERA3= <user>
##$USERA4= <user>
##$USERA5= <user>
##$V9= 5
##$VALIST= <valist>
##$VCLIST= <CCCCCCCCCCCCCCC>
##$VD= 0
##$VDLIST= <DDDDDDDDDDDDDDD>
##$VPLIST= <PPPPPPPPPPPPPPP>
##$VTLIST= <TTTTTTTTTTTTTTT>
##$WBST= 1024
##$WBSW= 4
##$XGAIN= (0..3)
0 0 0 0
##$XL= 0
##$YL= 0
##$YMAX_a= 591899
##$YMIN_a= -516013
##$ZGOPTNS= <>
##$ZL1= 120
##$ZL2= 120
##$ZL3= 120
##$ZL4= 120
##$ABSF1= 14.98509
##$ABSF2= -5.573092
##$ABSG= 5
##$ABSL= 3
##$ALPHA= 0
##$AQORDER= 0
##$ASSFAC= 0
##$ASSFACI= 0
##$ASSFACX= 0
##$ASSWID= 0
##$AUNMP= <proc_prof1d_extract_pilot.lims>
##$AXLEFT= 0
##$AXNAME= <>
##$AXNUC= <1H>
##$AXRIGHT= 0
##$AXTYPE= 0
##$AXUNIT= <>
##$AZFE= 0.1
##$AZFW= 0.1
##$BCFW= 0
##$BC_mod= 0
##$BYTORDP= 0
##$COROFFS= 0
##$CY= 15
##$DATMOD= 1
##$DC= 0
##$DFILT= <>
##$DTYPP= 0
##$F1P= 0
##$F2P= 0
##$FCOR= 0.5
##$FTSIZE= 32768
##$FT_mod= 6
##$GAMMA= 0
##$GB= 0
##$INTBC= 1
##$INTSCL= 1
##$ISEN= 128
##$LB= 0
##$LEV0= 0
##$LPBIN= 0
##$MAXI= 10000
##$MC2= 0
##$MEAN= 0
##$ME_mod= 0
##$MI= 0
##$NCOEF= 0
##$NC_proc= -8
##$NLEV= 6
##$NOISF1= 0
##$NOISF2= 0
##$NSP= 0
##$NTH_PI= 0
##$NZP= 0
##$OFFSET= 14.98509
##$PC= 1
##$PHC0= 89.06616
##$PHC1= 0
##$PH_mod= 1
##$PKNL= yes
##$PPARMOD= 0
##$PPDIAG= 0
##$PPIPTYP= 0
##$PPMPNUM= 2147483647
##$PPRESOL= 1
##$PSCAL= 4
##$PSIGN= 0
##$PYNMP= <proc.py>
##$REVERSE= no
##$SF= 400.02
##$SI= 32768
##$SIGF1= 0
##$SIGF2= 0
##$SINO= 400
##$SIOLD= 32768
##$SPECTYP= <>
##$SREGLST= <1H.CDCl3>
##$SSB= 0
##$STSI= 32768
##$STSR= 0
##$SW_p= 8223.68421052631
##$SYMM= 0
##$S_DEV= 0
##$TDeff= 65536
##$TDoff= 0
##$TI= <>
##$TILT= no
##$TM1= 0
##$TM2= 0
##$TOPLEV= 0
##$USERP1= <user>
##$USERP2= <user>
##$USERP3= <user>
##$USERP4= <user>
##$USERP5= <user>
##$WDW= 1
##$XDIM= 32768
##$YMAX_p= 471447361
##$YMIN_p= -683608
##$CURPLOT= <Network HP LaserJet P1505>
##$CURPRIN= <$Network HP LaserJet P1505>
##$DFORMAT= <normdp>
##$LAYOUT= <+/1D_H.xwp>
##$LFORMAT= <normlp>
##$PFORMAT= <normpl>
##$SURQMSG= 1
$$ End of Bruker specific parameters
$$ ---------------------------------
##NTUPLES= NMR SPECTRUM
##VAR_NAME=  FREQUENCY,     SPECTRUM/REAL,   SPECTRUM/IMAG
##SYMBOL=    X,             R,               I
##VAR_TYPE=  INDEPENDENT,   DEPENDENT,       DEPENDENT
##VAR_FORM=  AFFN,          ASDF,            ASDF
##VAR_DIM=   32768,         32768,           32768
##UNITS=     HZ,            ARBITRARY UNITS, ARBITRARY UNITS
##FACTOR=    0.250966925370066, 1,           1
##FIRST=     8223.43324360094, 1783,         34969
##LAST=      0,             -168879,         -73761
##MIN=       0,             -683608,         0
##MAX=       8223.43324360094, 471447361,    0
$$ Real data points
##PAGE= N=1
##DATA TABLE= (X++(R..R)), XYDATA
$$ [...]
19526f3296k31717a25610E4810J45835e988B88847b60402l8964e2660b4642j76833
$$ -63296 -295013 -125610 54810 200645 -5988 288847 -260402 -299366 -52660 -24642 -201475
19515b01475a6504j93592C572J30872c9396a0459j75154k42368d0236k88059A16960
$$ -201475 -16504 -210096 3572 134444 -39396 -10459 -185613 -427981 -40236 -328295 116960
19503f4874p5323f2613B79322E3680g2852L0109F4240b3433o8120C6369J22862
$$ -64874 -140197 -62613 279322 53680 -72852 -42743 64240 -23433 -91553 36369 159231
19492A59231j8602n6633a41095d623p2663J0592a9599A36534N423b07177A49128
$$ 159231 140629 83996 -141095 -4623 -77286 -66694 -19599 136534 141957 -207177 149128
19480a72751m446C28728E8060d4059C6187d8989l37317C7285e4100E0320c53089
$$ -172751 -177197 328728 58060 -44059 36187 -48989 -386306 37285 -54100 50320 -353089
19468h0179g669p8409d2739B07366B3565J34124a83861q7034M8631A76684b68197
$$ -80179 -7669 -86078 -42739 207366 23565 157689 -183861 -270895 -222264 176684 -268197
19456e9977J1640B37102d11276c3610m4320j49615a05106l25282A22570a88691
$$ -59977 -48337 237102 -411276 -33610 -77930 -227545 -105106 -430388 122570 -188691
19445i7164L0530K9247F2270a79355A16595c13377j26063i8205j16003Q1811I2938
$$ -97164 -66634 -37387 62270 -179355 116595 -313377 -439440 -98205 -214208 -132397 92938
19433c71428L4336g132A45107a4847j34772M6986g279p4865E9275j4426g7830
$$ -371428 -337092 -7132 145107 -14847 -149619 -102633 -7279 -82144 59275 44849 -77830
19421I174O0174B3588J34480g4005l0480H6803c11300A21290a94386B5891b0112
$$ 9174 69348 23588 158068 -74005 -104485 86803 -311300 121290 -194386 25891 -20112
19409a17323k87920A0004b038B72670E3718K4145a34664r1243B66309g9885I4929
$$ -117323 -405243 10004 -2038 272670 53718 77863 -134664 -225907 266309 -79885 94929
19397B51949c48203a02504B23105h6464l1345j48081k29471F6091a12402n5333
$$ 251949 -348203 -102504 223105 -86464 -117809 -265890 -495361 66091 -112402 -167735
19387a67735B30203a0782F2341b11559B26073h8315B6136a2981l47469A79477
$$ -167735 230203 -10782 62341 -211559 226073 -88315 26136 -12981 -360450 179477
19376I4921J62399l8114b21051P9793N7703d1735m0991j6585L4396k45519a50996
$$ 94921 257320 219206 -221051 -141258 -83555 -41735 -82726 -99311 -64915 -310434 -150996
19364g4242B46815a42595O6969C6523M4931b63733J8175P6306E1856A5577f6323
$$ -74242 246815 -142595 -75626 36523 81454 -263733 -245558 -169252 51856 15577 -66323
19352A48504j4968j6299a28513p8971H57b6720F9885a25310E536K2011a61989
$$ 148504 133536 117237 -128513 -207484 857 -26720 69885 -125310 5536 27547 -161989
19340a36159G7154N7827d84800A83776E2424q270e1409B31272b9059C49258C4254
$$ -136159 77154 134981 -484800 183776 52424 44154 -51409 231272 -29059 349258 34254
19328a95994A45509i5590b8621A05304f2571J2207J2875A60200a90156l7148l191
$$ -195994 145509 -95590 -28621 105304 -62571 -50364 -37489 160200 -190156 -227304 -230495
19317b30495g1284p7020k1302F6919c66713a44659K506c6608n3874A7302a36172
$$ -230495 -71284 -148304 -169606 66919 -366713 -144659 -142153 -36608 -90482 17302 -136172
19305a13860l07410g7019D6150i3899r9458K3887O3614D54732j80917a72991C75709
$$ -113860 -421270 -77019 46150 -93899 -193357 -169470 -105856 454732 273815 -172991 375709
19293A68761B8407a48789B0066c8646N572q6054k30064c3763j14401k40718A8105
$$ 168761 28407 -148789 20066 -38646 -33074 -119128 -349192 -33763 -148164 -388882 18105
19281b12326B93805j44837c66586F3606c0334m5408k22301P3433O0247j76849
$$ -212326 293805 148968 -366586 63606 -30334 -75742 -298043 -224610 -164363 -341212
19271c41212i3410c9304A45620h6720B1631c4868C04405h32l29628B73027a93096
$$ -341212 -93410 -39304 145620 -86720 21631 -34868 304405 -832 -330460 273027 -193096
19259b7814A71325B4111h043q7694p3452f5367B08207j9380m7528a00130j46580
$$ -27814 171325 24111 -8043 -95737 -169189 -65367 208207 188827 141299 -100130 -246710
19248b46710c9933A25948g6173j2776L3788j98853R0337p2737C21374a16596K0996
$$ -246710 -39933 125948 -76173 -88949 -55161 -254014 -163677 -236414 321374 -116596 -95600
19237i5600M2208o0037b9820J0634g000C71961g2196n4001D54023F3772a56147
$$ -95600 -53392 -113429 -29820 -19186 -7000 371961 -72196 -126197 454023 63772 -156147
19225d8814l30031H9495e2715q7048k01090f2930B9854a4592A07643a38420A53561
$$ -48814 -378845 89495 -52715 -139763 -340853 -62930 29854 -14592 107643 -138420 153561
19213B12584c08658N5378A26684J58959a16603D1326a73227j35687J52192J7757
$$ 212584 -308658 -253280 126684 285643 -116603 41326 -173227 -308914 -156722 -138965
19203a38965A10986a72332a8887n21442E7418a80144K5825B8654O9338a45419
$$ -138965 110986 -172332 -18887 -540329 57418 -180144 -154319 28654 97992 -145419
19192a58170j3282a9614H9521D3952K8865J92514c32240k02867a82479A8217N3482
$$ -158170 -171452 -19614 89521 43952 72817 265331 -332240 -535107 -182479 18217 71699
19181G1699a20521j63786e6341E0946a87903A72167m3578c93892B17414a62418
$$ 71699 -120521 -284307 -56341 50946 -187903 172167 128589 -393892 217414 -162418
19170A09075B8843b97927J00115b7678j18697L3905d3222a896j41606k472k48863
$$ 109075 28843 -297927 -197812 -27678 -146375 -112470 -43222 -1896 -143502 -145974 -394837
19159c94837j03186d2939h957o3449a4551l35531P7604J18817I967c71917J29905
$$ -394837 -498023 -42939 -8957 -72406 -14551 -350082 -272478 -153661 9967 -371917 -242012
19148b42012O6422K0769H9729K04326a04801m70A19340A1850R7628f7454a4148
$$ -242012 -175590 -154821 89729 294055 -104801 -105271 119340 11850 109478 -67454 -14148
19136B28484d5298e388A21317b22774p609l8475J19166A03357b60073b620C1028
$$ 228484 -45298 -5388 121317 -222774 -230383 -268858 -149692 103357 -260073 -2620 31028
19124B57714a77441j30201B00510r673b14361b4244E5064d61314A73972K16328
$$ 257714 -177441 -307642 200510 190837 -214361 -24244 55064 -461314 173972 390300
19114C90300B6591F281a11228j64326J28122k44145A21186a37475I4319b47856
$$ 390300 26591 6281 -111228 -275554 -147432 -391577 121186 -137475 94319 -247856
19103B37218J77796b04075p551c1260A68284b11713B94876j24453k0633Q4190
$$ 237218 415014 -204075 -211626 -31260 168284 -211713 294876 170423 149790 233980
19093B33980A12995P8265a09017l1809B8650Q02b07224C345d00153a2220A42699
$$ 233980 112995 191260 -109017 -140826 28650 29452 -207224 3345 -400153 -12220 142699
19081i3060M6272a2509e923A9258K26699b3719A84775c16132a52916D6645f3434
$$ -93060 -46788 -12509 -5923 19258 245957 -23719 184775 -316132 -152916 46645 -63434
19069d8702A19915b04943B7722g2329j59491d2480G0147h6494l6571B70343e8061
$$ -48702 119915 -204943 27722 -72329 -231820 -42480 70147 -86494 -123065 270343 -58061
19057D3467L3739a80584A64437f1392n8876a4969l4440A73838a4833l41999A17817
$$ 43467 77206 -180584 164437 -61392 -120268 -14969 -49409 173838 -14833 -356832 117817
19045f970q1008p158D3542a3053m2650r894b5914r6813j15012G4581b13305G4671
$$ -6970 -87978 -95136 43542 -13053 -55703 -65597 -25914 -122727 -237739 74581 -213305 74671
19032a39930A6141g0607q4808j64361f536j24820o2551g0731B13556d01158A06343
$$ -139930 16141 -70607 -155415 -319776 -6536 -131356 -193907 -70731 213556 -401158 106343
19020C546e3704B2733J5273a47160I3169M7699l9186b71937A21727a60064A19835
$$ 3546 -53704 22733 38006 -147160 93169 140868 101682 -271937 121727 -160064 119835
19008a96136Q3949j64937c0466E5676G991K7865a79591C49944i8596B1317g5042
$$ -196136 -112187 -277124 -30466 55676 7991 35856 -179591 349944 -98596 21317 -75042
18996a89758c5672A99034o673N2568j08819a77611Q2916B75208A19822B5839g2779
$$ -189758 -35672 199034 192361 244929 136110 -177611 -94695 275208 119822 25839 -72779
18984A1432K15836d1413l99497J96254K7386a3980B42367a44724j66481A96548
$$ 11432 227268 -41413 -440910 -244656 -217270 -13980 242367 -144724 -311205 196548
18973e7896F9472b91700R7384A77462d88013b41457I7944a66534N2752D18496
$$ -57896 69472 -291700 -194316 177462 -488013 -241457 97944 -166534 -113782 418496
18962a00160j42304A9306b48568E3143c7597j33658E325a56184a2390H2472b9461
$$ -100160 -242464 19306 -248568 53143 -37597 -171255 5325 -156184 -12390 82472 -29461
18950b77007F6539b28297a8820A30029a4219b36j74389k4756e6747E328J24727
$$ -277007 66539 -228297 -18820 130029 -14219 -236 -174625 -199381 -56747 5328 130055
18939A30055c8153A14249A8326c8094p6749m3189j62630a00436k9010N6910l06104
$$ 130055 -38153 114249 18326 -38094 -114843 -158032 -320662 -100436 -129446 -72536 -378640
18928c78640J75213A57893e8094l5813K0139j13791q6767J35954d7750j70828
$$ -378640 -203427 157893 -58094 -93907 -73768 -187559 -274326 -138372 -47750 -218578
18918b18578k8819G2109I632g6455F2359i8561q9512I0107f8175E1077g7936B10222
$$ -218578 -247397 72109 9632 -76455 62359 -98561 -188073 90107 -68175 51077 -77936 210222
18905B41748j03023a47560e9440C0143d3571F6196a669B80469a34361B13334b8433
$$ 241748 138725 -147560 -59440 30143 -43571 66196 -1669 280469 -134361 213334 -28433
18893c37275J31836B88645b8798C55909a73743J8682A04617a45380A57698A3273
$$ -337275 -205439 288645 -28798 355909 -173743 -155061 104617 -145380 157698 13273
18882b34853J00677D4256a03123C9347K59087A35304c4908j97068F7558b45243
$$ -234853 -134176 44256 -103123 39347 298434 135304 -34908 -231976 67558 -245243
18871c0492B34198A4817c4808A62882g5917k4139k23454J31536d8594q9390j7670
$$ -30492 234198 14817 -34808 162882 -75917 -100056 -323510 -191974 -48594 -137984 -155654
18860a55654n9033B2350b57304m801g1046A41487a03173K662j12709f3898C69249
$$ -155654 -214687 22350 -257304 -262105 -71046 141487 -103173 -100511 -213220 -63898 369249
18848f666q850j38383a1352j56321A15627a93068e78A38672D4629R8662g4134
$$ -6666 -15516 -153899 -11352 -167673 115627 -193068 -578 138672 44629 143291 -74134
18836a72740j22876G7638a09770j0946B42021b14861j20052G8903Q2561e7826
$$ -172740 -295616 77638 -109770 -120716 242021 -214861 -334913 78903 161464 -57826
18825C8773b46937k11701J90687A5071K86702a50782l60941a20527N8941C35963
$$ 38773 -246937 -458638 -267951 15071 301773 -150782 -511723 -120527 -61586 335963
18814C18961a12509J4244A22959A5479b05837j45022a01064d268p1367G5434f6972
$$ 318961 -112509 -98265 122959 15479 -205837 -350859 -101064 -4268 -75635 75434 -66972
18802H7626b09978k41327e2455B05734i867r890A18862h7652j72665j50798a64442
$$ 87626 -209978 -451305 -52455 205734 -9867 -19757 118862 -87652 -260317 -411115 -164442
18790G7080g6360j18128g6317E4066L12717A32924J3408J05806a80488A1489b08986
$$ 77080 -76360 -194488 -76317 54066 366783 132924 146332 252138 -180488 11489 -208986
18778F0979g7406A13117b56248a7731m15980M29A31573f5264r2238A13648E6206
$$ 60979 -77406 113117 -256248 -17731 -433711 -433282 131573 -65264 -157502 113648 56206
18766B9508b3526A19985c2823m1514F924h3517j96536L9095P0509O2064A4232
$$ 29508 -23526 119985 -32823 -74337 6924 -83517 -280053 -240958 -170449 -108385 14232
18754E8641e52067A15570l6668a13457M0683B8681a01581K0139A7141c1806p5845
$$ 58641 -552067 115570 78902 -113457 -72774 28681 -101581 -81442 17141 -31806 -107651
18743a07651C54574e970k44752R9081A27325c00602Q9511H7847b65187a7873m33986
$$ -107651 354574 -5970 -250722 -151641 127325 -300602 -211091 87847 -265187 -17873 -451859
18732d51859a77862A91466B2195a6710k20529O9156A17798B7274d29058f0620
$$ -451859 -177862 191466 22195 -16710 -237239 -168083 117798 27274 -429058 -60620
18721b17891C6042a38896A48032I32c7620D1631j9048c8197l3307I0256c5251
$$ -217891 36042 -138896 148032 932 -37620 41631 22583 -38197 -71504 90256 -35251
18709b62533O4356k24934E901a643H6972b13644F8817K66345A24226K22923j59922
$$ -262533 -198177 -423111 5901 -1643 86972 -213644 68817 335162 124226 347149 187227
18698A87227b47834I2301b79516Q6246p1689d7168m38651Q7596b3842F8172e3892
$$ 187227 -247834 92301 -279516 -193270 -264959 -47168 -485819 -398223 -23842 68172 -53892
18686I1884J60530a81583m0417j16274l6473a69033A0291b63116h4211A57393
$$ 91884 252414 -181583 -222000 -338274 -374747 -169033 10291 -263116 -84211 157393
18675g773l17166B7213c30997A90971h481n6422k49378Q3817D8715a94248J3399
$$ -7773 -324939 27213 -330997 190971 -8481 -64903 -314281 -230464 48715 -194248 -180849
18664a80849m521e5873B73529k3652k4436h9421A39477b81160D00610e5340C6749
$$ -180849 -185370 -55873 273529 249877 225441 -89421 139477 -281160 400610 -55340 36749
18652C34851D0160J98980l6716c21982a40357k0846F4197e9674k3902c9936B24965
$$ 334851 40160 239140 202424 -321982 -140357 -161203 64197 -59674 -83576 -39936 224965
18640A41211f2438j71582O9216C45868f39371b45425A44963a31971a3434p3389
$$ 141211 -62438 -234020 -164804 345868 -639371 -245425 144963 -131971 -13434 -86823
18630h6823m3523C2257d3400H1141K52033a90816e469j25304b1999k34946p4806
$$ -86823 -130346 32257 -43400 81141 333174 -190816 -5469 -130773 -21999 -256945 -331751
18619c31751R0031k1245J02227j2154q8760M5056J9033B72720A2003J65537e3774
$$ -331751 -241720 -262965 -160738 -172892 -261652 -216596 -197563 272720 12003 177540 -53774
18607c50115a43004M8201k56062J64438g7890c7636B37767c88225a31840k5019
$$ -350115 -143004 -94803 -350865 -186427 -77890 -37636 237767 -388225 -131840 -156859
18597a56859c5189D5521a83160Q1822b1375A93722A1617a33212O4140I3534D1647
$$ -156859 -35189 45521 -183160 -101338 -21375 193722 11617 -133212 -69072 93534 41647
18585b74771A119g9649j12440j389B90981b230m5275A6793K23933j00213c73210
$$ -274771 1119 -79649 -192089 -193478 290981 -2230 -47505 16793 240726 140513 -373210
18573A10157m0213O2452a52615J2168N8632A21983m3948l5629a32426B17365A9175
$$ 110157 69944 132396 -152615 -140447 -81815 121983 78035 42406 -132426 217365 19175
18561b38100J02379f5167p3373C02347a58816d1416E7461d0623A68607g0351j7563
$$ -238100 -135721 -65167 -138540 302347 -158816 -41416 57461 -40623 168607 -70351 -87914
18550h7914j7015E3450b49376B21246g4109k01461J09759C7820L13368a1137m7198
$$ -87914 -104929 53450 -249376 221246 -74109 -275570 -165811 37820 351188 -11137 -58335
18539e8335a6130j73468e2626A32882D8828d00105e0057k57356G0604J49836I7685
$$ -58335 -16130 -189598 -52626 132882 48828 -400105 -50057 -307413 70604 220440 97685
18527C17354j13062F0642b19699D12211a61947B1762b36631b0382B9212K44026
$$ 317354 204292 60642 -219699 412211 -161947 21762 -236631 -20382 29212 273238
18517B73238D8389b1906I7136g3180k11649D4836Q5111a47270e9857H938P5455
$$ 273238 48389 -21906 97136 -73180 -284829 44836 129947 -147270 -59857 8938 84393
18506H4393D602g1122j06173h1239A19594c19021F2033J90001l8304o0761c7390
$$ 84393 4602 -71122 -177295 -81239 119594 -319021 62033 252034 213730 152969 -37390
18494C07894C4237J10580J56086A21022a04540B02316G2748a92739o5290j30855
$$ 307894 34237 144817 300903 121022 -104540 202316 72748 -192739 -258029 -388884
18484c88884d8093m9025p0821k79689A98319b31978C0907a34485c6088j47651
$$ -388884 -48093 -97118 -167939 -447628 198319 -231978 30907 -134485 -36088 -183739
18474a83739j0145L0869L5228k2021N9676A83424f11159f8912l47333M6550a55346
$$ -183739 -193884 -163015 -127787 -149808 -90132 183424 -611159 -68912 -416245 -369695 -155346
18462A23355m8334J07863b39900E8760Q8473L6709a27797j71577E3993a36985
$$ 123355 75021 182884 -239900 58760 147233 183942 -127797 -299374 53993 -136985
18451a08760C62975a32584c263l87364h8214j64434H1134d4319H5863d1481k21491
$$ -108760 362975 -132584 -3263 -390627 -88214 -252648 81134 -44319 85863 -41481 -262972
18440b62972R0374B9876c83455a19389A74073a25982j5198C5633J2129b92755
$$ -262972 -172598 29876 -383455 -119389 174073 -125982 -141180 35633 47762 -292755
18429e6964J4676j97825l72097b6909j51254f6609A3645d05795F5235N8199a99243
$$ -56964 -42288 -240113 -612210 -26909 -178163 -66609 13645 -405795 65235 123434 -199243
18417G5636k4266d17743J71691A41546i5762C90746A19442R5359J45561B0100
$$ 75636 51370 -417743 -246052 141546 -95762 390746 119442 214801 360362 20100
18406A9309a24876j2830D3650k766N1982L4616l3708L8162K39974b21735E2376
$$ 19309 -124876 -137706 43650 40884 92866 127482 93774 131936 371910 -221735 52376
18394F898d1466A98283J7923c2544A02500M139a06156j73894b7905B11703a21419
$$ 6898 -41466 198283 216206 -32544 102500 106639 -106156 -280050 -27905 211703 -121419
18382B44311a04009E2527a82734H611J07110C2797J27646E7681L31590b3862F7757
$$ 244311 -104009 52527 -182734 8611 115721 32797 160443 57681 389271 -23862 67757
18370i9015J6628J8133a3434o5060b7855A22586b10108Q8766n5060c1069j3117
$$ -99015 -82387 -64254 -13434 -78494 -27855 122586 -210108 -121342 -176402 -31069 -44186
18359d4186p6842B49558a17385Q406n7949j54201h1035b7542n9451m4614N6687
$$ -44186 -121028 249558 -117385 -108979 -166928 -321129 -81035 -27542 -86993 -131607 -74920
18348g4920D9682a03832A25033A2811f2871j56170A93453J37076l4589H2590a69133
$$ -74920 49682 -103832 125033 12811 -62871 -219041 193453 330529 295940 82590 -169133
18336A47790D5749c01493c4827q434j76673M8718H7603J20367b86235a40900j38084
$$ 147790 45749 -301493 -34827 -43261 -219934 -171216 87603 207970 -286235 -140900 -278984
18325b78984R4798f1128n23536c6474j5953l5249M2115J6592A78933a34708A37782
$$ -278984 -184186 -61128 -584664 -36474 -52427 -87676 -45561 -28969 178933 -134708 137782
18313d440A39217b28231K1042h8030C10990f6531a3385j89618k8421c8839j61371
$$ -4440 139217 -228231 -207189 -88030 310990 -66531 -13385 -203003 -231424 -38839 -200210
18302b00210B33186i487j2355A5945i1029A88729i1490j13286k5136k39710B583
$$ -200210 233186 -9487 -21842 15945 -91029 188729 -91490 -204776 -229912 -469622 2583
18290E7455i5086k1032p0294A70456b2644o9257H4214a38539A42968b8688H7286
$$ 57455 -95086 -116118 -186412 170456 -22644 -91901 84214 -138539 142968 -28688 87286
18278a91619I6807j7349K04968k2804f9609q2693d2646j93678O9142M7878k5461
$$ -191619 96807 79458 284426 261622 -69609 -152302 -42646 -236324 -167182 -119304 -144765
18267a44765B5717J84790A00336d19272h776o6491B11498F4617d7665k6451j92115
$$ -144765 25717 210507 100336 -419272 -8776 -75267 211498 64617 -47665 -74116 -266231
18256b66231k450f9711d28B74907F0391i5070r2022F5151a8680k50767f1886J3931
$$ -266231 -268681 -69711 -428 274907 60391 -95070 -187092 65151 -18680 -269447 -61886 -47955
18244d7955j69984A22477L71b28738H2216b91083J3835a38071G5610c08491B41950
$$ -47955 -217939 122477 122848 -228738 82216 -291083 -277248 -138071 75610 -308491 241950
18232A23990R8376J25621D9890Q0382b04156A24892J99480b88369a38367j07890
$$ 123990 222366 347987 49890 130272 -204156 124892 324372 -288369 -138367 -246257
18222b46257b983j00895B143a46986H747b44461h3264B5901b65515B29679A03109
$$ -246257 -2983 -103878 2143 -146986 8747 -244461 -83264 25901 -265515 229679 103109
18210B39595C8705h4991k30810A10417k6773C5652b44336j17881I0347e7679B37389
$$ 239595 38705 -84991 -315801 110417 83644 35652 -244336 -362217 90347 -57679 237389
18198c04959E9726M6317Q1051n2035b3836j17283j05846I5863a82632A36374d2322
$$ -304959 59726 106043 187094 135059 -23836 -141119 -246965 95863 -182632 136374 -42322
18186b0115k79724a3025D0627i686j51857a2356l75355E9767L2137a31451A40201
$$ -20115 -299839 -13025 40627 -9686 -161543 -12356 -387711 59767 91904 -131451 140201
18174D23509A9892a33710B48563a31298k47683B62982a64801j3430D442J87469
$$ 423509 19892 -133710 248563 -131298 -378981 262982 -164801 -178231 4442 191911
18164A91911D6156a10626q2598e8446B12719i1790b0242j76019m6286j11276J68507
$$ 191911 46156 -110626 -193224 -58446 212719 -91790 -20242 -196261 -242547 -353823 -185316
18153a85316A27572c7599k12403C05175K12708a38069A52405a09518A27411B7135
$$ -185316 127572 -37599 -250002 305175 517883 -138069 152405 -109518 127411 27135
18142I8068J50991a82422H1829k2449j9778c08057A81806f2222J6677k10140D8727
$$ 98068 249059 -182422 81829 59380 39602 -308057 181806 -62222 -45545 -255685 48727
18130E8311a76938d8896m9709o3273A79944B2196K21228a52789p6863c190n495
$$ 58311 -176938 -48896 -98605 -161878 179944 22196 243424 -152789 -229652 -3190 -8685
18119h685j26396A36831c4706A96754b55251A7886m646c00658B12763C8541b19173
$$ -8685 -135081 136831 -34706 196754 -255251 17886 13240 -300658 212763 38541 -219173
18107A45259a22614K5986J2522b9496j97091c0426m801I3831Q9926c63377A07141
$$ 145259 -122614 -96628 -84106 -29496 -226587 -30426 -35227 93831 183757 -363377 107141
18095e0186A96196B9405O6381N2588a30472m73268a90835C86962a36414b3224
$$ -50186 196196 29405 95786 148374 -130472 -603740 -190835 386962 -136414 -23224
18084a09873A17155a9932j75488A57409J30510A00297a59139H5656L9624j8417
$$ -109873 117155 -19932 -195420 157409 287919 100297 -159139 85656 125280 106863
18074A06863b08870F9535b18896r6419J22581e803B4026R6072a18026o1785B85297
$$ 106863 -208870 69535 -218896 -315315 -192734 -5803 24026 120098 -118026 -179811 285297
18062b36248c9510G1026a9010l4088q47k47683B17590D841a51846j99723M7835
$$ -236248 -39510 71026 -19010 -53098 -53945 -301628 217590 4841 -151846 -351569 -303734
18051c03734a41553e6374k14359E8809a69537A74870J16515a64672m6249I5140
$$ -303734 -141553 -56374 -270733 58809 -169537 174870 291385 -164672 -210921 95140
18040A05943l399a51328k0386g4041E3420Q2147c39950B37561A18177b05036M6597
$$ 105943 102544 -151328 -171714 -74041 53420 135567 -339950 237561 118177 -205036 -158439
18029a58439f7659b9555C5639a15081M7405k08072I5722J98572g9523K6128j1261
$$ -158439 -67659 -29555 35639 -115081 -67676 -275748 95722 294294 -79523 -53395 -64656
18018f4656A40125a01345A50055A1698a25055I3751i8478A25067h9250C7414j8255
$$ -64656 140125 -101345 150055 11698 -125055 93751 -98478 125067 -89250 37414 19159
18007A9159K16687G946c58990B30404i4705J6056E679c76220A82519c06016B35497
$$ 19159 235846 7946 -358990 230404 -94705 -78649 5679 -376220 182519 -306016 235497
17995B76908a48766f74l86629J64568O2665a0300l2950B36901b1982I6183C9313
$$ 276908 -148766 -674 -387303 -222735 -160070 -10300 -43250 236901 -21982 96183 39313
17983b8363j65934A4059L02298A07220a40319O0433j36767P9257A00067j0874
$$ -28363 -194297 14059 316357 107220 -140319 -79886 -216653 -137396 100067 89193
17973H9193P9053i7911A69532J3992c7420A85321a63228A39454L1605h5999I2805
$$ 89193 168246 -97911 169532 183524 -37420 185321 -163228 139454 171059 -85999 92805
17961C9854F831J00097a52622j19952F8849c56266J35587C1908a06948B13791
$$ 39854 6831 106928 -152622 -272574 68849 -356266 -220679 31908 -106948 213791
17950A84779e6315k35960R0256k19623d0411q677A43157b34124k5135C8611c37584
$$ 184779 -56315 -292275 -202019 -421642 -40411 -49088 143157 -234124 -259259 38611 -337584
17938h1982C51822a22751k3338n4785A00296b10673c3343H3097b29474J08103
$$ -81982 351822 -122751 -146089 -200874 100296 -210673 -33343 83097 -229474 -121371
17928a21371B128a25813E0055k4101f63B604b62903A26238g6985k0511j9706D7351
$$ -121371 2128 -125813 50055 25954 -663 2604 -262903 126238 -76985 -97496 -117202 47351
17915A54103C9717e03687g9129B38228H9104a47423e0999A35089a79416H9936
$$ 154103 39717 -503687 -79129 238228 89104 -147423 -50999 135089 -179416 89936
17904e6500A17560b87620a6456j54791A02515a0779J878A66631C8079J0159b34728
$$ -56500 117560 -287620 -16456 -171247 102515 -10779 -8901 166631 38079 48238 -234728
17892b31453P9967A49364h2193A12728K01414j49543N602a10379A34301D8727
$$ -231453 -151486 149364 -82193 112728 314142 164599 170201 -110379 134301 48727
17881B8093K32610D2042a0430A11224C0303a08950B18586j04758e0914C11602
$$ 28093 260703 42042 -10430 111224 30303 -108950 218586 113828 -50914 311602
17870B76208A7401a5916j87925N5379I4016a41483A4745d9248B87767c98641a91677
$$ 276208 17401 -15916 -203841 -148462 94016 -141483 14745 -49248 287767 -398641 -191677
17858A05927b03490B50732H2388H214R8528a29773I2350a08186o0039o3061G438
$$ 105927 -203490 250732 82388 8214 106742 -129773 92350 -108186 -168225 -231286 7438
17846a8161b021F1100a30542C6100f6616j49429D376a14805A91564e345j75371
$$ -18161 -2021 61100 -130542 36100 -66616 -216045 4376 -114805 191564 -5345 -180716
17835a80716A95063L36660f3138J4668j9999j24759h8479a7436g684l53542D1792
$$ -180716 195063 531723 -63138 -48470 -68469 -193228 -88479 -17436 -7684 -361226 41792
17823a60528j81726g633j0604l9168p0551C69962b25030L2700G4504N1048P062
$$ -160528 -342254 -7633 -18237 -57405 -127956 369962 -225030 -192330 74504 125552 132614
17812A32614A2483a25943G0286g5359K085A58774c72284i196j1751A0610M8025
$$ 132614 12483 -125943 70286 -75359 -73274 158774 -372284 -9196 -20947 10610 58635
17801E8635a8440k8303E6522K47751j36337g7744p7518P3053C1489J61933D2429
$$ 58635 -18440 -46743 56522 304273 167936 -77744 -155262 -82209 31489 193422 42429
17789b66916a07599F212J851b08430g6731k00903F4222J23616G1355J44633B1859
$$ -266916 -107599 6212 8063 -208430 -76731 -277634 64222 187838 71355 215988 21859
17777c05163A93309c3473r1010E3648a72644Q0541A92020I0141k433n761J47962
$$ -305163 193309 -33473 -124483 53648 -172644 -92103 192020 90141 87708 81947 229909
17766B29909f901A187d7796A14224N3248E6063a75306B89362A30038c03195a8182
$$ 229909 -6901 1187 -47796 114224 167472 56063 -175306 289362 130038 -303195 -18182
17754E5022N765K4222a29222r5289A75317H1581N0136c69578B32219a26666H3556
$$ 55022 60787 85009 -129222 -224511 175317 81581 131717 -369578 232219 -126666 83556
17742A2963J42922m1474M862A8168r022L14735A29432K4504G095R6599l5257J78713
$$ 12963 155885 114411 119273 18168 9146 323881 129432 153936 7095 103694 68437 247150
17730B47150E5220e2038B79855b19940c4969B82995a95032L0536B24330F9319
$$ 247150 55220 -52038 279855 -219940 -34969 282995 -195032 -164496 224330 69319
17719h9551l25315O5170i2126g332B43558i3206F871N2385b21410g8133D6245
$$ -89551 -414866 -349696 -92126 -7332 243558 -93206 6871 59256 -221410 -78133 46245
17707A0617a45256a0742B5545P1076a18294B29151c7274j80955H3501i7495G0986
$$ 10617 -145256 -10742 25545 96621 -118294 229151 -37274 -218229 83501 -97495 70986
17695g3054B05818G9833a62093a4707F3968f2350C9517K55267A882b20445R7519
$$ -73054 205818 79833 -162093 -14707 63968 -62350 39517 294784 1882 -220445 -122926
17684a22926B21617H5444L05078C2849b1935G9427N0586J05131j11806O9455F5455
$$ -122926 221617 85444 390522 32849 -21935 79427 130013 235144 123338 192793 65455
17672A84676F5049d8996B2564h4305C68452A10568a25957C6220a7912j2539e426
$$ 184676 65049 -48996 22564 -84305 368452 110568 -125957 36220 -17912 -30451 -5426
17660A4864K09598C6749b4647B01411r8505C7843a01225A02723R9025I693K32516
$$ 14864 224462 36749 -24647 201411 102906 37843 -101225 102723 201748 9693 242209
17649B42209c1125B19173p8612c64145f364j9820o199A77058G1943a55833g2471
$$ 242209 -31125 219173 140561 -364145 -6364 -26184 -32383 177058 71943 -155833 -72471
17637A55968M8964m6396g2953L2342j38625p4069A02548J08614f297A10682J67245
$$ 155968 204932 158536 -72953 -40611 -179236 -253305 102548 211162 -6297 110682 277927
17626B77927H5183K0254j4814l2004a35714f274q0766c8072A65132A5405Q7163
$$ 277927 85183 105437 90623 58619 -135714 -6274 -87040 -38072 165132 15405 102568
17615A02568Q4894N3028A03399d5957j08441C8136b87136A00515q681K96961g0967
$$ 102568 187462 240490 103399 -45957 -154398 38136 -287136 100515 91834 388795 -70967
17603A04566J08050O5498A21924a92688B74466H4417c4305B53050b5215l235M67
$$ 104566 212616 278114 121924 -192688 274466 84417 -34305 253050 -25215 -28450 -27983
17592b7983k26093B94235f3584A93257C4124o664R4545e7166l9124I9485a21280
$$ -27983 -254076 294235 -63584 193257 34124 27460 122005 -57166 -96290 99485 -121280
17580c43732A91500a31946C43771F2243j2919J36513a5080k1476A72671G3487
$$ -343732 191500 -131946 343771 62243 49324 185837 -15080 -36556 172671 73487
17569e642B5248J78494a26844I1663l0574K00853c7673j13712d0965j04480J8304
$$ -5642 25248 203742 -126844 91663 61089 261942 -37673 -151385 -40965 -145445 -127141
17558a27141B6012j0178K59258d8638J4969B12297f133l08428J6545J36060A19593
$$ -127141 26012 15834 275092 -48638 -33669 212297 -6133 -314561 -298016 -161956 119593
17546H8439J88084d1936C37352a34287A47h0096n0059B64116B1885a84294F4257
$$ 88439 276523 -41936 337352 -134287 147 -80096 -130155 264116 21885 -184294 64257
17534g5652r5373L176g6326A00012e0156J4746H7872f2514A19219h0618C43714
$$ -75652 -171025 -167849 -76326 100012 -50156 -35410 87872 -62514 119219 -80618 343714
17522E8756K28699B573J99887N0781n788j03631R7284b5373B00246N0850a75240
$$ 58756 287455 2573 202460 253241 247453 143822 241106 -25373 200246 251096 -175240
17510A009b4781p5857G6414J0817A2934b0512j84709B67479b1327C23222C2787
$$ 1009 -24781 -100638 76414 87231 12934 -20512 -205221 267479 -21327 323222 32787
17498A65771j112J46563a82993b8952A10253m5982j6510K68881b74600a8308j2175
$$ 165771 164659 311222 -182993 -28952 110253 64271 47761 316642 -274600 -18308 -30483
17487c0483m3616A27165E9607M9120L3850F3418C0004c73010C34019H7830Q1089
$$ -30483 -74099 127165 59607 108727 142577 63418 30004 -373010 334019 87830 168919
17476A68919J24359B5031h6995A11689J94328J6532F2137B1969J61E908J16499
$$ 168919 293278 25031 -86995 111689 306017 322549 62137 21969 22130 5908 122407
17465A22407g9544I2314d9404A64404J60116j00420O5146n2512R3911i8279A18471
$$ 122407 -79544 92314 -49404 164404 324520 224100 289246 236734 330645 -98279 118471
17453A93651p6864K01828h6871A43552M34421B76945l1938m2517l7360a4829H9572
$$ 193651 116787 318615 -86871 143552 577973 276945 245007 202490 165130 -14829 89572
17441B40070d5049B39345j3882Q1567h447A48711h3427B62634B9869J82205L6153
$$ 240070 -45049 239345 225463 307030 -8447 148711 -83427 262634 29869 212074 248227
17430B48227n2187b141B59339H3563K89443A48579a60161F8247K21525J65062
$$ 248227 196040 -2141 259339 83563 373006 148579 -160161 68247 289772 454834
17420D54834A5531K58167F3637R4057l3263L40830c1265a4967C2828J21079J21772
$$ 454834 15531 273698 63637 157694 124431 465261 -31265 -14967 32828 153907 275679
17409B75679c0288j02131B78312J76404j93914j2330q5740K53520c5321A79878
$$ 275679 -30288 -132419 278312 454716 260802 248472 162732 416252 -35321 179878
17398B6217J71597H7590M96237A61881B0989J65617O820M1476q2091J75708l4313
$$ 26217 197814 87590 583827 161881 20989 186606 193426 234902 152811 328519 294206
17387B94206p6089G6376a2644F6617M92866A36189J25086j13211A3687h0860B61780
$$ 294206 218117 76376 -12644 66617 559483 136189 261275 148064 13687 -80860 261780
17375D5882b563B74507j09311m5031g080E9818K05124A24959K13215j07319k0792
$$ 45882 -2563 274507 165196 120165 -7080 59818 264942 124959 338174 230855 210063
17364B10063N6R3317o1576J6290C6542J58910E3422L20203A79739c1512A77908
$$ 210063 210119 303436 241860 258150 36542 195452 53422 373625 179739 -31512 177908
17352B55686j18403O8135J06027j16510K72629R302C2817N4394l4361N4272J3627
$$ 255686 137283 205418 311445 194935 467564 476866 32817 87211 52850 107122 120749
17341A20749J61625K8905c0322j24113C07289m110j34225A4431J58249h1588I747
$$ 120749 282374 311279 -30322 -154435 307289 303179 168954 14431 172680 -81588 9747
17329B10534r8627c881k6237B19397a50241A00861b52750e4379B08312a46387
$$ 210534 111907 -3881 -30118 219397 -150241 100861 -252750 -54379 208312 -146387
17318B45152J28550c66025B75268j13040p6278K08689L29337A50480J50873A44256
$$ 245152 373702 -366025 275268 162228 85950 294639 623976 150480 301353 144256
17307i6931d4858A14612m7868L42666A04943a200B07977J72362j61922R2574a05977
$$ -96931 -44858 114612 66744 409410 104943 -1200 207977 380339 218417 310991 -105977
17295d4149C08611j43730j8946J162i1625I8395M5831A7118J89074J88386D3687
$$ -44149 308611 164881 145935 147097 -91625 98395 144226 17118 206192 394578 43687
17283A51923F3668K63218A6466J22560M6323J05734j23752K86912j24707C7652
$$ 151923 63668 326886 16466 139026 185349 291083 167331 454243 329536 37652
17272A91136J53828j57257J00624r8775J78893a19203b2261B2446K96669a25072
$$ 191136 344964 187707 288331 189556 368449 -119203 -22261 22446 319115 -125072
17261A96332K23127J3485e0256D86106A35808m7333l7372B2014M26920j06522
$$ 196332 419459 432944 -50256 486106 135808 88475 51103 22014 448934 342412
17251C42412F8000c183E6594B0664L65620e1368B21358a97718B88405J82337a95675
$$ 342412 68000 -3183 56594 20664 386284 -51368 221358 -197718 288405 470742 -195675
17239A94746j3791H5961N42318c1204B05861J5695O1218j16380M58328k39679
$$ 194746 180955 85961 628279 -31204 205861 221556 282774 166394 624722 385043
17229C85043G5054J09431K04405A42694R3623b061D2509j2357J00711E4260L28335
$$ 385043 75054 184485 388890 142694 236317 -2061 42509 30152 130863 54260 382595
17218C82595E8876Q9593L1934F6270O5023k6171Q5475J3163P2431J58228F6642
$$ 382595 58876 148469 180403 66270 131293 105122 190597 203760 276191 434419 66642
17206G6205K44414j29649K18907A09087L06113a89172C51926j21577g760l5395
$$ 76205 320619 190970 409877 109087 415200 -189172 351926 230349 -7760 -43155
17196d3155I5891K61636A72800J31891k6930j13478B6531K76768q5569P8919j43493
$$ -43155 95891 357527 172800 304691 277761 164283 26531 303299 217730 296649 153156
17185A53156L26993k36472Q4055j47264j3321K87568A34334K67441q9699a3537
$$ 153156 480149 243677 327732 180468 167147 454715 134334 401775 312076 -13537
17174D249M39997g3312B22764J25954j70262G097N53817G0576K33481R7978j73704
$$ 4249 444246 -73312 222764 348718 178456 7097 560914 70576 304057 402035 228331
17163B28331J596m9833p6433L3110J8240K33505A52527O3438L2408L09655j17241
$$ 228331 229927 180094 103661 136771 155011 388516 152527 215965 248373 558028 440787
17152D40787A27918K48918j35580P6721l7434j1368o8092K30836J2144B04364
$$ 440787 127918 376836 241256 317977 280543 269175 201083 431919 444063 204364
17141E30796B8970K16059K12107B14523J86614j73329K31799R8282F0097M08653
$$ 530796 28970 245029 457136 214523 401137 227808 459607 557889 60097 468750
17131D68750j66709r9349d5485C30654j26764H5724K88828n7145m7042M3198o7762
$$ 468750 302041 202692 -45485 330654 203890 85724 374552 317407 270365 313563 245801
17120B45801j7558K53344j25793A50087K82122j77224j0113J55447J09586B34906
$$ 245801 228243 481587 355794 150087 432209 254985 244872 400319 509905 234906
17109C84723J4527K72783B91272J47450l393J08279j91090J17111K0893n8105
$$ 384723 399250 672033 291272 438722 435329 543608 352518 469629 490522 432417
17099D32417j61398a8374E65760p6181j83062q5442K72468k44566K5679K35820
$$ 432417 271019 -18374 565760 489579 306517 221075 493543 248977 274656 510476
17089E10476l7533j27818J89266j18502L56601C24389n0633K72952A17484M55969
$$ 510476 472943 345125 534391 415889 772490 324389 273756 546708 117484 573453
17079E73453J754j86651m1156o5399K44189o6887l2393k4084J9529L13981O7367
$$ 573453 575207 388556 347400 282001 526190 459303 426910 402826 422355 736336 803703
17068H03703l73548Q9597n4378L81406A23243M37930K5756B36228P5607L47389
$$ 803703 430155 519752 465374 846780 123243 561173 586929 236228 311835 659224
17058F59224O8301k99491J99883j89640l3858K9192K25072l23535Q4011L21375
$$ 659224 727525 428034 627917 438277 404419 433611 658683 335148 419159 740534
17048G40534j94522J56830q5146B99118M23899B63531K41444J26204j03850Q5755
$$ 740534 546012 702842 617696 299118 723017 263531 504975 631179 527329 613084
17038F13084N0097R9683l3935k6858k27158j74420M10344l13975K30821J46516
$$ 613084 663181 762864 728929 702071 474913 300493 710837 396862 627683 774199
17028G74199l24801K63594J36495C98613K55053K66994k61971k58216N61991C85527
$$ 774199 449398 712992 849487 398613 653666 920660 658689 400473 962464 385527
17017E11507l4790K08763L1287O4131j07679j4604k42927L14265m8049J60604
$$ 511507 476717 685480 716767 780898 673219 658615 415688 729953 681904 842508
17007H42508k87726J85646o6506R2283q3228l697o7986J63966j2986J39403j91193
$$ 842508 554782 740428 673922 766205 682977 679280 611294 775260 762274 901677 710484
16996G10484M8533j31549K0964K08491M45760n61369J02922k6840k64662J96102
$$ 710484 759017 627468 648432 856923 1302683 741314 844236 817396 552734 748836
16986G48836j81499K47897Q6631r2080j26660k36686L96280K38606m46198p0871
$$ 748836 567337 815234 901865 809785 683125 446439 842719 1081325 635127 564256
16976E64256O77851j81184l29278k15266L45354j57067O5809j6312J07955K12580
$$ 564256 1242107 1060923 731645 516379 861733 704666 770475 754163 862118 1074698
16966A074698j25954k72975K51191k93858L15000K08948l79492n7517K21184l8946
$$ 1074698 948744 675769 926960 633102 948102 1157050 777558 720041 941225 902279
16956I02279K28377k75727J61966j40173N73717m15559O2513M575p0413O7803
$$ 902279 1130656 854929 1016895 876722 1450439 1034880 1097393 1101968 1031555 1099358
16946A099358M6018r7515J94089k50295J7570J24225m15216M25039q7045J35879
$$ 1099358 1145376 1047861 1241950 991655 1009225 1133450 718234 1143273 1056228 1192107
16936A192107k95183J89922J66878j2247j32537k06213J26624L70412K0742m61272
$$ 1192107 896924 1086846 1253724 1241477 1108940 902727 1029351 1399763 1420505 959233
16926I59233J05289L42581j8022j08716k40259j8230R6321K545n5668M68584o8561
$$ 959233 1064522 1407103 1389081 1280365 1040106 1021876 1118197 1120742 1065074 1533658 1465097
16915A465097k63810R1694k4783J94955K90048k39713l38652L94063r1522j65549
$$ 1465097 1201287 1292981 1268198 1463153 1753201 1513488 1174836 1568899 1477377 1311828
16905A311828o3930M11157k6694j66063L42923p064k25629M8223l38540L02366
$$ 1311828 1247898 1659055 1632361 1466298 1809221 1802157 1576528 1624751 1286211 1588577
16895A588577M45669l13596r3723K79814l8816Q0394l30429J41597m5105k3076
$$ 1588577 2034246 1720650 1626927 1906741 1867925 1948319 1617890 1759487 1714382 1691306
16885A691306K41092j0837l4265J57220j21041P094M9729o7693k59754L15066
$$ 1691306 1932398 1921561 1887296 2044516 1923475 1930569 1980298 1912605 1652851 1967917
16875A967917j199M0488J49240l53102R4592N4035J60833L32233k25316q6949
$$ 1967917 1966718 2007206 2156446 1803344 1897936 1951971 2112804 2445037 2219721 2132772
16865B132772M27327m13946K00435j8025l14927L49159J6130J44046j2771k3303
$$ 2132772 2560099 2146153 2346588 2328563 2013636 2362795 2378925 2522971 2510200 2486897
16855B486897P8409J29631j25522J74925k43251K40578k59065K98088K02389j53888
$$ 2486897 2565306 2694937 2569415 2744340 2501089 2741667 2482602 2780690 2983079 2829191
16845B829191J67788j36600p0377O84145m94160k14503K33201M91952m32886k31321
$$ 2829191 2996979 2860379 2790002 3474147 2979987 2765484 2998685 3490637 3057751 2826430
16835B826430L62147J48052J49276Q5683Q1527k62671K97250k11729J04241K90406
$$ 2826430 3188577 3336629 3485905 3571588 3653115 3390444 3687694 3475965 3580206 3870612
16825C870612l29336L99111j81650r3845L42814m26089P99844n49759K05189K61026
$$ 3870612 3541276 3940387 3758737 3664892 4007706 3581617 4381461 3831702 4036891 4297917
16815D297917Q5888J47985R702k18404N51826j00102J11982r9105Q4202J96402
$$ 4297917 4383805 4531790 4541492 4323088 4874914 4774812 4886794 4787689 4871891 5068293
16805E068293j19972K98448J36025l7206j24415q0807N30723Q7075j5426j6632
$$ 5068293 4948321 5246769 5382794 5345588 5221173 5140366 5671089 5758164 5742738 5726106
16795E726106N73016j77511K23530M9208L42336l72636L19354K75666K20201N0438
$$ 5726106 6299122 6121611 6345141 6394349 6736685 6364049 6683403 6959069 7179270 7229708
16785G229708j86288N16537q7771K75145J53164j07203O04322L34298J7868J04871
$$ 7229708 7043420 7559957 7472186 7747331 7900495 7793292 8397614 8731912 8749780 8854651
16775H854651M3406K76227M99453L0410R9848J48583L68006J25369L01866J43922
$$ 8854651 8898057 9174284 9673737 9704147 9803995 9952578 10320584 10445953 10747819 10891741
16765A0891741J94353N86503J63736j5046N83221M71289K56015L16004L45920
$$ 10891741 11086094 11672597 11836333 11821287 12404508 12875797 13131812 13447816 13793736
16756A3793736N49805j6071P33340j26308Q00733N03634L89638P59551L75034
$$ 13793736 14343541 14327470 15060810 14934502 15735235 16238869 16628507 17388058 17763092
16747A7763092O45707M72809N70304P77703R9375R54149Q23226O15311O94918
$$ 17763092 18408799 18881608 19451912 20229615 20328990 21283139 22106365 22721676 23416594
16738B3416594J186523N55902J205198J000790R84151Q14763J074683J410940
$$ 23416594 24603117 25159019 26364217 27365007 28349158 29163921 30238604 31649544
16730C1649544J246572J121572J289779J838971J136157J773865J613326K081248
$$ 31649544 32896116 34017688 35307467 37146438 38282595 40056460 41669786 43751034
16722D3751034J861745J998509J905836K666712K001529K310444K968473K658654
$$ 43751034 45612779 47611288 49517124 52183836 54185365 56495809 59464282 62122936
16714F2122936L055032L111058L248424L660923L237480M209356L872087M127467
$$ 62122936 65177968 68289026 71537450 75198373 78435853 82645209 86517296 90644763
16706I0644763M127500M494991M252862M316369N288968M290030M594781M269024
$$ 90644763 94772263 99267254 103520116 107836485 113125453 117415483 122010264 126279288
16698A26279288M574555M389272L632763L572107K894839K587039J675541J674875
$$ 126279288 130853843 135243115 138875878 142447985 145342824 147929863 149605404 151280279
16690A51280279K18610J84491r06230r26344k104719k461409l070279l705586
$$ 151280279 151498889 151683380 150777150 149850806 147746087 145284678 142214399 138508813
16682A38508813l870200m265478m400373m450372m705262n032910m435749m713581
$$ 138508813 134638613 130373135 125972762 121522390 116817128 111784218 107348469 102634888
16674A02634888m765764m308466m493906m361496l960504l829242l383632l061436
$$ 102634888 97869124 93560658 89066752 84705256 80744752 76915510 73531878 70470442
16666G0470442l660851l234978k718323k890053k810716k728749k250489k312721
$$ 70470442 66809591 63574613 60856290 57966237 55155521 52426772 50176283 47863562
16658D7863562j918558j885375k111547j831217j488447j505539j676170j451138
$$ 47863562 45945004 44059629 41948082 40116865 38628418 37122879 35446709 33995571
16650C3995571j456368j215451r76374j643365r45463p69860j445597n21875q18626
$$ 33995571 32539203 31323752 30347378 28704013 27758550 26988690 25543093 25021218 24202592
16641B4202592r25560p21816n91149j119796r75273n31382m67589o19429o25979
$$ 24202592 23277032 22555216 21964067 20844271 19868998 19337616 18870027 18250598 17624619
16632A7624619p89611l53746o61105l32471l39066l78815o20232l63972n23010
$$ 17624619 16835008 16481262 15820157 15487686 15148620 14769805 14149573 13785601 13262591
16623A3262591j79116m51613j10914l31850o96219j14095l43691l93753k05473
$$ 13262591 13083475 12631862 12520948 12189098 11492879 11378784 11035093 10641340 10435867
16614A0435867l84587n5120m03326j38556k99404k62611J29029p03346J32378
$$ 10435867 10051280 9996160 9592834 9454278 9154874 8892263 9021292 8317946 8450324
16605H450324k7255n94056k10545p8727k50789p5803K9313m90288m1242m4980
$$ 8450324 8423069 7829013 7618468 7539741 7288952 7213149 7242462 6752174 6710932 6665952
16595F665952M355j24243m58896k00208j68938J24004J34429m71420n0481j20714
$$ 6665952 6670307 6546064 6087168 5886960 5718022 5842026 5976455 5505035 5454554 5333840
16585E333840J47213K52352m59430j43089N6272o32242M73595m76062O350j68523
$$ 5333840 5481053 5733405 5273975 5130886 5187158 4554916 5028511 4552449 4558799 4390276
16575D390276J2257k83453P9576k4359J62787j73021k06870R9201j59205k26259
$$ 4390276 4402533 4119080 4198656 4174297 4337084 4164063 3957193 4056394 3897189 3670930
16565C670930j35038M74190m55589J90689j17978r8137m78567J85668l2550k50423
$$ 3670930 3535892 4010082 3554493 3745182 3627204 3529067 3050500 3236168 3203618 2953195
16555B953195J68707J4739p4346k88316J60045J5980k0049j18025j95589K03233
$$ 2953195 3121902 3136641 3062295 2773979 2934024 2950004 2929955 2811930 2616341 2819574
16545B819574j35831r0382M7415k05026K91603l3268j20564m81467M6011M40360
$$ 2819574 2683743 2593361 2640776 2435750 2727353 2694085 2573521 2092054 2138065 2578425
16535B578425P2221m56663J68870j51690j05506J91483j4667j27497J19173j23886
$$ 2578425 2650646 2193983 2362853 2211163 2105657 2297140 2282473 2154976 2274149 2150263
16525B150263k15251j27527K31767L8369k23272J42728j5904j15790J1988j29086
$$ 2150263 1935012 1807485 2039252 2077621 1854349 1997077 1981173 1865383 1877371 1748285
16515A748285J04275j64162P1648L61619m21723k46125J46458P2885p9923O383
$$ 1748285 1852560 1688398 1760046 2121665 1699942 1453817 1600275 1673160 1593237 1599620
16505A599620J94453j01764J82555m33580l2927K79719j71052q4589l13810L89426
$$ 1599620 1794073 1692309 1874864 1441284 1408357 1688076 1517024 1432435 1118625 1508051
16495A508051Q233M2857p5179Q2433k39063k55263L51184J72935m60729j11701
$$ 1508051 1516284 1559141 1483962 1566395 1327332 1072069 1423253 1596188 1135459 1023758
16485A023758J20472K00591q262l47245M06124N4167k19231M646k01682K13276
$$ 1023758 1144230 1344821 1336559 989314 1395438 1449605 1230374 1235020 1033338 1246614
16475A246614L7218j4875k55395M2108M2983K87268j61071p0394m85093K90607
$$ 1246614 1283832 1268957 1013562 1055670 1098653 1385921 1224850 1154456 669363 959970
16465I59970Q3843P3575j28068j24578L58509j94332J0659m23156K80388L7696
$$ 959970 1043813 1117388 989320 864742 1223251 1028919 1039578 616422 896810 934506
16455I34506k5537Q6064k37927R6797K31709N3234O5993k18345j03501l07688
$$ 934506 908969 995033 757106 853903 1085612 1138846 1204839 986494 882993 575305
16445E75305L18602l57553O324J49311k3984M33134o3110k80565J00608l7251
$$ 575305 893907 536354 542678 691989 668005 1101139 1038029 757464 858072 820821
16435H20821J4886k03427N1563j87300M01120C82950M39109J82923m07320Q0583
$$ 820821 835707 632280 683843 496543 897663 382950 822059 1004982 597662 678245
16425F78245L0646m5357L79776k55150n5344j25678J06926K08489l79993J53585
$$ 678245 708891 663534 1043310 788160 732816 607138 714064 922553 542560 696145
16415F96145k8191r903j3726k72981J56094j65395M15378k77149m5953K90398
$$ 696145 667954 658051 644325 371344 527438 362043 777421 500272 454319 744717
16405G44717j42091n0322N3329K34116l05014J05625j58310l8434L24141k02524
$$ 744717 602626 552304 605633 839749 534735 640360 482050 443616 767757 565233
16395E65233J97466k26053Q427j77073O0887J59830o070M44154C89031K8445J29997
$$ 565233 762699 536646 545073 368000 428887 588717 582647 1026801 389031 417476 547473
16384E47473J09025j17436g501G86927j23698j91460Q0504j20108j77855L13455
$$ 547473 656498 539062 -7501 786927 663229 471769 552273 432165 254310 567765
16374E67765B43402M79309A97358K73558M23871C20703j769J38816j87187K28445
$$ 567765 243402 722711 197358 470916 894787 320703 318934 457750 270563 499008
16364D99008B41600M45588k37591J01556j44760J02899j03207L4041P1059j27007
$$ 499008 241600 687188 449597 551153 406393 509292 406085 440126 511185 384178
16354C84178K38148k02972K9628J5710a0076C41634J23885o0690A07310C2582
$$ 384178 622326 419354 448982 464692 -10076 341634 465519 404829 107310 32582
16343A06389K04878J54157Q8113j73607D4805J13375M58149B46025K39114j67629
$$ 106389 311267 465424 553537 379930 44805 158180 616329 246025 485139 317510
16333C17510H1290q406P1460L61221k40122N2568j14872l4938K72770A62949n4751
$$ 317510 81290 72884 144344 505565 265443 318011 203139 168201 440971 162949 108198
16322A08198J72678B6809J80336c1132A03523N6177O2246K50044J14737B84922
$$ 108198 280876 26809 207145 -31132 103523 159700 221946 471990 586727 284922
16311F22907l02729k4900F715L73246G0646c1134D52667k19535P8091P861l3808
$$ 622907 320178 295278 6715 379961 70646 -31134 452667 233132 311223 319084 285276
16300B85276P3656K02790O1967o2777A69090K69222A34286a42134H3606b2606
$$ 285276 358932 561722 623689 560912 169090 438312 134286 -142134 83606 -22606
16289A77510L83445B35356g6796C00098K8325j51636E687K11307n6816Q7580J14247
$$ 177510 560955 235356 -76796 300098 328423 176787 5687 216994 160178 247758 362005
16278C62005A74308J45046c7806A30746J44146K39457O1757a20228A10873C7232
$$ 362005 174308 319354 -37806 130746 274892 514349 576106 -120228 110873 37232
16267A38480B9007M0413L11376j03994j8137H4711Q1097O9579J77J43706A64260
$$ 138480 29007 69420 380796 276802 258665 84711 165808 235387 235564 379270 164260
16255B53323k9943C4041J22857L4587m0597K57282r7388O2656D2746L7609J09074
$$ 253323 223380 34041 156898 191485 150888 408170 310782 373438 42746 80355 189429
16244A89429l6058F7125M22859j35506A19403b02929D7934L19291j61901J21108
$$ 189429 153371 67125 489984 354478 119403 -202929 47934 367225 205324 326432
16234C26432j57212a95356A11337O7909k7201F4446b11809B877J4281e798A28743
$$ 326432 169220 -195356 111337 179246 152045 64446 -211809 2877 17158 -5798 128743
16222C12128A7588K74373H1470h7079a6829B9764L47696a38836C59505j7918E3945
$$ 312128 17588 291961 81470 -87079 -16829 29764 377460 -138836 359505 341587 53945
16210b95577A47820h4990C04952q0458C4951L07514j36654r3445J26381a99482
$$ -295577 147820 -84990 304952 224494 34951 342465 205811 112366 238747 -199482
16199a731A55636O0904b73224i20C00828I2892B6418a23827e4862B61982H4599
$$ -1731 155636 216540 -273224 -920 300828 92892 26418 -123827 -54862 261982 84599
16187A61349a3212D47964A20373a23565A21323e0429A00503K12675h703I4421
$$ 161349 -13212 447964 120373 -123565 121323 -50429 100503 313178 -8703 94421
16176B95596A43366M2635R2435m8939l3482O2021E8055O6952a45219G9272C2506
$$ 295596 143366 186001 278436 229497 196015 258036 58055 125007 -145219 79272 32506
16164B07363B2251c06432f7876A07291J91068D3285d8488j35211G2273a12984
$$ 207363 22251 -306432 -67876 107291 298359 43285 -48488 -183699 72273 -112984
16153C3596K41654e203D9257A034J61317a89880Q8227b298C25643F8177j4908
$$ 33596 275250 -5203 49257 1034 162351 -189880 -101653 -2298 325643 68177 53269
16142E3269B2707f9738A14384a7480F2354K5843R7670K06550A43091b2930E4820
$$ 53269 22707 -69738 114384 -17480 62354 88197 185867 392417 143091 -22930 54820
16130c75554A94218A1027J85889C7946N0846J55343k4498d5945A67446K07650
$$ -375554 194218 11027 196916 37946 88792 244135 219637 -45945 167446 375096
16120C75096a60659G3969J74798a59464A07100N8357a88913A60884i6505g643
$$ 375096 -160659 73969 248767 -159464 107100 165457 -188913 160884 -96505 -7643
16109A11893e3645G9012a3837B69461E2083a08061p901C66922j36846A08830k0621
$$ 111893 -53645 79012 -13837 269461 52083 -108061 -115962 366922 230076 108830 88209
16098H8209j1824g0812A42508q285b2471l42297A33806b36699A76869b17971A03000
$$ 88209 76385 -70812 142508 134223 -22471 -364768 133806 -236699 176869 -217971 103000
16086A3671d3765A29149E0931K244J53063i3849k4137I0149O9867h9665L2212
$$ 13671 -43765 129149 50931 53175 206238 -93849 -117986 90149 160016 -89665 -57453
16075e7453D29623b14165n1818B88194F5453a82893f0963C3360b8324A92033l2342
$$ -57453 429623 -214165 -265983 288194 65453 -182893 -60963 33360 -28324 192033 159691
16064A59691J04949d0798q8491K7393B32564p9549b01963A8231K13102a13489
$$ 159691 264640 -40798 -129289 -101896 232564 153015 -201963 18231 231333 -113489
16053C79656a7040H5686J56451J6525h1816b5347B56102j25063d4552A95343c70382
$$ 379656 -17040 85686 242137 258662 -81816 -25347 256102 131039 -44552 195343 -370382
16041a45033C37331m8889o6584a44516M616A35939L16658q9863c06802A3573a49984
$$ -145033 337331 288442 221858 -144516 -139900 135939 452597 362734 -306802 13573 -149984
16029I7874c3430k12514g175F4336J53113K42742b14105a05815B303J2758J98898
$$ 97874 -33430 -245944 -7175 64336 217449 460191 -214105 -105815 2303 15061 213959
16018B13959K8771b837j36315C11936b346C10103G1768l3303K37740g3873j12143
$$ 213959 242730 -2837 -139152 311936 -2346 310103 71768 38465 276205 -73873 -186016
16007a86016h2466A63065i0387A03488J25890C7700b6730A24361B8023J80486
$$ -186016 -82466 163065 -90387 103488 229378 37700 -26730 124361 28023 208509
15997B08509a05281A61760d6671J5741p419j1035A27869l8092C1452K438A4632
$$ 208509 -105281 161760 -46671 -30930 -38349 -49384 127869 89777 31452 33890 14632
15985a16138l08562R1846d4641C00607A7320h8959G7493I734j91J0156J57058
$$ -116138 -424700 -332854 -44641 300607 17320 -88959 77493 9734 9543 19699 176757
15974A76757C122a46710B3469j0871K29347O1254q2864B1377J26320a18658A70557
$$ 176757 3122 -146710 23469 12598 241945 303199 220335 21377 147697 -118658 170557
15962F6757K8360A5937Q8616J78012j23197J55260n494J53163b1559B7743r440
$$ 66757 95117 15937 104553 282565 159368 314628 309134 462297 -21559 27743 18303
15951A8303d7603j52660A30688a56573A45757A7884a11383k3544B47586a3218
$$ 18303 -47603 -200263 130688 -156573 145757 17884 -111383 -134927 247586 -13218
15940D441N4862a48320j40670a9868q3308r7105Q634H2508e3089l25780H3482
$$ 4441 59303 -148320 -288990 -19868 -103176 -200281 -191647 82508 -53089 -378869 83482
15928b29768k72778B7411P6747J92024b761A57079G557M8800a28294d338l27595
$$ -229768 -502546 27411 104158 296182 -2761 157079 7557 56357 -128294 -4338 -331933
15917c31933B15478B2618J17683f2121l65495D3818b52914A35136c11180l3939
$$ -331933 215478 22618 140301 -62121 -427616 43818 -252914 135136 -311180 -345119
15907c45119G6260a50826m31877E2035c9075j06854A79475c39551a7394o8890
$$ -345119 76260 -150826 -582703 52035 -39075 -145929 179475 -339551 -17394 -86284
15897h6284O801A23002m4062b27984F1743J8900K1940D2609J39699b01251h6827
$$ -86284 -79483 123002 78940 -227984 61743 80643 102583 42609 182308 -201251 -86827
15885a12687M0365A55834A8951e8451A8408K8773d55838b24772F257a00479A19652
$$ -112687 -72322 155834 18951 -58451 18408 47181 -455838 -224772 6257 -100479 119652
15873a44356L737r9651j06561i7537B4726a18656M9151A44504a13325r0390l1731
$$ -144356 -140619 -240270 -346831 -97537 24726 -118656 -69505 144504 -113325 -203715 -235446
15862b35446m8072I6559a30667B9660b8723A48185g4946A18701C1507J28728P6832
$$ -235446 -283518 96559 -130667 29660 -28723 148185 -74946 118701 31507 160235 237067
15851B37067a30226E392Q5679a9547p381B1641K0440a70698C33279i9886j30400
$$ 237067 -130226 5392 91071 -19547 -26928 21641 42081 -170698 333279 -99886 -230286
15840b30286B49431b87708J12214n8675F6305J85446b22692g1842E9516c85248
$$ -230286 249431 -287708 -175494 -234169 66305 251751 -222692 -71842 59516 -385248
15829I5841A8505K37126J24863C4673K63936b56254q2838C0999i1592l43937A43356
$$ 95841 18505 255631 380494 34673 298609 -256254 -339092 30999 -91592 -435529 143356
15817b25088i7274G6463a21305A36430c01295j2245b8978F109c84899H9538R3393
$$ -225088 -97274 76463 -121305 136430 -301295 -313540 -28978 6109 -384899 89538 182931
15806A82931q9938i0959A27367a15970b099j55421E2086M988B190d1067A14567
$$ 182931 92993 -90959 127367 -115970 -2099 -157520 52086 57074 2190 -41067 114567
15794a57468B78181A14111K2211L0543l1302a58886l4037A83815c05487A14513
$$ -157468 278181 114111 136322 166865 135563 -158886 -192923 183815 -305487 114513
15783b91083B82581f5796A1023L2453a35175G1700b51459M5496A42960F7636a05329
$$ -291083 282581 -65796 11023 43476 -135175 71700 -251459 -205963 142960 67636 -105329
15771C32265I6412A1258e0008A3162a43729A71267A0807L63327a65809A75012
$$ 332265 96412 11258 -50008 13162 -143729 171267 10807 374134 -165809 175012
15760h3139r4732J6467q4080F5376K62151g2115n8846J2457K5304B18761B3854
$$ -83139 -177871 -161404 -245484 65376 327527 -72115 -130961 -118504 -93200 218761 23854
15748B71185a91304a3687j35522D83815F8481a5935B06682H42a7547p711H2215
$$ 271185 -191304 -13687 -149209 483815 68481 -15935 206682 842 -17547 -25258 82215
15736a60585E2980f2553A28824e0279B2474J26848N448a26205f1042j28070L1800
$$ -160585 52980 -62553 128824 -50279 22474 149322 154770 -126205 -61042 -189112 -157312
15725a57312I4513D34J03720R0299O3272g7571I8781c2456l00822J43386K6261
$$ -157312 94513 434 104154 194453 257725 -77571 98781 -32456 -333278 -189892 -163631
15714a63631A4017d0230l13632b8476E3889a10039I3091J70699I6112L5524d57167
$$ -163631 14017 -40230 -353862 -28476 53889 -110039 93091 263790 96112 131636 -457167
15702B24259A6628b15594P9115a9002B44994a39921E7355M731d008j69727A96673
$$ 224259 16628 -215594 -136479 -19002 244994 -139921 57355 62086 -4008 -173735 196673
15690C43973b13184b3419B46356e3873j18035O2619F8803J44675b16689B20658
$$ 343973 -213184 -23419 246356 -53873 -171908 -109289 68803 213478 -216689 220658
15679a32216A6264b44367R7366H9163K6650K46610b24411a5421l0448j08493O8169
$$ -132216 16264 -244367 -147001 89163 115813 362423 -224411 -15421 -45869 -154362 -86193
15668h6193B32477H5188K3034b84573H6880G758i1564A43292b71802G6303O854
$$ -86193 232477 85188 108222 -284573 86880 7758 -91564 143292 -271802 76303 83157
15657H3157g0445A41760e82854K79511k2697j27601A52092j1245b56683R2795
$$ 83157 -70445 141760 -582854 -303343 -326040 -453641 152092 140847 -256683 -163888
15647a63888A5907P7055J5838K01888J80166A56706a60354q5840A6757b76973
$$ -163888 15907 92962 108800 310688 490854 156706 -160354 -246194 16757 -276973
15636h0887C17185p2461c30337r483a60677A96764a10968j47919a02170L764B31518
$$ -80887 317185 244724 -330337 -339820 -160677 196764 -110968 -258887 -102170 -98406 231518
15624b35005h9387n1821A25232g3280A4829c7159k88595h6333A34159L6986a31692
$$ -235005 -89387 -141208 125232 -73280 14829 -37159 -325754 -86333 134159 171145 -131692
15612B62057e975E0231k0365a46110F2777K43507b21512O436f8498n2549A13455
$$ 262057 -5975 50231 29866 -146110 62777 306284 -221512 -215076 -68498 -121047 113455
15600d3072D5329c09857g2863A54529b17261A6518J76977G725J36035o8082a47133
$$ -43072 45329 -309857 -72863 154529 -217261 16518 193495 7725 143760 75678 -147133
15588e3299o1949A84846C3116J23810c60674J28129c2644a0186k73694j10213
$$ -53299 -115248 184846 33116 156926 -360674 -232545 -32644 -10186 -283880 -394093
15578c94093B60877p2252n5373b90735a15793d0227J0763A2299K29572A5373a38521
$$ -394093 260877 188625 133252 -290735 -115793 -40227 -29464 12299 241871 15373 -138521
15566B14967a12792j37437d59j35863e3851q083A09923j463K9472A4270a86309
$$ 214967 -112792 -250229 -459 -136322 -53851 -61934 109923 108460 137932 14270 -186309
15554B12095F7432k9283M4103d2972J8483C06769q3415l7557b94986B32208c179
$$ 212095 67432 38149 82252 -42972 -24489 306769 223354 185797 -294986 232208 -3179
15542h006j28480O5631H4329d7464j86999J08025q5428f8133j22209c923A2711
$$ -8006 -136486 -70855 84329 -47464 -234463 -126438 -211866 -68133 -190342 -3923 12711
15530C5089b16428f6954q4250e7784j33194E8162k4646R6577K4596K3520B6272
$$ 35089 -216428 -66954 -151204 -57784 -190978 58162 33516 130093 154689 178209 26272
15518B05462a04627A97344b55201B02073J92002i2129M1060p6488G9189g9304
$$ 205462 -104627 197344 -255201 202073 394075 -92129 -51069 -127557 79189 -79304
15507A16018C1591b14746f2969j50555C8137b9099D5345L09382J38475C7862c14650
$$ 116018 31591 -214746 -62969 -213524 38137 -29099 45345 354727 493202 37862 -314650
15495A6057J170K83514G7035a4918A45154G395K26334b19352a02144F2663J29193
$$ 16057 17227 300741 77035 -14918 145154 7395 233729 -219352 -102144 62663 191856
15484A91856F3236a16189K545j27901A51207f1913A70827q0994a89291H8367J08704
$$ 191856 63236 -116189 -113644 -241545 151207 -61913 170827 89833 -189291 88367 197071
15473A97071a47756a8035A80750f3892j3441D1133a46682j07459d2687j30157
$$ 197071 -147756 -18035 180750 -63892 -77333 41133 -146682 -254141 -42687 -172844
15463a72844c2088p6459a8386C2340b74944a18628c6113B06593a26669b8549H4318
$$ -172844 -32088 -108547 -18386 32340 -274944 -118628 -36113 206593 -126669 -28549 84318
15451F6855J4285k4739J22325B641K26955j5192a92784C15640i6048L2527o7766
$$ 66855 81140 56401 178726 2641 229596 214404 -192784 315640 -96048 -63521 -131287
15440a31287B7750a47214M4977G2190O4796E6861e3918A1166J10771e8235A79096
$$ -131287 27750 -147214 -102237 72190 136986 56861 -53918 11166 121937 -58235 179096
15428b04253D5202k647a7477A52977o4516l9572i3959J4624K6644k4612D1879
$$ -204253 45202 42555 -17477 152977 88461 48889 -93959 -79335 -52691 -77303 41879
15416a11940J5316B57163J04146a27199B82842m8164J20328j02452a2763A74560
$$ -111940 -96624 257163 361309 -127199 282842 234678 355006 252554 -12763 174560
15405D04475a60200a2910B09235b45937m9933K3725J27330E4309b25721H257R749
$$ 404475 -160200 -12910 209235 -245937 -295870 -272145 -144815 54309 -225721 8257 18006
15394A8006j984a2922m6863f751A39364j6009a80753B83243f4493J0077j83263
$$ 18006 16022 -12922 -59785 -6751 139364 123355 -180753 283243 -64493 -54416 -237679
15383b37679J14314H8124a24504j40990C14086f7515P674j17043e6686A63999
$$ -237679 -123365 88124 -124504 -265494 314086 -67515 -59841 -176884 -56686 163999
15372C9266b58936R2933I8209e8532B11971h1224m9081A80158L2394o788e2879
$$ 39266 -258936 -166003 98209 -58532 211971 -81224 -130305 180158 212552 205764 -52879
15360b42392A86171a44603M3717L8521j8995l11630a94305k68207B30654j01508
$$ -242392 186171 -144603 -100886 -62365 -81360 -392990 -194305 -462512 230654 129146
15350A29146b1576G8218a22893C24920b2979k35573B09613B0711K19003c3550
$$ 129146 -21576 78218 -122893 324920 -22979 -258552 209613 20711 239714 -33550
15339c0822A86081A2090b7272j00191A30216b2187a647A16805J34774B5906Q231
$$ -30822 186081 12090 -27272 -127463 130216 -22187 -1647 116805 251579 25906 34137
15328C4137N4169B5636K9102R7149E952c12031R7815i0453A1106P520a39132a6349
$$ 34137 88306 25636 54738 151887 5952 -312031 -214216 -90453 11106 18626 -139132 -16349
15315a33419B28288p9478J16113J2460h341A96595M4785K14196A99715C9180a93294
$$ -133419 228288 148810 264923 277383 -8341 196595 241380 455576 199715 39180 -193294
15303A2319n528g7795A1369L70181A41759n3102L83206g0516A12725P9803d5836
$$ 12319 6791 -77795 11369 381550 141759 88657 471863 -70516 112725 192528 -45836
15291B13625o6011B6887O1234c3833E880A460O4052b13906B29718q8721K01058
$$ 213625 147614 26887 88121 -33833 5880 1460 65512 -213906 229718 140997 342055
15280C42055c4210H3035d3802r6135e5859q5402m4801f7014B29668b7059j82807
$$ 342055 -34210 83035 -43802 -139937 -55859 -141261 -186062 -67014 229668 -27059 -209866
15269b09866B47162b09374F0529K18844F3566J65840a4300j61759j79831i9414
$$ -209866 247162 -209374 60529 279373 63566 229406 -14300 -176059 -355890 -99414
15258F2777Q2247R2957J70A11329J10486B9416N58160c3132A56298p6546b23826
$$ 62777 145024 237981 238151 111329 221815 29416 587576 -33132 156298 79752 -223826
15246A58278n4766a35446k1446r6150g9356m0210c5424A71253Q4758F2020h2113
$$ 158278 103512 -135446 -156892 -253042 -79356 -119566 -35424 171253 256011 62020 -82113
15234I4118P0002e2719C03564P387N0636j78761F4653L4771J50351F4525K634
$$ 94118 164120 -52719 303564 310951 361587 182826 64653 99424 249775 64525 67159
15223F7159L26959N33107M22062J3306j14145M72561H54080A74693j1589D502
$$ 67159 394118 927225 1349287 1362593 1248448 1721009 854080 174693 163104 4502
15212C32929N1053A42737Q7147C7644a26728k17270J51926A02853g9137A36831
$$ 332929 383982 142737 229884 37644 -126728 -343998 -192072 102853 -79137 136831
15201B92653D0550J88387H8673J49084b30393R6654L2897E8066K27400b259A56578
$$ 292653 40550 228937 88673 237757 -230393 -133739 -100842 58066 285466 -2259 156578
15189a48613A07163J74685A37898a26779A21857c8144D9939K2658J35370b34906
$$ -148613 107163 281848 137898 -126779 121857 -38144 49939 72597 207967 -234906
15178G7411K40174A09359e8297m7777b4923B95421E8097N9551m7275c3542F1143
$$ 77411 317585 109359 -58297 -106074 -24923 295421 58097 117648 70373 -33542 61143
15166b02459B40578b0816b439D119J3975J02539B0578l347J52088b07911B08555
$$ -202459 240578 -20816 -2439 4119 18094 120633 20578 17231 169319 -207911 208555
15154b4936j6184l34867A43761b07992A82260O9030g7188A10221c8115G628K95275
$$ -24936 -41120 -375987 143761 -207992 182260 251290 -77188 110221 -38115 7628 302903
15143C02903H2345e8167k6344D3801N8757i7061F7677J69954a35657B91689F7554
$$ 302903 82345 -58167 -84511 43801 102558 -97061 67677 237631 -135657 291689 67554
15131A65541Q8966J42516A62797i0899L9760p2319D54515a49854B29916N2132
$$ 165541 254507 397023 162797 -90899 -51139 -123458 454515 -149854 229916 282048
15121B82048i2010A69331G745J23361O2281k9062b34058d773k7148j75966A99411
$$ 282048 -92010 169331 7745 131106 193387 164325 -234058 -4773 -31921 -207887 199411
15109A23620F1306j219J1267a87463A55355N8762K01905g7350b1179k05611B92469
$$ 123620 61306 60087 71354 -187463 155355 214117 416022 -77350 -21179 -226790 292469
15097A12181J2747R4669B7859K19163n4579H4437J26237a11505j05706B49324
$$ 112181 124928 219597 27859 247022 192443 84437 210674 -111505 -217211 249324
15086H6305H128b86336D388c3574A54116c9961A31343A5455J48764q1737K42456
$$ 86305 8128 -286336 4388 -33574 154116 -39961 131343 15455 164219 82482 324938
15075C24938B9698a24004B3774R7438K13118j54790B3758P2269K88653j66560
$$ 324938 29698 -124004 23774 121212 334330 179540 23758 96027 384680 218120
15065B18120c9805A43634J98969q7147k3479i1235C78036a21846o6618b6480B23762
$$ 218120 -39805 143634 342603 255456 231977 -91235 378036 -121846 -188464 -26480 223762
15053A67472L06384b34130C24007r422c3477j8465C10044H8417L71935F0343f5664
$$ 167472 473856 -234130 324007 314585 -33477 -51942 310044 88417 460352 60343 -65664
15041C14691J78257A75045a5783j0059A06689g0201o7662O1590A9218R1703h1630
$$ 314691 492948 175045 -15783 -25842 106689 -70201 -137863 -76273 19218 110921 -81630
15029a0789A24527a8642D40060A68103H3861B7807K89805J6304j64840j371J17397
$$ -10789 124527 -18642 440060 168103 83861 27807 317612 333916 169076 167705 285102
15018B85102m8658B1904a8901c0C58491g1459A87704E1400K54104p7516J3082
$$ 285102 236444 21904 -18901 -30 358491 -71459 187704 51400 305504 227988 241070
15007B41070Q3923A40947j164R9983e04346C22517A05191B446L08115j20947I3103
$$ 241070 324993 140947 139783 239766 -504346 322517 105191 2446 310561 189614 93103
14995A66104K20367j53844D3957h2080p6815g0090A24353J34025A00372K862l1108
$$ 166104 386471 232627 43957 -82080 -158895 -70090 124353 258378 100372 103234 72126
14984G2126a61472A08809K29199l4627n0640J24813A64199K24692o7101a0593
$$ 72126 -161472 108809 338008 303381 252741 377554 164199 388891 321790 -10593
14973B0827M3262J35031K03670B3006K57149G1373J075J82303a67557B92816J60927
$$ 20827 64089 199120 402790 23006 280155 71373 72448 254751 -167557 292816 453743
14962D53743H5049O1019L30420A46668K15442A59623a05681B38542p2856J68617
$$ 453743 85049 146068 476488 146668 362110 159623 -105681 238542 165686 334303
14952C34303p0148b47963D16868J233c60318G7444l5951f6551A66846R3344G1485
$$ 334303 264155 -247963 416868 418101 -360318 77444 41493 -66551 166846 260190 71485
14940G0115K15608J272O3851q7894A05974J85126I867h3455C96312J06286m8894
$$ 70115 285723 286995 350846 262952 105974 291100 9867 -83455 396312 502598 453704
14929D53704A02395m3389M27146j11241q2462c4105B07873j5977K31687E5469
$$ 453704 102395 59006 486152 374911 292449 -34105 207873 191896 423583 55469
14918A00941b8590j49266O0948a301D08548A51399K40512j93081J48285i4931
$$ 100941 -28590 -177856 -116908 -1301 408548 151399 391911 198830 347115 -94931
14907E77113B21290J02201p3712J40224J30302i8717D35961D0602b8288B73818
$$ 577113 221290 323491 249779 390003 520305 -98717 435961 40602 -28288 273818
14896A18339j3422E0499K3296P8121M58714j94145K16275b24708D34119O3311
$$ 118339 104917 50499 73795 151916 610630 416485 632760 -224708 434119 497430
14886D97430q5948j8098K9227k03974J68383j8306q1142I4955M57002j47104j55741
$$ 497430 411482 393384 422611 218637 387020 368714 287572 94955 551957 404853 249112
14875B49112K43379j63217Q9136j5663j68962k4371J54345a07864B80972C5274
$$ 249112 492491 329274 418410 402747 233785 209414 363759 -107864 280972 35274
14864B95344P2333O6647A72216M7821j9644J38995j51290K10300A80716G0619
$$ 295344 367677 434324 172216 220037 200393 339388 188098 398398 180716 70619
14853B77180o4275k08m5639M05767B21479J2907J4844J94137A49018a22521A02639
$$ 277180 212905 212697 167058 572825 221479 234386 249230 443367 149018 -122521 102639
14841B17076m5714b3785F33129B11536K17192j44554Q8322j04482J78056j57685
$$ 217076 171362 -23785 633129 211536 428728 284174 372496 268014 446070 288385
14831B88385L4599A48526J81233J66442P7262k29438K38634B79452m9245K19660
$$ 288385 322984 148526 329759 496201 573463 344025 582659 279452 230207 449867
14821D49867B06575K28846k2668K04883A52677K51898j32219J81265L334j74174
$$ 449867 206575 435421 412753 617636 152677 404575 272356 453621 456955 282781
14811B82781M4864A54539B1237L55575O0848J6771K16557C14974K16266J28862
$$ 282781 327645 154539 21237 376812 437660 454431 670988 314974 531240 660102
14801F60102B80778K14094p2500j59864o4199J12264M7312M14271C30485K57270
$$ 660102 280778 494872 422372 262508 198309 310573 357885 772156 330485 587755
14791E87755B66520k5036L38537D3655M03664A82529M71900B38553L34535C7617
$$ 587755 266520 241484 580021 43655 447319 182529 654429 238553 573088 37617
14780C15673J30428A97866M19891k59466J08270k2469J56837J03472k57741A47721
$$ 315673 446101 197866 617757 358291 466561 444092 600929 704401 446660 147721
14769E22688A55449L38293J24061A41630L67076k37104r2240J23920J32429J23919
$$ 522688 155449 493742 617803 141630 508706 271602 179362 303282 435711 559630
14759E59630B02787J08529K22190p6877K39538q6169M6254l8070r4736J12962
$$ 559630 202787 311316 533506 456629 696167 609998 656252 618182 523446 636408
14749F36408B80364L28297j47786P6594j22684Q1988A47207L83476R4147o0984
$$ 636408 280364 608661 460875 537469 414785 496773 147207 530683 624830 563846
14739E63846K7159L6367j69642k28716K50258n5954L83238C59288Q3394j06826
$$ 563846 591005 627372 457730 229014 479272 423318 806556 359288 442682 335856
14729C35856J38967L09113k25815N9824j39467K55237j34043j30437m0463j14013
$$ 335856 474823 783936 558121 617945 478478 733715 599672 469235 428772 314759
14719C14759N70435j59693j31306j09257K94518l37456p5857J72261J39600C01122
$$ 314759 885194 725501 594195 484938 779456 442000 366143 538404 678004 301122
14708E98082n6960q3224J89671k6054j68055k4199K18283J65379j76545J38140
$$ 598082 541122 457898 647569 621515 453460 429261 647544 812923 636378 774518
14698G74518P2287l88701J67607k14960L10801O0978K7417j24166L9586K16845
$$ 774518 846805 458104 625711 410751 721552 782530 809947 685781 725367 942212
14688I42212r4861l59529J59832O9379l2219L9025K12213l87712J04399K49766
$$ 942212 847351 487822 647654 717033 684814 723839 936052 548340 652739 902505
14678I02505j61784L143j48043q0222O13011D64363O28461k39019o9773n6612
$$ 902505 740721 743864 595821 515599 1128610 464363 1092824 853805 784032 727420
14668G27420R1629m3530O9044k19812J81908l08694P228r2118M81531k58594Q3100
$$ 727420 819049 775519 844563 624751 806659 497965 505193 413075 894606 636012 719112
14657G19112m9187j9344J83034j37230J28562k957l50406N08288J12763k54515
$$ 719112 669925 650581 833615 696385 824947 821990 471584 979872 1092635 838120
14647H38120L19741j31406k14361k68499K46088n2900k48250M38153j02168j93040
$$ 838120 1157861 1026455 812094 543595 789683 736783 488533 926686 824518 631478
14637F31478K74035r2024K13307k12394J10148r0354J22211j6758L5244j08899
$$ 631478 905513 813489 1026796 814402 924550 834196 956407 939649 974893 865994
14627H65994K7138M2070q2056j02946L19317J28533k12573l9789M8770j65497
$$ 865994 893132 935202 853146 750200 1069517 1198050 985477 945688 994458 828961
14617H28961J53286p1385N1113J57743J51597q0901J08267R1116l08711m73683
$$ 828961 982247 910862 961975 1119718 1271315 1190414 1298681 1389797 1081086 607403
14607F07403J10435J74710L7756M23079l16491L92816j56733k12774P4424J45062
$$ 607403 717838 892548 930304 1353383 1036892 1429708 1272975 1060201 1134625 1279687
14597A279687j08901J25312K39685j78938j59255k65326M14855k13290M58143
$$ 1279687 1170786 1296098 1535783 1356845 1197590 932264 1347119 1133829 1591972
14588A591972m52636j95298K89829N0007j22468K2883O8073L79960j13331m01606
$$ 1591972 1139336 944038 1233867 1283874 1161406 1184289 1252362 1632322 1518991 1117385
14578A117385N65592l69807N3725p7547L6662M00807m41056k4128N0035M41546
$$ 1117385 1682977 1313170 1366895 1289348 1326010 1726817 1285761 1261633 1311668 1753214
14568A753214o7868k63502J92487k04289l7427J99007m7961K14490j01337j04231
$$ 1753214 1685346 1421844 1614331 1410042 1372615 1571622 1523661 1738151 1636814 1532583
14558A532583L4113J64774j18938j30923N8096p4850K97389k46697K36737l9581
$$ 1532583 1566696 1731470 1612532 1481609 1539705 1464855 1762244 1515547 1752284 1712703
14548A712703K51868K1457J35089k32602J5691Q7314J9137j73706K93805J69163
$$ 1712703 1964571 1986028 2121117 1888515 1904206 1991520 2010657 1836951 2130756 2299919
14538B299919k83854j73015M16022j7465k34469O10552k16351J86208K78131m2517
$$ 2299919 2016065 1843050 2259072 2241607 2007138 2617690 2401339 2587547 2865678 2823161
14528B823161M5661K11607P41840L77283J223177K941694N257440J2262209K2130963
$$ 2823161 2868822 3080429 3822269 4199552 5422729 8364423 13621863 25884072 48015035
14519D8015035j4740866A2525921m529083C683300j805620j28320n32814M26250
$$ 48015035 33274169 12525921 7996838 3683300 1877680 1749360 1216546 1642796
14511A642796J13598N2149l02697L21905q6109O778J93641j31503k95143N10820
$$ 1642796 1756394 1808543 1505846 1827751 1741642 1748420 1942061 1810558 1515415 2026235
14501B026235J47772j82701k99255R4134J86946M03753k15341j74881K37956J53759
$$ 2026235 2174007 1991306 1692051 1786185 1973131 2376884 2161543 1986662 2224618 2378377
14491B378377q8313o6371M7843M08146k88864p1754m1348m8171L21645r4162K5636
$$ 2378377 2290064 2223693 2271536 2679682 2390818 2319064 2277716 2229545 2551190 2457028 2482664
14480B482664J71808j02003q1607J14836J99867p8248j30278j20249P08091n50379
$$ 2482664 2654472 2552469 2470862 2585698 2785565 2707317 2577039 2456790 3164881 2614502
14470B614502L1559J29080l8706K19274J24516r3290r5412J19634J47010m80747
$$ 2614502 2646061 2775141 2736435 2955709 3080225 2986935 2891523 3011157 3158167 2677420
14460B677420O72575l47558p7605J48399J8368K53513k80774L03632J5940J34234
$$ 2677420 3349995 3002437 2924832 3073231 3091599 3345112 3064338 3367970 3383910 3518144
14450C518144l43706L20633l4002J83263k7493K16612j3871p7508J64366j8123
$$ 3518144 3174438 3495071 3461069 3644332 3616839 3833451 3819580 3742072 3906438 3888315
14440C888315q4805J36905P6565N21038o05457K54706J26269k37465j32984L34151
$$ 3888315 3803510 3940415 4016980 4538018 3932561 4187267 4313536 4076071 3943087 4277238
14430D277238j2952K1963K86686n2741Q3913P5731K84636n7964M9674k3138N08897
$$ 4277238 4264286 4286249 4572935 4520194 4604107 4679838 4964474 4906510 4956184 4933046 5441943
14419E441943p26245O75395j16940p8979j01081J60634j08906J79077k1019L19425
$$ 5441943 4715698 5391093 5274153 5195174 5094093 5254727 5145821 5324898 5303879 5623304
14409E623304l02679M93512J22537J80819j41361J83882j57000l67616Q69935
$$ 5623304 5320625 5814137 5936674 6117493 5976132 6160014 6003014 5635398 6505333
14400F505333n52186L51772J94966j19572P9055Q9027J77542M42161J27798O2937
$$ 6505333 5953147 6304919 6499885 6380313 6459368 6548395 6725937 7168098 7295896 7358833
14390G358833P0501j80837M4707M76778j38416R338M26777k80391M47718o7770
$$ 7358833 7429334 7248497 7293204 7769982 7631566 7640904 8067681 7787290 8235008 8167238
14380H167238M4320P0670L07980L51169n2462L45952l63238J83535N83930J38948
$$ 8167238 8211558 8282228 8590208 8941377 8888915 9234867 8871629 9055164 9639094 9778042
14370I778042k33650O57634m3135J5557J34219M10622J02268J18729L47485L47027
$$ 9778042 9544392 10202026 10158891 10174448 10308667 10719289 10821557 10940286 11287771 11634798
14360A1634798l05744P13733j6459M64979k23676K33429M96202J63322M14146
$$ 11634798 11329054 12042787 12026328 12491307 12267631 12501060 12997262 13160584 13574730
14351A3574730K14862K5442Q3304N36770K16416M09480j36907M75908M92174N45616
$$ 13574730 13789592 13815034 13898338 14435108 14651524 15061004 14924097 15400005 15892179 16437795
14341A6437795R8735O03191Q0652J27673P16711N12719J26922O00076M38079M23504
$$ 16437795 16536530 17139721 17220373 17348046 18064757 18577476 18704398 19304474 19742553 20166057
14331B0166057P92203L27433J30453O60340K77774O23706Q32236M03961J000728
$$ 20166057 20958260 21285693 21416146 22076486 22354260 22977966 23810202 24214163 25214891
14322B5214891L44841O31578N08331J041398Q85045L30516O62381Q88427P05861
$$ 25214891 25559732 26191310 26699641 27741039 28626084 28956600 29618981 30507408 31213269
14313C1213269J060125J125214J240664O52867O61329J442597J069490J245128
$$ 31213269 32273394 33398608 34639272 35292139 35953468 37396065 38465555 39710683
14305C9710683J027493J449581J466984J245582K128163J285716J459487J908811
$$ 39710683 40738176 42187757 43654741 44900323 47028486 48314202 49773689 51682500
14297E1682500J614252K033167K155224K087936K474542K426989K503199K295708
$$ 51682500 53296752 55329919 57485143 59573079 62047621 64474610 66977809 69273517
14289F9273517L101135K850790L371577L090382L493881L653676M311233L951336
$$ 69273517 72374652 75225442 78597019 81687401 85181282 88834958 93146191 97097527
14281I7097527M913105M532935N138678N463821O072487O067161O446800P452659
$$ 97097527 102010632 106543567 111682245 117146066 123218553 129285714 135732514 143185173
14273A43185173P048750P480661Q670551Q563489R473193R988215J0681150J1440468
$$ 143185173 150233923 157714584 166385135 174948624 184421817 194410032 205091182 216531650
14265B16531650J1829014J2721095J3378301J4137660J4880205J5543916J6048369
$$ 216531650 228360664 241081759 254460060 268597720 283477925 299021841 315070210
14258C15070210J6272483J6656981J6582356J7336040J6214652J5729370J4572651
$$ 315070210 331342693 347999674 364582030 381918070 398132722 413862092 428434743
14251D28434743J3986401J2355646R925023O745548r05429k603201j057650j544976
$$ 428434743 442421144 454776790 464701813 471447361 470541932 467938731 466881081 465336105
14243D65336105l803207p897581o178354j0482094j4811978j5505756j5845752
$$ 465336105 461532898 453635317 447456963 436974869 422162891 406657135 390811383
14236C90811383j6801309j7691930j6855281j7125659j6418306j6165260j5366415
$$ 390811383 374010074 356318144 339462863 322337204 305918898 289753638 274387223
14229B74387223j4705098j3759572j2291305j2541409j1860644j1150585j0552068
$$ 274387223 259682125 245922553 233631248 221089839 209229195 198078610 187526542
14222A87526542r806465r118255q655519q008056p012425p282715o646357o443538
$$ 187526542 177720077 168601822 159946303 151938247 144925822 137643107 130996750 124553212
14214A24553212n946036m976041m686648n022635m743600m496496m302544l396270
$$ 124553212 118607176 113631135 108944487 103921852 99178252 94681756 90379212 86982942
14206H6982942l299324l317167l592225l051131l246005k239245k747202k404504
$$ 86982942 83683618 80366451 76774226 73723095 70477090 68237845 65490643 63086139
14198F3086139k450005k067991k227487j830143j493948j957072j885309j688677
$$ 63086139 60636134 58568143 56340656 54510513 53016565 51059493 49174184 47485507
14190D7485507j398939j542152j058434j010385j743331j402190j142272j011784
$$ 47485507 46086568 44544416 43485982 42475597 40732266 39330076 38187804 37176020
14182C7176020j043938n64060j231277j209782j076484o96328p02239o04923p00096
$$ 37176020 36132082 35568022 34336745 33126963 32050479 31354151 30651912 30046989 29346893
14173B9346893j059181j104047l84927p86760n57334m89950j134640k31108r13936
$$ 29346893 28287712 27183665 26798738 26011978 25454644 24964694 23830054 23598946 22685010
14164B2685010l50300l70105n67064n40039l86529o77024l24414l65745o62080
$$ 22685010 22334710 21964605 21397541 20857502 20470973 19793949 19469535 19103790 18441710
14155A8441710k22954k16785L9998r08601k79300l50903n62221j69706l13392
$$ 18441710 18218756 18001971 18041969 17133368 16854068 16503165 15940944 15771238 15457846
14146A5457846m18185R071l87031m97388m95176L7346l18246l20798l0666j86067
$$ 15457846 15039661 15048732 14661701 14164313 13669137 13706483 13388237 13067439 13036773 12850706
14136A2850706k16857m04420j92648j73040L5415k38724m50775j63145j84177
$$ 12850706 12633849 12229429 12036781 11863741 11899156 11660432 11209657 11046512 10862335
14127A0862335l23714N2130l28439j22901L19834m21711j43364J5461q19146N9937
$$ 10862335 10538621 10590751 10262312 10139411 10459245 10037534 9894170 9909631 9090485 9150422
14117I150422K0740j65038m72914J98579O4252p1243j43380m10294J86525k09210
$$ 9150422 9171162 9006124 8533210 8731789 8796041 8724798 8581418 8171124 8357649 8148439
14107H148439l17749n4532j25046j8175l81181J29942o3045N3663j27300m16314
$$ 8148439 7830690 7776158 7651112 7632937 7251756 7381698 7318653 7372316 7245016 6828702
14097F828702O6831J28138k23480K573m6772k53214j42866k45473K02159k42316
$$ 6828702 6895533 7023671 6800191 6802764 6755992 6502778 6359912 6114439 6316598 6074282
14087F074282Q0587k13961l11247J84719Q3518n07379K22281N5890m44065K67135
$$ 6074282 6154869 5940908 5629661 5814380 5897898 5390519 5612800 5668690 5224625 5491760
14077E491760k82769p310J58487l06650K23655l40508n5734K83498j89963l87256
$$ 5491760 5208991 5201681 5360168 5053518 5277173 4936665 4880931 5164429 4974466 4587210
14067D587210L00318J59642l20511o1005J12791m79621J74538N098p060l00661
$$ 4587210 4887528 5047170 4726659 4665654 4778445 4298824 4473362 4478460 4471400 4170739
14057D170739N9180K4854j71898J82688k88711L37435l16553k2125K441J2160
$$ 4170739 4229919 4254773 4082875 4265563 3976852 4314287 3997734 3975609 3978050 3990210
14047C990210J01915l7991j87939j53198j96214K53077m12543J25538l9373K36799
$$ 3990210 4092125 4054134 3866195 3712997 3516783 3769860 3357317 3482855 3443482 3680281
14037C680281J57481n52190N01083k67130J011k89128L63163R7667l54512Q7022
$$ 3680281 3837762 3285572 3786655 3519525 3520536 3231408 3594571 3692238 3337726 3424748
14027C424748j17660l30491p7265k28010N15415o7457J91818L2967k85855k31346
$$ 3424748 3307088 2976597 2899332 2671322 3186737 3119280 3311098 3344065 3058210 2826864
14017B826864r6078j05507L85938l57692r7763P0489N9487N5939j76530P012m3623
$$ 2826864 2730786 2625279 3011217 2653525 2555762 2626251 2685738 2741677 2565147 2572159 2528536
14006B528536K24463j07028J29482m41647K39824j80813L6630k88280K06559k08076
$$ 2528536 2752999 2645971 2775453 2333806 2573630 2392817 2429447 2141167 2347726 2139650
13996B139650L49388Q1389k21890n5686m87800L66955J25042o5124n5776J4989
$$ 2139650 2489038 2570427 2348537 2292851 1805051 2172006 2297048 2231924 2176148 2191137
13986B191137r6073J00489j72074j04571m3123Q0535J53442k50996k1535Q1145
$$ 2191137 2095064 2195553 2023479 1918908 1875785 1956320 2109762 1858766 1837231 1918376
13976A918376J65570J6770m20300J89018K188m6697k73950P3302L6599K68578
$$ 1918376 2083946 2100716 1680416 1869434 1871622 1824925 1550975 1624277 1660876 1929454
13966A929454k68244M20415K68906J465637L854389Q834802K4692264R51665A7841885
$$ 1929454 1661210 2081625 2350531 3816168 7670557 16505359 41197623 42149288 17841885
13956I436809l765975j279746o08586m60180n89796o0180K8367m01355r3143q6167
$$ 9436809 5670834 4391088 3782502 3322322 2732526 2672346 2700713 2299358 2206215 2120048
13946B120048j53K64325k06286p2219K1729k99829K54362k6846k25535M97700
$$ 2120048 2119895 2384220 2177934 2105715 2127444 1827615 2081977 2055131 1829596 2327296
13936B327296m81453n7760J77960j05064j0631J08595j36182j19636p5624Q2221
$$ 2327296 1845843 1788083 1966043 1860979 1850348 1958943 1822761 1703125 1627501 1709722
13926A709722O2674k77048M34058k84568p2985L7863J17169k02712L14805l95759
$$ 1709722 1772396 1495348 1929406 1644838 1571853 1609716 1726885 1524173 1838978 1443219
13916A443219k8852k55591J93786K98028n50462L75234R5391m26148M88637k42990
$$ 1443219 1414367 1158776 1352562 1650590 1100128 1475362 1570753 1144605 1633242 1390252
13906A390252R9553j56180o434K5052q5268L5948K54406l63071K3426P47K66025
$$ 1390252 1489805 1333625 1327191 1352243 1266975 1302923 1557329 1194258 1217684 1218431 1484456
13895A484456p4262p1525J29172o2272P4187n1456k57927J89154J1911l28835
$$ 1484456 1410194 1338669 1467841 1405569 1479756 1428300 1170373 1359527 1371438 1042603
13885A042603J51573J23496J74194R9152k91661k72519K24255j32741r7252K42662
$$ 1042603 1194176 1317672 1491866 1591018 1299357 1026838 1251093 1118352 1021100 1263762
13875A263762l63148N92864m08239L45206l45982J74526k36434O7346k14004K20430
$$ 1263762 900614 1493478 1085239 1430445 1084463 1258989 1022555 1089901 875897 1096327
13865A096327J7920l3218o1941J78607J82632j78607j99254n8783K57551l197
$$ 1096327 1114247 1081029 1019088 1197695 1380327 1201720 1002466 943683 1201234 1198037
13855A198037l14768p2300J69785j2959K25871j67430j45662M1266K2271L04080
$$ 1198037 883269 810969 980754 967795 1193666 1026236 880574 921840 944111 1248191
13845A248191k61641l17855P6073m147J02344J7862o0930L86256n39978O18126
$$ 1248191 986550 668695 744768 740621 842965 860827 799897 1186153 646175 1264301
13835A264301j73724l60105N76J30563Q9246p4414O8031j70659L15990j90170
$$ 1264301 1090577 730472 731048 861611 950857 876443 944474 773815 1089805 899635
13825H99635J01291p5207q2645j08181M86938l04318j22612o7785K65611r8501
$$ 899635 1000926 925719 843074 734893 1221831 917513 794901 727116 992727 894226
13815H94226m2742L514j46970L30052j57704j41617K82652R5402k99731q024j56243
$$ 894226 851484 854998 708028 1038080 880376 738759 1021411 1116813 817082 809058 652815
13804F52815J34013K09973l93911K04295n5108k4826l6353M30593k84286r9575
$$ 652815 786828 996801 602890 807185 752077 727251 690898 1121491 837205 737630
13794G37630q2115K14737n1045P8893l1651j4230Q0491k19936k82q3424M1890
$$ 737630 655515 870252 819207 898100 866449 852219 932710 712774 712492 629068 670958
13783F70958q1845O5040J15343k9493k59616J92300n5640J46046J50118k27438
$$ 670958 589113 654153 769496 740003 480387 672687 617047 763093 913211 685773
13773F85773l0666K02723K8897l18431J28863R2710k89373K54956l77055K21388
$$ 685773 655107 857830 886727 568296 697159 789869 500496 755452 378397 599785
13763E99785R5420K02091j38133k20762J24196p4695p7190j1330K34668j14497
$$ 599785 695205 897296 759163 538401 662597 587902 510712 499382 734050 619553
13753F19553J57065l4631j54846L2654J43079l6688j30182K68949j14880k09331
$$ 619553 776618 741987 587141 619795 762874 726186 596004 864953 750073 540742
13743E40742K71197k53639L54922k08699j81723K91605k38943q5054J04555k2869
$$ 540742 811939 558300 913222 704523 522800 814405 575462 490408 594963 572094
13733E72094l8934P7809B11366O69420k54034P1181j58034k9262J88171j53766
$$ 572094 533160 610969 211366 880786 626752 697933 539899 510637 698808 545042
13723E45042R0420n4815j1523k65442M72100k14013L08858B95932J56432l0834
$$ 545042 635462 580647 569124 303682 775782 561769 870627 295932 452364 421530
13713D21530L2515P3127j48057O3740J65162K82432m13517J33751r3724r4967
$$ 421530 454045 527172 379115 442855 608017 890449 476932 610683 516959 421992
13703D21992p9618j37300N38573B82598J90366K35706C08467M59598k09553A79221
$$ 421992 342374 205074 743647 282598 472964 708670 308467 768065 558512 179221
13692D73264j45392r733J39190L3778r0758L6590K12628j98065P48r614D040K99387
$$ 473264 327872 318139 457329 491107 400349 436939 649567 451502 452250 442636 4040 303427
13680C03427M6962N3731P033J57388J8371q4273K69667l86028j33318J95845K66625
$$ 303427 350389 404120 411153 568541 586912 502639 772306 386278 252960 448805 715430
13669G15430j90328J34199l20014J73798K0448j83334P5245j5211j03524J59076
$$ 715430 525102 659301 339287 513085 533533 350199 425444 410233 306709 465785
13659D65785o9801Q3675j85118M16465k35768j79226A39165J55751J91691M4979
$$ 465785 395984 479659 294541 711006 475238 296012 139165 294916 486607 531586
13649E31586k41721m4766J61760K5641p9171k0013K54639k83688J69080n0843
$$ 531586 289865 245099 406859 432500 353329 333316 587955 304267 473347 422504
13639D22504j98309J98881l2560M9983r4279J03593j31817j4208j19221O3712
$$ 422504 224195 423076 390516 440499 346220 449813 317996 303788 184567 248279
13629B48279J40614j65042L90384j43178j57556J24417j20920K73369k20299J00616
$$ 248279 388893 223851 614235 471057 313501 437918 316998 590367 370068 470684
13619D70684J22381j45836o2333n4619d9430C24265P8640L882j50127K34884j6480
$$ 470684 593065 447229 384896 330277 -49430 324265 402905 406787 256660 491544 475064
13608D75064A56524a26804A11999K81906N9796M0023A55385C6410M0940L10804
$$ 475064 156524 -126804 111999 393905 453701 493724 155385 36410 77350 388154
13598C88154j44648J69716L1046j60875Q0399p4756A03289k8809B2792O03961
$$ 388154 243506 413222 444268 283393 363792 289036 103289 74480 22792 626753
13588F26753k23284C0958L28651K82520A97890q6359J56297N1508A2016P40959
$$ 626753 403469 30958 359609 642129 197890 111531 267828 319336 12016 752975
13578G52975B81950o1735M09089k01379j66353J77805E4505J61080J36945r8306
$$ 752975 281950 220215 629304 427925 261572 439377 54505 215585 352530 254224
13568B54224J643K35848B04428L339M9409L35141k83071H8529M50443B62727K57083
$$ 254224 255867 491715 204428 207767 257176 592317 309246 88529 538972 262727 519810
13557E19810B42358o0016K24774j64164B7902K56528K26295A76005K53840K28343
$$ 519810 242358 182342 407116 242952 27902 284430 510725 176005 429845 658188
13547F58188B42349o7824K11421O2080j16599j05996A02183K82984j61270q3398
$$ 658188 242349 174525 385946 448026 331427 225431 102183 385167 223897 140499
13537A40499N56517C01799A37678D043L05517I2737Q9248H2738M10790a6241D90675
$$ 140499 697016 301799 137678 4043 309560 92737 181985 82738 493528 -16241 490675
13525C40300A12997J45338K6166k2124K48190q8147j23227K51287k45693J21873
$$ 340300 112997 258335 284501 262377 510567 422420 299193 550480 304787 426660
13515D26660k06071M1273j06811k620J56633c69851H908f9761A92619I0416j3845
$$ 426660 220589 261862 155051 152431 309064 -369851 8908 -69761 192619 90416 76571
13504G6571L246K77059M3333D1237J40879M76889q4910j45434J6638A91264K87490
$$ 76571 79817 356876 400209 41237 182116 659005 574095 428661 445299 191264 478754
13493D78754D1178J5896J46978C1808K64910J19046I5201J98343M1626P4475j14391
$$ 478754 41178 57074 204052 31808 296718 415764 95201 293544 335170 409645 295254
13482B95254A28441K66325A70445K1748k2162l600R763P9634g2242C77642e0064
$$ 295254 128441 394766 170445 192193 170031 166431 176194 255828 -72242 377642 -50064
13470A52084J77247j15440J00425J76008I4861J15745J21534P5539j30358q1681
$$ 152084 329331 213891 314316 490324 94861 210606 332140 407679 277321 195640
13460A95640K31933P8523A37814L6521n9717J33775J97269j57139G5631N32695
$$ 195640 427573 506096 137814 174335 114618 248393 445662 288523 75631 608326
13450F08326a49210C98675A56235e0142D12325n5860j60875J8321k0850J9669
$$ 608326 -149210 398675 156235 -50142 412325 356465 195590 213911 193061 212730
13440B12730B2791K08493j01795I295L82933A7768Q4468M417C7218d688j05166
$$ 212730 22791 231284 129489 9295 392228 17768 102236 106653 37218 -4688 -109854
13429a09854a4319E4157J95895j09949R6905o8881K04175b17440G3997J26292
$$ -109854 -14319 54157 250052 140103 237008 168127 372302 -217440 73997 200289
13419B00289B9449K16449A1668N27842A72668l4231p970J14514A10523K88902
$$ 200289 29449 245898 11668 539510 172668 138437 130467 244981 110523 399425
13409C99425A25044r125l0482R821a38102C11311j35810m9684c3006B15480p1434
$$ 399425 125044 115919 85437 95258 -138102 311311 175501 125817 -33006 215480 144046
13398A44046A1657K11075a2749B80907h9077K0964B2039Q6655O3881G6100K99274
$$ 144046 11657 222732 -12749 280907 -89077 -68113 22039 108694 172575 76100 375374
13387C75374O5753a64556B77046i1682A23520J47857p7391a0566A16253c45524
$$ 375374 441127 -164556 277046 -91682 123520 271377 193986 -10566 116253 -345524
13376A93691L5292n9211G2202A8855J19245o0478a34350C77288j45431k7158O9955
$$ 193691 228983 169772 72202 18855 138100 77622 -134350 377288 231857 204699 274654
13365B74654r9184L4223O172I0177D0644J17849Q5625r934B2904J38105M69811
$$ 274654 175470 209693 215865 90177 40644 158493 244118 234184 22904 161009 630820
13354F30820j86806J38169b53073A8749i1060B01406J5186D2930J47541j4797
$$ 630820 444014 582183 -253073 18749 -91060 201406 216592 42930 190471 175674
13344A75674e360I9878l959K08262Q0544D099K85082m5772B0408L65791Q1101
$$ 175674 -5360 99878 95919 304181 384725 4099 289181 243409 20408 386199 467300
13333D67300A95103k3044k6966J09572e5235B07895J24915n8646k9844L15657
$$ 467300 195103 172059 145093 254665 -55235 207895 332810 274164 244320 559977
13323E59977D848J16732M6652k9634M96065B80576E5616N2676a13806C93738j57307
$$ 559977 4848 121580 168232 138598 634663 280576 55616 108292 -113806 393738 236431
13312B36431o3180L05493j34325A34335e4309h265F56493a70189G1385a24469
$$ 236431 173251 478744 344419 134335 -54309 -8265 656493 -170189 71385 -124469
13301A9750c8402C63830B817J0823b62930A56200L2596K11216Q4447k36115A08904
$$ 19750 -38402 363830 2817 13640 -262930 156200 188796 400012 484459 248344 108904
13289B49440K96697k37993A49171R2073a12314C95339r142Q035l6360B3459l106
$$ 249440 546137 308144 149171 241244 -112314 395339 386197 394232 357872 23459 20353
13278B0353J66452b75273H5813L885J57649n4668D3649R7142J91747p4795j20694
$$ 20353 186805 -275273 85813 89698 247347 192679 43649 140791 332538 257743 137049
13267A37049J04300m0468a00992C30044P2096d3619G6075I092K46788E0045g6296
$$ 137049 241349 200881 -100992 330044 402140 -43619 76075 9092 255880 50045 -76296
13255B46130C5036J53246e3940A23560b16864A96768r7947K24945Q406j1138d0369
$$ 246130 35036 188282 -53940 123560 -216864 196768 98821 323766 332172 321034 -40369
13243C30994i3530B78449l5703F1479M9045l714b364N82B4784N9741d4877A33160
$$ 330994 -93530 278449 242746 61479 110524 106810 -2364 -1782 24784 84525 -44877 133160
13230a5496B97431a77726o8742A22568K11108d1461A10414a22562O1130A15803
$$ -15496 297431 -177726 -246468 122568 333676 -41461 110414 -122562 -61432 115803
13219f6099B0945a01132k2227D63773D2568c4269B11729q866K8791a53609m5543
$$ -66099 20945 -101132 -123359 463773 42568 -34269 211729 202863 231654 -153609 -199152
13208a99152A53483E3730J32521d2590C62550d1219B94879p9930c2108B51093
$$ -199152 153483 53730 186251 -42590 362550 -41219 294879 214949 -32108 251093
13197B99619j10372L859b887B09184b2971j97365B86791A3012a2529l081E32437
$$ 299619 189247 193106 -2887 209184 -22971 -220336 286791 13012 -12529 -15610 532437
13185b09532f2389A89208k8850a11042H1234J07646j3471b93530a13152M5753
$$ -209532 -62389 189208 160358 -111042 81234 188880 175409 -293530 -113152 -67399
13175f7399C7994c0341B41849g9466B42746q5108a9259A67740a88959A07808a11818
$$ -67399 37994 -30341 241849 -79466 242746 157638 -19259 167740 -188959 107808 -111818
13163B44257c4030G4311J51915F4313R7889D209c0378A58469a5411A50310P0852
$$ 244257 -34030 74311 226226 64313 162202 4209 -30378 158469 -15411 150310 221162
13152B21162B7891a57043A96912M000M0681j06590o6570F619b51102B35878g4563
$$ 221162 27891 -157043 196912 200912 241593 135003 68433 6619 -251102 235878 -74563
13140A03139O7798J26562B260L7049b1714g781A62224B1604C607J28720M5660
$$ 103139 170937 297499 2260 39309 -21714 -7781 162224 21604 3607 132327 177987
13129A77987l9490L8536H7900e5567B81918c8348H5441f0334c081C4845M5357
$$ 177987 138497 177033 87900 -55567 281918 -38348 85441 -60334 -3081 34845 80202
13118H0202b884A72290o8093Q0596o7146g5585A41796B802b51128d8115A52923
$$ 80202 -2884 172290 104197 184793 117647 -75585 141796 2802 -251128 -48115 152923
13106C1025R0171C5423J32605o3532B6742P7201c2956F8442k2212O6395c2128
$$ 31025 121196 35423 168028 104496 26742 103943 -32956 68442 46230 112625 -32128
13094a63279b8681D7536K7613d4958D8158d6184A35529n6856a61219e8725a5628
$$ -163279 -28681 47536 75149 -44958 48158 -46184 135529 78673 -161219 -58725 -15628
13082A30314K93273A22604d5766G2609M0159J3108K76278j24237E0790a31379
$$ 130314 423587 122604 -45766 72609 112768 125876 402154 277917 50790 -131379
13071c98468B5472c79568c8406B2929O7732a52291E1230K38279I4678a11963C8716
$$ -398468 25472 -379568 -38406 22929 90661 -152291 51230 289509 94678 -111963 38716
13059B17350N7682f137q25B63295E7982J82862g8931j3650j65073B9222K05643
$$ 217350 275032 -6137 -6962 263295 57982 240844 -78931 -92581 -257654 29222 234865
13048B34865r9029K33661j1838a66913I5891g8931b7127B45362A11945n1713J74656
$$ 234865 135836 369497 357659 -166913 95891 -78931 -27127 245362 111945 60232 234888
13037B34888a5849H5865a9544A88176J6860h7846C59788d6877j42115F9301J2244
$$ 234888 -15849 85865 -19544 188176 205036 -87846 359788 -46877 -188992 69301 81545
13026H1545J36630E7372d1591C28015a07800a7882B64333F5539K513N3529j0139
$$ 81545 218175 57372 -41591 328015 -107800 -17882 264333 65539 68052 121581 111442
13015A11442J12438G3816J05462j1553e5014C2305f8356A58102A3186J70621c855
$$ 111442 223880 73816 179278 167725 -55014 32305 -68356 158102 13186 183807 -3855
13003A47890J39045q3882J38895E2335N9293L58059A14850a79265I3439K0923
$$ 147890 286935 203053 341948 52335 111628 469687 114850 -179265 93439 114362
12993A14362c8729B46527q3016d6105A56198N90L18457E0210d169H5766J44490
$$ 114362 -38729 246527 163511 -46105 156198 156788 475245 50210 -4169 85766 230256
12982B30256F5380e0437D7327B285M17357A57907F734a3955C44328a547C50775
$$ 230256 65380 -50437 47327 2285 419642 157907 6734 -13955 344328 -1547 350775
12970c14434C64209b90375A07725R0010K28506A31637b07365A57904C4427R1645
$$ -314434 364209 -290375 107725 197735 426241 131637 -207365 157904 34427 126072
12960A26072e8531E330L606d1797o7708r1015H280K60892J37440A7177p473K53029
$$ 126072 -58531 5330 8936 -41797 -109505 -200520 8280 269172 406612 17177 9704 262733
12948B62733c9536j37236j04419A20539j6172q704a06389c1410C16637r5548A787
$$ 262733 -39536 -176772 -281191 120539 104367 95663 -106389 -31410 316637 221089 1787
12936g076A5323N9963b79097F5003g6227g269B097a99846F3490a15915B04049
$$ -7076 15323 75286 -279097 65003 -76227 -7269 2097 -199846 63490 -115915 204049
12924a35371A71778E9628J785N0452l4986g1052B08182J69570a56483b5366A22890
$$ -135371 171778 59628 61413 111865 76879 -71052 208182 377752 -156483 -25366 122890
12912C90653A57529a77047H5166a49029c4378L712k54356A21182k8357b56742
$$ 390653 157529 -177047 85166 -149029 -34378 -30666 -285022 121182 92825 -256742
12901D7921M3330J80920E1097e8177A08107b57845A99147o7844b54491D4678Q8634
$$ 47921 91251 272171 51097 -58177 108107 -257845 199147 131303 -254491 44678 133312
12890A33312K5582a82138A697J45701F6538a858B94124a97769q2676C7231K83007
$$ 133312 158894 -182138 1697 147398 66538 -1858 294124 -197769 -280445 37231 320238
12879C20238j51163G9625k6814J12189P5815a57120d704A26784A5457P4586a49229
$$ 320238 169075 79625 52811 165000 240815 -157120 -4704 126784 15457 90043 -149229
12867b3267A68647a00500j6394D7875J70054j1700G7255i0568D16730c3460k36175
$$ -23267 168647 -100500 -116894 47875 217929 206229 77255 -90568 416730 -33460 -269635
12856b69635g9941B82193b41899A31969b76864G9545e4836A29991f0001b145r6356
$$ -269635 -79941 282193 -241899 131969 -276864 79545 -54836 129991 -60001 -2145 -98501
12845i8501B15868a5381B33040J01a77521h452A97178c5105o1267A59309J39775
$$ -98501 215868 -15381 233040 233141 -177521 -8452 197178 -35105 -96372 159309 299084
12834B99084b54823A82253a33067M6026A9376c08928I4657a33257e1929Q218j21457
$$ 299084 -254823 182253 -133067 -87041 19376 -308928 94657 -133257 -51929 -43711 -165168
12823a65168H9393J2803l5436a01265F8915a23968A96914a50509B17966b08335
$$ -165168 89393 102196 66760 -101265 68915 -123968 196914 -150509 217966 -208335
12812a84385E9264a14210j06646A25201N3806F3744a32932j10366a11185J6082
$$ -184385 59264 -114210 -220856 125201 179007 63744 -132932 -243298 -111185 -95103
12802i5103k990H9855J08124a0269B27235a35591j31939J23342A07931a55181
$$ -95103 -98093 89855 197979 -10269 227235 -135591 -267530 -144188 107931 -155181
12791H7009B3910M6703K40426e8976k15071A35833E193J08427L4876K33072f0130
$$ 87009 23910 70613 311039 -58976 -274047 135833 5193 113620 148496 381568 -60130
12779C12824H3239a44018B30292b43563f3567G3778a86954A29722n043k2374a82961
$$ 312824 83239 -144018 230292 -243563 -63567 73778 -186954 129722 124679 102305 -182961
12767B0925d37144B54853c7814p4069A60154D4391K32162a53414I923a74910I855
$$ 20925 -437144 254853 -37814 -111883 160154 44391 276553 -153414 9923 -174910 9855
12755A46319a24027B61438g0652A63069n8512K82125a67072A37295c2676I8873
$$ 146319 -124027 261438 -70652 163069 104557 386682 -167072 137295 -32676 98873
12744h2157A33164J7408a69434A11675b26843B21288d03942a50169f1379j10061
$$ -82157 133164 150572 -169434 111675 -226843 221288 -403942 -150169 -61379 -171440
12734a71440a7640I7769g445p6729B02748O2652P7488a68252P0435C8504c12741
$$ -171440 -17640 97769 -7445 -84174 202748 265400 342888 -168252 -97817 38504 -312741
12722b1749A78452o1018f6292B99749b6510D5248f5193C29972j31400q4022J45699
$$ -21749 178452 117434 -66292 299749 -26510 45248 -65193 329972 198572 114550 260249
12711B60249a0021k55660a30636B1940N1532A8308a69927A36428b24364C9199
$$ 260249 -10021 -265681 -130636 21940 73472 18308 -169927 136428 -224364 39199
12700B80633a10309C17527A23246C5834b35782b2758j06028A79450o7860g0157
$$ 280633 -110309 317527 123246 35834 -235782 -22758 -128786 179450 111590 -70157
12689B0879M0250g7858c5922C5227K68554e5102A28134K72523A77878J9048b3125
$$ 20879 61129 -77858 -35922 35227 303781 -55102 128134 400657 177878 196926 -23125
12677C03411d4218I7018j9841b93082J30214B3625c42095c3385B99508F3137J29085
$$ 303411 -44218 97018 77177 -293082 -162868 23625 -342095 -33385 299508 63137 192222
12666A92222n5002o0817l2633g2104A92847D0522b9868E31337B21753j06049J26480
$$ 192222 137220 76403 43770 -72104 192847 40522 -29868 531337 221753 115704 242184
12655B42184q3078g3815A0242j420J82756J99311G5589j0374c5864E8861J26963
$$ 242184 159106 -73815 10242 8822 191578 390889 75589 65215 -35864 58861 185824
12644A85824D650a94305C53865q060A33581K7484i0444F6655N1891J02821B0646
$$ 185824 4650 -194305 353865 345805 133581 161065 -90444 66655 118546 221367 20646
12632F2669L9633J62669H7122L19992C0846i1583j67450E8432J73736I4319M080
$$ 62669 102302 264971 87122 407114 30846 -91583 -259033 58432 232168 94319 98399
12621I8399g4179L0128j00054a2929m3658n4312j24872B37125I5681a91656l05460
$$ 98399 -74179 -44051 -144105 -12929 -56587 -110899 -235771 237125 95681 -191656 -497116
12610d97116g1797l8226A21907a07147G2806e5107I7911J36479J47580F923c83651
$$ -497116 -71797 -110023 121907 -107147 72806 -55107 97911 234390 381970 6923 -383651
12598A05082N0331a57442A69277R01A9969K82421a91681A57204E5186J5991L1850
$$ 105082 155413 -157442 169277 170178 19969 302390 -191681 157204 55186 71177 103027
12587A03027h7593l5681K5312K7107A68881a55042A7711h0537E4269a25885d692
$$ 103027 -87593 -123274 -97962 -70855 168881 -155042 17711 -80537 54269 -125885 -4692
12575B5759a10555B12657q6489K0969l2410f0502A29880b02435l7189B44788A18078
$$ 25759 -110555 212657 126168 147137 114727 -60502 129880 -202435 -239624 244788 118078
12563a24820A77329q0558l2911j0027J6984J7044a33327C83919c3707l8751E6355
$$ -124820 177329 96771 63860 53833 70817 87861 -133327 383919 -33707 -72458 56355
12551B06502a19535A9693a88785B19156a80986A70125O2385b35390I0395h4977
$$ 206502 -119535 19693 -188785 219156 -180986 170125 232510 -235390 90395 -84977
12540E9653e3445A77702M59841G9106h3756F9491L602N7420M0012e832B35764
$$ 59653 -53445 177702 637543 79106 -83756 69491 73093 130513 170525 -5832 235764
12528b18957h7640M1479B86481B6480n17b9214h385B20541B9322J8428c442j34417
$$ -218957 -87640 -46161 286481 26480 25963 -29214 -8385 220541 29322 47750 -3442 -137859
12516a37859H8512a26413A15546i3161B26558C2366J65759a29433j52259F0130
$$ -137859 88512 -126413 115546 -93161 226558 32366 198125 -129433 -281692 60130
12505d65621H099O0894N3408c069E7368I180R3030Q5537a00843p1683A3f7983
$$ -465621 8099 68993 122401 -3069 57368 9180 102210 187747 -100843 -172526 13 -67983
12492e7330A61197Q687O7581J04207a52039D6138K47406a8340A41507P5629a94309
$$ -57330 161197 169884 237465 341672 -152039 46138 293544 -18340 141507 217136 -194309
12480a14494A78859a0754A52406J3491M2448e3656D787L7511K05056a91084F5845
$$ -114494 178859 -10754 152406 165897 208345 -53656 4787 42298 247354 -191084 65845
12468F9511g2500i851j80185J588N9266j0294p2168C18547a2051d126j41653a3618
$$ 69511 -72500 -9851 -190036 -188448 -129182 -139476 -211644 318547 -12051 -4126 -145779 -13618
12455G5104a87240g7732p3440r1177a9420A13682A1754c09707E4179d9538B84143
$$ 75104 -187240 -77732 -151172 -242349 -19420 113682 11754 -309707 54179 -49538 284143
12443B17759a30408B7229d5523B4695J02503a77887g9445A12411m1214M834I805
$$ 217759 -130408 27229 -45523 24695 127198 -177887 -79445 112411 71197 76031 9805
12431b55248j83030E0897b9956j20512I747c265j15343A62885d0640k13338A81660
$$ -255248 -438278 50897 -29956 -150468 9747 -3265 -118608 162885 -40640 -253978 181660
12419a0377r1766A53244a16962j07362M4999I5602D0180K13196A6264c9663q4055
$$ -10377 -102143 153244 -116962 -224324 -179325 95602 40180 253376 16264 -39663 -123718
12408a23718A11332A9608L0245a55007j4498B10252e5180q296K389p4419r1596
$$ -123718 111332 19608 49853 -155007 -169505 210252 -55180 -63476 -61087 -135506 -227102
12397b27102c322A21250a39266G8817l5793Q4974k3719O3579a64192g7698D312
$$ -227102 -3322 121250 -139266 78817 43024 127998 104279 167858 -164192 -77698 4312
12385A40584P2298p3678a79737l12796C46264A2487F37L17239a82449B84565C2263
$$ 140584 212882 139204 -179737 -492533 346264 12487 637 317876 -182449 284565 32263
12373A61402i2506C08972l2390a41018N1386A58211a07353A20874N1883b46117
$$ 161402 -92506 308972 276582 -141018 -89632 158211 -107353 120874 172757 -246117
12362a057j13435n933j404H7393d37842I7496a09017B28011a35061M5203f059
$$ -1057 -114492 -120425 -121829 87393 -437842 97496 -109017 228011 -135061 -89858 -6059
12350B56231I8103A670b3132A2792i078B24058A08486a55651j35481d0448j64245
$$ 256231 98103 1670 -23132 12792 -9078 224058 108486 -155651 -291132 -40448 -204693
12339b04693O8094B80385q2253j59a40885F7468a23690b4084M179I8009b80482
$$ -204693 -136599 280385 198132 197973 -140885 67468 -123690 -24084 -19905 98009 -280482
12327a8472B1281a8867j31516N9902C3036l104c84781H8802A2154c37756c1278
$$ -18472 21281 -18867 -150383 -90481 33036 29932 -384781 88802 12154 -337756 -31278
12315B80982i4557m639A0816b64864C08061l6220c28670B01715b07215C32549
$$ 280982 -94557 -99196 10816 -264864 308061 271841 -328670 201715 -207215 332549
12304a27288F6990p309a24887m3685A46337e9534j53313B5255g5393C4279d2538
$$ -127288 66990 59681 -124887 -168572 146337 -59534 -212847 25255 -75393 34279 -42538
12292A7707J75994c728j88910A70646F5584j2377a68051c223F252N3980K61791
$$ 17707 193701 -3728 -192638 170646 65584 53207 -168051 -3223 6252 60232 322023
12281C22023G0242b47254F6634B429K52495d7846j29136A26118g5050k41269C1768
$$ 322023 70242 -247254 66634 2429 254924 -47846 -176982 126118 -75050 -316319 31768
12269A14639e729D22947a86133A98360M2761a62211c8873r8830B33937a3381l1194
$$ 114639 -5729 422947 -186133 198360 241121 -162211 -38873 -137703 233937 -13381 -44575
12258d4575D8318a30097C79482L2323a47554F5517a97595A07506b12476j08946
$$ -44575 48318 -130097 379482 411805 -147554 65517 -197595 107506 -212476 -321422
12248c21422g3566G479L26595A01658E85g9420C03322j50963F6207B7811J91991
$$ -321422 -73566 7479 334074 101658 585 -79420 303322 152359 66207 27811 219802
12237B19802g055A70335B442c35788C67651A65961f2361I8053k941l2970f5498
$$ 219802 -7055 170335 2442 -335788 367651 165961 -62361 98053 95112 62142 -65498
12225D5948L1764l5822K8914M2340I888N2689b6475A39073Q5673H8972Q1678q2196
$$ 45948 77712 41890 70804 113144 9888 62577 -26475 139073 224746 88972 170650 88454
12213H8454K77286H5723b45499C01150K2211b00922D9934j4754K5654K21459B7935
$$ 88454 365740 85723 -245499 301150 323361 -200922 49934 35180 60834 282293 27935
12201B9393J34019K74880a41078B50725b82673A74638N9645q0443l4319N4894
$$ 29393 163412 438292 -141078 250725 -282673 174638 234283 153840 119521 174415
12191A74415H3763e5278A66762n386o0747P1605e4745l5036B15663J47198A36287
$$ 174415 83763 -55278 166762 161376 100629 172234 -54745 -89781 215663 362861 136287
12179c588A63002m3528a6439G0074L33843h4120B55855Q1124j46012q4477M4274
$$ -3588 163002 119474 -16439 70074 403917 -84120 255855 336979 190967 106490 150764
12168A50764J56317j26557K95441B21582J85587i7923G0682q84R3418a54894M721
$$ 150764 307081 180524 475965 221582 407169 -97923 70682 69798 163216 -154894 -150173
12157a50173A04074a60694c4238A18133J65445F9001J49326C8314J85758l6706
$$ -150173 104074 -160694 -34238 118133 283578 69001 218327 38314 224072 187366
12147A87366K1507K38246A13352B8641J61803a59574g7618B99536a24149A92388
$$ 187366 208873 447119 113352 28641 190444 -159574 -77618 299536 -124149 192388
12136E7615R6683Q2316e7587C55769J2713F5019B4649a76399A26990b13531D2892
$$ 57615 154298 236614 -57587 355769 368482 65019 24649 -176399 126990 -213531 42892
12124B25822b18486B09471i4544A66259J6910a08564B91798A8515O6737Q6728
$$ 225822 -218486 209471 -94544 166259 183169 -108564 291798 18515 85252 171980
12114A71980J89472E9121O0300C3218c04477A76995c78188H3967J8959J94352
$$ 171980 361452 59121 119421 33218 -304477 176995 -378188 83967 102926 297278
12104B97278j42745N637o9536g5273E8216J27744E6447a03304q3181H2379b5356
$$ 297278 154533 160170 90634 -75273 58216 185960 56447 -103304 -186485 82379 -25356
12092b05524c6680E1450g8132A30573D4178c1528m4151A60640a5638k41080I5113
$$ -205524 -36680 51450 -78132 130573 44178 -31528 -75679 160640 -15638 -256718 95113
12080d0907B04487C0275f2945g274D3375K20368a39762M7954L7399A23725b1215
$$ -40907 204487 30275 -62945 -7274 43375 263743 -139762 -91808 -54409 123725 -21215
12068B7403J48410a34863j56564J4230N7891C4925J14263a64875g3189k01283
$$ 27403 175813 -134863 -291427 -277197 -219306 34925 149188 -164875 -73189 -274472
12058b74472e2179A48532J31207F8121m812a58242e6246C97134n3706N87816M42223
$$ -274472 -52179 148532 279739 68121 63309 -158242 -56246 397134 343428 931244 1373467
12047A373467E65606B04605A4483F115M605b38429h6609H3973e1440E5492L6692
$$ 1373467 565606 204605 14483 6115 10720 -238429 -86609 83973 -51440 55492 92184
12036I2184h5735n4626l1471b553j51579d7584m831H1026a65618B14305C3863
$$ 92184 -85735 -140361 -171832 -2553 -154132 -47584 -52415 81026 -165618 214305 33863
12024B23556b18082E9272J0559h3969k6471A08211g6235A22119Q7808a71777B1597
$$ 223556 -218082 59272 69831 -83969 -110440 108211 -76235 122119 209927 -171777 21597
12012a03978J0839A9582f5988k43401b3019I4527K08501a12405A39959J9155J3505
$$ -103978 -93139 19582 -65988 -309389 -23019 94527 303028 -112405 139959 159114 172619
12001A72619K58011A7005K39039a60483A95360b60035O8884D4939L58493b89680
$$ 172619 430630 17005 256044 -160483 195360 -260035 -191151 44939 403432 -289680
11990H7329b56843M2571M5639A02789J31688J0326b9545G5176b22012J9847P6698
$$ 87329 -256843 -214272 -168633 102789 234477 244803 -29545 75176 -222012 -202165 -125467
11979a25467r8764B7772a20042G5785e7497B35827b53956E6893a90348m945a4056
$$ -125467 -224231 27772 -120042 75785 -57497 235827 -253956 56893 -190348 -195293 -14056
11967A8407R4266Q607c24110d0097Q674H3642e346o2564k10432B89606D5372a42282
$$ 18407 112673 121280 -324110 -40097 -31423 83642 -5346 -67910 -278342 289606 45372 -142282
11954C87510e8009j73529A5913b07508G3226k883a68745A06734b0560a146r669
$$ 387510 -58009 -231538 15913 -207508 73226 70343 -168745 106734 -20560 -1146 -10815
11943a0815j367o5031a909k6917B80820r8380G072K29819A17364j719n3049A2509
$$ -10815 -12182 -77213 -1909 -28826 280820 182440 7072 236891 117364 115645 62596 12509
11930d9112E6253e0121A5764p775K63008o9166o3560n9991b58433h4278L4381
$$ -49112 56253 -50121 15764 7989 270997 201831 138271 78280 -258433 -84278 -49897
11919d9897B2727M3003b35704k44492c8628F2907K9623a62727A65458C9977J82324
$$ -49897 22727 65730 -235704 -480196 -38628 62907 92530 -162727 165458 39977 222301
11908B22301F0309J39211b08275R6048a3843B71822j04238k1978D5059K07087
$$ 222301 60309 199520 -208275 -112227 -13843 271822 167584 145606 45059 252146
11898B52146a58254r1456a20341e1764o6374A49392D7640N2189b90940E1852a99814
$$ 252146 -158254 -249710 -120341 -51764 -118138 149392 47640 99829 -290940 51852 -199814
11886E893O0252a509l1408C0568a19710C01353f45871b59474P7301A60979b04617
$$ 5893 66145 -1509 -32917 30568 -119710 301353 -645871 -259474 -182173 160979 -204617
11874A76963c29335J30726I5689J32552A10612h7692j12526j19462N3864d6718
$$ 176963 -329335 -198609 95689 228241 110612 -87692 -200218 -319680 -265816 -46718
11863a73337c5474o2648A70285a78997P8260m9471j30849f767B33649a4387r4903
$$ -173337 -35474 -98122 170285 -178997 -100737 -150208 -281057 -6767 233649 -14387 -109290
11852a09290p5179B9382K00412b6501A23133g9487b0648A54532h1090J2594j79626
$$ -109290 -184469 29382 229794 -26501 123133 -79487 -20648 154532 -81090 -68496 -248122
11841b48122B9772J03340d8758B82687e3708A91050d6564j51603d6407D4350c266
$$ -248122 29772 133112 -48758 282687 -53708 191050 -46564 -198167 -46407 44350 -3266
11829h8195C6732b65829B46776E092L0767a04604j58536J14388j12376B98403
$$ -88195 36732 -265829 246776 5092 35859 -104604 -263140 -148752 -261128 298403
11818a21808e1068k3359K3403b0366A20289K0276a32372I8480a39066L8962q9115
$$ -121808 -51068 -74427 -51024 -20366 120289 140565 -132372 98480 -139066 -100104 -189219
11807a89219A32320a34651j4905b9700j42210b5835j07716J5762B3637h5500A91764
$$ -189219 132320 -134651 -149556 -29700 -171910 -25835 -133551 -117789 23637 -85500 191764
11795a39503A5362b11482d6833G569b36662B42627j07060n9676e7773j7310A71580
$$ -139503 15362 -211482 -46833 7569 -236662 242627 135567 75891 -57773 -75083 171580
11783h0979C07051a93370M6032r3325I0252f9315A25413m8733B0958a85395E0664
$$ -80979 307051 -193370 -147338 -240663 90252 -69315 125413 76680 20958 -185395 50664
11771A02111J75303I1228i605l01894e9364k38366O2507h8655B38007J11748B6445
$$ 102111 277414 91228 -9605 -311499 -59364 -297730 -235223 -88655 238007 349755 26445
11759g7447L2659B04444a35857L1872m4176B9489c8094B613L09095h8676l7367
$$ -77447 -44788 204444 -135857 -103985 -148161 29489 -38094 2613 311708 -88676 -126043
11748a26043A04652K41294B8676a58127B0593e9703b3698I9347C7238Q5130K3975
$$ -126043 104652 345946 28676 -158127 20593 -59703 -23698 99347 37238 122368 146343
11737A46343a65668h1354B06421d7167n1340J7011A52643b64021I8331a69443
$$ 146343 -165668 -81354 206421 -47167 -98507 -81496 152643 -264021 98331 -169443
11726a13046j49196E5897b52078c5548k8187H451a89231j85462a39356F1519e9371
$$ -113046 -262242 55897 -252078 -35548 -63735 8451 -189231 -374693 -139356 61519 -59371
11714d6208k52412B1011K59233c5559j68709D0255b0829A2545K41074a02540p9165
$$ -46208 -298620 21011 280244 -35559 -204268 40255 -20829 12545 253619 -102540 -181705
11703a81705L1552A00124L42562E6475A7816h4083A65130O0843b30230F3593N6987
$$ -181705 -150153 100124 442686 56475 17816 -84083 165130 225973 -230230 63593 120580
11692A20580L05968c30697a47298B33378A1309h5107B3572J24316b70506Q4905
$$ 120580 426548 -330697 -147298 233378 11309 -85107 23572 147888 -270506 -185601
11682a85601R1897H8243h9354B31272c02858A66997a78178A79541G9818a62095
$$ -185601 -93704 88243 -89354 231272 -302858 166997 -178178 179541 79818 -162095
11671a9076l39213A5669K6395b34090C61694a02985j69408h191j33811c2448I0606
$$ -19076 -358289 15669 42064 -234090 361694 -102985 -272393 -8191 -142002 -32448 90606
11659g7603H6107b15079a2248j28971A37476j4425a8788A90832a64967A56796
$$ -77603 86107 -215079 -12248 -141219 137476 123051 -18788 190832 -164967 156796
11648a60020n3138E7495a92466A58616Q3519a80311A84386A9954K21730p6036
$$ -160020 -213158 57495 -192466 158616 242135 -180311 184386 19954 241684 165648
11638A65648C8172G889K14764j00417i7437A43796J82107I0412k7391J34604b02099
$$ 165648 38172 7889 222653 122236 -97437 143796 325903 90412 63021 197625 -202099
11626a47517B17838L4512j25202c1352C05093b92336C6087J6306e6194n6018e416
$$ -147517 217838 252350 127148 -31352 305093 -292336 36087 52393 -56194 -112212 -5416
11614A33665O3836r591h523F5497J33363p6155a36407B91663E8316a2157A40510
$$ 133665 197501 187910 -8523 65497 198860 122705 -136407 291663 58316 -12157 140510
11602a79249D16356C866J44822a10928G4685L24940a25313B06275b21032g3518
$$ -179249 416356 3866 148688 -110928 74685 399625 -125313 206275 -221032 -73518
11591I9944a56694A77975e7843l29182G4288l4332a86143A22245A8831g3807F376
$$ 99944 -156694 177975 -57843 -387025 74288 39956 -186143 122245 18831 -73807 6376
11579a89026g3100D5853g6236B24412F4785i0536j5503A77404K13526c6358j56939
$$ -189026 -73100 45853 -76236 224412 64785 -90536 -106039 177404 390930 -36358 -193297
11568a93297r92E10646j54446A51380C680J68312a16730k07886C40403A63904
$$ -193297 -194289 510646 356200 151380 3680 171992 -116730 -324616 340403 163904
11557d8980A69162C5519c3259L256B47940I8401d295A68402J00967c00662J43190
$$ -48980 169162 35519 -33259 -30003 247940 98401 -4295 168402 269369 -300662 -157472
11546a57472D6720P5831M1836j6676M0956c3157l8153D8083j6197J19773J70544
$$ -157472 46720 122551 164387 147711 188667 -33157 -71310 48083 31886 151659 322203
11535C22203E3039d1946E1191b05825B49060n7912b6574B28492d4567D8458K52069
$$ 322203 53039 -41946 51191 -205825 249060 191148 -26574 228492 -44567 48458 300527
11524C00527b14699j47150A4187J88763R0148A37029K9555b38961L1348E4886
$$ 300527 -214699 -361849 14187 202950 293098 137029 166584 -238961 -207613 54886
11513D906J03355R210m2048J7697c69342I3705J45029o2896h9218c8176F6392
$$ 4906 108261 117471 75423 93120 -369342 93705 238734 175838 -89218 -38176 66392
11501A27863D9538M0462f0026k6112B90675b64213f8362C03642e1872Q426A02275
$$ 127863 49538 90000 -60026 -86138 290675 -264213 -68362 303642 -51872 -43446 102275
11489a07606a3587C57863m0394J41093f1824B4702L68893A83982G0231P3723J21291
$$ -107606 -13587 357863 317469 458562 -61824 24702 393595 183982 70231 143954 265245
11478B65245q639d4587B58335a40133K2425M2653C29656D6805J41318a04916C5542
$$ 265245 256606 -44587 258335 -140133 -117708 -75055 329656 46805 188123 -104916 35542
11466C67194j00467H5805K5449C2955b72649d6889A60772a74902A73284J90097
$$ 367194 266727 85805 111254 32955 -272649 -46889 160772 -174902 173284 363381
11456C63381j80344b02910B03617P2741j24352j5370a16704K6560C32906a39287
$$ 363381 183037 -202910 203617 276358 152006 136636 -116704 -90144 332906 -139287
11445B01197B2472R0198l267P5965b63656A51722G0287L6885J3045Q1159o720
$$ 201197 22472 112670 109403 185368 -263656 151722 70287 107172 120217 201376 194656
11434A94656r4197R0234b9926l850J3284B58786a23437j21268B19539D7455J43427
$$ 194656 100459 190693 -29926 -33776 -20492 258786 -123437 -244705 219539 47455 190882
11423A90882q1517b01184R7547A72938a9472B53075K19370b4303I7172L48762
$$ 190882 109365 -201184 -103637 172938 -19472 253075 472445 -24303 97172 445934
11413D45934a7725D1338e1705n9180h545j4317n4432l38968C0614b2132A76507
$$ 445934 -17725 41338 -51705 -110885 -8545 -22862 -77294 -416262 30614 -22132 176507
11401A91600a40079p4211H6047l9909A083J61469a77675I5738a18903C5089J13912
$$ 191600 -140079 -214290 86047 46138 1083 162552 -177675 95738 -118903 35089 149001
11390A49001a41604B5905M6552J41914C0127M1652J51146r3025h5731L8926D69893
$$ 149001 -141604 25905 72457 214371 30127 71779 222925 129900 -85731 -46805 469893
11378e6420l72264A00274b51420B41671j19119n4917b16954j12406A47434E1246
$$ -56420 -428684 100274 -251420 241671 122552 67635 -216954 -329360 147434 51246
11367b64982A25784b90921b8746C1450J86966E1387a52468r5970A45053J05974
$$ -264982 125784 -290921 -28746 31450 218416 51387 -152468 -248438 145053 251027
11357B51027D4159d2489A18963k6525J56186a19208C50273a87972g4066A53156
$$ 251027 44159 -42489 118963 92438 248624 -119208 350273 -187972 -74066 153156
11346F297g8174L5381J7147l8415I2527d83682I0098J76722p5487a06238k7200
$$ 6297 -78174 -42793 -25646 -64061 92527 -483682 90098 266820 191333 -106238 -133438
11335a33438O3820j08531d5253A41171N1638c05552J37007A36193a79277D1942
$$ -133438 -69618 -178149 -45253 141171 192809 -305552 -168545 136193 -179277 41942
11324A08373K9611c1770j23573B07216a01120c9664k46068G7551a15254k688c9325
$$ 108373 137984 -31770 -155343 207216 -101120 -39664 -285732 77551 -115254 -117942 -39325
11312b38232B51870r485b3346D23938E917K7061K7102J97741L0606F8250f470
$$ -238232 251870 242385 -23346 423938 5917 32978 60080 257821 288427 68250 -6470
11300a84839n5894A06710a5798A759g7587A12445i66j94067D628a62802O9820
$$ -184839 -240733 106710 -15798 1759 -77587 112445 -966 -195033 4628 -162802 -92982
11289i2982j94355D4026J82158b51307C38145h0761J3360j11583B8843f7109j89132
$$ -92982 -287337 44026 226184 -251307 338145 -80761 -67401 -178984 28843 -67109 -256241
11278b56241A090f8486j44724l0559E933R2088i3385A8598c20096A98545m9472
$$ -256241 1090 -68486 -213210 -243769 5933 98021 -93385 18598 -320096 198545 149073
11267A49073c21533N1408a5439k5943l37228h5948j74930a1781J19q7337I3880
$$ 149073 -321533 -270125 -15439 -41382 -378610 -85948 -260878 -11781 -11662 -98999 93880
11255C3839a74095j16008F499J25485a16195A47387D7484K41814f72C84667A85923
$$ 33839 -174095 -290103 6499 131984 -116195 147387 47484 289298 -672 384667 185923
11243A48153b8727j24681l74960B40932C1737N3493J32956c834l83957d1772A5558
$$ 148153 -28727 -153408 -528368 240932 31737 85230 218186 -3834 -387791 -41772 15558
11231a10933L2109A43053B643b15047F8802h5541p0652C72935A75389d7270a800
$$ -110933 -78824 143053 2643 -215047 68802 -85541 -156193 372935 175389 -47270 -1800
11219b1905A81655J60394a74089m6960B07181C7945b37096e3986A11890N2848
$$ -21905 181655 342049 -174089 -221049 207181 37945 -237096 -53986 111890 164738
11209A64738m7638n0415K04096b07236m5786G0841M608J92162G7364K8511R1050
$$ 164738 117100 66685 270781 -207236 -253022 70841 75449 267611 77364 105875 196925
11198A96925a97059h4960j92092D9944b26516e3547C7217a01667a5929n3101j16873
$$ 196925 -197059 -84960 -277052 49944 -226516 -53547 37217 -101667 -15929 -69030 -185903
11187a85903G3692a10143d0535r2179j91725a9376l5344j44484R1616k63509a71429
$$ -185903 73692 -110143 -40535 -132714 -324439 -19376 -54720 -199204 -107588 -371097 -171429
11175d4356k50590A638h5067B50683r6849l7457b9361k4203F4134d64135D7126
$$ -44356 -294946 1638 -85067 250683 153834 116377 -29361 -53564 64134 -464135 47126
11163c4581C66677A3983J27445c29362a01202r0028K3132C4600f977b474A33792
$$ -34581 366677 13983 141428 -329362 -101202 -191230 -168098 34600 -6977 -2474 133792
11151b82399A04094J0903a90577P5630J947A53833a74593B94259h5255A86540
$$ -282399 104094 114997 -190577 -114947 -113000 153833 -174593 294259 -85255 186540
11140b34552I2564c54412H3079b01587r7668A23066J6699C9765L0174i0983r8559
$$ -234552 92564 -354412 83079 -201587 -299255 123066 139765 39765 69939 -90983 -189542
11129a89542Q8718C4034D980K62159a01262k8681A60417B0897g2043C48061G1719
$$ -189542 -100824 34034 4980 267139 -101262 -129943 160417 20897 -72043 348061 71719
11117b91263A7636b78144Q8792A1830a48556B36998C5128f0256D47211D9105K9338
$$ -291263 17636 -278144 -189352 11830 -148556 236998 35128 -60256 447211 49105 78443
11106G8443a3276H0628e5986j3247a7174D1642h9567A84647a37016E9782J60756
$$ 78443 -13276 80628 -55986 -69233 -17174 41642 -89567 184647 -137016 59782 220538
11095B20538D7904a15399c0343B54873H2924a81910N9794A09918k6821K17217
$$ 220538 47904 -115399 -30343 254873 82924 -181910 -122116 109918 83097 300314
11085C00314G6143K7366J73665k2460a23705A93666k2437k668K12124q6201B9054
$$ 300314 76143 103509 277174 254714 -123705 193666 171229 168561 380685 294484 29054
11073B60450G1501a13857b8465A41859B3713C528M6259R9329j6494l0094P5595
$$ 260450 71501 -113857 -28465 141859 23713 3528 49787 149116 132622 102528 178123
11062A78123K34067M8597A79116o761P9249f7281I4117a50809C62514H2157k0538
$$ 178123 412190 460787 179116 172355 251604 -67281 94117 -150809 362514 82157 61619
11051F1619K20956K09336a57432B66186L7713d1566G55528j01059A83484O5434
$$ 61619 282575 491911 -157432 266186 303899 -41566 755528 654469 183484 248918
11041B48918A1838N77838A80800a1944p7623B78459K18827l8200C1042M51775
$$ 248918 11838 589676 180800 -11944 -89567 278459 497286 459086 31042 482817
11031D82817L2678J94684k99262j51175Q569o478J24769m6257L58187r5204K7100
$$ 482817 515495 710179 410917 259742 268311 261833 386602 340345 698532 603328 630428
11020F30428n4466P248j11637M2012J20834M9893l18854K80382B02057O58380
$$ 630428 575962 583210 471573 513585 634419 684312 365458 645840 202057 860437
11010H60437j31245p5382q2440k9828m5089k7069j81064L83817j93071N7583O9779
$$ 860437 729192 653810 571370 541542 496453 469384 288320 672137 479066 536649 606428
10999F06428j36827j21208M21654k86067P130j50882K18934j0428L0458j88789
$$ 606428 469601 348393 770047 483980 491110 340228 559162 548734 579192 390403
10989C90403J96400k28996M06110l65788J38393q4892p5990n8342J19053j24723
$$ 390403 586803 357807 763917 398129 536522 451630 375640 317298 436351 311628
10979C11628L68039N0538j75260k62680J40355J91543k8444o6633j30358J52435
$$ 311628 679667 730205 554945 292265 432620 624163 595719 529086 398728 551163
10969E51163J32559A42038K08445j5770J18991q4191M93928r5942J34989D39092
$$ 551163 683722 142038 350483 334713 453704 369513 863441 767499 902488 439092
10958G18990K44714l80233K39748K21526l80786K20611K47882l14836M00129J43771
$$ 718990 963704 583471 823219 1044745 663959 884570 1132452 817616 1217745 1361516
10948A361516L23064N121O7189K66492K78278J20540L2540l8337M9396n66561
$$ 1361516 1684580 1689701 1756890 2023382 2301660 2422200 2454740 2416403 2465799 1899238
10938A899238P7329l07801k03510k37678L52788j40404K68419l50548j7969K59682
$$ 1899238 1976567 1668766 1465256 1227578 1580366 1439962 1708381 1357833 1339864 1599546
10928A599546r1431j02650K36052l81136k84410n6416j03883l92883J73842K6828
$$ 1599546 1508115 1405465 1641517 1260381 975971 919555 815672 422789 596631 623459
10918F23459j31387k11358J87512j85468j09142K29610A86163J43990J01495c0657
$$ 623459 492072 280714 468226 282758 173616 403226 186163 330153 431648 -30657
10907b8325C7134K74783A29992Q7738a27581b873j407A83807f4882j24292C58518
$$ -28325 37134 311917 129992 217730 -127581 -2873 -4280 183807 -64882 -189174 358518
10895A41206B0006a27906A16331L09515b68312I0519b453A38231a43027d2839
$$ 141206 20006 -127906 116331 425846 -268312 90519 -2453 138231 -143027 -42839
10884b0532B9821a13369A21023A8044a11560E94954b00235P3953B27813o5445
$$ -20532 29821 -113369 121023 18044 -111560 594954 -200235 -126282 227813 162368
10874A62368b12820B34442b29187B24493n0791Q7410p3889a68209A46689j8684
$$ 162368 -212820 234442 -229187 224493 173702 261112 187223 -168209 146689 128005
10864A28005n4758a36054j43177B23963d61436K14099J01612A82284d9057j13739
$$ 128005 73247 -136054 -279231 223963 -461436 -247337 -145725 182284 -49057 -162796
10854a62796b0628B01581g1389e854F1169R1859a19674b7573A70916p5998i957
$$ -162796 -20628 201581 -71389 -5854 61169 153028 -119674 -27573 170916 94918 -9957
10842f7658r8621I293K56565A13260b72067J04486B48492a20299B35700g7882
$$ -67658 -166279 9293 265858 113260 -272067 -167581 248492 -120299 235700 -77882
10831C6664Q1297L29691A07387P7685g5115A63497c5178C19469C3865Q7916a82613
$$ 36664 117961 447652 107387 185072 -75115 163497 -35178 319469 33865 121781 -182613
10819A12672B742a77383r6492C0654e0132A48559n1307c89252A32641n8692g4173
$$ 112672 2742 -177383 -273875 30654 -50132 148559 97252 -389252 132641 73949 -74173
10807b6282j22625H4518l3217J77574o4683m6730b45674B84780f0016E9588J22929
$$ -26282 -148907 84518 51301 228875 164192 117462 -245674 284780 -60016 59588 182517
10796A82517E8823L12411k3340a23391M2141k34629D17983c07041A61848E5754
$$ 182517 58823 371234 347894 -123391 -81250 -315879 417983 -307041 161848 55754
10785a15395A79896b15763C0876r096b58771J15303d7605j27554A25635D9021
$$ -115395 179896 -215763 30876 21780 -258771 -143468 -47605 -175159 125635 49021
10774A58816a58663L6931K8364A53044a83972k4828e6817j12640e9108F7255a40691
$$ 158816 -158663 -121732 -93368 153044 -183972 -208800 -56817 -169457 -59108 67255 -140691
10762a46004c4770A0865L3141a7644A10006b00698k7588h1113j81513E0795b62967
$$ -146004 -34770 10865 44006 -17644 110006 -200698 -228286 -81113 -262626 50795 -262967
10750a26420A30573a72333b9783k55629e2962j60939A21599h9761A61022d30227
$$ -126420 130573 -172333 -29783 -285412 -52962 -213901 121599 -89761 161022 -430227
10739B4392M0475B0817J76196b3625k93067A84901k5416b07150R9464E7238A0510
$$ 24392 64867 20817 197013 -23625 -316692 184901 159485 -207150 -107686 57238 10510
10727c55121A801L6455g8975c3960a3318k75344f9971A09687J5254c95601l5763
$$ -355121 1801 38256 -78975 -33960 -13318 -288662 -69971 109687 124941 -395601 -431364
10716d31364a09424p0184g7170h726k7520r1238N1343j5385H4396a09233a4939
$$ -431364 -109424 -179608 -77170 -8726 -36246 -127484 -76141 -91526 84396 -109233 -14939
10704A6102b03036J00922C5496A4009J7815N6300J22410b39489A12347b47155
$$ 16102 -203036 -102114 35496 14009 31824 88124 210534 -239489 112347 -247155
10693F4917g6445j70681p458A6200a35789B33033a1999m0024D1601d6379A74331
$$ 64917 -76445 -247126 -254584 16200 -135789 233033 -11999 -52023 41601 -46379 174331
10681a78075A24536a38552A22573c36527L9082c3008D8344M5599A3396K94097
$$ -178075 124536 -138552 122573 -336527 -297445 -33008 48344 93943 13396 307493
10671C07493j5592A4531a32160A80335E4814j4994O0555e5982A63704a35275B31837
$$ 307493 291901 14531 -132160 180335 54814 39820 100375 -55982 163704 -135275 231837
10659c1405l4156D788J30526b49355m6383a29029B91902o1792j6821E0105a76812
$$ -31405 -65561 4788 135314 -249355 -295738 -129029 291902 230110 213289 50105 -176812
10647i2681A93255b1559k68841E1841a46216k53737F8331c79403F5487B9820K2702
$$ -92681 193255 -21559 -290400 51841 -146216 -399953 68331 -379403 65487 29820 52522
10636E2522c7369j31187j90305d2274B71764f7853M864A49220a70610A88172b68394
$$ 52522 -37369 -168556 -358861 -42274 271764 -67853 -62989 149220 -170610 188172 -268394
10624f1332D7437a50712N4968a3694H13b00059F0262f0047j92099A785a23296
$$ -61332 47437 -150712 -95744 -13694 813 -200059 60262 -60047 -252146 1785 -123296
10612F6195L0566b36764d1235j751j1823j76148j03769A82519F1950K9780a90888
$$ 66195 96761 -236764 -41235 -42986 -54809 -230957 -334726 182519 61950 91730 -190888
10600b2878G3360a15024k2074B62962b63374j87792a6560j63619c933j16990j06877
$$ -22878 73360 -115024 -137098 262962 -263374 -451166 -16560 -180179 -3933 -120923 -227800
10589b27800A62807M8918a76215H0357a89601L0215G6330a90914F5089a66022
$$ -227800 162807 211725 -176215 80357 -189601 -159386 76330 -190914 65089 -166022
10578E7994a12787A44007a57351e9916R132G5518C3930a88414j68871B6452f2767
$$ 57994 -112787 144007 -157351 -59916 -50784 75518 33930 -188414 -357285 26452 -62767
10566e08207i8904B4151L5845h6863B15427b0645F2208F745K00467b53926A12257
$$ -508207 -98904 24151 59996 -86863 215427 -20645 62208 6745 207212 -253926 112257
10554d6456k79167B52298e8099q1877O4724A84002q1088d6874j66713G2602i8624
$$ -46456 -325623 252298 -58099 -139976 -75252 184002 102914 -46874 -213587 72602 -98624
10542d30488D9949a42967f9535b5400A46958B9550i7134E32531e0726j14440C33585
$$ -430488 49949 -142967 -69535 -25400 146958 29550 -97134 532531 -50726 -165166 333585
10530H6094J08380e3460J157B27706g9599c5860A0727d7309B55227a41847d4772
$$ 86094 194474 -53460 -52303 227706 -79599 -35860 10727 -47309 255227 -141847 -44772
10518b53655d8321A03723e5693j61021a6517j57915b021l09795a50605D8251j2250
$$ -253655 -48321 103723 -55693 -216714 -16517 -174432 -2021 -311816 -150605 48251 36001
10507C6001K9344a09085C3074e9062k65407h9610m5469b6153q1012F5620L2052
$$ 36001 65345 -109085 33074 -59062 -324469 -89610 -135079 -26153 -107165 65620 97672
10496I7672a51189J370P0362k583k46904a6604A62227f2817C4181c4922M918H2114
$$ 97672 -151189 -149819 -79457 -82040 -328944 -16604 162227 -62817 34181 -34922 -30004 82114
10483I7874f6559j58157A45073C1307J90673p3956f2712F3018A6505i8081b9405
$$ 97874 -66559 -224716 145073 31307 221980 148024 -62712 63018 16505 -98081 -29405
10471B53963a69138g9786I397b6308C10535c9547C05J63458A1661d6976l0615
$$ 253963 -169138 -79786 9397 -26308 310535 -39547 305 163763 11661 -46976 -77591
10460g7591B0102P3056J75577A12392a13683B02014c7262C81929i1073G69500
$$ -77591 20102 93158 268735 112392 -113683 202014 -37262 381929 -91073 769500
10449H40223C56765j69449J33733G2528C3717J77010b6326d562k76775e7366p9782
$$ 840223 356765 187316 321049 72528 33717 210727 -26326 -4562 -281337 -57366 -137148
10438a37148j52150J27550A39708E8654a10596K886G5963b3036A44300D351a52303
$$ -137148 -289298 -161748 139708 58654 -110596 -107710 75963 -23036 144300 4351 -152303
10426b862l65123D0026P0428a764l1609k7228r575m07227E7254a22964I5311e0456
$$ -2862 -367985 40026 110454 -1764 -33373 -60601 -70176 -477403 57254 -122964 95311 -50456
10413I396J10262e7113A58263b30865c7204j131B5803a54419I6859j1369b8277
$$ 9396 119658 -57113 158263 -230865 -37204 -38335 25803 -154419 96859 85490 -28277
10401B9561a7262D3487a11019A96884b98371I3865K7751a56000A52049a68388
$$ 29561 -17262 43487 -111019 196884 -298371 93865 121616 -156000 152049 -168388
10390a85998E8482J4215L5461I937M5045N0380h9950A59899c64095J12346g4139
$$ -185998 58482 72697 108158 9937 54982 105362 -89950 159899 -364095 -251749 -74139
10378b81201B0255N6298j3518J09570a54098B40166J3207c7583C11947a64586
$$ -281201 20255 76553 63035 172605 -154098 240166 253373 -37583 311947 -164586
10367A74597J9372q3892a13815D7374L50244h4237C15378p0052n8352l1533c52526
$$ 174597 193969 110077 -113815 47374 397618 -84237 315378 245326 186974 155441 -352526
10355a8073o1970B99973J91236a85566A20230J01642G2704L7013h2741G55346
$$ -18073 -80043 299973 491209 -185566 120230 221872 72704 109717 -82741 755346
10344E9132J91398L42777k05802P6322j73895q6384K93561A13792K25531j03002
$$ 59132 250530 593307 387505 463827 289932 203548 497109 113792 339323 236321
10334B36321K2127J56097j7316o6332r0376J6903K5801M8849j52360D8873L59839
$$ 236321 258448 414545 397229 330897 240521 257424 283225 332074 179714 48873 408712
10323D08712Q445j53758M80797C16327O7176j80571J32169J00902k07611o775
$$ 408712 417157 263399 744196 316327 383503 202932 335101 436003 228392 221617
10313B21617j0100N6952K35403j08046j36156F4232J85049F0033a46173I0570
$$ 221617 211517 268469 503872 395826 259670 64232 249281 60033 -146173 90570
10302i056r2999A98065P1954p8578F9807n985b0557C02993M3263A1110N2310c51628
$$ -9056 -102055 198065 270019 191441 69807 63822 -20557 302993 346256 11110 63420 -351628
10289A53306L13272a30023o847A01681C3537Q2578C9858f4492A48764a63563H9400
$$ 153306 466578 -130023 -136870 101681 33537 116115 39858 -64492 148764 -163563 89400
10277d5352l9050L1487k22438N7122A98582a0673l8225C9691J14129M4144B5242
$$ -45352 -84402 -52915 -275353 -218231 198582 -10673 -48898 39691 153820 197964 25242
10265A26806e0004E3681f8867A63402c0489D752h7680p0235A7313K11656a83650
$$ 126806 -50004 53681 -68867 163402 -30489 4752 -87680 -157915 17313 228969 -183650
10253b22971a5469B4367J92198i83p6962C9158a13173B37550g0519A18263g6330
$$ -222971 -15469 24367 216565 -983 -77945 39158 -113173 237550 -70519 118263 -76330
10241I9608P92h0266j12522g8210r3317B98103a00508D06812A0131J6533d1052
$$ 99608 100400 -80266 -192788 -78210 -171527 298103 -100508 406812 10131 26664 -41052
10229H4153J40780K50745A10465c32138D05737G1356l4491J86109d0623B5912
$$ 84153 224933 475678 110465 -332138 405737 71356 36865 222974 -40623 25912
10218b77661j9050g1901q7084k5574k1055N6043r0647A50921a62437M5403C0644
$$ -277661 -296711 -71901 -158985 -184559 -205614 -149571 -240218 150921 -162437 -117034 30644
10206G0708j9020R2367d60562B6555K43313a76248k75773h8580G671b53138J07941
$$ 70708 51688 144055 -460562 26555 269868 -176248 -452021 -88580 7671 -253138 -145197
10195a45197j04546F1423b22149J3429M9245f1605K1726F1505e8183l63686I4726
$$ -145197 -249743 61423 -222149 -208720 -159475 -61605 -39879 61505 -58183 -421869 94726
10183H8842R5257a38610p2572O0130L8024d4079m3738j2493K167A7493J85333
$$ 88842 184099 -138610 -211182 -151052 -113028 -44079 -87817 -100310 -98143 17493 202826
10172B02826a10050K2428c1581E4374K5575J8234D2684b95214J2935a10120A08668
$$ 202826 -110050 -87622 -31581 54374 79949 98183 42684 -295214 -282279 -110120 108668
10160D80109G5311k0727a61097d0048a1345m8980A1374h8508D131h6394l25945
$$ 480109 75311 54584 -161097 -40048 -11345 -60325 11374 -88508 4131 -86394 -412339
10149d12339A2242e5542k6143A75097a79937D137K11916o0155a90693a0253F3976
$$ -412339 12242 -55542 -81685 175097 -179937 4137 216053 155898 -190693 -10253 63976
10137h8025B11463c43401d8129k8831A51587d17333O0846C5448g4327j62273k4699
$$ -88025 211463 -343401 -48129 -76960 151587 -417333 -356487 35448 -74327 -236600 -261299
10126b61299C3211K9258m941R4929I441L6427J62119q9578L5466e047k2621l60923
$$ -261299 33211 62469 57528 152457 9441 45868 207987 118409 153875 -5047 -27668 -388591
10114c88591J50538Q3419B29855c73r6028d1670A02342a52173c5563G8113a71535
$$ -388591 -238053 -154634 229855 -373 -96401 -41670 102342 -152173 -35563 78113 -171535
10102b42994d727k48466K9552D6686J0982K64900f1984r8100K8289l30216B57509
$$ -242994 -4727 -253193 -223641 46686 57668 322568 -61984 -160084 -131795 -462011 257509
10090e5607l15279C09814a37555G9030O1281a82300O7265j04770f2727A34225
$$ -55607 -370886 309814 -137555 79030 140311 -182300 -115035 -219805 -62727 134225
10079A58577a60588g7956l12870A47301e7121k93372B37748n9030o3455D8551
$$ 158577 -160588 -77956 -390826 147301 -57121 -350493 237748 178718 115263 48551
10068b80121B44971D3233c10103B51294a75599O2305C9635d2570k33736F137J55046
$$ -280121 244971 43233 -310103 251294 -175599 -113294 39635 -42570 -276306 6137 161183
10057A61183J74393b4446m0687I0162A0164a87953G6791c8109C21761c21873K4886
$$ 161183 335576 -24446 -65133 90162 10164 -187953 76791 -38109 321761 -321873 -296987
10046b96987D3205b73484g8028G5316c62089F5318B4173K62955C3457d6098q283
$$ -296987 43205 -273484 -78028 75316 -362089 65318 24173 287128 33457 -46098 -54381
10035e4381b5906o6010A16033g4006I8685b10023i3412j0273j25853B95756b5067
$$ -54381 -25906 -91916 116033 -74006 98685 -210023 -93412 -103685 -229538 295756 -25067
10023f8350p7529r7975l5356A20371M7663p4225a58511B14910g7033j20390L5452
$$ -68350 -145879 -243854 -279210 120371 168034 93809 -158511 214910 -77033 -197423 -161971
10012a61971A78414b84692A02035b46559G3924a68027O3636j10009P7933j10350
$$ -161971 178414 -284692 102035 -246559 73924 -168027 -104391 -214400 -136467 -246817
10002b46817N7606q2839g0579D17M04148F822c9543j70999H2327l5477J83980
$$ -246817 -189211 -272050 -70579 417 404565 6822 -39543 -210542 82327 46850 230830
9991B30830a23727K2178j92211i1068m7621r473A22393b12565k3214f9622e873
$$ 230830 -123727 -101549 -293760 -91068 -138689 -148162 122393 -212565 -235779 -69622 -5873
9979D6632G033O2261f3421I6921O0422e5388k30397J9982J30681k6423k9448j2989
$$ 46632 7033 69294 -63421 96921 157343 -55388 -285785 -265803 -135122 -161545 -190993 -203982
9967b03982A1751g0941D4790b59001H644b23453A75218c7939G6884A1157b35881
$$ -203982 11751 -70941 44790 -259001 8644 -223453 175218 -37939 76884 11157 -235881
9955b14041e3220j82611a06269A42972a63488B3881b87645J09956D26147b03914
$$ -214041 -53220 -235831 -106269 142972 -163488 23881 -287645 -177689 426147 -203914
9944F214f2798q4834A39177b4105j55854l7081b7152H220c05885a15618L4549
$$ 6214 -62798 -147632 139177 -24105 -179959 -217040 -27152 8220 -305885 -115618 -81069
9933h1069q8921f1712k64338a40080C50570d6740B57964b56169A50178l1503b62129
$$ -81069 -169990 -61712 -326050 -140080 350570 -46740 257964 -256169 150178 118675 -262129
9921D4281a01447b9376m6789j74257a23183A60576K9950a60753H3997a46515g529
$$ 44281 -101447 -29376 -76165 -250422 -123183 160576 190526 -160753 83997 -146515 -7529
9909C761g0896o1829j27850A86998Q5383a5441C5778a0651n0480j08631I7397
$$ 3761 -70896 -132725 -260575 186998 272381 -15441 35778 -10651 -61131 -169762 97397
9897A27430a43064N2507l1535k4999r780j34914J16370g5884j22546f1815F9233
$$ 127430 -143064 -90557 -122092 -147091 -156871 -291785 -175415 -75884 -198430 -61815 69233
9885a41728C38498B5698a08157q1529e411F8528b85204A4190a24849j48051J11776
$$ -141728 338498 25698 -108157 -189686 -5411 68528 -285204 14190 -124849 -272900 -161124
9874a61124r1445O1338I5646J78521G3353h0812o0411c2922B19710a66427a1092
$$ -161124 -252569 -191231 95646 274167 73353 -80812 -141223 -32922 219710 -166427 -11092
9862b97449R9250p7205A19536a88974D5791a28386d0922A12654a71193d6998m6717
$$ -297449 -198199 -275404 119536 -188974 45791 -128386 -40922 112654 -171193 -46998 -93715
9851i3715m7559l35314J11182A45905J4243a85046b3758o1103o2091A2990J06706
$$ -93715 -141274 -476588 -365406 145905 160148 -185046 -23758 -84861 -146952 12990 119696
9840A19696e79j32009a8327k68607D2143K54827b77108A0469f31941h3052a0414
$$ 119696 -579 -132588 -18327 -286934 42143 296970 -277108 10469 -631941 -83052 -10414
9828A6860i7244A35320f3865J5592m0705l6112j0073G091J87792c64647O2286
$$ 16860 -97244 135320 -63865 -48273 -88978 -125090 -135163 7091 194883 -364647 -302361
9817c02361B3733g1937P585k19046Q1139B8908b36433B04425C5126J43044q7682
$$ -302361 23733 -71937 -64352 -283398 -202259 28908 -236433 204425 35126 178170 90488
9806I0488B6859a15448M3164I4635J123A6754d0488o5812l40924E3438a45834
$$ 90488 26859 -115448 -72284 94635 95758 16754 -40488 -106300 -447224 53438 -145834
9794d4740j73550C5175I090b55648C337g7744j02771A02894b00876a3430A01883
$$ -44740 -218290 35175 9090 -255648 3337 -77744 -180515 102894 -200876 -13430 101883
9782H5984b96592A25101c4987I862a81261A14590a99995A41988b49328A2954b77158
$$ 85984 -296592 125101 -34987 9862 -181261 114590 -199995 141988 -249328 12954 -277158
9770a12793r731j76097A40580b6572o5990K5611C11045A16957d00426D0222b37740
$$ -112793 -122524 -298621 140580 -26572 -92562 -66951 311045 116957 -400426 40222 -237740
9758a40031j40837r605J22923L7788j81441B34788c7302G7414d4561p8801k221
$$ -140031 -280868 -290473 -167550 -129762 -311203 234788 -37302 77414 -44561 -123362 -125583
9747a25583D54690a02178q9208j35450a09557j86323J43436f1671j31731Q2987
$$ -125583 454690 -102178 -191386 -326836 -109557 -295880 -152444 -61671 -193402 -110415
9737a10415Q180c5768j53240e9762H4273J24852A0895c1078o5512F3130J92028
$$ -110415 -102235 -35768 -189008 -59762 84273 209125 10895 -31078 -96590 63130 255158
9726B55158a00413L536K1592j24155A296J22312d5501k79299L9855A96015a89531
$$ 255158 -100413 -96877 -75285 -199440 1296 123608 -45501 -324800 -284945 196015 -189531
9714a77118d5439j0696r7956j93201A3016d07057a31171A06912c79617e0463j32362
$$ -177118 -45439 -56135 -154091 -347292 13016 -407057 -131171 106912 -379617 -50463 -182825
9703a82825A71182f3639F5475b83386j3108J30357L0106O5769i093n4380j87932
$$ -182825 171182 -63639 65475 -283386 -296494 -166137 -136031 -70262 -9093 -63473 -251405
9692b51405a09625D5667c95222e1299k51723k9657a38299e8797K8645n3870C11642
$$ -251405 -109625 45667 -395222 -51299 -303022 -332679 -138299 -58797 -30152 -84022 311642
9680g866I5312h8985L527C533a35801l31107A3022h7102j07376c8759p2458E1893
$$ -7866 95312 -88985 -85458 3533 -135801 -466908 13022 -87102 -194478 -38759 -111217 51893
9667F4045a73051m7929L4872R0775B33833b7047m9476n9486A65174L83565b6855
$$ 64045 -173051 -220980 -186108 -95333 233833 -27047 -76523 -136009 165174 548739 -26855
9655e2074l98493I9432d9229B90478A22552c12651A17843f3968n3617L9811A40486
$$ -52074 -450567 99432 -49229 290478 122552 -312651 117843 -63968 -117585 -77774 140486
9643c20642a20691A05207a08614C839h8810j25540g5112p7385j40179A0194a87666
$$ -320642 -120691 105207 -108614 3839 -88810 -214350 -75112 -152497 -292676 10194 -187666
9631A3898b5555k492A93199G1298M3837a29819k34559C4991J06384e4769A92422
$$ 13898 -25555 -28047 193199 71298 115135 -129819 -364378 34991 141375 -54769 192422
9619b77303c9666j63372j21360A5921K0649K13685a20339A56589o3935L8978d52625
$$ -277303 -39666 -203038 -324398 15921 36570 250255 -120339 156589 92654 131632 -452625
9607e8316j37879p1911C69966D4589d8826n0090A12261F337O9860e4793n1340
$$ -58316 -196195 -268106 369966 44589 -48826 -98916 112261 6337 76197 -54793 -106133
9596a06133k20714a28461a4216j78731E1143b34198Q6604B01867a58220j10027
$$ -106133 -326847 -128461 -14216 -192947 51143 -234198 -147594 201867 -158220 -268247
9586b68247b0684k50346k03687A50528b09194d5991A25700a53076o3624G5009
$$ -268247 -20684 -271030 -474717 150528 -209194 -45991 125700 -153076 -216700 75009
9575a92382o666l4965i1829L6715j44973C017b46197m6870i065r8559d3469m9022
$$ -192382 -199048 -234013 -91829 -55114 -200087 3017 -246197 -293067 -9065 -107624 -43469 -92491
9563i2491c7757o9748j7449I5719J26283a11622n2914D6018b50080Q7472d8586
$$ -92491 -37757 -107505 -124954 95719 222002 -111622 -164536 46018 -250080 -162608 -48586
9551f7874m0255A6761g7935k1490A61883a11780l0658P138B28209G6807b5982
$$ -67874 -108129 16761 -77935 -99425 161883 -111780 -142438 -135300 228209 76807 -25982
9539C13549d0183o5339l23191a40874A33543C0472f6965a6556r9492A57834b84570
$$ 313549 -40183 -105522 -428713 -140874 133543 30472 -66965 -16556 -116048 157834 -284570
9527A31180d36213a50973H4182b91470A94715b9773k01624N2368L396h4556A29779
$$ 131180 -436213 -150973 84182 -291470 194715 -29773 -231397 -179029 -175633 -84556 129779
9515d38524a67286a8213j20754b413F6325a80394C24713F6927M2327a16730A40426
$$ -438524 -167286 -18213 -138967 -2413 66325 -180394 324713 66927 109254 -116730 140426
9503a69176H4480b8611A15466b63443J29351B77823a84252m8854A67821h8224
$$ -169176 84480 -28611 115466 -263443 -134092 277823 -184252 -233106 167821 -88224
9492A22222a29016B10545b5006l02841A6054B993J56530A0645a85674g0915C34661
$$ 122222 -129016 210545 -25006 -327847 16054 2993 159523 10645 -185674 -70915 334661
9480b40995l587e2706C4047a01331r7586k66448a42387B09283h6997m0303c7375
$$ -240995 -244582 -52706 34047 -101331 -198917 -465365 -142387 209283 -86997 -127300 -37375
9468g3586G4994N816b61367a2341B31833b83616d3516r5183K6130P86b8769j09915
$$ -73586 74994 80810 -261367 -12341 231833 -283616 -43516 -138699 -112569 -111783 -28769 -138684
9456a38684c3538p6138A46502b30521d1821B893d35970B423c78505G276a17276
$$ -138684 -33538 -109676 146502 -230521 -41821 2893 -435970 2423 -378505 7276 -117276
9444a09551F2605j7933d63344A25701b53511c3152l3818a3089l3127Q412l30811
$$ -109551 62605 44672 -463344 125701 -253511 -33152 -66970 -13089 -46216 -37804 -368615
9433c68615d3011J6416k43512A58248b61414a13480l4606q2099j5973O4887h7712
$$ -368615 -43011 -26595 -270107 158248 -261414 -113480 -148086 -230185 -246158 -181271 -87712
9421b53403d0198A70009d71894E032P1586a68470j51840E3859P5351b20321H1576
$$ -253403 -40198 170009 -471894 5032 76618 -168470 -320310 53859 129210 -220321 81576
9409a59592B4583b69977P2603k63473d6221j84334I3364i2031l7423A23196J69449
$$ -159592 24583 -269977 -197374 -460847 -46221 -230555 93364 -92031 -129454 123196 292645
9398B92645m6164E9505b76872J27926C2977b2270A21382b18160P2503j3219c613
$$ 292645 246481 59505 -276872 -148946 32977 -22270 121382 -218160 -145657 -158876 -3613
9386A23157a03593A41810d4210k42357a10238c4109C4333J296d05710J63599A713
$$ 123157 -103593 141810 -44210 -286567 -110238 -34109 34333 35629 -405710 -242111 1713
9374a18398A94603i8796M4209D8419a95274A4389a864j12080B00214J87927a01940
$$ -118398 194603 -98796 -54587 48419 -195274 14389 -1864 -113944 200214 388141 -101940
9362B03591a29436p8060N0572B00611b57073J09253j55229a20909j45055C2120
$$ 203591 -129436 -207496 -156924 200611 -257073 -147820 -303049 -120909 -265964 32120
9351G599J46285P5567D3246H901J07733f9473F7381j5603k4230a41639L8143c6147
$$ 7599 153884 229451 43246 8901 116634 -69473 67381 51778 27548 -141639 -103496 -36147
9338I7972m4241J15576J91754A6568G111b02899A38666b26805C8341J68095E2822
$$ 97972 53731 169307 361061 16568 7111 -202899 138666 -226805 38341 206436 52822
9326d1038l54932B12171a59804M0392B38602b01122D9967J85511l0642a8036j86058
$$ -41038 -395970 212171 -159804 -119412 238602 -201122 49967 235478 204836 -18036 -204094
9315b04094R8589A21984j5846b09830r1075D8683K6968a10520k66154A18323d13385
$$ -204094 -105505 121984 106138 -209830 -300905 48683 75651 -110520 -376674 118323 -413385
9303a09084j5866a5650A23845f7059E3716h2972j30841M5795k07131a52193b5718
$$ -109084 -124950 -15650 123845 -67059 53716 -82972 -213813 -168018 -375149 -152193 -25718
9291A41953Q2354b74374h6436A99185J99951A73970m7492a41828p1378i2423E3822
$$ 141953 224307 -274374 -86436 199185 399136 173970 126478 -141828 -213206 -92423 53822
9279B73598a30101B9120a29234e1597C3127J59048E4427Q6780a51799B22646A7308
$$ 273598 -130101 29120 -129234 -51597 33127 192175 54427 141207 -151799 222646 17308
9267a47955j6527C64251E5660b56824j2084J8324A32439j4407J47456C0881a43528
$$ -147955 -164482 364251 55660 -256824 -268908 -250584 132439 118032 265488 30881 -143528
9255B35418H4811c61233a07010D7678a17945E579K3070M1243g20m23248A99830
$$ 235418 84811 -361233 -107010 47678 -117945 5579 28649 69892 -720 -423968 199830
9243b5657m05994B08700c46175J28789h2980m082f615B9877b37404d3490H3646
$$ -25657 -431651 208700 -346175 -217386 -82980 -87062 -6615 29877 -237404 -43490 83646
9231H6358b43918a03257a2439p8141h538j09848N0267l4121K238D9198b49386
$$ 86358 -243918 -103257 -12439 -90580 -8538 -118386 -68119 -102240 -100002 49198 -249386
9219a27632j20993J11965F6469e4751I7253a68144A35695D7775a69817j09591
$$ -127632 -248625 -136660 66469 -54751 97253 -168144 135695 47775 -169817 -279408
9209b79408J08148A22356A8442a48717A69228a27003A01239H527J51797b62331
$$ -279408 -171260 122356 18442 -148717 169228 -127003 101239 8527 160324 -262331
9198B41106i2938A60736e765j89187F7024a08579n8616C1285a04736j38665D0273
$$ 241106 -92938 160736 -5765 -194952 67024 -108579 -167195 31285 -104736 -243401 40273
9186E192f4593j1686n8088A3464c33497J64600j92253B48144f914r972A21638
$$ 5192 -64593 -76279 -134367 13464 -333497 -168897 -361150 248144 -6914 -16886 121638
9174b07971B0531P2214a26078I0269B5246d8G9505D047a57196D4107c1097l47326
$$ -207971 20531 92745 -126078 90269 25246 -48 79505 4047 -157196 44107 -31097 -378423
9162c78423D3338k0199b08897j32695B4054c5370k82183i3215B49690e10512a52142
$$ -378423 43338 23139 -208897 -341592 24054 -35370 -317553 -93215 249690 -510512 -152142
9150E7933c4526j74938f7953p5125m017M7927c3268H6379e4987j8172k1360b5861
$$ 57933 -34526 -209464 -67953 -143078 -147095 -99168 -33268 86379 -54987 -73159 -94519 -25861
9137F5309a05519A45370O8019a84560A49965b56220H9017a22419j90626R6797
$$ 65309 -105519 145370 213389 -184560 149965 -256220 89017 -122419 -313045 -216248
9127b16248A10213E2274b65420D0015L8310b98896a03107m1416e5291o4368A3284
$$ -216248 110213 52274 -265420 40015 78325 -298896 -103107 -144523 -55291 -119659 13284
9115f9972p2031j22436a26773j39215B71653I9391b08066N5418b0536j42172G3662
$$ -69972 -142003 -264439 -126773 -265988 271653 99391 -208066 -152648 -20536 -162708 73662
9103a34463C7284J85107E5168b52890E9246r001a46476K2230l05024B34199a13863
$$ -134463 37284 222391 55168 -252890 59246 50245 -146476 -124246 -429270 234199 -113863
9091A54364o2206c23283D54262e6783j65172A29019c08070Q2736A26562f71038
$$ 154364 92158 -323283 454262 -56783 -221955 129019 -308070 -225334 126562 -671038
9080A46329J37726b12793L7004j59514J45676e1621l187J3564B05673d70180g1091
$$ 146329 284055 -212793 -175789 -335303 -189627 -51621 -54808 -41244 205673 -470180 -71091
9068d2666G6462a0744l90240a49146d3362J4440n0222j04560B37868a61337P5609
$$ -42666 76462 -10744 -400984 -149146 -43362 -28922 -79144 -183704 237868 -161337 -85728
9057h5728j11307a8740q3206j53773f4003l146B54633j07248b35091A7536b15402
$$ -85728 -197035 -18740 -101946 -255719 -64003 -67149 254633 147385 -235091 17536 -215402
9045h8488k08935A110h1096j96961d4497B08667N4220d0027k25238R1436N7248
$$ -88488 -297423 1110 -81096 -278057 -44497 208667 262887 -40027 -265265 -173829 -116581
9034a16581J7718A49662a46024M2817e413j88214E1069J54030c16652b2162A70898
$$ -116581 -98863 149662 -146024 -103207 -5413 -193627 51069 205099 -316652 -22162 170898
9022a68419A69652c8614k33957C7466a76048L5001B9448a65245r8843I1781R335
$$ -168419 169652 -38614 -272571 37466 -176048 -141047 29448 -165245 -264088 91781 101116
9011A01116m7965a22333M773k626k77310I204f0646A85168b07347a6314r5311
$$ 101116 53151 -122333 -117560 -120186 -397496 9204 -60646 185168 -207347 -16314 -111625
9000a11625A53580d0324A84051b81889D53898A26592a85797b5493n5910j3634
$$ -111625 153580 -40324 184051 -281889 453898 126592 -185797 -25493 -81403 -95037
8990i5037q099d3168l24608f2559B39582a78250k1178i0537A24182F073a13870
$$ -95037 -103136 -43168 -367776 -62559 239582 -178250 -199428 -90537 124182 6073 -113870
8978b42327G4860b2206A55685h6922k24077A30198d4875E9938a17843k01433a23491
$$ -242327 74860 -22206 155685 -86922 -310999 130198 -44875 59938 -117843 -319276 -123491
8966c4393B76761b32589k24566A34560c92703J82508e4540k56346A4899c2305
$$ -34393 276761 -232589 -457155 134560 -392703 -210195 -54540 -310886 14899 -32305
8955a87700B15364c58865g908k33147C3277b80637I7255b78639a33580p3679A24191
$$ -187700 215364 -358865 -7908 -241055 33277 -280637 97255 -278639 -133580 -207259 124191
8943a7501k6233a8374D8227J02014a04366A44589b00453j29643f4226j75385B8341
$$ -17501 -43734 -18374 48227 150241 -104366 144589 -200453 -330096 -64226 -239611 28341
8931B58601j06358e4192k80230f2080J5300r464j1248l38287e0737j94629E2712
$$ 258601 152243 -54192 -334422 -62080 -46780 -56244 -67492 -405779 -50737 -245366 52712
8919A83245h116A24407b63852e2513j629p6736k0038C01053A29988O4173b64950
$$ 183245 -8116 124407 -263852 -52513 -54142 -130878 -150916 301053 129988 194161 -264950
8907b0898k66854A51591m5487a39895m7387A22147c51057A88434a84916K2860
$$ -20898 -287752 151591 106104 -139895 -187282 122147 -351057 188434 -184916 -162056
8897a62056D6218e0882C88720A90015I2438J10750q4878A7127c24245J26455B62050
$$ -162056 46218 -50882 388720 190015 92438 203188 118310 17127 -324245 -197790 262050
8885C63588A9120f0177n0498M4663j07719B35596b4175j28482A7983N201O2346
$$ 363588 19120 -60177 -110675 -66012 -173731 235596 -24175 -152657 17983 23184 85530
8874H5530P0600G84J3228b36952k0476P3356a7784j37560L1231I130c2820D0986
$$ 85530 156130 784 14012 -236952 -257428 -184072 -17784 -155344 -124113 9130 -32820 40986
8861c48409m4264b3809R604k1077p9260G3971b88754M3964i2855a531E8223a98828
$$ -348409 -392673 -23809 -14205 -35282 -114542 73971 -288754 -244790 -92855 -1531 58223 -198828
8848a81623k76172a81916c9884j66523a9437l16715A36545N2340a44514E8309
$$ -181623 -457795 -181916 -39884 -206407 -19437 -336152 136545 188885 -144514 58309
8837C17000a63831D2575Q6610b14318B07991a30871c0464I5445R7088b31856E1669
$$ 317000 -163831 42575 129185 -214318 207991 -130871 -30464 95445 192533 -231856 51669
8825E6819a41204J0038f295k15423J06921l5698j14137Q3191H0571a78355P0227
$$ 56819 -141204 -131166 -6295 -221718 -114797 -150495 -264632 -181441 80571 -178355 -108128
8814a08128R28k7515c3035C70547c40027a51002A4978c8888p168F8257a94298
$$ -108128 -107200 -134715 -33035 370547 -340027 -151002 14978 -38888 -46056 68257 -194298
$$ [...]
##END NTUPLES=NMR SPECTRUM
##END=
