##TITLE=AC1561_ROEFFECT0018_8270796_OJMknnd640
##JCAMPDX= 6.0         $$ Bruker NMR JCAMP-DX V2.0
##DATA TYPE= NMR SPECTRUM
##DATA CLASS= NTUPLES
##ORIGIN= BRUKER
##OWNER= Administrator
$$ 1.72 TOPSPIN		Version 2.1
$$ 2014-08-04 17:04:55.260 -0700  Administrator@X
$$ Compression mode = diff/dup
##.OBSERVE FREQUENCY= 400.02188249412
##.OBSERVE NUCLEUS= ^1H
##.ACQUISITION MODE= SIMULTANEOUS (DQD)
##.ACQUISITION SCHEME= undefined
##.AVERAGES= 64
##.DIGITISER RES= 22
##SPECTROMETER/DATA SYSTEM= spect
##.PULSE SEQUENCE= noesygpps1d.comp
##.SOLVENT NAME= COFFEE_meoh
##.SHIFT REFERENCE= INTERNAL, COFFEE_meoh, 1, 14.97789
##AUDIT TRAIL= $$ (NUMBER, WHEN, WHO, WHERE, PROCESS, VERSION, WHAT)
$$ ##TITLE= Audit trail, TOPSPIN		Version 2.1
$$ ##JCAMPDX= 5.01
$$ ##ORIGIN= Bruker BioSpin GmbH
$$ ##OWNER= Administrator
$$ $$ E:\/data/COFFEE/nmr/AC1561_ROEFFECT0018_8270796_OJMknnd640/22/pdata/1/auditp.txt
$$ ##AUDIT TRAIL=  $$ (NUMBER, WHEN, WHO, WHERE, PROCESS, VERSION, WHAT)
(   1,<2014-08-04 17:04:50.120 -0700>,<Administrator>,<X>,<go>,<TOPSPIN 2.1>,
      <created by zg
	started at 2014-08-04 16:53:20.817 -0700,
	POWCHK enabled, PULCHK disabled,
       configuration hash MD5:
       16 EA D6 F4 BB 67 03 14 9B FF E7 A0 43 5B 48 2E
       data hash MD5: 64K
       10 3F BC FA 68 73 E8 F2 6E EA 20 28 F6 E5 2E 64>)
(   2,<2014-08-04 17:04:53.260 -0700>,<Administrator>,<X>,<proc1d>,<TOPSPIN 2.1>,
      <Start of raw data processing
       efp LB = 0.3 FT_mod = 6 PKNL = 1 PHC0 = 0 PHC1 = 0 SI = 128K 
       data hash MD5: 128K
       CE 47 57 72 11 CE D4 18 03 A9 E1 0F D4 89 7D C7>)
(   3,<2014-08-04 17:04:54.198 -0700>,<Administrator>,<X>,<proc1d>,<TOPSPIN 2.1>,
      <pk PHC0 = -88.97827 PHC1 = 0 
       data hash MD5: 128K
       96 57 49 47 E0 6A 56 25 5A 8D 23 11 02 4D D5 00>)
(   4,<2014-08-04 17:04:54.635 -0700>,<Administrator>,<X>,<proc1d>,<TOPSPIN 2.1>,
      <abs ABSG = 1 
       data hash MD5: 128K
       23 6A AC 48 00 2F 82 1D 4B 66 35 AA D9 DD 43 FD>)
(   5,<2014-08-04 17:04:54.729 -0700>,<Administrator>,<X>,<proc1d>,<TOPSPIN 2.1>,
      <abs ABSG = 2 
       data hash MD5: 128K
       77 D8 99 45 04 9A 82 48 F9 E4 D6 BA 65 07 44 40>)
(   6,<2014-08-04 17:04:54.838 -0700>,<Administrator>,<X>,<proc1d>,<TOPSPIN 2.1>,
      <abs ABSG = 3 
       data hash MD5: 128K
       ED BB F2 51 0F 7A D3 2A 1F BA 57 ED 03 0C 56 0B>)
(   7,<2014-08-04 17:04:54.948 -0700>,<Administrator>,<X>,<proc1d>,<TOPSPIN 2.1>,
      <abs ABSG = 4 
       data hash MD5: 128K
       6F 8E 32 79 25 74 65 0E D3 BB 4B 73 FC EA 62 58>)
(   8,<2014-08-04 17:04:55.042 -0700>,<Administrator>,<X>,<proc1d>,<TOPSPIN 2.1>,
      <abs ABSG = 5 
       data hash MD5: 128K
       D6 F6 4C 82 A5 0B F1 D7 5C 4A 6B ED D5 F7 27 46>)
$$ ##END=
$$ 
$$ $$ hash MD5
$$ $$ EE CA 0C BA B0 DE 46 4A 1C 70 DF 2E 5E BD 58 05
##$RELAX= 
##$RELAX= 
##$RELAX= 
##$RELAX= 
##$RELAX= 
##$RELAX= 
##$RELAX= 
##$RELAX= 
$$ Bruker specific parameters
$$ --------------------------
##$DU= <E:\>
##$EXPNO= 22
$$ [...]
##$TP07= 0
##$TPNAME0= <>
##$TPNAME1= <>
##$TPNAME2= <>
##$TPNAME3= <>
##$TPNAME4= <>
##$TPNAME5= <>
##$TPNAME6= <>
##$TPNAME7= <>
##$TPOAL= (0..7)
0.5 0.5 0.5 0.5 0.5 0.5 0.5 0.5
##$TPOFFS= (0..7)
0 0 0 0 0 0 0 0
##$TUNHIN= 0
##$TUNHOUT= 0
##$TUNXOUT= 0
##$USERA1= <user>
##$USERA2= <user>
##$USERA3= <user>
##$USERA4= <user>
##$USERA5= <user>
##$V9= 5
##$VALIST= <valist>
##$VCLIST= <CCCCCCCCCCCCCCC>
##$VD= 0
##$VDLIST= <DDDDDDDDDDDDDDD>
##$VPLIST= <PPPPPPPPPPPPPPP>
##$VTLIST= <TTTTTTTTTTTTTTT>
##$WBST= 1024
##$WBSW= 4
##$XGAIN= (0..3)
0 0 0 0
##$XL= 0
##$YL= 0
##$YMAX_a= 10467815
##$YMIN_a= -11578884
##$ZGOPTNS= <>
##$ZL1= 120
##$ZL2= 120
##$ZL3= 120
##$ZL4= 120
##$ABSF1= 14.97789
##$ABSF2= -5.580292
##$ABSG= 5
##$ABSL= 3
##$ALPHA= 0
##$AQORDER= 0
##$ASSFAC= 0
##$ASSFACI= 0
##$ASSFACX= 0
##$ASSWID= 0
##$AUNMP= <proc_prof1d_extract.lims>
##$AXLEFT= 0
##$AXNAME= <>
##$AXNUC= <1H>
##$AXRIGHT= 0
##$AXTYPE= 0
##$AXUNIT= <>
##$AZFE= 0.1
##$AZFW= 0.1
##$BCFW= 0
##$BC_mod= 0
##$BYTORDP= 0
##$COROFFS= 0
##$CY= 15
##$DATMOD= 1
##$DC= 0
##$DFILT= <>
##$DTYPP= 0
##$F1P= 0
##$F2P= 0
##$FCOR= 0.5
##$FTSIZE= 131072
##$FT_mod= 6
##$GAMMA= 0
##$GB= 0
##$INTBC= 1
##$INTSCL= 1
##$ISEN= 128
##$LB= 0.3
##$LEV0= 0
##$LPBIN= 0
##$MAXI= 10000
##$MC2= 0
##$MEAN= 0
##$ME_mod= 0
##$MI= 0
##$NCOEF= 0
##$NC_proc= -1
##$NLEV= 6
##$NOISF1= 0
##$NOISF2= 0
##$NSP= 0
##$NTH_PI= 0
##$NZP= 0
##$OFFSET= 14.97789
##$PC= 1
##$PHC0= -88.97827
##$PHC1= 0
##$PH_mod= 1
##$PKNL= yes
##$PPARMOD= 0
##$PPDIAG= 0
##$PPIPTYP= 0
##$PPMPNUM= 2147483647
##$PPRESOL= 1
##$PSCAL= 4
##$PSIGN= 0
##$PYNMP= <proc.py>
##$REVERSE= no
##$SF= 400.020002879253
##$SI= 131072
##$SIGF1= 0
##$SIGF2= 0
##$SINO= 400
##$SIOLD= 131072
##$SPECTYP= <>
##$SREGLST= <1H.CDCl3>
##$SSB= 0
##$STSI= 131072
##$STSR= 0
##$SW_p= 8223.68421052631
##$SYMM= 0
##$S_DEV= 0
##$TDeff= 65536
##$TDoff= 0
##$TI= <>
##$TILT= no
##$TM1= 0
##$TM2= 0
##$TOPLEV= 0
##$USERP1= <user>
##$USERP2= <user>
##$USERP3= <user>
##$USERP4= <user>
##$USERP5= <user>
##$WDW= 1
##$XDIM= 131072
##$YMAX_p= 176600427
##$YMIN_p= -501245833
##$CURPLOT= <Network HP LaserJet P1505>
##$CURPRIN= <$Network HP LaserJet P1505>
##$DFORMAT= <normdp>
##$LAYOUT= <+/1D_H.xwp>
##$LFORMAT= <normlp>
##$PFORMAT= <normpl>
##$SURQMSG= 1
$$ End of Bruker specific parameters
$$ ---------------------------------
##NTUPLES= NMR SPECTRUM
##VAR_NAME=  FREQUENCY,     SPECTRUM/REAL,   SPECTRUM/IMAG
##SYMBOL=    X,             R,               I
##VAR_TYPE=  INDEPENDENT,   DEPENDENT,       DEPENDENT
##VAR_FORM=  AFFN,          ASDF,            ASDF
##VAR_DIM=   131072,        131072,          131072
##UNITS=     HZ,            ARBITRARY UNITS, ARBITRARY UNITS
##FACTOR=    0.0627417313425164, 1,          1
##FIRST=     8223.62146879497, 1254,         -15207
##LAST=      0,             1469,            -15260
##MIN=       0,             -501245833,      0
##MAX=       8223.62146879497, 176600427,    0
$$ Real data points
##PAGE= N=1
##DATA TABLE= (X++(R..R)), XYDATA
$$ [...]
62842C36410n967n303m915m598m115l601l287k990k396j624j065p65m84k28j78
62827B94894j83J20O85J080J143J109J088Q57L21l26r65j697k485l050l229l149
62811B86213k961k690k402k165j825j195n33m21j023j752j962j667j374j412j619
62796B61212j653j381r37m93j36J06J83J28J20K94N00M95K65l0l55o66o25L4Q41
62777B57902R46K98k16p0J97j6l71k29K33L92J88M6K7j28l31k58PR0N0K71O90
62756B59718P92M41O8KJ29L46P37J229J471J250O89M9m37n54l19j20k70n49n58
62737B64114l41k03j28J18M42N23L69K53J91K5o5K35P36R15P61P66J059J187Q85
62718B71842N12M96Q84J505K118K322J838J001N21N99Q01Q60J033J509J982K135
$$ y = [336410, 330443, 325140, 320225, 315627, 311512, 307911, 304624, 301634, 299238, 297614, 296549, 295784, 295300, 295072, 294894, 294711, 294831, 295516, 296596, 297739, 298848, 299936, 300793, 301114, 300788, 299823, 298126, 295641, 292591, 289362, 286213, 283252, 280562, 278160, 275995, 274170, 272975, 272442, 272021, 270998, 269246, 267284, 265617, 264243, 262831, 261212, 259559, 258178, 257241, 256748, 256612, 256718, 256901, 257029, 257149, 257443, 257943, 258438, 258703, 258673, 258318, 257652, 257027, 257061, 257902, 258848, 259146, 258930, 258860, 259057, 259041, 258670, 258441, 258674, 259066, 259254, 259300, 259327, 259199, 258868, 258610, 258617, 258707, 258757, 259028, 259718, 260510, 260951, 261019, 261021, 261150, 261496, 262233, 263462, 264933, 266183, 266872, 266921, 266484, 265930, 265611, 265491, 265221, 264672, 264114, 263773, 263570, 263442, 263560, 264002, 264525, 264894, 265147, 265338, 265363, 265298, 265533, 266269, 267184, 267945, 268711, 269770, 270957, 271842, 272354, 272850, 273734, 275239, 277357, 279679, 281517, 282518, 283039, 283638, 284439, 285299, 286332, 287841, 289823, 291958]
62702B91958K096K177K470K912L436L921M253M514M887N348N804O446P526Q786
62688C56534R653J0048J0545J1509J2621J3453J4126J5139J6806J9071K1653K4246
62676E35404K6753K9355L2200L5101L7700L9843M1507M2533M2726M2017M0202
62665I45341L6776L1538K5108J8369J1557M452k789r711j6254k2628k8492l3071
62653I60196l6118l8107l9388l9873l9636l9035l8053l6309l3897l1531k9583
62642E58666k7629k5279k2771k0495j8422j6389j4422j2547j0769r373q695q413
62630C63462p702o304m856l903l225k480j815j480j408j516j888k253j948p98
62616C21886M67J151J456J928K586L144L672M433N341O062O482O740P003P518
$$ y = [291958, 294054, 296231, 298701, 301613, 305049, 308970, 313223, 317737, 322624, 327972, 333776, 340222, 347748, 356534, 366187, 376235, 386780, 398289, 410910, 424363, 438489, 453628, 470434, 489505, 511158, 535404, 562157, 591512, 623712, 658813, 696513, 736356, 777863, 820396, 863122, 905139, 945341, 982117, 1013655, 1038763, 1057132, 1068689, 1073141, 1070352, 1060641, 1044387, 1021759, 993267, 960196, 924078, 885971, 846583, 806710, 767074, 728039, 689986, 653677, 619780, 588249, 558666, 531037, 505758, 482987, 462492, 444070, 427681, 413259, 400712, 389943, 380570, 371875, 363462, 355760, 349456, 344600, 340697, 337472, 334992, 333177, 331697, 330289, 328773, 326885, 324632, 322684, 321886, 322353, 323504, 324960, 326888, 329474, 332618, 336290, 340723, 346064, 352126, 358608, 365348, 372351, 379869]
62602C79869Q570J0123J1761J3271J4932J6990J9237K1387K3455K5478K7243K8659
62590F00975K9970L1267L2071L1812L0405K8063K4885K0878J6169J0880N074r73
62578H61476o774j2112j7119k1765k5626k8392l0142l0951l0781k9981k9235k8645
62566E69953k7497k5365k2881k0900j9425j7920j6250j4685j3291j1959j0773
62555C69007r864r077q217p368o651n929n164m643m461m163l403k540k072j841
62541B93614j439j051j220j899k436k455k223k091k080k031j774j187l64K77M11
62526B72052K28J53K39J87j12m31n62n85p01r93j298j291q27k26L1o2j2M69J094
62507B67353J552J959K533L187L737M198M619M940N258N864O789P666Q345R192
$$ y = [379869, 388439, 398562, 410323, 423594, 438526, 455516, 474753, 496140, 519595, 545073, 572316, 600975, 630945, 662212, 694283, 726095, 756500, 784563, 809448, 830326, 846495, 857375, 862449, 861476, 854702, 842590, 825471, 803706, 778080, 749688, 719546, 688595, 657814, 627833, 598598, 569953, 542456, 517091, 494210, 473310, 453885, 435965, 419715, 405030, 391739, 379780, 369007, 359143, 350066, 341849, 334481, 327830, 321901, 316737, 312094, 307633, 303470, 300067, 297527, 295455, 293614, 292175, 291124, 289904, 288005, 285569, 283114, 280891, 278800, 276720, 274689, 272915, 271728, 271364, 271641, 272052, 272280, 272433, 272672, 272859, 272747, 272316, 271754, 271169, 270468, 269475, 268177, 266886, 266059, 265833, 265864, 265802, 265790, 266259, 267353, 268905, 270864, 273397, 276584, 280321, 284519, 289138, 294078, 299336, 305200, 311989, 319655, 328000, 337192]
62493C37192J0503J2060J3588J5236J7126J8895K0111K0817K1215K1177K0473
62482E28393J9116J7136J4368J0925P392M069N00l735q081j1598j4081j5971j7437
62469E30996j8282j8590j8742j8793j8441j7627j6647j5698j4737j3731j2690
62458C47018j1499j0137q878p956p182o255n307m644m227l795l362l110k970k755
62444B64941k551k525k510k264j939j864j941j807j434j076p89m14KK56L80N61
62428B45026P65Q93J119J663K337K776L020L393L917M325M610N080N880O836P768
62413B99408Q652R542J0610J2058J3723J4994J5553J5896J6620J7461J7571J6620
62401D68708J5007J3109J0923Q390N582K465j031m664p925j0467j2246j3327j3924
$$ y = [337192, 347695, 359755, 373343, 388579, 405705, 424600, 444711, 465528, 486743, 507920, 528393, 547509, 564645, 579013, 589938, 597330, 601399, 601899, 598164, 590083, 578485, 564404, 548433, 530996, 512714, 494124, 475382, 456589, 438148, 420521, 403874, 388176, 373439, 359708, 347018, 335519, 325382, 316504, 308548, 301366, 295111, 289804, 285160, 280933, 277138, 273776, 270666, 267696, 264941, 262390, 259865, 257355, 255091, 253152, 251288, 249347, 247540, 246106, 245030, 244241, 243827, 243829, 244085, 244465, 245026, 245791, 246684, 247803, 249466, 251803, 254579, 257599, 260992, 264909, 269234, 273844, 278924, 284804, 291640, 299408, 308060, 317602, 328212, 340270, 353993, 368987, 384540, 400436, 417056, 434517, 452088, 468708, 483715, 496824, 507747, 516137, 521719, 524184, 523153, 518489, 510564, 500097, 487851, 474524, 460600]
62388D60600j4411j4962j5270j5002j4317j3560j2732j1684j0628r935r545r069
62376C09485q373p605o856o156n582n056m280l304k738k879l086k650j894j601
62362B47425j730j603j140r04j054j125r48q14o94j38Q49J635J892J957K096K110
62346B47814J965K045K557L152L499L627L552L100K327J589R49R4j003j854k164
62331B71249k252k484k815l128l532m017m254m052l647l347l168l041k997k974
62317B25541k794k446k109j806j387q94n16j76L39Q45Q88N22L34N39P09N95O48
62300B18832J299K220K749K680K310K005J991K339K861L208L297L334L408L340
62286B55873L055K767K640K621K671K821K891K583J963J441J169Q92N81O83J414
$$ y = [460600, 446189, 431227, 415957, 400955, 386638, 373078, 360346, 348662, 338034, 328099, 318554, 309485, 301112, 293507, 286651, 280495, 274913, 269857, 265577, 262273, 259535, 256656, 253570, 250920, 249026, 247425, 245695, 244092, 242952, 242048, 240994, 239869, 238921, 238107, 237413, 237275, 238124, 239759, 241651, 243608, 245704, 247814, 249779, 251824, 254381, 257533, 261032, 264659, 268211, 271311, 273638, 275227, 276176, 276270, 275267, 273413, 271249, 268997, 266513, 263698, 260570, 257038, 253021, 248767, 244715, 241068, 237721, 234553, 231512, 228515, 225541, 222747, 220301, 218192, 216386, 214999, 214105, 213589, 213413, 213752, 214597, 215485, 216007, 216341, 216880, 217589, 218184, 218832, 220131, 222351, 225100, 227780, 230090, 232095, 234086, 236425, 239286, 242494, 245791, 249125, 252533, 255873, 258928, 261695, 264335, 266956, 269627, 272448, 275339, 277922, 279885, 281326, 282495, 283387, 283968, 284651, 286065]
62271B86065K327K882L179L742M788O079P337Q532R811J1283J2882J4424J5912
62258C89243J7575J9413K0917K1579K1523K1122K0227J8369J5710J3036J0737
62247E89451Q396N666K941Q06p51k223m045o392r152j1880j4024j5435j6358j6941
62233E10059j7059j6691j6034j5122j3795j2203j0874j0100r655r268q984q877
62221C61397q845q819q829q735q251p380o417n499m541l673l190k960k463j590
62207B80205q58n85m31k5M98R06J277J713K063K250K444K621K391J627P91L08
62191B97195L3l49p69j004j015p76j13R01J751K055K035K144K555L243M208N253
62175C17347N993O388O974Q144R588J0790J1772J2849J3961J4719J5015J5158
$$ y = [286065, 288392, 291274, 294453, 298195, 302983, 309062, 316399, 324931, 334742, 346025, 358907, 373331, 389243, 406818, 426231, 447148, 468727, 490250, 511372, 531599, 549968, 565678, 578714, 589451, 597847, 603513, 606454, 607260, 606509, 604286, 600241, 593849, 584697, 572817, 558793, 543358, 527000, 510059, 493000, 476309, 460275, 445153, 431358, 419155, 408281, 398181, 388526, 379258, 370274, 361397, 352552, 343733, 334904, 326169, 317918, 310538, 304121, 298622, 294081, 290408, 287218, 284258, 281795, 280205, 279347, 278762, 278331, 278306, 278804, 279710, 280987, 282700, 284763, 287013, 289457, 292078, 294469, 296096, 296887, 297195, 297228, 296879, 296110, 295106, 294091, 293315, 293202, 294103, 295854, 297909, 299944, 302088, 304643, 307886, 312094, 317347, 323340, 329728, 336702, 344846, 354434, 365224, 376996, 389845, 403806, 418525, 433540, 448698]
62163D48698J5450J5894J6287J6447J6437J6571J7062J7609J7658J7031J5957
62152F31101J4433J2108Q917N354J888j429m550p114q961j0532j2379j4499j6529
62139E97808j8298j9885k1277k2269k2607k2134k0975j9553j8166j6612j4564
62128C81468j2335j0631r608q676p451o224n337m701m192l919l800l489l051l020
62114B95034l465l620k944j949j423j378j289r44m48J83Q72J272J203J018J130
62099B83252J464J764K023K249K234K051K247L108M081M487M370M139L861L503
62085C24833L396L751M076L755K965K326J884J181J87n22n10K01J430K936M293
62070C56182N239O177P772J0041J2245J3744J4526J4876J4859J4264J2842J0551
$$ y = [448698, 464148, 480042, 496329, 512776, 529213, 545784, 562846, 580455, 598113, 615144, 631101, 645534, 657642, 666559, 671913, 673801, 672372, 667822, 660708, 651747, 641215, 628836, 614337, 597808, 579510, 559625, 538348, 516079, 493472, 471338, 450363, 430810, 412644, 396032, 381468, 369133, 358502, 348894, 340218, 332767, 326543, 321206, 316505, 312313, 308394, 304594, 301105, 298054, 295034, 291569, 287949, 285005, 283056, 281633, 280255, 278966, 278022, 277574, 277757, 278629, 279901, 281104, 282122, 283252, 284716, 286480, 288503, 290752, 292986, 295037, 297284, 300392, 304473, 308960, 313330, 317469, 321330, 324833, 328229, 331980, 336056, 339811, 342776, 345102, 346986, 348167, 348354, 347832, 347322, 347523, 348953, 351889, 356182, 361421, 367598, 375370, 385411, 397656, 411400, 425926, 440802, 455661, 469925, 482767, 493318]
62058D93318P715M848K288R9j621k761l539m491n849p339q758j0192j1470j1992
62044D40256j1570j0880j0542j0280r466q131o778n577m398l335k560j947j381
62031C53411j189j647k290k358j759r82k33P45K093L636N206O695P859Q551R063
62016C86801R761J0519J0906J0830J0582J0373J0165R850R200P873N771L228O15
62003D96474j930m041m983m404k896j262L07J868K994L189K706K242K124K359
61989D94747L092M207M899M560L817L738M190M016K852J691J461J940K505L128
61975E40843M146N549O922P875Q323Q507Q792R229R419R092Q534Q094P484O139
61961F48948M037J626q83l526o042p966r190r886j0006r464q670q233q180q092
$$ y = [493318, 501033, 505881, 508169, 508268, 506647, 503886, 500347, 495856, 490007, 482668, 473910, 463718, 452248, 440256, 428686, 417806, 407264, 396984, 387518, 379387, 372609, 367032, 362634, 359299, 356739, 354792, 353411, 352222, 350575, 348285, 345927, 344168, 343186, 342953, 343698, 345791, 349427, 354633, 361328, 369187, 377738, 386801, 396562, 407081, 417987, 428817, 439399, 449772, 459937, 469787, 478987, 486860, 492631, 495859, 496474, 494544, 490503, 485520, 481116, 478220, 476958, 477265, 479133, 482127, 485316, 488022, 490264, 492388, 494747, 497839, 502046, 506945, 511505, 515322, 519060, 523250, 527266, 530118, 531809, 533270, 535210, 537715, 540843, 544989, 550538, 557460, 565335, 573658, 582165, 590957, 600186, 609605, 618697, 627231, 635325, 642809, 648948, 652985, 654611, 653728, 650202, 644160, 636194, 627004, 617118, 607112, 597648, 588978, 580745, 572565, 564473]
61947E64473p906p846p736p241o676o766p510q130q314q589r263r879j0080j0282
61933D48255j0965j1874j2422j2411j1972j1121r838q356p035o106n593n331n021
61920C30210m497l902l358k652j684r30q83j185j022l24J90K04K77Q55J586J974
61904C14859K096K316K712L079L207K878J988Q25j20p97j597k645l548m007m221
61889C17025m495m833n086n157m927m376l833l676l763l607l168k905k987l006
61875B61206k657k117j538p82J32Q23J093J235J554J983K380K731K912K675K183
61860B73813J988K260K517K416K286K512K865K880K582K404K603L068L543L787
61846C11524L746L674L931M571N388O357P572Q759R401R452R398R468R340Q887
$$ y = [564473, 556567, 548721, 540985, 533744, 527068, 520302, 512792, 504662, 496348, 487759, 478496, 468617, 458537, 448255, 437290, 425416, 412994, 400583, 388611, 377490, 367652, 359296, 352261, 346155, 340562, 335231, 330210, 325713, 321811, 318453, 315801, 314117, 313187, 312304, 311119, 310097, 309773, 309963, 310167, 310444, 311299, 312885, 314859, 316955, 319271, 321983, 325062, 328269, 331147, 333135, 333960, 333840, 333043, 331446, 328801, 325253, 321246, 317025, 312530, 307697, 302611, 297454, 292527, 288151, 284318, 280642, 276879, 273272, 270104, 267199, 264212, 261206, 258549, 256432, 254894, 254112, 254244, 255067, 256160, 257395, 258949, 260932, 263312, 266043, 268955, 271630, 273813, 275801, 278061, 280578, 282994, 285280, 287792, 290657, 293537, 296119, 298523, 301126, 304194, 307737, 311524, 315270, 318944, 322875, 327446, 332834, 339191, 346763, 355522, 364923, 374375, 383773, 393241, 402581, 411468]
61832D11468Q596Q822R119Q789P730O354M942L481J926L11j302k726l775m544
61818D59191n255n673n167l560j531J84J579L016M495N750O787P771Q529Q595
61804D84711P701N952L582Q75j762l918n471o590p475q197q740r077r192r061
61790D33338q635p909p041o308n800n325m726m130l682l232k565j759j012k75
61776C70939N32J179J438J570J965K492K738K768L035L542L817L742L742M077
61762D07576M536N044N813O761P403P625P975Q861J0003J0983J1838J2767J3686
61749E20871J4456J5181J5915J6378J6241J5468J4140J2254R861P108M080Q28
61737F62781k313m818o422p148o938n748l938k031r5K091M255N735O401O717O747
$$ y = [411468, 420064, 428886, 438005, 446794, 454524, 460878, 465820, 469301, 471227, 471538, 470236, 467510, 463735, 459191, 453936, 448263, 443096, 439536, 438005, 438189, 439768, 442784, 447279, 453029, 459816, 467587, 476116, 484711, 492412, 498364, 501946, 502821, 501059, 497141, 491670, 485080, 477605, 469408, 460668, 451591, 442399, 433338, 424703, 416794, 409753, 403445, 397645, 392320, 387594, 383464, 379782, 376550, 373985, 372226, 371214, 370939, 371471, 372650, 374088, 375658, 377623, 380115, 382853, 385621, 388656, 392198, 396015, 399757, 403499, 407576, 412112, 417156, 422969, 429730, 437133, 444758, 452733, 461594, 471597, 482580, 494418, 507185, 520871, 535327, 550508, 566423, 582801, 599042, 614510, 628650, 640904, 650765, 657873, 661953, 662781, 660468, 655650, 649228, 642080, 635142, 629394, 625456, 623425, 623330, 625421, 629676, 635411, 641812, 648529, 655276]
61722F55276N909L952J415j247m157p375j0418j2947j5158j7082j8156j8084j7427
61709E44501j6816j6136j5078j3888j2932j2003j0753r353q148p049n882m941
61697D11522m547m421m059l505l127k944k733k540k521k530k341k110k065k036
61683C70043j786j546j697k103k334k320k276k124j580p70k04j07k01j59M4K37
61667C51117K29o9n41r11j038r98q16l88J42L06j29q07j233j315j227j043q47
61650C40432q52j162j557j809j898j783j338p10l30l24k85N5M07M39K87J69k3
61633C29718l72n72l73j0J87K70L93M49L45K45J45k77r99j341q74j66p6o30j180
61614C24882j351j249j047r25j191j880k530k771k899l337l904m115l930l619
$$ y = [655276, 661185, 665137, 666552, 665305, 661148, 653773, 643355, 630408, 615250, 598168, 580012, 561928, 544501, 527685, 511549, 496471, 482583, 469651, 457648, 446895, 437542, 429394, 422345, 416463, 411522, 406975, 402554, 398495, 394990, 391863, 388919, 386186, 383646, 381125, 378595, 376254, 374144, 372079, 370043, 368257, 366711, 365014, 362911, 360577, 358257, 355981, 353857, 352277, 351507, 351303, 351196, 350995, 350836, 350880, 351117, 351346, 351277, 350736, 349825, 348787, 347789, 346973, 346585, 346727, 347033, 346904, 346097, 344864, 343549, 342322, 341279, 340432, 339580, 338418, 336861, 335052, 333154, 331371, 330033, 329323, 328993, 328669, 328384, 328439, 328846, 329285, 329572, 329741, 329718, 329346, 328774, 328401, 328391, 328578, 328848, 329241, 329690, 330035, 330280, 330425, 330148, 329149, 327808, 326934, 326768, 326692, 326062, 324882, 323531, 322282, 321235, 320310, 319119, 317239, 314709, 311938, 309039, 305702, 301798, 297683, 293753, 290134]
61600B90134l197k625k256k471k982l130k767k293j997j813j653j505j293j061
61586B59091j082j436j730j651j495j645j881j753j352j111j067r68q97j117j450
61571B38456j472j243j191j329j225p87m65n52p81q08o74o11p24r59j178j233
61555B23224j094q51n15NO15R96J011Q70P58O39N98Q89J393J530J076N03J46l62
61537B31431j326k217k407k169k209k550k644k311j894j610j408j276j221j109
61523B05080r40j011j318j311p04o6O7R2O14J287J329P76K66j41r14j951k531
61506A98624k401k047j920k065k457k937k958k176j181q93j312j647j571j404
61492A71655j229p77k43k15o39p57l09R3M2q7O3K57J91K0r9l21p11r24p00k49
$$ y = [290134, 286937, 284312, 282056, 279585, 276603, 273473, 270706, 268413, 266416, 264603, 262950, 261445, 260152, 259091, 258009, 256573, 254843, 253192, 251697, 250052, 248171, 246418, 245066, 243955, 242888, 241920, 241023, 239906, 238456, 236984, 235741, 234550, 233221, 231996, 231209, 230744, 230192, 229411, 228603, 227929, 227318, 226594, 225635, 224457, 223224, 222130, 221279, 220764, 220769, 221384, 222380, 223391, 224261, 225019, 225658, 226256, 227145, 228538, 230068, 231144, 231647, 231793, 231431, 230105, 227888, 225481, 223312, 221103, 218553, 215909, 213598, 211704, 210094, 208686, 207410, 206189, 205080, 204140, 203129, 201811, 200500, 199796, 199730, 199797, 199889, 200503, 201790, 203119, 203895, 204161, 204020, 203106, 201155, 198624, 196223, 194176, 192256, 190191, 187734, 184797, 181839, 179663, 178482, 177589, 176277, 174630, 173059, 171655, 170426, 169649, 169406, 169191, 168552, 167795, 167486, 167579, 167621, 167534, 167597, 167854, 168045, 168065, 167966, 167645, 166934, 166010, 165310, 165061]
61472A65061P1J90K46L68N97P75O22J38k33j86k4p9o0M38J101J318J135J044J048
61453A73570P71L03J04J37J7j61L1M67O45O63J020J547J565J154J096J513J680
61436A86122J371J248J596J807J543J315J418J311O68N2n4n0m29r35j144j219
61420A94620j413j456j067n36k29m0J80J82j67m88n07n39q38j015o21O9M25K56
61402A86816j72n73o90l22L09O17L87J10K29N66P82R33J171J358J335J195R84
61385A95035N88J32N1L84N50J74l56n04k61J27N76R44Q91L94o6j90k63n19o62
61366A97025m37j43p3J2L43O26N49L72M45N50L67J60L41P27Q15N74L75L47L33
61347B03308L44N23P87R22R66J154J546J978K269K303K110J975K242K794L118
$$ y = [165061, 165132, 165322, 165568, 165936, 166533, 167308, 167930, 168068, 167835, 167649, 167625, 167546, 167486, 167924, 169025, 170343, 171478, 172522, 173570, 174341, 174644, 174748, 174885, 174902, 174741, 174772, 175239, 175884, 176547, 177567, 179114, 180679, 181833, 182929, 184442, 186122, 187493, 188741, 190337, 192144, 193687, 195002, 196420, 197731, 198399, 198451, 198397, 198347, 197918, 196983, 195839, 194620, 193207, 191751, 190684, 190148, 189919, 189879, 190059, 190241, 190074, 189586, 189079, 188540, 187702, 186687, 186066, 186135, 186560, 186816, 186644, 186071, 185381, 185059, 185368, 185985, 186372, 186482, 186711, 187277, 188059, 188992, 190163, 191521, 192856, 194051, 195035, 195623, 195755, 195806, 196190, 196740, 196914, 196558, 196054, 195793, 195920, 196496, 197440, 198331, 198725, 198659, 198469, 198206, 197687, 197025, 196588, 196445, 196372, 196384, 196727, 197353, 197902, 198274, 198719, 199269, 199636, 199796, 200137, 200864, 201679, 202253, 202628, 202975, 203308, 203652, 204175, 204962, 205884, 206850, 208004, 209550, 211528, 213797, 216100, 218210, 220185, 222427, 225221, 228339]
61332B28339L011K769K602K326J876J573J557J480J108P15M83R3o46j254j277
61317B44755j028j100j469j713j753j796j781j497j040p41o85p66r54j194j237
61302B26001j012q28r37j110j027p94o75o26n24n43q20j060r12n33l06k40p9J67
61284B14142K74K68L69O06Q22R22Q86O63L43K20M13O83Q48J078J477J734J573
61267B27321J256J199J417J677J960K290K444K294K196K550L180L621L860M296
61253B61561N042N781O250O514O688O722O473N826M779L546K420J464M93n19j333
61238C21707j823k174k521k727k734k765k948l074k962k717k405j874j133n26
61224B89324k45n0K22K91q7n90p21m13M8M24O68R06J495K674M051M891N105N380
$$ y = [228339, 231350, 234119, 236721, 239047, 240923, 242496, 244053, 245533, 246641, 247356, 247839, 247932, 247286, 246032, 244755, 243727, 242627, 241158, 239445, 237692, 235896, 234115, 232618, 231578, 230837, 230152, 229386, 228432, 227238, 226001, 224989, 224161, 223224, 222114, 221087, 220293, 219618, 218992, 218468, 217925, 217105, 216045, 215133, 214600, 214294, 214054, 213975, 214142, 214416, 214684, 215053, 215659, 216481, 217403, 218289, 218952, 219295, 219515, 219928, 220611, 221459, 222537, 224014, 225748, 227321, 228577, 229776, 231193, 232870, 234830, 237120, 239564, 241858, 244054, 246604, 249784, 253405, 257265, 261561, 266603, 272384, 278634, 285148, 291836, 298558, 305031, 310857, 315636, 319182, 321602, 323066, 323559, 323040, 321707, 319884, 317710, 315189, 312462, 309728, 306963, 304015, 300941, 297979, 295262, 292857, 290983, 289850, 289324, 289079, 289029, 289251, 289542, 289455, 288865, 288144, 287731, 287779, 288203, 288871, 289777, 291272, 293946, 297997, 302888, 307993, 313373]
61206C13373O089O754O945O967P165P112O161M346K212J88j393k177k261k322
61192C59159k718k996k781k562k886l348l231k687k393k409k265j941j795j727
61178C23420j248l88K89N78Q35J286J773K215K747L340L855M390N108N818O231
61163C60249O563P271Q270Q965R036Q631P757O093L548N59k272m561o178p184
61149D06747p696p680p028n991n221n020m946m483l754l108k456j566o85k16o0
61134C46837J64M78P19J067J736K419K670K673K928L371L479L129K728K518K395
61119C79311K319K340K317K186K345L192M375N157N392N535N818O072O261O543
61105D39163O809O812O745P065P781Q455Q913R333R731R948J0141J0652J1342
$$ y = [313373, 319462, 326216, 333161, 340128, 347293, 354405, 360566, 364912, 367124, 367312, 365919, 363742, 361481, 359159, 356441, 353445, 350664, 348102, 345216, 341868, 338637, 335950, 333557, 331148, 328883, 326942, 325147, 323420, 322172, 321784, 322073, 322651, 323486, 324772, 326545, 328760, 331507, 334847, 338702, 343092, 348200, 354018, 360249, 366812, 374083, 382353, 391318, 400354, 408985, 416742, 422835, 426383, 426942, 424670, 420109, 413931, 406747, 399051, 391371, 384343, 378352, 373131, 368111, 363165, 358682, 354928, 351820, 349364, 347798, 347113, 346897, 346837, 347001, 347479, 348198, 349265, 351001, 353420, 356090, 358763, 361691, 365062, 368541, 371670, 374398, 376916, 379311, 381630, 383970, 386287, 388473, 390818, 394010, 398385, 403542, 408934, 414469, 420287, 426359, 432620, 439163, 445972, 452784, 459529, 466594, 474375, 482830, 491743, 501076, 510807, 520755, 530896, 541548, 552890]
61092E52890J1555J0809R108O712M089J869K68j274l285n338o647p314q133r323
61078E55986j0372j1109j1945j2952j3583j3553j3272j3139j3052j2820j2459
61067D17730j1897j1010j0020r237q407o971n061l470k556j935j349j026r23m91
61053C43377N00J581K416L243M195M852M871M427L660K365O44p18j075n93K68
61038C74013J421K866M270N387O464P775R111J0150J0978J1790J2435J2735J2895
61025D82290J3153J3328J3141J2765J2566J2480J2083J1201J0090R037Q083P092
61013F17309N864M308K543Q31o94k083l344m408n347o344p400q356r301j0587
60999E72991j2310j4080j5420j6159j6280j5772j4807j3782j2940j2154j1215
$$ y = [552890, 564445, 575254, 584362, 591074, 595163, 597032, 597300, 596026, 592741, 587403, 580756, 573442, 565309, 555986, 545614, 534505, 522560, 509608, 496025, 482472, 469200, 456061, 443009, 430189, 417730, 405833, 394823, 384803, 375566, 367159, 360188, 355127, 351657, 349101, 347166, 345817, 344791, 343868, 343377, 343877, 345458, 347874, 351117, 355312, 360164, 365035, 369462, 373122, 375487, 376131, 375413, 374338, 373745, 374013, 375434, 378300, 382570, 387957, 394421, 402196, 411307, 421457, 432435, 444225, 456660, 469395, 482290, 495443, 508771, 521912, 534677, 547243, 559723, 571806, 583007, 593097, 602134, 610217, 617309, 623173, 627481, 630024, 630855, 630161, 628078, 624734, 620326, 614979, 608635, 601235, 592879, 583578, 572991, 560681, 546601, 531181, 515022, 498742, 482970, 468163, 454381, 441441, 429287, 418072]
60988D18072j0137r033p965o987o149n352m450l494k668k004j451j178j337j553
60974C54314j186k09P12J176J537K183K880L240L403L746M275M769N307O128P140
60959C99415P987Q603R276J0166J1086J1841J2474J3106J3678J3977J3855J3399
60947E38863J2965J2899J3135J3150J2535J1506J0646J0128R544Q573P503O857
60935F68304O654O407N798N024M428M091L935M001M401N204O452Q121R953J1652
60921G54425J3375J5661J8602K1494K3622K5035K6198K7410K9055L1856L6197
60910A022930M1581M7410N3757O0664O7387P3462P9931Q8473J00067J15701J37333
60899A888696J66172K00902K39914K84590L38034M02151M80057N79804P08748
$$ y = [418072, 407935, 398902, 390937, 383950, 377801, 372449, 367999, 364505, 361837, 359833, 358382, 357204, 355867, 354314, 353128, 352919, 353631, 354807, 356344, 358527, 361407, 364647, 368050, 371796, 376071, 380840, 386147, 392275, 399415, 407402, 416005, 425281, 435447, 446533, 458374, 470848, 483954, 497632, 511609, 525464, 538863, 551828, 564727, 577862, 591012, 603547, 615053, 625699, 635827, 645371, 653944, 661447, 668304, 674958, 681365, 687163, 692187, 696615, 700706, 704641, 708642, 713043, 718247, 724699, 732820, 742773, 754425, 767800, 783461, 802063, 823557, 847179, 872214, 898412, 925822, 954877, 986733, 1022930, 1064511, 1111921, 1165678, 1226342, 1293729, 1367191, 1447122, 1535595, 1635662, 1751363, 1888696, 2054868, 2255770, 2495684, 2780274, 3118308, 3520459, 4000516, 4580320, 5289068]
60890E289068Q62297J023886J175589J295558J337306J229756R30477M92436O1327
60881A3697700k15749k85673j96651k9789J51812K88533K98475J10367k64805
60872A3554220p11733j078678j273592j299897j216863j083118r34434p90849
60864E165056o63773n55453m61870l80351l11937k56838k12284j75807j47240
60855A999503j26233j10662r8640q9801q3548p8104p2399o7027o2409n7706n2436
60844A100538m7449m3408l9821l6486l4286l3594l3336l2586l1758l1231l0192
60833G06391k7943k5180k2884k0983j9011j7114j5482j3783j1947j0577r820q885
60821E02782p397o098n479m886l800k835k502k218j512j089j572k244k184j741
$$ y = [5289068, 6151365, 7175251, 8350840, 9646398, 10983704, 12213460, 13143937, 13636373, 13697700, 13481951, 13196278, 12999627, 12969838, 13121650, 13410183, 13708658, 13819025, 13554220, 12842487, 11763809, 10490217, 9190320, 7973457, 6890339, 5955905, 5165056, 4501283, 3945830, 3483960, 3103609, 2791672, 2534834, 2322550, 2146743, 1999503, 1873270, 1762608, 1663968, 1574167, 1490619, 1412515, 1340116, 1273089, 1210680, 1152974, 1100538, 1053089, 1009681, 969860, 933374, 899088, 865494, 832158, 799572, 767814, 736583, 706391, 678448, 653268, 630384, 609401, 590390, 573276, 557794, 544011, 532064, 521487, 511667, 502782, 495385, 489287, 483808, 478922, 475122, 472287, 469785, 467567, 466055, 464966, 463394, 461150, 458966, 457225]
60807D57225j739k146k605l395m668n589n424m754m504m499m141l715l805m067
60793D02174l783l160k899k976k924k836l000l084k685k258k427k887k982k841
60779C61432k908k854k152j260j108j663k126k235k376k659k857l040l351l420
60765C27423k908k274k111k134j760j275j356j744j554o90J01M76P63J061J083
60750C13101Q16N86M57L27M41J050J762K011J960K090K168J519J50j232k225k923
60734C22058l262l016k424k010j813j465r53n92m05j94n3j86l72k79r6j67l18
60717C04453k55k89q59j602j788j473j346j581j735j709j901k407k846l010l023
60702B78629k856k391j912j867k183k408k420k438k438k215j911j838j929j888
$$ y = [457225, 455486, 453340, 450735, 447340, 442672, 437083, 431659, 426905, 422401, 417902, 413761, 410046, 406241, 402174, 398391, 395231, 392332, 389356, 386432, 383596, 380596, 377512, 374827, 372569, 370142, 367255, 364273, 361432, 358524, 355670, 353518, 352258, 351150, 349487, 347361, 345126, 342750, 340091, 337234, 334194, 330843, 327423, 324515, 322241, 320130, 317996, 316236, 314961, 313605, 311861, 310307, 309617, 309718, 310194, 310957, 312018, 313101, 313917, 314503, 314960, 315287, 315728, 316778, 318540, 320551, 322511, 324601, 326769, 328288, 328438, 327206, 324981, 322058, 318796, 315780, 313356, 311346, 309533, 308068, 307115, 306523, 306118, 305924, 305871, 305685, 305313, 305034, 304938, 304771, 304453, 304198, 303909, 303050, 301448, 299660, 298187, 296841, 295260, 293525, 291816, 289915, 287508, 284662, 281652, 278629, 275773, 273382, 271470, 269603, 267420, 265012, 262592, 260154, 257716, 255501, 253590, 251752, 249823, 247935]
60688B47935j752j740j777j683j611j766j921j778j486j266r02k21L51M21L64
60673B31168O91J150J204J037J184J594J860K025K247K135J359N86P46J629K229
60658B52844K226K069J881J417R09Q84J133R49L35k9K3Pj96k28j57n26j427k365
60640B59749l076l630l850l530l114l191l443l145k504k426k946l133k636k123
60626B17002k028j981j739j588j561j232n86j72j49p9J72K27O6J47M48L99k5j18
60608B07203L45O96N20L06N19R25J229J566J968K098J880J720J783J750J573J668
60592B27749K116K398K262K093K127K045J676J384J407J480J413J389J413J131
60578B52083N20Q6R1K16J87J11Kl36p50q02n62o35j167j589j588j553j797k108
$$ y = [247935, 246183, 244443, 242666, 240983, 239372, 237606, 235685, 233907, 232421, 231155, 230253, 230032, 230383, 230804, 231168, 231859, 233009, 234213, 235250, 236434, 238028, 239888, 241913, 244160, 246295, 247654, 248240, 248986, 250615, 252844, 255070, 257139, 259020, 260437, 261346, 262230, 263363, 264312, 264647, 264618, 264641, 264648, 264452, 264224, 264067, 263541, 262114, 259749, 256673, 253043, 249193, 245663, 242549, 239358, 235915, 232770, 230266, 227840, 224894, 221761, 219125, 217002, 214974, 212993, 211254, 209666, 208105, 206873, 206287, 206115, 205966, 205887, 206059, 206286, 206352, 206499, 206947, 207346, 207321, 207203, 207548, 208244, 208764, 209070, 209589, 210514, 211743, 213309, 215277, 217375, 219255, 220975, 222758, 224508, 226081, 227749, 229865, 232263, 234525, 236618, 238745, 240790, 242466, 243850, 245257, 246737, 248150, 249539, 250952, 252083, 252603, 252689, 252780, 252996, 253183, 253294, 253296, 252960, 252210, 251408, 250846, 250211, 249044, 247455, 245867, 244314, 242517, 240409]
60560B40409k340k685l056k936k241j611j454j342p83L8O24Q20P20M67L14M10
60544B25354M29q0r33j517j737k011k276j987j155n20l93k95M9K25L4j05jl7k74
60525B12770q5P36J412J298P98N52M38O2l38l00M4J33k46p81j027p43j54O9m67
60506B14171j212j281p58n49r20j130p28k84l00l86l3M64N73L81L16N05Q53J349
60488B11031J880K121J959J610J196O76K77L26N82M64N1J0M02M79j9l61j1O10
60470B23283J024J410J895K021J627J430K015K890L256L148L170L603M350N239
60456B60361N864N648M618L566L036K593J619K18j095k110k807l053k872k579
60442B73007k283j718q27L5P47J620K700L571M135M869N936O886P533Q325R365
$$ y = [240409, 238069, 235384, 232328, 229392, 227151, 225540, 224086, 222744, 221961, 221999, 222623, 223443, 224163, 224630, 224944, 225354, 225783, 225703, 224770, 223253, 221516, 219505, 217229, 215242, 214087, 213567, 213174, 212879, 212928, 213153, 213187, 213082, 213081, 213044, 212770, 212685, 213421, 214833, 216131, 216929, 217481, 217919, 217981, 217643, 217343, 217387, 217520, 217274, 216493, 215466, 214723, 214569, 214638, 214171, 212959, 211678, 210920, 210371, 209451, 208321, 207593, 207309, 207009, 206623, 206590, 207054, 207627, 208008, 208324, 208829, 209682, 211031, 212911, 215032, 216991, 218601, 219797, 220473, 220750, 221076, 221658, 222122, 222173, 222183, 222585, 223064, 223045, 222684, 222673, 223283, 224307, 225717, 227612, 229633, 231260, 232690, 234705, 237595, 240851, 243999, 247169, 250772, 255122, 260361, 266225, 271873, 276491, 280057, 283093, 285686, 287305, 287523, 286428, 284318, 281511, 278458, 275586, 273007, 270724, 269006, 268179, 268214, 268961, 270581, 273281, 276852, 280987, 285856, 291792, 298678, 306211, 314536, 323901]
60427C23901R926R486Q411P089N239K686O3j962l425m462m728m136l421l243l332
60412C38092l157k835k662k415j828j167o94j09Q16J674K149K617L419M133M375
60397C42408M632N537O946Q460J0273J2686J5271J7467J9451K1619K3564K4465
60385E12779K4145K2984K0982J7664J2787O610k92p085j2886j7400k1013k3920
60373E35355k5663k5849k4803k3087k1007j8973j7571j6738j5600j3716j1777
60362C20571j0497r585q494p409o672n955m911m007l804l929l648k973k419k080
60348B44188j733j452j396j364j215j243j590j824j656j480j560j420p71k08k58
60333B25018m57k34L6j67m53k43P6j18m62k24L75O10N35O79Q92O52K02K24O25
$$ y = [323901, 333827, 343313, 351724, 358813, 364052, 366738, 366801, 364839, 361414, 356952, 352224, 348088, 344667, 341424, 338092, 334935, 332100, 329438, 327023, 325195, 324028, 323334, 323225, 324041, 325715, 327864, 330481, 333900, 338033, 342408, 347040, 352577, 359523, 367983, 378256, 390942, 406213, 423680, 443131, 464750, 488314, 512779, 536924, 559908, 580890, 598554, 611341, 617951, 617659, 610574, 597688, 580288, 559275, 535355, 509692, 483843, 459040, 435953, 414946, 395973, 378402, 361664, 346064, 332348, 320571, 310074, 300489, 291995, 284586, 277914, 271959, 267048, 263041, 259237, 255308, 251660, 248687, 246268, 244188, 242455, 241003, 239607, 238243, 237028, 235785, 234195, 232371, 230715, 229235, 227675, 226255, 225484, 225276, 225018, 224561, 224327, 224363, 224196, 223743, 223500, 223576, 223458, 222996, 222772, 223147, 223757, 224292, 224971, 225863, 226515, 226717, 226941, 227566]
60314B27566P62O07O54Q13M96l32j047j290j138n73L95J213J274P51L13K14K85
60297B30963M90P73P88M36K70O62J100J082J025J433J839J639J308J596K148K063
60281B49615J482J273J543J676J559J583J633J323R53J099J497J450J125J180
60267B68991J426J138M45J52L04K74J27N14J295J624J443J551K097K400K364K708
60251B88853L586M272M534N033N999O765O964P026P042O315M532K419O80q20k383
60236C50817l861n138o379p397p593o896o005n355m635l624k701k145j691j162
60222B86235q31q23q28p13p71r99q58j04P37J115J141J231J532J996K617L352
60206B94029M132N044O157P197P767P817P415O366M584K639J182N5j329k915m175
$$ y = [227566, 228328, 228935, 229589, 230402, 230898, 230566, 229519, 228229, 227091, 226518, 226913, 228126, 229400, 230151, 230464, 230678, 230963, 231453, 232226, 233014, 233450, 233720, 234382, 235482, 236564, 237589, 239022, 240861, 242500, 243808, 245404, 247552, 249615, 251097, 252370, 253913, 255589, 257148, 258731, 260364, 261687, 262640, 263739, 265236, 266686, 267811, 268991, 270417, 271555, 272000, 272152, 272456, 272730, 272857, 273371, 274666, 276290, 277733, 279284, 281381, 283781, 286145, 288853, 292439, 296711, 301245, 306278, 312277, 319042, 326006, 333032, 340074, 346389, 350921, 353340, 354020, 353200, 350817, 346956, 341818, 335439, 328042, 320449, 313553, 307548, 302193, 297558, 293934, 291233, 289088, 287397, 286235, 285404, 284581, 283753, 283040, 282269, 281270, 280412, 280308, 281045, 282160, 283301, 284532, 286064, 288060, 290677, 294029, 298161, 303205, 309362, 316559, 324326, 332143, 339558, 345924, 350508, 353147, 354329, 354384, 353055, 350140, 345965]
60191C45965n066n963o714o789o355o179o425o418n807m979m211l291k212j429
60177B74127j166j123j062j049j047q73o13m98m50l47m96j085j473r54lK99q6
60160B62101k15K00M69K91J78L29K44j89l62l2K31N9j92k80m97r34j166j019q37
60141B58379p46m38J00M64O51J083J705J914J613J392J496J533J428J595J983
60126B74152J953J429J205J679K309K625K864L203L338L171L081L121K865K323
60112C09318K077K196K047J475J136J259J207O91L46N06N28n2p09r20j096j709
60096C18300k388k595k478k383k200j831j600j628j466r08m34l50k17K58N70L09
60080B98959m0J56P34J164J355J447J370J102R68J101J179J078J148J512J693
$$ y = [345965, 340899, 334936, 328222, 321433, 315078, 308899, 302474, 296056, 290249, 285270, 281059, 277768, 275556, 274127, 272961, 271838, 270776, 269727, 268680, 267807, 267194, 266696, 266246, 265899, 265403, 264318, 262845, 261891, 261888, 262187, 262101, 261886, 262086, 262555, 262846, 263024, 263353, 263597, 263408, 263046, 263014, 263245, 263304, 263112, 262832, 262335, 261401, 260235, 259216, 258379, 257633, 257195, 257295, 257759, 258410, 259493, 261198, 263112, 264725, 266117, 267613, 269146, 270574, 272169, 274152, 276105, 277534, 278739, 280418, 282727, 285352, 288216, 291419, 294757, 297928, 301009, 304130, 306995, 309318, 311395, 313591, 315638, 317113, 318249, 319508, 320715, 321406, 321752, 322258, 322786, 322734, 322025, 321105, 320009, 318300, 315912, 313317, 310839, 308456, 306256, 304425, 302825, 301197, 299731, 298823, 298389, 298039, 297822, 298080, 298650, 298959, 298919, 299075, 299809, 300973, 302328, 303775, 305145, 306247, 307215, 308316, 309495, 310573, 311721, 313233, 314926]
60065C14926J377R41P53N91K18j35k36k58k95r0M06Q39J080J423J841J866J495
60048C26742J397J810K108J881J612J758J964J824J571J478J283Q66P52J348K197
60033C50591K652K707K673K589K411K233J907J041j93r80r14n60n57q71j281j812
60017C61636k319k342j875j552j701j968k112k364k679k596k218k314k965l189
60003C29442k444j458r61o43p3L69L49L68Q69J376J381J281J596K024K116K168
59987C37760K606L119L248L206L370L535L364K955K382J321k42j651k564l489
59973C58920m756n826o224o324o459o206n337m518m226l873k894j816j297j042
59959B98122n96l33n85o78K5Q75R31M94M49P47P28M34L72M16Q8m69q38j228k009
$$ y = [314926, 316303, 317244, 317997, 318588, 318806, 318671, 318435, 318177, 317882, 317792, 318198, 319037, 320117, 321540, 323381, 325247, 326742, 328139, 329949, 332057, 333938, 335550, 337308, 339272, 341096, 342667, 344145, 345428, 346294, 347046, 348394, 350591, 353243, 355950, 358623, 361212, 363623, 365856, 367763, 368804, 368611, 367631, 366717, 366157, 365600, 364729, 363448, 361636, 359317, 356975, 355100, 353548, 351847, 349879, 347767, 345403, 342724, 340128, 337910, 335596, 332631, 329442, 326998, 325540, 324579, 323936, 323863, 324232, 324581, 324949, 325818, 327194, 328575, 329856, 331452, 333476, 335592, 337760, 340366, 343485, 346733, 349939, 353309, 356844, 360208, 363163, 365545, 366866, 366624, 364973, 362409, 358920, 354164, 348338, 342114, 335790, 329331, 323125, 317788, 313270, 309044, 305171, 302277, 300461, 299164, 298122, 297526, 297193, 296608, 295930, 295955, 296830, 297761, 298255, 298704, 299451, 300179, 300613, 300985, 301401, 301489, 301020, 300182, 298954, 296945]
59940B96945k779k952k840l091l469l241k455j799j516j368j448j990k635k808
59926B62554k605k523k598k535k403k374k200j618r71o88n76l64l73q91j427j437
59910B36971j218j237j165n07L39O69O08P19R20Q50Q16J308J954K001J529J204
59894B45761J155J041Q80Q96Q65M76N2L3J16k34q15j121j272j608j828j484r20
59877B41993p35p65n30k54l89o05k96K83M66L62N72J101J563K068K880L567L593
59860B54874L329L385L390K580J281N07L52oq39j584j974k307k643k736k702k841
59844B52066k924k529j882j507j310q96m03j30K53J077J744J521Q61P54J132J131
59828B48958O88O29J252K056K687L155L284L037L064L860M724M696M135M068M411
$$ y = [296945, 294166, 291214, 288374, 285283, 281814, 278573, 276118, 274319, 272803, 271435, 269987, 267997, 265362, 262554, 259949, 257426, 254828, 252293, 249890, 247516, 245316, 243698, 242727, 242039, 241463, 241099, 240726, 239835, 238408, 236971, 235753, 234516, 233351, 232844, 233183, 233852, 234460, 235179, 236099, 236949, 237765, 239073, 241027, 243028, 244557, 245761, 246916, 247957, 248837, 249733, 250598, 251074, 251126, 251159, 251275, 251041, 250226, 249105, 247833, 246225, 244397, 242913, 241993, 241258, 240493, 239963, 239709, 239320, 238715, 238419, 238702, 239168, 239530, 240102, 241203, 242766, 244834, 247714, 251281, 254874, 258203, 261588, 264978, 267558, 268839, 269346, 269698, 269692, 268853, 267269, 265295, 262988, 260345, 257609, 254907, 252066, 249142, 246613, 244731, 243224, 241914, 241018, 240615, 240485, 240738, 241815, 243559, 245080, 245941, 246695, 247827, 248958, 249646, 250275, 251527, 253583, 256270, 259425, 262709, 265746, 268810, 272670, 277394, 282090, 286225, 290293, 294704]
59813B94704M241L580L289L342K781J512N97N59O61K59l59p94j108j334j299j140
59797C09491j190j334j264j179j365j381o80K30M65K90P13J808K744L325M107
59782C14780N020N327M953M562M245L423K094R22N6q84j653j618j092j023j343
59767C37769j120m29m49j488k472k783l073l752m162l839l304l005k646k062j654
59752C01531j446q59J54Q56J003J230J770J937J456J123J581K462L276M230N525
59737C25829O770P556P849P487O178M336L000K592K524K287J934J286k46k642
59723C76740n011o728p969q807q799p814o415n081l836k837k421k390k170j787
59709C04675j775k040j872j227q58j043j229j172j283j678j951k037k244k361
$$ y = [294704, 298945, 302525, 305814, 309156, 311937, 313449, 314046, 314605, 315266, 315525, 315166, 314372, 313264, 311930, 310631, 309491, 308301, 306967, 305703, 304524, 303159, 301778, 301098, 301328, 301793, 302083, 302796, 304604, 307348, 310673, 314780, 319800, 325127, 330080, 334642, 338887, 342310, 344404, 345326, 345382, 344498, 342845, 341227, 340135, 339112, 337769, 336649, 336220, 335771, 334283, 331811, 329028, 325955, 322203, 318041, 314202, 310898, 307893, 305247, 303185, 301531, 300085, 299226, 299380, 300236, 301239, 302469, 304239, 306176, 307632, 308755, 310336, 312798, 316074, 320304, 325829, 332599, 340155, 348004, 355491, 361669, 366005, 369005, 371597, 374121, 376408, 378342, 379628, 379382, 376740, 371729, 365001, 357032, 348225, 339426, 331612, 325197, 320116, 316280, 313443, 311022, 308632, 306462, 304675, 302900, 300860, 298988, 297761, 296903, 295860, 294631, 293459, 292176, 290498, 288547, 286510, 284266, 281905]
59695B81905j913j348j623k539k847k207j587j513j409j017r06j121q78q8K81
59680B61190p9j99M28R85R18Q81J362J713J514J496K202K904K831K383K207K136
59664B84872J867J739J998K182K023K025K512L025L209L352L478L078K311K267
59650C19938L322M391M586M391M427M258L383K329J699J162K31p81j478k108k800
59635C46950l019k571k193k372k543k222j907k039k084j580j103j243j566j445
59621C19063j112r63p90m63m84r81j117l49O22J023J134J405J441Q89L82N44R08
59604C21152P86M11K63P7m57q29n16N3K52K58M21M12o4m80k93J28K29K46O10J107
59584C23766J360J433J291M79r58k132k576k933l680m253m198m047m190m012l122
$$ y = [281905, 279992, 278644, 277021, 274482, 271635, 269428, 267841, 266328, 264919, 263902, 262996, 261875, 260997, 260909, 261190, 261111, 260912, 261340, 262325, 263243, 264124, 265486, 267199, 268713, 270209, 272411, 275315, 278146, 280529, 282736, 284872, 286739, 288478, 290476, 292658, 294681, 296706, 299218, 302243, 305452, 308804, 312282, 315360, 317671, 319938, 323260, 327651, 332237, 336628, 341055, 345313, 348696, 351025, 352724, 353886, 354117, 353336, 351858, 349750, 346950, 343931, 341360, 339167, 336795, 334252, 332030, 330123, 328084, 326000, 324420, 323317, 322074, 320508, 319063, 317951, 316988, 316198, 315735, 315251, 314270, 313153, 312804, 313426, 314449, 315583, 316988, 318429, 319318, 319700, 320244, 321152, 321938, 322349, 322612, 322689, 322232, 321403, 320887, 320940, 321192, 321450, 321871, 322283, 322219, 321739, 321446, 321574, 321803, 322049, 322659, 323766, 325126, 326559, 327850, 328329, 327371, 325239, 322663, 319730, 316050, 311797, 307599, 303552, 299362, 295350, 292228]
59569B92228k266k059j914j322r70j407j797j256l91j80l28j21J39m2o5P35J644
59552B80628J692J353J598K022J566M70j43j64l88r24j182j158j262j213m24P43
59536B83214J422J583J771J854J329M81p2n95j714l014l496l180k934k928k558
59521B71163j765j142q11l92J2j13o29q59o84n67n69k76L57R65J455J941K187
59504B70273J929J484J304J207Q06L51L11N46O00N25N62M90N7m06n84q22j369
59487B77264j640j151n43o57j218j447j374j456j457r04j69K3k19l27l33n35o05
59470B63252j45L56K84J09O58J602J881J319O51K51o2k58j56K6N4K35P57J051
59452B71865P29M53Q62J382J254J015J626K787L530L926M798O172P424Q587J0185
$$ y = [292228, 289962, 287903, 285989, 284667, 283697, 282290, 280493, 279237, 278846, 278666, 278338, 278217, 278356, 278314, 278249, 278984, 280628, 282320, 283673, 285271, 287293, 288859, 289329, 289186, 289022, 288634, 287710, 286528, 285370, 284108, 282895, 282471, 283214, 284636, 286219, 287990, 289844, 291173, 291654, 291582, 290987, 289273, 286259, 282763, 279583, 276649, 273721, 271163, 269398, 268256, 267445, 267053, 267065, 266952, 266323, 265464, 264780, 264213, 263644, 263368, 263725, 264690, 266145, 268086, 270273, 272202, 273686, 274990, 276197, 277003, 277354, 277665, 278211, 278811, 279336, 279898, 280388, 280445, 280039, 279455, 278633, 277264, 275624, 274473, 273930, 273273, 272055, 270608, 269234, 267778, 266321, 265417, 265248, 265271, 265052, 264725, 264392, 263857, 263252, 263107, 263463, 263747, 263856, 264514, 266116, 267997, 269316, 269967, 270218, 270156, 269898, 269742, 269768, 269822, 270057, 270814, 271865, 272594, 273047, 273909, 275291, 276545, 277560, 279186, 281973, 285503, 289429, 294227, 300399, 307823, 316410, 326595]
59437C26595J1996J3130J2983J1177P300K027k332l893l335k635k402k023j623
59424C66965j919k610k761k694l549n203o344o547o595o693o170n025m143l791
59410C02921l349k682k308k179j714j120j192j770j808j095n07m25l73k62n70
59395B81567j152j255q80p96j068r21k32J96Q6O6M31P19P39Q34J047J070J100
59378B81551J597K248K338K073K275K900L141K901K774K709K173J542J789K799
59364C14810L497L635L980M659M983M973N392O139O183N341M510L894K717R91
59350C75704j52l43n65j336j896j849k083l255m701n507n590n118m077k888k350
59335C33994k445k203j160J15J174K250L347M082M697O006P914R264R571R630
$$ y = [326595, 338591, 351721, 364704, 375881, 383181, 385208, 382876, 378983, 375648, 373013, 370611, 368588, 366965, 365046, 362436, 359675, 356981, 353432, 348229, 341885, 335338, 328743, 322050, 315880, 310855, 306712, 302921, 299572, 296890, 294582, 292403, 290689, 289569, 288377, 286607, 284799, 283704, 283197, 282772, 282399, 282137, 281567, 280415, 279160, 278280, 277484, 276416, 275495, 275263, 275459, 275545, 275611, 276042, 276761, 277500, 278334, 279381, 280451, 281551, 283148, 285396, 287734, 289807, 292082, 294982, 298123, 301024, 303798, 306507, 308680, 310222, 312011, 314810, 318307, 321942, 325922, 330581, 335564, 340537, 345929, 352068, 358251, 363592, 368102, 371996, 374713, 375704, 375552, 375209, 374644, 373308, 371412, 369563, 367480, 364225, 359524, 354017, 348427, 343309, 339232, 336344, 333994, 331549, 329346, 328186, 328301, 329475, 331725, 335072, 339154, 343851, 349857, 357771, 367035, 376606, 386236]
59321C86236R987J0034R234Q075P247O748O373O200O204O040N301L410m49o106
59307D64534j1386j3700j2638r807o471k876M44K646L966N152N343K582k978q380
59293D16431j1154j1597j1082r974q290o760n938n309m350l439k999k716k304
59280C30519k054k028j717j074p91j055j087m21M48J092J691K208K251K078K511
59265C32571L483M023M000M439N680O768P220P872R272J0700J1502J2020J2478
59252D32028J2359J1603J1097J1130J0676R005O783M802K812M41j910l895n826
59239E01105p833r432j0493j1503j2399j2474j1838j1581j1924j1725j0437r049
59227C70417q313p613o438n430n033m558l575k898l096l388k974k279j871j428
$$ y = [386236, 396223, 406257, 415491, 423566, 430813, 437561, 443934, 450134, 456338, 462378, 467679, 471089, 470640, 464534, 453148, 439448, 426810, 417003, 410532, 407656, 408100, 410746, 414712, 419864, 425207, 427789, 424811, 416431, 405277, 393680, 382598, 372624, 364334, 357574, 351636, 346327, 341977, 338538, 335539, 332823, 330519, 328465, 326437, 324720, 323646, 322855, 321800, 320713, 320292, 320740, 321832, 323523, 325731, 327982, 330060, 332571, 336054, 340077, 344077, 348516, 354196, 360964, 368184, 376056, 385328, 396028, 407530, 419550, 432028, 444387, 455990, 467087, 478217, 488893, 497898, 504681, 509483, 512295, 512736, 510826, 506931, 501105, 493272, 483840, 473347, 461844, 449445, 436971, 425133, 413552, 401628, 389903, 379466, 370417, 362104, 354491, 348053, 342623, 337590, 333032, 329457, 326559, 323463, 320075, 317101, 314822, 312951, 311523]
59213C11523p24m22q29j132p86n01q15j010m54K12K63J55M60P34N17M42J162K228
59195C11023L043L963N449P057Q274R419J0718J1368J0422P846M111k48m103n970
59181C82372n595m244k839j004J411L441M465N112N793N757M610L352K767K203
59167D07601J006j64o55j065j950k579k259j657j580j657j417j436k130k623k179
59152C85256j552j631j880j487q70o60l71N63J510J805K092L027L772L243J923
59137C94740R27J83r92k369l359m268n609o884p405p534p853p911p090n929n278
59122C23369m936m315l659l404l182k597k158k285k303j618r12r25j121p57l23
59107B88874n90j131j170r16q47n65K75Q97O02L6M8K28q4m12j09L16K28J74P39
$$ y = [311523, 310799, 310377, 309548, 308416, 307630, 307129, 306314, 305304, 304850, 305062, 305325, 305480, 305940, 306674, 307191, 307633, 308795, 311023, 314066, 318029, 323478, 330535, 338809, 348228, 358946, 370314, 380736, 388582, 392693, 392445, 388342, 382372, 376777, 372533, 369694, 368690, 370101, 373542, 378007, 383119, 388912, 394669, 399279, 402631, 405398, 407601, 408607, 408443, 407788, 406723, 404773, 402194, 399935, 398278, 396698, 395041, 393624, 392188, 390058, 387435, 385256, 383704, 382073, 380193, 378706, 377836, 377176, 376805, 377368, 378878, 380683, 382775, 385802, 389574, 392817, 394740, 395667, 395850, 394858, 392489, 389130, 384862, 379253, 372369, 364964, 357430, 349577, 341666, 334576, 328647, 323369, 318433, 314118, 310459, 307055, 303873, 301276, 299118, 296833, 294530, 292912, 292000, 291075, 289954, 289197, 288874, 288284, 287153, 285983, 285067, 284220, 283655, 283930, 284827, 285429, 285465, 285513, 285741, 285657, 285245, 285136, 285452, 285680, 285854, 286593]
59088B86593J221Q88M93R74J723J688J251J338J674J563J471K165L163L648M025
59073C13878N010O008O149N931O240O550N828M402L230K110L49j592k839l689
59059C57565m888o022o321o233o536o738n986m786m146l855l291k958l486m041
59045B88278l615k913l090l538k976j824j410j599j387j035j445k012j434j01
59031B59899M79K54M15J113J450J481K019K789K796K291K407L138L579L835M744
59016B92689O052O833P363Q581J0091J0655J0390J0410J0681J0223R153Q420P779
59003D09320O128L639J539m8j990m093n246n435n618n749n002l678k894k535j670
58988C76668p30j083k525l463l526l810m527m642m023l741m006l849l041k437
$$ y = [286593, 287814, 288702, 289195, 290169, 291892, 293580, 294831, 296169, 297843, 299406, 300877, 303042, 306205, 309853, 313878, 318888, 324896, 331045, 336976, 343216, 349766, 355594, 359996, 363226, 365336, 365685, 364093, 361254, 357565, 352677, 346655, 340334, 334101, 327565, 320827, 314841, 310055, 305909, 302054, 298763, 295805, 292319, 288278, 284663, 281750, 278660, 275122, 272146, 270322, 268912, 267313, 265926, 264891, 263446, 261434, 260000, 259899, 260378, 260632, 261047, 262160, 263610, 265091, 267110, 269899, 272695, 274986, 277393, 280531, 284110, 287945, 292689, 298741, 305574, 312937, 321518, 331609, 342264, 352654, 363064, 373745, 383968, 393121, 401541, 409320, 415448, 419087, 420626, 420578, 418588, 414495, 409249, 403814, 398196, 392447, 387445, 383767, 380873, 378338, 376668, 375938, 374855, 372330, 368867, 365341, 361531, 357004, 352362, 348339, 344598, 340592, 336743, 333702, 331265]
58974C31265k227j732j060j089j678j797j421j523k144k395k268k553l049k831
58960C03498k156k085k398j989j123j028j430q43O68J493J252J170J524J238K64
58945B98055j51R6l16j505j967j273p39q81n23Q01J929K293K855M036M858M954
58929C12522N357O468P242P113O806O514N367L370J892J381O56q28k030k389k838
58914C56603l835m329l741l051k922k510j129N00J638K624L725M434M630N035
58900C57672N795O119N863N898O372O280N291M341L883L161J790L38j059k935
58886D08809m892n570m771l708k826j266R69K508K911L411M585N383N249N230
58872D16022N954O492O214N945O314O677O597O714P259P385O797O334O165N174
$$ y = [331265, 329038, 327306, 326246, 325157, 323479, 321682, 320261, 318738, 316594, 314199, 311931, 309378, 306329, 303498, 301342, 299257, 296859, 294870, 293747, 292719, 291289, 290446, 291114, 292607, 293859, 295029, 296553, 297791, 298055, 297904, 298000, 297684, 296179, 294212, 292939, 292200, 291319, 290796, 291597, 293526, 295819, 298674, 302710, 307568, 312522, 317879, 324347, 331589, 338702, 345508, 352022, 357389, 360759, 362651, 364032, 364688, 363860, 361830, 359441, 356603, 352768, 348439, 344698, 341647, 338725, 336215, 335086, 335586, 337224, 339848, 343573, 348007, 352637, 357672, 363467, 369586, 375449, 381347, 387719, 393999, 399290, 403631, 407514, 410675, 412465, 412803, 411744, 408809, 403917, 398347, 393576, 389868, 387042, 385776, 386745, 389253, 392164, 395575, 400160, 405543, 410792, 416022, 421976, 428468, 434682, 440627, 446941, 453618, 460215, 466929, 474188, 481573, 488370, 494704, 500869, 506043]
58858E06043K934N22j413l625o483q956j0319j1179j2005j2317j2022j1867j1898
58845D07415j1143r496q083p234n937l968k479j900j276l58j97r24j176o42q45
58830C51757k409l786l820l374l262k784j580q18j132j359o80p7l84p62m04M0
58814C25166L7K98J144J601J288J406K665M104N053O288Q124R436R822J0601J2400
58799C99433J3820J3900J3769J4437J5058J4967J5263J6752J8276J8773J9077
58788E73525J9936K0135J8366J5226J1695P408K135k801o378r505j3177j6608
58776F19957j8805k0224k1293k1031j8848j6058j3947j1963r457p417o693o267
58764D47954n059l861l729m021l801l622m149m572m193l964m778n700n700n555
$$ y = [506043, 508977, 509499, 508086, 504461, 497978, 489022, 478703, 467524, 455519, 443202, 431180, 419313, 407415, 396272, 386776, 378693, 371459, 365522, 361554, 359075, 357175, 355899, 355541, 355344, 354420, 353244, 352602, 351757, 349348, 345562, 341742, 338368, 335106, 332322, 330742, 329924, 328792, 327433, 326753, 326676, 326292, 325530, 325126, 325166, 325203, 325501, 326645, 328246, 329534, 330940, 333605, 337709, 342762, 349050, 357174, 366610, 376432, 387033, 399433, 413253, 427153, 440922, 455359, 470417, 485384, 500647, 517399, 535675, 554448, 573525, 593461, 613596, 631962, 647188, 658883, 666291, 668426, 665625, 659247, 649742, 636565, 619957, 601152, 580928, 559635, 538604, 519756, 503698, 489751, 477788, 468331, 460914, 454221, 447954, 442895, 439034, 435305, 431284, 427483, 423861, 419712, 415140, 410947, 406983, 402205, 396505, 390805, 385250]
58750C85250o296p249p414p277p590p788p273o763o794o483n314m454m634m548
58736B95373l109j484j066j152n80J49K80O07J822K781K452J915K390K925K213
58721C05516J062Q67J156Q47M60Q74J316P82O7K36M96k83j282j168m67m13p15
58704C09351n36l79r28j361q56m24j204k353k613k528l020l300k397j204q16l54
58688B85078J240K865L072K681L090L489K421P90N74J696K745L729N529P595Q688
58673C35282R002R191Q327N180O86l090n592p290p806o698n094m286l793k775
58659C21244k090k699l495l023k075k150k713k362j500j291j238l11P87R13Q83
58644B98880K026L577M025L869M503N573N965O162P108Q024P846P506Q200Q810
$$ y = [385250, 378954, 371705, 364291, 357014, 349424, 341636, 334363, 327600, 320806, 314323, 309009, 304555, 299921, 295373, 292264, 290780, 289714, 288562, 287982, 288131, 288411, 289018, 290840, 293621, 296073, 297988, 300378, 303303, 305516, 306578, 307445, 308601, 309448, 309908, 310782, 312098, 312880, 312947, 313183, 313679, 313396, 312114, 310946, 310479, 310066, 309351, 308815, 308436, 307508, 306147, 305291, 304867, 303663, 301310, 298697, 296169, 293149, 289849, 287452, 286248, 285432, 285078, 286318, 289183, 292255, 294936, 298026, 301515, 303936, 304726, 305300, 306996, 309741, 313470, 318999, 326594, 335282, 344284, 353475, 361802, 366982, 367668, 364578, 358986, 351696, 343890, 337192, 332098, 327812, 324019, 321244, 319154, 316455, 312960, 309937, 307862, 305712, 302999, 300637, 299137, 297846, 296608, 296297, 297084, 297997, 298880, 300906, 304483, 308508, 312377, 316880, 322453, 328418, 334580, 341688, 349712, 357558, 365064, 373264, 382074]
58630C82074P775O011N228M795L238J385Q95R84j27j757j962j098r79j423r36
58615D04103J09J39n39m98j49r35k357k905l101m533o723q008q690j0159j1819
58600C43935j2008j1155j0829j0596r033o935o182o272n326l721l304l761l301
58587B51512k193k100k581j815k07K64k14K45J601K258K536M092O378P323P158
58572B74257P961R782J0842J1171J2412J4287J4957J4522J4514J4289J1752P400
58560D18146L754R62l100q420j2503j4451j5581j5992j4378j1398r335q288o391
58547C03025l885k963l497k995j114j34n68l75R02J271J98m42m2j28q95n98Q40
58530B88600J377O47O72K005K843K615K901M072M537M020M069M744M312K827K371
$$ y = [382074, 389849, 395860, 401088, 405883, 409121, 410506, 411401, 412385, 412258, 410501, 408539, 407441, 406462, 405039, 404103, 404212, 404351, 403812, 403314, 403165, 402230, 399873, 396968, 393867, 389334, 382611, 374603, 365913, 355754, 343935, 331927, 320772, 309943, 299347, 290314, 283379, 277197, 270925, 265599, 261878, 258574, 254813, 251512, 249319, 247219, 244638, 242823, 242616, 242880, 242666, 242911, 244512, 246770, 249306, 253398, 259776, 267099, 274257, 282218, 292000, 302842, 314013, 326425, 340712, 355669, 370191, 384705, 398994, 410746, 418146, 421900, 422862, 419762, 411342, 398839, 384388, 368807, 352815, 338437, 327039, 317704, 309416, 303025, 299140, 296177, 292680, 289685, 288571, 288437, 287869, 287494, 288396, 289667, 289865, 289423, 289381, 289253, 288358, 287760, 288600, 289977, 290624, 291296, 293301, 296144, 298759, 301660, 305732, 310269, 314289, 318358, 323102, 327414, 330241, 332612]
58515C32612L181L153J756P11L14j138l579m707m013l532l903l524k256k076l202
58500C09797l449k318j811k402k129n40L84K19R96L118M431M336M908O767P827
58485C30134P308P014P456O705M362K676K491J981O18L91J806K791K837M088O992
58470C89650R066R440J0414J2933J4646J4260J3622J3743J2766R764O622M348
58458E21274J397k533n026n075m831n479n279l460k041j975j520k84p51l748o444
58443D74225o996p193q411r003p894o886p006o443m253k437k126j484N14K015
58429D06622J999K301L838M786M441M871O705P415N923M649M823M056J030j796
58415D61663k690l571n813p368o860o380p408q003o831n934o692p047n612m511
$$ y = [332612, 335793, 338946, 340702, 341413, 341727, 340589, 337010, 332303, 328290, 324758, 320855, 317331, 315075, 312999, 309797, 306348, 304030, 302219, 299817, 297688, 297148, 297532, 297751, 298747, 301865, 306296, 310632, 315540, 322307, 330134, 337442, 344456, 351912, 358617, 362979, 365655, 368146, 370127, 370745, 371136, 372942, 375733, 378570, 382658, 389650, 398716, 408156, 418570, 431503, 446149, 460409, 474031, 487774, 500540, 510304, 516926, 521274, 522671, 520138, 515112, 510037, 505206, 499727, 494448, 490988, 488947, 486972, 485452, 485168, 484417, 480669, 474225, 467229, 460036, 451625, 442622, 434728, 427842, 420836, 414393, 410140, 407703, 405577, 404093, 404607, 406622, 408621, 410922, 414760, 419546, 423987, 428858, 435563, 442978, 448901, 453550, 458373, 462429, 463459, 461663, 458973, 455402, 449589, 442221, 435361, 428981, 421573, 413570, 406739, 400805, 394113, 387066, 381454, 376943]
58401C76943n257n837m710l718m127l911j919n80j421j996m38J094O72K40J719
58386C46754L403L566L735N145N825M435L128L395L056N27j968k616l336n588
58372C69461p148o391n571o347o391m039j918k231k678r49J032J237J616L967
58358C33650N974N501M712N760O421M395J824J200P34j752m188l978k690k682
58344C54881k727j207N8n74r48P99K350J592P83K186L660K983K299L791N212M312
58328C79450L431M851N964M019J423J216J512l83k533k366j905l684n483m656
58314C80856l578n241p425o917n574o413p600o161l933l897m341k465j53k60q55
58299C16043R41L073K445R52J735L081K078N19J116J778k03k165p03J679J045
$$ y = [376943, 371686, 365849, 361139, 357421, 353294, 349383, 347464, 346884, 345463, 343467, 343029, 344123, 344795, 345035, 346754, 350157, 353723, 357458, 362603, 368428, 372863, 375991, 379386, 382442, 382969, 381001, 378385, 375049, 369461, 362313, 355922, 350351, 344004, 337613, 333574, 331656, 329425, 326747, 325798, 326830, 328067, 329683, 333650, 339624, 345125, 349837, 355597, 362018, 366413, 368237, 369437, 370171, 368419, 364231, 360253, 357563, 354881, 352154, 350947, 351005, 350431, 349483, 350282, 352632, 354224, 355007, 357193, 360853, 363836, 366135, 369926, 375138, 379450, 382881, 387732, 393696, 397715, 399138, 400354, 401866, 401483, 398950, 396584, 394679, 390995, 385512, 380856, 377278, 372037, 364612, 357695, 352121, 345708, 338108, 331947, 328014, 324117, 319776, 317311, 317158, 316898, 316043, 316984, 320057, 322502, 323454, 325189, 328270, 330348, 330867, 331983, 333761, 333558, 331393, 330690, 332369, 333414]
58284C33414p21J57K036J309m45K56J894J171k81P20K305J217m06J159M070M487
58268C52342L797N296P267O420M646N231N970L360j26l57O64j105l737l121j024
58253C85523j382k369j62L047L037J834L716O678O344M666O121Q844Q285O154
58239D40336O833Q514O852L929M322N936L985N46O27K292N01k790k315J55o99
58224D79024l329k569Jo72k788j134K338K100j04J257M433L881J485L002O549
58209D93474O134L519M740Q006P138L931M779P885O552K398K420N531N011J874
58195E63392K535N719N011K085L733Q135P951M712N959J0390J0403P193Q458J3093
58181F58769J3284R954J0764J4620J3861J0050J1418J6295J5536J0029R016J2421
$$ y = [333414, 332693, 332850, 334886, 336195, 335750, 336006, 337900, 339071, 338790, 339510, 341815, 343032, 342626, 343785, 347855, 352342, 356139, 361435, 368702, 375122, 379768, 384999, 390969, 394329, 394203, 393846, 394510, 393405, 389668, 386547, 385523, 384141, 381772, 381610, 384657, 387694, 389528, 393244, 399922, 406266, 410932, 417053, 425897, 434182, 440336, 447169, 455683, 462535, 466464, 470786, 476722, 480707, 481253, 481880, 484172, 484673, 481883, 479568, 479723, 479024, 475695, 473126, 473127, 472455, 469667, 468533, 470871, 472971, 472867, 474124, 478557, 482438, 483923, 486925, 493474, 499608, 503127, 507867, 515873, 523011, 526942, 531721, 539606, 546158, 548556, 550976, 556507, 561518, 563392, 565927, 571646, 576657, 578742, 582475, 590610, 598561, 603273, 609232, 619622, 630025, 637218, 645676, 658769, 672053, 682007, 692771, 707391, 721252, 731302, 742720, 759015, 774551, 784580, 793596, 806017]
58169H06017J2008Q777J1478J8699K0404J6592J6440J9762J7858J2102J2422J7802
58157I90361J7742J2793J3563J9643K0208J5553J6805K3923K5674K1923K3826
58146A202014L1180L2375K7695K9308L7112L8611L3883L5861M4503M6369M1405
58135A600316M3567N3152N5927N1820N5812O7993P2392O8341P2182Q4737Q9259
58124B315498Q5221R0595J06480J14435J13451J22997J44208J56412J57907J70072
58114C577276J94692K09706K14303K33328K69085K96328L13675L49179M05411
58105F062983M53689M93636N59652O56483P52761Q52839J005409J225071J481952
58096A3544475J785305K188374K688591L224627L802962M517603N418871O508158
$$ y = [806017, 818025, 826802, 838280, 856979, 877383, 893975, 910415, 930177, 948035, 960137, 972559, 990361, 1008103, 1020896, 1034459, 1054102, 1074310, 1089863, 1106668, 1130591, 1156265, 1178188, 1202014, 1233194, 1265569, 1293264, 1322572, 1359684, 1398295, 1432178, 1468039, 1512542, 1558911, 1600316, 1643883, 1697035, 1752962, 1804782, 1860594, 1928587, 2000979, 2069320, 2141502, 2226239, 2315498, 2400719, 2491314, 2597794, 2712229, 2825680, 2948677, 3092885, 3249297, 3407204, 3577276, 3771968, 3981674, 4195977, 4429305, 4698390, 4994718, 5308393, 5657572, 6062983, 6516672, 7010308, 7569960, 8226443, 8979204, 9832043, 10837452, 12062523, 13544475, 15329780, 17518154, 20206745, 23431372, 27234334, 31751937, 37170808, 43678966]
58088D3678966P903999R815386J2237139J4849066J7302115J9269876J9922900
58081A44979447J7735307J1584031K301642p283421j4233637j7407635j7561387
58074A20114347j6058625j3869252j1538318r470841p940030o976360o415381
58067D7845540o028036n604617n032004m352635l695781l131719k640538k206029
58059A5154181j852864j582105j350732j137003r62743q34289p20825o08016n17927
58050E587677m58815m05763l47265l03473k82132k60727k28328k03696j96101
58041B901377j87075j66403j49717j45267j37553j18672j03622j00219r4323p8548
58031A619978o6573o5842o3846n4215m9597n5967n9829n3415m8146n1032n1396
$$ y = [43678966, 51582965, 61398351, 73635490, 88484556, 105786671, 125056547, 144979447, 162714754, 174298785, 176600427, 169317006, 155083369, 137675734, 120114347, 104055722, 90186470, 78648152, 69177311, 61237281, 54260921, 47845540, 41817504, 36212887, 31180883, 26828248, 23132467, 20000748, 17360210, 15154181, 13301317, 11719212, 10368480, 9231477, 8268734, 7434445, 6713620, 6105604, 5587677, 5128862, 4723099, 4375834, 4072361, 3790229, 3529502, 3301174, 3097478, 2901377, 2714302, 2547899, 2398182, 2252915, 2115362, 1996690, 1893068, 1792849, 1698526, 1619978, 1553405, 1487563, 1423717, 1369502, 1319905, 1263938, 1204109, 1150694, 1102548, 1051516, 1000120]
58020A000120m2994l6595l8620l8956l1521k6203k8965l0240k4144j9891k3197
58009F58794k5049j9681j5668j8655k0533j6051j3221j7055j9446j5215j2165
57998D66055j5309j6775j1271o540q602j1195r377r328j4961j8683j5089j0726
57986C18199j1004j0427m908r71l435o175m158k749o238q842o025l401n616p422
57972B36828m482k131m752p009m310j704l860o062l726j219k864m469k025K25
57958A88440j555l052n23J480j041l659k188o82l087n311l403j451l513n666l787
57943A51002j598l199n131l467j562l190n001l258j214k462l752j612N26r89k825
57928A12268j240O45q25k618j182M61j160k900j096J279M64q77P47K602J208p33
$$ y = [1000120, 957126, 920531, 881911, 842955, 811434, 785231, 756266, 726026, 701882, 681991, 658794, 633745, 614064, 598396, 579741, 559208, 543157, 529936, 512881, 493435, 478220, 466055, 450746, 433971, 422700, 416160, 407558, 396363, 386986, 377658, 362697, 344014, 328925, 318199, 307195, 296768, 291860, 290889, 287454, 281279, 277121, 274372, 268134, 259292, 253267, 249866, 244250, 236828, 232346, 230215, 225463, 218454, 214144, 212440, 208580, 202518, 198792, 197573, 194709, 190240, 188215, 188440, 186885, 183833, 183310, 184790, 183749, 180090, 177902, 177220, 174133, 168822, 165419, 163968, 160455, 154789, 151002, 149404, 146205, 141074, 137607, 136045, 132855, 127854, 124596, 123382, 120920, 117168, 115556, 116082, 115093, 112268, 111028, 111673, 110848, 108230, 107048, 107509, 106349, 103449, 102353, 103632, 104096, 103219, 103966, 106568, 107776, 107043]
57912A07043K68J639J07j557O0K177J151m94Q34K714J576l27N04J967Q42o16P51
57895A18639K438R56j359r01K34j478l940l426j671k261l741k860j148j757l185
57880I4540k427j007j778l048j941k68j080k640j798q1n41j789j010K86o39k065
57864G2714j084O09m5j490p01Q22M9j543q44P97L06j067l02J356Q07q62n71Q82
57846F9833P47r8Q53K439K031Q59J716L484L362K373L270N031M883L732M236N440
57830A14191M715L051L047L605J994o17j126k21q11k382k248r24r18j651p14J149
57814A20140J404O24J149K243J623L14R51K596K318O51M36J449J138l73r45r33
57798A34785k241m016m010l131l852n354n018l528l558m537l760j728j271k220
$$ y = [107043, 107311, 108950, 109057, 107500, 107560, 109737, 110888, 110394, 111228, 113942, 115518, 115191, 115695, 117662, 118504, 117888, 118639, 121077, 122033, 120674, 119773, 120007, 118529, 114589, 111163, 109492, 107231, 103490, 100630, 99482, 97725, 94540, 92113, 91106, 89328, 86280, 84339, 84071, 82991, 80351, 78553, 78472, 77931, 76142, 75132, 75418, 74779, 72714, 71630, 72239, 72194, 70704, 70003, 70825, 70874, 69331, 68487, 69284, 69590, 68523, 68221, 69577, 70384, 69522, 68951, 69833, 70580, 70482, 71335, 73774, 75805, 76664, 78380, 81864, 85226, 87599, 90869, 95900, 100783, 104515, 108751, 114191, 118906, 121957, 125004, 128609, 130603, 129986, 128860, 128639, 127828, 125446, 123198, 122274, 121356, 119705, 118991, 120140, 121544, 122168, 123317, 125560, 127183, 127497, 128448, 131044, 133362, 134013, 134449, 135898, 137036, 136663, 135718, 134785, 132544, 128528, 124518, 121387, 117535, 112181, 107163, 103635, 100077, 95540, 91780, 90052, 88781, 86561]
57784H6561k003p85r87k298k120n62j28q59m95Q04P02o58p94M78R84N40R77K092
57766H1449J940Q92J182K576K764J768J723K566K234Q44N05J083M97j050j348
57751I9625n49r79k662l266k495k390l217l235k528k994m418m605l527l333m161
57736E5266l974k665k301l062k934j692j211j675j311j73k13j342j327P7P14R6
57720C2273K7P87N67q21j398p37n81j331j451p92r00j607r88R38J923J346Q01
57703B8056O22n32k307k657j641j459k279j912j21O99j22l42J052K302K397K560
57687B4316L193K929J738J531K656L194K593K580L546L590K243J548K264K426
57673F0347J046k18l86q43k255l048k497k290l420m428m248m010m542m747l945
$$ y = [86561, 84558, 83773, 82786, 80488, 78368, 77806, 77678, 76819, 76324, 77128, 77830, 77172, 76378, 76856, 77840, 78380, 79357, 81449, 83389, 84281, 85463, 88039, 90803, 92571, 94294, 96860, 99094, 99938, 100443, 101526, 102023, 100973, 99625, 99076, 98097, 95435, 92169, 89674, 87284, 84067, 80832, 78304, 75310, 70892, 66287, 62760, 59427, 55266, 51292, 48627, 46326, 43264, 40330, 38638, 37427, 35752, 34441, 34268, 34055, 32713, 31386, 31463, 32177, 32273, 32300, 33087, 33654, 32833, 31435, 30698, 30117, 28786, 27335, 26543, 25643, 24036, 23048, 23986, 25909, 27255, 28056, 28678, 28146, 25839, 23182, 21541, 20082, 17803, 15891, 15770, 16469, 16347, 16005, 17057, 19359, 21756, 24316, 27509, 30438, 32176, 33707, 36363, 39557, 42150, 44730, 48276, 51866, 54109, 55657, 57921, 60347, 61393, 61175, 60789, 59946, 57691, 54643, 52146, 49856, 46436, 42008, 37760, 33750, 29208, 24461, 20516]
57658B0516l267l324l029j970j472k067k388A295A84i51p17M54a79D36O17J618
57642B671K305K061K077K840L106K386J944K315K311J503J056J235O83q56j762
57627B5875j475j456k264k468j552j051j685k139j894k358C676g94l370k441k995
57612i600l626l086k558l206l910l453k712k787k974k411j787j812j804j320j262
57597d8308k054k522j973j414j578j684j315j371k035k007r65m68j189j607p66
57582g1256Q3j7M3J121K183K472L057M554N694N865O712R431J2717b015A6412
57566C9729K8809L3137L6436L9070L9074L3582K1911N795j1946k7579l7287l9981
57554A60750l8265l5216l1551k7035F129a2849j5744j2277r557q395p800o593
$$ y = [20516, 17249, 13925, 10896, 8926, 7454, 5387, 2999, 1295, 184, -951, -1668, -1214, -179, 436, 1053, 2671, 4976, 7037, 9114, 11954, 15060, 17446, 19390, 21705, 24016, 25519, 26575, 27810, 28493, 27637, 25875, 24400, 22944, 20680, 18212, 16660, 15609, 13924, 11785, 9891, 7533, 3676, -794, -4164, -6605, -9600, -13226, -16312, -18870, -22076, -25986, -29439, -32151, -34938, -37912, -40323, -42110, -43922, -45726, -47046, -48308, -50362, -52884, -54857, -56271, -57849, -59533, -60848, -62219, -64254, -66261, -67226, -67694, -68883, -70490, -71256, -71173, -71190, -71147, -70026, -67843, -65371, -62314, -57760, -52066, -46201, -39489, -30058, -17341, -2015, 16412, 39729, 68538, 101675, 138111, 177181, 216255, 249837, 271748, 277543, 265597, 238018, 200731, 160750, 122485, 87269, 55718, 28683, 6129, -12849, -28593, -40870, -50427, -58822, -66622, -73215]
57542g3215n259m625m186l308k589k577k538j963j704k234k406j455n17o13q35
57527a10024j94M25n4q38p26k11k86n62l06r9o97j464j523j294j429j448q63m07
57509a22000o90j017q16q03j363j440m95J32n89j477j156l40k94o06l67j22o53
57492a34096j208q23k20m85j097j099j008j700k550k567k227k412k643k138j514
57477a57787j653j970j551r60j146j660j653j541j947k153j415o69j100k042k165
57462a81412j651j473j495j139r12j440j962j550q15p29q57m68k55j007j770j265
57446b00200j44J98oK58N69n2r81q65J7L32Nq9r0p34j579j600j045q48p89j27
57426b07770N38N5j146j673j433j435j756j614j080q97r45n73l7n8l44j98j2m93
$$ y = [-73215, -78474, -83099, -87285, -90593, -93182, -95759, -98297, -100260, -101964, -104198, -106604, -108059, -108576, -109189, -110024, -110218, -109793, -109847, -110685, -111411, -111622, -111908, -112470, -112776, -112875, -113572, -115036, -116559, -117853, -119282, -120730, -121593, -122000, -122690, -123707, -124523, -125326, -126689, -128129, -128624, -128492, -129081, -130558, -131714, -132054, -132348, -132954, -133321, -133443, -134096, -135304, -136127, -136347, -136832, -137929, -139028, -140036, -141736, -144286, -146853, -149080, -151492, -154135, -156273, -157787, -159440, -161410, -162961, -163921, -165067, -166727, -168380, -169921, -171868, -174021, -175436, -176105, -177205, -179247, -181412, -183063, -184536, -186031, -187170, -188082, -189522, -191484, -193034, -193849, -194578, -195435, -195903, -196158, -197165, -198935, -200200, -200344, -200146, -200152, -199894, -199325, -199377, -200358, -201223, -201206, -200874, -200869, -200958, -201048, -201782, -203361, -204961, -206006, -206854, -207643, -207770, -207232, -207177, -208323, -209996, -211429, -212864, -214620, -216234, -217314, -218211, -219156, -219729, -219766, -219824, -220168, -220366, -220378, -220871]
57408b20871j095q78l03l77p41m52Rm73j442j544q92p58j247j367j097j330j968
57391b36826k051j636j709k269k374j947j774j827j360n72l98q26j067j199j849
57376b59684k535k190j224j111j923k226j550j050j411j858j707j339j223j223
57362b82254j267j512j726j514j173j274j533j268o85n30p44p04n12o94j007q63
57346b99260n91q84j409j352r94j148j530j266o51o70j162j173q85j343k413k852
57330c19583k384j959j946j765j341j235j294q35j79l78j346j906j732j674k030
57315c41587k150j903j937k325k438k243k265k268j551n52m80j257j570j091q89
57300c66506j419j850j778j887k393k525k005j641j835j947j622j446j719j905
$$ y = [-220871, -221966, -222844, -223147, -223524, -224265, -224717, -224708, -225181, -226623, -228167, -229059, -229817, -231064, -232431, -233528, -234858, -236826, -238877, -240513, -242222, -244491, -246865, -248812, -250586, -252413, -253773, -254345, -254743, -255569, -256636, -257835, -259684, -262219, -264409, -265633, -266744, -268667, -270893, -272443, -273493, -274904, -276762, -278469, -279808, -281031, -282254, -283521, -285033, -286759, -288273, -289446, -290720, -292253, -293521, -294206, -294736, -295480, -296184, -296696, -297390, -298397, -299260, -299851, -300735, -302144, -303496, -304490, -305638, -307168, -308434, -309085, -309755, -310917, -312090, -312975, -314318, -316731, -319583, -321967, -323926, -325872, -327637, -328978, -330213, -331507, -332342, -332521, -332899, -334245, -336151, -337883, -339557, -341587, -343737, -345640, -347577, -349902, -352340, -354583, -356848, -359116, -360667, -361219, -361699, -362956, -364526, -365617, -366506, -367925, -369775, -371553, -373440, -375833, -378358, -380363, -382004, -383839, -385786, -387408, -388854, -390573, -392478]
57286c92478j705j566j653j504j058r30j310j665j793k026k252j899j152r33j429
57271d15353j810j664j523j709j822j691j709j940j922j623j595k026k520k896
57257d41803l268l407l026k575k699l101l017k594k599k991l135l112l465l852
57243d84644l530k909l025l630l549k828k708l416l818l477l217l372l260k772
57229e30155k752l283l348k673k277k640k924k608k363k647k909k842l004l569
57215e69994l829l562l525l988m169l763l594m095m452m090l693l927m362m429
57201f25472m440m750m967m720m396m411m565m625m772n007m950m598m472m721
57187f90866m923n018n411n986o075n669n579o147o841p333p849q253q015p316
$$ y = [-392478, -394183, -395749, -397402, -398906, -399964, -400894, -402204, -403869, -405662, -407688, -409940, -411839, -412991, -413924, -415353, -417163, -418827, -420350, -422059, -423881, -425572, -427281, -429221, -431143, -432766, -434361, -436387, -438907, -441803, -445071, -448478, -451504, -454079, -456778, -459879, -462896, -465490, -468089, -471080, -474215, -477327, -480792, -484644, -488174, -491083, -494108, -497738, -501287, -504115, -506823, -510239, -514057, -517534, -520751, -524123, -527383, -530155, -532907, -536190, -539538, -542211, -544488, -547128, -550052, -552660, -555023, -557670, -560579, -563421, -566425, -569994, -573823, -577385, -580910, -584898, -589067, -592830, -596424, -600519, -604971, -609061, -612754, -616681, -621043, -625472, -629912, -634662, -639629, -644349, -648745, -653156, -657721, -662346, -667118, -672125, -677075, -681673, -686145, -690866, -695789, -700807, -706218, -712204, -718279, -723948, -729527, -735674, -742515, -749848, -757697, -765950, -773965, -781281]
57173g81281o987p070o721n826n294n446n435m790m194m199m400m431m596m973
57159h55643n014m632m533m982n357n358n567o236o717o612o476o753p103p250
57145i38233p506p910p861p176o570o569o801o850o889p057p052o765o553o547
57131a036339o473o391o707p293p512p248p056p139p127o947o911o915o530o002
57117a132590n968o277o129n459n003m934m665m037l450k797j430P28L140N548
57103a173323P562P614M141k028p904j1256j2107j1488j0427j0246j1992j5034
57091a246488j7550j8858j9940k1523k3100k4133k4821k5313k5413k5380k5758
57080a498277k6257k6054k5215k4587k4277k3669k2875k2642k2869k2729k2339
$$ y = [-781281, -788268, -795338, -802059, -807885, -813179, -818625, -824060, -828850, -833044, -837243, -841643, -846074, -850670, -855643, -860657, -865289, -869822, -874804, -880161, -885519, -891086, -897322, -904039, -910651, -917127, -923880, -930983, -938233, -945739, -953649, -961510, -968686, -975256, -981825, -988626, -995476, -1002365, -1009422, -1016474, -1023239, -1029792, -1036339, -1042812, -1049203, -1055910, -1063203, -1070715, -1077963, -1085019, -1092158, -1099285, -1106232, -1113143, -1120058, -1126588, -1132590, -1138558, -1144835, -1150964, -1156423, -1161426, -1166360, -1171025, -1175062, -1178512, -1181309, -1182739, -1182011, -1178871, -1173323, -1165761, -1158147, -1154006, -1156034, -1163938, -1175194, -1187301, -1198789, -1209216, -1219462, -1231454, -1246488, -1264038, -1282896, -1302836, -1324359, -1347459, -1371592, -1396413, -1421726, -1447139, -1472519, -1498277, -1524534, -1550588, -1575803, -1600390, -1624667, -1648336, -1671211, -1693853, -1716722, -1739451, -1761790]
57069a761790k2707k3965k5049k5246k4745k3825k2910k3139k5327k8601l1534
57058b038838l4282l7882m2065m5664m8810n2672n7303o1754o6079p1152p6786
57047b633287q2044q7132r2984r9325j05201j10973j17739j25227j32404j39490
57037c725806j47250j55029j61930j69031j77882j87685j96611k05014k14515
57028e340753k24908k34927k45110k56866k69712k82555k96451l12803l30327
57019g794412l47401l65966l89282m17533m49765m88160n35399n89424o46051
57010a2023393p05501p71471q45634r28760j025560j142149j280302j440836j631449
57001b1795055j865072k153137k508920k957229l534294m280975n244297o481227
$$ y = [-1761790, -1784497, -1808462, -1833511, -1858757, -1883502, -1907327, -1930237, -1953376, -1978703, -2007304, -2038838, -2073120, -2111002, -2153067, -2198731, -2247541, -2300213, -2357516, -2419270, -2485349, -2556501, -2633287, -2715331, -2802463, -2895447, -2994772, -3099973, -3210946, -3328685, -3453912, -3586316, -3725806, -3873056, -4028085, -4190015, -4359046, -4536928, -4724613, -4921224, -5126238, -5340753, -5565661, -5800588, -6045698, -6302564, -6572276, -6854831, -7151282, -7464085, -7794412, -8141813, -8507779, -8897061, -9314594, -9764359, -10252519, -10787918, -11377342, -12023393, -12728894, -13500365, -14345999, -15274759, -16300319, -17442468, -18722770, -20163606, -21795055, -23660127, -25813264, -28322184, -31279413, -34813707, -39094682, -44338979, -50820206]
56993e0820206q045265r960909j2209824j4733096j7437155k0206256k2926788
56986a56339499k5498521k7809215k9703459l0996678l1530765l1234170l0179804
56979c63292111k8615435k6852119k4952867k2450345j8478449j2369200m235307
56972e01245833M992610J4064801K1962127K8121729L2382132L4859191L5829040
56965c29034203L5601050L4424687L2489922K9981497K7100417K4041696K0976372
56958a24418562J8048863J5365335J2979362J0901832R125878P635484O399654
56951d3962154N377690M534083L841245L271818K799684K407608K084811J818125
56943a7827090J593107J401622J240206J102517R80763Q72654P79661O99848O28831
$$ y = [-50820206, -58865471, -68826380, -81036204, -95769300, -113206455, -133412711, -156339499, -181838020, -209647235, -239350694, -270347372, -301878137, -333112307, -363292111, -391907546, -418759665, -443712532, -466162877, -484641326, -497010526, -501245833, -496253223, -482188422, -460226295, -432104566, -399722434, -364863243, -329034203, -293433153, -259008466, -226518544, -196537047, -169436630, -145394934, -124418562, -106369699, -91004364, -78025002, -67123170, -57997292, -50361808, -43962154, -38584464, -34050381, -30209136, -26937318, -24137634, -21730026, -19645215, -17827090, -16233983, -14832361, -13592155, -12489638, -11508875, -10636221, -9856560, -9156712, -8527881]
56934h527881N65897N12551M66711M24541L86392L54866L28686L04353K82096
56925d901788K64259K49438K34068K18342K04938J93236J80389J66673J54237
56916c036208J41961J27513J13731J07003J09188J15818J21895J24979J23355
56907a950765J16330J06502R7571Q9882Q1592P3237O7101O2852N8144N2913M9063
56896a095578M6460M3278L9834L8075L7619L6082L3064L0301K8357K6703K6343
56885g09462K8704L2399L4608L5072L5339L4935L2172K8008K5148K3646K1276
56874c78155J7936J5802J5216J4201J2217J0784J0284R557Q789R463J1260J2250
56862b30396J2258J2930J4396J5040J4677J4804J5541J5413J4314J3697J3613
$$ y = [-8527881, -7961984, -7449433, -6982722, -6558181, -6171789, -5816923, -5488237, -5183884, -4901788, -4637529, -4388091, -4154023, -3935681, -3730743, -3537507, -3357118, -3190445, -3036208, -2894247, -2766734, -2653003, -2546000, -2436812, -2320994, -2199099, -2074120, -1950765, -1834435, -1727933, -1630362, -1540480, -1458888, -1385651, -1318550, -1255698, -1197554, -1144641, -1095578, -1049118, -1005840, -966006, -927931, -890312, -854230, -821166, -790865, -762508, -735805, -709462, -680758, -648359, -613751, -578679, -543340, -508405, -476233, -448225, -423077, -399431, -378155, -360219, -344417, -329201, -315000, -302783, -291999, -281715, -272158, -263369, -253906, -242646, -230396, -218138, -205208, -190812, -175772, -161095, -146291, -130750, -115337, -101023, -87326, -73713]
56851g3713J2493J0148Q082O726N105L371K864L488L769L575M091d873C93M737
56837E130N155O429O770N985N869P035Q174Q779R842J1390J2015J1265R959P986
56823A21783M390q7l237m481n184n726n039l285k167k075j613m43J18j99oJ035
56807I3784J533J064R50J699K060J473R89J112R75L86L77J101J370R36J022J976
56791A12807K668K765L322M537N213N120N562O880P666P227O597O305N319L156
56777A85144R24n29j607k370j986n73M24M57N88J354J887J860K211L258M050M334
56761A99426N208P050Q769R848J1126J2796J3468J2133R197N087k86n898r556
56748B78368j0368r592q450o900n075l849l203j984OJ583K461L890O356Q791J0754
$$ y = [-73713, -61220, -51072, -42990, -36264, -31159, -27788, -24924, -21436, -17667, -14092, -10001, -4873, 393, 5130, 10285, 16714, 23484, 29469, 35338, 42373, 50547, 59326, 69168, 80558, 92573, 103838, 113797, 121783, 126173, 126086, 122849, 118368, 113184, 107458, 102419, 99134, 96967, 94892, 93279, 92836, 92954, 92755, 92749, 93784, 95317, 96381, 97331, 99030, 101090, 102563, 103552, 104664, 105639, 106025, 106402, 107503, 108873, 109809, 110831, 112807, 115475, 118240, 121562, 126099, 131312, 136432, 141994, 148874, 156540, 163767, 170364, 176669, 181988, 185144, 186068, 185539, 183932, 181562, 179576, 179003, 179427, 179884, 180472, 181826, 183713, 185573, 187784, 191042, 195092, 199426, 204634, 211684, 220453, 230301, 241427, 254223, 267691, 279824, 289021, 294108, 293822, 287924, 278368, 268000, 258408, 249958, 243058, 237983, 234134, 230931, 228947, 228953, 230536, 232997, 236887, 243243, 252034, 262788]
56733B62788J3248J6568J9501K1414K2802K2784J8650R436k007j1883j8603k2080
56721C52618k2198j9642j6440j3952j1556q515n615l734k361p43Q20K050L645
56708B54377O044Q526J0534J2577J4933J6621J6450J3893Q577O26p924j3938j6238
56695C25058j6322j5597j3928j1434r385q193o614m110k034j315r18J35J229J859
56681B38431K916M903O702P494Q059Q747Q068M862K91l882p325j0087j1297j0552
56667B47330r092q066o991n324l935l528l200k109j056r08r43l47J53k71q68p13
56651B00132m06p58j134p38k47n31r96p78l83n72p77k51M06L73J45M25O53J59
56633A94722m01k08J95K2k61K2L29m2n37l88J4P7K13P62J001M80P2M21O62Q0m70
$$ y = [262788, 276036, 292604, 312105, 333519, 356321, 379105, 397755, 407191, 405184, 393301, 374698, 352618, 330420, 310778, 294338, 280386, 268830, 260315, 254700, 250966, 248605, 247862, 248682, 250732, 254377, 260421, 268947, 279481, 292058, 306991, 323612, 340062, 353955, 362532, 363158, 355234, 341296, 325058, 308736, 293139, 279211, 267777, 258392, 250199, 243585, 239475, 237441, 236126, 235208, 235343, 236572, 238431, 241347, 246250, 252952, 260446, 268505, 277252, 285320, 290182, 290473, 286591, 279266, 269179, 257882, 247330, 238238, 230172, 223181, 217857, 213922, 210394, 207194, 205085, 204029, 203121, 202178, 201831, 201984, 201713, 200845, 200132, 199726, 198968, 197834, 197096, 196849, 196318, 195322, 194544, 194161, 193589, 192812, 192561, 192967, 193340, 193485, 193910, 194563, 194722, 194321, 194113, 194308, 194330, 194069, 194091, 194420, 194378, 193841, 193453, 193467, 193544, 193757, 194519, 195520, 196000, 196072, 196493, 197155, 197235, 196765]
56612A96765j86J50k16l82N19J480J247M73L52M85l4o41l76J87m5p07q42p06r77
56593A96546j181o42j7j51m84j95J11l94j042q89m77o27o64K54J257J141M66L59
56575A93371L70l46r39k16R69R63Q6j13L99M88K35O25J419J521J070J090J408
56558B02400J056K85K15P83R56O72P11R98Q41M58N78R43Q32O01R62J397R61J31
56540B15780O2N70O00R9k57o03j381k006j744j281j629k233j954j199j135j564
56524B00125j488j106j241j533j161o70j043j661j260k47L8k69j14K75p4p21m45
56507A87405L90M11k98m67NJ33j19K4L80K34j6L40N81k94j360j068L9K89j43J48
56487A86614R26Q00J15M18J403J268J8m77K60P76N36N47R42O61j96k67N11P19
$$ y = [196765, 196579, 196729, 196513, 196131, 196650, 198130, 199377, 199850, 200202, 200687, 200653, 200012, 199636, 199823, 199778, 199071, 198229, 197523, 196546, 195365, 194723, 194706, 194555, 194071, 193876, 193987, 193593, 192551, 191662, 191185, 190558, 189894, 190148, 191405, 192546, 193012, 193371, 193741, 193395, 192456, 192240, 193209, 194172, 194258, 194145, 194544, 195032, 195267, 195892, 197311, 198832, 199902, 200992, 202400, 203456, 203741, 203956, 204739, 205695, 206367, 207078, 208076, 208917, 209375, 209953, 210896, 211728, 212329, 213291, 214688, 215649, 215780, 215842, 216412, 217012, 217111, 216854, 216251, 214870, 212864, 211120, 209839, 208210, 205977, 204023, 202824, 201689, 200125, 198637, 197531, 196290, 194757, 193596, 192926, 191883, 190222, 188962, 188715, 188753, 188484, 188370, 188645, 188571, 187850, 187405, 187795, 188206, 187908, 187441, 187446, 187579, 187460, 187484, 187864, 188098, 188082, 188422, 189003, 188709, 187349, 186281, 186320, 186609, 186466, 186614, 187540, 188340, 188455, 188873, 190276, 191544, 191562, 191085, 191345, 192121, 192657, 193204, 194146, 194807, 194611, 194344, 194855, 195574]
56469A95574Q3j45L28M45R2L61J268J600J276J467K153K040J151R19J509J589
56453B11710J041J193K060K054R45L72Q35Q87Lm29K09O48J93j39J14r3j140j823
56435B18640j593j465j917j985j311r12j146j025l29j74p88r35k96j29p84q83
56419B02968R2P45K76j77K17N18n0p40q83j026j419j303n58k73p99j083o66m16
56401A95423o59n27Q3J9q77j190l61L54K10J09O09Q67M22N9J00j47n89j46R91
56382A94750J209K62j49O11J020K62l79n7J67l69n76J27M83k56q90n17j33n99
56364A94966j055o86j92k40k98r0k90q50o29L92P36R8L3J016J370L12n40n4N27
56345A94526Q8m13q4J23n39j006m33K02N3p0M32O41N9k29L41O50J13j84K30J95
$$ y = [195574, 195657, 195512, 195840, 196285, 196377, 196738, 198006, 199606, 200882, 202349, 204502, 206542, 207693, 208612, 210121, 211710, 212751, 213944, 216004, 218058, 219003, 219375, 220210, 221097, 221100, 220671, 220880, 221528, 221721, 221582, 221696, 221603, 220463, 218640, 217047, 215582, 213665, 211680, 210369, 209457, 208311, 207286, 206957, 206783, 205995, 205060, 204764, 204635, 203851, 202968, 203060, 203805, 204081, 203904, 204121, 204639, 204589, 203849, 202966, 201940, 200521, 199218, 198660, 198387, 197588, 196505, 195839, 195423, 194764, 194237, 194320, 194339, 193462, 192272, 191911, 192265, 192475, 192584, 193193, 194060, 194482, 194541, 194641, 194494, 193905, 193759, 194750, 195959, 196221, 196072, 196683, 197703, 197965, 197586, 197529, 197696, 197327, 196751, 196878, 197361, 197105, 196215, 195698, 195565, 194966, 193911, 193225, 193033, 192793, 192495, 192405, 192115, 191265, 190636, 191028, 191764, 191862, 191895, 192911, 194281, 194593, 194053, 193999, 194526, 194614, 194201, 194117, 194240, 193701, 192695, 192262, 192464, 192517, 192447, 192879, 193520, 193579, 193350, 193691, 194341, 194454, 194270, 194500, 194695]
56325A94695n73n50O45J068k03j258o15L63J83k90m4k3q76j164L2J064M84m13
56307A92525o4O74N20K31P30J035K67l47K54Q26J89m62J22P90K41m15J93J088
56289A98397R22N02R11J179L18l89L35J162M99n43k20P30P36L70R00J580J085
56272B08474J36O8L04k32q18m22Q9l09o16K26J001L61n08j8Q67N02l79k41L01
56253B08786j23q93p82m79j002j314k04J105R63K67O12J231O48l19j55M28O3l78
56235B08454M52J433Q69k33N4J028Q29l1K04J113J120O30J045J765J273J26p9
56218B20052L65K56P5P51J264L57p37k40R40R39L44P61J563J278O91J327K311
56201B32297K011J306J873K758K139R59J291K479K555K006K571L603L348K520
$$ y = [194695, 194122, 193572, 194217, 195285, 195082, 193824, 193209, 193572, 193755, 193465, 193421, 193398, 192522, 191358, 191390, 192454, 192938, 192525, 192461, 193135, 193655, 193886, 194616, 195651, 195918, 195571, 195825, 196651, 196840, 196378, 196500, 197290, 197531, 197116, 197309, 198397, 199319, 199821, 200732, 201911, 202229, 201840, 202175, 203337, 203836, 203293, 203073, 203803, 204539, 204909, 205809, 207389, 208474, 208610, 208678, 208982, 208750, 207932, 207510, 207599, 207290, 206674, 206900, 207901, 208262, 207754, 207736, 208603, 209105, 208726, 208485, 208786, 208663, 207770, 206988, 206509, 205507, 204193, 203989, 205094, 206057, 206324, 206936, 208167, 208815, 208496, 208341, 208769, 208832, 208454, 208906, 210339, 211208, 210975, 211029, 212057, 212886, 212855, 213059, 214172, 215292, 215922, 216967, 218732, 220005, 220131, 220052, 220417, 220673, 220748, 221499, 222763, 223120, 222383, 222143, 223083, 224022, 224366, 225127, 226690, 227968, 228659, 229986, 232297, 234308, 235614, 237487, 240245, 242384, 243343, 244634, 247113, 249668, 251674, 254245, 257848, 261196, 263716]
56187B63716K920L789L267K182K590L831L828L053L363M140L553K455K995M497
56173C10179M719M067M518N539N267M558N647P792Q584Q557J0061J2530J3426
56160D05444J3099J4181J6784J8811K0397K3545K7820L0907L3054L6565M1366
56149F81973M5360M8697N3227N8292O1477O3009O4952O6633O5552O2139N8892
56138A330203N5267M8386L8391K8165J8054N996p314j8584k7260l5722m4052m9755
56126A341775n2801n5878n9230o0289n8766n7244n6245n3666m9502m6272m4257
56115G47625m1149l6804l3578l1611k8684k4981k3045k2669k0954j7778j6007
56104D50365j5874j4484j1464r745r987r539p723o890p354o593m363l391m087
$$ y = [263716, 266636, 270425, 273692, 275874, 278464, 282295, 286123, 289176, 292539, 296679, 300232, 302687, 305682, 310179, 314898, 318965, 323483, 329022, 334289, 338847, 344494, 352286, 360870, 369427, 379488, 392018, 405444, 418543, 432724, 449508, 468319, 488716, 512261, 540081, 570988, 604042, 640607, 681973, 727333, 776030, 829257, 887549, 949026, 1012035, 1076987, 1143620, 1209172, 1271311, 1330203, 1385470, 1433856, 1472247, 1500412, 1518466, 1524462, 1517148, 1498564, 1471304, 1435582, 1391530, 1341775, 1288974, 1233096, 1173866, 1113577, 1054811, 997567, 941322, 887656, 838154, 791882, 747625, 706476, 669672, 636094, 604483, 575799, 550818, 527773, 505104, 484150, 466372, 450365, 434491, 420007, 408543, 398798, 388811, 379272, 371549, 364659, 357305, 350712, 346349, 342958, 338871]
56091C38871l819k220j963l297l298j486p83j874k052p11m51j690j724k55j90
56076C13058j846k020j26N90p33j002P40J544M46K33J648J775k4m41J606K961
56060C18409K254K134L582L889K335K010L878M823L696L453N246O235N398N577
56046C72919P606Q465P414P876J0937J3179J3291J4632J8767K2705K5084K8798
56034E51673L4830L9785M2091M4439M7417M7182M2273L6368L1630K5865J8903
56023I62456J4922J5270J5628J3352J0906R239M964k477q035r081r310j1356j2729
56010I93749j2699j5672k3514l1578l6440m0542m5225m6589m2748l7957l5141
55999F25644l1316k4773j9416j7458j5120j0206o612o632o300l115r22k135k828
$$ y = [338871, 335052, 332832, 330869, 327572, 324274, 322788, 322005, 320131, 318079, 317368, 316917, 315227, 313503, 313248, 313058, 311212, 309192, 309066, 309656, 308923, 307921, 308661, 310205, 310651, 310884, 312532, 314307, 314283, 313842, 315448, 318409, 320663, 322797, 326379, 330268, 332603, 334613, 338491, 343314, 347010, 350463, 355709, 361944, 367342, 372919, 380525, 388990, 396404, 404280, 415217, 428396, 441687, 456319, 475086, 497791, 522875, 551673, 586503, 626288, 668379, 712818, 760235, 807417, 849690, 886058, 917688, 943553, 962456, 977378, 992648, 1008276, 1021628, 1032534, 1041773, 1046737, 1044260, 1036225, 1027144, 1017834, 1006478, 993749, 981050, 965378, 941864, 910286, 873846, 833304, 788079, 741490, 698742, 660785, 625644, 594328, 569555, 550139, 532681, 517561, 507355, 500743, 494111, 487811, 484696, 483774, 481639, 478811]
55986D78811n14Q76j063k117M31K452J160N96L442N410L588K246M355N566K778
55971E08017M34J954L125N77j480L75K009N4j340J087L044J303L76L518N855L730
55955E32638J960M370O265L987K594N964Q768O642M786P752J0356P839N296P669
55941F16886J0082P742N660Q680J1595R315O932R390J1261P406L616N650Q162
55928G22377N733M212R327J4671J3318J0692J3474J6575J3978J1521J5514J9770
55916H71162J7528J5037J9303K3891K1373J8144K1861K6165K3422K0384K5064
55905A103334L0470K8099K4918K9629L5107L2475K9360L5266M2412M0642L7584
55894A469296M3608N0943M9029M6106N3263O1893O0265N7289O5410P5563P4745
$$ y = [478811, 478297, 479173, 478110, 475993, 476424, 478876, 480036, 480632, 484074, 489484, 493072, 495318, 499673, 505239, 508017, 508451, 510405, 513530, 514107, 512627, 513002, 515011, 515065, 513725, 514812, 517856, 519159, 519535, 523053, 528908, 532638, 534598, 538968, 545233, 549220, 551814, 557778, 566546, 573188, 577974, 585726, 596082, 603921, 609217, 616886, 626968, 634710, 640370, 649050, 660645, 669960, 676892, 686282, 697543, 704949, 708565, 714215, 722377, 728110, 732322, 741649, 756320, 769638, 780330, 793804, 810379, 824357, 835878, 851392, 871162, 888690, 903727, 923030, 946921, 968294, 986438, 1008299, 1034464, 1057886, 1078270, 1103334, 1133804, 1161903, 1186821, 1216450, 1251557, 1284032, 1313392, 1348658, 1391070, 1431712, 1469296, 1512904, 1563847, 1612876, 1658982, 1712245, 1774138, 1834403, 1891692, 1957102, 2032665, 2107410]
55883B107410P2479Q2767R6231R8424R8980J12781J29596J33823J36373J53908
55873C222772J75223J83264J90724K16372K46978K62804K79048L18829L68153
55864E464167M04291M44403N15481O02500O82180P80838R38094J143222J373697
55855A2348873J661460K043769K487684K954798L502395M221350N128174O246136
55847D0594639P721618R662729J1887466J4030933J5825003J6904765J6306381
55840A32933534J2737463N894606k606044j0069064j4619983j6173476j5754728
55833I2342308j4360173j2560050j0697696q997413p507121o176050n012409m068463
55825B2962933l325026k709879k201178j817184j532402j291319j084170r33778
$$ y = [2107410, 2179889, 2262656, 2358887, 2457311, 2556291, 2669072, 2798668, 2932491, 3068864, 3222772, 3397995, 3581259, 3771983, 3988355, 4235333, 4498137, 4777185, 5096014, 5464167, 5868458, 6312861, 6828342, 7430842, 8113022, 8893860, 9831954, 10975176, 12348873, 14010333, 16054102, 18541786, 21496584, 24998979, 29220329, 34348503, 40594639, 48316257, 57978986, 69866452, 83897385, 99722388, 116627153, 132933534, 145670997, 151565603, 148959559, 138890495, 124270512, 108097036, 92342308, 77982135, 65422085, 54724389, 45726976, 38219855, 32043805, 27031396, 22962933, 19637907, 16928028, 14726850, 12909666, 11377264, 10085945, 9001775, 8067997]
55817H067997q26248p22188o19512n43317m88322m27458l63763l21157k95520
55808C460512k62969k25492k03308j92336j71836j44884j31101j27758j16132
55799A884696r8375r1737r3570q6767p3328o9290p2399o6738n4052m9871n3273
55788A075296m9830m0232l7790m1373l7996k8861k6800l0891k8664k0702j8818
55777G13339k2323j9664j1418q962j2263j0917n524o679j4153j7520j6073j8391
55765E49452k3553k2396j6218j5206j9210j8517j2755j0923j3426j1866o235m988
55753C74159q359q406n285o971j2882j4067r723p915r826q677m365l951p254o818
55739B59660k564j972n358n325j301m89l664l993p65n59l839l886p6R04j811j832
$$ y = [8067997, 7241749, 6519561, 5900049, 5356732, 4868410, 4440952, 4077189, 3756032, 3460512, 3197543, 2972051, 2768743, 2576407, 2404571, 2259687, 2128586, 2000828, 1884696, 1786321, 1694584, 1601014, 1514247, 1440919, 1371629, 1299230, 1232492, 1178440, 1128569, 1075296, 1025466, 985234, 947444, 906071, 868075, 839214, 812414, 781523, 752859, 732157, 713339, 691016, 671352, 659934, 650972, 638709, 627792, 622268, 615589, 601436, 583916, 567843, 549452, 525899, 503503, 487285, 472079, 452869, 434352, 421597, 410674, 397248, 385382, 379147, 374159, 365800, 357394, 352109, 345138, 332256, 318189, 308466, 300551, 290725, 282048, 277683, 273732, 266478, 259660, 257096, 255124, 249766, 244441, 243140, 242651, 238987, 234994, 234229, 233670, 229831, 225945, 225869, 226773, 224962, 223130]
55723B23130J683K543J8K29L738M195Q69K38L499M484J809J225L921M143N62j260
55707B55026P1o63m540o147m206l966o750p495m933m026n983n919k765j544l532
55692A92628l904j465r69l366l445K33K547J529J547M103M675J613p00l49r12
55677A93765l384l747j319r22l911n477l708k866m812n467l021j505k997l962
55663A46667k566j965l382l327p72L45j313j809L57J296n92j452M20J186j092
55648A32001k797j804j213k727l216j257k81j894k619o87M88j022j966l52P86
55633A11440m83j261K74J263p1r00N57J580M06m55M52N28j392k260n95N03p20
55616A08866j449p7N23j224k247o14Q10k4o17Q22J750M76l36J103K128Q21k55
$$ y = [223130, 224813, 227356, 227374, 227603, 231341, 235536, 236405, 236643, 240142, 244626, 246435, 247660, 251581, 255724, 256286, 255026, 255097, 254434, 249894, 243747, 239541, 235575, 228825, 221330, 216397, 212371, 206388, 200469, 197704, 196160, 192628, 188724, 187259, 186290, 182924, 179479, 179712, 182259, 183788, 185335, 189438, 194113, 195726, 195026, 194677, 193765, 190381, 186634, 185315, 184393, 180482, 175005, 171297, 168431, 163619, 158152, 155131, 153626, 150629, 146667, 144101, 142136, 138754, 135427, 134655, 135000, 133687, 131878, 132235, 133531, 132939, 131487, 131907, 133093, 132001, 129204, 127400, 126187, 123460, 120244, 118987, 118706, 116812, 114193, 113506, 113994, 112972, 111006, 110654, 111440, 110957, 109696, 109970, 111233, 111162, 110262, 110819, 112399, 112805, 112350, 112802, 113330, 111938, 109678, 109083, 109586, 108866, 107417, 107340, 107863, 106639, 104392, 103778, 104588, 104564, 103947, 104769, 106519, 106995, 106659, 107762, 109890, 110711, 110456]
55599A10456Q93J895P90k38N70J030m32j393j06J097L95j06J122J785L82n84O08
55582A18164J534M29k80J244K584J726Q25J782K524J375N89J905K914J651M76
55567A39442J583K903K295J565K453K796O70j554j400o86j806l338l280l011m117
55552A34515m852l597k338k906l339j758l11j239k618k000q67j382k058q85M69
55537A04834j90j299n59O44j1j325j007J8k26q74k70M42l78j405q17J59k73r27
55519I6536q6R62L85o07j95M96k29j113l80P01J95q73o80j16o65j216l56N19k14
55500I3064j113l72O26o4j192p65J70k14q23Q6J229O35n29j55Q24M32m76j1R76
55481I2328O44j70L41J317R45MK33R18N61J08J038K084J393J48M64J517J330O15
$$ y = [110456, 111349, 113244, 114034, 113796, 114366, 115396, 114964, 113571, 113465, 114562, 114957, 114851, 115973, 117758, 118140, 117556, 118164, 119698, 120127, 119847, 121091, 123675, 125401, 126226, 128008, 130532, 131907, 132496, 134401, 137315, 138966, 139442, 141025, 143928, 146223, 147788, 150241, 153037, 153707, 152153, 150753, 150067, 148261, 144923, 141643, 138632, 134515, 129663, 126066, 123728, 120822, 117483, 115725, 115414, 114175, 111557, 109557, 108690, 107308, 105250, 104365, 104834, 104644, 103345, 102786, 103430, 103419, 102094, 101087, 101105, 100879, 100005, 99735, 100177, 99799, 98394, 97577, 97736, 97463, 96536, 96450, 97412, 97797, 97190, 96995, 97491, 97262, 96149, 95769, 96470, 96665, 95792, 95112, 94996, 94331, 93115, 92759, 93278, 93064, 91951, 91579, 92205, 92141, 90949, 90184, 90354, 90140, 89317, 89403, 90632, 91267, 90738, 90583, 91407, 91839, 91363, 91352, 92328, 92972, 92802, 93143, 94460, 95405, 95409, 95642, 96560, 97121, 97229, 98267, 100351, 101744, 101892, 102356, 103873, 105203, 105818]
55463A05818J158K087J466P2r1M65J4q79o77j41p99j644r73J07m30j636j268J10
55445A02759M06p5L48J104N51n06k10O60Q1j298j389o17r03j763j282Lrr88q86
55426I5986J17N3j015j285p39q73j460j020Nr1r37p46K03J09q94j068m03l94r57
55407H4591p12R8J12l27J48R99O35m03k87P02P37j67m71j88n01r37j52J055P82
55388H5714m59n51M13N00l68m74K82L45k85j54N67L26o36n76M28N97j74k78M13
55369H5630M10l40l80K73J39p51q79k08j40n96j40J010J187M69N88J608J740O55
55351I0275n7N0k61j135j223l93m3l90j47P80R62R5n50n42o77q60k05P69O01m29
55331H6620o66l2K2n68m28M30N61p2k2P87R18K42J25O62N21l42n33O5J53l08r7
$$ y = [105818, 106976, 109063, 110529, 110601, 110510, 110975, 110989, 110110, 109433, 109292, 108493, 106849, 105876, 105983, 105553, 103917, 102649, 102759, 103165, 103090, 103438, 104542, 105093, 104587, 104377, 105037, 105118, 103820, 102431, 101814, 100911, 99148, 97866, 97869, 97860, 96872, 95986, 96103, 96156, 95141, 93856, 93117, 92244, 90784, 89764, 89769, 89678, 88741, 87995, 88198, 88307, 87413, 86345, 85942, 85548, 84591, 83879, 83977, 84089, 83762, 83910, 84909, 85544, 85141, 84854, 85556, 86293, 86126, 85655, 85467, 84966, 84029, 83877, 84932, 85714, 85255, 84704, 85117, 85617, 85249, 84775, 85057, 85402, 85117, 84963, 85530, 85856, 85220, 84644, 85072, 85669, 85495, 85217, 85630, 86040, 85700, 85320, 85593, 85732, 84981, 84102, 83894, 83754, 83158, 83018, 84028, 85215, 85684, 86272, 87880, 89620, 90275, 90218, 90268, 90007, 88872, 87649, 87256, 87213, 86823, 86676, 87456, 88418, 88513, 87963, 87421, 86744, 85884, 85679, 86448, 87049, 86620, 85954, 85922, 85944, 85376, 84948, 85378, 85939, 85867, 85845, 86632, 87550, 87792, 87917, 88579, 89100, 88758, 88225, 88290, 88443, 88135, 88038]
55310H8038N82K94p29p66J81L89k86k06P30P32m94j168p25n52r53n06Q40J164
55292H6565p1j028p23l55n89l37P12J138M11j21J85K19m68o97j8M04R9O4N23L56
55272H6269m64m24P34J350P28J94M26L40m81q24k64q3p38r08l7N94K97O6L31O5
55252H7171q78j044m9M90j96o99j24L34j87n90K1P02N58K60M06L22k99n05N4K91
55232H6038k58m66K72Q83O10K21K62P3n63o94q8J51l30m14K68N34q6m17J15M19
55212H6530p9l54J35L93q4l02J63K80l38n50Q4L89j20k23O08J104N69J41N25O99
55192H9570P1l40m1j41j026j327m69P4n32r05n2P70L98k01L4L30j11m20J19N12
55172H6313qm47o6P2p43j196k51Q50P33K28O12J257J047M66L98L12m52j062o60
$$ y = [88038, 88620, 88914, 88185, 87419, 87600, 87989, 87703, 87497, 88227, 88959, 88465, 87297, 86572, 86020, 85067, 84561, 85401, 86565, 86494, 85466, 84743, 84388, 83799, 83462, 84174, 85312, 85723, 85602, 85787, 86006, 85538, 84841, 84823, 85227, 85326, 85390, 85913, 86269, 85805, 85381, 86115, 87465, 88193, 88387, 88813, 89153, 88672, 87848, 87584, 87501, 86763, 85855, 85818, 86412, 86709, 86775, 87106, 87171, 86293, 85249, 85200, 85690, 85494, 84795, 84671, 85005, 84818, 84228, 84249, 84951, 85509, 85769, 86175, 86497, 86198, 85693, 85747, 86038, 85780, 85314, 85586, 86469, 87079, 87300, 87562, 87635, 87072, 86378, 86290, 86441, 86111, 85697, 85965, 86499, 86413, 85996, 86111, 86530, 86451, 86097, 86232, 86625, 86541, 86239, 86402, 86682, 86344, 85794, 85878, 86267, 86147, 85924, 86532, 87636, 88205, 88346, 88871, 89570, 89641, 89301, 89260, 89119, 88093, 86766, 86297, 86371, 85839, 84934, 84882, 85652, 86050, 85849, 85883, 86213, 86102, 85682, 85801, 86313, 86305, 85858, 85792, 85864, 85121, 83925, 83674, 84524, 85257, 85485, 86097, 87354, 88401, 88867, 89265, 89577, 89125, 88063, 87403]
55153H7403n4k08m47J36Q61P77M29O58R21M68r3l4N5m35p53k31K63r3m61J12Q43
55132I0117N56l43p93q01p53l21N99J031M37j98m9J34l92r13p33n52r69j107k93
55113H4657M92L70J64P24J238Q45L49N98P61Jp26l92J52k08p10k56L87rp85n95
55093H7057J89L17q1n8K54J55p9J01K02k87o00m8M85L3o39m00K49L31K76Q40J333
55072H9630Q51J43L13P70M14k06L0O47N12nJ60O04K33n97p45l82m84q66o49m6
55052I0327O5j33J06N33M19M2M0O3l98o85r6N94L76j83m2L80J86j26L47R79O61
55031I3455r3r0L45R8n75o04j70k17n35k50L92N55M67P30P97k7q76n90J48pn96
55010I2357k44P31Q89K60Q0M10K22m22m94l5J9k38O1O79O54K29M00Q65M83m90
$$ y = [87403, 87349, 87141, 86694, 86830, 87691, 88468, 88897, 89555, 90476, 90944, 90851, 90817, 90872, 90437, 89684, 89453, 89716, 89623, 89162, 89274, 90117, 90673, 90330, 89537, 88736, 87983, 87662, 88261, 89292, 89729, 89531, 89482, 89616, 89224, 88311, 87578, 87026, 86057, 84950, 84657, 85149, 85519, 85683, 86407, 87645, 88490, 88839, 89437, 90198, 90199, 89473, 89081, 89233, 89025, 88315, 88059, 88446, 88437, 87652, 87057, 87246, 87563, 87482, 87424, 87678, 87833, 87754, 87855, 88057, 87770, 87170, 87122, 87607, 87640, 87001, 86601, 86850, 87181, 87457, 88297, 89630, 90481, 90624, 90937, 91707, 92121, 91915, 91945, 92592, 93104, 93099, 93259, 93863, 94096, 93499, 92754, 92372, 91888, 91022, 90373, 90327, 90392, 90259, 90365, 90898, 91317, 91359, 91399, 91462, 91064, 90379, 90283, 90877, 91253, 91070, 91028, 91408, 91594, 91468, 91815, 92794, 93455, 93362, 93272, 93617, 93715, 93140, 92536, 92366, 92149, 91614, 91364, 91756, 92311, 92778, 93508, 94305, 94278, 93402, 92812, 92960, 92953, 92357, 92113, 92844, 93733, 93993, 94073, 94483, 94705, 94283, 93789, 93754, 93773, 93535, 93596, 94275, 94929, 95158, 95558, 96423, 96906, 96416]
54990I6416o99k0L88K42L23O52M53j64l14j03m05j051j030l37R1J46M57Q33N27
54971I6405j26j96R5j20m75N6J050J177N12K83N15J21p92r42k12J74p7l8L81J55
54951I7946p72j171o55k19l59m39k29l00n86k88N27Q25L63p6k66p03j142p15L08
54932I2049O42O0l68k15j43l29j45L20K34l02k30N47R45O08L39M02J17n62p44
54913I3225k23J77J83L64P00M82j35j65L95M64j49m04N6L79K28L10P91Q80M02
54894I7960K39O67Q57M29L6j1k27o94p80m24k98l93J9Q51J112O72M82Q24Q98M53
54874A02672J99L20J79k14n2O32Q07K53j11j6k27q30q84k23J43j26j43L74N28
54855A03281M0p3O40J206R30M33L39L26J43K04N61O48N05Q89J805K326K280K511
$$ y = [96416, 95717, 95697, 96085, 96327, 96650, 97302, 97755, 97591, 97277, 97174, 96769, 95718, 94688, 94351, 94442, 94588, 95045, 95878, 96405, 96279, 96083, 96178, 96058, 95583, 95639, 96689, 97866, 98378, 98661, 99176, 99297, 98505, 97563, 97351, 97525, 97448, 97410, 97791, 97946, 97174, 96003, 95348, 95129, 94770, 94331, 94102, 93802, 93216, 92928, 93455, 94280, 94643, 94567, 94301, 93598, 92456, 91741, 92049, 92691, 92751, 92383, 92168, 92025, 91696, 91551, 91871, 92105, 91803, 91573, 92120, 93065, 93673, 94012, 94414, 94531, 93969, 93225, 93002, 93179, 93362, 93726, 94426, 94908, 94773, 94608, 95003, 95467, 95318, 94914, 94970, 95349, 95577, 95887, 96678, 97558, 97960, 98199, 98866, 99723, 100152, 100188, 100177, 99950, 99256, 98476, 98052, 97754, 97361, 97380, 98231, 99343, 100015, 100497, 101321, 102219, 102672, 102871, 103191, 103370, 103156, 103104, 103736, 104543, 104796, 104685, 104669, 104442, 103612, 102728, 102505, 102648, 102522, 102379, 102753, 103281, 103321, 103248, 103888, 105094, 106024, 106457, 106796, 107122, 107265, 107469, 108030, 108678, 109183, 110072, 111877, 114203, 116483, 118994]
54837A18994L194L448L160L366M362N064M849M351L866K685O89j045j967k803
54823A52213l947m680m649m561m696m365l441k854k840k386j165l16n15r09p88
54808A10101o58q17n50L14P08J55k86J30O35N80O74J470K211K255K289K927L527
54791A25665L521L545M150M642M334L659L041J968K16j318k080k804l998m814
54777A39727m559l972l851l703k978k326k396k551k056j451j475j701j446j020
54763A04242r15p75k53M5l28o53k12M80O47N29O08N86J30k79k29k09n99q38m84
54744A01493j01j89k76M1K41m0j99R0P7o21j050m99K16J67j68m5J15k52o04l35
54724I8061k0k59l74L33J072Q05L4j06K80L53J79L78P77P73M78L13M5n67q68k37
$$ y = [118994, 122188, 125636, 128796, 132162, 136524, 141588, 146437, 150788, 154654, 157339, 158028, 156983, 155016, 152213, 148266, 143586, 138937, 134376, 129680, 125315, 121874, 119020, 116180, 113794, 112629, 112313, 111798, 110889, 110101, 109443, 108626, 108076, 108390, 109098, 109253, 108967, 109097, 109732, 110312, 110986, 112456, 114667, 116922, 119211, 122138, 125665, 129186, 132731, 136881, 141523, 145857, 149516, 152557, 154525, 154741, 153423, 151343, 148539, 144541, 139727, 135168, 131196, 127345, 123642, 120664, 118338, 115942, 113391, 111335, 109884, 108409, 106708, 105262, 104242, 103327, 102552, 102299, 102344, 102016, 101363, 101151, 101631, 102278, 102807, 103415, 104001, 104131, 103852, 103623, 103414, 102815, 101977, 101493, 101392, 101203, 100927, 100968, 101209, 101169, 100970, 101060, 101137, 100516, 99466, 98967, 99183, 99350, 99182, 99137, 99252, 99000, 98396, 98061, 98041, 97782, 97408, 97741, 98813, 99618, 99652, 99546, 99826, 100179, 100358, 100736, 101513, 102286, 102764, 103077, 103122, 102555, 101687, 101450]
54704A01450P09R98P79P53Q13M79L4P8M00M11K39L60O63Q09R55J282J395J064
54686A13671Q51J241J847K285K943M017M811M861M807N168N296M566L571K980
54672A62915K293R65k67n05k17l00n00j85J81j68q20r53q75j325j908j718j028
54655A55585r26j649k562l383m148m456l939l152k819k633j914q94k48J37P82
54640A23781J493J811K026K718L639M151M228M143L692K688J572O40n75k230l413
54625A50364l498l292l691m175l950l536l737l980l282k099j553j518j122n29
54611A10402n64r92q81l07j17l03j34L18K90k32n57n70o69p11k78K41J20m24o10
54592A04022m24m01m72k49k2k66n33j09O47Q53N66M37L75j23p73r07o74o03m20
$$ y = [101450, 102159, 103157, 103936, 104689, 105502, 105981, 106015, 106093, 106493, 106904, 107143, 107503, 108166, 108975, 109930, 111212, 112607, 113671, 114522, 115763, 117610, 119895, 122838, 126855, 131666, 136527, 141334, 146502, 151798, 156364, 159935, 162915, 165208, 166173, 165906, 165401, 165184, 164884, 164384, 164199, 164380, 164212, 163392, 162439, 161564, 160239, 158331, 156613, 155585, 154659, 153010, 150448, 147065, 142917, 138461, 134522, 131370, 128551, 125918, 124004, 123110, 122862, 122999, 123781, 125274, 127085, 129111, 131829, 135468, 139619, 143847, 147990, 151682, 154370, 155942, 156582, 156007, 153777, 150364, 146866, 143574, 139883, 135708, 131758, 128222, 124485, 120505, 117223, 115124, 113571, 112053, 110931, 110402, 109838, 108846, 107965, 107658, 107541, 107238, 107104, 107422, 107712, 107480, 106923, 106353, 105684, 104973, 104695, 104936, 105056, 104632, 104022, 103598, 103197, 102725, 102476, 102454, 102188, 101655, 101546, 102193, 103046, 103612, 104049, 104424, 104301, 103528, 102621, 101947, 101344, 100924]
54573A00924L07R70P25j2k45m9j17k57J26N51J38o65p02p4J94O0L27Q67P61P7
54553A03906j68K21M81M05M76N69J15n32n06k2j6l15Q5J034J240L94m15n53n21
54534A05878o07m40j30l24q59q59l23k17p43r81m80J39M52P40J028Q84M21K77
54516A03856M46L44J3M3L05J23k98r7O03P25N4m85m91n36p88o58j06J53j7K8L37
54495A03554K20l11m06P6L01k6k28p5j48n39n40%L61L33N10R30Q27J00l80k71
54475A04288k11m24k69L81P16M10J41K62K69Jj1K77J56m30n97q8K33p4l39j59
54455A04532n5k99l31M7K21j5m4K77K42k62l06M27R51O05J09K57P10Q62Q00O86
54435A09414K74l23m28N3L28N1j43R9K30J6K7M02L85k45n81j64J59k46o76l94
$$ y = [100924, 101231, 102201, 102926, 102914, 102669, 102620, 102503, 102246, 102372, 102923, 103061, 102396, 101694, 101620, 101814, 101874, 102201, 103068, 103829, 103906, 103738, 103959, 104440, 104845, 105321, 105890, 106005, 105473, 104967, 104945, 104929, 104614, 104699, 105733, 106973, 107367, 106952, 106399, 105878, 105271, 104831, 104701, 104377, 103518, 102659, 102336, 102119, 101376, 100395, 99915, 100054, 100506, 101246, 102274, 103158, 103579, 103856, 104302, 104646, 104659, 104702, 105007, 105130, 104832, 104735, 105338, 106063, 106117, 105632, 105141, 104605, 103817, 103159, 103053, 103206, 103189, 103217, 103554, 103774, 103463, 103057, 103133, 103434, 103408, 103180, 103105, 102957, 102418, 101878, 101878, 102239, 102572, 103082, 104012, 104839, 104939, 104559, 104288, 104077, 103653, 103384, 103765, 104481, 104891, 105032, 105294, 105563, 105564, 105553, 105830, 105986, 105556, 104959, 104871, 105104, 105030, 104691, 104532, 104477, 104178, 103847, 103894, 104115, 104100, 104056, 104333, 104575, 104313, 104007, 104434, 105385, 105990, 106099, 106356, 107066, 107928, 108728, 109414, 109688, 109365, 108937, 108990, 109318, 109369, 109226, 109325, 109555, 109571, 109598, 110000, 110385, 110140, 109559, 109395, 109554, 109308, 108632, 108238]
54415A08238J05J02j17jJ82m3m11m87m07m01k64N5J09k23l61j5L00K13R4K13K25
54394A07106j8m0L17N09L15K67N72O53K62LK03L08k6k86q3K23L86O77R79O33k30
54373A12730m93K05P78M58q0j24j17n27q05m62p9k51n48m34k59l90l70R3L71L2
54353A09728k56R4N17L65N6J35J98j79m31nM90L08j36q0K35J93nJ36L36P9l18
54332A11460k79Jkk19l52n48q53o82J84Q78O06o0j23L53N93M28J98p8m92o67k97
54311A10049J98K88J52J64K07J56L89J006J331R59N81Q29J137O95j57n22l39j79
54293A16944j80j36j87m97p06m92j90j91k34m0Q1q7p5M22Q53P50N57P19Q09M23
54273A18543J09L97P60N52J55J73K62r9m48j40L94M16K49O54J413J791J875K249
$$ y = [108238, 108343, 108445, 108328, 108327, 108509, 108466, 108055, 107568, 107161, 106760, 106496, 106551, 106660, 106437, 106076, 106061, 106361, 106574, 106668, 106881, 107106, 107088, 107048, 107365, 107874, 108189, 108456, 109028, 109681, 109943, 109946, 110149, 110457, 110431, 110145, 110062, 110285, 110671, 111348, 112327, 112960, 112730, 112237, 112442, 113220, 113678, 113598, 113474, 113357, 112830, 112025, 111563, 111484, 111233, 110685, 110251, 109992, 109602, 109232, 109325, 109696, 109728, 109472, 109566, 110083, 110448, 110504, 110639, 110837, 110658, 110227, 110222, 110712, 111020, 110884, 110804, 111039, 111232, 111227, 111363, 111699, 111778, 111460, 111181, 111182, 111180, 110961, 110609, 110061, 109208, 108526, 108710, 109588, 110194, 110134, 110011, 110364, 110957, 111385, 111583, 111505, 111013, 110346, 110049, 110247, 110535, 110687, 110851, 111058, 111214, 111603, 112609, 113940, 114899, 115480, 116309, 117446, 118141, 117984, 117462, 117123, 116944, 116764, 116628, 116441, 115944, 115238, 114746, 114556, 114365, 114131, 114091, 114172, 114085, 114010, 114432, 115285, 116035, 116592, 117311, 118120, 118543, 118652, 119049, 119809, 120361, 120516, 120689, 120951, 120852, 120404, 120264, 120658, 121074, 121323, 121977, 123390, 125181, 127056, 129305]
54255A29305K767K866K706K842L093K894K354J966J604Q32j52r03j620k619l435
54240A44500l437k935k642k473j952j346j244j433j228o40j98N8L54M16q0o53
54224A25067o47k95j84j47K37N40R0p33r94o50l88l41j57jk90p14o23k11j48l66
54204A19045k65J04K01J03K81N27K58l37n47l38k54l10o8L15K94k4p4P8m8k95
54184A18646q5M11M89J33k2J13N3k33k84j38k23m11j62M16O75N34M79N71M22P9
54164A21463j1J09O5QL71R07R65N78L30K64n8n72p76o63o11n49j90J75O8j96j6
54143A21661L48K39j07P6O18O43J33r4J68K98J16P2J71k8l28p9N63P56M53M70
54123A26149R19R85M23L0K45M92K92m2k06l33m12j40K98K78k09m40j21K33K72
$$ y = [129305, 132072, 134938, 137644, 140486, 143579, 146473, 148827, 150793, 152397, 153229, 153077, 152174, 150554, 147935, 144500, 141063, 138128, 135486, 133013, 131061, 129715, 128471, 127038, 125810, 125170, 124972, 125030, 125384, 125800, 125720, 125067, 124420, 124125, 123941, 123794, 124031, 124571, 124661, 123928, 122934, 122284, 121896, 121555, 121398, 121397, 121107, 120393, 119770, 119559, 119411, 119045, 118780, 118884, 119085, 119188, 119469, 119996, 120254, 119917, 119370, 119032, 118778, 118468, 118400, 118715, 119009, 118985, 118911, 118989, 118941, 118646, 118561, 118972, 119461, 119594, 119572, 119685, 119738, 119505, 119221, 119083, 118860, 118449, 118287, 118703, 119378, 119912, 120391, 120962, 121384, 121463, 121452, 121561, 121626, 121634, 122005, 122912, 123877, 124455, 124785, 125049, 124991, 124419, 123643, 122980, 122369, 121820, 121630, 121805, 121873, 121677, 121661, 122009, 122248, 122141, 122217, 122835, 123478, 123611, 123517, 123685, 123983, 124099, 124171, 124342, 124314, 123986, 123907, 124470, 125226, 125679, 126149, 127068, 128053, 128476, 128506, 128751, 129243, 129535, 129493, 129287, 128954, 128542, 128402, 128700, 128978, 128769, 128329, 128208, 128441, 128713]
54104A28713K37K66J15k06l69l73n25p41o96n49o08m92L15J283J379P12L65O07
54086A29433O23O8m49o26q73j224j121o24n30r63j075n26l7n8m9L33N41J61l96
54067A22608p23r81j167q17O2O78N50J00k00l86m17j8N57N93R0j06K72M73Q4k70
54047A20982m5L40L87K91L27K87O8K0K22K39l9j00L00P24Q63R22R24N81Q0J2K85
54026A27670J40m64n84J57R43J142J147J328J261P33L76N49O28J07m45l31K08
54009A34565O05Q27R97Q68L73J6R2K58L08O10J235J592J486J625K451L347L733
53992A54988M042M897O115P338Q816J0676J2066J1833R656N932J178l814p903
53979B25820j0388j1441j1368j0166q240o650n935n451m505l394k603j853p90
$$ y = [128713, 128950, 129216, 129331, 129125, 128756, 128383, 127858, 127117, 126421, 125872, 125264, 124772, 125087, 126370, 127749, 128461, 128826, 129433, 130056, 130124, 129675, 129049, 128176, 126952, 125831, 125207, 124677, 123714, 122639, 122113, 122076, 122018, 121969, 122302, 122843, 123004, 122608, 121885, 120904, 119737, 118920, 118982, 119660, 120210, 120310, 120110, 119724, 119307, 119289, 119846, 120439, 120529, 120423, 120695, 121168, 121252, 120982, 120937, 121277, 121664, 121955, 122282, 122569, 122637, 122657, 122879, 123118, 123079, 122979, 123279, 124003, 124866, 125788, 126712, 127293, 127373, 127385, 127670, 127810, 127346, 126762, 126919, 127862, 129004, 130151, 131479, 132740, 133473, 133849, 134398, 135026, 135133, 134688, 134357, 134565, 135170, 135997, 136994, 137862, 138235, 138251, 138343, 138601, 138909, 139519, 140754, 142346, 143832, 145457, 147908, 151255, 154988, 159030, 163927, 170042, 177380, 186196, 196872, 208938, 220771, 230427, 236359, 237537, 233723, 225820, 215432, 203991, 192623, 182457, 174217, 167567, 161632, 156181, 151676, 148282, 145679, 143826, 143036]
53966A43036J07K48rJ21P22J349J844K331K729K999L416M071M510M371L882L227
53950A78954K102M07j228k195k675l057l242l034k686k418j966j147l47R5L66
53935A57929N99N24J75K23R05J458J297R92J295J867J909J441J080J026J069J187
53919A74976J389J365R63N96N66N24J78l9K46M91j4j013j674j755j627j507j414
53902A72251j516j919k309k399k327k201j778j038n65p42j101j096r02r06r67
53887A50485q47p97j010j071o55k10k53n08m74k98l34l74j46J3k71o36n66k67
53869A41781j58n5L01N04J52k30O4O58O82J74m2K75N97O32O52Q17R79J064J039
53850A49886O92O5j94L82J277J707J794K244L133L894M323M761N338N901O620
$$ y = [143036, 143143, 143391, 143382, 143503, 144225, 145574, 147418, 149749, 152478, 155477, 158893, 162964, 167474, 171845, 175727, 178954, 181056, 181463, 180235, 178040, 175365, 172308, 169066, 166032, 163346, 160928, 158962, 157815, 157468, 157563, 157929, 158528, 159052, 159227, 159450, 160355, 161813, 163110, 164102, 165397, 167264, 169173, 170614, 171694, 172720, 173789, 174976, 176365, 177730, 178693, 179289, 179855, 180379, 180557, 180518, 180764, 181255, 181241, 180228, 178554, 176799, 175172, 173665, 172251, 170735, 168816, 166507, 164108, 161781, 159580, 157802, 156764, 156199, 155457, 154356, 153260, 152358, 151452, 150485, 149638, 148841, 147831, 146760, 146105, 145895, 145642, 145134, 144660, 144362, 144028, 143654, 143508, 143521, 143250, 142614, 142048, 141781, 141623, 141568, 141869, 142373, 142525, 142295, 142359, 143017, 143699, 143873, 143831, 144106, 144703, 145335, 145987, 146804, 147783, 148847, 149886, 150578, 150643, 150449, 150831, 152108, 153815, 155609, 157853, 160986, 164880, 169203, 173964, 179302, 185203, 191823]
53835A91823P981J0124J2663J5170J7324J8724J8852J7147J2949O085k042q676
53823C18124j1830j1901j0628r080p468o137n587n619n473m787l675k111n9J954
53809B35723L136L311K832J891N37p64j444j537j547j699j834j880j861j703j507
53794B31654j667k244k633k407k030k041k168j978j856k364l085l184k774k696
53780A98527l109l381l247l100l130l006k574k064j640j294j172j385j618j540
53766A66267j371j474j653j544j356j500j781j750j542j591j739j533j096r01
53752A45436q65n63j33n0k12j32R4j0l50m12k80m73q90q72l43O8R9R7J86P8j67
53731A40306r7K68L80J04n9J62M64N95O32N33J27l65m43r0K50M19O32Q35O78J87
$$ y = [191823, 199804, 209928, 222591, 237761, 255085, 273809, 292661, 309808, 322757, 328842, 326800, 318124, 306294, 294393, 283765, 274685, 267217, 261080, 255493, 249874, 244401, 239614, 235939, 233828, 233769, 235723, 238859, 242170, 245002, 246893, 247430, 246666, 245222, 243685, 242138, 240439, 238605, 236725, 234864, 233161, 231654, 229987, 227743, 225110, 222703, 220673, 218632, 216464, 214486, 212630, 210266, 207181, 203997, 201223, 198527, 195418, 192037, 188790, 185690, 182560, 179554, 176980, 174916, 173276, 171982, 170810, 169425, 167807, 166267, 164896, 163422, 161769, 160225, 158869, 157369, 155588, 153838, 152296, 150705, 148966, 147433, 146337, 145436, 144571, 144008, 143875, 143825, 143613, 143481, 143575, 143565, 143215, 142803, 142523, 142050, 141160, 140288, 139945, 140013, 140112, 140209, 140395, 140473, 140306, 140209, 140477, 140857, 140961, 140902, 141064, 141528, 142123, 142755, 143288, 143415, 143050, 142607, 142517, 142767, 143186, 143818, 144653, 145331, 145518]
53711A45518k04l15k68%O17J242J436J425J756K268K278J792J591K019K547K716
53695A66418K727K852K962K877K619K147J408O66K83J38j35m40l72J2K34J40o3
53678A84473l82r44j434j429j177j266j620j654j350j278j588j859j952k131k310
53663A62099k077j523j197j173j030p44o57o38k39K46lr21j474j223q61r01r18
53646A46766n62k48l24m12j74M7q8k63j19J13N5k35n01o52o10k96M8P7l9J61N35
53625A43279M26j74m95j57K81L63L77N92O77L76Q9K42O49R60J173J341J274R71
53607A52244Q14J014J309J460J538J516J190P19N64P14O51L04K82Q26J293J142
53591A67580O94M82M63M17M72P40R17P22L64J64J27J71L80P01Q28O88N77O41O51
$$ y = [145518, 145314, 144999, 144731, 144731, 145348, 146590, 148026, 149451, 151207, 153475, 155753, 157545, 159136, 161155, 163702, 166418, 169145, 171997, 174959, 177836, 180455, 182602, 184010, 184676, 184959, 185097, 184962, 184522, 184150, 184162, 184396, 184536, 184473, 184091, 183147, 181713, 180284, 179107, 177841, 176221, 174567, 173217, 171939, 170351, 168492, 166540, 164409, 162099, 160022, 158499, 157302, 156129, 155099, 154355, 153698, 153060, 152821, 153067, 153064, 152143, 150669, 149446, 148585, 147684, 146766, 146204, 145956, 145632, 145220, 145046, 145093, 145005, 144742, 144623, 144736, 144791, 144556, 144055, 143403, 142793, 142497, 142545, 142622, 142583, 142744, 143279, 143705, 143531, 143036, 142879, 143160, 143523, 143900, 144492, 145169, 145545, 145634, 145876, 146525, 147485, 148658, 149999, 151273, 152244, 153058, 154072, 155381, 156841, 158379, 159895, 161085, 161804, 162368, 163082, 163733, 164037, 164319, 165145, 166438, 167580, 168274, 168756, 169219, 169636, 170108, 170848, 171765, 172487, 172851, 173015, 173142, 173313, 173693, 174394, 175222, 175910, 176487, 177128, 177779]
53572A77779N05M04L61J34k21l27j97l06p45r60o54k41j05r8l6n2r2K02P85J036
53552A77172P02L00K20J37k60o80q08q26q06l51O10J326J172N50K01J30p6l54
53534A78359l03N7L33L99M79O59P97P72N80K99J34K69N85P71Q34J097J537J657
53516A89315J185M83N6Q2M84J071J454J341R91R09J098J179J208J609K240K430
53500B07135K103J970K356K758K878L160L874M513M691M786N164N477N322M858
53486B61045M274L357K108J050L29o97k297l635l905l567l540l793l614k859k092
53471B42164j745j847k280k717k635j990j450j470j571j168n73m70q00r40p36
53456B19772n26m10j83J20K51K15K06J83Rj65r3J34K60L13M47N43L58k4k34j05
$$ y = [177779, 178284, 178688, 179049, 179183, 178962, 178635, 178438, 178132, 177387, 176427, 175773, 175532, 175427, 175329, 175293, 175241, 175149, 175351, 176136, 177172, 177874, 178174, 178394, 178531, 178271, 177591, 176783, 175957, 175151, 174800, 175410, 176736, 177908, 178458, 178659, 178789, 178713, 178359, 178056, 178113, 178446, 178845, 179324, 179983, 180780, 181552, 182132, 182431, 182565, 182834, 183419, 184190, 185024, 186121, 187658, 189315, 190500, 190983, 191039, 191121, 191605, 192676, 194130, 195471, 196462, 197371, 198469, 199648, 200856, 202465, 204705, 207135, 209238, 211208, 213564, 216322, 219200, 222360, 226234, 230747, 235438, 240224, 245388, 250865, 256187, 261045, 265319, 268676, 270784, 271834, 272163, 271466, 269169, 265534, 261629, 258062, 254522, 250729, 247115, 244256, 242164, 240419, 238572, 236292, 233575, 230940, 228950, 227500, 226030, 224459, 223291, 222718, 222248, 221448, 220508, 219772, 219246, 218836, 218653, 218773, 219024, 219239, 219445, 219628, 219637, 219472, 219379, 219513, 219773, 220086, 220533, 221076, 221434, 221410, 221176, 221071]
53436B21071K06M33M28L23M62R74J406J247P30O01J021J420J495J655K216K899
53420B38587L433L950M399M393L986L882M335M630M207L562L429L694L883M074
53406B94444M614N362N930O294O604O773O806P056P695Q300Q493Q506Q683Q919
53392C94479R063R325R796J0061R797R264Q797Q383Q101Q263Q721Q803Q408Q308
53378E19569Q785Q944Q102O946O405O323O156O183O829P524P448O871O627O660
53364F19372O299N550M979M599L969L156K561J975Q77n55j701k612l823n214o010
53349F33422n940n483n045m733m784n370o082o338o271o453o938p314p479p537
53335E47655p248o453n787o002o748o987o504n974n638m988l862k801k114j476
$$ y = [221071, 221277, 221710, 222138, 222461, 222923, 223897, 225303, 226550, 227280, 227881, 228902, 230322, 231817, 233472, 235688, 238587, 242020, 245970, 250369, 254762, 258748, 262630, 266965, 271595, 275802, 279364, 282793, 286487, 290370, 294444, 299058, 304420, 310350, 316644, 323248, 330021, 336827, 343883, 351578, 359878, 368371, 376877, 385560, 394479, 403542, 412867, 422663, 432724, 442521, 451785, 460582, 468965, 477066, 485329, 494050, 502853, 511261, 519569, 528354, 537298, 545400, 552346, 558751, 565074, 571230, 577413, 584242, 591766, 599214, 606085, 612712, 619372, 625671, 631221, 636200, 640799, 644768, 647924, 650485, 652460, 653337, 652782, 651081, 648469, 644646, 639432, 633422, 627482, 621999, 616954, 612221, 607437, 602067, 595985, 589647, 583376, 576923, 569985, 562671, 555192, 547655, 540407, 533954, 528167, 522165, 515417, 508430, 501926, 495952, 490314, 485326, 481464, 478663, 476549, 475073]
53321D75073p13j98k22n46q04p60k11Q32J849K287K311K526L071L612M155N084
53305D97346O362P416P903Q017Q042Q090Q299Q750R307R934J0935J2359J3558
53292F16318J4001J4177J4932J6201J7288J8069J8968J9887K0269K0201K0408
53281H10719K1113K1769K2102K2442K2898K3046K2743K2380K2124K1620K0694
53270A053650J9698J8873J8019J6969J5840J4611J3027J1124R290P671O023M253
53258A209048K615J152n26k828n842r382j2980j5956j7966j9379k0679k1707k2036
53245A063534k1828k1671k1686k1554k1186k0728k0049j8976j7914j7420j7288
53234H43234j6905j6367j6328j6806j7020j6563j5832j5147j4315j3201j2023
$$ y = [475073, 474360, 474162, 473940, 473394, 472590, 471830, 471619, 472451, 474300, 476587, 478898, 481424, 484495, 488107, 492262, 497346, 503708, 511124, 519027, 527044, 535086, 543176, 551475, 560225, 569532, 579466, 590401, 602760, 616318, 630319, 644496, 659428, 675629, 692917, 710986, 729954, 749841, 770110, 790311, 810719, 831832, 853601, 875703, 898145, 921043, 944089, 966832, 989212, 1011336, 1032956, 1053650, 1073348, 1092221, 1110240, 1127209, 1143049, 1157660, 1170687, 1181811, 1191101, 1198772, 1204795, 1209048, 1211663, 1212815, 1212289, 1209461, 1203619, 1194237, 1181257, 1165301, 1147335, 1127956, 1107277, 1085570, 1063534, 1041706, 1020035, 998349, 976795, 955609, 934881, 914832, 895856, 877942, 860522, 843234, 826329, 809962, 793634, 776828, 759808, 743245, 727413, 712266, 697951, 684750, 672727]
53223F72727j0872r644q545p955p655o979n841m881m482m362m319m571n130n538
53209E81953n553n463n532n592n423m997m325l465k746k423k179j536o55p3K04
53194E32195O05J128J422J637K293L266L860L956M199M907N704O414P321Q314
53180E87221Q758Q568Q576R331J0275J0590J0228R672R227Q924Q685Q269P445
53167G05769O346N303M334L219K032J022J18q49j649k124k858m504o635q238r231
53152F92055j0334j1554j2107j1936j1969j2540j2877j2544j2170j2204j2129
53141E59691j1555j1018j0978j0962j0399r531q840q362q141q553r557j0341j0362
53128D31092j0027r842r606r018q326p770p115o255n657n492n142m122k909k221
$$ y = [672727, 661855, 652211, 643666, 635711, 628056, 621077, 615236, 610355, 605873, 601511, 597192, 592621, 587491, 581953, 576400, 570937, 565405, 559813, 554390, 549393, 545068, 541603, 538857, 536434, 534255, 532719, 532064, 531991, 532195, 532800, 533928, 535350, 536987, 539280, 542546, 546406, 550362, 554561, 559468, 565172, 571586, 578907, 587221, 595979, 604547, 613123, 622454, 632729, 643319, 653547, 663219, 672446, 681370, 690055, 698324, 705769, 712115, 717418, 721752, 724971, 727003, 728025, 728143, 727294, 725645, 723521, 720663, 716159, 709524, 701286, 692055, 681721, 670167, 658060, 646124, 634155, 621615, 608738, 596194, 584024, 571820, 559691, 548136, 537118, 526140, 515178, 504779, 495248, 486408, 478046, 469905, 461352, 451795, 441454, 431092, 421065, 411223, 401617, 392599, 384273, 376503, 369388, 363133, 357476, 351984, 346842, 342720, 339811, 337590]
53114C37590k072k126k380k852l231l351l544l993m331m355m437m791n017m927
53100B86183n014n488n619m798l599k946k887k907k898l006l042k829k747l147
53086B35256l625l589l203l025l092l061k943k999l153l148l003k799k330j506
53072A93780q33q42j350j724j717j521j314j212j344j600j594j220q73q15p54
53057A75067m56k18l18m73l66j87j89j73P3K90K08J1j27m17q76r65l95K39K54
53038A70982j88n35p20r07q95n12j49k29m83m30j93j45j62O2L15K40O5K98Q74
53019A67288J320J497J579J548J308J046R34P49L07p9j40k33p76j430j570j238
53003A72110r21p13l94j17k49o86r68r39p52m25K4K52L0k21P8P97J279J242R33
$$ y = [337590, 335518, 333392, 331012, 328160, 324929, 321578, 318034, 314041, 309710, 305355, 300918, 296127, 291110, 286183, 281169, 275681, 270062, 265264, 261665, 258719, 255832, 252925, 250027, 247021, 243979, 241150, 238403, 235256, 231631, 228042, 224839, 221814, 218722, 215661, 212718, 209719, 206566, 203418, 200415, 197616, 195286, 193780, 192947, 192105, 190755, 189031, 187314, 185793, 184479, 183267, 181923, 180323, 178729, 177509, 176636, 175821, 175067, 174611, 174393, 174075, 173602, 173236, 173049, 172860, 172687, 172760, 173050, 173258, 173269, 173142, 172725, 171849, 170884, 170489, 170728, 170982, 170794, 170259, 169539, 168632, 167737, 167225, 167076, 166847, 166364, 165934, 165741, 165596, 165434, 165496, 165811, 166051, 166116, 166414, 167288, 168608, 170105, 171684, 173232, 174540, 175586, 176520, 177269, 177576, 177497, 177357, 177124, 176348, 174918, 173348, 172110, 171189, 170476, 170082, 169965, 169716, 169030, 168062, 167123, 166371, 165946, 165970, 166222, 166252, 166031, 166109, 166906, 168185, 169427, 170360]
52984A70360N79K69J50K61K98K6k99l68l10l45l04p6m3n17j033r86n81m81p38
52965A65862q46o45m82n30o09o30o49n90l43k8K26N01P70O77J04m70o12n35n68
52946A60603n32k45o7k49k91K85R85J017N27K06J21j45m67l28J95M91M29L68L78
52927A63281K37J10L50P09O00R0k16j61r7n1K46N80M52M9J05O76R51M57l55q61
52907A67152q71l98M36J159J259R00O59O54N88N55R24J430J360P33L79O10P69
52890A78298L69k04n02p30j110j281q90k65K5j05l38m28k83R4N20P52P86Q15Q21
52871A76344O06K23k2l2L4J47L42L96M7m31m82r2K34K97L29L15p7p70j151r53
52851A75304n76l55r7L38O45N70L28J62m1m05o95o63m33l05l29l37j75J56M20
$$ y = [170360, 170939, 171208, 171358, 171619, 171917, 171943, 171644, 171276, 170966, 170621, 170317, 170241, 170198, 169681, 168648, 167662, 167081, 166600, 165862, 165016, 164371, 163889, 163359, 162750, 162120, 161471, 160881, 160538, 160510, 160736, 161237, 162007, 162684, 162788, 162318, 161706, 161171, 160603, 160071, 159826, 159759, 159510, 159219, 159504, 160489, 161506, 162033, 162239, 162360, 162215, 161748, 161420, 161615, 162106, 162535, 162903, 163281, 163518, 163628, 163978, 164687, 165287, 165377, 165161, 165000, 164903, 164852, 165098, 165678, 166130, 166179, 166284, 166960, 167911, 168368, 168013, 167152, 166281, 165883, 166319, 167478, 168737, 169637, 170296, 170950, 171538, 172093, 173017, 174447, 175807, 176540, 176919, 177529, 178298, 178667, 178463, 177961, 177231, 176121, 174840, 173950, 173685, 173710, 173605, 173267, 172839, 172556, 172650, 173170, 173922, 174708, 175523, 176344, 176950, 177173, 177151, 177119, 177153, 177300, 177642, 178038, 178085, 177654, 177172, 177080, 177314, 177611, 177940, 178255, 178178, 177408, 176257, 175304, 174728, 174373, 174276, 174614, 175259, 175829, 176157, 176319, 176278, 175873, 175178, 174515, 174082, 173777, 173448, 173111, 172936, 173092, 173512]
52832A73512K73k86p06m95Q8L75K10k0j18k51l70j58L51O46M45L9k16k92k82j88
52812A72557q7j23k63l56m17n06m61j44J70J55K7J89M88M59J84J78M55N23L29
52793A73357M34J016J507J428R40L79j77o34q24q97j185j496j271n29Qrr4J66
52775A72119M78M50K34J31N9j00j73m1R5Q7R7J89J77J05L58R63J279Q27k4n55
52755A76755n52k63O8L38M38L77K52M8l64q65j137j180j334j668j774j405q79
52738A66855n85m93l92k34o7J07K00R7j06j89j85k87m08k81N5L54P43J522K398
52719A69104K677K400K435L141L652K994J274o63k186l078l264k945k591k399
52705A70551k064j438r13q26q83o76l92m90r63j341j313r37m38l7J45J70K08K45
$$ y = [173512, 173785, 173499, 172793, 172298, 172386, 172761, 172971, 172951, 172833, 172582, 172212, 172054, 172405, 173051, 173496, 173535, 173319, 173027, 172745, 172557, 172470, 172347, 172084, 171728, 171311, 170805, 170344, 170200, 170370, 170525, 170552, 170741, 171229, 171688, 171872, 172050, 172505, 173028, 173357, 173791, 174807, 176314, 177742, 178682, 179061, 178884, 178250, 177426, 176529, 175344, 173848, 172577, 172048, 172056, 172047, 171953, 172119, 172597, 173047, 173281, 173412, 173471, 173371, 173198, 173157, 173252, 173339, 173436, 173625, 173802, 173907, 174265, 175228, 176507, 177334, 177310, 176755, 176203, 175940, 176008, 176346, 176784, 177161, 177413, 177461, 177097, 176232, 175095, 173915, 172581, 170913, 169139, 167734, 166855, 166270, 165777, 165385, 165151, 165084, 165191, 165391, 165488, 165382, 165193, 165008, 164721, 164313, 164032, 164087, 164441, 165184, 166706, 169104, 171781, 174181, 176616, 179757, 183409, 186403, 187677, 187014, 184828, 181750, 178486, 175541, 172950, 170551, 168487, 167049, 166136, 165310, 164427, 163751, 163359, 162869, 161906, 160565, 159252, 158315, 157877, 157840, 157985, 158155, 158363, 158608]
52687A58608J39n9j27j01j96l13j00L90O15L51P3K55P54J143J236J002M37k51
52669A63856o43o27m95m24k33J31L54K85K02L18L89J82j09k19j88j48k1K30M10
52650A63250L82K43P1j72l52k00K00M41L95L78N41O64P09R31J286J286P92L46
52632A71191L60N50N24L60K20m7m76o89m38n1J00R3J10K2k24l16p6J86K08J96
52612A71803L34L41L0k10j4L30L45J28L1j4k77n90n65k23N3J44K61N06P14P30
52592A73857N55L17K14L43N12M40K16J62K77K16m8r2K03L70P8l66n71n81n85n66
52572A74951n43o24n98l4Q79J276P65K9j60J08L90O73J021J054M87k30m65k41
52554A78738K1K18M24M31O8l39m16l06l27l65j45K15M18M95O22P58Q38R94J199
$$ y = [158608, 158747, 158688, 158561, 158460, 158264, 157951, 157851, 158241, 158856, 159207, 159280, 159535, 160289, 161432, 162668, 163670, 164107, 163856, 163213, 162586, 162091, 161667, 161434, 161565, 161919, 162204, 162406, 162724, 163113, 163295, 163186, 162967, 162779, 162631, 162610, 162840, 163250, 163632, 163875, 163946, 163774, 163422, 163222, 163422, 163863, 164258, 164636, 165177, 165841, 166550, 167481, 168767, 170053, 170845, 171191, 171551, 172101, 172625, 172985, 173205, 173158, 172682, 171993, 171555, 171504, 171604, 171697, 171807, 171829, 171605, 171289, 171213, 171399, 171607, 171803, 172137, 172478, 172508, 172298, 172284, 172614, 172959, 173087, 173118, 173104, 172827, 172237, 171672, 171449, 171502, 171646, 171907, 172413, 173127, 173857, 174412, 174729, 174943, 175286, 175798, 176238, 176454, 176616, 176893, 177109, 177061, 176969, 177172, 177542, 177620, 177254, 176683, 176102, 175517, 174951, 174408, 173784, 173186, 173152, 174031, 175307, 176072, 176101, 175941, 176049, 176439, 177112, 178133, 179187, 179674, 179444, 178979, 178738, 178759, 178977, 179401, 179832, 179900, 179561, 179145, 178839, 178512, 178147, 178002, 178217, 178635, 179130, 179752, 180510, 181348, 182342, 183541]
52535A83541J074N43J74M39J027J377J413J212N47o55j791k234k121j930j642
52520A80974j019l04L5J1o9j77l68l61Q4O12P17M23N8l07o25n59rM51L46N9J56
52499A80128L88K32r3m3J82Ol54j49N96J032P89M20L83M70L74J62l6j82j12L24
52479A84517P87P23J11n02p68q18p77n69k34m0j38m43p77q73m73K88P89O77L55
52460A81835L66O04O76O01N77M15r6n64n32k88m18p63p00k50m6k68m39l29k47
52441A80134m06o06o42m52L9O93R27L79l93n51r6L33N60Q65J111Q65L74L89R55
52422A84478J302J112R04J020J079Q35O96R84J379J491J421J374J263J023Q01
52407B01162O13K26l56p86q91q82q92q33p58q95j172j255j103r75q10k66N54J004
$$ y = [183541, 184615, 185158, 185332, 185771, 186798, 188175, 189588, 190800, 191347, 190692, 188901, 186667, 184546, 182616, 180974, 179955, 179651, 179686, 179697, 179628, 179451, 179083, 178722, 178806, 179418, 180135, 180558, 180616, 180309, 179684, 179125, 179116, 179567, 179913, 179972, 180128, 180516, 180748, 180655, 180612, 180794, 180800, 180446, 180297, 180893, 181925, 182714, 183134, 183517, 183987, 184361, 184523, 184487, 184305, 184193, 184517, 185304, 186027, 186138, 185636, 184868, 184050, 183273, 182704, 182470, 182430, 182292, 181849, 181072, 180199, 179726, 180014, 180803, 181480, 181835, 182201, 182805, 183481, 184082, 184659, 185074, 184978, 184414, 183882, 183594, 183176, 182413, 181713, 181463, 181417, 181149, 180710, 180381, 180134, 179728, 179122, 178480, 178028, 178067, 178760, 179687, 180066, 179673, 179122, 179026, 179359, 179919, 180784, 181895, 182760, 183134, 183523, 184478, 185780, 186892, 187796, 188816, 189895, 190730, 191426, 192410, 193789, 195280, 196701, 198075, 199338, 200361, 201162, 201775, 202001, 201645, 200859, 199968, 199086, 198194, 197361, 196603, 195708, 194536, 193281, 192178, 191203, 190393, 190127, 190681, 191685]
52389A91685P83K95m0k66m89n78n37o50r69j103p98l12J5J86L08L31K57K95N57
52370A88970Q67R88R00P60P66J017J334J317Q53K82j20n31j072j344j126r89j540
52353A91332k316k364j689j193j228j225p98l04p9K1Q1p0l15k19K11M42K48J3
52335A80548lJ7n4r1j90n82j028r89n59l66m97l40K35N61L25Q8K48M06K66K54
52315A78249O65R91Q06N66Q42J387J656J734K036K523K921L364M173N222O008
52300B13143O140N375L542R01j764l777n050n663n491m588l503k722k131j451
52286A92961p82l35K1M29O33L33k52o40o13k22M63J255J802J949J952K020J964
52269B02938J550Q78J93m13p90o85j71K44K43J03J71L50M10M20N29O19N00K01
$$ y = [191685, 192468, 192763, 192723, 192457, 191968, 191390, 190853, 190203, 189234, 188131, 187333, 187021, 187036, 187222, 187530, 187861, 188118, 188413, 188970, 189837, 190825, 191725, 192485, 193251, 194268, 195602, 196919, 197772, 198054, 197934, 197403, 196331, 194987, 193861, 192872, 191332, 189016, 186652, 184963, 183770, 182542, 181317, 180519, 180215, 180136, 180157, 180238, 180168, 179853, 179634, 179845, 180287, 180535, 180548, 180545, 180562, 180508, 180417, 180227, 179645, 178617, 177628, 177069, 176703, 176206, 175866, 176101, 176662, 176987, 177075, 177323, 177729, 177995, 178249, 178914, 179905, 180711, 181277, 182119, 183506, 185162, 186896, 188932, 191455, 194376, 197740, 201913, 207135, 213143, 219283, 224658, 228200, 229101, 227337, 223560, 218510, 212847, 207356, 202768, 199265, 196543, 194412, 192961, 192179, 191844, 191865, 192294, 192927, 193260, 193008, 192368, 191755, 191533, 191996, 193251, 195053, 197002, 198954, 200974, 202938, 204488, 205366, 205559, 205146, 204356, 203671, 203500, 203744, 203987, 204090, 204261, 204611, 205021, 205441, 205970, 206589, 207089, 207290]
52251B07290j86o50j026r89n52j46J3K11O18Q62O14J57J5L06Q20J369J766J779
52233B12271J486J350J628K022K198K256K395K531K516K449K395K197J800J456
52219B40950J348J386J579K088K719K932K691K694L321L998M098L933M205M935
52205B82877N607O016O307O467O409O375O648O983O893O391N944N807N846N982
52191C70552O308O806P232P380P241O971O804O852O915O673O195N924O071O355
52177D64279O480O446O278N863N258M740M303L644K836K399K365J943O06j070
52163E16370k192k642k830k842k527k052j696j299n74K41O35N54L54K23J12J51
52147D99986N61J250J908K438K999L655M344N006N505N650N503N428N559N604
$$ y = [207290, 207104, 206454, 205428, 204439, 203887, 203741, 203754, 203965, 204583, 205445, 206059, 206216, 206231, 206537, 207357, 208726, 210492, 212271, 213757, 215107, 216735, 218757, 220955, 223211, 225606, 228137, 230653, 233102, 235497, 237694, 239494, 240950, 242298, 243684, 245263, 247351, 250070, 253002, 255693, 258387, 261708, 265706, 269804, 273737, 277942, 282877, 288484, 294500, 300807, 307274, 313683, 320058, 326706, 333689, 340582, 346973, 352917, 358724, 364570, 370552, 376860, 383666, 390898, 398278, 405519, 412490, 419294, 426146, 433061, 439734, 445929, 451853, 457924, 464279, 470759, 477205, 483483, 489346, 494604, 499344, 503647, 507291, 510127, 512526, 514891, 516834, 517440, 516370, 514178, 511536, 508706, 505864, 503337, 501285, 499589, 498290, 497716, 497957, 498592, 499146, 499500, 499723, 499835, 499986, 500547, 501797, 503705, 506143, 509142, 512797, 517141, 522147, 527652, 533302, 538805, 544233, 549792, 555396]
52133E55396N385N176N150M994M525M176M365M715M534L782K963K306J658R80
52119F10105M03j22p03j198j447j619j950k278k349k318k509k875l153l347l587
52104E81053l716l500l123k949k949k812k488k218k130k195k422k711k732k327
52090E42781j853j626j359o07M35J116J164Q71N69M57P43J441K080K137J644J008
52074E51001L44m73j235j490j216r19r56j177j273j168r90r03r86j098r62n39
52058E35960k03l01p51j215j441j249n26M97J272J551J640J770J675J110L76j89
52042E39976p20j397j853j659j033m80m7M93R97J189J303J829K726L505L927M096
52026E52852L999L517K799K129J529R57O78R27J420J726J910K253K597K570K318
$$ y = [555396, 560781, 565957, 571107, 576101, 580626, 584802, 589167, 593882, 598416, 602198, 605161, 607467, 609125, 610105, 610508, 610386, 609683, 608485, 607038, 605419, 603469, 601191, 598842, 596524, 594015, 591140, 587987, 584640, 581053, 577337, 573837, 570714, 567765, 564816, 562004, 559516, 557298, 555168, 552973, 550551, 547840, 545108, 542781, 540928, 539302, 537943, 537336, 537771, 538887, 540051, 540922, 541491, 541948, 542691, 544132, 546212, 548349, 549993, 551001, 551345, 550872, 549637, 548147, 546931, 546012, 545056, 543879, 542606, 541438, 540448, 539545, 538559, 537461, 536499, 535960, 535757, 535456, 534705, 533490, 532049, 530800, 530274, 530771, 532043, 533594, 535234, 537004, 538679, 539789, 540165, 539976, 539256, 537859, 536006, 534347, 533314, 532834, 532787, 533280, 534277, 535466, 536769, 538598, 541324, 544829, 548756, 552852, 556851, 560368, 563167, 565296, 566825, 567782, 568460, 569387, 570807, 572533, 574443, 576696, 579293, 581863, 584181]
52011E84181K284K459K444K141J790J382P49R4j48M2L45P90J713L102M563N913
51995F13844P287Q647R743J0539J1155J1486J1395J1168J1195J1297J0966J0169
51983G38891R256Q205O721N019L745L021K293J244J68p09j542k323k659k393j987
51968G66950j924k188k538k942l480m090m619m881m683m055l394l094l047k842
51954G19173k310j605q06N9Q06J312J843K714L769M606N147N504N511M994M341
51939G55058M166M445M613M457M254M110L737K953J906P72k76r07r73q73j061
51924G86381j314j100m68L3K09K82J68n40j883l457m998o394p281p363p032o926
51908G38317o943o535n859n680o095o378o213o073o169o011n421n037n323n887
$$ y = [584181, 586465, 588924, 591368, 593509, 595299, 596681, 597430, 597524, 597376, 597418, 597763, 598553, 600266, 603368, 607931, 613844, 621131, 629778, 639521, 650060, 661215, 672701, 684096, 695264, 706459, 717756, 728722, 738891, 748147, 756352, 763073, 768092, 771837, 774858, 777151, 778395, 778563, 777854, 776312, 773989, 771330, 768937, 766950, 765026, 762838, 760300, 757358, 753878, 749788, 745169, 740288, 735605, 731550, 728156, 725062, 722015, 719173, 716863, 715258, 714452, 714511, 715317, 716629, 718472, 721186, 724955, 729561, 734708, 740212, 745723, 750717, 755058, 759224, 763669, 768282, 772739, 776993, 781103, 784840, 787793, 789699, 790471, 790195, 789288, 788315, 787442, 786381, 785067, 783967, 783499, 783532, 783741, 784023, 784191, 783651, 781768, 778311, 773313, 766919, 759638, 752275, 745243, 738317, 731374, 724839, 718980, 713300, 707205, 700827, 694614, 688541, 682372, 676361, 670940, 665903, 660580, 654693]
51894F54693o247o591p270q171r124j0340j1978j3665j4889j5508j5591j5159
51882E20160j4334j3359j2195j0558q483o489m990l951l277l019l089l298l769
51869D29349m790o126p082p334p183o907o473n946n533n094m288l260k513k047
51855C54773j378n00N4K58P51J707K510K932L562M605N178M559L324K502K263
51840C87100K110J836J565J293R89P36M15l03j290j860j807j777k160k250j311
51825C83286K38J457K253L260M788O608Q611J0884J3292J5581J7742J9727K0919
51812E08646K0378J7528J2329N099l326j1519j8057k2301k4372k4608k3424k1390
51800D14983j9095j6883j4865j3031j1237r387p676o317n023l309j325K45J266
$$ y = [654693, 648446, 641855, 634585, 626414, 617290, 606950, 594972, 581307, 566418, 550910, 535319, 520160, 505826, 492467, 480272, 469714, 461231, 454742, 449752, 445801, 442524, 439505, 436416, 433118, 429349, 424559, 418433, 411351, 404017, 396834, 389927, 383454, 377508, 371975, 366881, 362593, 359333, 356820, 354773, 353395, 352895, 352949, 353207, 353958, 355665, 358175, 361107, 364669, 369274, 374452, 379011, 382335, 384837, 387100, 389210, 391046, 392611, 393904, 394893, 395629, 396044, 395741, 394451, 392591, 390784, 389007, 386847, 384597, 383286, 383524, 384981, 387234, 390494, 395282, 401890, 410501, 421385, 434677, 450258, 468000, 487727, 508646, 529024, 546552, 558881, 563980, 560654, 549135, 531078, 508777, 484405, 459797, 436373, 414983, 395888, 379005, 364140, 351109, 339872, 330485, 322809, 316492, 311469, 308160, 306835, 307080, 308346]
51787C08346K414M036N508O209O401O518O237M948K782N01j338k579l187l339
51773C43457l481l810l969l627l037k549k078j474j036j072j259j052m35K03O48
51758C15429Q37N45l83j702l067m429n734o588o659o118n273m136k769j669j223
51743B67061j122q13k24L89R93J598J944J850J669J792J992J794J274Q98Q43R48
51727B82886J173J536J791J623J080L71n09j598k668l478m026m230l772k769k034
51712B65376k091k314j791o86O0J11K7K38N67P93J009J305J600J886K198K320
51696B70608J972J297P56N06L16Ql39o09p67p69o24m10p5O24J683K660L177L362
51678B83376L465L390K934K182J234r0j802l347m169m319m085l404k221j063n45
$$ y = [308346, 310760, 314796, 320304, 326513, 332914, 339432, 345669, 350617, 353399, 353900, 352562, 349983, 346796, 343457, 339976, 336166, 332197, 328570, 325533, 322984, 320906, 319432, 318396, 317324, 316065, 315013, 314578, 314781, 315429, 316266, 316811, 316428, 314726, 311659, 307230, 301496, 294908, 288249, 282131, 276858, 272722, 269953, 268284, 267061, 265939, 265126, 264902, 265291, 266284, 267882, 269826, 271676, 273345, 275137, 277129, 278923, 280197, 281095, 281938, 282886, 284059, 285595, 287386, 289009, 290089, 290460, 289951, 288353, 285685, 282207, 278181, 273951, 270179, 267410, 265376, 263285, 260971, 259180, 258494, 258554, 258665, 258692, 258930, 259497, 260290, 261299, 262604, 264204, 266090, 268288, 270608, 272580, 273877, 274633, 275139, 275455, 275463, 275124, 274515, 273748, 272979, 272355, 271945, 271870, 272494, 274177, 276837, 280014, 283376, 286841, 290231, 293165, 295347, 296581, 296491, 294689, 291342, 287173, 282854, 278769, 275365, 273144, 272081, 271536]
51663B71536n23l57J46O92J176J691K014J774J166Q15R24J076Q99M26j67p75j221
51646B81292j374j349j368j417j446j578j812j771j236p30q99j611k150k236k203
51631B58112k245k149j747j203p10l09oK76P37J400J905J949J709J479J199P85
51615B61182N79R49J658K143K225K086J820J513J422J535J308M39m47n79j31K11
51599B77913M44J120K224L087L384L284K748J512j40j447k170k730l344l754l954
51584B78177m340m926n168m807m266l907l525k879k152j573j066n28n3L10P14
51569B40011J202J625J926K265K750L358M022M523M452L702K790K259J975J554
51555B78414J182J349J982K617L249M213N320N954O041O037N833M576J855j636
$$ y = [271536, 271013, 270656, 270802, 271494, 272670, 274361, 276375, 278149, 279315, 280130, 281054, 282130, 283029, 283455, 283288, 282513, 281292, 279918, 278569, 277201, 275784, 274338, 272760, 270948, 269177, 267941, 267211, 266312, 264701, 262551, 260315, 258112, 255867, 253718, 251971, 250768, 250058, 249749, 249743, 250019, 250756, 252156, 254061, 256010, 257719, 259198, 260397, 261182, 261761, 262710, 264368, 266511, 268736, 270822, 272642, 274155, 275577, 277112, 278420, 278859, 278412, 277833, 277702, 277913, 278357, 279477, 281701, 284788, 288172, 291456, 294204, 295716, 295576, 294129, 291959, 289229, 285885, 282131, 278177, 273837, 268911, 263743, 258936, 254670, 250763, 247238, 244359, 242207, 240634, 239568, 239040, 238987, 239297, 240011, 241213, 242838, 244764, 247029, 249779, 253137, 257159, 261682, 266134, 269836, 272626, 274885, 276860, 278414, 279596, 280945, 282927, 285544, 288793, 293006, 298326, 304280, 310321, 316358, 322191, 326767, 328622, 326986]
51541C26986m865p212q378q293p439o595n981n201m110l098k384j686q57j52L13
51526B61048P23J006Q54M55M22P30N75l67j315j511j203j001r62q62q13r32q87
51509B55960l57M01R34J178J254J105P90P66J343K181K796L251L943M961O079
51494B86585P081P631P077M902J411k319n160o515o434n429m054k533q13R95K555
51479B84980L654M315M576M542M612N194O047O384N848M907M218M068M640O197
51465C54182Q718J1767J5073J8771K2720K6064K7865K7979K6922K5177K2908K0108
51453F08254J6652J2328P111J254m884j0899j6245k0431k3452k5668k7178k7680
51441D89162k7026k5459k3223k0410j7363j4671j2531j0591q647o999n885n054
$$ y = [326986, 322121, 314909, 306531, 298238, 290799, 284204, 278223, 273022, 268912, 265814, 263430, 261744, 260887, 260735, 261048, 261771, 262777, 263631, 264086, 264508, 265238, 265813, 265446, 264131, 262620, 261417, 260416, 259454, 258592, 257779, 256847, 255960, 255603, 256004, 256938, 258116, 259370, 260475, 261265, 262031, 263374, 265555, 268351, 271602, 275545, 280506, 286585, 293666, 301297, 308374, 313276, 314687, 312368, 307208, 300693, 294259, 288830, 284776, 282243, 281430, 282425, 284980, 288634, 292949, 297525, 302067, 306679, 311873, 317920, 324304, 330152, 335059, 339277, 343345, 347985, 354182, 362900, 374667, 389740, 408511, 431231, 457295, 485160, 513139, 540061, 565238, 588146, 608254, 624906, 637234, 644345, 645599, 640715, 629816, 613571, 593140, 569688, 544020, 516842, 489162, 462136, 436677, 413454, 393044, 375681, 361010, 348479, 337888, 329241, 322242, 316357, 311303]
51429C11303m241l580l201k845k255j600j120p06j68L95P89J032J158J006N15
51414B96482o5n45j075j777k358k396j860j113n38l25m15n75o64q46j313j898
51398B78719k284k439k453k131j323n61n62j145j458j346j570k421l086k875k219
51383B50846j833j681j393j097j078j095p71l00n6J01N24J080J363J430J651J991
51367B49682K034J626J078P23O49P56Q21O19K49J39N16J120J614J980K265K324
51351B68195K132J995K155K461K681K825K822K344J237j16j195j778j784j192
51337B82782l89j01n95j331j808k205k749k986k379j211k79P3R5J0k02m78o41
51320B65606n78k66K60P15O85J86k33k31o0K7K62Q05J244J194R40R14R32N65k4
$$ y = [311303, 307062, 303482, 300281, 297436, 295181, 293581, 292461, 291755, 291587, 291982, 292771, 293803, 294961, 295967, 296482, 296417, 295872, 294797, 293020, 290662, 288266, 286406, 285293, 284755, 284430, 284015, 283440, 282776, 281930, 280617, 278719, 276435, 273996, 271543, 269412, 268089, 267528, 266966, 265821, 264363, 263017, 261447, 259026, 255940, 253065, 250846, 249013, 247332, 245939, 244842, 243764, 242669, 241898, 241598, 241542, 241643, 242167, 243247, 244610, 246040, 247691, 249682, 251716, 253342, 254420, 255143, 255792, 256548, 257369, 257988, 258237, 258376, 258892, 260012, 261626, 263606, 265871, 268195, 270327, 272322, 274477, 276938, 279619, 282444, 285266, 287610, 288847, 288731, 287536, 285758, 283974, 282782, 282393, 282292, 281697, 280366, 278558, 276353, 273604, 270618, 268239, 267028, 266749, 266822, 266917, 266927, 266725, 266247, 265606, 265028, 264762, 265022, 265737, 266422, 266608, 266375, 266144, 266084, 266111, 266373, 267178, 268422, 269616, 270556, 271470, 272402, 272967, 272943]
51301B72943k97j04K71O53J054J389J620K000K725L604M446N436O718Q018R192
51286C19668J0690J2882J5292J7234J8931K1241K4422K7796L0610L2565L3621
51275E64952L3808L3163L1456K8117K2923J6529R830L071l960j1105j7847k3897
51263F87040k9038l2658l4196l3976l2915l1361k8997k5815k2477j9502j6813
51252C79292j4250j2010j0301r034q096p541p326p140o730o137n547n038m570
51239B75572m052l429k812k349j985j522j011p20n70j51M97O94J25n26n53k08
51223B57000q3JN75J423J895K084K682L721M466M624M716N003M910L941K440R99
51207C00397l23j779l306m547n291n557n450n108m690m324m127m136m112l601
$$ y = [272943, 272646, 272542, 272813, 273466, 274520, 275909, 277529, 279529, 282254, 285858, 290304, 295740, 302458, 310476, 319668, 330358, 343240, 358532, 375766, 394697, 415938, 440360, 468156, 498766, 531331, 564952, 598760, 631923, 663379, 691496, 714419, 730948, 740778, 743849, 739889, 728784, 710937, 687040, 658002, 625344, 591148, 557172, 524257, 492896, 463899, 438084, 415607, 396105, 379292, 365042, 353032, 342731, 333697, 325601, 318060, 310734, 303594, 296864, 290727, 285180, 280142, 275572, 271520, 268091, 265279, 262930, 260945, 259423, 258412, 257692, 257122, 256971, 257468, 258162, 258287, 257761, 257208, 257000, 256917, 256918, 257493, 258916, 260811, 262895, 265577, 269298, 273764, 278388, 283104, 288107, 293017, 296958, 299398, 300397, 300074, 298295, 294989, 290442, 285151, 279594, 274144, 269036, 264346, 260022, 255895, 251759, 247647, 244046]
51193B44046k431j061p9M10O26O29M16L07O72J387K019K445K830L155L180K819
51177B61370K150J196J49m69l53O7J71M3J71N30O87O65R12J433J670J374Q82M76
51159B73124J07j53l5L41M59J71n7J60O14Q76P13P8q46j545j566j147r40j128
51141B69226j281j151r75r49r26q40q48r44q71o03m29m30l52r1J53K86M30N35
51123B59940M32L28P00J555K336K708K914L178L362L377L409L458L205K563J864
51108B95329J254M61n64j307j340r43o38n88o90r19j249j489j537j557j650j622
51092B80951j251o21jM04N11M22M72R16J542J943K096K262K415K245J788J424
51076B97518J157N39m73j252j376j244j438j906k248k382k492k575k420j933j204
$$ y = [244046, 241615, 240554, 240475, 240885, 241511, 242140, 242556, 242863, 243535, 244922, 246941, 249386, 252216, 255371, 258551, 261370, 263520, 264716, 264865, 264396, 264043, 264110, 264281, 264324, 264495, 265025, 265712, 266377, 267289, 268722, 270392, 271766, 272648, 273124, 273231, 273078, 273043, 273384, 273843, 274014, 273957, 274117, 274731, 275607, 276320, 276398, 275552, 274007, 272441, 271294, 270354, 269226, 267945, 266794, 265819, 264870, 263944, 263104, 262256, 261312, 260441, 259838, 259409, 258979, 258627, 258536, 258689, 258975, 259405, 259940, 260372, 260700, 261400, 262955, 265291, 267999, 270913, 274091, 277453, 280830, 284239, 287697, 290902, 293465, 295329, 296583, 297044, 296480, 295173, 293833, 292890, 292252, 291664, 290974, 290055, 288806, 287317, 285780, 284223, 282573, 280951, 279700, 279079, 279078, 279482, 279993, 280415, 280887, 281803, 283345, 285288, 287384, 289646, 292061, 294306, 296094, 297518, 298675, 299214, 298741, 297489, 296113, 294869, 293431, 291525, 289277, 286895, 284403, 281828, 279408, 277475, 276271]
51061B76271m33J24L04K68L81P50J158J448J621J525R41M2o41r26j216j816k482
51044B77319k855k936k857k560k015j479j174j000p79n43m06k96j7N43J315K010
51028B62270K248J950J577J629K006K241K240K288K373K097J410Q31P48R82J172
51013B88062J171R09L36k98n66m72m68p55j031j046r48q85p76o36o78q91j001
50996B80027r83j118j363j268o72k8K68K76J34j98n39m52P0M43L42J67L24O16
50978B76046P07O63O37N20K70J70L52N76P64J222J974K430K234J848J836K030
50962B94279J966J723J768K297L173M228N258O028O630P391Q188Q385P823P170
50948C66307O863O325M913L000J375O5j352k745l627m147m923n993o679o549n778
$$ y = [276271, 275838, 275962, 276266, 276534, 276915, 277665, 278823, 280271, 281892, 283417, 284358, 284400, 283759, 282833, 281617, 279801, 277319, 274464, 271528, 268671, 266111, 264096, 262617, 261443, 260443, 259664, 259121, 258715, 258419, 258402, 258945, 260260, 262270, 264518, 266468, 268045, 269674, 271680, 273921, 276161, 278449, 280822, 282919, 284329, 285160, 285908, 286890, 288062, 289233, 290142, 290478, 290180, 289614, 289142, 288674, 287919, 286888, 285842, 284894, 284009, 283233, 282597, 281919, 281028, 280027, 279044, 277926, 276563, 275295, 274623, 274595, 274863, 275139, 275273, 275075, 274536, 274084, 274154, 274597, 274939, 275106, 275430, 276046, 276753, 277416, 278053, 278573, 278843, 279013, 279365, 279941, 280705, 281927, 283901, 286331, 288565, 290413, 292249, 294279, 296245, 297968, 299736, 302033, 305206, 309434, 314692, 320720, 327350, 334741, 342929, 351314, 359137, 366307, 373170, 379495, 384408, 387408, 388783, 388848, 387496, 384751, 381124, 376977, 372054, 366061, 359382, 352833, 347055]
50933C47055m602l099j560m50J77P03J333J886K258K667L270L909M355M558M542
50918C67002M330L985L591L184K849K771L093L831M997O594Q348R762J0640J1304
50904D46281J2019J2517J2346J1414R934Q078O004L940J994J15j568k734l409
50891E16931m128n178o157o594o631o599o281n172l248r27J475L824N861P330
50877D84506Q299Q979R345R344R309R765J0935J2656J4668J6754J8785K0877K3223
50864F57445K5582K7306K8156K8680K9391K9969K9749K8569K6717K4323K1386
50853I57273J8114J4803J1535Q367N557L206J056r86k458k909k517j710o47L36
50839A009020K54j691n039q390j0691j1798j2124j2359j3234j4862j6527j7636
$$ y = [347055, 342453, 339354, 337794, 337344, 337521, 338224, 339557, 341443, 343701, 346368, 349638, 353547, 357902, 362460, 367002, 371332, 375317, 378908, 382092, 384941, 387712, 390805, 394636, 399633, 406227, 414575, 424337, 434977, 446281, 458300, 470817, 483163, 494577, 504511, 512589, 518593, 522533, 524527, 524642, 523074, 520340, 516931, 512803, 507625, 501468, 494874, 488243, 481644, 475363, 470191, 466943, 466016, 467491, 471315, 477176, 484506, 492805, 501784, 511129, 520473, 529782, 539547, 550482, 563138, 577806, 594560, 613345, 634222, 657445, 683027, 710333, 738489, 767169, 796560, 826529, 856278, 884847, 911564, 935887, 957273, 975387, 990190, 1001725, 1010092, 1015649, 1018855, 1019911, 1018925, 1016467, 1013558, 1011041, 1009331, 1008684, 1009020, 1009274, 1007583, 1002544, 994154, 983463, 971665, 959541, 947182, 933948, 919086, 902559, 884923]
50827H84923j8538j9813k1237k2259k3048k4106k5089k5118k4146k3009k2050
50816F36510k0768j8951j7149j5694j4193j2354j0564r205q094p023o225n855
50804D90435n537m914m187l708l411l029k603k314k079j642r50j55N99J206J576
50789D59287J749J848J915J890J878K094K524K820K725K377K130K182K481K870
50775D90770L254L671M211M883N606O376P254Q142Q822R361J0165J1456J2970
50762E86941J4386J5758J7320J9132K1269K3991K7394L1139L4923L8841M2971
50751H74065M6966N0534N3960N7569O1075O3987O6377O8539P0184P0660O9742
50740A553658O7465O3377N6802M7904L7792K7474J7270P267k262j0981j8503k4262
$$ y = [884923, 866385, 846572, 825335, 803076, 780028, 755922, 730833, 705715, 681569, 658560, 636510, 615742, 596791, 579642, 563948, 549755, 537401, 526837, 517632, 509538, 502515, 496290, 490435, 484898, 479984, 475797, 472089, 468678, 465649, 463046, 460732, 458653, 457011, 456061, 455906, 456505, 457711, 459287, 461036, 462884, 464799, 466689, 468567, 470661, 473185, 476005, 478730, 481107, 483237, 485419, 487900, 490770, 494024, 497695, 501906, 506789, 512395, 518771, 526025, 534167, 542989, 552350, 562515, 573971, 586941, 601327, 617085, 634405, 653537, 674806, 698797, 726191, 757330, 792253, 831094, 874065, 921031, 971565, 1025525, 1083094, 1144169, 1208156, 1274533, 1343072, 1413256, 1483916, 1553658, 1621123, 1684500, 1741302, 1789206, 1826998, 1854472, 1871742, 1879009, 1876747, 1865766, 1847263, 1823001]
50728A823001k7833k9358k9236k7530k4246j9973j5599j1501p707m702l373m063
50716A617880o457j0287j5428k1349k7284l3084l9018m4682m9053n1836n3820
50705A265582n5499n6231n5262n2811m9609m5887m1540l6762l1976k7370k2938
50694G89697j8728j4777j1061p681m807k312Q0K191L473L901M148M580M628L668
50680G57000J960K68j114k372l530m316m635m782n150n916o915p750q186q474
50666F96088r044r907j0604j0860j0813j0604j0096r193q022o686n178l634k326
50653E89121j247j33J053K034K739L470M366N251O116P350R206J1468J3870J6481
50639F71145J9429K2569K5673K8683L1587L4361L7066L9683M1774M2769M2668
$$ y = [1823001, 1795168, 1765810, 1736574, 1709044, 1684798, 1664825, 1649226, 1637725, 1630018, 1625316, 1621943, 1617880, 1611423, 1601136, 1585708, 1564359, 1537075, 1503991, 1464973, 1420291, 1371238, 1319402, 1265582, 1210083, 1153852, 1098590, 1045779, 996170, 950283, 908743, 871981, 840005, 812635, 789697, 770969, 756192, 745131, 737450, 732643, 730331, 730411, 732602, 736075, 739976, 744124, 748704, 753332, 757000, 758960, 759228, 758114, 755742, 752212, 747896, 743261, 738479, 733329, 727413, 720498, 712748, 704562, 696088, 687044, 677137, 666533, 655673, 644860, 634256, 624160, 614967, 606945, 600259, 595081, 591447, 589121, 587874, 587741, 588794, 590828, 593567, 597037, 601403, 606654, 612770, 620120, 629326, 640794, 654664, 671145, 690574, 713143, 738816, 767499, 799086, 833447, 870513, 910196, 951970, 994739, 1037407]
50628A037407M2006M1007L9359L6928L4145L1339K8175K4058J8758J2376N156
50617A350714k444r759j6300k1839k6046k8464k8985k7950k5695k2394j8458j4471
50605A107909j0657o951l715j714j184j563k496m368p551j1669j6124k0651k4995
50592I94271k8570l0977l2368l2849l2056k9849k6899k3986k1149j8042j4683
50581G02843j1340p990m551j245J734M656P817J0966J3678J6000J8222K0245K1700
50568G92735K2424K2380K1362J9318J6697J4056J1526R055O908N427M490L702
50556I50080K845J866O47p71k018k903l731m743n534n577m912l840k247J18K942
50541I22222N570P817R954J2104J4127J5945J7449J8222J7947J6989J5989J5142
$$ y = [1037407, 1079413, 1120420, 1159779, 1196707, 1230852, 1262191, 1290366, 1314424, 1333182, 1345558, 1350714, 1348270, 1338511, 1322211, 1300372, 1274326, 1245862, 1216877, 1188927, 1163232, 1140838, 1122380, 1107909, 1097252, 1090301, 1086586, 1084872, 1083688, 1082125, 1079629, 1075261, 1067710, 1056041, 1039917, 1019266, 994271, 965701, 934724, 902356, 869507, 837451, 807602, 780703, 756717, 735568, 717526, 702843, 691503, 683513, 678962, 677717, 679451, 684107, 691924, 702890, 716568, 732568, 750790, 771035, 792735, 815159, 837539, 858901, 878219, 894916, 908972, 920498, 929553, 936461, 941888, 946378, 950080, 952925, 954791, 955438, 954667, 952649, 949746, 946015, 941272, 935738, 930161, 925249, 921409, 919162, 919280, 922222, 927792, 935609, 945563, 957667, 971794, 987739, 1005188, 1023410, 1041357, 1058346, 1074335, 1089477]
$$ [...]
##END NTUPLES=NMR SPECTRUM
##END=
