##TITLE=AC1564_ROEFFECT0018_8270708_RLHtpewVFm
##JCAMPDX= 6.0         $$ Bruker NMR JCAMP-DX V2.0
##DATA TYPE= NMR SPECTRUM
##DATA CLASS= NTUPLES
##ORIGIN= BRUKER
##OWNER= Administrator
$$ 1.72 TOPSPIN		Version 2.1
$$ 2013-10-12 19:51:50.002 -0700  Administrator@X
$$ Compression mode = diff/dup
##.OBSERVE FREQUENCY= 400.02188249412
##.OBSERVE NUCLEUS= ^1H
##.ACQUISITION MODE= SIMULTANEOUS (DQD)
##.ACQUISITION SCHEME= undefined
##.AVERAGES= 64
##.DIGITISER RES= 22
##SPECTROMETER/DATA SYSTEM= spect
##.PULSE SEQUENCE= noesygpps1d.comp
##.SOLVENT NAME= COFFEE_meoh
##.SHIFT REFERENCE= INTERNAL, COFFEE_meoh, 1, 14.96077
##AUDIT TRAIL= $$ (NUMBER, WHEN, WHO, WHERE, PROCESS, VERSION, WHAT)
$$ ##TITLE= Audit trail, TOPSPIN		Version 2.1
$$ ##JCAMPDX= 5.01
$$ ##ORIGIN= Bruker BioSpin GmbH
$$ ##OWNER= Administrator
$$ $$ E:\/data/COFFEE/nmr/AC1564_ROEFFECT0018_8270708_RLHtpewVFm/12/pdata/1/auditp.txt
$$ ##AUDIT TRAIL=  $$ (NUMBER, WHEN, WHO, WHERE, PROCESS, VERSION, WHAT)
(   1,<2013-10-12 19:51:44.475 -0700>,<Administrator>,<X>,<go>,<TOPSPIN 2.1>,
      <created by zg
	started at 2013-10-12 19:40:15.153 -0700,
	POWCHK enabled, PULCHK disabled,
       configuration hash MD5:
       C8 4E 4E 5D D3 5C D8 9E 9F 52 82 E0 59 8A DE 15
       data hash MD5: 64K
       40 27 CC 81 C0 B3 4E 8F F8 E9 C7 AC 6E 96 4D 35>)
(   2,<2013-10-12 19:51:47.860 -0700>,<Administrator>,<X>,<proc1d>,<TOPSPIN 2.1>,
      <Start of raw data processing
       efp LB = 0.3 FT_mod = 6 PKNL = 1 PHC0 = 0 PHC1 = 0 SI = 128K 
       data hash MD5: 128K
       A1 CA EB 1F 40 87 DE FB DF 21 CD 42 71 EB 8A 24>)
(   3,<2013-10-12 19:51:48.849 -0700>,<Administrator>,<X>,<proc1d>,<TOPSPIN 2.1>,
      <pk PHC0 = -82.94678 PHC1 = 0 
       data hash MD5: 128K
       17 B2 1A 8F C4 46 E3 EF FD C5 F5 D6 D8 D1 DD E8>)
(   4,<2013-10-12 19:51:49.319 -0700>,<Administrator>,<X>,<proc1d>,<TOPSPIN 2.1>,
      <abs ABSG = 1 
       data hash MD5: 128K
       01 43 FF 08 6E 2B 73 E6 C5 4F 0C D9 D3 CD E3 53>)
(   5,<2013-10-12 19:51:49.425 -0700>,<Administrator>,<X>,<proc1d>,<TOPSPIN 2.1>,
      <abs ABSG = 2 
       data hash MD5: 128K
       3B 74 48 99 60 14 57 E5 F1 97 8F E4 EB 2A CC 95>)
(   6,<2013-10-12 19:51:49.516 -0700>,<Administrator>,<X>,<proc1d>,<TOPSPIN 2.1>,
      <abs ABSG = 3 
       data hash MD5: 128K
       26 23 8C F4 24 05 EB E4 1F 09 9B C0 01 10 78 6C>)
(   7,<2013-10-12 19:51:49.623 -0700>,<Administrator>,<X>,<proc1d>,<TOPSPIN 2.1>,
      <abs ABSG = 4 
       data hash MD5: 128K
       D3 DD D9 E8 49 A6 B9 E1 48 13 FF 25 3D 78 0D 03>)
(   8,<2013-10-12 19:51:49.729 -0700>,<Administrator>,<X>,<proc1d>,<TOPSPIN 2.1>,
      <abs ABSG = 5 
       data hash MD5: 128K
       A2 7E 3F 48 2C 55 C5 63 14 8C AC F5 F2 3E 19 F4>)
$$ ##END=
$$ 
$$ $$ hash MD5
$$ $$ EE E1 C4 B0 6F 99 D9 DA F6 6D 30 1C 54 18 0A 86
##$RELAX= 
##$RELAX= 
##$RELAX= 
##$RELAX= 
##$RELAX= 
##$RELAX= 
##$RELAX= 
##$RELAX= 
$$ Bruker specific parameters
$$ --------------------------
##$DU= <E:\>
##$EXPNO= 12
$$ [...]
##$TP07= 0
##$TPNAME0= <>
##$TPNAME1= <>
##$TPNAME2= <>
##$TPNAME3= <>
##$TPNAME4= <>
##$TPNAME5= <>
##$TPNAME6= <>
##$TPNAME7= <>
##$TPOAL= (0..7)
0.5 0.5 0.5 0.5 0.5 0.5 0.5 0.5
##$TPOFFS= (0..7)
0 0 0 0 0 0 0 0
##$TUNHIN= 0
##$TUNHOUT= 0
##$TUNXOUT= 0
##$USERA1= <user>
##$USERA2= <user>
##$USERA3= <user>
##$USERA4= <user>
##$USERA5= <user>
##$V9= 5
##$VALIST= <valist>
##$VCLIST= <CCCCCCCCCCCCCCC>
##$VD= 0
##$VDLIST= <DDDDDDDDDDDDDDD>
##$VPLIST= <PPPPPPPPPPPPPPP>
##$VTLIST= <TTTTTTTTTTTTTTT>
##$WBST= 1024
##$WBSW= 4
##$XGAIN= (0..3)
0 0 0 0
##$XL= 0
##$YL= 0
##$YMAX_a= 5799207
##$YMIN_a= -12115728
##$ZGOPTNS= <>
##$ZL1= 120
##$ZL2= 120
##$ZL3= 120
##$ZL4= 120
##$ABSF1= 14.96077
##$ABSF2= -5.597412
##$ABSG= 5
##$ABSL= 3
##$ALPHA= 0
##$AQORDER= 0
##$ASSFAC= 0
##$ASSFACI= 0
##$ASSFACX= 0
##$ASSWID= 0
##$AUNMP= <proc_prof1d_extract.lims>
##$AXLEFT= 0
##$AXNAME= <>
##$AXNUC= <1H>
##$AXRIGHT= 0
##$AXTYPE= 0
##$AXUNIT= <>
##$AZFE= 0.1
##$AZFW= 0.1
##$BCFW= 0
##$BC_mod= 0
##$BYTORDP= 0
##$COROFFS= 0
##$CY= 15
##$DATMOD= 1
##$DC= 0
##$DFILT= <>
##$DTYPP= 0
##$F1P= 0
##$F2P= 0
##$FCOR= 0.5
##$FTSIZE= 131072
##$FT_mod= 6
##$GAMMA= 0
##$GB= 0
##$INTBC= 1
##$INTSCL= 1
##$ISEN= 128
##$LB= 0.3
##$LEV0= 0
##$LPBIN= 0
##$MAXI= 10000
##$MC2= 0
##$MEAN= 0
##$ME_mod= 0
##$MI= 0
##$NCOEF= 0
##$NC_proc= -2
##$NLEV= 6
##$NOISF1= 0
##$NOISF2= 0
##$NSP= 0
##$NTH_PI= 0
##$NZP= 0
##$OFFSET= 14.96077
##$PC= 1
##$PHC0= -82.94678
##$PHC1= 0
##$PH_mod= 1
##$PKNL= yes
##$PPARMOD= 0
##$PPDIAG= 0
##$PPIPTYP= 0
##$PPMPNUM= 2147483647
##$PPRESOL= 1
##$PSCAL= 4
##$PSIGN= 0
##$PYNMP= <proc.py>
##$REVERSE= no
##$SF= 400.020009728886
##$SI= 131072
##$SIGF1= 0
##$SIGF2= 0
##$SINO= 400
##$SIOLD= 131072
##$SPECTYP= <>
##$SREGLST= <1H.CDCl3>
##$SSB= 0
##$STSI= 131072
##$STSR= 0
##$SW_p= 8223.68421052631
##$SYMM= 0
##$S_DEV= 0
##$TDeff= 65536
##$TDoff= 0
##$TI= <>
##$TILT= no
##$TM1= 0
##$TM2= 0
##$TOPLEV= 0
##$USERP1= <user>
##$USERP2= <user>
##$USERP3= <user>
##$USERP4= <user>
##$USERP5= <user>
##$WDW= 1
##$XDIM= 131072
##$YMAX_p= 389154930
##$YMIN_p= -11893
##$CURPLOT= <Network HP LaserJet P1505>
##$CURPRIN= <$Network HP LaserJet P1505>
##$DFORMAT= <normdp>
##$LAYOUT= <+/1D_H.xwp>
##$LFORMAT= <normlp>
##$PFORMAT= <normpl>
##$SURQMSG= 1
$$ End of Bruker specific parameters
$$ ---------------------------------
##NTUPLES= NMR SPECTRUM
##VAR_NAME=  FREQUENCY,     SPECTRUM/REAL,   SPECTRUM/IMAG
##SYMBOL=    X,             R,               I
##VAR_TYPE=  INDEPENDENT,   DEPENDENT,       DEPENDENT
##VAR_FORM=  AFFN,          ASDF,            ASDF
##VAR_DIM=   131072,        131072,          131072
##UNITS=     HZ,            ARBITRARY UNITS, ARBITRARY UNITS
##FACTOR=    0.0627417313425164, 1,          1
##FIRST=     8223.62146879497, 446,          -59168
##LAST=      0,             1974,            -59779
##MIN=       0,             -11893,          0
##MAX=       8223.62146879497, 389154930,    0
$$ Real data points
##PAGE= N=1
##DATA TABLE= (X++(R..R)), XYDATA
$$ [...]
61617D18837j026l61j55o87j577k090j969j680j764k210k697l111l608m286m996
61602C86620n443n375m794m053l521l236k996k782k747k788k556j970j444j378
61588C41537j749k278k759l019k874k378j861j581j489j517j808k431l038l091
61574C09664k393j288l46R2J30R5L6l64j250k091k151j407o06l37m75n91n82o28
61556B95508p85q25m23M26J174J125L56r9M71J347J285L37j73M27J218J153N22
61539C03044L77J045J932K441K460K202J986K085K407K519K195J665J233R39P34
61524C29264M92j79j584l189l923l514k772k274j614n43J66j53q41q29k86k03
61508C08018p40j081p88k91J1J38K4n60j389j805j603j277j292j603j949k078
$$ plain form
61617 418837 417811 417450 417295 416608 415031 412941 410972 409292 407528 405318 402621 399510 395902 391616 386620
61602 386620 381177 375802 371008 366955 363434 360198 357202 354420 351673 348885 346329 344359 342915 341537
61588 341537 339788 337510 334751 331732 328858 326480 324619 323038 321549 320032 318224 315793 312755 309664
61574 309664 307271 305983 305637 305729 305859 305954 305990 305626 304376 302285 300134 298727 298121 297784 297309 296718 296136 295508
61556 295508 294723 293898 293475 293901 295075 296200 296556 296457 296928 298275 299560 299897 299724 300151 301369 302522 303044
61539 303044 303421 304466 306398 308839 311299 313501 315487 317572 319979 322498 324693 326358 327591 328530 329264
61524 329264 329756 329577 327993 324804 320881 317367 314595 312321 310707 310164 310330 310177 309336 308507 308221 308018
61508 308018 307278 306197 305409 305118 305129 305267 305291 304731 303342 301537 299934 298657 297365 295762 293813 291735
61492B91735j691p15L31P60N31J53j44n21q90q82n08k18j52P9O56J220J475J626
61474B92845J919K201K209J953J617J300J024P70M65J43M1K27L57J64jK93P21
61457C08248N73q4l70J87J044J439J199O04N3RO81J522J625Q72J31J26N81Q06
61439C19246O03K67J51M74J252K140K637K638K446K265K087K031K245K350J736
61424C44568N09m28n01mO69J559K600L268L254K959K848K897K966L110L096K358
61408C75728R59j24k77k18r18k157k963l023k884k997l369l830l973l239j740
61393C44975o33q18j642j832j324j147j582j753j113k01M21R12J398J431Q30K85
61377C38207M11Q17P93M47M30Q98J419J767K085K379K396K099J759J563J467J491
$$ plain form
61492 291735 290044 289329 289660 290420 290951 291104 290960 290439 289549 288667 288159 287941 287789 287868 288524 289744 291219 292845
61474 292845 294764 296965 299174 301127 302744 304044 305068 305838 306303 306446 306487 306714 307071 307235 307234 307527 308248
61457 308248 308821 308737 308367 308554 309598 311037 312236 312840 312893 312902 313583 315105 316730 317602 317733 317859 318440 319246
61439 319246 319849 320116 320267 320741 321993 324133 326770 329408 331854 334119 336206 338237 340482 342832 344568
61424 344568 345077 344649 344148 344144 344813 346372 348972 352240 355494 358453 361301 364198 367164 370274 373370 375728
61408 375728 376687 376563 376286 376068 375150 372993 370030 367007 364123 361126 357757 353927 349954 346715 344975
61393 344975 344342 343524 341882 340050 338726 337579 335997 334244 333131 332930 333351 334263 335661 337092 337922 338207
61377 338207 338618 339435 340228 340675 341105 342003 343422 345189 347274 349653 352049 354148 355907 357470 358937 360428
61361C60428J701J891J721J305J219J721K304K405K233K486L414M595N628O508
61347C99559P266P714P807P944Q533R438J0191J0468J0127R080P545O282N943
61334E07897O246O270N562M436L196J777L07o91j112j657k870m202m712m326l764
61319E12357l397k915k140j455j166r82m64L48J072J561K057K889M206N892P636
61304E25499R095J0184J1118J2095J2941J3238J2750J1619J0086Q242O109L818
61292F46794J488j000l742o321p999q554q635q968r530r824r627r043q047o633
61278E50359n197m243l678l031k268j730j242j15J731L454M416M911N338N404
61264E54109M764L868L410L373L317L314L907N269P091R118J1224J2991J3809
$$ plain form
61361 360428 362129 364020 365741 367046 368265 369986 372290 374695 376928 379414 382828 387423 393051 399559
61347 399559 406825 414539 422346 430290 438823 448261 458452 468920 479047 488127 495672 501954 507897
61334 507897 514143 520413 525975 530411 533607 535384 535691 535000 533888 532231 529361 525159 520447 516121 512357
61319 512357 508960 506045 503905 502450 501284 500302 499838 500186 501258 502819 504876 507765 511971 517863 525499
61304 525499 534594 544778 555896 567991 580932 594170 606920 618539 628625 636867 642976 646794
61292 646794 648282 647282 643540 637219 629220 620666 612031 603063 593533 583709 574082 565039 556992 550359
61278 550359 545162 540919 537241 534210 531942 530212 528970 528855 530586 534040 538456 543367 548705 554109
61264 554109 558873 562741 566151 569524 572841 576155 580062 585331 592422 601540 612764 625755 639564
61251F39564J3446J2201J0577R043P920P078N920M060J771m86k643m678o146o724
61237F90903o811o917o830o167n477n623o216n809l946j917r81p92j86J187K784
61222F37202M165N320O214O755P063P307P368P122O861O966P213O925N945M963
61208G27389M681M930M915M142K868J664Q75N57P21J329K211L180M279N703P517
61193G76961R689J2344J5528J8713K0993K2046K2437K2750K2775K1974K0294J8057
61181A004561J5443J2634J0165Q525P537O748O117N750N170L712J510o72k538
61168A084662m420o391q136r820j2067j4805j7046j8319j9334k0743k2049k2536
61156I08996k2525k2774k3146k2827k1638k0116j8484j6370j3708j1073q901o941
$$ plain form
61251 639564 653010 665211 675788 684831 692751 699829 705749 709809 711580 711094 708451 703773 697627 690903
61237 690903 684092 677175 670345 664178 658701 653078 646862 641053 637107 635190 634209 633417 633231 634418 637202
61222 637202 641367 646687 652901 659656 666719 674026 681394 688516 695377 702343 709556 716481 722426 727389
61208 727389 732070 737000 741915 746057 748925 750589 751464 752021 752742 754071 756282 759462 763741 769444 776961
61193 776961 786650 798994 814522 833235 854228 876274 898711 921461 944236 966210 986504 1004561
61181 1004561 1020004 1032638 1042803 1051328 1058865 1065613 1071730 1077480 1082650 1086362 1087872 1087200 1084662
61168 1084662 1080242 1073851 1065715 1055895 1043828 1029023 1011977 993658 974324 953581 931532 908996
61156 908996 886471 863697 840551 817724 796086 775970 757486 741116 727408 716335 707434 700493
61144G00493m848k847j483r84j134j672k510l617m805n731o156o137n834n129
61130F47606l746j818k5J168K179L813O242Q841J1084J3111J5349J7899K0608
61117G42311K3488K6686K9996L2765L4433L5171L5733L6733L8105L9339L9961
61106A114721L9766L8744L7068L5071L3037L0978K8695K5893K2211J7387J1680
61095A435251N916P19m159r387j5087k0734k5914l0564l4489l7271l8929m0076
61083A185276m1094m1544m0795l8910l6605l4551l2973l1699l0302k8342k5756
61072H02705k2922k0267j8036j6365j5221j4148j2553j0422q333o539m602k264
61060F51033k06O92N19K21N54J556K951M419N610O368P047Q237J0059J1975J3339
$$ plain form
61144 700493 695645 692798 691315 690331 689197 687525 685015 681398 676593 670862 664706 658569 652735 647606
61130 647606 643860 642042 642017 643185 645364 649177 655419 664260 675344 688455 703804 721703 742311
61117 742311 765799 792485 822481 855246 889679 924850 960583 997316 1035421 1074760 1114721
61106 1114721 1154487 1193231 1230299 1265370 1298407 1329385 1358080 1383973 1406184 1423571 1435251
61095 1435251 1441167 1441886 1437727 1428340 1413253 1392519 1366605 1336041 1301552 1264281 1225352 1185276
61083 1185276 1144182 1102638 1061843 1022933 986328 951777 918804 887105 856803 828461 802705
61072 802705 779783 759516 741480 725115 709894 695746 683193 672771 664438 657899 653297 651033
61060 651033 650827 651519 652038 652259 652813 654369 657320 661739 667349 673717 680764 689001 699060 711035 724374
61045G24374J3995J4387J5164J6635J8524K0363K2168K4377K7051K9523L1112
61034I57673L1882L2417L3174L4277L5592L6696L7160L7182L7579L8711L9904
61023A352247M0317L9914L9113L8047L6853L6168L6512L7618L9254M2204M7304
61012A785551N3806O0092O6019P3253Q3021R5017J09114J26899J50757J82576
61002B786105K24389K79369L51302M44812N68604P37230R63295J240551J531915
60993I127572J778268J926813J956495J876847J702941J437386J084978O85458
60985B1576758L20540P3820k4114j2107L6433N9073J7145j20082l80698p65577
60975B0781191j220418j643506j933068k037736j971824j791274j557112j313292
$$ plain form
61045 724374 738369 752756 767920 784555 803079 823442 845610 869987 897038 926561 957673
61034 957673 989555 1021972 1055146 1089423 1125015 1161711 1198871 1236053 1273632 1312343 1352247
61023 1352247 1392564 1432478 1471591 1509638 1546491 1582659 1619171 1656789 1696043 1738247 1785551
61012 1785551 1839357 1899449 1965468 2038721 2121742 2216759 2325873 2452772 2603529 2786105
61002 2786105 3010494 3289863 3641165 4085977 4654581 5391811 6355106 7595657 9127572
60993 9127572 10905840 12832653 14789148 16665995 18368936 19806322 20891300 21576758
60985 21576758 21897298 21971118 21947004 21934897 21971330 22030403 22047548 21927466 21546768 20781191
60975 20781191 19560773 17917267 15984199 13946463 11974639 10183365 8626253 7312961
60967G312961j084562q83180p14051n76716m67132l80096l11003k56267k13141
60958B426813j79527j53696j33943j18475j05639r4180q3426p3314o4158n6127
60948A364328m8973m2426l6750l2595l0251k9301k9108k9344k9810l0099k9843
60937I95828k9225k8746k8472k7892k6710k5414k4642k4227k3303k1404j9089
60926G16704j7291j6306j5625j4640j3212j1551r910q570p840p686p467o557n231
60913E74818m426m399m186k881j018J06J92J73O69J184J117P26M90L15M4J54J047
60896E64125K043K056J091J26m59j276k601l639l736l473l960n357o796p433p146
60881E23565o291n346m674m302l919l332k747k424k253k019j834j897j991j643
$$ plain form
60967 7312961 6228399 5345219 4631168 4054452 3587320 3207224 2896221 2639954 2426813
60958 2426813 2247286 2093590 1959647 1841172 1735533 1641353 1557927 1484613 1420455 1364328
60948 1364328 1315355 1272929 1236179 1203584 1173333 1144032 1114924 1085580 1055770 1025671 995828
60937 995828 966603 937857 909385 881493 854783 829369 804727 780500 757197 735793 716704
60926 716704 699413 683107 667482 652842 639630 628079 618169 609599 601759 594073 586606 580049 574818
60913 574818 570392 565993 561807 558926 557908 558014 558206 558379 559048 560232 561349 562075 562565 562880 562924 563078 564125
60896 564125 566168 568224 569315 569441 568982 567706 565105 561466 557730 554257 550297 544940 538144 530711 523565
60881 523565 517274 511928 507254 502952 499033 495701 492954 490530 488277 486258 484424 482527 480536 478893
60867D78893q03R1P73J445K259K897L010K897L327M627O202P115P032O463O087
60852E32315O029N939N589N198N077N239N386N217M685M070L766L835L766K922
60838E99033J291m75j830k817l634m109m034l704l650l839l657k721j388k90L17
60823E64493N40M61O4n28r66r31l71M86J323J849J854J286L97k94l79R5Q38J766
60805E71983K931M020M391L980L691M351N596O401O588O998Q056R023R090Q635
60791F55734Q628R271R866R937R731R572R391R116R027R339R823J0130J0270J0394
60777G90229J0377R976R273Q555P872P046O151N491N128M836M633M852N417N553
60763H85389M710L399K520K058J149n96k569m145n442o687p520p604p492q022
$$ plain form
60867 478893 478090 478181 478954 480399 482658 485555 488565 491462 494789 499416 505618 512733 519765 526228 532315
60852 532315 538344 544283 549872 555070 560147 565386 570772 575989 580674 584744 588510 592345 596111 599033
60838 599033 600324 599849 598019 595202 591568 587459 583425 579721 576071 572232 568575 565854 564466 564176 564493
60823 564493 565033 565494 565558 565030 564064 563133 562762 563248 564571 566420 568274 569560 569957 569663 569284 569379 570217 571983
60805 571983 574914 578934 583325 587305 590996 595347 600943 607344 613932 620930 628986 638009 647099 655734
60791 655734 664362 673633 683499 693436 703167 712739 722130 731246 740273 749612 759435 769565 779835 790229
60777 790229 800606 810582 819855 828410 836282 843328 849479 854970 860098 864934 869567 874419 879836 885389
60763 885389 890099 893498 896018 898076 899225 898629 896060 891915 886473 879786 872266 864662 857170 849148
60749H49148r080r711r468q882q453p994p354p060p672q898r989j0747j1520j2392
60735G19928j2985j3077j2849j2451j1790j0824r723q640p705p258p596q309q421
60722E88300p539o432n982o007n636m632l671l310l309l148k750k456k541k999
60708E27888l592l903l597k841k334k609l401l882l534k680k133k374l119l634
60694D84255l518l104l010l380l781l789l481l231l245l456l685l695l268k388
60680D37224j381o64l97m35n28m82k75r9j67l46j42O64J590J957J683J198O91
60663D40091j1p47q49r4O36K70j019j917j547m33L69O10Q88J642K636L481M132
60646D48138M679M938M694M124L658L388K921J909M84r32k010k589k586k101j537
$$ plain form
60749 849148 840068 830357 820889 812007 803554 795560 788206 781146 773474 764576 754587 743840 732320 719928
60735 719928 706943 693866 681017 668566 656776 645952 636229 627589 619884 612626 605030 596721 588300
60722 588300 580761 574329 568347 562340 556704 552072 548401 545091 541782 538634 535884 533428 530887 527888
60708 527888 524296 520393 516796 513955 511621 509012 505611 501729 498195 495515 493382 491008 487889 484255
60694 484255 480737 477633 474623 471243 467462 463673 460192 456961 453716 450260 446575 442880 439612 437224
60680 437224 435843 435179 434782 434347 433819 433337 433062 432963 432796 432450 432308 432972 434562 436519 438202 439400 440091
60663 440091 440080 439333 438484 438390 439026 439296 438277 436360 434813 434380 434749 435359 436247 437889 440525 444006 448138
60646 448138 452817 457755 462449 466573 470231 473619 476540 478449 478933 478001 475991 473402 470816 468715 467178
60631D67178j326j473j579j326q28m33l15l53l49k71k95n82j070j475j582j430
60615D52491j168q51n36n01j032j938k592k682k612k875l185k776j510j94M39
60600D28478N33N36K87o63k042k903k795k195j588q01L00J108R59J82k84j34J10
60583D19088R1M2J47J37j91n97p87p27m16K02Q83J231J413K154L649N103N859
60566D37281O378P460Q959J0094J0637J0954J1047J0408Q862O804M515J964o65
60553E34698k905m660o249p623q125p384n858m240k718j203K10J365K326L224
60539D90858M101N113O485Q036R163R574R558R244Q130N916L298J343K58n95j648
60524E68834k652l244l387l225k938k754k768k689k196j574j509k141k648k069
$$ plain form
60631 467178 465852 464379 462800 461474 460646 460213 459898 459545 459196 458925 458630 458048 456978 455503 453921 452491
60615 452491 451323 450472 449936 449435 448403 446465 443873 441191 438579 435704 432519 429743 428233 428039 428478
60600 428478 429011 429547 429834 429171 427129 424226 421431 419236 417648 416847 417147 418255 419214 419396 419112 418978 419088
60583 419088 419179 419221 419368 419505 419314 418717 417930 417203 416787 416989 417872 419103 420516 422670 426319 431422 437281
60566 437281 443659 451119 460078 470172 480809 491763 502810 513218 522080 528884 533399 535363 534698
60553 534698 531793 527133 520884 513261 505136 497752 491894 487654 484936 483733 483943 485308 487634 490858
60539 490858 494959 500072 506557 514593 523756 533330 542888 552132 560262 566178 569476 570819 571077 570482 568834
60524 568834 566182 562938 559551 556326 553388 550634 547866 545177 542981 541407 539898 537757 535109 533040
60510E33040l98J345K078J616P33L05M88Q27J108J706K990M891P330J0677J5198
60495E83934K0350K5205K9480L3555L7460M0489M1879M1356L8847L4220K7503
60484I54278J8933Q639l123j5188k5619l3193l8339m2059m4314m4179m1402l7035
60472F57399l2368k7908k3640j9795j6843j4905j3556j2225j0637q902p401o549
60460D62670o476o798o791n998m719l701l332l267k985k505k211k118j734q69
60446D09166q3j6n31r58j027j057j215j151o68k95p03j722k444k359j885j627
60430C91425j523j182p62q75j543j885j180J44J052J148Q98P41N91L53L70R37
60414C88709J693J933J513J116J476K457L035K304N19j018j272m74M12R28J290
$$ plain form
60510 533040 532642 533987 536065 537681 538414 538719 539207 540034 541142 542848 545838 550729 558059 568736 583934
60495 583934 604284 629489 658969 692524 729984 770473 812352 853708 892555 926775 954278
60484 954278 973211 981850 978727 963539 937920 904727 866388 824329 780015 735836 694434 657399
60472 657399 625031 597123 573483 553688 536845 521940 508384 496159 485522 476620 469219 462670
60460 462670 456194 449396 442605 436607 431888 428187 424855 421588 418603 416098 413887 411769 410035 409166
60446 409166 409083 409067 408536 407578 406551 405494 404279 403128 402460 402165 401462 399740 397296 394937 393052 391425
60430 391425 389902 388720 387958 387083 385540 383655 382475 382619 383671 384819 385717 386458 387049 387402 387772 388709
60414 388709 390402 392335 393848 394964 396440 398897 401932 404236 404755 403737 402465 401991 402403 403331 404621
60399D04621J494J120K67j40L98J034O98k58m64N56J809K320K286K438K890L148
60383D24217K844K020J034M66P60J646K199J883J169Q17R15J062J157J345J460
60368D44994J159N98L56O09R18R20P44O21N76O71J051J560J730J497J380J674
60352D61058J935J759J576K036K901L386L501M133N615P100P774P970Q409Q858
60338E28011Q376O720M643K747Q27j395l625n482p023q298q827q229p040o192
60324D95213n767n034l736k575k156k206k189k116k145j956j192k23K65L39O86
60309D65208J516K335L000M191O431R227J1715J3852J6272J9059K1285K1842K0448
60296F16381J7589J3867R643N171P63l307o816r482j1017j1368j0831r727q132
$$ plain form
60399 404621 406115 407235 407502 407362 407760 408794 409492 409234 408770 409326 411135 413455 415741 418179 421069 424217
60383 424217 427061 429081 430115 430581 431341 432987 435186 437069 438238 439055 439970 441032 442189 443534 444994
60368 444994 446153 446751 447107 447716 448634 449554 450298 450919 451495 452166 453217 454777 456507 458004 459384 461058
60352 461058 462993 464752 466328 468364 471265 474651 478152 482285 487900 495000 502774 510744 519153 528011
60338 528011 536387 543107 547750 550497 551324 549929 546304 540822 533799 525501 516674 508445 501405 495213
60324 495213 489446 484412 480676 478101 475945 473739 471550 469434 467289 465333 464141 463918 464183 464522 465208
60309 465208 466724 469059 472059 476250 482681 491908 503623 517475 533747 552806 574091 595933 616381
60296 616381 633970 647837 657480 662651 663414 660107 653291 643809 632792 621424 610593 600866 592734
60283E92734o214m647m218m901n750n936n599n440n827o626p569q322q474p922
60269E05289p107o510o040n414m782m439m109l298k250j773k045k352k152j635
60255D51383j053k59O63J149J040J008J548K115J974J423J390K111K895L070K562
60240D73019J687Q87N24M74Q1r87k040k087j136j92M0r6J35R13J802K370K703
60223D78097L219L950M188L287J793J109J782K852L351L659M575N763O170N751
60209E29546N587O284P199P493P189O900P090P753Q430Q499P871P298P424P717
60195F32280P073N349L553K480K035J899J976J933J167l49j826k632k965l307
60181F48666l772m284m881n524o001o238o291o109n714n563n954o169n147l115
$$ plain form
60283 592734 586520 581873 577655 572754 567004 561068 555469 550029 544202 537576 530007 521685 513211 505289
60269 505289 498182 491672 485632 480218 475436 470997 466888 463590 461340 459567 457522 455170 453018 451383
60255 451383 450330 450071 450734 451883 452923 453931 455479 457594 459568 460991 462381 464492 467387 470457 473019
60240 473019 474706 475593 476117 476591 476672 475685 473645 471558 470422 470230 470270 470174 470309 471222 473024 475394 478097
60223 478097 481316 485266 489454 492741 494534 495643 497425 500277 503628 507287 511862 517625 523795 529546
60209 529546 535133 541417 548616 556109 563298 570198 577288 585041 593471 601970 609841 617139 624563 632280
60195 632280 639353 644702 648255 650735 652770 654669 656645 658578 659745 659396 657570 654938 651973 648666
60181 648666 644894 640610 635729 630205 624204 617966 611675 605566 599852 594289 588335 582166 577019 573904
60167E73904j597j505k150k451k158j440k64J146K081K226K125K264K380K238
60153E76799K270K750L083K639J634N91l79j072q47L76J564J909K022K815L991
60138F00145M790N494O868Q581R581R748R812R808R055P586O201M974L061L84
60124F96088j804k535k248j795j271m74L11P57J140J911K898L477L329K714K162
60109G04660K042K243K225J595O11j76o55j139j882k946m417o069p131p049o361
60094F75551o087o354o389n766m801l689k254o52N78J412K401L603M361M498M736
60079F61148N501O125N868M974M069L118J692j89k094l763n127o119o897p920
60065F60386r391j0868j1742j1827j1216j0012q482p084o075n395n086n283n614
$$ plain form
60167 573904 572307 570802 568652 566201 564043 562603 562339 563485 565566 567792 569917 572181 574561 576799
60153 576799 579069 581819 584902 587541 589175 589766 589387 588315 587468 587844 589408 591317 593339 596154 600145
60138 600145 604935 610429 617297 625878 635459 645207 655019 664827 673882 681468 687669 692643 695704 696088
60124 696088 694284 691749 689501 687706 686435 685961 686272 687029 688169 690080 692978 696455 699784 702498 704660
60109 704660 706702 708945 711170 712765 713376 713200 712545 711406 709524 706578 702161 696092 688961 681912 675551
60094 675551 669464 663110 656721 650955 646154 642465 640211 639559 640137 641549 643950 647553 651914 656412 661148
60079 661148 666649 672774 678642 683616 687685 690803 692495 692306 690212 686449 681322 675203 668306 660386
60065 660386 650995 640127 628385 616558 605342 595330 586848 579764 573689 568294 563208 557925 552311
60052E52311n246l912k323j208n40k7K76M12R38K184L647M651N265N943O718P339
60036E76428P869Q390Q544P937O799N653M626L562K511J409k49k727n269o811
60022F18672p352p954r399j1439j3234j3947j3167j1377r856r415r343q323o233
60009D87633m214k997k184j420j188j896k781k536p84J576L340M008L920L751
59995D84228L828L892L575L005K701K861L149L221L190L344L737M236M722N041
59981E34730M902M111K863J633O80k51j600l308m625m863m321m087m779n815o211
59966E09059n726m839l906k931k044j621j694j717j137k9J016J523J536J475J635
59951D90600J890J915J715J657J969K417K662K683K600K376J939J428J016O55
$$ plain form
60052 552311 547065 543153 540830 539622 539082 539055 539331 539743 540681 542865 546512 551163 556428 562371 569089 576428
60036 576428 584297 592687 601231 609168 615967 621620 626246 629808 632319 633728 633479 630752 625483 618672
60022 618672 611320 603366 593967 582528 569294 555347 542180 530803 520947 511532 502189 493866 487633
60009 487633 483419 480422 478238 476818 475630 473734 470953 468417 467633 469209 472549 476557 480477 484228
59995 484228 488056 491948 495523 498528 501229 504090 507239 510460 513650 516994 520731 524967 529689 534730
59981 534730 539632 543743 546606 548239 548919 548668 547068 543760 539135 534272 529951 525864 521085 515270 509059
59966 509059 503333 498494 494588 491657 489613 487992 486298 484581 483444 483415 484431 485954 487490 488965 490600
59951 490600 492490 494405 496120 497777 499746 502163 504825 507508 510108 512484 514423 515851 516867 517522
59937E17522J45o91k069m029n960o841o366n407m823m322l240j917j345j601j708
59922D67348j159n14k32J52J090K057K191J514Q73Q77J396J959K233K210K222
59907D84217K664L524M322M651M566M336M060L756L540L447L291K935K592K577
59893E34478K914L379L892M546N330N976O149N779N180M811M763M654M182L710
59879E99743L914M778N444N275M675M477M735M602L340J050j653m339o907r223
59865F19911j0869j1428j0939r987r213q722q090o939n388l945k972k346j623
59852E27450n01R03K230L327M328N398O574P889R372J0727J1323J0753R266P429
59838F16468N559L743K168J055M22K33O89J889L323M136L845K511M04k051m160
$$ plain form
59937 517522 517667 516976 514907 510878 504918 498077 491711 486304 481481 477159 473919 472002 470657 469056 467348
59922 467348 466189 465675 465443 465595 466685 468742 470933 472447 473320 474197 475593 477552 479785 481995 484217
59907 484217 486881 490405 494727 499378 503944 508280 512340 516096 519636 523083 526374 529309 531901 534478
59893 534478 537392 540771 544663 549209 554539 560515 566664 572443 577623 582434 587197 591851 596033 599743
59879 599743 603657 608435 613879 619154 623829 628306 633041 637643 640983 642033 640380 636041 629134 619911
59865 619911 609042 597614 586675 576688 567475 558753 550663 543724 538336 534391 531419 529073 527450
59852 527450 526949 527852 530082 533409 537737 543135 549709 557598 566970 577697 589020 599773 609039 616468
59838 616468 622027 625770 627938 628993 629415 629648 630337 632226 635549 639685 643530 646041 646445 644394 640234
59823F40234n506o543q030r804j0855j0758j0258j0123j0167r865r267q679p932
59810E22447o653m952l323k037j150p62q15q49m88J5K11J48J25J9m94j209j610
59793D98623j701j902k186k129j905k254l193l634k892j764j394j620j411o24
59779D70014k74r66j968k246j772j304j258j304r69k34N22Q96Q26O28P43J305
59763D62639K019K522K722K747K711K673K731K945L252L578L963M451M901N119
59749E08973N033M638L971L350L393M319N379N492M514L364K802K605K175J449
59735E61457P82L25k2k37k35j19o3k9J18L83P42J185J485J241O00M57J405K732
59717E72207L123K254J029L95M98J048J684J946J527Q40O81J156J501J187N53
$$ plain form
59823 640234 634728 628185 620155 610351 599496 588738 578480 568357 558190 548325 539058 530379 522447
59810 522447 515794 510842 507519 505482 504332 503570 502755 501906 501418 501433 501644 501792 501917 501936 501442 500233 498623
59793 498623 496922 495020 492834 490705 488800 486546 483353 479719 476827 475063 473669 472049 470638 470014
59779 470014 469740 468774 466806 464560 462788 461484 460226 458922 457953 457719 458241 459137 459963 460591 461334 462639
59763 462639 464658 467180 469902 472649 475360 478033 480764 483709 486961 490539 494502 498953 503854 508973
59749 508973 514006 518644 522615 525965 529358 533677 539056 544548 549062 552426 555228 557833 560008 561457
59735 561457 562239 562564 562542 562305 562070 561951 561888 561859 561977 562360 563102 564287 565772 567013 567613 568070 569475 572207
59717 572207 575330 577584 578613 579008 579506 580554 582238 584184 585711 586551 587232 588388 589889 591076 591629
59702E91629P1l66r27j281j170j061j535k250k289j436m74j30k63k46K19Q42J119
59685E80452P79K8n68n57J8P50J303J587J617J383Q70R0q95j943k890l704m536
59668E73784n465o231o349n621m529m025m648n821o306n522m121k976k039p17
59654E09414R05K053K452K711L308L946M260M482M915N233M876L726J990j60k359
59639E51752l929m507m423m027l137j728n93m39p22l67O15J171Q95N44P70J203
59623E33078J168N25n35j796k736k614j364J09R17R84N73k98j383j786q12J012
59607E25042K500L192L578M082M513M552M191L557K751J971J420R37Q7j305k891
59592E58177m095m491l969k898k025j815j917j752j472j726k436k647k005j491
$$ plain form
59702 591629 591700 591334 590407 589126 587956 586895 585360 583110 580821 579385 578911 578781 578518 578272 578491 579333 580452
59685 580452 581231 581259 580691 580134 580152 580902 582205 583792 585409 586792 587662 587752 586857 584914 582024 578320 573784
59668 573784 568319 562088 555739 550118 545589 541564 536916 531095 524789 519267 515146 512170 510131 509414
59654 509414 510319 512372 514824 517535 520843 524789 529049 533531 538446 543679 548555 552281 554271 554111 551752
59639 551752 547823 543316 538893 534866 531729 530001 529408 528969 528247 527880 528495 529666 530561 531105 531875 533078
59623 533078 534246 534771 534236 532440 529704 527090 525726 525835 526752 527736 528309 528011 526628 524842 524030 525042
59607 525042 527542 530734 534312 538394 542907 547459 551650 555207 557958 559929 561349 562286 562373 561068 558177
59592 558177 554082 549591 545622 542724 540699 538884 536967 535215 533743 532017 529581 526934 524929 523438
59578E23438k055l150l476k821k104j830j522q46k56n2K47R72J460R94J12OQ70
59561E09987J743J994K010K221K356K109J830J872J817J106J39j6R12J963K136
59546E34179J502Q26N25M59M85P82J591L033N255Q410J2223J5777J8057J8769
59532F21873J8382J7338J5413J2060P268J911k670n295n376l147L77L892O533
59519F88559Q189R111R312Q437O151K616j395m912p357q900j0098j1303j2397
59506F76013j3155j3563j3752j3664j3108j2041j0669r220p785o486n589n266
59494E51715n238m921l988k671j421m72J79N91R05J361K014K620L138M041N639
59479E53492P254P911P790Q163R559J0935J1200J0704J0366J0124R311Q044O975
$$ plain form
59578 523438 521383 518233 514757 511936 509832 508002 506480 505634 505378 505326 505573 506545 508005 508999 509111 509117 509987
59561 509987 511730 513724 515734 517955 520311 522420 524250 526122 527939 529045 529184 529168 530080 532043 534179
59546 534179 535681 536507 537032 537491 537976 538758 540349 543382 548637 557047 569270 585047 603104 621873
59532 621873 640255 657593 673006 685066 692334 694245 691575 686280 680904 677757 678134 682026 688559
59519 688559 696748 705859 715171 723608 729759 732375 730980 726068 718711 709811 699713 688410 676013
59506 676013 662858 649295 635543 621879 608771 596730 586061 576841 569056 562570 556981 551715
59494 551715 546477 541556 537568 534897 533476 533004 533183 533774 534679 536040 538054 540674 543812 547853 553492
59479 553492 560746 568657 576447 584610 594169 605104 616304 627008 637374 647498 656809 664853 671828
59466F71828N862L746P05j788k698k546k201j481K81K939N673P995J0031J2026
59452G10372J4142J6477J8860K0795K1904K2227K1863K0688J8656J5957J2489
59441I14430P685J340n729j2307j7752k1913k4525k5315k4519k2718k0292j7460
59429G30925j4675j2394j0614r034p576o263m728k412P55M254P609J0746J3763
59416G00356J6691J9545K2371K5208K8008L0371L1352K9964K6207K1079J5270
59405I66422Q314m64j0513k0086k7253l0437k8761k2958j5647r600n620k929j351
59392G99117j983n563j1350j7928k4095k8545k9862k7710k3515j9140j5359j2063
59380E82004r360p468n964m078j807MP95R19J005J141J070Q30Q70J504K453L003
$$ plain form
59466 671828 677690 681436 682141 680353 677655 675109 672908 671427 671708 674647 680320 688315 698346 710372
59452 710372 724514 740991 759851 780646 802550 824777 846640 867328 885984 901941 914430
59441 914430 922115 923455 917726 905419 887667 865754 841229 815914 791395 768677 748385 730925
59429 730925 716250 703856 693242 684208 676632 670369 665641 663229 663984 668238 675847 686593 700356
59416 700356 717047 736592 758963 784171 812179 842550 873902 903866 930073 951152 966422
59405 966422 974736 974272 963759 943673 916420 885983 857222 834264 818617 809017 803397 800468 799117
59392 799117 797134 791571 780221 762293 738198 709653 679791 652081 628566 609426 594067 582004
59380 582004 572644 565176 559212 555134 553327 553331 554126 555045 556050 557191 558261 559091 559961 561465 563918 566921
59364E66921K714J975J732K629M424O313P659Q350Q629Q780R019R500J0356J1722
59350F60723J3706J6304J9285K2120K4156K5113K5453K5967K6863K7480K7037
59339I14207K5447K3067J9989J5972J0926N158q54o577j1448j5241j8349k1319
59327I40978k4134k6247k7317k7532k7222k6516k5368k3659k1275j8391j5569
59316F77748j3266j1360r552q009p068o462n548m276l215k552j798o58M91J282
59302F05757J875K469K986L700N458Q624J2213J4706J5523J5203J4334J2867J0384
59289G26099O588J605l902q890j2435j4095j3851j2060r474o913m601k205L44
59276F46210K540M099N518P426R785J2235J4728J7296J9495K0739K0970K0401
$$ plain form
59364 566921 569635 571610 573342 575971 580395 586708 594367 602717 611346 620126 629145 638645 649001 660723
59350 660723 674429 690733 710018 732138 756294 781407 806860 832827 859690 887170 914207
59339 914207 939654 962721 982710 998682 1009608 1014766 1013912 1007335 995887 980646 962297 940978
59327 940978 916844 890597 863280 835748 808526 782010 756642 732983 711708 693317 677748
59316 677748 664482 653122 643570 635561 628493 622031 616483 612207 608992 606440 604642 603984 604475 605757
59302 605757 607632 610101 613087 616787 622245 630869 643082 657788 673311 688514 702848 715715 726099
59289 726099 732687 734292 730390 721500 709065 694970 681119 669059 659585 652672 648071 645866 646210
59276 646210 648750 652849 658367 665793 675578 687813 702541 719837 739332 760071 781041 801442
59264H01442J8881J6184J2721R229N773J745l020p889j2199j5828j8700k0456
59252G87883k0966k0653j9906j8569j6464j4036j1952j0184q127n626l384k063
59240F35953j351k09J999M894P586R501J0631J1177J1302J1194J1031J0666R580
59227G33954P329M038L02l333o649r585j1981j3575j4288j4388j4343j4333j4015
59214F29133j2943j1204r380p861o505n171m202m055m582n055m920m239l380k556
59200E43080j764r61r1R61K258L534M193L851K971K643L538N125O256O391N946
59185E87931N470N002M361L592K854K137J427Q77O38O22P10R50J440K183L274
59170F23468M828O613Q076R109J0364J2391J4706J6257J6604J6171J5436J4441
$$ plain form
59264 801442 820323 836507 849228 858457 864230 865975 862955 855066 842867 827039 808339 787883
59252 787883 766917 746264 726358 707789 691325 677289 665337 655153 647026 641400 638016 635953
59240 635953 634602 634393 636392 641286 648872 658373 669004 680181 691483 702677 713708 724374 733954
59227 733954 741283 745321 745623 742290 735641 726056 714075 700500 686212 671824 657481 643148 629133
59214 629133 616190 604986 595606 587745 581240 576069 571867 567812 563230 558175 553255 549016 545636 543080
59200 543080 541316 540355 540264 541225 543483 547017 551210 555061 558032 560675 564213 569338 575594 581985 587931
59185 587931 593401 598403 602764 606356 609210 611347 612774 613651 614289 614911 615621 616571 618011 620194 623468
59170 623468 628296 634909 642985 652094 662458 674849 689555 705812 722416 738587 754023 768464
59158G68464J3044J1114Q382M629J67m202p879j0768j2896j4148j4648j4913j5285
59145G11061j5427j4723j3113j1246r845r093q665q164p470o676n798m774l769
59132E92298l277l656m557n101m687l481k088q99R4J080K120L106L907M574N349
59117E84782O446P871R468J0968J1941J1984J1170J0150R476R003Q282P402O877
59104G05820O717O212M889L275K330K450L276M151M384L489J666r1r19j032j266
59089G45351j796j962j379n88k39l03m89r74k090l611n036o413q222j0419j2196
59074F89634j2873j2581j1881j1121j0392r680q800p499n903m572l875l609l419
59061E83429l270l151k730j784p44k96n40r68j172j243j464j962k610k979k567
$$ plain form
59158 768464 781508 792622 801004 805633 805800 801598 793719 782951 770055 755907 741259 726346 711061
59145 711061 695634 680911 667798 656552 646707 637614 628949 620785 613315 606639 600841 596067 592298
59132 592298 589021 585365 580808 575707 571020 567539 565451 564552 564646 565726 567846 570952 574859 579433 584782
59117 584782 591228 599099 608567 619535 631476 643460 654630 664780 674256 683259 691541 698943 705820
59104 705820 712537 718749 723638 726913 729243 731693 734969 739120 743504 746993 748659 748568 747649 746617 745351
59089 745351 743555 741593 740214 739626 739387 739084 738595 737621 735531 731920 726884 720471 712249 701830 689634
59074 689634 676761 664180 652299 641178 630786 621106 612306 604807 598904 594332 590457 586848 583429
59061 583429 580159 577008 574278 572494 571750 571454 570914 569946 568774 567531 566067 564105 561495 558516 555949
59046E55949j423l54r1l70l68R3L48m8p02r65o69p4N58J094J582K240L122L763
59028E63685L618K927K646L392M850O438Q016R650J1136J2156J2641J2618J2043
59015F65816J1016R984R243Q442O851M159Q64k044l716l996l462k753j880m19
59001F98105J722M102O356Q475J0416J1968J3188J4437J5633J6059J5324J4064
58989H29849J3084J2195J0524P808M726J924p72l948p659j1096j3147j3326j2135
58976H18027j0484q819o930m529j667J398M349O844Q768J0510J2545J4751J6616
58963H61379J8122J9785K1621K2781K2526K0953J8507J5363J1666P667L190k357
58951A041203q851j4976j9517k2569k4825k6319k6717k6290k5584k4430k2309
$$ plain form
59046 555949 554526 554172 554081 553711 553343 553436 553784 553736 553034 552069 551400 551326 551884 552978 554560 556800 559922 563685
59028 563685 567303 570230 572876 576268 581118 587556 595572 605222 616358 628514 641155 653773 665816
59015 665816 676832 686816 696059 704501 711352 715511 716375 714331 710615 706619 703157 700404 698524 698105
59001 698105 699827 703929 710285 718760 729176 741144 754332 768769 784402 800461 815785 829849
58989 829849 842933 855128 865652 873460 878186 880110 879338 875390 867731 856635 843488 830162 818027
58976 818027 807543 798724 791794 787265 785598 786996 791345 798189 806957 817467 830012 844763 861379
58963 861379 879501 899286 920907 943688 966214 987167 1005674 1021037 1032703 1040370 1043560 1041203
58951 1041203 1032352 1017376 997859 975290 950465 924146 897429 871139 845555 821125 798816
58940G98816j9548j7102j5211j3139j0483p855o015m990m324l701l061k420j904
58927F89063j691j816k096k280k178j838j667k048k672k706j925j049n85k5J111
58912F65598K182K340K021K366L431M207M378M798O048P644R057J0516J2319J4233
58898G51138J6025J7818J9463K0334K0313K0268K0957K2120K3318K5055K8140
58887I84949L2329L6482L9930M2812M5021M5718M4250M0953L6571L1221K4452
58876A404688J6142O873k650j2085k1129k9108l5412m0104m3618m5817m5950m3717
58864A108113l9928l5751l1708k7788k4159k1252j9253j7898j6795j5782j5039
58853H42760j4882j5221j5281j4325j2750j1779j1816j1816j0758r028p649o841
$$ plain form
58940 798816 779268 762166 746955 733816 723333 715478 709463 704473 700149 696448 693387 690967 689063
58927 689063 687372 685556 683460 681180 679002 677164 675497 673449 670777 668071 666146 665097 664512 664487 665598
58912 665598 667780 670120 672141 674507 677938 682145 686523 691321 697369 705013 714070 724586 736905 751138
58898 751138 767163 784981 804444 824778 845091 865359 886316 908436 931754 956809 984949
58887 984949 1017278 1053760 1093690 1136502 1181523 1227241 1271491 1312444 1349015 1380236 1404688
58876 1404688 1420830 1427703 1425053 1412968 1391839 1362731 1327319 1287215 1243597 1197780 1151830 1108113
58864 1108113 1068185 1032434 1000726 972938 948779 927527 908274 890376 873581 857799 842760
58853 842760 827878 812657 797376 783051 770301 758522 746706 734890 724132 715104 707455 700614
58841G00614o189n656n524n620n551n475n716n909n457m680m485m953n221m836
58827F25342m236l771l169k265j347n14N52J884K966L533L990M717N550O190O590
58812F46012O703O406N880N558N473N145M356L502K988K644K020Q81o95k409l873
58797F90591m868n475n764n692n575o066p079p350o025m119l203l137k485r31
58783F22822L13P25J398L157N164O206O265N923N177L786K143R03J18p01j893
58768F61506l422m918n793n765n321n115m928m138l082k789l240l211k128p76
58754F06880L40J819L854N345N577N508O219P160P248O693O360O163N602N255
58740F80023O076P559Q217P799P511P892P944O827N189M198M075M243M418M850
$$ plain form
58841 700614 694425 688769 683245 677625 672074 666599 660883 654974 649517 644837 640352 635399 630178 625342
58827 625342 621106 617335 614166 611901 610554 610040 610592 612476 615442 618975 622965 627682 633232 639422 646012
58812 646012 652715 659121 665001 670559 676032 681177 685533 689035 692023 694667 696687 697568 696873 694464 690591
58797 690591 685723 680248 674484 668792 663217 657151 650072 642722 636697 632578 629375 626238 623753 622822
58783 622822 623135 623860 625258 628415 633579 639785 646050 651973 657150 660936 663079 663982 664100 663399 661506
58768 661506 658084 653166 647373 641608 636287 631172 626244 622106 619024 616235 612995 609784 607656 606880
58754 606880 607220 609039 612893 618238 623815 629323 635542 642702 649950 656643 663003 669166 674768 680023
58740 680023 686099 693658 701875 709674 717185 725077 733021 739848 745037 749235 753310 757553 761971 766821
58726G66821N710O707P346P401P000O323N402M440M008M427N079N108M829N531
58712H46132P569R626J0393J0094R641R103P917N961L432J67l868p799j0610j2559
58698H85199j4866j8008k1145k3361k4599k5183k5015k3738k1373j8507j5827
58687F53577j3521j1223q717o517n372n268n515n808o460p451q009p561o378m976
58673E50801l544k325j707j461o30J234L518N651P910J0476J2661J3890J4561
58660F11035J5060J4803J3209J0829Q429N754K356r97l075l866m275m599m557
58647F60106m435m841n449n378m770m764n770o825o837n583l413q16J541L139
58633F05905M080M795N334N570N723N991N930N015L513K062P03p39j690j353P1
$$ plain form
58726 766821 772531 779238 786584 793985 800985 807308 812710 817150 821158 825585 830664 835772 840601 846132
58712 846132 853701 863327 873720 883814 893455 902558 910475 916436 919868 920035 916167 908368 897758 885199
58698 885199 870333 852325 831180 807819 783220 758037 733022 709284 687911 669404 653577
58687 653577 640056 628833 620116 613599 608227 602959 597444 591636 585176 577725 569716 562155 555777 550801
58673 550801 547257 544932 543225 541764 541134 542368 545886 551537 559447 569923 582584 596474 611035
58660 611035 626095 640898 654107 664936 673365 679119 681475 680478 677403 673537 669262 664663 660106
58647 660106 655671 650830 645381 640003 635233 630469 624699 617874 611037 605454 602041 601225 602766 605905
58633 605905 609985 614780 620114 625684 631407 637398 643328 648343 651856 653918 654621 653882 652192 650839 650910
58618F50910J697L357N626Q524J1342J3699J5698J7044J7097J5983J4568J3075
58606G88620J0670O806K127k226n613p899r197r849j0237j0436j0390j0263j0222
58593G21891j0050r536q963q538p726n873l196m09K363N386Q385J0794J2670J4408
58579G21606J5727J5985J5332J4493J3520J1890R779Q143P416P164P049P269P976
58566H63349R203J1291J4413J7782K0418K2608K5421K8717L0897L0839K8888K5706
58554A129532K1357J5955J0171M542q65n754r373j1301j1774j1152r818q578q257
58541A104685q744r354j0167j1948j4724j7534j9780k1673k3173k3703k3210k2356
58529H98319k1196j8871j5116j0950p357m182j030J758L639M708N330N631N709
$$ plain form
58618 650910 652607 655964 661590 670114 681456 695155 710853 727897 744994 760977 775545 788620
58606 788620 799290 806096 808223 805997 800384 792485 783288 773439 763202 752766 742376 732113 721891
58593 721891 711841 702305 693342 684804 677078 671205 668009 667600 669963 675349 683734 694528 707198 721606
58579 721606 737333 753318 768650 783143 796663 808553 818332 826475 833891 841055 848104 855373 863349
58566 863349 872552 883843 898256 916038 936456 959064 984485 1013202 1044099 1074938 1103826 1129532
58554 1129532 1150889 1166844 1177015 1181557 1180692 1174938 1165565 1154264 1142490 1131338 1121520 1112942 1104685
58541 1104685 1095941 1086587 1076420 1064472 1049748 1032214 1012434 990761 967588 943885 920675 898319
58529 898319 877123 858252 843136 832186 824829 820647 819617 821375 825014 829722 835052 840683 846392
58516H46392N799N769N146L918K650J536J58j508k630k581j797j211j324k058
58502H58259l013l661l868m162m930n556n227m457m648o109p610q059p580o680
58488G82699n547m425l661l002j770J0J622L038N092Q033J1004J3352J5374J7295
58474H39114J8489J8284J6720J4076J0513O418K334j661n726r317j1583j2621
58462H85040j3222j3281j1859q974n899l346p34K209M749O582Q545J0998J2752
58449H73560J2605J0891Q677O279L321l92m653q792j1637j2415j1911j1659j1768
58436H42106j0843q254n097k485k85J877L743N171O509P647Q005P963Q896J1220
58422H76173J3654J4965J5165J4470J2675J0114P704N407K225j679m596n775o524
$$ plain form
58516 846392 852191 857960 863106 867024 869674 871210 871368 869860 867230 864649 862852 861641 860317 858259
58502 858259 855246 851585 847717 843555 838625 833069 827842 823385 818737 812628 805018 796959 789379 782699
58488 782699 777152 772727 769066 766064 764294 764304 765926 768964 774056 782089 793093 806445 821819 839114
58474 839114 857603 875887 892607 906683 917196 923614 925948 924287 918561 909244 897661 885040
58462 885040 871818 858537 846678 837704 831805 828459 827725 829934 834683 841265 849810 860808 873560
58449 873560 886165 897056 905733 912012 915333 914941 910288 901496 889859 877444 865533 853874 842106
58436 842106 831263 823009 817912 815427 815142 817019 820762 825933 832442 840089 848094 856057 864953 876173
58422 876173 889827 904792 919957 934427 947102 957216 964920 970327 972552 970873 966277 960502 953978
58409I53978p906r204r754j0421j1953j3474j3968j3847j3728j3153j1837j0627
58397H14106r896q456n605k766j516j270o17L00M11k66r77j707k804l715l581
58382G71641k459r86N61J952K755L231M459O678Q712R789J0586J1608J2099J1610
58368H52236J1031J0956J0683J0034J0294J1980J3583J4043J4596J6440J8415
58357I94291J8951J8550J8252J7299J4579J0915P624M233m8l863n259m747m399
58344A086378m708m541l485k058k18K296M742O320P642R585J1582J2776J3799
58331A140110J5579J7402J8060J7919J7930J7691J6355J4400J2601J0394P219
58320A305660M208K596J666M06k48R07K757L415L154L495M482N283O339Q405J0594
$$ plain form
58409 953978 946072 936868 927114 916693 904740 891266 877298 863451 849723 836570 824733 814106
58397 814106 804210 795754 790149 787383 785867 784597 783980 784280 784691 784425 783448 781741 778937 775222 771641
58382 771641 769182 768196 768757 770709 773464 776695 781154 787832 796544 806333 816919 828527 840626 852236
58368 852236 863267 874223 884906 894940 905234 917214 930797 944840 959436 975876 994291
58357 994291 1013242 1031792 1050044 1067343 1081922 1092837 1100461 1104694 1104646 1100783 1095524 1090777 1086378
58344 1086378 1081670 1077129 1073644 1071586 1071368 1073664 1078406 1084726 1092368 1101953 1113535 1126311 1140110
58331 1140110 1155689 1173091 1191151 1209070 1227000 1244691 1261046 1275446 1288047 1298441 1305660
58320 1305660 1309868 1312464 1314130 1314536 1314288 1315195 1317952 1321367 1324521 1328016 1332498 1337781 1344120 1352525 1363119
58305A363119J1744J2613J4383J6214J6725J6584J7068J7488J6706J5758J6092
58294A534494J6694J5878J4647J5029J6474J7087J7201J8357J9907K0200K0056
58283A726024K1560K4233K5945K6731K8220L0015L0348K9646K9893L1066L1639
58272B035320L1913L3359L5408L6483L7388M0047M3724M6191M7785N0481N3816
58261B491915N5772N6843N9094O1973O3146O2814O3012O3388O2057N9843N9363
58250C159220O0591O1666O3137O6898P1919P5856P9821Q6546R4936J01674J07088
58239D029352J13941J21515J26890J31124J38037J47527J56315J64518J75143
58230E304362J87702J99069K10039K24283K41523K58701K77005L00239L27124
$$ plain form
58305 1363119 1374863 1387476 1401859 1418073 1434798 1451382 1468450 1485938 1502644 1518402 1534494
58294 1534494 1551188 1567066 1581713 1596742 1613216 1630303 1647504 1665861 1685768 1705968 1726024
58283 1726024 1747584 1771817 1797762 1824493 1852713 1882728 1913076 1942722 1972615 2003681 2035320
58272 2035320 2067233 2100592 2136000 2172483 2209871 2249918 2293642 2339833 2387618 2438099 2491915
58261 2491915 2547687 2604530 2663624 2725597 2788743 2851557 2914569 2977957 3040014 3099857 3159220
58250 3159220 3219811 3281477 3344614 3411512 3483431 3559287 3639108 3725654 3820590 3922264 4029352
58239 4029352 4143293 4264808 4391698 4522822 4660859 4808386 4964701 5129219 5304362
58230 5304362 5492064 5691133 5901172 6125455 6366978 6625679 6902684 7202923 7530047
58221G530047L53196L79495M11054M47644M84913N23951N70259O24026O81353
58212A2005938P44427Q19987R08661J007229J120507J258717J424242J614868
58204B0904576J839227K114237K448936K848741L335923L948750M724134N705753
58196D7870277O971032Q631741J0824961J3743115J7629823K2585731K8233088
58189A56489768L3583389L7373335L8662161L7175013L3127839K6789094J8258421
58182C81459020P695910m207709j5999598k5819230l2195441l4701890l3977721
58175B42253341l1198166k7508387k3767217k0513150j7949033j5958150j4258066
58168I1101172j2623579j0993498r415767p954899o656202n544118m617230l852587
$$ plain form
58221 7530047 7883243 8262738 8673792 9121436 9606349 10130300 10700559 11324585 12005938
58212 12005938 12750365 13570352 14479013 15486242 16606749 17865466 19289708 20904576
58204 20904576 22743803 24858040 27306976 30155717 33491640 37440390 42164524 47870277
58196 47870277 54841309 63473050 74298011 88041126 105670949 128256680 156489768
58189 156489768 190073157 227446492 266108653 303283666 336411505 363200599 381459020
58182 381459020 389154930 384947221 368947623 343128393 310932952 276231062 242253341
58175 242253341 211055175 183546788 159779571 139266421 121317388 105359238 91101172
58168 91101172 78477593 67484095 58068328 50113429 43457227 37913109 33295879 29443292
58160B9443292l225693k719055k312037j978872j701603j473251j285853j127150
58152A3619778r91011q79199p89899p14557o48114n92342n46801n05800m66572
58143G485483m31707m01223l70408l37703l07188k81136k57087k34107k15014
58134D649910k00563j87790j75898j67631j63164j58491j51475j43988j36825
58125C164085j28016j17577j08502j01632r4646q7228q2118p9711p6789p2058
58115B215808o8105o6307o4492o1229n8009n5589n2379m8041m4722m3236m1705
58104A611994l9240l7388l6793l5981l4538l3898l4103l3305l1358l0325l0524
58093A234541k9741k7263k5033k3872k2282k0019j9019j9557j9158j6764j4547
$$ plain form
58160 29443292 26217599 23498544 21186507 19207635 17506032 16032781 14746928 13619778
58152 13619778 12628767 11749568 10959669 10245112 9596998 9004656 8457855 7952055 7485483
58143 7485483 7053776 6652553 6282145 5944442 5637254 5356118 5099031 4864924 4649910
58134 4649910 4449347 4261557 4085659 3918028 3754864 3596373 3444898 3300910 3164085
58125 3164085 3036069 2918492 2809990 2708358 2613712 2526484 2444366 2364655 2287866 2215808
58115 2215808 2147703 2081396 2016904 1955675 1897666 1842077 1789698 1741657 1696935 1653699 1611994
58104 1611994 1572754 1535366 1498573 1462592 1428054 1394156 1360053 1326748 1295390 1265065 1234541
58093 1234541 1204800 1177537 1152504 1128632 1106350 1086331 1067312 1047755 1028597 1011833 997286
58082I97286j4160j4496j4577j5349j7053j7961j7331j6720j6959j6707j5365
58071H20608j4449j4663j4477j3130j2172j2379j2024r944p711o904o632n656
58059F90467m695m796n343n459n637o475p406q032q978j0226j0317q479n945m103
58045E94576k935k159k264l334m420m898n074m997m333l752m426n863o293n586
58031E34242n436o312o757o341o569p943q865q490q049q129p475n799n018o014
58017D37045o795n766m333m219m533l762k605k470k890k707k403k985l806l658
58003C84113k938k732k774k135j005J9J446L975O809Q603R403J0225J1292J1997
57989D36298J1910J0742Q118M537J636L74j34r55j600j236m69n36j439k251k582
$$ plain form
58082 997286 983126 968630 954053 938704 921651 903690 886359 869639 852680 835973 820608
58071 820608 806159 791496 777019 763889 751717 739338 727314 717370 709659 702755 696123 690467
58059 690467 685772 680976 675633 670174 664537 658062 650656 642624 633646 623420 613103 604624 598679 594576
58045 594576 591641 589482 587218 583884 579464 574566 569492 564495 560162 556410 551984 546121 539828 534242
58031 534242 528806 522494 515737 509396 502827 494884 486019 477529 469480 461351 453876 448077 443059 437045
58017 437045 430250 424484 420151 415932 411399 407637 405032 402562 399672 396965 394562 391577 387771 384113
58003 384113 381175 378443 375669 373534 372529 372548 373994 377969 384778 393381 402784 413009 424301 436298
57989 436298 448208 458950 467068 471605 473241 473615 473481 472526 470926 469690 469221 468685 467246 464995 462413
57974D62413k614k371j997k020k402k217j130k41m42r61o93J15N77O91R38J252
57958D48898J438J841K481K487J379Lq56j674k905l637k984j836j694k459k878
57943D37604k638k513k785k806j982k53K050M122M937M467M031M715O083P159
57929D62191P788Q170P912O709N172L896K400J10k266l553l752l828m273m914
57915D81762n698o620p227p123o662o378o067n173l742k403j688j758k334k657
57901D16232k250j853k681m458n501n104m409m298m051l059k249k438k765k262
57887C68854j784k600m100m573l682k505j696j046n05k25MK72oj125k232k541
57871C40510k620l270l932l657k878k718l093l093k711k660k790k271j179l69
$$ plain form
57974 462413 459799 457428 455431 453411 451009 448792 447662 447421 446979 446018 445325 445440 446017 446708 447646 448898
57958 448898 450336 452177 454658 457145 458524 458527 457671 455997 453092 449455 446471 444635 442941 440482 437604
57943 437604 434966 432453 429668 426862 424880 424627 426677 430799 435736 440203 444234 448949 455032 462191
57929 462191 469979 478149 486061 492770 497942 501838 504238 504348 502082 498529 494777 490949 486676 481762
57915 481762 476064 469444 462217 455094 448432 442054 435987 430814 427072 424669 422981 421223 418889 416232
57901 416232 413982 412129 409448 404990 399489 394385 389976 385678 381627 378568 376319 373881 371116 368854
57887 368854 367070 364470 360370 355797 352115 349610 347914 346868 346363 346138 346142 346414 346408 345283 343051 340510
57871 340510 337890 334620 330688 327031 324153 321435 318342 315249 312538 309878 307088 304817 303638 303269
57857C03269P1Q88K193L287L885M423N088N659O118O527O458N582M535M211M470
57842C66664M513M174L802L301K379J396Q15K32q61j810j632p42m70j015j322
57827C79424q62k57n0j36m24j018j614j706j322q25j37Q74J621J468P87L78J81
57810C76382l39j002j347j834l205n055o367p121p884q242p366n821n007m879
57796C10913m154k761k001k040j376M19J597R12l07j62J084J795J502J263J866
57781C08550K944L763M033L954L888L972L975L745L619L897M114L601K681K317
57767C59053K571K388J175m38j738k874m184n408o203o749p328p738p582o839
57753C08106n849m958m276l536k307p40K43N7n46m16L33O19J93k0M70R42O07l73
$$ plain form
57857 303269 303340 304228 306421 309708 313593 318016 323104 328763 334881 341408 347866 353448 357983 362194 366664
57842 366664 371177 375351 379153 382454 384833 386229 387044 387276 386415 384605 382973 382231 381761 380746 379424
57827 379424 378562 378305 378255 378119 377695 376677 375063 373357 372035 371210 371073 371947 373568 375036 375823 376201 376382
57810 376382 376043 375041 373694 371860 368655 363600 357233 350112 342228 333986 326620 320799 315792 310913
57796 310913 306759 303998 301997 299957 298581 299000 300597 301509 301202 301040 302124 303919 305421 306684 308550
57781 308550 311494 315257 319290 323244 327132 331104 335079 338824 342443 346340 350454 354055 356736 359053
57767 359053 361624 364012 365187 364749 363011 360137 355953 350545 344342 337593 330265 322527 314945 308106
57753 308106 302257 297299 293023 289487 287180 286440 286683 286740 286194 285778 286111 286730 286923 286903 287373 288315 288922 288549
57735B88549j390k183k708k917k878k653j968n85R73J824J886J849K039K115J991
57720B83944K070K398K398J774R10J32p39j927l292m529n212m849l565k485k536
57705B64492l156l153k541k329k654k638k121k030k650l015k515j776j332p81
57691B31801P3M27k04r33p03K84J165J662J977K153K327K979M232N457O295P445
57675B66437R815J3372J7595K2627K9288L8100M8566N9034O7049P0488O8755O2440
57663G73566N1724L5948J5191q395l1338n0385o3192o8596o7172o1111n2852m3994
57651D29394l5548k8403k2936j8734j5263j2469j0376q673p075n683m601l695
57639B55938k924k425k015j252j65O94J130J512J924J909J378R17Q41P29K95r3
$$ plain form
57735 288549 287159 284976 282268 279351 276473 273820 271852 271267 272240 274064 275950 277799 279838 281953 283944
57720 283944 286014 288412 290810 292584 293494 293626 292887 290960 287668 283139 277927 273078 269513 267028 264492
57705 264492 261336 258183 255642 253313 250659 248021 245900 243870 241220 238205 235690 233914 232582 231801
57691 231801 231874 232301 232097 231164 230461 230745 231910 233572 235549 237702 240029 243008 247240 252697 258992 266437
57675 266437 276252 289624 307219 329846 359134 397234 445800 504834 571883 642371 711126 773566
57663 773566 825290 861238 876429 868034 836696 786311 723119 654523 587351 526240 473388 429394
57651 429394 393846 365443 342507 323773 308510 296041 285665 276992 269917 264234 259633 255938
57639 255938 253014 250589 248574 247322 247157 247851 248981 250493 252417 254326 255704 256621 257462 258191 258486 258393
57623B58393k28n40j274j919j986j729j568j494j407j431j483j296j073j388k135
57608B37442k531k388k302k295j559p1Q92O24Q6K08L36m52j600j927j427j020
57592B22016j150j734k774l911m199l353k546k756l185k667j757j783k470k297
57578A85434j061j87m21q92q53q36j483k407k849k678k161j512j101j407k256
57563A63330k741k303j488j186j500j750j361l55R00K071K924L208K788K010J602
57548A66149J885K245J878R76M64O66J031J269J750K422K453J543O53N82P31K28
57532A86925n10m82J64L52j77n65k65J71j1p10j149p00M81J569J878J637J551
57515A90159J711J577J127J039J460J607J130Q14J166J449R98M59N77P56J17q57
$$ plain form
57623 258393 258165 257625 256351 254432 252446 250717 249149 247655 246248 244817 243334 242038 240965 239577 237442
57608 237442 234911 232523 230221 227926 226367 226296 227188 227812 227898 228106 228442 227990 226390 224463 223036 222016
57592 222016 220866 219132 216358 212447 208248 204895 202349 199593 196408 193741 191984 190201 187731 185434
57578 185434 184373 184186 183765 182873 182020 181184 179701 177294 174445 171767 169606 168094 166993 165586 163330
57563 163330 160589 158286 156798 155612 154112 152362 151001 150646 151546 153617 156541 159749 162537 164547 166149
57548 166149 168034 170279 172157 173133 173597 174263 175294 176563 178313 180735 183188 184731 185384 185966 186697 186925
57532 186925 186415 185933 186097 186449 186272 185707 185442 185613 185602 184892 183743 183043 183524 185093 186971 188608 190159
57515 190159 191870 193447 194574 195613 197073 198680 199810 200624 201790 203239 204237 204696 205273 206029 206146 205289
57499B05289j215j325k201l475l760k849j984j925k162k090j751j275p47o74j466
57484A76390k449k485j581q05n80k60M76J041R99O48K74k36q30j171j290j497
57468A66644j629j304q56r80j445j321n73k37p43j282j198q74p62o27k66k1l7
57451A52489J19O00Q70O72N88J060J603J587J137P46N59N10O29P41M29k77p03
57434A63359l92K69O73P13O34N66N62O38O34M17K29L63M87Q2n57n84J2K54k39
57415A68120n57J19J250J762J477J070J012J184J331J427J618J952K024J243k19
57400A84813j137o18N07P56J46P2R83J673J298O78Q40J520J958K219K751L386
57384B01845L725L922M220M306L916L460L326L117K440J804J838K053J420j08
$$ plain form
57499 205289 204074 202749 200548 197073 193313 190464 188480 186555 184393 182303 180552 179277 178530 177856 176390
57484 176390 173941 171456 169875 169070 168490 168230 168706 169747 170746 171394 171668 171432 170602 169431 168141 166644
57468 166644 165015 163711 162855 161875 160430 159109 158536 158299 157556 156274 155076 154202 153440 152813 152547 152526 152489
57451 152489 152608 153208 154078 154750 155338 156398 158001 159588 160725 161471 162030 162540 163169 163910 164339 164062 163359
57434 163359 162967 163236 163909 164622 165256 165822 166384 167022 167656 168073 168302 168665 169152 169234 168677 168093 168105 168359 168120
57415 168120 167563 167682 168932 170694 172171 173241 174253 175437 176768 178195 179813 181765 183789 185032 184813
57400 184813 183676 183058 183565 184321 184467 184539 185522 187195 188493 189171 190011 191531 193489 195708 198459 201845
57384 201845 205570 209492 213712 218018 221934 225394 228720 231837 234277 236081 237919 239972 241392 241284
57370B41284j555k251k365k235j966j690j511j200m45N03J005Q30M30L40O02Q17
57354B30593O13J63J80J140K525L306L255L148L446L532K752J551R25J157J782
57339B60068K367K781K962K976L084L289L152K562K241K902M134M868M731M264
57325C06381L992L857L643L334L020K859L054L527L757L324K576K298K767L509
57311C51898M013M222M333M421M446M437M497M711N017N207N162N036N040N093
57297D17533N003M930N276O033O680O892O932P134P429P633P787P957Q057Q133
57283E13409Q422Q919R295R509J0029J1098J2299J3192J3954J4909J5857J6400
57271F57292J6626J6958J7527J8186J8897J9649K0108J9773J8505J6621J4535
$$ plain form
57370 241284 239729 237478 235113 232878 230912 229222 227711 226511 226066 226569 227574 228404 228834 229174 229776 230593
57354 230593 231206 231369 231549 232689 235214 238520 241775 244923 248369 251901 254653 256204 257129 258286 260068
57339 260068 262435 265216 268178 271154 274238 277527 280679 283241 285482 288384 292518 297386 302117 306381
57325 306381 310373 314230 317873 321207 324227 327086 330140 333667 337424 340748 343324 345622 348389 351898
57311 351898 355911 360133 364466 368887 373333 377770 382267 386978 391995 397202 402364 407400 412440 417533
57297 417533 422536 427466 432742 438775 445455 452347 459279 466413 473842 481475 489262 497219 505276 513409
57283 513409 521831 530750 540045 549554 559583 570681 582980 596172 610126 625035 640892 657292
57271 657292 673918 690876 708403 726589 745486 765135 785243 805016 823521 840142 854677
57260H54677J2454J0373Q249O265M819L985L145J685K6o66R5J636L158M517N766
57245I20184O699P344Q273R823J1510J2659J3143J3157J2841J2537J2815J3716
57233A054701J4517J4663J4387J3999J3318J2378J1945J2598J3776J4520J4626
57222A205428J4494J4375J4525J5494J7411J9421K0665K1368K2233K3181K3607
57211A412202K3453K3124K2628K1666K0331J8895J7239J5271J3604J2878J2690
57200A613981J2127J1154J0543J0639J1183J2180J3907J6049J7856J9253K0836
57189A769708K2668K3965K4200K3724K3089K2410K1622K0744J9687J8316J6776
57178B006909J5367J4132J3021J2199J1640J0738R100P413O641O556O031M781
$$ plain form
57260 854677 867131 877504 885753 892018 896837 900822 903967 905652 905678 905012 905107 906743 909901 914418 920184
57245 920184 926883 934227 942500 952323 963833 976492 989635 1002792 1015633 1028170 1040985 1054701
57233 1054701 1069218 1083881 1098268 1112267 1125585 1137963 1149908 1162506 1176282 1190802 1205428
57222 1205428 1219922 1234297 1248822 1264316 1281727 1301148 1321813 1343181 1365414 1388595 1412202
57211 1412202 1435655 1458779 1481407 1503073 1523404 1542299 1559538 1574809 1588413 1601291 1613981
57200 1613981 1626108 1637262 1647805 1658444 1669627 1681807 1695714 1711763 1729619 1748872 1769708
57189 1769708 1792376 1816341 1840541 1864265 1887354 1909764 1931386 1952130 1971817 1990133 2006909
57178 2006909 2022276 2036408 2049429 2061628 2073268 2084006 2093106 2100519 2107160 2113716 2119747 2124528
57166B124528L736L644M290N236O298P080P000O149N344M993M659M047L610L740
57152B194354M049L889L087J851M96n57j049j333j986k825k998k165q75M60K156
57137B196554M521P324J0388J4018J8379K3086K7797L2651L7772M2803M7301N1012
57125B513606N3537N4404N3813N2759N1932N1075M9760M8273M7477M8419N2288
57114C077343N9920P0842Q3504R6907J11357J27248J44029J61213J79583K00639
57104D312585K25450K54925K90743L35163L90296M58498N43241O48851P79555
57095H239307R39384J132422J361819J628055J927911K253736K591809K921034
57087B2995477L215239L450241L612896L706872L749274L756083L723754L622064
$$ plain form
57166 2124528 2128264 2131908 2136198 2141434 2147732 2154812 2161812 2167961 2173305 2178298 2182957 2187004 2190614 2194354
57152 2194354 2198403 2202292 2205379 2207230 2207726 2207169 2206120 2204787 2202801 2199976 2196978 2194813 2193938 2194398 2196554
57137 2196554 2201075 2208399 2218787 2232805 2251184 2274270 2302067 2334718 2372490 2415293 2462594 2513606
57125 2513606 2567143 2621547 2675360 2728119 2780051 2831126 2880886 2929159 2976636 3025055 3077343
57114 3077343 3137263 3208105 3291609 3388516 3499873 3627121 3771150 3932363 4111946 4312585
57104 4312585 4538035 4792960 5083703 5418866 5809162 6267660 6810901 7459752 8239307
57095 8239307 9178691 10311113 11672932 13300987 15228898 17482634 20074443 22995477
57087 22995477 26210716 29660957 33273853 36980725 40729999 44486082 48209836 51831900
57079E1831900L406592L040925K509649J816165R77575K8083r75056j956625k841032
57070E7838176l569436m106183m437157m567405m519179m327174m031056l669026
57062B4611560l274464k874441k489114k132225j812342j533463j295187j093880
57054H106444r24860p83721o66128n67721m84996m15925l59150l12924k75136
57045C315883k43970k18027j96130j77428j61376j47220j33851j20556j07609
57036A809716r5607q4593p4250o4603n5818m7591l9358l0963k2347j2683n59J4727
57024A296071L2342N0204O5705P6412Q0557P6807O3227L7471l40m4594q5209j12942
57012A535711j24238j21626j10557r6102q1455o8074n6558m7292m0308l4952l0283
$$ plain form
57079 51831900 55238492 58279417 60789066 62605231 63582806 63610889 62635833 60679208 57838176
57070 57838176 54268740 50162557 45725400 41157995 36638816 32311642 28280586 24611560
57062 24611560 21337096 18462655 15973541 13841316 12028974 10495511 9200324 8106444
57054 8106444 7181584 6397863 5731735 5164014 4679018 4263093 3903943 3591019 3315883
57045 3315883 3071913 2853886 2657756 2480328 2318952 2171732 2037881 1917325 1809716
57036 1809716 1714109 1629516 1555266 1490663 1434845 1387254 1347896 1316933 1294586 1281903 1281344 1296071
57024 1296071 1328413 1378617 1444322 1520734 1601291 1678098 1741325 1778796 1778456 1733862 1648653 1535711
57012 1535711 1411473 1289847 1179290 1083188 1001733 933659 877101 829809 789501 754549 724266
57001G24266k5928k2167j9271j7144j5633j4687j4137j3724j3327j2811j1745
56990E43692r757p088m221j168K271N644Q018R046R057Q038N368Q25m858j0725
56976E54142j6154k0559k3215k3862k2946k0957j8101j4752j1569q771n896k567
56964C64793R98M519Q087J1816J5535J9065K2179K4128K3870K1061J6200R677
56952E41928J474p865j6801k3798k8150k9616k8224k4827k0919j7276j3517r466
56940C22943n973l614j511J704O435J2319J8880K5092K9131K9827K7872K4542
56928D87647J9783J2700L357p085j7597k7274l4491l7670l7036l4422l1156k7312
56916B69444k3070j9351j6583j3998j0949q062o391n975n949n624m901l938k931
$$ plain form
57001 724266 698338 676171 656900 639756 624123 609436 595299 581575 568248 555437 543692
56990 543692 533935 526847 522626 521458 523729 529373 537391 546437 555494 563532 568900 569725 564867 554142
56976 554142 537988 517429 494214 470352 447406 426449 408348 393596 382027 373256 367360 364793
56964 364793 365791 370310 378397 390213 405748 424813 446992 471120 494990 516051 532251 541928
56952 541928 543402 535537 518736 494938 466788 437172 408948 384121 363202 345926 332409 322943
56940 322943 316970 313356 311845 313549 319984 332303 351183 376275 405406 435233 463105 487647
56928 487647 507430 520130 523487 516402 498805 471531 437040 399370 362334 327912 296756 269444
56916 269444 246374 227023 210440 196442 185493 177431 171040 165065 159116 153492 148591 144653 141722
56903A41722k121j605j252q98n06%P35J625K472L355M681O704R310J2374J5971
56888A92567J9910K3363K5222K4906K2699J9311J5149J0025L651l506j0082j4699
56876C28516j6929j7160j5806j3040r304n477k234O58M131Q895J4871K1558K8742
56863C27421L6523M4518N1360N5429N5885N2684M5737L4800K0309L721j3134k8457
56851F86796m0206m6439m6744m2805l6876l0032k2382j4341o643P30Q742J8269
56839D28069K9542M2516N6982P1855Q4785R2954R4402Q8746P6771N9244L6158
56828A162024P680k3821n3280p5328q7373r0219q6240p7714o6614n4621m2725
56817E11769l1194k0269j0429j644P265J7961L1059M5260N7887O6340O9348O7015
$$ plain form
56903 141722 139601 137996 136744 135846 135340 135340 136075 137700 140172 143527 148208 154912 164222 176596 192567
56888 192567 212477 235840 261062 285968 308667 327978 343127 353152 356803 353297 343215 328516
56876 328516 311587 294427 278621 265581 256277 250800 248566 249224 253355 262250 277121 298679 327421
56863 327421 363944 408462 459822 515251 571136 623820 669557 704357 724666 728387 715253 686796
56851 686796 646590 600151 553407 510602 473726 443694 421312 406971 400328 401058 409800 428069
56839 428069 457611 500127 557109 628964 713749 806703 901105 989851 1066622 1125866 1162024
56828 1162024 1169704 1145883 1092603 1017275 929902 839683 753443 675729 609115 554494 511769
56817 511769 480575 460306 449877 448233 455498 473459 504518 549778 607665 674005 743353 810368
56805H10368N9789M7566K9997P647j7230m1022n9939p1445p5163p2592o5973n7286
56793D94717m7965l8873l0264k2103j4608q101k203M247J1964K0225K7528L2820
56781D27384L5666L5661L2437K6104J7111N736p663k1749l4074m2220m5199m3888
56769C85306m0215l5816l1266k6593k2138j8444j5454j2654j0121q589q112p583
56757A48321o218m686m001l959l569k627j795j496j551j748j986k021j802j791
56743A09071k242k486j773n47M4k48o18n75m65o06p90q83j063j259r91j08R08
56726I5369J533J691J641J733K231K908L023K221J205R19J259J390J082Q64R63
56711A20032J006Q19O59N65K82n8J8N00R13J164J558J894J484L69m50l74n1l63
$$ plain form
56805 810368 870157 917723 947720 955367 938137 897115 837176 765731 690568 617976 552003 494717
56793 494717 446752 407879 377615 355512 340904 332803 330600 334847 346811 367036 394564 427384
56781 427384 463050 498711 531148 557252 574363 580099 572436 550687 516613 474393 429194 385306
56769 385306 345091 309275 278009 251416 229278 210834 195380 182726 172605 164016 155904 148321
56757 148321 142103 137417 133416 129457 125888 123261 121466 119970 118419 116671 114685 112664 110862 109071
56743 109071 106829 104343 102570 102023 102067 101819 101201 100626 100161 99555 98765 97882 96819 95560 94569 94461 95369
56726 95369 96902 98593 100234 101967 104198 107106 110129 112350 113555 114474 115733 117123 118205 119069 120032
56711 120032 121038 121857 122516 123081 123363 123305 123323 123823 124736 125900 127458 129352 130836 131205 130755 130381 130330 129967
56693A29967j244j974k139j845j357q88m68O0O89R61M92l20p56p63q33r65o47
56676A17970J48P68R31J052J362J485J179P14K54l41q84q03j27L25R5k08J79J194
56658A25293K207K646K179R04k69k55Q92J947K145K008K154K149J344J08n55k59
56642A44638M99J073J186R86R39J365J928J989J566J334J534J664J451J376J759
56627A65287K126K011J622J220N79k97p02k15L72K3j122j979j923j191k96L09
56611A65824K42m66j133j103m93J32M84N13Nj079k107k312j753j190j050j070
56595A53444r39p97q76j079j112q83n87m33l90l15k29k77l30NP54J370J482J458
56577A50266J677J734J091K14J06Q54J649K041K214K116J522J030J654L174M270
$$ plain form
56693 129967 128723 126749 124610 122765 121408 120520 120052 120112 120801 121762 122254 121934 121178 120415 119582 118617 117970
56676 117970 118118 118886 119817 120869 122231 123716 124895 125609 125863 125522 124638 123835 123708 124033 124128 123920 124099 125293
56658 125293 127500 130146 132325 133229 132960 132705 133597 135544 137689 139697 141851 144000 145344 145452 144897 144638
56642 144638 145137 146210 147396 148382 149321 150686 152614 154603 156169 157503 159037 160701 162152 163528 165287
56627 165287 167413 169424 171046 172266 172845 172548 171846 171631 172003 172026 170904 168925 167002 165811 165515 165824
56611 165824 166066 165600 164467 163364 162871 163003 163487 164000 164005 162926 160819 158507 156754 155564 154514 153444
56595 153444 152505 151708 150832 149753 148641 147758 147171 146738 146348 146033 145804 145527 145197 145202 145956 147326 148808 150266
56577 150266 151943 153677 154768 154982 155088 155942 157591 159632 161846 163962 165484 166514 168168 171342 175612
56562A75612M689N820Q411J1083J2138J1744J1195J0834R916P986N280K181p69
56549B76120k688l075k496j947j800j906k192k554k708k680l025l909m539m203
56535B36398l329k819k839k949k919k772k410j918j726j935j987j597j311j493
56521B04394j581j143q73j501k425k596k167k049k277k104j441r06o07o9O03O87
56505A83945Q6m75o27p70j086j055l58N27R82R44O57J88m70j135j528j511j215
56488A77099r63r32q15k00O19P77N5o54n48L2L40M04P11J222J472J335J002M90
56470A81446j56m54mR11J703K156K264J904J222P98P84N46k18p23k88M25M45O0
56452A92821K71J093J577J184J15j310k544k586j078P06J199O12L93R50J301R33
$$ plain form
56562 175612 180301 186121 194532 205615 217753 229497 240692 251526 261442 269428 274708 276889 276120
56549 276120 273432 270357 267861 265914 264114 262208 260016 257462 254754 252074 249049 245140 240601 236398
56535 236398 233069 230250 227411 224462 221543 218771 216361 214443 212717 210782 208795 207198 205887 204394
56521 204394 202813 201670 200797 199296 196871 194275 192108 190059 187782 185678 184237 183331 182724 182655 183258 183945
56505 183945 184031 183556 182929 182159 181073 180018 179660 180187 181169 182113 182770 182958 182488 181353 179825 178314 177099
56488 177099 176136 175204 174389 174189 174808 175585 175640 174986 174438 174470 174810 175214 175925 177147 178619 179954 180956 181446
56470 181446 181290 180836 180832 181743 183446 185602 187866 189770 190992 191790 192574 193120 192902 192179 191891 192316 192761 192821
56452 192821 193092 194185 195762 196946 197061 195751 193207 190621 189543 190249 191448 192060 192453 193403 194704 195637
56436A95637M92M46L99Q4o3K94Q35J176J279J178R42R12J295J677J555J184J031
56419B10353Q64L51J11Q32J731J303l46j482j146j40N88J058J301Q01l96j170
56403B14613p70J10M11M4m07n88l21N83J893K813K789K093J309P41M89N40N63
56386B26905J97k86k05N32J185J166O37N9k20O8Q99J570J300K77n06n28j79P3
56368B32944K03K64L04O57J542K401K414J643Q53K94k70n23J96J488K022J381
56352B47813O30O32R33Q66O82Q28J036Q52N16N78J058J457J368Q41M05O94J711
56335B62900K629K902L167M215N469N650M749M022M000L918L324K818K747K484
56321C14994J598N55k66j158k054k110j048O1J73l60n53j80L17O76Q83Q99Q62
$$ plain form
56436 195637 196129 196575 196974 197058 196995 197289 198124 199300 200579 201757 202699 203611 204906 206583 208138 209322 210353
56419 210353 211217 211568 211679 212511 214242 215545 215199 213717 212571 212431 213019 214077 215378 216179 215783 214613
56403 214613 213843 213953 214364 214408 214001 213413 213092 213675 215568 218381 221170 223263 224572 225313 225802 226342 226905
56386 226905 227102 226816 226611 227143 228328 229494 230131 230190 229970 230038 230937 232507 233807 234084 233578 233050 232871 232944
56368 232944 233147 233411 233715 234372 235914 238315 240729 242372 243225 243519 243249 242726 242922 244410 246432 247813
56352 247813 248443 249075 250008 250874 251556 252384 253420 254272 254788 255366 256424 257881 259249 260090 260495 261189 262900
56335 262900 265529 268431 271598 275813 281282 286932 291681 295703 299703 303621 306945 309763 312510 314994
56321 314994 316592 317147 316881 315723 313669 311559 310511 310572 310745 310385 309832 309652 309969 310645 311528 312427 313289
56304C13289J127J730K319K791L384L916L812L142K870L548M580N089M871M153
56290C60621L142K196J824K087K613L203L947M682N142N543O145O404N697M800
56276D18046N245P076Q675R120R240R887J0658J1063J1606J2744J3936J4593J5114
56263E57003J6123J7479J8780K0138K1824K3877K6431K9803L3836L7999M2362
56252H45655M7566N3674O0155O7185P5658Q5572R5731J05479J15323J25301J34211
56241A811510J41116J46241J49620J50203J47161J40792J31320J18022J00453
56232C036438P9411N5950L0665M601k0457m3545o5084q5057j02006j14820j24158
56221B651938j30997j35064j35863j34027j30453j25198j18400j11137j04182
$$ plain form
56304 313289 314416 316146 318465 321256 324640 328556 332368 335510 338380 341928 346508 351597 356468 360621
56290 360621 363763 365959 367783 369870 372483 375686 379633 384315 389457 395000 401145 407549 413246 418046
56276 418046 423291 430367 439042 448162 457402 467289 477947 489010 500616 513360 527296 541889 557003
56263 557003 573126 590605 609385 629523 651347 675224 701655 731458 765294 803293 845655
56252 845655 893221 946895 1007050 1074235 1149893 1235465 1331196 1436675 1551998 1677299 1811510
56241 1811510 1952626 2098867 2248487 2398690 2545851 2686643 2817963 2935985 3036438
56232 3036438 3115849 3171799 3202464 3207065 3186608 3143063 3077979 2992922 2890916 2776096 2651938
56221 2651938 2520941 2385877 2250014 2115987 1985534 1860336 1741936 1630799 1526617
56212A526617r6939q8780q0437p2956o6255n9862n4018m9013m4417m0050l6519
56201H37371l3830l0694k6470k2515k0246j9012j7327j5140j3398j2281j1317
56190F15141j0458r753q750p327o239n784n028l511k472k982m060m142l367k835
56176E38433k612k064j263n68L42J560K058J217K72O45J770K258K248K806L745
56161E50847L943L395L216L918N019O053O808P098P253Q054R318R719R017R015
56147F42673J0970J3617J5424J7172K0341K4440K8230L2365L8453M6360N4843
56136I44888O3990P4570Q5512R4320R9673J01641R9959R4298Q5860P6603O7136
56125A888450N7209M7722M0189L4522K9269K3674J7809J1283L769l711r987j5656
$$ plain form
56212 1526617 1429678 1340898 1260461 1187505 1121250 1061388 1007370 958357 913940 873890 837371
56201 837371 803541 772847 746377 723862 703616 684604 667277 652137 638739 626458 615141
56190 615141 604683 594930 586180 578853 572614 566830 561802 558291 555819 552837 548777 544635 541268 538433
56176 538433 535821 533757 532494 531926 532268 533828 535886 537103 537375 538020 539790 542048 544296 547102 550847
56161 550847 554790 558185 561401 565319 570338 576391 583199 590297 597550 605604 614922 624641 633658 642673
56147 642673 653643 667260 682684 699856 720197 744637 772867 805232 843685 890045 944888
56136 944888 1008878 1083448 1168960 1263280 1362953 1464594 1564553 1658851 1744711 1821314 1888450
56125 1888450 1945659 1993381 2033570 2068092 2097361 2121035 2138844 2150127 2153896 2150185 2140198 2124542
56113B124542k1975k8636l4746m1306n0306o1602p2842q2078q8485r1037q8878
56102A462651q2852p4760o5335n4768m4501l6266k9816k3735j8077j4046j1474
56091A007021r033o543m929m177l454k868k911k699r67J584L190L808M721N924
56077I88667O355O291P017Q414R243R535J0348J1500J1918J1810J2175J2701J2559
56064A118533J2568J4037J6082J6847J6703J7418J8732J8865J7958J7861J8692
56053A304296J8779J7820J7151J6896J5870J4325J3890J4781J5719J6444J7705
56042A483676J9072J9493J9617K0850K2708K3907K5012K7119K9002K9035K8664
56031A748155L0302L2888L3685L3367L4849L7937L9883M0648M2712M5911M7450
$$ plain form
56113 2124542 2102567 2073931 2039185 1997879 1947573 1885971 1813129 1731051 1642566 1551529 1462651
56102 1462651 1379799 1305039 1239704 1184936 1140435 1104169 1074353 1050618 1032541 1018495 1007021
56091 1007021 997988 991445 986516 982339 978885 976017 973106 970407 969440 971024 974214 978022 982743 988667
56077 988667 995022 1001313 1008330 1016744 1025987 1035522 1045870 1057370 1069288 1081098 1093273 1105974 1118533
56064 1118533 1131101 1145138 1161220 1178067 1194770 1212188 1230920 1249785 1267743 1285604 1304296
56053 1304296 1323075 1340895 1358046 1374942 1390812 1405137 1419027 1433808 1449527 1465971 1483676
56042 1483676 1502748 1522241 1541858 1562708 1585416 1609323 1634335 1661454 1690456 1719491 1748155
56031 1748155 1778457 1811345 1845030 1878397 1913246 1951183 1991066 2031714 2074426 2120337 2167787
56020B167787M7117M7612M9519N0731N1132N2993N6392N8926O0394O3061O7125
56009B772789P0515P3313P7606Q2935Q6914R0158R5423J02045J06805J10008J14915
55998C783426J21403J26427J30600J37586J47023J54947J61468J70779J83230
55989E116889J94840K05284K18627K35534K52609K70127K92049L17784L42721
55980G446464L67659L98357M34968M71872N09094N53202O05646O61485P21335
55971A2170082P92622Q77289R71130J077445J207544J365509J547750J760491
55963B1769862K021424K341550K724896L191394L780892M532099N483643O704632
55955E2550392Q303526J0414878J3221784J6969563K1806549K7447154L2977633
$$ plain form
56020 2167787 2214904 2262516 2312035 2362766 2413898 2466891 2523283 2582209 2642603 2705664 2772789
56009 2772789 2843304 2916617 2994223 3077158 3164072 3254230 3349653 3451698 3558503 3668511 3783426
55998 3783426 3904829 4031256 4161856 4299442 4446465 4601412 4762880 4933659 5116889
55989 5116889 5311729 5517013 5735640 5971174 6223783 6493910 6785959 7103743 7446464
55980 7446464 7814123 8212480 8647448 9119320 9628414 10181616 10787262 11448747 12170082
55971 12170082 12962704 13839993 14811123 15888568 17096112 18461621 20009371 21769862
55963 21769862 23791286 26132836 28857732 32049126 35830018 40362117 45845760 52550392
55955 52550392 60853918 71268796 84490580 101460143 123266692 150713846 183691479
55948A83691479L7126981L8869980L7839892L4203367K8196081J9833736R118892
55941C88880408l413669j6329586k7564163l5282413l8722582l8378670l5469841
55934A93719484l1239613k6596492k2115401j8127362j4762442j2004149r778720
55927E9095305q009013o611684n497669m598574l874769l292521k813760k412591
55919B1984724k080776j809509j581354j384446j218436j080773r60928q52913
55911A1015589p60337o84150o17071n54705n01038m58291m21396l86787l57311
55902F274503l34224l13012k91008k71209k55042k39000k21693k06719j95382
55893C947214j83701j69784j57235j48150j39336j28613j18554j10898j03123
$$ plain form
55948 183691479 220818460 259688440 297528332 331731699 359927780 379761516 388880408
55941 388880408 385466739 369137153 341572990 306290577 267567995 229189325 193719484
55934 193719484 162479871 135883379 113767978 95640616 80878174 68874025 59095305
55927 59095305 51086292 44474608 38976939 34378365 30503596 27211075 24397315 21984724
55919 21984724 19903948 18094439 16513085 15128639 13910203 12829430 11868502 11015589
55911 11015589 10255252 9571102 8954031 8399326 7898288 7439997 7018601 6631814 6274503
55902 6274503 5940279 5627267 5336259 5065050 4810008 4571008 4349315 4142596 3947214
55893 3947214 3763513 3593729 3436494 3288344 3149008 3020395 2901841 2790943 2687820
55884B687820r3653q4893p8202p1223o2887n6033n2416n0033m7827m8134n2007
55873A990512n6641n9804o2379o4586o4276o1161n8214n6769n4513n0248m6197
55862A355724m3608m0513l6030l2505l1099k9465k6195k3471k2939k2858k1671
55851A025370k0753k1144k1211j9937j9127j9983k0769k0121j9515k0197k0800
55840H01813k0102j9190j8861j7870j5715j4098j3782j3003j0889r264r178q881
55828F30980p289o218o917p577o656n669o225p136p090p382r291j1252j1343j0346
55814E20589r768r028p138n176m521m392l485k333j828j171N46K299K850K900
55800D80344L620M576M972N334O142O492N770M996M800L878J272j662l413m582
$$ plain form
55884 2687820 2594167 2509274 2431072 2359849 2296962 2240929 2188513 2138480 2090653 2042519 1990512
55873 1990512 1933871 1874067 1811688 1747102 1682826 1621665 1563451 1506682 1452169 1401921 1355724
55862 1355724 1312116 1271603 1235573 1203068 1171969 1142504 1116309 1092838 1069899 1047041 1025370
55851 1025370 1004617 983473 962262 942325 923198 903215 882446 862325 842810 822613 801813
55840 801813 781711 762521 743660 725790 710075 695977 682195 669192 658303 649039 639861 630980
55828 630980 623691 617473 610556 602979 596323 590654 584429 577293 570203 562821 553530 542278 530935 520589
55814 520589 510821 501793 494655 489479 484958 480566 477081 474748 472920 471749 472295 474594 477444 480344
55800 480344 483964 488540 493512 498846 504988 511480 517250 522246 527046 530924 532196 530534 527121 522539
55786E22539o151p353p259o790p138p717p673p782q939j0368j1246j2410j4404
55773D07309j5538j4109j1110q553o470l811j006O73J277J566J242k38k084l280
55759C45868m268n680o492n369k815j74K405N132O918O667N228L992K540k21l527
55744C50204n605o356o998p685p617p016o862o906o028m316k975k351j786j289
55730B76414j570k516l223l496l923m585m998n132n278n190m609m146m382m556
55716B18810l597j959r83p47j41J164K380L137L871M633M869M509M135L892L228
55701B47201J820p7k154m143n542o000n853n576n048m018k927k435k433k275j661
55686A98879p36L21J189J466J357J705K736L538L404K880K707K720K535K420K430
$$ plain form
55786 522539 516388 509035 501776 494986 487848 480131 472458 464676 455737 445369 434123 421713 407309
55773 407309 391771 377662 366552 357999 351529 347718 346712 347385 348662 350228 351470 351232 349148 345868
55759 345868 341600 335920 329428 324059 321244 321070 323475 328607 335525 342192 347420 351412 353952 353731 350204
55744 350204 344599 338243 331245 323560 315943 308927 302065 295159 289131 284815 281840 279489 277703 276414
55730 276414 274844 272328 269105 265609 261686 257101 252103 246971 241693 236503 231894 227748 223366 218810
55716 218810 215213 213254 212271 211524 211383 212547 214927 218064 221935 226568 231437 235946 240081 243973 247201
55701 247201 249021 248944 246790 242647 237105 231105 225252 219676 214628 210610 207683 205248 202815 200540 198879
55686 198879 198143 198464 199653 201119 202476 204181 206917 210455 213859 216739 219446 222166 224701 227121 229551
55671B29551J729j33k094k869k602k157j641q41k71m70q88o87n8M13R42J904K798
55654B22626L068L207L734L919K989J805J728K423K466J597O81r7j278k625l327
55639B42916l657m681o305p165o733o078o192o745o848o125m807l499k856k862
55625A68363k642j646n86l64o65o59n23r74j746j923j543j518k088k605k773k886
55609A43222k909k472j816j605j840j913j652j348r67k91L13L26L0L5J51j51n30
55592A26583k63K91N3j016j798j690j172p42l83j77l55o66o22l66l80n01j95L73
55574A16974N92N69R44J738K363K612K620K186J222N76J144K396L023K794K402
55559A44155J814L82j503k506k243j649j231n38M26P40L6q44j154j134j154j099
$$ plain form
55671 229551 231280 231147 229053 226184 223582 221425 219784 218943 218672 218202 217314 216627 216569 216982 217924 219828 222626
55654 222626 225694 228901 232635 236554 239543 241348 243076 245499 247965 249562 250243 250146 248868 246243 242916
55639 242916 239259 234578 228273 221108 214375 208297 202105 195360 188512 182387 177580 174081 171225 168363
55625 168363 165721 164075 163489 163125 162460 161801 161278 160304 158558 156635 155092 153574 151486 148881 146108 143222
55609 143222 140313 137841 136025 134420 132580 130667 129015 127667 126700 126409 126722 127048 127078 127113 127264 127113 126583
55592 126583 126320 126611 126664 125648 123850 122160 120988 120246 119863 119686 119331 118665 118043 117677 117297 116796 116601 116974
55574 116974 117566 118135 119079 120817 123180 125792 128412 130598 131820 132396 133540 135936 138959 141753 144155
55559 144155 145969 146351 144848 142342 140099 138450 137219 136681 137107 137847 137883 137039 135885 134751 133597 132498
55543A32498r67j070j284j005j70N66Q56R83J086J040J120J813K807L245K964
55528A44482K515J937P69p04j526j539j529j770j768j570j959k984l650l470l053
55513A24181k739k063j030n69j020j451j178p81q93j010m33N10R50N86l04j257
55497A11499j664j099JO84P49Q00R78O87j54p17n85l20l85m84m45o02q57m81O41
55478A08246J562J627J222P62Q9o40p68l98n59j433j767r12p5m30j230j070j5
55461A04211P91R18P43L89k10o47m48J04M87P36R96Q68Q4o84o35l8K50P3r2o9
55441A07827o6q9p0k27o66r55p26k82K5M50J180J565R36k19p39k70N09R30R13
55422A10026O63M43M82O50M14m24j277j474j047m00L33J070J433J243R34R14R66
$$ plain form
55543 132498 131531 130461 129177 128172 128002 128568 129424 130407 131493 132533 133653 135466 138273 141518 144482
55528 144482 146997 148934 149703 148999 147473 145934 144405 142635 140867 139297 137338 134354 130704 127234 124181
55513 124181 121442 119379 118349 117780 116760 115309 114131 113350 112457 111447 111014 111524 112474 113060 112756 111499
55497 111499 109835 108736 108737 109421 110170 110970 111948 112635 112481 111764 111179 110859 110474 109990 109545 108943 108086 107605 108246
55478 108246 109808 111435 112657 113419 113508 112868 112100 111702 111143 109710 107943 107031 106956 106526 105296 104226 104211
55461 104211 105002 105920 106663 107052 106842 106195 105747 105851 106338 107074 108070 108938 109022 108338 107703 107665 107915 107988 107896 107827
55441 107827 107761 107672 107602 107375 106709 105754 105028 104746 104771 105221 106401 107966 108902 108683 107944 107674 108183 109113 110026
55422 110026 110689 111132 111614 112264 112678 112254 110977 109503 108456 108056 108389 109459 110892 112135 113069 113983 114949
55405A14949P74N64M92O8j039k068k022j142n61o42o89k76O0k38q98j240j001
55388A05091m17J59N06N34L04K2o3J87N90O88K32m81r89j284j569j577q30L73
55370A01476J030O95j5m49p17j038j041l52O42J195J004K92m97p69j89P09Q77
55353A02853J08n70l49K90M56J50lJ78M21O33R01J067R07M90Rn05r36r77n83j82
55333A04358q7j84l63p03r88p52p6L57L65N49J080J178M29l35k72K70O19R62J582
55314A07989J761P18q00j208k27Q28Q36N5o37q26p21o68o80l60N60J581J902J600
55296A11703J524J796J464J88q39n50M21Q12N22K02j23p07r97l45O17O36l02j049
55278A14973j008o14k31K10N30L14k89o84p14o64n79l85l63o42n70L84J473J556
$$ plain form
55405 114949 115723 116287 116779 116847 115808 113740 111718 110576 110015 109373 108684 108408 108468 108230 107332 106092 105091
55388 105091 104674 104833 105339 105873 106177 106199 106136 106323 106913 107601 107833 107352 106363 105079 103510 101933 101103 101476
55370 101476 102506 103201 103186 102737 102020 100982 99941 99589 100231 101426 102430 102722 102225 101456 101267 101976 102853
55353 102853 102961 102391 102042 102332 102788 102938 102935 103113 103534 104167 105068 106135 107042 107532 107541 107036 106100 105123 104540 104358
55333 104358 104271 104087 103724 103021 102033 101281 101205 101562 101927 102476 103556 104734 105163 104828 104556 104826 105445 106407 107989
55314 107989 109750 110468 109668 108460 108233 109061 109897 109952 109315 108489 107768 107100 106420 106060 106620 108201 110103 111703
55296 111703 113227 115023 116487 116675 115836 115286 115707 116519 117041 117243 117120 116413 115416 115071 115688 116324 116022 114973
55278 114973 113965 113351 113120 113330 113860 114174 113885 113201 112487 111823 111244 110859 110496 109854 109284 109668 111141 112697
55260A12697Q14L85N23M90P9j38r3l28o68k51Q44J366P52p4k88l27q33j498j706
55241A11746j505j197o99M2N40L35l29q87j078q89l27M70J171J579J642J185J29
55224A11928r70j298q18k86j85k58k26k11k15R5P39J169R32J90o17j140j069l29
55206A07431N34P60L01j88l13k88l05k76k75n42q68p11j18K69K49L47Q26J180
55188A08013R76M86J46M1J83O28J067R56M25K54O90R58M44m12q28p24m93k80L9
55169A12569N06J032J415J222K39q69j007j8J060J410J310J252J047L68m41q57
55153A20238r16r33q58n01k5K61L15K03q0l20j18M15N35j55j091j510j357r98
55135A13105n63o3K83M15O29R78R51L31j66J87R49J038K16o89r81q22p37q81r60
$$ plain form
55260 112697 113511 113896 114419 114909 114988 114850 114757 114429 113761 113510 114354 115720 116472 116398 116110 115783 114950 113452 111746
55241 111746 110241 109044 108345 108387 108927 109262 108933 108046 106968 106079 105752 106222 107393 108972 110614 111799 111928
55224 111928 110958 109660 108842 108556 108371 108113 107887 107676 107461 107556 108295 109464 110396 110586 109969 108829 107760 107431
55206 107431 107965 108725 109026 108838 108525 108237 107932 107656 107381 106839 105971 105260 105142 105411 105660 106007 106833 108013
55188 108013 108989 109475 109621 109662 109845 110473 111540 112496 112921 113175 113865 114823 115267 114855 114027 113303 112810 112530 112569
55169 112569 113075 114107 115522 116744 116983 116114 115107 115089 116149 117559 118869 120121 121168 121536 121095 120238
55153 120238 119322 118389 117531 117030 117005 117266 117581 117784 117704 117384 117266 117681 118216 118061 116970 115460 114103 113105
55135 113105 112542 112479 112762 113177 113806 114784 115735 116066 115900 116087 117036 118074 118290 117601 116620 115798 115061 114180 113220
55116A13220n88L18J313J709J261M40j21k62k27k40l65n47n79k83J20J72j34j87
55098A15020M81J557K309K281J538N84J26M57R85Q77K61J21P71J283Q60nl42p1
55080A29093J99K24K43M01O68J104J566J504N98o10j306j372j224r98n51oK94
55063A29827L15K34kn17j024j105q07n16k76J86Q95J559J947J907J172k15j493
55046A32087j797j243q12j112j690j720r28K87J218J331O76o9k74m7N8j11j40
55029A25714K27O69P21K71m24j001j164r32p18q30r09k71J034J908J375j99j397
55012A24074j302l63L08K31j66l56k90r0L51J041J546J416Q75N28M86L56K1j88
54994A28478k00l56o76o47n5N57O91N80O81R95J348J837K432K614K018J116P35
$$ plain form
55116 113220 112632 112950 114263 115972 117233 117673 117552 117290 117063 116823 116458 115911 115332 115049 115169 115341 115207 115020
55098 115020 115501 117058 119367 121648 123186 123770 123896 124353 125338 126215 126476 126597 127368 128651 129511 129506 129164 129093
55080 129093 129292 129516 129759 130160 130828 131932 133498 135002 135600 134990 133684 132312 131088 130090 129539 129533 129827
55063 129827 130142 130376 130374 129857 128833 127728 126921 126405 126129 126315 127210 128769 130716 132623 133795 133580 132087
55046 132087 130290 129047 128235 127123 125433 123713 122785 123072 124290 125621 126297 126228 125954 125907 125965 125854 125714
55029 125714 125941 126610 127331 127602 127178 126177 125013 124081 123363 122533 121624 121353 122387 124295 125670 125471 124074
55012 124074 122772 122409 122717 122948 122782 122426 122136 122046 122397 123438 124984 126400 127275 127803 128289 128645 128666 128478
54994 128478 128278 127922 127246 126599 126544 127101 127792 128372 129053 130048 131396 133233 135665 138279 140297 141413 142148
54977A42148J025J434J406P32m27j453j604r44m75q02j199p44J57L44k89p02l43
54960A38264J94K98J35nk51n90n06L21J398K062K249K232K003J385N55r8m86q08
54942A48352j045r27m55j25m07j123j591j405r07o72p31o12m5P53J558K364K956
54925A45938K811J866R43Q67J452J987K435L436N123O725P530P688P678P478O657
54910B10614M997K770M49j573l122m278n252o170o896p112o566n380m114l378
54896A64989l248l251k979k548k273k138j849j211l29M84Q31N81J96L91J226J925
54880A50797J941J741K106L085M158N097N982O579O460N756N180N165N370N084
54866B14501L762J351j530l880n163n760o154o144n483m842n094n814n596m049
$$ plain form
54977 142148 143173 144607 146013 146745 146318 144865 143261 142317 141842 141040 139841 139097 139254 139598 139309 138607 138264
54960 138264 138458 138756 138891 138886 138635 138045 137539 137860 139258 141320 143569 145801 147804 149189 149744 149646 149160 148352
54942 148352 147307 146380 145925 145800 145393 144270 142679 141274 140367 139695 138964 138352 138307 139060 140618 142982 145938
54925 145938 148749 150615 151558 152425 153877 155864 158299 161735 166858 173583 181113 188801 196479 203957 210614
54910 210614 215611 218381 218830 217257 214135 209857 204605 198435 191539 184427 177861 172481 168367 164989
54896 164989 161741 158490 155511 152963 150690 148552 146703 145492 145163 145647 146478 147059 147255 147646 148872 150797
54880 150797 152738 154479 156585 159670 163828 168925 174907 181486 187946 193702 198882 204047 209417 214501
54866 214501 218263 219614 218084 214204 209041 203281 197127 190983 185500 180658 175564 169750 164154 160105
54852A60105k398j792j975k087j902j597j120n49n03j319k231k171j158j41L11
54837A39473M32M45J48m70q84o68j04J91K5k85m56n37p01r03q68l68M82J269J601
54818A37822J415R99P15O57N56O6q14j655j928j445m27O48J257J117M35j82k45
54801A38991K14Q02J103Q29o3j127j559r37K53J090J138O76K12J35O12J403J851
54784A45623J458N55n3qL67P24J044J259J051L31m28o20j20P39J569K185K616
54767A58292L048L685M547N464O191O506O355O058O175O856P446P035N308K671
54753B35637k89l018n020o129o756p344p693p318o309n262m388l417k396j812
54739A68486j778j835j760j810j849j164L34J521J436O48M04Q67J133Q23O34J176
$$ plain form
54852 160105 157707 155915 153940 151853 149951 148354 147234 146685 146182 144863 142632 140461 139303 139162 139473
54837 139473 139905 140350 140498 140028 139144 138476 138372 138563 138588 138303 137847 137310 136609 135706 134838 134470 134952 136221 137822
54818 137822 139237 140236 140951 141608 142164 142230 141416 139761 137833 136388 135961 136609 137866 138983 139418 139236 138991
54801 138991 139205 140007 141110 141939 141876 140749 139190 138253 138506 139596 140734 141410 141622 141757 142369 143772 145623
54784 145623 147081 147636 147583 147575 147942 148666 149710 150969 152020 152351 151923 151303 151183 151922 153491 155676 158292
54767 158292 161340 165025 169572 175036 181227 187733 194088 200146 206321 213177 220623 227658 232966 235637
54753 235637 235348 232330 227310 221181 214425 207081 199388 192070 185761 180499 176111 172694 170298 168486
54739 168486 166708 164873 163113 161303 159454 158290 158624 160145 161581 162229 162633 163500 164633 165456 166090 167266
54723A67266K053K529K582K863L825N230O450P054P026O501N446L784J773p5j511
54708B22796k788m171n453o197o272n923n440m949m421l712k771j848j355j301
54694A66195j173n95M4or22k027k458j938r30j34J66K64M74N94K49l59n97l92
54676A56455m17j004j481j187n72n28r61r35j90M23K24l50n40l46l02m80l73K78
54658A47714J011J125M25n63j070p89j10L66M59M48N34N49K90j33m46n05l29j2
54640A48964K89M52O43J115J626J418K09j081j261m40P1m76j309j369q18o22r52
54623A46459r50m9J157J680J230K84n67r68q90o14n54q04j065j049p80l30L53
54606A42543J153J650J567J124O47J59l18m57p5L77L91K03M06Q73Q38J22m62k11
$$ plain form
54723 167266 169319 171848 174430 177293 181118 186348 192798 199852 206878 213379 218825 222609 224382 224307 222796
54708 222796 220008 215837 210384 204187 197915 191992 186552 181603 177182 173470 170699 168851 167496 166195
54694 166195 165022 164427 164471 164465 163543 161516 159058 157120 156190 156056 156222 156486 156960 157554 157803 157444 156847 156455
54676 156455 156038 155034 153553 152366 151794 151266 150305 149370 149180 149603 149827 149477 148937 148591 148289 147809 147436 147714
54658 147714 148725 149850 150275 149712 148642 147853 147743 148109 148568 149016 149550 150099 150389 150256 149810 149305 148976 148964
54640 148964 149253 149705 150348 151463 153089 154507 154716 153635 152374 151934 152005 151529 150220 148851 148033 147411 146459
54623 146459 145509 145460 146617 148297 149527 149811 149244 148276 147386 146772 146218 145414 144349 143300 142520 142190 142543
54606 142543 143696 145346 146913 148037 148684 148843 148525 148068 147993 148370 148761 148964 149370 150243 151081 151203 150741 150530
54588A50530N07Q37O06L93O30J044J012K83p33j390j502j472j588j444m93R45
54572A48165J749J251j8j040j319j010m41N0J05l68q97q11j1Q83J180Q31M19M19
54554A49137O18L76m45j107q41J43R27J112J165J412J290K18j231j738q41M84
54538A50679J095J009J074J633K113J949J391J095J220J358J167P03J82j81j87
54523A66300Q7O0p49j847k141j380n64n18p84m74L57R19Q00J81o72j403j471q29
54505A55872l74p96j376r59J86P61N49O65J468J762O97p55j129l41O58J278J485
54488A59651J182M09k47k14K26L95J74o5k23n51j068j442j362p55K07J060J341
54471A58718J188J222J576J612R27J07p0L63Q83J217J154K62j351k535k285j126
$$ plain form
54588 150530 151037 151874 152480 152873 153503 154547 155559 155842 155109 153719 152217 150745 149157 147713 147220 148165
54572 148165 149914 151165 151147 150107 148788 147778 147337 147387 147492 147124 146227 145416 145405 146288 147468 148299 148718 149137
54554 149137 149755 150131 149686 148579 147738 147881 148808 149920 151085 152497 153787 154005 152774 151036 150195 150679
54538 150679 151774 152783 153857 155490 157603 159552 160943 162038 163258 164616 165783 166486 166668 166487 166300
54523 166300 166387 166447 165698 163851 161710 160330 159766 159248 158464 157990 158347 159266 160066 160247 159575 158172 156701 155872
54505 155872 155498 154702 153326 152367 152553 153314 153863 154528 155996 157758 158455 157700 156571 156230 156888 158166 159651
54488 159651 160833 161242 160995 160781 161007 161402 161576 161511 161288 160737 159669 158227 156865 156110 156317 157377 158718
54471 158718 159906 161128 162704 164316 165243 165350 165280 165643 166526 167743 168897 169159 167808 165273 162988 161862
54455A61862l80l35j55M98R35O39R8k8K13L63K34j27o96j378j908k057j812j261
54437A54705n14K10O93R20R88R18P54P02Q50Q84M31l69r54r27l46M35R04O57j26
54418A60815o49l67L82R57J240J379J108Q7j219j836j496q40l43K18J030J646
54402A62112J552Q94L09K58O52J011R26N68N89J210J712J357N68M47J122J439
54386A76726N79p09r83J36J533J820P02q06j440r92m12n15r38p70J31J045J414
54369A76521J295Q69K06m50p08n30j51L90J092J498J111L04q0L2j2k37J16J047
54351A82313J364M70n20m16K67K53m68q79p54q74j416j458m23R38J514J152N25
54334A81588J30q0k72l71j03O37J480J768J346R19J252K115K543K178J754K009
$$ plain form
54455 161862 161482 161147 160992 161490 162425 163064 163162 163134 163347 163710 163944 163817 163121 161743 159835 157778 155966 154705
54437 154705 154191 154401 155094 156014 157002 157920 158674 159376 160226 161110 161541 161172 160218 159291 158945 159380 160284 160941 160815
54418 160815 160166 159799 160181 161138 162378 163757 164865 164952 163733 161897 160401 159561 159218 159436 160466 162112
54402 162112 163664 164558 164867 165125 165777 166788 167714 168282 168871 170081 171793 173150 173718 174165 175287 176726
54386 176726 177305 176596 175613 175749 177282 179102 179804 178998 177558 176566 176154 175639 174701 173931 174062 175107 176521
54369 176521 177816 178685 178891 178441 177733 177203 177052 177442 178534 180032 181143 181447 181367 181399 181387 181150 181266 182313
54351 182313 183677 184147 183627 183211 183478 183731 183263 182384 181630 180756 179340 177882 177459 178397 179911 181063 181588
54334 181588 181718 181638 181366 180995 180892 181529 183009 184777 186123 187042 188294 190409 192952 195130 196884 198893
54318A98893K676L059L197L781N000O097O288N574M411K979J248m93j785k672
54304B38253l676m931n844n895n337m779m433m176m001l893l529k672j754j437
54290A81896j690j865j580r96k47O42J225R08p0o41k83L03K94j56m28l95k57P3
54272A76733O77J120R15K92j07j27p5m4P4J42Lj8M31R09O67l5n0R14J676J195
54252A85292R9j74O86J674J927J595J142N63k83j111j397j093o85n63n53k24M58
54235A87353R68P06l36j444j768j149l38k61j049j905k042j480p82j85N31J353
54219A78172J704J146J47l04J73R57J238R70P92J089J421J045j10j235j510r50
54203A84745j86L68P66J023Q52J67n35o37j06N40Q44P38L67o2k96j37K56M37J35
$$ plain form
54318 198893 201569 204628 207825 211606 216606 222703 228991 234565 238976 241955 243203 242710 240925 238253
54304 238253 234577 229646 223802 217907 212570 207791 203358 199182 195181 191288 187759 185087 183333 181896
54290 181896 180206 178341 176761 175765 175518 176160 177385 178293 178223 177582 177299 177602 177896 177740 177312 176917 176660 176733
54272 176733 177410 178530 179445 179737 179630 179503 179428 179384 179458 179600 179603 179585 180016 180925 181592 181557 181507 182421 184097 185292
54252 185292 185391 185217 185903 187577 189504 191099 192241 192804 192521 191410 190013 188920 188235 187672 187119 186895 187353
54235 187353 188321 189027 188691 187247 185479 184330 183992 183731 182682 180777 178735 177255 176473 176288 176819 178172
54219 178172 179876 181022 181169 180865 181038 181995 183233 184203 184995 186084 187505 188550 188440 187205 185695 184745
54203 184745 184559 184927 185693 186716 187568 187735 187200 186563 186457 186997 187841 188579 188946 188884 188588 188451 188707 189144 189279
54184A89279m19p60o55k37K23N28O03M56J96m9k54n14q44j092j070p64k75L05
54166A84657Q09R09M27k42m15N1N61O64O81R95J131L10j166j930j284j94j2o72
54148A85280r41k63N28M57k88q22q16o74o32m00J73P04Q48P93P33L12p63j810
54130A82419j699k99J321K255K550K434J678L42o28m15M47P28J31n15n15P2R02
54113A91208J636J810J244O14P74J462J510N69l91o39p28j327j867j313K05J494
54097A96261J812J438Q68J98m95q56o74k45pJ3J00L43M27N8n82r54p49j32O15
54078A97439J377J926J797Q95K3J18J036J660J290M04q5K54J280K484L089K539
54062B17526J166o7p06j160j693j800j041J02P95Q35O30N37P13J226J837K051
$$ plain form
54184 189279 188860 188100 187445 187208 187431 187959 188562 189018 189214 189165 188911 188397 187553 186461 185391 184627 184352 184657
54166 184657 185466 186375 186802 186560 186145 186196 186757 187421 188102 189097 190228 190538 189372 187442 186158 185964 185952 185280
54148 185280 184339 184076 184604 185061 184773 183951 183135 182461 181829 181429 181602 182306 183154 183947 184680 184992 184229 182419
54130 182419 180720 180421 181742 183997 186547 188981 190659 191001 190373 189958 190405 191133 191264 190749 190234 190306 191208
54113 191208 192844 194654 195898 196512 197286 198748 200258 200827 200436 199797 199069 197742 195875 194562 194767 196261
54097 196261 198073 199511 200379 200577 200082 199226 198552 198307 198300 198313 198413 198756 199183 199241 198659 197705 196956 196824 197439
54078 197439 198816 200742 202539 203434 203457 203575 204611 206271 207561 207965 207880 208134 209414 211898 214987 217526
54062 217526 218692 218625 217919 216759 215066 213266 212225 212327 213122 213957 214587 215124 215837 217063 218900 220951
54046B20951J830J855K591L530L919L799L732L906M190M673N494O366P004P712
54032B81552Q766R559R296Q315P698P580O948N385L898L508L866L910L312K570
54018C66163K085J761J350P61Lp96j469k090k936m026m922n310n424n632n764
54003C33754n383m530l734l132k069J02L083N920Q252J0767J4142J7784K0161
53990C95117K0336J8615J5590J1083M649l225j1012j7220k1126k2633k2024k0092
53978C48058j7964j6285j4730j2605r862p231n408m378l655k969k447k184j895
53965B46445j289n33r2p7j31mQ1j20l43r9O38J278J270P30L77P58J596K000J476
53946B53961N57K35Q93K144L420M313M487L986L612M184N355N890N352M656M529
$$ plain form
54046 220951 222781 224636 227227 230757 234676 238475 242207 246113 250303 254976 260470 266836 273840 281552
54032 281552 290318 299877 309173 317488 325186 332766 339714 345099 348997 352505 356371 360281 363593 366163
54018 366163 368248 370009 371359 372120 372123 371327 369858 367768 364832 360806 355884 350574 345150 339518 333754
54003 333754 328371 323841 320107 316975 314906 315008 318091 324011 332263 343030 357172 374956 395117
53990 395117 415453 434068 449658 460741 465390 462165 451153 433933 412807 390174 368150 348058
53978 348058 330094 313809 299079 286474 276612 269381 263973 259595 255940 252971 250524 248340 246445
53965 246445 245156 244623 244531 244454 244323 244319 244400 244280 243937 243838 244476 245754 247024 247754 248131 248889 250485 252485 253961
53946 253961 254518 254753 255646 257790 261210 265523 270010 273996 277608 281792 287147 293037 298389 303045 307574
53931C07574M452L799L075L073L512L635L671M430N747O545O506O539P352Q518
53917C78428R247R326Q960Q377P918P960Q455R016R499R993J0203R518P840N743
53903E00483L679J638k44j518k209k946m046n060n669o226o931p211o692o188
53889D50860o830q479r886j0296j0155j0113j0135r796q992q003p146o534o100
53876C38395n648n002m224l605l359l345l244l027l124l872m833n008l973k504
53862B83627j750j970k513k835l005l132k963k282j360p07n56p67r99r31n22j14
53846B57221m0j73j45oj69o49q86m90K77J018J729K494L017K976K593K534L243
53829B74544M617O241P772R211J0989J3682J7508K2082K6574L0010L1536L0767
$$ plain form
53931 307574 312026 315825 318900 321973 325485 329120 332791 337221 342968 349513 356019 362558 369910 378428
53917 378428 387675 397001 405961 414338 422256 430216 438671 447687 457186 467179 477382 486900 494740 500483
53903 500483 504162 505800 505556 504038 501829 498883 494837 489777 484108 477882 470951 463740 457048 450860
53889 450860 444030 435551 425665 415369 405214 395101 384966 375170 366178 358175 351029 344495 338395
53876 338395 332747 327745 323521 319916 316557 313212 309968 306941 303817 299945 295112 290104 286131 283627
53862 283627 281877 279907 277394 274559 271554 268422 265459 263177 261817 261110 260554 259787 258788 257857 257335 257221
53846 257221 257181 257008 256863 256857 256688 256039 255153 254663 254940 255958 257687 260181 263198 266174 268767 271301 274544
53829 274544 279161 285402 293174 302385 313374 327056 344564 366646 393220 423230 454766 485533
53817D85533K7788K2613J4828M348p428j7936k5161k8705k9151k7104k3231j8556
53805C77838j3971r647n385j327K072M615O553Q262R967J1541J2481J2343J1403
53792D26745J0480R816Q621O172K933k0k344m452o430p701p982p846q059q694
53778D11239r262r407r217q993q925q978q945q643q116p555p067o584o010n393
53764B98144m901m654m529m177l385k412j821j868k201k300k040j731j676j891
53750B58558k145k183j908j457j055q07o88o74o94m78L01J529K549K742K203J633
53734B57426J579J908J998J471O47J84K61L52m6p13j008o80m2N20P60M59l53j065
53716B63658r19RQ15R53Q98J371K279K920K859K270J589J221J403K004K519K502
$$ plain form
53817 485533 513321 535934 550762 555110 547682 529746 504585 475880 446729 419625 396394 377838
53805 377838 363867 354220 348835 347508 349580 354195 360748 369010 378977 390518 402999 415342 426745
53792 426745 437225 447041 455662 461834 464767 464747 462403 457951 451521 443820 435838 427992 419933 411239
53778 411239 401977 392570 383353 374360 365435 356457 347512 338869 330753 323198 316131 309547 303537 298144
53764 298144 293243 288589 284060 279883 276498 274086 272265 270397 268196 265896 263856 262125 260449 258558
53750 258558 256413 254230 252322 250865 249810 249003 248315 247641 246947 246469 246770 248299 250848 253590 255793 257426
53734 257426 259005 260913 262911 264382 265029 265213 265474 265826 265780 265067 264059 263379 263337 263857 264617 265076 264723 263658
53716 263658 262739 262748 263563 264516 265414 266785 269064 271984 274843 277113 278702 279923 281326 283330 285849 288351
53700B88351K004J512J523K157K990L270K614J575J178J774K665K957K463J596
53686C18629P44P0l40m29k29J18L48R5p36j652j957j553j008q28r90j244j354
53669C07684r90L7J285J898J597R70N98M08J34j45l14n18q14r47q38q52j221j588
53651C06384j482q83p5O57R30M75k93n03N4O57Q29R47J287J257M31m66m82K69
53633C09993J018J522J942K059J643J168J170J340J178J150J981L134L304K414
53619C35016J779K126K733K797K572K650L061L565M118M582M623M309M204M458
53605C82593M529M086L548L289K973K240J568J725K604L208K746J397M3o15o37
53590D15297o53j062j580j774j741j860k123k244k318k660l053k870k080j388
$$ plain form
53700 288351 290355 291867 293390 295547 298537 301807 304421 305996 307174 308948 311613 314570 317033 318629
53686 318629 319373 319443 319103 318674 318445 318563 318911 319006 318270 316618 314661 313108 312100 311272 310282 309038 307684
53669 307684 306694 306731 308016 309914 311511 312481 313079 313487 313621 313476 313162 312644 311830 310883 310045 309193 307972 306384
53651 306384 304902 304019 303944 304601 305531 306006 305713 305210 305264 305921 306750 307697 308984 310241 310672 310206 309724 309993
53633 309993 311011 312533 314475 316534 318177 319345 320515 321855 323033 324183 326164 329298 332602 335016
53619 335016 336795 338921 341654 344451 347023 349673 352734 356299 360417 364999 369622 373931 378135 382593
53605 382593 387122 391208 394756 398045 401018 403258 404826 406551 409155 412363 415109 416506 416549 415934 415297
53590 415297 414644 413582 412002 410228 408487 406627 404504 402260 399942 397282 394229 391359 389279 387891
53576C87891j218j215j006q36j048j480j773j848j753j437j007p82q09p11l06
53561C70662O3J04M8K18N46Q58J178J455J332P28J69K01P00J267J906K796L604
53544C87835L714L154K739L154M227N290O005O649P697R202J0694J1642J1975
53531D73977J2007J1933J1640J0995J0018Q701P028N365M527N100O759Q517R611
53518E86178J0064J0417J1116J2167J3321J4509J5989J7944J9998K1344K1509
53507G54556K0938K0707K1469K2736K3292K2534K1237K0640K0979K1386K1260
53496I91734K0959K0907K0732J9930J8797J7941J7323J6513J5678J5468J6002
53485A191984J6696J7059J7080J6931J6824J6975J7214J6939J6011J5207J4857
$$ plain form
53576 387891 386673 385458 384452 383616 382568 381088 379315 377467 375714 374277 373270 372488 371679 370968 370662
53561 370662 370725 370829 370877 371095 371641 372499 373677 375132 376464 377192 377361 377562 378262 379529 381435 384231 387835
53544 387835 391549 394703 397442 400596 404823 410113 416118 422767 430464 439666 450360 462002 473977
53531 473977 485984 497917 509557 520552 530570 539271 546299 551664 556191 561291 568050 576567 586178
53518 586178 596242 606659 617775 629942 643263 657772 673761 691705 711703 733047 754556
53507 754556 775494 796201 817670 840406 863698 886232 907469 928109 949088 970474 991734
53496 991734 1012693 1033600 1054332 1074262 1093059 1111000 1128323 1144836 1160514 1175982 1191984
53485 1191984 1208680 1225739 1242819 1259750 1276574 1293549 1310763 1327702 1343713 1358920 1373777
53474A373777J3682J0311N688K419J558J498L82j826m269o776r467j1874j3433
53461A361670j4278j4679j4464j3695j3324j4246j6139j7950j9095j9658j9885
53450A184257k0112k0669k1305k1258k0366j9486j9189j8836j7607j5762j3982
53439I75685j2233j0219q328p063o065m781l580l068k732j561K44J565K179K970
53425I23013M275N383N957O647P922R376J0688J2193J3960J5297J5876J6541J8227
53412A065355K0658K2876K4573K6207K8126L0202L2164L3788L4933L5737L6672
53401A391291L8091L9939M2082M4560M7149M9126M9976N0151N0569N1495N2338
53390A906767N2593N2398N2139N1889N1522N1049N0471M9480M7611M4804M1514
$$ plain form
53474 1373777 1387459 1397770 1403458 1405877 1407435 1408933 1409315 1407489 1403220 1396444 1386977 1375103 1361670
53461 1361670 1347392 1332713 1318249 1304554 1291230 1276984 1260845 1242895 1223800 1204142 1184257
53450 1184257 1164145 1143476 1122171 1100913 1080547 1061061 1041872 1023036 1005429 989667 975685
53439 975685 963452 953233 944905 937842 931777 926996 923416 920348 917616 916055 916299 917864 920043 923013
53425 923013 927288 932671 938628 945275 953197 962573 973261 985454 999414 1014711 1030587 1047128 1065355
53412 1065355 1086013 1108889 1133462 1159669 1187795 1217997 1250161 1283949 1318882 1354619 1391291
53401 1391291 1429382 1469321 1511403 1555963 1603112 1652238 1702214 1752365 1802934 1854429 1906767
53390 1906767 1959360 2011758 2063897 2115786 2167308 2218357 2268828 2318308 2365919 2410723 2452237
53379B452237L8279L5265L2360K9461K6485K3213J9431J5164J0563N611K07n491
53367B682785j1170j6811k2670k8800l4888m0574m5516m9205n1327n2358n3155
53356B276311n3697n3093n1135m9025m7863m7216m5998m4148m2432m1120l9974
53345A760610l9301l9738m0929m1549m0888l9515l8154l6787l5234l3666l2064
53334A342785k9962k7317k4918k3289k1756j9350j6302j3862j2802j2823j3294
53323A127110j3934j4600j4938j4576j3439j1785j0010q509p506o918o435n721
53311I98739m569k913q44J356L289M688N660O563P624Q709R695J0891J2787J5264
53297A076939J7503J8910J9808K0950K2551K4165K5337K6007K6431K6951K7687
$$ plain form
53379 2452237 2490516 2525781 2558141 2587602 2614087 2637300 2656731 2671895 2682458 2688069 2688276 2682785
53367 2682785 2671615 2654804 2632134 2603334 2568446 2527872 2482356 2433151 2381824 2329466 2276311
53356 2276311 2222614 2169521 2118386 2069361 2021498 1974282 1928284 1884136 1841704 1800584 1760610
53345 1760610 1721309 1681571 1640642 1599093 1558205 1518690 1480536 1443749 1408515 1374849 1342785
53334 1342785 1312823 1285506 1260588 1237299 1215543 1196193 1179891 1166029 1153227 1140404 1127110
53323 1127110 1113176 1098576 1083638 1069062 1055623 1043838 1033828 1025319 1017813 1010895 1004460 998739
53311 998739 994170 991257 990413 991769 995058 999746 1005406 1011969 1019593 1028302 1037997 1048888 1061675 1076939
53297 1076939 1094442 1113352 1133160 1154110 1176661 1200826 1226163 1252170 1278601 1305552 1333239
53286A333239K8160K7510K5548K3268K1738K0671J8830J5804J2510R802P372M523
53274A548975J354j448l672n756q043j0368j2495j4559j6835j9233k1256k2526
53262A414138k3167k3593k3988k4280k4500k4778k4904k4405k3389k2765k3151
53251A151218k3987k4352k4307k4621k5381k5789k5434k4881k4715k4777k4710
53240H78264k4586k4548k4368k3844k3195k2561k1482j9427j6618j3892j1825
53229F51918j0381r316q569q214q290q654q985r018q891r077r877j1118j2401
53216E29127j3372j3704j3140j1795j0292r266q822q525p869o755n598m957m951
53203D10081n075m868m549m675n205n452n044m451m283m481m470l926l069k354
$$ plain form
53286 1333239 1361399 1388909 1414457 1437725 1459463 1480134 1498964 1514768 1527278 1537080 1544452 1548975
53274 1548975 1550329 1548881 1545209 1539453 1531410 1521042 1508547 1493988 1477153 1457920 1436664 1414138
53262 1414138 1390971 1367378 1343390 1319110 1294610 1269832 1244928 1220523 1197134 1174369 1151218
53251 1151218 1127231 1102879 1078572 1053951 1028570 1002781 977347 952466 927751 902974 878264
53240 878264 853678 829130 804762 780918 757723 735162 713680 694253 677635 663743 651918
53229 651918 641537 632221 623652 615438 607148 598494 589509 580491 571600 562523 552646 541528 529127
53216 529127 515755 502051 488911 477116 466824 457558 448736 440211 432342 425587 419989 415032 410081
53203 410081 405006 400138 395589 390914 385709 380257 375213 370762 366479 361998 357528 353602 350533 348179
53189C48179k137k465l068l595l923m109m108l721k906j943j271j225j749k163
53175C09796j602l9J350J404L68n27o64m36j88K67R06J211J032R33J236J410R58
53158C17415K51n8M8K10L28M29L31j2k17q3Rk75o08o15o00r74j378j219p35p04
53138C11543j224j606j444j039p55n83m05j92J36N47O73K18m96q93r59j099j255
53121C01167q74J41J075J243P11K7l85l73k7L48M63L58K68K64K93M41P16P10k2
53102C06544j241k136k203j657j004o75r75j782k280j708m20L93J86m43q41j085
53086B88673j302j090k67M37K83l58n11j4L78J75l52q23j150j182o55J80M68k01
53068B82689j139j371q58l27j36Q0N72R57Q61O44R44J731K294K121J441P89M91
$$ plain form
53189 348179 346042 343577 340509 336914 332991 328882 324774 321053 318147 316204 314933 313708 311959 309796
53175 309796 308194 308155 309505 310909 311277 310750 310086 309650 309462 309729 310635 311846 312878 313811 315047 316457 317415
53158 317415 317666 317608 317656 317866 318194 318623 318954 318942 318725 318642 318651 318376 317768 317153 316553 315579 314201 312982 312247 311543
53138 311543 310319 308713 307269 306230 305475 304892 304487 304295 304431 304978 305651 305869 305373 304480 303521 302422 301167
53121 301167 300293 300434 301509 302752 303463 303490 303105 302732 302705 303053 303516 303874 304142 304406 304699 305140 305856 306566 306544
53102 306544 305303 303167 300964 299307 298303 297628 296653 294871 292591 290883 290463 290856 291042 290599 289758 288673
53086 288673 287371 286281 286014 286451 286734 286376 285865 285851 286229 286404 286052 285229 284079 282897 282242 282422 282890 282689
53068 282689 281550 280179 279321 278994 278858 278938 279510 280467 281328 281972 282916 284647 286941 289062 290503 291292 291783
53051B91783O01J000J349J333J110J246J926K579K578K022J430R05K07n88j077
53036C08404j262j641k334k708k238j421j287k117l139l486l106k486j841r75
53022B78363Q8Q55R75P72Q07J054J031O64N05Q54J233J086N45J20l2q3p6Qo3m24
53002B88282o49k15O30J062P51J31m19j031j772k224k008j277m35L22Q38Q29K89
52985B83104j73J26J152K259K955L225L152K687J850R62L93J90J35J06K24N82
52969C02929R62J092J052J180J540J822J874J967K266K396J971J229P21N47M14
52954C23962K43J44r6p94j640j896j485j200j560k078k121j845j814k033k028
52939C03759j643j249j142j210j164r23p01p77j098j185p16j44k16q46j119o81
$$ plain form
53051 291783 292384 293384 294733 296066 297176 298422 300348 302927 305505 307527 308957 309862 310069 309481 308404
53036 308404 307142 305501 303167 300459 298221 296800 295513 293396 290257 286771 283665 281179 279338 278363
53022 278363 278451 279306 280281 281053 281860 282914 283945 284609 285114 285968 287201 288287 288832 288952 288920 288837 288761 288769 288706 288282
53002 288282 287633 287418 288048 289110 289861 289992 289573 288542 286770 284546 282538 281261 280826 281148 281986 282815 283104
52985 283104 282931 283057 284209 286468 289423 292648 295800 298487 300337 301299 301692 301882 302017 302123 302347 302929
52969 302929 303891 304983 306035 307215 308755 310577 312451 314418 316684 319080 321051 322280 323001 323548 323962
52954 323962 324205 324349 324253 323459 321819 319923 318438 317238 315678 313600 311479 309634 307820 305787 303759
52939 303759 302116 300867 299725 298515 297351 296428 295727 294950 293852 292667 291951 291807 291591 290745 289626 288945
52923B88945l89j006j897j841p73K05M00J70o9m39r30r01P7J357J876J441Q27
52906B87053O43O36K49n27j172j316j084p73m45k5M03O53P34Q47J068J302J571
52889B89817J973K283J959Q43m87j334j616j634j460j068p70r71j487j677j271
52874B83100o10m0L97N52J32o62j018n29J42J38l61m36J93Q21R03Q87J476K472
52856B87557K938K427J587J312J639J764J099q5j151j929k708l558m020l676k809
52841B80387k196k312k825l003k442j433n73j79q4M1L03N61O86O81O60P91J204
52824B70267J810K270K275J806J023N8q88j442j397j116j132j359j199n34PO4
52808B70513K49J198K447K972K693K546L022L484L126K019P44l94j366k050k401
$$ plain form
52923 288945 288556 287550 285653 283812 283039 283244 283644 283814 283745 283306 282376 281475 281552 282909 284785 286226 287053
52906 287053 287696 288332 288581 288054 286882 285566 284482 283709 283264 283239 283642 284295 285029 285876 286944 288246 289817
52889 289817 291790 294073 296032 296875 296388 295054 293438 291804 290344 289276 288506 287535 286048 284371 283100
52874 283100 282490 282450 282847 283399 283531 282869 281851 281322 281464 281602 281241 280805 280998 281819 282722 283609 285085 287557
52856 287557 290495 292922 294509 295821 297460 299224 300323 300238 299087 297158 294450 290892 286872 283196 280387
52841 280387 278191 275879 273054 270051 267609 266176 265603 265424 265340 265381 265684 266245 266931 267612 268272 269063 270267
52824 270267 272077 274347 276622 278428 279451 279509 278621 277179 275782 274666 273534 272175 270976 270442 270449 270513
52808 270513 270762 271960 274407 277379 280072 282618 285640 289124 292250 294269 295013 294619 293253 291203 288802
52793B88802k703l163l476l251k668k219j937j445p49l61n23p56m78K48Q12P13
52777B66846m0r08j179n38N83J410J629J546J450J200O11q9n15n79m96m20l63
52760B70148k76n3M45J166J782J971J733J239O52J70M3L07O31O96N47M06L35L46
52742B82288N91J106J463J111K9j136j698j473q45m00m25n93k87N96J468J855
52726B83650K005K259K251J417J10n94l14K11K18j53l98m42m01r0O14J171Q51
52709B92365k66j224j287o88j77j09k20j53L9Q6jJ56P73J547K054K297K537K706
52691C00435K546K263K464L176L445K377K89j595k399k181j501q28l76j53o7j51
52675C07744o07j403k041k032j563j248j246j064l57M75Q58Q36Q73J051R22K59
$$ plain form
52793 288802 286099 282936 279460 276209 273541 271322 269385 267940 267191 266830 266307 265551 265073 265321 266133 266846
52777 266846 266806 265898 264719 264181 264764 266174 267803 269349 270799 271999 272610 272521 272006 271427 270931 270511 270148
52760 270148 269872 269819 270264 271430 273212 275183 276916 278155 278807 278977 279020 279327 279958 280654 281201 281607 281942 282288
52742 282288 282879 283985 285448 286559 286588 285452 283754 282281 281436 281036 280611 280018 279731 280327 281795 283650
52726 283650 285655 287914 290165 291582 291692 291098 290784 290995 291213 291060 290662 290220 289819 289729 290343 291514 292365
52709 292365 292099 290875 289588 288900 288723 288614 288394 288241 288280 288366 288365 288521 289294 290841 292895 295192 297729 300435
52691 300435 302981 305244 307708 310884 314329 316706 316995 315400 313001 310820 309319 308491 308115 307962 307895 307744
52675 307744 307137 305734 303693 301661 300098 298850 297604 296540 296183 296658 297516 298352 299225 300276 301198 301457
52659C01457n44r67r62p41l19L68J037J284J183J181J376J398J151J054J222J045
52643C10223Q0j130j774j891k051k229j929j231p88o90l13N00J057J021J090J879
52627C01824K932L467L477L394L248K956K888L279L387K283K43j493k320k717
52613C26848l015k786j821r01r49j796k378k019j082m32m98r29j080p38k81r8
52597C06045q5J00N22J024J572K069K056J199L6l37M18J380J502Q36L17N68J298
52580C20520J785J656J157P97Q18R98R85O82K68n3j98k12k64n24r06j106j022
52563C25381q65o93k44M20N74k63j437j870j540j382j773k002j400k36Q49J544
52547C15063J695J123J48l68NO60Q82Q82J244J774J664O74m67r04m28N18J221
$$ plain form
52659 301457 300913 299946 298984 298243 297924 298292 299329 300613 301796 302977 304353 305751 306902 307956 309178 310223
52643 310223 310303 309173 307399 305508 303457 301228 299299 298068 297280 296590 296277 296777 297834 298855 299945 301824
52627 301824 304756 308223 311700 315094 318342 321298 324186 327465 330852 333135 333378 331885 329565 326848
52613 326848 323833 321047 319226 318325 317376 315580 313202 311183 310101 309669 309171 308242 307162 306424 306143 306045
52597 306045 305960 306060 306582 307606 309178 311247 313303 314502 314538 314201 314619 315999 317501 318337 318654 319222 320520
52580 320520 322305 323961 325118 325915 326733 327731 328716 329398 329666 329613 329415 329203 328939 328415 327509 326403 325381
52563 325381 324516 323823 323579 323999 324573 324310 322873 321003 319463 318081 316308 314306 312906 312670 313519 315063
52547 315063 316758 317881 318029 317661 317666 318326 319208 320090 321334 323108 324772 325446 324979 324075 323647 324165 325386
52530C25386J146L71m45p27m77K2O28J094Q81j78j269j370n31K04J86k26l90n3
52512C24252Q05K118L469M222M258M105M059L702K677J472Q29O20m6j643l626
52497C51273n036n379m866m023l268k678k101j477r71p11n75m02l00m79q00p72
52481C17435j40O96J063P99M93P62J450J753J265N93N70J108J332R31P13J467
52465C32290K780L614L751L887M335M502L913L038K569K317J548J38j333k524
52451C64825l702m958n780n704m956m018k987j862j091j187j853k160j725j149
52437C21693j029j067n55M79J214R89K5q97j200r03m08l6K51O52J144J375J077
52420C22804L44m94j093j111l26R85K007K123J599J224J364J757K211K990M439
$$ plain form
52530 325386 326532 326903 326458 325731 325254 325276 325904 326998 327879 327701 326432 325062 324531 324735 324921 324695 324305 324252
52512 324252 325057 327175 330644 334866 339124 343229 347288 350990 353667 355139 355968 356588 356542 354899 351273
52497 351273 346237 340858 335992 331969 328701 326023 323922 322445 321474 320763 320188 319786 319486 319007 318207 317435
52481 317435 317295 317991 319054 319853 320346 321108 322558 324311 325576 326169 326739 327847 329179 330110 330823 332290
52465 332290 335070 338684 342435 346322 350657 355159 359072 362110 364679 366996 368544 368682 367349 364825
52451 364825 361123 356165 350385 344681 339725 335707 332720 330858 329767 328580 326727 324567 322842 321693
52437 321693 320664 319597 319042 319521 320735 321724 321749 320852 319652 318749 318341 318305 318556 319208 320352 321727 322804
52420 322804 323148 322654 321561 320450 320124 321109 323116 325239 326838 328062 329426 331183 333394 336384 340823
52405C40823O546R039J1609J3855J5294J5624J4797J2735R378N138R29k605n651
52392D47511q619j1238j2696j2578j1254r343p256n312l838k880k101j194k64
52379C58938L91P00Q79J158J642K311L031L632M162M948O164P289P367O011M044
52364D12667K751K468K277J227m65j840k473k691k628j922o72J70J5l40J93J269
52348D10006J524O16k74j66N23R99J331J956K670L027L274L932M794N172N099
52333D44483N345O215P210P986Q903J0276J1795J3058J4119J5117J5831J6116
52321E76454J6379J7069J7947J8346J7997J7206J6297J5326J4332J3508J3049
52310G53910J3028J3429J4142J4904J5440J5654J5588J5265J4700J4028J3435
$$ plain form
52405 340823 347369 356408 368017 381872 397166 412790 427587 440322 449700 454838 455767 453162 447511
52392 447511 438892 427654 414958 402380 391126 381783 374527 369215 365377 362497 360396 359202 358938
52379 358938 359329 360029 360908 362066 363708 366019 369050 372682 376844 381792 387956 395245 402612 408623 412667
52364 412667 415418 417886 420163 421390 420925 419085 416612 413921 411293 409371 408699 408869 408884 408544 408737 410006
52348 410006 411530 412146 411872 411706 412229 413228 414559 416515 419185 422212 425486 429418 434212 439384 444483
52333 444483 449828 456043 463253 471239 480142 490418 502213 515271 529390 544507 560338 576454
52321 576454 592833 609902 627849 646195 664192 681398 697695 713021 727353 740861 753910
52310 753910 766938 780367 794509 809413 824853 840507 856095 871360 886060 900088 913523
52299I13523J3037J2810J2562J1925J0570Q608O537M609K507r7k915n266o820
52286I81590p692p994p759p331p318p875q344p883o294m073j849M2J558K829L982
52271I15589M984N697O237P095Q671J0652J2170J2750J2842J3213J3956J4479
52259A038335J4362J3842J3308J2806J2376J2479J3479J4843J5467J4891J3712
52248A189900J2593J1398R612P188M576K128q9k034l622m768n314n109m344l609
52234A208506l288l143k778k285j961j677j089l63p7m02q52r42o15O9J181K609
52218A192893L924M765N163N340N456N632N886N958N560M912M691N288O445P741
52204A269654Q993R959J0214R689R058Q982R244R006P899O472N570N610O401P394
$$ plain form
52299 913523 926560 939370 951932 963857 974427 983035 989572 994181 996688 996591 993676 988410 981590
52286 981590 973898 965904 958145 950814 943496 935621 927277 919394 913100 909027 907178 907220 908778 911607 915589
52271 915589 920573 926270 932507 939602 948273 958925 971095 983845 996687 1009900 1023856 1038335
52259 1038335 1052697 1066539 1079847 1092653 1105029 1117508 1130987 1145830 1161297 1176188 1189900
52248 1189900 1202493 1213891 1223503 1230691 1235267 1237395 1237306 1235272 1231650 1226882 1221568 1216459 1212115 1208506
52234 1208506 1205218 1202075 1199297 1197012 1195051 1193374 1192285 1191922 1191845 1191443 1190591 1189649 1189034 1189103 1190284 1192893
52218 1192893 1196817 1201582 1206745 1212085 1217541 1223173 1229059 1235017 1240577 1245489 1250180 1255468 1261913 1269654
52204 1269654 1278647 1288606 1298820 1308509 1317567 1326549 1335793 1344799 1352698 1359170 1364740 1370350 1376751 1384145
52190A384145Q042Q109P711P057O296N632N289N057M177K013j143m247o510p974
52176A423654r167j0400j1454j1916j1700j1244j1037j0966j0373q909o997n279
52164A304212l913k626j199M88K543M718O215O384N521M475L615K736J809J050
52150A336028J54j515l698n006m557l183k259j910j216K5Q85O66k50j235k311
52135A310618l690m997n643n667n588n491m782k967k54K711N441P860J0151J2572
52121A310274J5286J8262K1330K4272K6825K8695K9694K9821K9176K7822K5943
52110A587400K3857K1764J9563J7161J4791J2701J0738Q688O978O383O977P917
52098A744918Q542R090J0006J1022J1511J1294J0573R236O927L707J08l532p294
$$ plain form
52190 1384145 1392187 1400296 1408007 1415064 1421360 1426992 1432281 1437338 1441515 1443528 1442385 1438138 1431628 1423654
52176 1423654 1414487 1404087 1392633 1380717 1369017 1357773 1346736 1335770 1325397 1316488 1309491 1304212
52164 1304212 1300299 1297673 1296474 1296962 1299505 1304223 1310438 1316822 1322343 1326818 1330433 1333169 1334978 1336028
52150 1336028 1336182 1334667 1330969 1325963 1321406 1318223 1315964 1314054 1312838 1312863 1313748 1314414 1314164 1312929 1310618
52135 1310618 1306928 1301931 1296288 1290621 1285033 1279542 1274760 1271793 1271539 1274250 1279691 1287551 1297702 1310274
52121 1310274 1325560 1343822 1365152 1389424 1416249 1444944 1474638 1504459 1533635 1561457 1587400
52110 1587400 1611257 1633021 1652584 1669745 1684536 1697237 1707975 1716663 1723641 1730024 1737001 1744918
52098 1744918 1753460 1762550 1772556 1783578 1795089 1806383 1816956 1826192 1833119 1836826 1836934 1833402 1826108
52085A826108j1139j4546j6829j7589j6882j5222j3319j1470r256o206k656M73
52073A691467K699M326N747P062Q417J0081J1895J3197J3634J3700J4025J4516
52061A810766J4574J3900J2739J1492J0367R287P941O093M002K282J182L12p51
52048A904186j917k904l852n262p502j0547j3990j7113j9225k0190k0367j9929
52036A761388j8645j6579j4511j3151j2296j1261r913q708p889p207o406n531
52024A629291m742m178m015m347m998n728o548p645q995j0255j0943j0684r561
52011A536652q320p817q084q387q456q989j0491j2318j3599j4594j6247j8705
51999A400645k1289k3679k6099k8340k9640k9740k9182k8342k6956k4860k2413
$$ plain form
52085 1826108 1814969 1800423 1783594 1766005 1749123 1733901 1720582 1709112 1699856 1693650 1690994 1691467
52073 1691467 1694166 1698492 1704239 1711301 1719718 1729799 1741694 1754891 1768525 1782225 1796250 1810766
52061 1810766 1825340 1839240 1851979 1863471 1873838 1883125 1891066 1897159 1901161 1903443 1904625 1904937 1904186
52048 1904186 1902269 1899365 1895513 1890251 1882749 1872202 1858212 1841099 1821874 1801684 1781317 1761388
52036 1761388 1742743 1726164 1711653 1698502 1686206 1674945 1665032 1656324 1648435 1641228 1634822 1629291
52024 1629291 1624549 1620371 1616356 1612009 1607011 1601283 1594735 1587090 1578095 1567840 1556897 1546213 1536652
52011 1536652 1528332 1520515 1512431 1504044 1495588 1486599 1476108 1463790 1450191 1435597 1419350 1400645
51999 1400645 1379356 1355677 1329578 1301238 1271598 1241858 1212676 1184334 1157378 1132518 1110105
51988A110105j9855j7100j4454j2810j2552j2906j2852j2250j1665j1583j2173
51977I59905j3361j4735j5766j6470j7375j8600j9464j9344j8367j6878j4829
51966G74716j2182r307o447l322K02L621O480R035J1482J3139J3217J1962J0171
51953H22767P907M682P01l128o356r302j2009j3819j4163j3157j1167q346m855
51940G39755j100K451N371P313Q413R495J1154J2663J2553J0406P356M579K074
51927H32483p69m126p730j1298j4496j6889j8426j9545k0398k0437j9184j7074
51915F62111j4996j3335j1929j0685r642q666p599o599n769m616k516K78K694
51902E68731M177N480P823J1456J5382J8388K0067K0679K0282J8333J4332Q643
$$ plain form
51988 1110105 1090250 1073150 1058696 1045886 1033334 1020428 1007576 995326 983661 972078 959905
51977 959905 946544 931809 916043 899573 882198 863598 844134 824790 806423 789545 774716
51966 774716 762534 753227 746780 743458 743660 747281 753761 762796 774278 787417 800634 812596 822767
51953 822767 830674 835356 836057 832929 826573 817271 805262 791443 777280 764123 752956 744610 739755
51940 739755 738655 741106 746477 753790 762203 771698 782852 795515 808068 818474 825830 830409 832483
51927 832483 831714 827588 819858 808560 794064 777175 758749 739204 718806 698369 679185 662111
51915 662111 647115 633780 621851 611166 601524 592858 585259 578660 572891 568275 565759 566037 568731
51902 568731 572908 578388 586211 597667 613049 631437 651504 672183 692465 710798 725130 733773
51890G33773K324l806r529j4631j8499k0546k0757j9473j6998j3753j0378p203
51878E80524l805K97M696Q443J1329J4141J7536K1146K4135K6095K7020K6753
51866G58310K4959K1645J7341J2627P622K032m249j0632j5969j9354k0778k0835
51854G52719j9903j7919j4921j1545q662o658n187l645j883m95l52j680l764n657
51840F50448p092q321r309r638r261q738q390p757o303m310k498j043M22J980
51826E70190L185L719L768L534K855J490m61k671m858o728p809p691o335m093
51812E48095j451J175L469N213O279O635O423N874N016L601J497q95k976m638
51798E83317o154p453p970p471o480n586m752l759k905k654k802k715k304k113
$$ plain form
51890 733773 736097 732291 722762 708131 689632 669086 648329 628856 611858 598105 587727 580524
51878 580524 576719 577016 581712 590155 601484 615625 633161 654307 678442 704537 731557 758310
51866 758310 783269 804914 822255 834882 842504 844536 840287 829655 813686 794332 773554 752719
51854 752719 732816 714897 699976 688431 679769 673111 667924 664279 662396 661901 661549 659869 656105 650448
51840 650448 643356 635035 625726 616088 606827 598089 589699 581942 575639 571329 568831 567788 568210 570190
51826 570190 573375 577094 580862 584396 587251 588741 588280 585609 580751 574023 566214 558523 552188 548095
51812 548095 546644 547819 551288 556501 562780 569415 575838 581712 586728 590329 591826 590931 587955 583317
51798 583317 577163 569710 561740 554269 547789 542203 537451 533692 530787 528133 525331 522616 520312 518199
51784E18199k312k275j463k15O67Q11M10k85j159k042k661k826k520j893j160
51769D99276l62Q34K823N412P786R471J0950J2970J5342J6989J7058J5520J2688
51756F26757Q772M148m37m372p689j0719j3394j5257j6020j5822j4917j3418j1437
51743E16195r231p124n312l786k343o86J370L761O266Q707J0950J2821J4190J5073
51729E60851J5428J4821J2698R161N279K279N19n51j544k535l289l770m202m825
51715F00320n674o513o904o500n414m218l419l033k763k418j951j176K06K208
51701E52751M368O183P630R067J0627J1777J1612R708O637L628J610O76M38O53
51687F37365J297K126K541J994L12k371n781r412j2446j4068j3914j2222r585
$$ plain form
51784 518199 515887 513612 512149 511934 512601 513412 513822 513537 512378 510336 507675 504849 502329 500436 499276
51769 499276 498914 499748 502571 507983 515769 525240 536190 549160 564502 581491 598549 614069 626757
51756 626757 635529 639677 639240 634868 627179 616460 603066 587809 571789 555967 541050 527632 516195
51743 516195 506964 499840 494528 490742 488399 487713 489083 492844 499110 507817 518767 531588 545778 560851
51729 560851 576279 591100 603798 612959 618238 620517 621036 620485 618941 616406 613117 609347 605145 600320
51715 600320 594646 588133 581229 574729 569315 565097 561678 558645 555882 553464 551513 550337 550543 552751
51701 552751 557119 563302 570932 579999 590626 602403 614015 623723 630360 633988 635598 636274 636712 637365
51687 637365 638662 640788 643329 645323 645635 643264 637483 628071 615625 601557 587643 575421 565836
51674E65836o613l684r38J504L332M260M408M319M416M622M644M472M383M523
51660E99484M640M221K830M26k546n472q031j0077j1022r872o339j678K248M741
51646E63553O529Q219R205Q404N579J436l189p695j1479j3981j5097j5247j4869
51633E21368j4150j3130j1809j0108p979n676l681k281j352o02J64R97J841K418
51619D56020K351J500K01r31j410j124l76L39P04Q10R19J051J051Q71N74O0p70
51602D61840j538j568p71J17N30R41K210M417O918R383J2033J4802J6905J7613
51588E43832J6977J5465J3187R873N466M71m171p409q559p765n867l580r40K362
51574E69342O292J0419J4341J7856K0958K4055K7908L2846L7994M1879M4004M5401
$$ plain form
51674 565836 559223 555539 554601 556105 559437 563697 568105 572424 576840 581462 586106 590578 594961 599484
51660 599484 604124 608345 611175 611601 609055 603583 595552 585475 574453 564581 558242 556564 558812 563553
51646 563553 570082 578301 587506 595910 601489 602925 599736 592041 580562 566581 551484 536237 521368
51633 521368 507218 494088 482279 472171 464192 458516 454835 452554 451202 450600 450764 451761 453602 456020
51619 456020 458371 459871 460072 459141 457731 456607 456231 456570 457274 458084 459003 460054 461105 461976 462550 462610 461840
51602 461840 460302 458734 457963 458080 458610 459551 461761 466178 473096 482479 494512 509314 526219 543832
51588 543832 560809 576274 589461 599334 604800 605271 601100 593691 585132 577367 571500 567920 566980 569342
51574 569342 575634 586053 600394 618250 639208 663263 691171 724017 762011 803890 847894 893295
51562H93295M7380N0116N2735N4510N5583N6708N8541O1111O3601O4599O2755
51551A520934N7305M7974L4680J7716j790k1929m0771n7083p0360q0363q6784
51540A319529q9306q7963q3382p6632o8733o0315n1786m3583l6084k9402k3563
51529F68780j8773j5248j2818j1060r824r180q827q062o711n526n175n217m749
51516E47610l804l335l705m152m016l703l840m050l490k349j887k785m165m617
51502D97712l802k670k288k776l359l298k605j925j592j127J61K118L780M473
51488D82802M503M556M809M864M330L171J653K08q36j631k708m206n482n803n313
51473D84917m852m845m860m358l443k655k288k228k224k092j684r51p4O29J045
$$ plain form
51562 893295 940675 990791 1043526 1098036 1153619 1210327 1268868 1329979 1393580 1458179 1520934
51551 1520934 1578239 1626213 1660893 1678609 1676819 1654890 1614119 1557036 1486676 1406313 1319529
51540 1319529 1230223 1142260 1058878 982246 913513 853198 801412 757829 721745 692343 668780
51529 668780 650007 634759 621941 610881 601057 591877 583050 574988 568277 562751 557576 552359 547610
51516 547610 543806 540471 536766 532614 528598 524895 521055 517005 513515 511166 509279 506494 502329 497712
51502 497712 493910 491240 488952 486176 482817 479519 476914 474989 473397 472270 472431 474549 478329 482802
51488 482802 487305 491861 496670 501534 505864 509035 510688 510896 510060 508429 505721 501515 496033 490230 484917
51473 484917 480065 475220 470360 466002 462559 459904 457616 455388 453164 451072 449388 448437 448363 448992 450037
51458D50037J435K149L182M029M134L420K340J422Q99P19P19P06O39Q09J733L694
51442D82066O566J0079J3932J7510J9878K0529J9851J8445J6233J2749Q192L588
51430F49618j83l003n011o098o243o052o484q078j0521j2906j4321j4386j3287
51417E43045j1357q795n982l748k706k452j994r95L3Q56J979L619N024N412N024
51402E26963M565M100L274K274J660J445J199J035J595K919M171M852N515O843
51388E72410Q662J0437J2328J5043J8925K3759K9405L6061M3856N2602O2088P2210
51376I57786Q2581R2189R9649J03832J04205J00711R3388Q2075O6485M6631K3321
51365A852853j702k6142m7930o5892p9848r0090r6700r9496r8530r4438q8174
$$ plain form
51458 450037 451472 453621 456803 460832 464966 468386 470726 472148 473047 473766 474485 475191 475830 476639 478372 482066
51442 482066 488632 498711 512643 530153 550031 570560 590411 608856 625089 637838 646030 649618
51430 649618 649435 646432 641421 635323 629080 623028 616544 608466 597945 585039 570718 556332 543045
51417 543045 531688 522893 516911 513163 510457 508005 506011 505016 505049 505905 507884 511503 516527 521939 526963
51402 526963 531528 535628 538902 541176 542836 544281 545480 546515 548110 551029 555200 560052 565567 572410
51388 572410 581072 591509 603837 618880 637805 661564 690969 727030 770886 823488 885576 957786
51376 957786 1040367 1132556 1232205 1336037 1440242 1540953 1634341 1716416 1782901 1829532 1852853
51365 1852853 1851151 1825009 1777079 1711187 1631339 1541249 1444549 1345053 1246523 1152085 1063911
51354A063911q0502p1925o2989n4433m6827m0213l4209k8536k3374j9183j6264
51343E85456j4504j3502j2785j1969j0906r784q966q512q013p029n642m339l383
51330D66122k575j718j000o98p25p35o11n33n90n81l48n7Q5J53M03Q44J164J145
51312D59745R48R02J105J326J336J213J294J780K405K623K188J462J007R04P80
51297D81018L84j63p75j703l131m747o014o679o720o025m564k781j329l89L70
51282D36752J139J747K277L286N030O791P473O791N516M633M483M682M622M043
51268D99265L243K816L067L742M338M484M071L223K291J611J037k4j878m009n574
51253E21703o317o636o849o791o266n590n353n722o177o076n363m531l840k895
$$ plain form
51354 1063911 983409 911484 848495 794062 747235 707022 672813 644277 620903 601720 585456
51343 585456 570952 557450 544665 532696 521790 512006 503040 494528 486515 479486 473844 469505 466122
51330 466122 463547 461829 460829 460131 459406 458671 458060 457527 456937 456356 456008 455951 456036 456189 456592 457436 458600 459745
51312 459745 460693 461595 462700 464026 465362 466575 467869 469649 472054 474677 476865 478327 479334 480238 481018
51297 481018 481402 481239 480464 478761 475630 470883 464869 458190 451470 445445 440881 438100 436771 436382 436752
51282 436752 437891 439638 441915 445201 450231 457022 464495 471286 476802 481435 485918 490600 495222 499265
51268 499265 502508 505324 508391 512133 516471 520955 525026 528249 530540 532151 533188 533164 531286 527277 521703
51253 521703 515386 508750 501901 495110 488844 483254 477901 472179 466002 459926 454563 450032 446192 443297
51239D43297j334L31J112Q07L27M95J085J332R92M28J0r8J54N54O37L03J44O86
51221D51262J526J870J629J373J325J178Q57O43M44k26j315j984j657o51N47J935
51205D58756L396M207L915L266L426M461N275N044M036K957K083J335P22L81L24
51190E03584L82L49J40j42k65j20J50L00K85K69M00O24O92L62l43j019j268j171
51172E03209j227j668k100k044j524q97l18K25N25L29j43k68J76O97P42L91P5
51155D96180q8m13j189k323l454m141m117l567l120l234l599l471k714k088k227
51140D56435k629k219p93O44J141R30R10J372J743J532R98P12Q49J163J417J532
51124D65737J395R09K91J9L63J077J760K301K761K979K725K293K422L417M708
$$ plain form
51239 443297 441963 442294 443406 444213 444540 445035 446120 447452 448444 448872 448882 448784 448938 449492 450129 450432 450576 451262
51221 451262 452788 454658 456287 457660 458985 460163 461020 461663 462107 461881 460566 458582 456925 456274 456821 458756
51205 458756 462152 466359 470274 473540 476966 481427 486702 491746 495782 498739 500822 502157 502879 503260 503584
51190 503584 503966 504315 504455 504313 504048 503928 504078 504378 504663 504932 505332 505956 506648 507010 506667 505648 504380 503209
51172 503209 501982 500314 498214 496170 494646 493749 493431 493656 494181 494510 494367 494099 494275 494972 495714 496105 496180
51155 496180 496092 495679 494490 492167 488713 484572 480455 476888 473768 470534 466935 463464 460750 458662 456435
51140 456435 453806 451587 450794 451438 452579 453509 454419 455791 457534 459066 460064 460776 461625 462788 464205 465737
51124 465737 467132 468041 468332 468351 468714 469791 471551 473852 476613 479592 482317 484610 487032 490449 495157
51109D95157N572N887N799N116L714K219J399R95P9j355k175j835j269j446j923
51094E15934j815j457j909l139l869l332k156j337j079r40n34J88R10J119P05
51079D97289L54Q14J823K423K313K165K489K945L073K971K870K611K070J639J783
51064E29632K433L206M014N128O746Q722J0570J1722J1976J1684J1169J0128Q126
51051F35256N562L561K857L444N269Q366J2087J5084J6525J6692J6084J4704J2649
51038G68140J0607R061P628N746L545J415p03l124n966r393j3596j8059k1590
51025G33711k3690k5030k5910k5252k2260j8155j4803j2184q827m480p09J335
51013E53746K230L083M205N445O723P743Q056P896Q183R259J0407J0926J0895
$$ plain form
51109 495157 500729 506616 512415 517531 521245 523464 524863 525858 525937 524582 522407 520572 519303 517857 515934
51094 515934 514119 512662 510753 507614 503745 500413 498257 496920 495841 494901 494367 494555 495465 496584 497289
51079 497289 497643 498457 500280 502703 505016 507181 509670 512615 515688 518659 521529 524140 526210 527849 529632
51064 529632 532065 535271 539285 544413 551159 559881 570451 582173 594149 605833 617002 627130 635256
51051 635256 640818 644379 647236 650680 655949 664315 676402 691486 708011 724703 740787 755491 768140
51038 768140 778747 787808 795436 801182 804727 806142 805439 802315 796349 786956 773360 755301 733711
51025 733711 710021 684991 659081 633829 611569 593414 578611 566427 557600 553120 552411 553746
51013 553746 555976 559059 563264 568709 575432 583175 591231 599127 607310 616569 626976 637902 648797
51000F48797J0538R703Q523P754P809Q082P929P696Q138R257J0415J1280J1994
50987G67915J2658J3264J4024J5214J6682J7918J8510J8410J7896J7536J7759
50976I47786J8213J7792J5832J2930J0168P767N171K340K24j89J183L861P620
50963A050698J2511J8233K4021K9316L4227L9024M3453M6939M9382N1197N2480
50952A451481N2685N1449M9318M7078M4823M2220L9459L7168L5531L4306L3668
50941A919186L4209L5835L7440L8058L7697L6666L4702L1318K6630K1241J5578
50930B268560R809M198r84n849j0856j6440k2881l0270l8293m6165n3123n9036
50918A998670o4313o9207p3370p6024p6536p4911p1800o7902o3456n8432n3111
$$ plain form
51000 648797 659335 669038 677561 685315 693124 701206 709135 716831 724969 734226 744641 755921 767915
50987 767915 780573 793837 807861 823075 839757 857675 876185 894595 912491 930027 947786
50976 947786 965999 983791 999623 1012553 1022721 1030488 1035659 1037999 1038223 1038034 1039217 1043078 1050698
50963 1050698 1063209 1081442 1105463 1134779 1169006 1208030 1251483 1298422 1347804 1399001 1451481
50952 1451481 1504166 1555615 1604933 1652011 1696834 1739054 1778513 1815681 1851212 1885518 1919186
50941 1919186 1953395 1989230 2026670 2064728 2102425 2139091 2173793 2205111 2231741 2252982 2268560
50930 2268560 2278369 2282567 2281583 2275734 2264878 2248438 2225557 2195287 2156994 2110829 2057706 1998670
50918 1998670 1934357 1865150 1791780 1715756 1639220 1564309 1492509 1424607 1361151 1302719 1249608
50907A249608m8014m3306l8706l4151l0097k6904k4294k1687j8860j6103j3905
50896I33581j2581j1880j0983r262p171n866n767o004n629m771m193m148m193
50883H41133l871l047j770k58J136K209L118L974M597M848M962N170N317N309
50869H72827N531O429P873R380J0743J2039J3258J4390J5641J7097J8444J9555
50857A023207K1003K3397K6423K9257L1876L5169L9746M5356N1547N8176O5031
50846A450188P1713P8221Q5159R2846J00675J07769J13903J19269J23609J26148
50836B469500J26405J24564J20926J15309J07276R6835Q4738P2076N9722M8267
50826C425618L8293L0504K5513K3629K4831K8713L4480M1343M9016N7454O5818
$$ plain form
50907 1249608 1201594 1158288 1119582 1085431 1055334 1028430 1004136 982449 963589 947486 933581
50896 933581 921000 909120 898137 888875 881704 875838 870071 864067 858438 853667 849474 845326 841133
50883 841133 837262 834215 832445 832187 833323 835532 838650 842624 847221 852069 857031 862201 867518 872827
50869 872827 878358 884787 892660 902040 912783 924822 938080 952470 968111 985208 1003652 1023207
50857 1023207 1044210 1067607 1094030 1123287 1155163 1190332 1230078 1275434 1326981 1385157 1450188
50846 1450188 1521901 1600122 1685281 1778127 1878802 1986571 2100474 2219743 2343352 2469500
50836 2469500 2595905 2720469 2841395 2956704 3063980 3160815 3245553 3317629 3377351 3425618
50826 3425618 3463911 3494415 3519928 3543557 3568388 3597101 3631581 3672924 3721940 3779394 3845212
50815C845212P2078P4086P0883O2651M9653L1880R779j5264m1460o7450r2452
50804C999596j15866j36887j54531j67922j76615j80531j79756j74598j65993
50795B546897j55298j43391j30227j15729j00738q6492p3362o0897m9037l8536
50785A593190k9867k2580j6162j0928p441n449m129l299l645n539q179j0232j1093
50772A454647j1257j1580j2528j4052j5830j7503j8815j9801k0776k2013k3420
50761A267072k4654k5413k5520k4860k3515k1899k0320j8546j6208j3663j1798
50750A040676j0749r446o998l942j485L02K625O317J0734J4537J7145J9134K1547
50737A100397K4945K9017L2947L6250L9212M2394M5929M9487N2789N5715N8123
$$ plain form
50815 3845212 3917290 3991376 4062259 4124910 4174563 4206443 4216222 4200958 4159498 4092048 3999596
50804 3999596 3883730 3746843 3592312 3424390 3247775 3067244 2887488 2712890 2546897
50795 2546897 2391599 2248208 2117981 2002252 1901514 1815022 1741660 1680763 1631726 1593190
50785 1593190 1563323 1540743 1524581 1513653 1506212 1500763 1496634 1493335 1489690 1484151 1475972 1465740 1454647
50772 1454647 1443390 1431810 1419282 1405230 1389400 1371897 1353082 1333281 1312505 1290492 1267072
50761 1267072 1242418 1217005 1191485 1166625 1143110 1121211 1100891 1082345 1066137 1052474 1040676
50750 1040676 1029927 1020481 1013483 1009541 1008056 1008358 1010983 1017300 1028034 1042571 1059716 1078850 1100397
50737 1100397 1125342 1154359 1187306 1223556 1262768 1305162 1351091 1400578 1453367 1509082 1567205
50726A567205N9959O1468O2889O3992O4434O4516O4943O5613O5190O2280N6754
50715B259243M9567M1558L2778K2943J2282J906o612j2166j4674j4678j2499p994
50703B351654j135P434J6553K5125L2471L8211M1905M2815M0212L3935K4401J1912
50691B665493l592k1678m0662n8324p3327q5473r4627j00168j01649r9458r4491
50680A892044q7570p9318p0177o0294m9727l8869k8372j8510r019K17Q768J6129
50668A475302K2233K7238L1103L3680L4909L4708L2884K9497K5110K0523J6345
50657A783532J2900J0241Q189O566N563N435N810N722M619L037J924J687K157
50644A857382L253N212Q263J2353J7112K1994K6584L0896L5136L9172M2615M5499
$$ plain form
50726 1567205 1627164 1688632 1751521 1815513 1879947 1944463 2009406 2075019 2140209 2202489 2259243
50715 2259243 2308810 2350368 2383146 2406089 2418371 2420277 2413665 2401499 2386825 2372147 2359648 2351654
50703 2351654 2350519 2357953 2374506 2399631 2432102 2470313 2512218 2555033 2595245 2629180 2653581 2665493
50691 2665493 2661901 2640223 2599561 2541237 2467910 2382437 2287810 2187642 2085993 1986535 1892044
50680 1892044 1804474 1725156 1654979 1594685 1544958 1506089 1477717 1459207 1450188 1450405 1459173 1475302
50668 1475302 1497535 1524773 1555876 1589556 1624465 1659173 1692057 1721554 1746664 1767187 1783532
50657 1783532 1796432 1806673 1814862 1821428 1826991 1832426 1838236 1843958 1848577 1851614 1853538 1855225 1857382
50644 1857382 1860635 1865847 1874110 1886463 1903575 1925569 1952153 1983049 2018185 2057357 2099972 2145471
50632B145471M8454N1945N5721N9232O2055O3531O2481N7926M9980L9559K7230
50621B723585J2798l853k1708l8459n1482n9236o1822o0141n4794m6249l5859
50610B302780k5659j6867r338k940J478L166K731J216j565o711j4394k3450l2778
50597B177669m2121n1193n9006o4611o8016o9862p0564p0031o8059o4628o0023
50586A489555n4794m9548m4693m0408l6634l2906k8501k3217j7855j3430j0058
50575A137511p005l678k6L824P642J0796J2676J3529J4135J4519J3751J1406Q524
50562A237604O546N817N774O150P293R464J2445J5893J9634K3531K7345L0732
50550A408228L3282L4635L4775L4092L2952L1282K8835K5748K2633K0144J8599
$$ plain form
50632 2145471 2193925 2245870 2301591 2360823 2422878 2486409 2548890 2606816 2656796 2696355 2723585
50621 2723585 2736383 2732530 2710822 2672363 2620881 2561645 2499823 2439682 2384888 2338639 2302780
50610 2302780 2277121 2260254 2250916 2247976 2249454 2252620 2255351 2256567 2255002 2248291 2233897 2210447 2177669
50597 2177669 2135548 2084355 2025349 1960738 1892722 1822860 1752296 1682265 1614206 1549578 1489555
50586 1489555 1434761 1385213 1340520 1300112 1263478 1230572 1202071 1178854 1160999 1147569 1137511
50575 1137511 1130506 1126828 1126802 1130626 1138268 1149064 1161740 1175269 1189404 1203923 1217674 1229080 1237604
50562 1237604 1244150 1249967 1255741 1261891 1269184 1278648 1291093 1306986 1326620 1350151 1377496 1408228
50550 1408228 1441510 1476145 1510920 1545012 1577964 1609246 1638081 1663829 1686462 1706606 1725205
50539A725205J7968J8144J9162K1253K4549K8765L3306L7818M2405M7310N2641
50528B068526N8502O5032P2074P9084Q5724R2214R8701J04471J08383J10062J10062
50517C052835J08681J05164R8618Q9312P8426O6523N2901L6728J8410n74j8993
50506C688031l6450n2719o7097p8760q7433r3236r6019r5223r0479q1998p0376
50495B838241n6332m0651k4152p506Q707K3643L6073M4736M8736M7519M0723K8354
50483B988091J1109r534l1722n3689p4038r1630j05296j13942j17197j16000j12259
50472B173893j07549j02213r5751q8010p9786p2164o5505n9319n3198m7533m3012
50461A359853l9566l6251l2283k7815k3488j9622j6137j2983j0133p326m304j250
$$ plain form
50539 1725205 1743173 1761317 1780479 1801732 1826281 1855046 1888352 1926170 1968575 2015885 2068526
50528 2068526 2127028 2192060 2264134 2343218 2428942 2521156 2619857 2724328 2832711 2942773 3052835
50517 3052835 3161516 3266680 3365298 3454610 3533036 3599559 3652460 3689188 3707598 3707024 3688031
50506 3688031 3651581 3598862 3531765 3453005 3365572 3272336 3176317 3081094 2990615 2908617 2838241
50495 2838241 2781909 2741258 2717106 2709600 2718307 2741950 2778023 2822759 2871495 2919014 2959737 2988091
50483 2988091 2999200 2989666 2957944 2904255 2830217 2738587 2633291 2519349 2402152 2286152 2173893
50472 2173893 2066344 1964131 1868380 1780370 1700584 1628420 1562915 1503596 1450398 1402865 1359853
50461 1359853 1320287 1284036 1251753 1223938 1200450 1180828 1164691 1151708 1141575 1134249 1129945 1128695
50449A128695J462L894O375Q740J0233J0464R996R768J0184J0969J1635J1772
50437A234187J1176R993Q660P481O392N282M383M061M279M482M141L396L012L624
50423A314549N035O462P522Q607J0146J2009J4071J6909K1133K6221L0956L5067
50411A508687L9476M4650M9638N3307N5769N7878N9856O1222O1754O1694O1051
50400B114982N9351N6129N1299M5046L7651K9326J9995R420k224j4209k5967l7546
50388B343253m8938n9380o7850p3910p7484p8174p5577p0074o2571n3556m3168
50377A632571l2068k1313j1287j607P620J5229K0056K1938K1287J8266J2872N418
50365A688982l549j3433k3435l2503l9854m5298m8879n0558n0487m9223m7340
$$ plain form
50449 1128695 1130157 1134051 1140426 1149166 1159399 1169863 1179859 1189627 1199811 1210780 1222415 1234187
50437 1234187 1245363 1255356 1264016 1271497 1277889 1283171 1287554 1291615 1295894 1300376 1304517 1307913 1310925 1314549
50423 1314549 1319584 1326046 1333568 1342175 1352321 1364330 1378401 1395310 1416443 1442664 1473620 1508687
50411 1508687 1548163 1592813 1642451 1695758 1751527 1809405 1869261 1930483 1992237 2053931 2114982
50400 2114982 2174333 2230462 2281761 2326807 2364458 2393784 2413779 2423199 2420975 2406766 2380799 2343253
50388 2343253 2294315 2234935 2167085 2093175 2015691 1937517 1861940 1791866 1729295 1675739 1632571
50377 1632571 1600503 1579190 1567903 1566296 1573916 1589145 1609201 1631139 1652426 1670692 1683564 1688982
50365 1688982 1685433 1672000 1648565 1616062 1576208 1530910 1482031 1431473 1380986 1331763 1284423
50354A284423m5072m2544l9972l7412l4661l1672k8683k5708k2441j8953j5951
50343I41354j3827j2001r773p402n565m205k751j255l59r8L11J334K473L108L310
50328H94654L450L638L944M689N963P174P612P372P232P706Q533R115R131Q705
50314I88918Q100P424O537N333M072L240L049L239L508L938M769N881O816P258
50300A062082P392P719Q684J0440J2893J5871J9228K2692K5626K7185K6959K5378
50288A272149K3262K0870J7601J2816O878J220k746m736n643o669q569j1570j5470
50275A299393j9504k2383k3031k1391j8311j4707j1097p829n206l246j747q23
50263A150118r91k315l876m501l995l216l017l413l789l614k872j986j320p52
$$ plain form
50354 1284423 1239351 1196807 1156835 1119423 1084762 1053090 1024407 998699 976258 957305 941354
50343 941354 927527 915526 905753 898351 892786 888581 885830 884575 884216 884118 884429 885763 888236 891344 894654
50328 894654 898104 901742 905686 910375 916338 923512 931124 938496 945728 953434 961967 971082 980213 988918
50314 988918 997018 1004442 1010979 1016312 1020384 1023624 1026673 1029912 1033420 1037358 1042127 1048008 1054824 1062082
50300 1062082 1069474 1077193 1085877 1096317 1109210 1125081 1144309 1167001 1192627 1219812 1246771 1272149
50288 1272149 1295411 1316281 1333882 1346698 1353576 1354796 1352050 1347314 1341671 1335002 1326433 1314863 1299393
50275 1299393 1279889 1257506 1234475 1213084 1194773 1180066 1168969 1161140 1155934 1152688 1150941 1150118
50263 1150118 1149127 1146812 1142936 1138435 1134440 1131224 1128207 1124794 1121005 1117391 1114519 1112533 1111213 1110461
50249A110461J47J362K270K462K452L015M063M805M930M937N157N237M856M338
50235A160492M047L746L081K296J820J487P32n21j885l235m769o358p505q119
50221A145309q730r646j0503j0928j1131j1345j1157r902p598m965k637p23R65
50208A047009K738N045Q163J1709J4868J7254J9253K1264K2988K3829K3830K3809
50196A241759K4410K5461K6413K7117K7773K8151K7318K4376J9234J2453M568
50185A489033m080j2977k1346k8530l4133l7756l9030l8127l5820l2733k8810
50174A175691k3871j8375j3184q812n414l339l065m512o972r892j3206j6775j9937
50161A028337k1936k2420k1314j8659j4926j1116q028n606l337j110P82K295L725
$$ plain form
50249 1110461 1110608 1111970 1114240 1116702 1119154 1122169 1126232 1131037 1135967 1140904 1146061 1151298 1156154 1160492
50235 1160492 1164539 1168285 1171366 1173662 1175482 1176969 1177701 1177180 1175295 1172060 1167291 1160933 1153428 1145309
50221 1145309 1136579 1126933 1116430 1105502 1094371 1083026 1071869 1061967 1054369 1049404 1046767 1046044 1047009
50208 1047009 1049747 1054792 1062955 1074664 1089532 1106786 1126039 1147303 1170291 1194120 1217950 1241759
50196 1241759 1266169 1291630 1318043 1345160 1372933 1401084 1428402 1452778 1472012 1484465 1489033
50185 1489033 1484953 1471976 1450630 1422100 1387967 1350211 1311181 1273054 1237234 1204501 1175691
50174 1175691 1151820 1133445 1120261 1111449 1106035 1102696 1099631 1095119 1088147 1078255 1065049 1048274 1028337
50161 1028337 1006401 983981 962667 944008 929082 917966 909938 904332 900995 899885 900667 902962 906687
50148I06687N164O316O859O662N527L203j64l803o817q785r859j0475j1000j1457
50134H78058j1453j0518q617o161l505o79K240M789O377O786O256N202M007L058
50120H75840K660K892L560M351N001N424N666N819N981O318P051Q155R184R624
50106I57526R444R112R071R406J0039J0907J1796J2294J2239J1999J2154J3016
50094A089003J4621J7019K0271K4207K8487L2871L7276M1635M5869M9972N3899
50083A455130N7431O0371O2786O4872O6566O7560O7812O7768O7756O7155O4464
50072B169671N8428M9133L7744K5205J1500l513j8961l3275m5521n5748o3909
50061B130754o9381p1953p2542p2166p0718o7599o3149n8421n3706m8343m2168
$$ plain form
50148 906687 911851 918167 925026 931688 937215 940418 940254 936451 929634 920849 910990 900515 889515 878058
50134 878058 866605 856087 847470 841309 837804 837125 839365 844154 850531 857317 863573 868775 872782 875840
50120 875840 878500 881392 884952 889303 894304 899728 905394 911213 917194 923512 930563 938718 947902 957526
50106 957526 966970 976082 985153 994559 1004598 1015505 1027301 1039595 1051834 1063833 1075987 1089003
50094 1089003 1103624 1120643 1140914 1165121 1193608 1226479 1263755 1305390 1351259 1401231 1455130
50083 1455130 1512561 1572932 1635718 1700590 1767156 1834716 1902528 1970296 2038052 2105207 2169671
50072 2169671 2228099 2277232 2314976 2340181 2351681 2348168 2329207 2295932 2250411 2194663 2130754
50061 2130754 2061373 1989420 1916878 1844712 1773994 1706395 1643246 1584825 1531119 1482776 1440608
50050A440608l6116l1006k6584k2358j8614j5899j4017j2275j0408q593o793m687
50038A233258k193M93L293O190Q819J0614J1397J1426J1002J0357R830R556R075
50025A333117P812N978M377L121J337j493m505o457p326q224r858j1836j3543
50012A292500j4966j6389j7740j8822j9801k0992k2205k2786k2375k1186j9460
50001A075778j7106j4175j1250q769o136k224L146Q712J3093J6117J8456K0345
49989A095987K1298K0965J9645J7833J5724J3424J1186R164P164M959K694O45
49977A240688j306l492n755p223p059n237k381J032M922R104J2992J6111J8661
49964A271057K1112K3305K4482K4421K4043K4553K6216K8407L0600L2714L4559
$$ plain form
50050 1440608 1404492 1373486 1346902 1324544 1305930 1290031 1276014 1263739 1253331 1244738 1237945 1233258
50038 1233258 1231065 1231558 1234851 1241041 1249860 1260474 1271871 1283297 1294299 1304656 1314486 1324042 1333117
50025 1333117 1340929 1346907 1351284 1354405 1355742 1354249 1349744 1343287 1335961 1327737 1317879 1306043 1292500
50012 1292500 1277534 1261145 1243405 1224583 1204782 1183790 1161585 1138799 1116424 1095238 1075778
50001 1075778 1058672 1044497 1033247 1024478 1018342 1016118 1019264 1027976 1041069 1057186 1075642 1095987
49989 1095987 1117285 1138250 1157895 1175728 1191452 1204876 1216062 1225226 1232390 1237349 1240043 1240688
49977 1240688 1239382 1235890 1230135 1222912 1215853 1210616 1208235 1209267 1214189 1223293 1236285 1252396 1271057
49964 1271057 1292169 1315474 1339956 1364377 1388420 1412973 1439189 1467596 1498196 1530910 1565469
49953A565469L5524L5038L2935K9179K3723J6860R321J590o476j4953k3017k9419
49941A675774l3684l6276l7682l7936l7179l5993l4870l3837l2980l2957l4405
49930A287975l7123m0210m2892m4740m5336m4337m1876l8437l4265k9457k4543
$$ plain form
49953 1565469 1600993 1636031 1668966 1698145 1721868 1738728 1748049 1749639 1743163 1728210 1705193 1675774
49941 1675774 1642090 1605814 1568132 1530196 1493017 1457024 1422154 1388317 1355337 1322380 1287975
49930 1287975 1250852 1210642 1167750 1123010 1077674 1033337 991461 953024 918759 889302 864759
$$ [...]
##END NTUPLES=NMR SPECTRUM
##END=
