##TITLE=AC1568_ROEFFECT0020_8270884_IHj4B1YpuO
##JCAMPDX= 6.0         $$ Bruker NMR JCAMP-DX V2.0
##DATA TYPE= NMR SPECTRUM
##DATA CLASS= NTUPLES
##ORIGIN= BRUKER
##OWNER= Administrator
$$ 1.72 TOPSPIN		Version 2.1
$$ 2013-10-12 17:56:14.376 -0700  Administrator@X
$$ Compression mode = diff/dup
##.OBSERVE FREQUENCY= 400.02188249412
##.OBSERVE NUCLEUS= ^1H
##.ACQUISITION MODE= SIMULTANEOUS (DQD)
##.ACQUISITION SCHEME= undefined
##.AVERAGES= 8
##.DIGITISER RES= 22
##SPECTROMETER/DATA SYSTEM= spect
##.PULSE SEQUENCE= zg30
##.SOLVENT NAME= COFFEE_meoh
##.SHIFT REFERENCE= INTERNAL, COFFEE_meoh, 1, 14.98509
##AUDIT TRAIL= $$ (NUMBER, WHEN, WHO, WHERE, PROCESS, VERSION, WHAT)
$$ ##TITLE= Audit trail, TOPSPIN		Version 2.1
$$ ##JCAMPDX= 5.01
$$ ##ORIGIN= Bruker BioSpin GmbH
$$ ##OWNER= Administrator
$$ $$ E:\/data/COFFEE/nmr/AC1568_ROEFFECT0020_8270884_IHj4B1YpuO/10/pdata/1/auditp.txt
$$ ##AUDIT TRAIL=  $$ (NUMBER, WHEN, WHO, WHERE, PROCESS, VERSION, WHAT)
(   1,<2013-10-12 17:56:07.204 -0700>,<Administrator>,<X>,<go>,<TOPSPIN 2.1>,
      <created by zg
	started at 2013-10-12 17:55:01.391 -0700,
	POWCHK enabled, PULCHK disabled,
       configuration hash MD5:
       C8 4E 4E 5D D3 5C D8 9E 9F 52 82 E0 59 8A DE 15
       data hash MD5: 64K
       83 48 5F 81 BB 79 98 1C A3 29 0E FD 87 0A CA 30>)
(   2,<2013-10-12 17:56:10.657 -0700>,<Administrator>,<X>,<proc1d>,<TOPSPIN 2.1>,
      <Start of raw data processing
       efp LB = 0 FT_mod = 6 PKNL = 1 PHC0 = 0 PHC1 = 0 SI = 32K 
       data hash MD5: 32K
       B8 51 41 70 DF 35 35 E4 CF 05 EF 7D F3 51 51 B8>)
(   3,<2013-10-12 17:56:10.938 -0700>,<Administrator>,<X>,<proc1d>,<TOPSPIN 2.1>,
      <pk PHC0 = 98.09143 PHC1 = 0 
       data hash MD5: 32K
       5F 01 5A 89 B6 10 BA B8 8B 34 05 DC 73 28 73 07>)
(   4,<2013-10-12 17:56:11.048 -0700>,<Administrator>,<X>,<proc1d>,<TOPSPIN 2.1>,
      <abs ABSG = 1 
       data hash MD5: 32K
       7C E9 4D DA 9E DE A7 9E 9A FD CE 86 07 C7 9F 1F>)
(   5,<2013-10-12 17:56:11.110 -0700>,<Administrator>,<X>,<proc1d>,<TOPSPIN 2.1>,
      <abs ABSG = 2 
       data hash MD5: 32K
       E2 6C EE 85 33 30 E4 83 4B CD 15 CF 68 D7 B1 7E>)
(   6,<2013-10-12 17:56:11.157 -0700>,<Administrator>,<X>,<proc1d>,<TOPSPIN 2.1>,
      <abs ABSG = 3 
       data hash MD5: 32K
       A8 66 B0 B7 C3 71 55 59 8F AF 2B 49 5A BC 41 28>)
(   7,<2013-10-12 17:56:11.266 -0700>,<Administrator>,<X>,<proc1d>,<TOPSPIN 2.1>,
      <abs ABSG = 4 
       data hash MD5: 32K
       B0 BD 0B C7 B5 16 10 F0 F4 D1 AC 54 06 E4 78 A0>)
(   8,<2013-10-12 17:56:11.329 -0700>,<Administrator>,<X>,<proc1d>,<TOPSPIN 2.1>,
      <abs ABSG = 5 
       data hash MD5: 32K
       8E 2C 5A 40 AC F1 33 0C 2C 87 1B AA D6 71 A1 A1>)
$$ ##END=
$$ 
$$ $$ hash MD5
$$ $$ 27 C7 50 CA B0 1A C9 B9 8C 10 88 EB 30 F9 10 1C
##$RELAX= 
##$RELAX= 
##$RELAX= 
##$RELAX= 
##$RELAX= 
##$RELAX= 
##$RELAX= 
$$ Bruker specific parameters
$$ --------------------------
##$DU= <E:\>
##$EXPNO= 10
$$ [...]
150 150 150 150 150 150 150 150
##$TP07= 0
##$TPNAME0= <>
##$TPNAME1= <>
##$TPNAME2= <>
##$TPNAME3= <>
##$TPNAME4= <>
##$TPNAME5= <>
##$TPNAME6= <>
##$TPNAME7= <>
##$TPOAL= (0..7)
0.5 0.5 0.5 0.5 0.5 0.5 0.5 0.5
##$TPOFFS= (0..7)
0 0 0 0 0 0 0 0
##$TUNHIN= 0
##$TUNHOUT= 0
##$TUNXOUT= 0
##$USERA1= <user>
##$USERA2= <user>
##$USERA3= <user>
##$USERA4= <user>
##$USERA5= <user>
##$V9= 5
##$VALIST= <valist>
##$VCLIST= <CCCCCCCCCCCCCCC>
##$VD= 0
##$VDLIST= <DDDDDDDDDDDDDDD>
##$VPLIST= <PPPPPPPPPPPPPPP>
##$VTLIST= <TTTTTTTTTTTTTTT>
##$WBST= 1024
##$WBSW= 4
##$XGAIN= (0..3)
0 0 0 0
##$XL= 0
##$YL= 0
##$YMAX_a= 633889
##$YMIN_a= -539623
##$ZGOPTNS= <>
##$ZL1= 120
##$ZL2= 120
##$ZL3= 120
##$ZL4= 120
##$ABSF1= 14.98509
##$ABSF2= -5.573092
##$ABSG= 5
##$ABSL= 3
##$ALPHA= 0
##$AQORDER= 0
##$ASSFAC= 0
##$ASSFACI= 0
##$ASSFACX= 0
##$ASSWID= 0
##$AUNMP= <proc_prof1d_extract_pilot.lims>
##$AXLEFT= 0
##$AXNAME= <>
##$AXNUC= <1H>
##$AXRIGHT= 0
##$AXTYPE= 0
##$AXUNIT= <>
##$AZFE= 0.1
##$AZFW= 0.1
##$BCFW= 0
##$BC_mod= 0
##$BYTORDP= 0
##$COROFFS= 0
##$CY= 15
##$DATMOD= 1
##$DC= 0
##$DFILT= <>
##$DTYPP= 0
##$F1P= 0
##$F2P= 0
##$FCOR= 0.5
##$FTSIZE= 32768
##$FT_mod= 6
##$GAMMA= 0
##$GB= 0
##$INTBC= 1
##$INTSCL= 1
##$ISEN= 128
##$LB= 0
##$LEV0= 0
##$LPBIN= 0
##$MAXI= 10000
##$MC2= 0
##$MEAN= 0
##$ME_mod= 0
##$MI= 0
##$NCOEF= 0
##$NC_proc= -8
##$NLEV= 6
##$NOISF1= 0
##$NOISF2= 0
##$NSP= 0
##$NTH_PI= 0
##$NZP= 0
##$OFFSET= 14.98509
##$PC= 1
##$PHC0= 98.09143
##$PHC1= 0
##$PH_mod= 1
##$PKNL= yes
##$PPARMOD= 0
##$PPDIAG= 0
##$PPIPTYP= 0
##$PPMPNUM= 2147483647
##$PPRESOL= 1
##$PSCAL= 4
##$PSIGN= 0
##$PYNMP= <proc.py>
##$REVERSE= no
##$SF= 400.02
##$SI= 32768
##$SIGF1= 0
##$SIGF2= 0
##$SINO= 400
##$SIOLD= 32768
##$SPECTYP= <>
##$SREGLST= <1H.CDCl3>
##$SSB= 0
##$STSI= 32768
##$STSR= 0
##$SW_p= 8223.68421052631
##$SYMM= 0
##$S_DEV= 0
##$TDeff= 65536
##$TDoff= 0
##$TI= <>
##$TILT= no
##$TM1= 0
##$TM2= 0
##$TOPLEV= 0
##$USERP1= <user>
##$USERP2= <user>
##$USERP3= <user>
##$USERP4= <user>
##$USERP5= <user>
##$WDW= 1
##$XDIM= 32768
##$YMAX_p= 443628252
##$YMIN_p= -713423
##$CURPLOT= <Network HP LaserJet P1505>
##$CURPRIN= <$Network HP LaserJet P1505>
##$DFORMAT= <normdp>
##$LAYOUT= <+/1D_H.xwp>
##$LFORMAT= <normlp>
##$PFORMAT= <normpl>
##$SURQMSG= 1
$$ End of Bruker specific parameters
$$ ---------------------------------
##NTUPLES= NMR SPECTRUM
##VAR_NAME=  FREQUENCY,     SPECTRUM/REAL,   SPECTRUM/IMAG
##SYMBOL=    X,             R,               I
##VAR_TYPE=  INDEPENDENT,   DEPENDENT,       DEPENDENT
##VAR_FORM=  AFFN,          ASDF,            ASDF
##VAR_DIM=   32768,         32768,           32768
##UNITS=     HZ,            ARBITRARY UNITS, ARBITRARY UNITS
##FACTOR=    0.250966925370066, 1,           1
##FIRST=     8223.43324360094, -98151,       -218163
##LAST=      0,             -222070,         -100734
##MIN=       0,             -713423,         0
##MAX=       8223.43324360094, 443628252,    0
$$ Real data points
##PAGE= N=1
##DATA TABLE= (X++(R..R)), XYDATA
$$ [...]
$$ plain form
19554 -176204 -85469 156473 -58600 816 -281646 -125450 -63134 -178834 -41545 80329 -330642
19542 -222778 98056 81443 -169067 40124 -278293 -170716 60387 -46735 -133528 -272425 181140
19530 -147100 159540 -139702 -215091 110018 -6130 -188323 104204 227514 -195725 -101441
19520 -101441 -7938 -84979 -274727 33944 295646 16505 -48433 -33801 -108935 308247 -37534
19508 -64250 -411297 -98513 35260 -102538 58523 -72223 -48776 -276726 -232264 -196635 -62892
19496 25788 75509 -255714 283905 190987 57588 274395 -133310 -23042 11886 137615 -541214
19484 -97052 -213805 -16517 232522 56432 180515 -102406 26640 121745 -558989 20746 -285147
19472 286371 -62320 148924 56310 51829 80907 -189615 326877 56055 2775 52397 -156991
$$ packed form
19554a76204h5469A56473e8600H16b81646a25450O2316j15700d1545H0329c30642
19542b22778I8056j6613a69067D0124b78293J07577F0387d6735q6793j38897A81140
19530a47100A59540a39702p5389A10018f130j82193A04204J23310a95725R4284
19520a01441g938p7041j89748C3944K61702A6505d8433J4632p5134C08247c7534
19508f4250l47047i8513C5260a02538E8523g2223K3447k27950M4462L5629f2892
19496B5788M9721b55714B83905r2918E7588K16807a33310b3042A1886J25729e41214
19484i7052j16753a6517B32522E6432J24083a02406B6640R5105e58989B0746b85147
19472B86371f2320A48924E6310m481K9078a89615C26877E6055B775M9622a56991
$$ plain form
19460 97829 13197 -320768 -329802 10330 -144975 -116245 -340983 -346871 -193510 -127362 -69541
19449 -69541 69592 -151151 -251223 -46431 -263737 -11197 -48176 162384 -219102 210365
19438 97606 -9628 10840 137532 187837 -78383 48143 -177846 -402788 122016 -13721 -74453
19427 -74453 42861 69737 136735 34796 -451227 -273437 -333984 199639 10764 -147910 -35049
19415 -26376 174415 41586 235340 7038 -138157 -138881 190449 -87431 -217597 -202669 -258354
19404 -258354 -64559 27878 -67193 -426507 -45941 -243355 235677 11566 151842 -8426 -365558
19393 -365558 58913 -95399 -169183 -276029 -462931 11753 119999 65030 -372834 187876
19382 72252 153805 -156630 -27750 -57431 -76295 -84962 65050 -231923 -168453 -232727 -153313
$$ packed form
19460I7829A3197c20768r034A0330a44975K8730k24738n888J53361O6148N7821
19449f9541F9592a51151j00072d6431k17306a1197l6979A62384b19102B10365
19438I7606i628A0840J26692N0305g8383D8143a77846k24942A22016a3721o0732
19427g4453D2861K6876O6998C4796d51227J77790o0547A99639A0764a47910c5049
19415b6376A74415D1586J93754G038a38157p24A90449h7431j30166J4928n5685
19404b58354f4559B7878f7193l59314d5941j97414B35677A1566J40276h426l57132
19393c65558E8913i5399p3784j06846j86902A1753J08246n4969c72834A87876
19382G2252Q1553a56630b7750k9681j8864q667F5050b31923O3470o4274P9414
$$ plain form
19371 -153313 -253046 221268 149564 -242810 41499 -179850 -324192 -87948 -532601 -30995
19360 2857 218308 -142842 121564 80962 -21482 41925 -100023 -57180 -352866 -109143 -72453
19349 -72453 72026 -149991 -88168 -300085 161455 -106859 -108716 127203 42246 -139430 129606
19337 47221 -156643 236703 -73770 -335625 -66256 -293223 -13968 28544 151394 73381 318364
19326 318364 -7879 -115338 -8291 -100177 -399301 -333832 -25401 197477 99133 -104401 -76898
19315 -76898 -276515 -140618 109132 -329489 208366 -31426 -130054 234163 11057 -305893
19304 -56821 -41913 -305258 51918 -230793 40863 -513842 280368 -14445 117346 -113962
19293 -13814 -93192 -83400 -32212 -330075 -91402 -120512 -306876 -465043 -247499 -256477 -298730
$$ packed form
19371a53313r9733B21268p1704b42810D1499a79850j44342h7948m44653c0995
19360B857K15451a42842A21564m0602b1482D1925a00023M2843k95686a09143L6690
19349g2453G2026a49991O1823k11917A61455a06859j857A27203D2246a39430A29606
19337D7221a56643B36703g3770k61855f6256k26967a3968B8544J22850G3381K44983
19326C18364g879j07459h291r1886k99124O5469b5401A97477r8344a04401K7503
19315g6898j99617J35897A09132c29489B08366c1426r8628B34163A1057c05893
19304e6821J4908k63345E1918b30793D0863e13842B80368a4445A17346a13962
19293a3814p9378R792c2212k97863i1402k9110j86364j58167K17544q978m2253
$$ plain form
19282 -298730 -103869 -228575 -241104 -46084 54934 -63608 105325 -305756 -197827 -143805
19272 -143805 -46328 -299042 -108378 -297671 -112109 -7920 231650 86605 -17335 136101
19261 146770 -60872 -74049 89563 -203111 -8358 -3105 33782 410907 -61708 -371065 134858
19249 -154893 169549 -298095 66411 205223 -120746 54816 -436701 -114408 -26670 66426
19238 -88722 -54100 231424 -95926 -217557 21243 14308 229974 -109133 -143150 45879 -40924
19226 -319507 -202818 -346502 -284720 -106670 83220 -178234 -253782 -18830 31288 -443593
19215 92022 56805 -2706 -399088 -72822 -139268 19714 46297 -32555 -458154 -276593 35289
19203 -205645 -135749 -144126 -183686 -384408 -167594 195389 108777 98768 -11673 145997 -602837
$$ packed form
19282b98730a03869j24706j2529d6084E4934f3608A05325c05756J07929N4022
19272a43805d6328k52714a08378j89293a12109g920B31650H6605a7335A36101
19261A46770f0872j3177H9563b03111h358c105C3782L77125f1708l09357A34858
19249a54893A69549b98095F6411J38812a20746E4816d36701a14408b6670F6426
19238h8722L4622B31424i5926j21631B1243o935K15666a09133l4017D5879d0924
19226c19507J16689j43684O1782a06670H3220a78234p5548a8830C1288d43593
19215I2022l5217b706l96382g2822o6446A9714K6583c2555m25599J81561C5289
19203b05645O9896q377l9560k00722a67594A95389q6612j0009a1673A45997f02837
$$ plain form
19191 -90041 -78723 241959 -57860 123435 42172 79473 54988 -141083 -222986 -27090 358393
19179 91420 -301024 -65669 31557 288952 -45107 -121757 -361466 49884 -111649 169101 18561
19167 95061 120691 -140213 273238 -253204 -19310 -274791 83101 127520 74432 98212 -532724
19155 -342419 -230998 -4627 -208879 -540486 -34172 -77256 -357577 -365303 -224336 84660 -139940
19143 175660 -243217 31135 75434 80368 170364 40091 -235952 -106938 -146286 53711 61075
19132 61075 -20331 -147443 -109212 -232543 133123 282299 -255504 -209680 -23638 273346
19121 109281 179257 -110303 -49741 -244523 -180922 -173965 -64043 -40900 -132424 116779 -46757
19109 -103686 -113820 -59039 -120711 73193 -92048 -75161 2427 18690 -244220 75010 -65633
$$ packed form
19191i0041J1318B41959e7860A23435D2172L7301k4485a41083q1903b7090C58393
19179I1420c01024f5669C1557K57395d5107p6650k39709D9884a11649A69101A8561
19167I5061K5630a40213B73238b53204a9310k55481H3101M4419n3088K3780e32724
19155c42419J11421d627k04252l31607c4172m3084k80321p726J40967H4660a39940
19143A75660b43217C1135M4299M934Q9996D0091b35952a06938l9348E3711P364
19132F1075b0331j27112L8231j23331A33123J49176b55504M5824b3638B73346
19121A09281O9976a10303d9741j94782O3601O957f4043K3143r1524A16779d6757
19109a03686j0134N4781o1672G3193i2048J6887B427J6263b44220G5010f5633
$$ plain form
19097 -126314 35382 -180116 282788 -11037 -283943 -15028 301679 30055 -97732 -57632 -52985
19086 -52985 -379308 194838 331895 29611 -191107 19674 -93446 13817 -244366 14755 52256
19075 52256 285233 262087 -388310 120681 -261112 152120 -371921 -243803 11539 27049
19065 27049 6798 -120760 185615 3208 188729 -104490 154914 -149520 25908 -22515 -43589
19054 -43589 -207683 -21337 -100613 -40269 110557 -273673 227913 -136732 -319245 50814
19043 -36199 253006 17237 -35570 -132151 174564 -197877 106855 -424569 -45915 74726 -168750
19031 -221812 262452 36087 235080 189069 55284 -137064 -102931 192834 278276 260857 -12782
19019 180187 109164 198388 -79544 62829 -310142 53270 -211741 -156690 18704 325767 -42455
$$ packed form
19097a26314C5382a80116B82788a1037k72906a5028C01679C0055i7732M0100M647
19086e2985l26323A94838J37057B9611a91107A9674i3446A3817b44366A4755L7501
19075E2256K32977k3146c88310A20681b61112A52120c71921J28118A1539J5510
19065B7049F798a20760A85615C208J85521a04490A54914a49520B5908b2515k1074
19054d3589j64094b1337p9276d0269A10557b73673B27913a36732j82513E0814
19043c6199B53006A7237c5570r6581A74564a97877A06855d24569d5915G4726a68750
19031b21812B62452C6087J98993m6011E5284a37064L4133A92834Q5442j7419a2782
19019A80187p1023Q9224g9544F2829c10142E3270b11741N5051A8704L07063d2455
$$ plain form
19007 -368522 -249807 -164344 -43910 -203270 102104 -42548 95527 185538 -196561 -165508 -106083
18996 -106083 -79652 -141565 -198953 49200 -153374 88948 259767 -225162 39362 155301 93226
18985 93226 -197081 66245 198020 105153 -502441 -161379 -55089 239672 47249 -146205
18974 -376420 -224043 75974 -351374 -199408 213547 -52934 -118161 62137 -49237 -81549 -78993
18963 -78993 219415 -170857 -281202 -2355 111041 -355174 -16799 -213663 -153448 -8422 -194097
18952 -194097 -60853 176930 -309589 120709 340697 -222526 4975 -46955 -284464 -262422
18942 -262422 -403659 -13726 -71871 -335800 -40826 -3109 64792 213928 -167748 -178499 -234908
18931 -234908 2625 8811 108364 -219791 15074 -147007 -209559 -211965 85666 5920 166149 -337592
$$ packed form
19007c68522J18715Q5463d3910j59360A02104d2548I5527R0011a96561L1053N9425
18996a06083K6431o1913n7388D9200a53374H8948J70819b25162C9362J15939o2075
18985I3226a97081F6245J31775r2867e02441a61379e5089B39672D7249a46205
18974c76420J52377G5974c51374J51966B13547e2934o5227F2137d9237l2312K556
18963g8993B19415a70857j10345b355A11041c55174a6799j96864O0215h422j85675
18952a94097f0853A76930c09589A20709K19988b22526D975d6955k37509K2042
18942b62422j41237a3726n8145k63929d0826c109F4792J49136a67748j0751n6409
18931b34908B625O186R9553b19791A5074a47007o2552k406H5666E920J60229c37592
$$ plain form
18918 -16376 -123421 -134239 178453 164841 204919 -265270 -158287 -439247 -67497 -322786
18908 -322786 -194322 -269416 19343 -151832 -15182 -142140 249269 -8399 241077 91246 -152789
18896 155024 -104951 -217173 -130000 8555 -26593 31390 239563 429540 -108142 -18355 157816
18884 154277 -414967 -163239 226881 95924 43554 246944 73173 33268 145536 -150440
18873 -336667 5859 222241 -214419 85566 89503 -70580 94166 74411 -583800 15015 190422
18862 190422 68993 -30183 -126623 64910 125919 -362685 139273 45425 -86525 6268 -58797
18850 -240863 -290391 224138 115851 203335 -120002 6079 -305008 -139510 216395 -58256
18839 136577 -294028 19673 -330934 -8236 -306111 -333485 167291 174003 46544 -289512 -263529
$$ packed form
18918a6376j07045j0818A78453j3612M0078b65270J06983k80960f7497k55289
18908c22786J28464p5094A9343a51832a5182j26958B49269h399B41077I1246a52789
18896A55024a04951j12222Q7173H555b6593C1390K08173J89977a08142a8355A57816
18884A54277d14967a63239B26881I5924D3554K03390G3173C3268J12268a50440
18873c36667E859K16382b14419H5566L937g0580I4166j9755e83800A5015J75407
18862A90422F8993c0183r6440F4910O1009c62685A39273D5425h6525F268e8797
18850b40863m9528B24138j08287Q7484a20002F079c05008a39510B16395e8256
18839A36577b94028A9673c30934h236k97875k7374A67291O712D6544b89512K5983
$$ plain form
18828 -263529 -43280 -338382 -92233 212383 -52989 135179 16409 8751 -209717 -131642 -96929
18817 -96929 107267 446159 136488 57563 -73226 13262 36383 -129423 207555 164564 68097
18805 158925 143566 245133 -405493 -137354 49231 -47790 -81951 -81136 -146086 2547 -365025
18793 -129429 -49701 163702 -118320 42309 -41848 -138487 -106709 274430 164019 -7867 -96750
18782 -96750 -12279 -115882 51101 -50588 101009 25699 -53853 197063 137970 130903 -14469
18770 -242909 29620 -180044 -103943 1723 -55068 -140682 -211704 1521 -207127 377712 -147961
18758 -64774 -170484 86357 -569091 -56197 -78570 -195773 -3451 62912 119258 275713 -114857
18746 14638 -73655 96596 -83184 217248 -161998 182908 -180023 -294348 -160198 -6237 -130750
$$ packed form
18828b63529d3280k95102i2233B12383e2989A35179A6409p658b09717P8075L4713
18817i6929A07267L38892A36488E7563g3226A3262K3121a29423B07555m2991F8097
18805A58925j5359J01567d05493a37354D9231d7790l4161Q15o4950B547c65025
18793a29429d9701A63702a18320D2309d1848r6639L1778B74430j10411g867q8883
18782i6750a2279j03603E1101e0588A01009B5699e3853A97063n9093p067a4469
18770b42909B9620a80044P6101A723e5068q5614p1022A521b07127C77712a47961
18758f4774j05710H6357e69091e6197k2373j17203c451F2912N6346J56455a14857
18746A4638g3655I6596h3184B17248a61998A82908a80023j14325J34150f237j24513
$$ plain form
18735 -130750 -49397 -106896 -168913 -191842 133053 130260 -68560 37764 -322496 -10766 -243666
18724 -243666 -39557 -42213 -20236 76300 99595 -350212 -129570 71363 100984 72004 -164539
18712 -31717 -83136 243135 289136 -67551 -28525 -256682 -282709 -262391 -40815 -97685 -123312
18701 -123312 202329 -371135 28377 66260 -376719 -190708 -89281 -147729 114160 -14053
18690 55029 -126952 33604 104154 44125 -260087 21797 262557 -59128 65422 -37517 107838
18678 -147888 195197 -102870 39064 77495 -378893 -85755 -336161 -836 -140277 -72791 -120304
18667 -120304 -30314 -198122 -320088 201508 -110175 -158417 204917 18517 413184 -211648
18656 -36395 -223789 88511 125148 -331793 -48301 27746 380449 -75511 -241705 -122290 73784
$$ packed form
18735a30750d9397n7499o2017k2929A33053k793f8560C7764c22496a0766k32900
18724b43666c9557k656b0236G6300K3295c50212a29570G1363K9621k8980a64539
18712c1717n1419B43135M6001f7551b8525k28157k6027K0318d0815n6870k5627
18701a23312B02329c71135B8377L7883c76719J86011h9281n8448A14160a4053
18690E5029a26952C3604P0550D4125b60087B1797K40760e9128F5422c7517A07838
18678a47888A95197a02870C9064L8431c78893h5755k50406h36j39441O7486m7513
18667a20304c0314j67808j21966B01508a10175m8242B04917A8517L94667b11648
18656c6395j87394H8511L6637c31793d8301B7746L52703g5511j66194J19415G3784
$$ plain form
18644 -154816 -291697 -24597 150030 101230 104087 -192631 176299 -102868 87051 7016 -378405
18632 -277471 -23838 -258273 89005 -115897 -97041 135783 237361 165962 -179527 -73212
18621 -186672 73329 -199397 34539 -258835 174624 -194966 -54111 -92570 -108977 -209832
18611 -209832 -65736 235957 -178617 -143045 143488 -184917 -272429 56094 -116984 -326050
18601 -326050 -405972 12413 -25937 84216 93655 -158268 -38638 40242 -305067 85577 -184214
18589 -81665 74197 30370 -162206 117746 -74416 -80415 63091 -12138 1430 -24900 -163549
18578 -163549 227798 -278129 44783 136641 56066 4010 247418 -299653 -220839 -4389 -101032
18567 -101032 -144835 112797 -196726 285977 -107983 71820 -60615 -48328 -179276 27111
$$ packed form
18644a54816j36881b4597A50030m8800K857a92631A76299a02868H7051G016c78405
18632b77471b3838k34435H9005a15897J8856A35783J01578p1399a79527g3212
18621a86672G3329a99397C4539b58835A74624a94966e4111l8459j6407j00855
18611b09832f5736B35957a78617L5572A43488a84917q7512E6094a16984k09066
18601c26050p9922A2413b5937H4216R439a58268c8638D0242c05067H5577a84214
18589h1665G4197C0370a62206A17746g4416n999F3091a2138A430b4900j38649
18578a63549B27798b78129D4783R1858E6066D010K43408b99653P8814d389r6643
18567a01032m3803A12797a96726B85977a07983G1820f0615J2287j30948B7111
$$ plain form
18556 -241480 179998 -100134 -188527 -125166 -127729 201940 37535 -294740 115472 200999 -219378
18544 -273085 39742 27034 103591 -73504 -221291 -115894 -123569 -274706 -120074 46333 -36197
18532 166708 262874 74720 -116943 -201495 -388362 -179169 -137245 10061 -190242 -334208
18522 -334208 80240 -240484 161017 -153402 67511 105639 311586 -215917 -24725 -345578
18512 -345578 -499846 382497 -214214 138698 71230 20898 17684 80794 -383798 -207990
18502 -207990 -90605 -91001 -311879 -49234 196130 -30147 141375 -244738 -179714 -77239 36552
18490 79213 347648 58045 -884 137227 -2239 -445640 -235676 86629 -298789 32239 -31252
18478 -17896 -204577 -79465 -84668 -301077 -196662 6354 297627 -282577 10069 -26884 -255088
$$ packed form
18556b41480A79998a00134q8393O3361k563B01940C7535b94740A15472Q5527b19378
18544b73085C9742j2708P6557g3504j47787J05397p675j51137a20074D6333c6197
18532A66708R6166G4720a16943q4552j86867a79169M1924A0061a90242j43966
18522c34208H0240b40484A61017a53402F7511L8128K05947b15917b4725l20853
18512c45578j54268C82497b14214A38698o7468B0898l214O3110c83798J75808
18502b07990i0605l96k20878d9234A96130c0147A41375b44738O5024g7239C6552
18490G9213K68435E8045h84A37227b239m43401K09964H6629b98789C2239c1252
18478a7896j86681g9465n203k16409J04415F354K91273b82577A0069b6884k28204
$$ plain form
18467 -255088 -100957 262435 258681 216315 15934 -226051 106486 -100881 70853 -171173
18456 -222777 116045 -236539 -111781 -6874 -255076 41885 -177397 44616 -190087 185252
18445 -175034 194585 -341501 -153424 -92806 173734 -25728 13213 -26279 -384978 12662
18434 -188820 -110 270168 -153177 -243453 -13975 158812 77251 109249 -22453 -116333 128232
18422 -111972 -83050 -22843 -304351 -36782 -75135 83743 -108998 -146148 -188943 225061 -394287
18410 -189510 180824 98155 86547 257601 147579 54321 206424 10970 163705 293331
18400 293331 -83890 -190001 -261280 146163 -195180 88551 121567 -209983 -235329 57608 5811
18388 139030 6530 -122518 116738 -12709 -122664 -92367 264527 222329 29593 -207015 -109982
$$ packed form
18467b55088a00957B62435l754m2366A5934b26051A06486a00881G0853a71173
18456b22777A16045b36539a11781f874k48202D1885a77397D4616a90087A85252
18445a75034A94585c41501a53424O0618A73734b5728A3213b6279l58699A2662
18434a88820a10B70168a53177r0276a3975A58812G7251L1998b2453r3880A28232
18422a11972K8922b2843k81508c6782l8353H3743a08998l7150m2795B25061c94287
18410a89510A80824q2669j1608J71054j10022E4321J52103A0970J52735J29626
18400B93331h3890j06111p1279A46163a95180H8551L3016b09983k5346E7608E811
18388A39030F530a22518A16738a2709j09955L0297B64527m2198B9593b07015R7033
$$ plain form
18377 -109982 -77284 9925 -166948 -196417 -19117 103699 -4926 131041 180001 -261539 -193073
18366 -193073 -366849 -50376 232077 248940 -299610 2520 -13923 -248621 -55235 116563 115054
18355 115054 -89533 27891 -134231 112482 62646 64999 -137161 -247729 -47714 -431775 19401
18343 -338180 -22742 -87300 27633 -62107 119712 42043 -344213 -61240 -327447 -5625 78697
18331 -226898 -89983 -102984 -226592 4914 183480 79982 112804 158272 -50536 220605 -154196
18319 -125062 127837 -109014 -393442 -237632 -79907 218327 -135351 -153027 109218 43342
18308 98804 4101 164041 -163275 -96031 294608 56280 123164 72424 -308926 -74895 -59782
18297 -59782 27336 18856 -118314 183218 -135922 9101 289744 -97411 31754 -289420 241125
$$ packed form
18377a09982L2698I925a66948k9469a9117A03699d926A31041M8960b61539O8466
18366a93073j73776e0376B32077J6863b99610B520a3923k34698e5235A16563j509
18355A15054h9533B7891a34231A12482m9836K353a37161j10568d7714l84061A9401
18343c38180b2742o4558B7633f2107A19712D2043c44213f1240k66207e625G8697
18331b26898h9983j3001j23608D914J78566G9982L2822M5468e0536B20605a54196
18319a25062A27837a09014k84428J55810g9907B18327a35351j7676A09218D3342
18308I8804D101J59940a63275O7244B94608E6280O6884n0740c08926g4895J5113
18297e9782B7336q480a18314A83218a35922I101K80643i7411C1754b89420B41125
$$ plain form
18285 17296 -16365 32859 -9665 -230517 -170914 229512 -14358 122468 125082 -110448 -263612
18274 -263612 54127 -33005 -162501 -159457 -350545 -128421 217502 -107965 -152506 39465 -62450
18262 -202521 -135458 -239437 13706 -196839 -1760 28907 84506 -172912 -131025 -98312 -48971
18250 201322 237144 79143 77652 -261575 106725 -292195 -16354 -13149 -82158 251738 316267
18239 316267 -179210 24312 -142124 71606 -73835 186745 -119247 -93931 133415 33533
18228 -157973 7477 -174523 54091 -46703 28462 -73363 -45614 -121812 -35362 -107569 -99173 229763
18215 -135806 113683 208211 -95795 21547 -141187 -240206 47856 56489 259084 151793 45878
18203 151913 -383870 -50124 261962 -121176 47700 -267628 -7384 31913 206212 -286027
$$ packed form
18285A7296a6365C2859i665k20852N9603B29512a4358A22468K614a10448j53164
18274b63612E4127c3005j29496L044j91088a28421B17502a07965m4541C9465f2450
18262b02521O7063j03979A3706a96839a760B8907N5599a72912M1887L2713d8971
18250B01322L5822G9143j491b61575A06725b92195a6354L205o9009B51738O4529
18239C16267a79210B4312a42124G1606g3835A86745a19247K5316A33415C3533
18228a57973G477a74523E4091d6703B8462g3363K7749p6198c5362p2207Q396B29763
18215a35806A13683R4528i5795B1547a41187r9019D7856Q633K02595j07291D5878
18203A51913c83870e0124B61962a21176D7700b67628g384C1913J74299b86027
$$ plain form
18192 10090 68821 -80237 -103811 -28393 198435 -407868 167144 118172 133550 -165428 -23524
18180 -103945 71707 196543 -104403 -168967 -249972 206426 22595 -255961 -293951 -88226 -307855
18169 -307855 -32719 -37779 -124511 69616 92659 -165681 -97919 -182452 169377 89734 -222015
18157 43583 -139454 -27530 -324733 -29033 196150 -44439 195109 -68228 159388 -90227 41033
18145 -51846 -196949 -255473 -103296 15379 -128965 -129541 -146030 58756 414087 -114129 54067
18133 208276 263761 89767 22287 100430 -108607 241231 -80168 302418 -382957 -24831 -175082
18122 -175082 -205710 100691 156938 -159597 63302 221300 -185299 -87811 38216 199512
18112 199512 -129203 -290474 7501 98058 -190506 46813 -59532 -190673 -177859 -539911 -190426
$$ packed form
18192A0090N8731h0237k3574b8393A98435d07868A67144m8972J5378a65428b3524
18180a03945G1707J24836a04403o4564q1005B06426B2595b55961l7990h8226k19629
18169c07855c2719n060q6732F9616K3043a65681O7762q4533A69377p9643b22015
18157D3583a39454b7530k97203b9033A96150d4439A95109f8228A59388i0227D1033
18145e1846j45103n8524a03296A5379a28965n76j6489E8756L55331a14129E4067
18133B08276N5485H9767B2287P8143a08607B41231h0168C02418c82957b4831j50251
18122a75082l0628A00691N6247a59597F3302J57998a85299h7811C8216J61296
18112A99512a29203j61271G501R0557a90506D6813e9532j31141J2814l62052a90426
$$ plain form
18100 81002 82135 97992 -296747 -153725 -2878 26086 364833 -89479 129931 -29224 87589
18088 -202925 -141469 189039 -5934 78232 -339241 35592 89839 69513 48426 -121480 221097
18076 -83147 -356784 94308 -124978 -61564 -67541 -123689 -121261 139326 42472 -17563 -172944
18065 -172944 111406 213313 -70368 156029 268095 75701 16502 5219 -150288 10582 166530
18054 166530 -55798 152849 132596 -28888 22122 -276354 -299334 191061 -219814 -103308
18043 243847 -37771 93023 98143 60648 -125707 193110 228876 38293 62963 164190 -81044
18031 -155580 151303 -336858 80479 220900 151846 -383236 -132441 89261 -129383 -230169
18021 -230169 205128 86614 -257616 -346298 -202060 82941 -266531 -92016 127917 108317
$$ packed form
18100H1002J133J5857b96747J43022b878B6086L38747h9479A29931b9224H7589
18088b02925O1456A89039e934G8232c39241C5592N4247k0326k1087a21480B21097
18076h3147k73637I4308a24978f1564n977n6148K428A39326D2472a7563j55381
18065a72944A11406J01907g0368A56029J12066G5701A6502E219a50288A0582J55948
18054A66530e5798A52849k0253b8888B2122b76354k2980A91061b19814a03308
18043B43847c7771I3023N120l7495a25707A93110L5766C8293K4670J01227h1044
18031a55580A51303c36858H0479J40421o9054c83236a32441H9261a29383j00786
18021b30169B05128H6614b57616q8682J44238H2941b66531i2016A27917j9600
$$ plain form
18011 108317 -189644 -9577 -78558 9527 15354 -350603 -72723 -232477 -271509 279221 -138067
17999 -68069 136443 95261 -71759 -4917 167960 62771 80319 -87936 -95053 262896 88516
17987 -58917 168971 -228509 -17201 -277469 137135 3710 15346 -63304 53138 -152014 100738
17975 204502 108358 93001 149719 -328150 -169143 93093 432459 -53877 -258180 113918
17964 -173032 -107642 -277197 -9268 251501 94849 158818 -43033 8735 -31475 42459 -146016
17952 207391 70901 -14607 55310 571292 98181 12058 -125081 -12683 -48529 124130 111728
17941 111728 301610 -82528 165879 115911 -82612 -17730 -112828 72324 -93023 -109823 74897
17929 -76859 -19825 -124321 90285 -18299 -63902 -22799 -173397 -178811 88653 144172 -14959
$$ packed form
18011A08317a89644i577o8981I527N827c50603g2723j59754l9032B79221a38067
17999f8069A36443m1182g1759d917A67960F2771J7548h7936p117B62896H8516
17987e8917A68971b28509a7201k60268A37135C710J1636f3304E3138a52014A00738
17975B04502r6144j5357N6718c28150J59007I3093L39366e3877k04303A13918
17964a73032O5390j69555i268B51501I4849O3969d3033H735c1475D2459a46016
17952B07391G0901a4607E5310N15982I8181A2058a25081a2683l5846A24130j2402
17941A11728J89882h2528A65879m9968h2612a7730r5098G2324i3023j6800G4897
17929g6859a9825j04496I0285a8299m5603b2799j50598n414H8653N5519a4959
$$ plain form
17917 -68210 -158547 -95238 -348898 -227057 -28831 -60624 -87648 158732 -17840 -282277 -137907
17905 70411 64180 -83652 -36737 -16399 -116457 2968 64515 -230115 -92055 -144216 329065
17893 -475459 112344 66543 349038 -174123 20065 59118 -106619 -132502 -194396 95739 -260611
17881 25891 112553 -8409 8975 28281 66248 7938 -236070 173171 595 -151633 110353 -49843
17868 -61099 301823 64337 117942 48914 -113657 187780 -63090 93389 -64680 -171922 51354
17856 58632 -117180 144103 117069 21911 -121096 303525 8006 -140698 -62135 -17437 251607
17844 -117919 -103880 -87488 -263302 122088 85008 -41476 105487 -288706 195611 117134
17834 117134 326451 -409803 -113154 60915 -259006 48839 210248 -192492 -4263 -32031
$$ packed form
17917f8210r0337O3309k53660J21841b8831l1793k7024A58732a7840k64437a37907
17905G0411o231h3652c6737a6399j00058B968O1547b30115i2055n2161C29065
17893d75459A12344m5801K82495a74123B0065L9053a06619k5883o1894I5739b60611
17881B5891Q6662h409H975J9306L7967G938b36070A73171E95a51633A10353d9843
17868f1099C01823F4337N3605D8914a13657A87780f3090I3389f4680j07242E1354
17856E8632a17180A44103k7034B1911a21096C03525H006a40698f2135a7437B51607
17844a17919J4039J6392j75814A22088l7080d1476A05487b88706A95611p8477
17834A17134K09317d09803a13154F0915b59006D8839J61409a92492d263k7768
$$ plain form
17824 -32031 5902 -6836 -72631 339465 109931 176590 -9668 88657 147466 -67385 -96766 534054
17811 -138609 474518 -231721 -114973 -17805 -11340 -180692 -255110 -356275 242336 117603
17800 190967 9242 77720 -238780 23316 -111557 232061 35477 369446 135140 -127400
17789 -28233 -572 242591 -358871 158822 -233468 440181 -154656 53640 19092 102692 -226523
17777 119179 139540 -53561 -14566 152465 177947 -217474 50589 -42143 -44640 -89214 46011
17765 -19417 -134282 36306 -4813 3110 -298585 -66452 -202650 368800 96136 43994 -162476
17753 -15694 85985 -222265 234809 -127493 105483 -66690 -22485 -249922 17512 -62974 -143126
17742 -143126 -263 139269 -56997 -109860 43877 -162916 -153987 13130 -65396 72466 -35541 234507
$$ packed form
17824c2031E902f836o5795C39465A09931O6659i668H8657N8809f7385k9381E34054
17811a38609D74518b31721a14973a7805O465j69352p4418j01165B42336A17603
17800A90967I242O8478b38780B3316a11557B32061C5477L33969A35140a27400
17789b8233e72B42591c58871A58822b33468D40181a54656E3640A9092Q3600b26523
17777A19179K0361e3561a4566A52465K5482b17474E0589d2143k497m4574D6011
17765a9417j14865C6306d813C110b98585f6452j36198C68800I6136D3994a62476
17753a5694H5985b22265B34809a27493A05483f6690b2485k27437A7512f2974q0152
17742a43126b63A39269e6997n2863D3877a62916Q929A3130f5396G2466c5541B34507
$$ plain form
17729 -50743 195065 -8279 170924 -195721 -73806 -17666 144453 132953 67785 -333244 113474
17717 53972 173386 73484 -180841 -45521 -181737 114861 -171103 -56085 20522 -4586 166620
17705 307471 -81954 119760 14684 72507 64760 266365 164157 13093 -104801 -177983 96714
17693 44538 -54373 214006 -178391 286 -91139 311990 88889 249950 -419186 126179 -65232
17681 57188 -293682 75766 399380 130873 31078 2783 296291 132520 35485 -335633 28866
17669 312312 -145820 100163 -177045 502436 -46735 -24400 -116460 -75222 84266 50003 -4203
17657 204896 259572 95259 -2178 123606 -101758 72638 -113381 27405 169444 -137843 -1940
17645 233061 -45034 208404 164747 46309 -10209 137674 141545 84468 78551 178062 29115
$$ packed form
17729e0743A95065h279A70924a95721g3806a7666A44453j1500o5168c33244A13474
17717E3972J19414G3484a80841d5521j36216A14861a71103e6085B0522d586A66620
17705C07471h1954A19760A4684N7823p747K01605j02208A3093a04801p3182I6714
17693D4538e4373B14006a78391B86i1139C11990H8889J61061d19186A26179f5232
17681E7188b93682G5766L23614A30873C1078B783K93508A32520C5485c35633B8866
17669C12312a45820A00163a77045E02436d6735K2335r2060M1238H4266l4263d203
17657B04896N4676I5259b178A23606a01758G2638a13381B7405J42039a37843a940
17645B33061d5034B08404m3657D6309a0209A37674L871n7077n917R9511B9115
$$ plain form
17633 -39297 -326682 -45071 82688 79909 6128 -158601 -37540 46434 27641 3354 -43435 -81128
17621 -81128 27959 65332 -76272 -74982 -62348 -102321 -10959 -106258 -264582 239725 136705
17610 136705 62371 207287 80151 -208584 235134 77760 -222691 162585 192438 307337
17600 307337 -136660 33245 -22175 156427 259765 383052 55483 -52316 291622 221312
17590 221312 46847 34789 -48592 -201252 -153129 361437 47979 -90683 78925 -57055 62101
17578 147495 238860 -8116 -52656 148265 230693 56806 -24201 -27151 21112 18808 183187 117124
17566 117124 476048 -66379 113652 28546 36663 128412 50274 78358 24240 66993 185226
17555 185226 134449 -188711 -76593 59667 -18009 168364 136528 -259387 51786 14837 265568
$$ packed form
17633c9297k87385d5071H2688k779F128a58601c7540D6434j8793C354d3435l7693
17621h1128B7959L7373g6272J290J2634l9973a0959r5299j58324B39725j03020
17610A36705F2371J44916H0151b08584B35134G7760b22691A62585K9853J14899
17600C07337a36660C3245b2175A56427J03338J23287E5483e2316B91622p0310
17590B21312D6847j2058d8592j52660M8123C61437D7979i0683G8925e7055F2101
17578A47495R1365h116m4540A48265Q2428E6806b4201k950B1112k304J64379o6063
17566A17124L58924f6379A13652B8546Q117R1749E0274K8084B4240M2753J18233
17555A85226n0777a88711g6593E9667a8009A68364l1836b59387E1786A4837K50731
$$ plain form
17544 265568 -6145 144663 -62342 -16390 83883 -104016 69666 32619 -293148 52762 -40035
17532 202705 -101328 -134147 -50703 -13657 215749 82298 -150785 106220 -45084 61820 75507
17521 75507 4369 45349 50845 416799 -110865 -213574 399086 106009 50327 77311 40196
17510 40196 -76374 -273231 -29193 -108825 24283 107041 -133442 -30557 -146043 183989 -67336
17498 -218681 416383 -226835 247897 89649 24285 196377 -143125 -53076 -82721 -42145
17488 -42145 176082 306130 8306 88105 -27686 -2526 52191 253410 130616 85082 6156
17476 338256 28280 280697 512524 371339 101281 200402 -57603 -133220 -388403 82210
17465 -125706 449565 -53219 -263451 43848 -161517 -116963 243480 134282 124948 163071 -116396
$$ packed form
17544B65568f145A44663f2342a6390H3883a04016F9666C2619b93148E2762d0035
17532B02705a01328l2819e0703a3657B15749H2298a50785A06220d5084F1820J3687
17521G5507D369M0980N496L65954a10865j02709C99086A06009E0327K6984l7115
17510D0196g6374j96857b9193p9632B4283Q2758a33442c0557j15486A83989f7336
17498b18681D16383b26835B47897H9649B4285J72092a43125e3076k9645M0576
17488d2145A76082J30048H306P9799b7686b526E2191K01219j22794m5534F156
17476C38256B8280K52417K31827j41185A01281R9121e7603p5617k55183H2210
17465a25706D49565e3219k10232D3848a61517M4554B43480j09198r334L8123a16396
$$ plain form
17453 455598 -30084 -51862 531317 150460 370882 255571 131622 146456 213193 150561
17443 150561 12925 -209655 368391 17337 138473 319109 -29715 -12087 316535 225084
17433 225084 474760 218043 -52013 243522 21397 413095 369422 116000 256625 -131670
17422 361857 414418 337271 183962 387002 281112 17174 149076 431362 457009 92374
17411 492899 139934 361104 100986 277374 302322 329967 95459 15268 -114640 227568
17400 189990 127784 26401 10858 232281 187408 349367 -130531 118834 -60035 264224
17389 38492 144285 -6778 173205 -102054 -7561 405821 327174 -314839 283964 201862 258848
17378 258848 236269 -122900 215747 447809 35729 1962 240327 63043 285936 -24902 -137177
$$ packed form
17453D55598c0084k1778E31317A50460K20422j15311j23949J4834O6737o2632
17443A50561A2925b09655C68391A7337J21136J80636b9715a2087C16535r1451
17433B25084K49676B18043e2013B43522B1397L91698m3673A16000J40625a31670
17422C61857N2561p7147j53309K03040j05890A7174J31902K82286K5647I2374
17411D92899A39934K21170A00986J76388K4948K7645I5459A5268a14640B27568
17400A89990o2206B6401A0858K21423m4873J61959a30531A18834f0035B64224
17389C8492J05793f778A73205a02054g561D05821p8647c14839B83964q2102N6986
17378B58848k2579a22900B15747K32062C5729A962K38365F3043K22893b4902j12275
$$ plain form
17367 -137177 294580 266298 -115359 219137 41756 -186133 76525 -44291 116102 133727
17357 133727 112417 -51458 171526 71648 337647 -177664 201111 202651 148272 123988 129250
17346 129250 -8344 338274 124861 56955 311116 344069 42399 519166 395532 609286
17336 609286 101864 87409 52293 180397 83624 -39759 315235 109138 298656 140490
17325 4078 164741 -23020 90093 87410 257737 364344 75609 122628 -50161 266233 -48367
17313 -109031 151400 118988 320621 28209 173817 -114424 13354 175615 233981 64911
17302 348231 61463 -145892 153808 154163 87145 265563 24883 -97275 16366 86573 202442
17291 202442 91869 -188540 -48968 169954 38744 -67319 -13822 371605 -49934 213902 196060
$$ packed form
17367a37177B94580k8282a15359B19137D1756a86133G6525d4291A16102J7625
17357A33727k1310e1458A71526G1648K65999a77664B01111J540n4379k4284N262
17346A29250h344C38274A24861E6955K54161L2953D2399M76767j23634K13754
17336F09286A01864j4455l5116J28104H3624c9759C15235A09138J89518A40490
17325D078J60663b3020I0093k683J70327J06607G5609M7019e0161B66233d8367
17313a09031A51400l2412K01633B8209J45608a14424A3354J62261N8366F4911
17302C48231F1463a45892A53808L55o7018J78418B4883i7275A6366P0207J15869
17291B02442I1869a88540d8968A69954C8744f7319a3822C71605d9934B13902j7842
$$ plain form
17280 196060 -71719 169907 139998 82164 136799 91119 197408 443165 137553 630738
17270 630738 234409 18101 217706 57196 -163042 250086 386452 538656 -94284 456400
17259 -58208 60001 51139 192387 221024 142595 95533 46529 39809 494856 -9490 263055 328541
17247 328541 2721 73058 475824 224442 97413 104394 414941 247204 138673 41882 357374
17236 357374 239403 292267 297425 211633 268817 -45516 228087 223519 -96767 72929 216901
17225 216901 315009 410300 404788 20542 468819 360658 238953 298282 320924 260374 205837
17214 205837 122332 158367 148821 192569 72402 394901 112868 47800 252705 -20937 296510
17202 187481 613692 74162 378345 442725 387503 83649 94445 362812 81673 -178526 150380
$$ packed form
17280A96060g1719A69907k9909n7834N4635m5680J06289K45757A37553M93185
17270F30738B34409A8101J99605E7196a63042B50086J36366J52204i4284D56400
17259e8208F0001q862J41248K8637p8429m7062D6529o720M55047i490B63055O5486
17247C28541B721P0337M02766B24442I7413O981L10547j67737j08531D1882L15492
17236C57374j17971N2864N158q5792N7184d5516B28087m568i6767G2929J43972
17225B16901R8108R5291n512B0542M48277j08161j21705N9329K2642o0550n4537
17214B05837q3505L6035r546M3748G2402L22499A12868D7800K04905b0937B96510
17202A87481M26211G4162L04183O4380n5222H3649J0796K68367H1673a78526A50380
$$ plain form
17190 351063 368753 254569 107460 303530 -15716 513887 122538 267988 204160 567328
17180 567328 303688 361384 410502 129571 209913 257931 158107 193263 383770 215492 320005
17169 320005 280749 237228 464158 -42348 317600 404167 38073 392299 365839 45980 93830
17158 93830 1310 295732 54186 322704 157778 -28077 173050 474368 199007 -29373 372100
17146 319040 545459 35411 259190 229748 69150 -3581 184038 500307 737553 368332
17135 309195 182801 20213 114354 247943 177607 227729 284115 122910 267850 364199 456249
17124 456249 274728 776561 341378 350086 137440 510149 274371 307430 236684 376706
17114 376706 322099 305736 682028 183828 274639 323211 503758 409297 589890 195493
$$ packed form
17190C51063J7690j14184A07460J96070a5716E13887A22538J45450o3828L63168
17180E67328k63640N7696M9118A29571Q0342M8018r9824L5156J90507j68278J04513
17169C20005l9256m3521K26930d2348C17600Q6567C8073L54226k6460D5980M7850
17158I3830A310K94422E4186K68518A57778b8077A73050L01318A99007b9373C72100
17146C19040K26419C5411K23779k9442F9150c581A84038L16269K37246C68332
17135C09195j26394B0213R4141J33589p0336N0122N6386A22910J44940R6349R2050
17124D56249j81521N01833C41378Q708A37440L72709k35778L3059p0746J40022
17114C76706n4607j6363L76292A83828R0811M8572J80547r4461J80593A95493
$$ plain form
17103 339086 100518 354177 378107 184657 197759 342640 473986 417760 342309 239811
17093 239811 382468 261364 50986 541742 187246 448481 528828 379381 187712 407462
17083 407462 -42878 324482 300377 237426 548579 -8097 476242 114147 209787 287284 381786
17072 381786 414841 240564 465428 189054 570942 506514 388313 115671 432401 267872
17062 267872 671050 364425 592978 383327 691489 498613 358673 411674 524065 356203
17052 356203 569835 594238 616133 685854 549262 736527 436403 577072 106562 305750
17042 305750 480219 508055 685741 87801 271793 486300 599957 530757 721745 445051
17032 445051 713334 450698 594981 533353 482224 658727 489313 829109 624398 469461
$$ packed form
17103C39086A00518K53659K3930A84657J3102J44881J31346n6226p5451j02498
17093B39811J42657j21104E0986M90756A87246K61235Q0347j49447A87712K19750
17083D07462d2878C24482k4105o2951L11153h097D76242A14147R5640P7497R4502
17072C81786L3055j74277K24864A89054L81888o4428j18201A15671L16730j64529
17062B67872M03178l06625K28553k09651L08162j92876j39940N3001J12391j67862
17052C56203K13632K4403K1895O9721j36592J87265l00124J40669A06562J99188
17042C05750J74469K7836J77686H7801J83992K14507J13657o9200J90988k76694
17032D45051K68283k62636J44283o1628n1129J76503j69414L39796k04711j54937
$$ plain form
17022 469461 509322 571676 388434 676804 656552 678171 605570 885694 795073 745789 685482
17011 685482 314745 690629 578128 334167 684017 721626 681558 800555 621480 751993
17001 751993 604934 937621 594704 598974 489607 265053 803317 751421 810018 936981
16991 936981 768101 736407 453839 813474 853414 513428 653620 699080 620094 692183
16981 692183 480530 665394 737049 642802 775745 895516 713957 764820 685453 1044889
16971 1044889 859351 703212 1274436 1067355 1000575 732682 731670 980373 787899 971227
16961 971227 817164 1019129 1142643 686642 795156 979975 935749 1219693 1027745 953481
16951 953481 1089147 1250658 936988 1070563 1095521 1025443 1229781 1376713 932356 871957
$$ packed form
17022D69461L9861O2354j83242K88370k0252K1619p2601K80124r0621m9284o0307
17011F85482C14745L75884j12501k43961L49850L7609m0068J18997j79075J30513
17001G51993j47059L32687l42917M270j09367k24554N38264n1896N8597J26963
16991I36981j68880l1694k82568L59635L9940l39986J40192M5460p8986P2089
16981F92183k11653J84864P1655r4247J32943J19771j81559N0863p9367L59436
16971A044889j85538j56139N71224k07081o6780k67893j012K48703j92474J83328
16961I71227j54063K01965J23514m56001J08514J84819m4226K83944j91948p4264
16951I53481J35666J61511l13670J33575K4958p0078K04338J46932m44357o0399
$$ plain form
16941 871957 1200501 1147685 1295153 1189075 924673 1207315 924768 1214888 1113755 1492339
16931 1492339 1443936 1314277 1168506 1260497 1001542 1157787 1023590 1227977 1393541 1542019
16921 1542019 1160052 1029178 1465896 1176224 1239786 1383656 1667195 1459472 1239447 1410285
16911 1410285 1407796 1673822 1440362 1501448 1206983 1479727 1442314 1757791 1484350 1008878
16901 1008878 1473332 1502977 1376239 1683430 1558691 1694649 1557692 1645201 1961144 1746102
16891 1746102 1714796 2011254 1935981 1873880 1877315 1823667 1935670 1841771 2108840 1983532 2207732
16880 2207732 2122020 1997662 2009128 2352109 2102223 1629152 2279939 2125073 2310833 2197894
16870 2197894 2434773 2392160 2376525 2214844 2440383 2385779 2519818 2572898 2656355 2679501
$$ packed form
16941H71957L28544n2816J47468j06078k64402K82642k82547K90120j01133L78584
16931A492339m8403j29659j45771R1991k58955J56245j34197K04387J65564J48478
16921A542019l81967j30874M36718k89672O3562J43870K83539k07723k20025J70838
16911A410285k489K66026k33460O1086k94465K72744l7413L15477k73441m75472
16901A008878M64454K9645j26738L07191j24739J35958j36957Q7509L15943k15042
16891A746102l1306K96458p5273o2101L435n3648J12003r3899K67069j25308K24200
16880B207732q5712j24358J1466L42981k49886m73071O50787j54866J85760j12939
16870B197894K36879m2613j5635j61681K25539n4604J34039N3080Q3457K3146
$$ plain form
16860 2679501 2745581 2656021 2669067 2947548 3111710 2917446 2693549 2619241 2601191 2782467
16850 2782467 2961911 2804084 2833016 3168529 3114944 3307086 3172723 3270545 3459874 3445721
16840 3445721 3709838 3521749 3479498 3699976 3887747 3685642 3832763 3866451 4230665 3871522
16830 3871522 4232719 4107602 4051228 4361102 4603386 4465716 4549554 4893707 4711460 4853396
16820 4853396 4842468 4899136 4987941 5093960 5337006 5281381 5311946 5416778 5788626 5963457
16810 5963457 5851909 5928626 6057403 6439801 6515130 6751815 6769688 6919351 6978729 6829684
16800 6829684 7595693 7581097 7664459 8028236 8321581 8408158 8368109 8607223 8928851 9121403
16790 9121403 9341641 9473663 9878572 9934015 10117837 10635358 11122462 11167423 11736596 11913919
$$ packed form
16860B679501O6080q9560J3046K78481J64162j94264k23897p4308j8050J81276
16850B782467J79444j57827K8932L35513n3585J92142j34363R7822J89329j4153
16840C445721K64117j88089m2251K20478J87771k02105J47121L3688L64214l59143
16830C871522L61197j25117n6374L09874K42284j37670Q3838L44153j82247J41936
16820D853396j0928N6668Q8805J06019K43046n5625L0565J04832L71848J74831
16810E963457j11548P6717J28777L82398P5329K36685J7873J49663N9378j49045
16800F829684P66009j4596Q3362L63777K93345Q6577m0049K39114L21628J92552
16790I121403K20238J32022M04909N5443J83822N17521M87104M4961N69173J77323
$$ plain form
16780 11913919 12146642 12547581 13104692 13264219 13723982 14103121 14902910 15219162 16066197
16771 16066197 16319962 16506994 16899584 17706908 18717076 18903313 19417298 20735977 21663358
16762 21663358 22263968 23253071 24178586 24972597 25979570 27313323 28355789 29371977 30650351
16753 30650351 32480891 33548152 35410634 37226515 39065475 40743707 43337106 45527893
16745 45527893 47769011 50473083 53276510 56047752 59623823 62931264 66879786 70668637
16737 70668637 74900827 79525651 84753497 90002772 95783572 101973528 108259647 115190631
16729 115190631 122391375 129629168 137688130 145633620 153589653 161401071 168922048 176503735
16721 176503735 182442221 188435630 192788481 196541201 198636202 199134906 197872394 195884079
$$ packed form
16780A1913919K32723M00939N57111J59527M59763L79139P99789L16252Q47035
16771A6066197K53765J87032L92590Q07324J010168J86237N13985J318679R27381
16762B1663358O00610R89103R25515P94011J006973J333753J042466J016188J278374
16753C0650351J830540J067261J862482J815881J838960J678232K593399K190787
16745D5527893K241118K704072K803427K771242L576071L307441L948522L788851
16737G0668637M232190M624824N227846N249275N780800O189956O286119O930984
16729A15190631P200744P237793Q058962P945490P956033P811418P520977P581687
16721A76503735N938486N993409M352851L752720K095001M98704j262512j988315
$$ plain form
16713 195884079 191998148 186787182 181446206 174273768 167133444 159252667 150725637 142977595
16705 142977595 134859069 126900094 119030880 111978471 105180732 98646616 92607524 86929251
16697 86929251 81375265 76665588 71694759 67747963 63878854 59847296 56638324 53356771
16689 53356771 50538606 47798424 44858550 42928269 40572733 38543726 36518990 35077246
16681 35077246 33052158 31539645 30396948 28532599 27293875 26226796 25173787 24072641
16673 24072641 23098496 22101795 21321720 20264490 19570875 18837735 18401072 17253093 17078663
16664 17078663 16413458 15646916 15453186 14505642 14071016 13408877 13259688 12452585 12191664
16655 12191664 11667078 11518738 11241025 10621520 10351414 10095152 10026828 9850874 9472660
$$ packed form
16713A95884079l885931n210966n340976p172438p140324p880777q527030p748042
16705A42977595q118526p958975p869214p052409o797739o534116o039092n678273
16697H6929251n553986m709677m970829l946796l869109m031558l208972l281553
16689E3356771k818165k740182k939874j930281k355536k029007k024736j441744
16681C5077246k025088j512513j142697j864349j238724j067079j053009j101146
16673B4072641r74145r96701p80075j057230o93615p33140m36663j147979j74430
16664A7078663o65205p66542j93730r47544m34626o62139j49189q07103k60921
16655A2191664n24586j48340k77713o19505k70106k56262o8324j75954l78214
$$ plain form
16646 9472660 9380738 8687132 8560994 8378714 7983750 7809272 7960955 7628743 7256758 7083004
16636 7083004 6725914 6901772 6993163 6081739 6347782 6124448 5772364 5862335 5625873 5766461
16626 5766461 5555437 5552305 5282442 5322166 4877044 5086179 4787825 4628292 4581994 4485691
16616 4485691 4315932 4331303 4137134 4237919 3771793 3803758 3531278 3519759 3576831 3837456
16606 3837456 3431855 3712255 3547637 3487312 3420986 3169024 3209783 3017295 3126170 3091260
16596 3091260 3012285 2794035 2857131 2679009 3326446 2863332 2917127 3166550 2636763 2467775
16586 2467775 2464454 2520060 2594840 2177715 2405585 2247076 2096706 2224335 2124991 2336556
16576 2336556 2081764 2046841 2138714 2039471 1799601 2044881 2036666 1669414 1951370 1720149
$$ packed form
16646I472660r1922o93606j26138j82280l94964j74478J51683l32212l71985j73754
16636G083004l57090J75858R1391r11424K66043k23334l52084Q9971k36462J40588
16626E766461k11024l132k69863L9724m45122K09135k98354j59533m6298r6303
16616D485691j69759J5371j94169J00785m66126L1965k72480j1519N7072K60625
16606C837456m05601K80400j64618o0325o6326k51962M0759j92488J08875l4910
16596C091260p8975k18250O3096j78122O47437m63114N3795K49423n29787j68988
16586B467775l321N5606P4780m17125K27870j58509j50370J27629r9344K11565
16576B336556k54792l4923R1873r9243k39870K45280q215l67252K81956k31221
$$ plain form
16566 1720149 2185972 1691443 1877594 1504001 2017954 1745851 1724474 1692714 1719343 1216634
16556 1216634 1631914 1456007 1825546 1702946 1512487 1295004 1481032 1343972 1484733
16547 1484733 1775667 1149625 1691459 1533780 1267666 1230294 1097267 1378119 1406991 1276605
16537 1276605 1174231 1173781 786371 1281860 996708 930749 1174160 999776 899115 1311468
16527 1311468 1084817 1061152 1041337 1287041 992175 779986 753870 1171150 751932 1314853
16517 1314853 832685 1126486 1206712 906961 1041136 838630 778068 868327 874764 886014
16507 886014 1047012 775321 832819 1014462 605077 918271 928515 1054367 767367 714264
16497 714264 589352 852320 799442 697439 814597 823809 651203 508624 830895 959955
$$ packed form
16566A720149M65823m94529J86151l73593N13953k72103k1377l1760K6629n02709
16556A216634M15280j75907L69539j22600j90459k17483J86028j37060J40761
16547A484733K90934o26042N41834j57679k66114l7372j33027K80852K8872j30386
16537A276605j02374m50l87410M95489k85152o5959K43411j74384j00661M12353
16527A311468k26651k3665j9815K45704k94866k12189k6116M17280m19218N62921
16517A314853m82168K93801Q0226k99751J34175k02506o0562R0259O437J1250
16507H86014J60998k71691N7498J81643m09385L13194J0244J25852k87000n3103
16497G14264j24912K62968n2878j02003J17158R212j72606j42579L22271J29060
$$ plain form
16487 959955 834929 654998 616589 960405 623272 623287 468176 774987 275681 539442
16477 539442 748431 403774 559084 321485 406206 662697 458127 653371 362696 435377
16467 435377 207424 562929 803926 451455 771069 553927 556785 776783 692316 335552
16456 640060 422493 406305 426896 317029 598738 378319 489175 461235 324982 337171
16446 337171 436342 269501 569195 483953 442876 231427 356287 464687 313219 599101
16436 599101 341817 341522 321842 512095 600938 246623 384044 412544 459146 584359 295705
16425 295705 304545 548441 385714 474045 140427 402454 409992 154377 -18245 366041 329114
16414 329114 181216 69985 566525 270874 249389 174381 143555 440675 173857 100818
$$ packed form
16487I59955j25026j79931l8409L43816l37133J5j55111L06811B75681K63761
16477E39442K08989l44657J55310k37599Q4721K56491k04570J95244k90675P2681
16467D35377B07424L55505K40997l52471L19614k17142K858K19998q4467C35552
16456F40060k17567j6188K0591j09867K81709k20419J10856k7940j36253J2189
16446C37171R9171j66841K99694q5242m1077k11449J24860J08400j51468K85882
16436E99101k57284k95j9680J90253Q8843B46623J37421K8500M6602J25213k88654
16425B95705Q840K43896j62727Q8331A40427K62027P538A54377a8245C66041l6927
16414C29114j47898F9985M96540B70874k1485p5008l0826K97120A73857p3039
$$ plain form
16404 100818 449595 276192 168762 224926 218783 170765 483784 67417 430113 152905
16393 87160 217328 261339 51555 458537 195985 169828 163782 178346 -48310 132998 463071
16382 463071 -8441 325429 -255244 -16644 414805 370489 318063 529046 276289 177471 242714
16371 242714 465403 180429 249111 38337 268692 17843 305502 4508 354920 245940
16361 245940 367174 387479 346692 44294 -46937 63450 109122 360276 234207 293918 241759
16350 241759 -79646 -7819 264820 201528 -106695 111872 286732 132740 400914 355392
16340 355392 208343 186753 40306 285456 84740 149703 -72418 444941 110306 252282
16330 252282 -186433 74807 93390 323475 210606 37401 216957 34157 163852 257739
$$ packed form
16404A00818L48777j73403j07430N6164o143m8018L13019F7417L62696A52905
16393H7160J30168M4011E1555M06982A95985k6157o046J4564d8310A32998L30073
16382D63071h441C25429b55244a6644D14805m4316n2426K10983k52757r8818O5243
16371B42714K22689A80429O8682C8337K30355A7843K87659D508L50412j08980
16361B45940J21234K0305m0787D4294d6937F3450M5672K51154j26069N9711n2159
16350B41759g9646g819B64820o3292a06695A11872J74860A32740K68174m5522
16340C55392j47049k1590D0306K45150H4740O4963g2418D44941A10306J41976
16330B52282a86433G4807J8583K30085j12869C7401J79556C4157J29695R3887
$$ plain form
16320 257739 -2732 44261 90590 212607 451099 -12182 293938 -102831 161229 403875
16310 403875 -10165 253189 285395 336844 147173 113551 -29369 -52159 65457 307292 193225
16299 193225 137736 344401 -79511 363180 -114126 112856 92729 -5865 316930 23264 237166
16288 237166 -27087 23418 83986 56228 1088 159695 421650 53493 113557 168003 256013
16277 256013 -101796 -257614 -132358 -249181 243561 340920 26383 -23281 93961 27846
16266 -92970 203203 214198 2113 224769 237721 71348 36172 217685 -22237 220809 -106548
16254 -129718 33775 343346 250625 354891 98814 -128620 -23753 -374891 -12467 77263 313741
16243 313741 -24846 -44655 57347 131632 158472 186613 -210618 -122097 -67368 275165 23782
$$ packed form
16320B57739b732D4261M6329J22017K38492a2182B93938a02831A61229K42646
16310D03875a0165B53189L2206N1449A47173l3622b9369k2790F5457K41835j14067
16299A93225n5489K06665g9511C63180a14126A12856k0127e865C16930B3264K13902
16288B37166b7087B3418O0568k7758A088J58607K61955E3493O0064N4446Q8010
16277B56013a01796j55818J25256j16823B43561R7359B6383b3281I3961B7846
16266i2970B03203J0995B113K22656J2952G1348l5176J81513b2237B20809a06548
16254a29718C3775L09571r2721J04266I8814a28620b3753l51138a2467G7263K36478
16243C13741b4846j9809E7347P4285K6840K8141b10618Q8521N4729B75165B3782
$$ plain form
16231 31202 97770 189125 359142 45394 -346401 -148222 84473 -56440 43114 28034 39031
16220 39031 -161815 51430 156343 345022 -92177 460049 351068 -313885 -31568 -110771
16210 -110771 199851 -248319 56685 -118943 -164326 187346 -253268 57728 87069 29682
16199 222638 -164760 140280 -180404 -265363 -94163 97128 -77024 158645 -39012 -31974 -82497
16188 -82497 -269574 250968 62436 38757 387182 96692 -149587 82545 -284694 29126 48549
16177 48549 39590 258551 7040 173288 -17258 496334 -3435 -252517 -220586 124941 -165590
16165 40354 51812 -154867 -19416 222035 -59212 -205825 -212311 -183465 15088 -40078 -147413
16154 -147413 -32603 -224795 -335226 -96201 64691 31565 -28703 62096 -192383 -140727 181281
$$ packed form
16231C1202O6568R1355J70017D5394c46401a48222H4473e6440D3114j5080J0997
16220C9031a61815E1430J04913J88679i2177D60049j08981c13885c1568p9203
16210a10771A99851b48319E6685a18943m5383A87346b53268E7728K9341B9682
16199B22638a64760A40280a80404q4959i4163I7128g7024A58645c9012P038n0523
16188h2497j87077B50968F2436k3679L48425I6692a49587H2545b84694B9126J9423
16177D8549q959K18961G040J66248a7258D96334c435k49082L1931A24941a65590
16165D0354J1458a54867a9416B22035e9212j46613o486K8846A5088d0078j07335
16154a47413c2603j92192j10431i6201F4691C1565b8703F2096a92383N1656A81281
$$ plain form
16142 -177458 177658 -353136 -319588 323864 220111 -161949 -70729 111960 -54678 231928
16131 -65981 -154902 325303 13628 -34617 -185943 85840 80564 -141878 -249463 341448 33329
16119 121213 -297708 98374 40422 -23990 -23230 2152 -26556 -193668 160056 -378345 234648
16107 226089 56012 -245153 -126284 -136935 4255 7751 126577 194257 -41193 -13234 29865
16095 154010 -256297 -38243 -87887 196140 275075 -22993 -52718 103621 159116 -133787 42717
16083 -59161 -231131 141762 -136729 55377 175064 52947 -35935 57950 158146 -310237
16072 -74675 -136161 291829 44865 -77617 88721 -91801 113014 40123 -299165 229835 -283027
16060 -49180 279502 -171448 -51563 222024 100280 -189790 -188264 -158789 94335 63196 -201767
$$ packed form
16142a77458A77658c53136L3548C23864j03753a61949g0729A11960e4678B31928
16131f5981q8921C25303A3628c4617j51326H5840n276a41878j07585C41448C3329
16119A21213b97708I8374D0422b3990P60B152b6556j67112A60056c78345B34648
16107B26089E6012b45153J18869j0651D255L496J18826O7680d1193a3234B9865
16095A54010b56297c8243m9644A96140P8935b2993k9725A03621N5495a33787D2717
16083e9161j71970A41762a36729E5377J19687E2947c5935E7950J00196c10237
16072g4675o1486B91829D4865g7617H8721i1801A13014D0123b99165B29835b83027
16060d9180B79502a71448e1563B22024A00280a89790J526K9475I4335l1139b01767
$$ plain form
16048 198927 103385 102009 44583 213997 22333 226188 -174647 30521 175180 154361 -163160
16036 -320981 -209388 -205421 61040 -256722 114575 -345323 -481680 -64499 -55282 177861 -224337
16024 73120 51303 289470 -76773 -238336 -287999 121691 222378 -67271 -116027 -266 70155
16012 -187657 -285683 -68417 121370 -339153 -135807 28370 95886 171446 -149920 -195608 177881
16000 -326611 -299776 102531 -293317 -178155 -60724 -516486 -338123 42636 -407674 373882
15989 -217471 7596 -77357 -236025 120024 -186311 44848 57998 290523 16968 266716 393114
15978 393114 72098 -79191 70516 -11783 48900 75350 32306 -85597 46855 -20312 -296745
15967 -296745 119157 -212362 76136 -514648 -66320 -231118 -95161 245122 -169534 -177750
$$ packed form
16048A98927r5542j376D4583J69414B2333K03855a74647C0521J44659k0819a63160
16036c20981J11593L967F1040b56722A14575c45323j36357f4499R217A77861b24337
16024G3120k1817K38167g6773j61563m9663A21691J00687f7271m8756b66G0155
16012a87657r8026f8417A21370c39153a35807B8370O7516P5560a49920m5688A77881
16000c26611K6835A02531b93317J15162f0724m55762J78363D2636d07674C73882
15989b17471G596g7357j58668A20024a86311D4848J3150K32525A6968K49748J26398
15978C93114G2098g9191G0516a1783D8900K6450C2306h5597D6855b0312k76433
15967b96745A19157b12362G6136e14648f6320j64798i5161B45122a69534q216
$$ plain form
15957 -177750 -296210 218884 9662 204374 38300 -153660 -132422 -264454 -24401 48598 -244796
15945 -46146 -163717 93 166368 32267 -9483 125842 -303060 -148332 -49101 -45905 -32093 38468
15932 -85549 -68225 -26357 323188 73936 -33087 -231885 5990 202818 129559 78675 -238914
15920 149443 -13287 -27531 -146025 216343 -538294 -327069 199822 -126237 17335 286574
15910 286574 86370 131084 215187 120353 -277216 -42301 22049 26813 -31499 -78344 -247398
15899 -247398 82525 193414 -58830 -393528 -224424 213699 109421 286436 -128331 -935
15888 -201816 -221429 212983 -157007 -160119 -59277 -44320 349503 -156875 -266620 -489767
15878 -489767 123495 17300 -246128 -127258 -186825 51204 -216839 -10613 -244221 40826
$$ packed form
15957a77750j18460B18884I662J94712C8300a53660K1238j32032b4401D8598b44796
15945d6146j17571I3J66275C2267i483A25842c03060a48332d9101L196J3812C8468
15932h5549J7324b6357C23188G3936c3087j98798E990J96828p3259n0884b38914
15920A49443a3287j4244j18494B16343e38294K11225A99822a26237A7335K69239
15910B86574H6370M4714Q4103r4834b77216d2301B2049M764c1499m6845j69054
15899b47398H2525J10889e8830l34698J69104B13699j04278J77015a28331i35
15888b01816j9613B12983a57007l112e9277J4957C49503a56875j09745k23147
15878d89767A23495A7300b46128J18870n9567E1204b16839a0613k33608D0826
$$ plain form
15867 -475943 -351391 -139288 80845 -118210 -369135 -22908 128011 91472 -148725 -234589
15857 -234589 -113488 -191784 89024 180034 -205805 -91987 51237 102733 255804 1726 -47158
15845 120389 203180 -199662 47621 -159632 403429 48937 150105 -71399 -66542 84375 263622
15834 263622 188328 -149552 -62760 67553 -9485 -39465 -49515 -185764 -184948 -232572 57498 -44634
15821 -147302 29257 -91460 -129709 -102588 25118 -33990 74639 -34512 -153568 -242343 125845
15809 -161296 -399151 -35549 -131239 -138347 84796 277694 115023 -177679 -309550 -168574
15799 -168574 -9166 -353782 -48965 108569 59357 -262822 213164 4721 -79849 -6413 115026
15787 -118054 323193 200985 -100416 111216 -87038 -176009 -72937 -251614 -108405 -15704
$$ packed form
15867d75943J24552a39288H0845a18210k50925b2908A28011l6539a48725q5864
15857b34589a13488p8296H9024R1010b05805i1987E1237N1496J53071A726d7158
15845A20389Q2791a99662D7621a59632D03429D8937J01168g1399M857H4375J79247
15834B63622p5294a49552f2760F7553i485k9980j0050j36249Q16m7624E7498d4634
15821a47302B9257i1460l8249K7121B5118c3990G4639c4512j19056q8775A25845
15809a61296k37855c5549r5690p108H4796J92898A15023a77679j31871J40976
15799a68574i166l44616d8965A08569m9212b62822B13164D721g9849f413A15026
15787a18054C23193j22208a00416A11216h7038q8971g2937j78677a08405a5704
$$ plain form
15776 -188387 -119817 -172273 -70640 -340077 -2758 275429 -298489 -106892 204766 165777 27798
15764 -251493 -122658 -194623 86740 154825 122121 -222440 279597 159545 137553 -46920 -200959
15753 -200959 -111202 -403880 91556 -33223 144973 308865 -216089 73728 -32269 -27350 -33727
15742 -33727 -144366 -160950 263729 273259 46858 -79572 234760 186778 34886 6895 -287671
15730 -16206 -63523 -288796 -309242 -3584 -142990 61881 41994 78012 -1976 238917 -217885
15718 -118255 -184401 -81645 9498 -299574 -72155 -520339 -27407 153904 -137324 229836 -169695
15706 -294 -332080 -335427 -243564 -258523 198302 -93286 78682 80107 103325 -6891 73666 -178373
15693 29215 -5055 -92178 -166709 66761 -70984 -133445 83535 -116089 31635 -456022 109680
$$ packed form
15776a88387O8570n2456g0640k69437b758B75429b98489a06892B04766l8989B7798
15764b51493a22658p1965H6740O8085l2704b22440B79597j20052k1992d6920j54039
15753b00959Q9757k92678I1556c3223A44973J63892b16089G3728c2269M919o377
15742c3727j10639j6584B63729R530D6858g9572B34760m7982C4886F895b87671
15730a6206m7317k25273k0446c584j39406F1881j9887L6018a976B38917b17885
15718a18255o6146h1645I498b99574g2155m48184b7407A53904a37324B29836a69695
15706b94l31786l347R1863j4959A98302i3286G8682J425K3218f891G3666a78373
15693B9215e055q7123p4531F6761g0984o2461H3535a16089C1635d56022A09680
$$ plain form
15681 69607 -21742 -158434 -255495 -207701 94383 -14043 123031 101641 -162646 141458 -37173
15669 28450 -94516 17818 -99521 -341793 153872 287388 -4852 -253843 -59833 -390552 128650
15657 41416 -120770 -382947 -104625 -55633 -48026 -242702 -231506 -168684 -156264 -118903 131510
15645 214097 -22084 -20729 -368114 244452 25203 -229373 184950 -239696 269614 -167875
15634 115148 57841 -59023 168516 -60600 235805 -101515 -105767 -84660 85806 69583 -374381
15622 -279704 167659 66797 -78 19008 292059 -26354 140549 -22509 172360 100753 -16050
15610 -27574 176662 -221008 -140852 365612 -231297 -441434 -327681 -10387 -287285 1165
15599 -216553 -286516 116375 -209345 -119691 -339690 124519 17392 107261 121299 462306
$$ packed form
15681F9607b1742j36692r7061M7794I4383a4043A23031k1390a62646A41458c7173
15669B8450i4516A7818i9521k42272A53872J33516d852k48991e9833l30719A28650
15657D1416a20770k62177a04625M8992P607j94676J1196O2822J2420L7361A31510
15645B14097b2084J355l47385B44452B5203b29373A84950b39696B69614a67875
15634A15148n7307e9023A68516f0600B35805a01515m252K1107H5806j6223c74381
15622b79704A67659F6797g8A9008K73051b6354A40549b2509A72360p1607a6050
15610b7574A76662b21008Q0156C65612b31297k10137J13753a0387k76898A165
15599b16553o9963A16375b09345Q9654k19999A24519A7392Q9869J4038L41007
$$ plain form
15589 462306 235547 144929 82997 32269 174801 86373 67368 -162237 -350444 -107906
15578 -300622 134718 -115225 -19783 170833 123767 -262027 176538 29251 248047 123612
15567 224271 -141047 -19702 -43689 -192062 -80640 -53 165548 266560 112373 6163 -162029
15555 -262520 89323 54019 -92807 -81947 -37605 28164 12211 26322 46210 -206274 184544
15543 -5273 122412 -90836 27529 -42299 171475 123371 219235 132906 75102 116343 239314
15532 239314 -356581 -234138 -106254 -216920 -134144 -312075 92266 89993 289574 -28992
15521 177870 -345733 155115 8315 261560 408081 -91517 -176424 116274 -207904 696 256881
15510 256881 27537 -145568 -205791 62382 27516 34637 208627 147801 -273067 -185560 19155
$$ packed form
15589D62306k26759r0618o1932C2269J42532H6373j9005a62237j88207a07906
15578c00622A34718a15225a9783A70833m7066b62027A76538B9251K18796A23612
15567B24271a41047a9702k3987j48373h0640e3A65548J01012A12373F163a62029
15555b62520H9323l5304i2807J0860c7605B8164A2211J4111J9888b06274A84544
15543e273A22412i0836B7529d2299A71475m8104R5864q6329n7804M1241J22971
15532B39314c56581J22443a06254j10666Q2776j77931I2266k273J99581b8992
15521A77870c45733A55115H315K53245J46521i1517q4907A16274b07904F96K56185
15510B56881B7537a45568o0223F2382B7516P121J73990o0826b73067Q7507A9155
$$ plain form
15498 100323 158463 71718 -215731 -312308 296164 -339727 -129509 -83993 203770 -76791
15487 127910 -18856 159727 -82915 38235 -142381 -55589 301625 40643 -391847 -51611 107569
15475 160237 180134 47356 277158 296489 -33006 178471 -298804 289947 -253636 -10798
15464 -483920 17209 105737 170756 246208 -223507 -215932 -126914 -89627 -122426 -305263 333490
15452 -136646 -23800 116811 120816 -65874 -16777 89163 13236 -104220 -61301 -112424 -147546
15441 -147546 -214460 104522 -149257 16668 80508 -278430 -260845 -21726 -6186 -192341 219040
15429 61160 -57325 -194183 -133674 77876 -206840 48469 -313271 26600 -21544 164322 19326
15417 -210871 61471 -89498 11433 -143372 -95449 13132 70709 -81350 110792 -62161 -195002
$$ packed form
15498A00323N8140G1718b15731r6577B96164c39727a29509M5516B03770g6791
15487A27910a8856A59727h2915C8235a42381e5589C01625D0643c91847e1611A07569
15475A60237J9897D7356K29802J9331c3006A78471b98804B89947b53636a0798
15464d83920A7209Q8528O5019P5452b23507P575Q9018L7287l2799j82837C33490
15452a36646b3800A16811M005f5874a6777H9163A3236a04220M2919n1123l5122
15441a47546o6914A04522a49257A6668O3840b78430J7585b1726f186j86155B19040
15429F1160e7325j36858O0509G7876b06840D8469c13271B6600b1544A64322A9326
15417b10871F1471h9498A1433a43372M7923A3132N7577h1350A10792f2161j32841
$$ plain form
15406 -195002 36843 -183006 -32803 -121596 135323 22968 -26791 177784 -86205 204775 198019
15395 198019 -96028 -31237 133224 -101055 -64426 -180385 120872 39384 -149424 239668
15384 -145469 -227148 -53156 232233 417677 -54850 169561 -35925 226185 -13128 120517
15373 8679 -164930 -2784 -42900 145820 162802 -84893 -18881 143470 166662 -71516 203137
15361 14060 -118429 191588 -46503 105338 -304025 3481 190832 16068 85169 -269028 85922
15349 85823 318998 -303009 -54196 100067 -65275 -117479 -329939 -80199 107541 50708 -259342
15337 44432 244010 -219105 -93204 290640 149513 31924 133916 30008 112348 -192761
15326 -38471 383522 -141040 -253406 -89436 -104218 -169361 -306471 -211944 267757 -68945 -17413
$$ packed form
15406a95002C6843a83006c2803q8793A35323B2968b6791A77784h6205B04775o756
15395A98019i6028c1237A33224a01055L6629j15959A20872C9384a49424B39668
15384a45469q1679e3156B32233J85444e4850A69561c5925B26185a3128A20517
15373H679a64930b784m0116A45820J6982h4893a8881A43470K3192g1516B03137
15361A4060a18429A91588d6503A05338c04025C481J87351A6068O9101b69028H5922
15349H5823K33175c03009e4196A00067f5275n2204k12460h0199A07541E0708b59342
15337D4432J99578b19105i3204B90640j41127C1924J01992C0008Q2340a92761
15326c8471C83522a41040j12366h9436j4782o5143j37110R4527B67757f8945a7413
$$ plain form
15314 232352 -208901 -155505 -320461 215083 -27672 71832 -198803 68836 -128870 272589
15303 -196681 -83145 206348 -121840 182994 225658 -142825 -47043 111875 -91024 52229
15292 -13054 133484 -308266 188895 12883 -7477 227327 157963 -74310 167859 -10226 37648
15280 187908 13412 -51491 -155878 166965 44148 242625 165320 120500 112000 28608 360780
15269 360780 -249482 54557 235695 -119347 258114 294044 56940 -72082 75079 -223186
15258 130669 72069 185981 483315 88569 142053 -40196 231663 316121 223685 678385 1401090
15247 1401090 1278478 1017384 1653547 927975 100457 -16349 297772 154139 283187 47159
15236 -192845 246709 -56305 158873 200914 319252 44429 -218385 21945 25115 -96131 43198
$$ packed form
15314B32352b08901N3396j64956B15083b7672G1832a98803F8836a28870B72589
15303a96681h3145B06348a21840A82994M2664a42825d7043A11875i1024E2229
15292a3054A33484c08266A88895A2883g477B27327o9364g4310A67859a0226C7648
15280A87908A3412e1491j04387A66965D4148J98477p7305m4820q500B8608L32172
15269C60780b49482E4557J81138a19347B58114L5930E6940g2082G5079b23186
15258A30669n8600J13912K97334H8569N3484d0196B31663Q4458r2436M54700P22705
15247A401090j22612k61094O36163p25572A00457a6349B97772j43633J29048D7159
15236a92845B46709e6305A58873M2041J18338D4429b18385B1945L170i6131D3198
$$ plain form
15224 158589 244868 -91693 164385 -12154 -63701 -215681 -27416 41746 165719 -81388 -197488
15213 -197488 -30988 163605 -89657 253649 158888 138496 75333 134263 -255697 563745 -82338
15201 69988 -178836 76117 -214892 93577 26828 110800 -31303 -27223 59803 -123442 73026
15189 50797 149611 55015 323896 190101 211893 509773 -181528 344125 26613 256725
15179 256725 34800 -41300 89347 121243 166178 -13064 120641 -107075 18336 -181260 -26752
15167 354098 -117100 213380 5301 -172895 103106 -58527 -26874 -121499 355645 68417 41461
15156 41461 24414 -128081 272510 -110768 106326 153632 381811 62193 -185909 343675
15145 330972 -35498 249214 26589 -23516 190441 309807 85271 121081 406304 226970
$$ packed form
15224A58589Q6279i1693A64385a2154n1547j51980b7416D1746J23973h1388j16100
15213a97488c0988A63605h9657B53649r4761k0392o3163N8930b55697E63745h2338
15201F9988a78836G6117b14892I3577B6828Q3972c1303M080E9803a23442G3026
15189E0797R8814E5015K68881j33795K1792K97880a81528C44125B6613K30112
15179B56725C4800d1300H9347L1896M4935a3064A20641a07075A8336a81260b6752
15167C54098a17100B13380E301a72895A03106e8527b6874r4625C55645F8417k6956
15156D1461j7047a28081B72510a10768A06326M7306K28179F2193a85909C43675
15145C30972c5498B49214B6589b3516A90441J19366H5271L5810K85223j79334
$$ plain form
15135 226970 5189 40186 214167 -29145 356636 220753 179561 175785 33278 -22435 46041
15123 -49330 188693 201554 47099 15811 60172 379142 324241 544135 231477 96959 12797
15111 -129043 -52939 -6255 66471 63687 167548 84513 -56782 53907 58650 211444 14694 -144757
15098 197453 -181016 223951 -256760 27662 -47539 286525 140326 443070 209657 266367
15088 266367 284172 -59894 34931 272776 441256 205817 227629 166447 69411 469458 208019
15076 27485 342526 72730 199141 3807 32117 416124 -42155 231707 170000 76922 -128823
15064 -89187 -33945 483164 257756 163034 -164961 188671 -22036 223402 276938 45498 2522
15052 136377 446209 147217 225495 275116 -11935 325068 -91270 171406 16840 74072 73894
$$ packed form
15135B26970E189L4997J73981b9145C56636j35883m1192l776C3278b2435D6041
15123d9330A88693J2861D7099A5811M4361L18970n4901K19894B31477I6959A2797
15111a29043e2939f255F6471k784J03861q3035e6782E3907M743J52794A4694a44757
15098A97453a81016B23951b56760B7662d7539B86525A40326L02744B09657N6710
15088B66367J7805e9894C4931K37845J68480B05817K1812o1182F9411M00047B08019
15076B7485L15041G2730J26411C807K8310L84007d2155B31707o1707G6922a28823
15064h9187c3945D83164k25408r4722a64961A88671b2036B23402N3536D5498B522
15052A36377L09832A47217P8278M9621a1935C25068i1270A71406A6840N7232j78
$$ plain form
15041 73894 209637 357211 198097 284468 -119626 323806 15387 155604 33499 263349
15031 263349 -79525 -99806 51999 221299 115538 -176453 -34043 509520 255712 109678
15020 282960 78261 -14660 56574 151021 171240 80096 -273056 513083 -125145 237421 135180
15009 135180 238715 -46978 351678 16936 -21727 253850 516794 145673 -96056 365155
14998 271441 184739 328286 249060 363331 338365 211620 227202 366807 8483 259563 -46054
14986 -157105 475190 303121 252120 48297 134231 252691 44709 231453 -57457 192527
14975 415353 372160 264201 80811 -52330 313063 280208 281827 237847 136986 179400 75576
14963 125596 363222 18347 289930 352320 335709 310867 65452 50260 617619 163511 380733
$$ packed form
15041G3894J35743J47574j59114Q6371a19626C23806A5387J40217C3499K29850
15031B63349g9525k0281E1999J69300j05761a76453c4043E09520k53808A09678
15020B82960G8261a4660E6574R4447K0219H0096b73056E13083a25145B37421j02241
15009A35180J03535d6978C51678A6936b1727B53850K62944A45673i6056C65155
14998B71441q6702J43547p9226J14271k4966j26745J5582J39605H483K51080d6054
14986a57105D75190j72069n1001D8297Q5934J18460D4709J86744e7457A92527
14975D15353m3193j07959H0811e2330C13063l2855J619m3980j00861M2414G5576
14963A25596K37626A8347K71583O2390j6611k4842F5452j5192N67359A63511K17222
$$ plain form
14952 380733 401804 311034 251881 245759 21643 283963 86209 576511 97308 300813 310572
14941 310572 672926 -37201 364640 -133666 609722 38427 164097 52560 430734 327459
14931 327459 514611 42147 39222 308744 455191 372522 278353 274021 196169 254789 197548
14920 197548 232258 283532 492307 304573 144174 310731 213305 315179 98181 268220
14910 268220 218057 300003 401242 240176 254588 103662 216938 479496 404770 424916
14900 424916 90525 246487 200100 232897 85264 549859 -17398 272288 203186 235584 589660
14889 589660 407414 244440 294595 294181 255803 326335 283609 158085 256124 508459 282455
14878 282455 433389 552667 160509 276746 337073 275646 414653 143555 499229 373546
$$ packed form
14952C80733K1071r0770n9153o122B1643K62320H6209M90302I7308K03505R759
14941C10572L62354c7201C64640a33666F09722C8427J25670E2560L78174j03275
14931C27459J87152D2147k925K69522J46447q2669r4169m332p7852N8620n7241
14920A97548L4710N1274K08775j87734A44174J66557r7426J01874I8181J70039
14910B68220n0163Q1946J01239j61066J4412A03662J13276K62558p4726K0146
14900D24916I0525J55962m6387L2797H5264M64595a7398B72288o9102L2398L54076
14889E89660j82246j62974N0155m14l8378P0532m2726j25524R8039K52335k26004
14878B82455J50934J19278A60509J16237O0327o1427J39007A43555L55674j25683
$$ plain form
14868 373546 303835 400410 555868 313854 703804 214522 402518 320637 -2551 354001
14857 268805 518335 571211 387947 462231 521109 78473 719181 178311 576595 599877
14847 599877 358880 577026 431601 271835 819626 204378 570701 343220 162028 745378
14837 745378 486064 223750 502465 484473 373115 405015 305948 380116 447331 565715
14827 565715 462032 411601 423229 427633 322244 145832 697729 266055 451333 426061
14817 426061 269175 675722 287245 494654 499255 172774 469106 628863 615432 478984
14807 478984 412059 755654 619014 662058 343253 900384 623476 346253 351913 893461
14797 893461 308687 591305 491185 544765 267772 341329 184142 464223 243123 458925
$$ packed form
14868C73546o9711R6575J55458k42014L89950B14522J87996q1881b551C54001
14857B68805K49530N2876j83264P4284N8878G8473O40708A78311L98284K3282
14847E99877k40997K18146j45425j59766N47791B04378L66323k27481A62028N83350
14837G45378k59314B23750K78715j7992j11358L1900r9067P4168O7215J18384
14827E65715j03683n0431J1628M404j05389A45832N51897B66055J85278k5272
14817D26061j56886M06547B87245K07409M601A72774K96332J59757j3431j36448
14807D78984o6925L43595j36640M3044l18805N57131k76908k77223N660N41548
14797H93461C08687K82618j00120N3580B67772P3557j57187K80081k21100K15802
$$ plain form
14787 458925 819866 563590 751639 401548 539663 594902 349156 620186 531871 524817
14777 524817 571554 802315 346396 725457 412109 444757 555491 407561 570863 625739
14767 625739 403741 368389 693489 780113 364335 678723 680500 750071 862516 525546
14757 525546 393845 596828 314867 807031 785669 880430 468871 456997 538181 681761
14747 681761 703075 1016373 451525 772990 740081 976739 775411 408664 716908 674679
14737 674679 763055 448567 741785 731964 680738 638049 997057 382120 906233 737808
14727 737808 742307 821075 953372 882988 882794 895143 741420 615899 875116 909784 878741
14716 878741 762089 839756 965491 722964 637125 591590 816465 895110 793624 890238
$$ packed form
14787D58925L60941k56276J88049l50091J38115N5239k45746K71030q8315p054
14777E24817M6737K30761C46396L79061l13348L2648J10734j47930J63302N4876
14767F25739k21998l5352L25100Q6624C64335L14388J777O9571J12445l36970
14757E25546j31701K02983k81961M92164k1362R4761m11559j1874Q1184J43580
14747F81761K1314L13298D51525L21465l2909K36658k01328l66747L08244m2229
14737F74679Q8376l14488K93218r821n1226m2689L59008C82120N24113j68425
14727G37808M499P8768J32297p0384j94J2349j53723j25521K59217L4668l1043
14716H78741j16652P7667J25735k42527q5839m5535K24875P8645j01486R6614
$$ plain form
14706 890238 586817 563318 763426 693789 913625 1119636 920606 758163 817187 1182516
14696 1182516 655933 841708 921943 725790 699968 818737 702020 805064 565519 880639
14686 880639 899461 745369 801573 1112966 804440 797892 350493 640066 931757 860117
14676 860117 706488 871425 720088 958356 805341 931773 1117384 963801 1071816 976351
14666 976351 1278519 972716 1170784 818274 701950 1054236 1124866 1256078 1212888 1036705
14656 1036705 1426754 888974 1171781 1107174 1076257 1239851 904887 1064179 935303 1277657
14646 1277657 979713 925006 1304869 1208492 1119614 1371922 1325237 1074053 1277010 1001136
14636 1001136 1116864 1189688 1287975 1534032 790760 1242551 1274405 993186 1378513 1090744
$$ packed form
14706H90238l03421k3499K00108o9637K19836K06011j99030j62443N9024L65329
14696A182516n26583J85775Q0235j96153k5822J18769j16717J03044k39545L15120
14686H80639J8822j54092N6204L11393l08526o548C50493K89573K91691p1640
14676H60117j53629J64937j51337K38268j53015J26432J85611j53583J08015r5465
14666I76351L02168l05803J98068l52510j16324L52286P0630J31212m3190j76183
14656A036705L90049n37780K82807o4607l0917J63594l34964J59292j28876L42354
14646A277657k97944n4707L79863r6377q8878K52308m6685k51184K02957k75874
14636A001136J15728P2824R8287K46057p43272M51791L1854k81219L85327k87769
$$ plain form
14626 1090744 1209751 1173516 1441941 1324485 1396359 1600759 1397399 1689239 1185298 1307169
14616 1307169 1694511 1416736 1548557 1681209 1524567 1587622 1190016 1526171 1512298 1588662
14606 1588662 1590933 1281057 1544471 1404844 1635025 1649048 1842520 1646542 1739462 1438222
14596 1438222 1342460 1662303 1595364 1834742 1775698 1748432 1862000 1614941 1712118 1810735
14586 1810735 1700138 1510373 1754680 1653579 1886702 1781835 1533769 1380589 1694698
14577 1694698 1968130 2112275 2006809 2164002 2275722 2042023 2026311 2030364 2349334 1880525
14567 1880525 2277159 2385130 2814723 2621435 2272091 2123365 2664132 2771379 3091494
14558 3091494 3110852 2889087 3196438 3122108 3401100 3721895 4015611 4440660 5361801 7512979
$$ packed form
14626A090744J19007l6235K68425j17456P1874K04400k03360K91840n03941J21871
14616A307169L87342k77775J31821J32652j56642O3055l97606L36155j3873P6364
14606A588662K271l09876K63414j39627K30181J4023J93472j95978R2920l01240
14596A438222r5762L19843o6939K39378n9044k7266J13568k47059R7177R8617
14586A810735j10597j89765K44307j01101K33123j04867k48066j53180L14109
14577A694698K73432J44145j05466J57193J11720k33699j5712M053L18970m68809
14567A880525L96634J07971M29593j93288l49344j48726N40767J07247L20115
14558C091494J9358k21765L07351p4330K78992L20795K93716M25049R21141K151178
$$ plain form
14548 7512979 12652166 22149003 39795992 43377621 20906272 8490889 3794788 2599118
14540 2599118 2172636 2121633 1772878 1922982 1855356 1976172 2016024 2118895 1991922 2060795
14530 2060795 2041826 2223834 2075399 2369281 2043913 2622045 2226036 2460427 2388766 2606949
14520 2606949 2493520 2711639 2310172 2204128 2430386 2596228 2561205 2938369 2649629 2782364
14510 2782364 2917418 2933018 2738152 2963325 2920720 3036548 2820332 2796932 3193266 2975583
14500 2975583 2967395 2766932 3199784 3030862 2947203 3487303 3409415 3029164 3447915 3374125
14490 3374125 3651679 3280616 3703027 3741420 3446889 3702038 3573613 3571947 3633868 3938000
14480 3938000 3722761 3588602 3820919 3922977 3777816 3646345 3653727 4033189 4038019 4197521
$$ packed form
14548G512979N139187R496837J7646989L581629B0906272H490889C794788j195670
14540B599118m26482n1003l48755J50104o7626J20816L9852J02871j26973O8873
14530B060795j8969J82008j48435K93882l25368N78132l96009K34391p1661K18183
14520B606949j13429K18119m01467j06044K26258J65842l5023L77164k88740J32735
14510B782364J35054J5600j94866K25173m2605J15828k16216k3400L96334k17683
14500B975583q188k00463M32852j68922q3659N40100p7888l80251M18751p3790
14490C374125K77554l71063M22411L8393k94531K55149j28425j666O1921L04132
14480C938000k15239j34159K32317J02058j45161j31471P382L79462M830J59502
$$ plain form
14470 4197521 4084900 4315258 4338998 4442825 4351128 4384667 4348087 4373663 4463362 4396668 4465823
14459 4465823 4595692 4898645 5086085 4822718 5020526 5090152 5134792 5267280 4929351 5003951
14449 5003951 5196604 5051227 5377802 5418194 5639044 5805605 5660810 5563112 5840352 5881281
14439 5881281 6081211 5987905 6358391 6354389 6221621 6282853 6299779 6530210 6651418 6734032
14429 6734032 6656550 6879666 6918059 7315107 7194633 7269132 7565455 7490547 7656536 7502666
14419 7502666 7354318 8339861 7830718 8040471 8267990 8556411 8480922 8638274 8644700 8839751
14409 8839751 8783403 9344219 9351519 9730522 9596378 9717171 9620312 9633400 9971795 10294202
14399 10294202 10561182 10616130 10569159 10873761 11152925 11293311 11710218 11671066 11821540 12200512
$$ packed form
14470D197521j12621K30358K3740J03827r1697L3539l6580K5576Q9699o6694O9155
14459D465823J29869L02953J87440k63367J97808O9626M4640J32488l37929P4600
14449E003951J92653j45377L26575M0392K20850J66561j44795r7698K77240M0929
14439E881281J99930r3306L70486m002j32768O1232J6926K30431J21208Q2614
14429F734032p7482K23116L8393L97048j20474P4499K96323p4908J65989j53870
14419G502666j48348R85543n09143K09753K27519K88421p5489J57352O426J95051
14409H839751n6348N60816P300L79003j34144J20793r6859J3088L38395L22407
14399A0294202K66980N4948m6971L04602K79164J40386M16907l9152J50474L78972
$$ plain form
14389 12200512 12117704 12375338 12684878 12728151 13514369 13226010 13649004 14008335 14382006 14246741
14379 14246741 14658320 14901634 15249209 15333377 15870967 15894834 16505746 16774936 17089398 17548832
14369 17548832 17568864 18052811 18559972 18986935 19128171 19904535 19964250 20591442 20795258 21400807
14359 21400807 21930742 22448738 22860935 23668290 23980593 24600128 25011118 25528127 26181911
14350 26181911 26928507 27245631 28398229 28948406 29618633 30184181 31120465 31894786 32928238
14341 32928238 33371901 34471183 35531067 36397345 37546995 38701925 39413839 40945139
14333 40945139 41762030 43016699 44138062 45255131 46916602 48639854 50038957 51658460
14325 51658460 53197985 55171110 56679917 58958749 60826375 62827210 65366713 67791691
$$ packed form
14389A2200512q2808K57634L09540M3273P86218k88359M22994L59331L73671j35265
14379A4246741M11579K43314L47575Q4168N37590K3867O10912K69190L14462M59434
14369A7548832K0032M83947N07161M26963J41236P76364N9715O27192K03816O05549
14359B1400807N29935N17996M12197Q07355L12303O19535M10990N17009O53784
14350B6181911P46596L17124J152598N50177O70227N65548R36284P74321J033452
14341C2928238M43663J099282J059884Q66278J149650J154930P11914J531300
14333D0945139Q16891J254669J121363J117069J661471J723252J399103J619503
14325E1658460J539525J973125J508807K278832J867626K000835K539503K424978
$$ plain form
14317 67791691 70156495 72425958 75406579 78436666 81392650 84709210 88074511 91314939
14309 91314939 95244825 99045823 103642399 108095790 112487403 117541635 122849065 128693607
14301 128693607 134467982 141103800 147740645 154947262 162569527 170652831 179055537 187833884
14293 187833884 197353363 207328840 217923219 228802843 240735831 252820885 265079620
14286 265079620 278523603 292243336 306317395 320959997 335351153 349798352 364038257
14279 364038257 378115733 391665847 404345704 415843658 426538564 435310086 441204522
14272 441204522 442500145 442683736 443209485 443628252 443247417 440329496 435197772 427606391
14264 427606391 419189731 408641909 396243979 382989111 368419338 353812342 338892711
$$ packed form
14317F7791691K364804K269463K980621L030087K955984L316560L365301L240428
14309I1314939L929886L800998M596576M453391M391613N054232N307430N844542
14301A28693607N774375O635818O636845P206617P622265Q083304Q402706Q778347
14293A87833884R519479R975477J0594379J0879624J1932988J2085054J2258735
14286B65079620J3443983J3719733J4074059J4642602J4391156J4447199J4239905
14279C64038257J4077476J3550114J2679857J1497954J0694906Q771522N894436
14272D41204522J295623J83591N25749M18767l80835k917921n131724p591381
14264D27606391q416660j0547822j2397930j3254868j4569773j4606996j4919631
$$ plain form
14257 338892711 323605230 309240363 294839140 281974529 268524595 255197045 242683552
14250 242683552 231113740 219650767 209045280 198609809 189171233 180065021 172003736
14243 172003736 164196850 156212331 149045550 142172922 135510590 129914010 124606629 119009134
14235 119009134 113768806 108957689 104616883 100489415 96687247 92860735 88792123 85523102
14227 85523102 82139022 79237714 76017018 73185304 70711691 68335680 65869253 63788839
14219 63788839 61822238 59314396 57287661 55549010 53692052 52224068 50660326 48938285
14211 48938285 47571389 45945157 44541139 43562615 42834268 41888057 40003754 38462826
14203 38462826 37753334 36886946 36091806 35277683 34165838 33130450 32246076 31197415 30634989
$$ packed form
14257C38892711j5287481j4364867j4401223j2864611j3449934j3327550j2513493
14250B42683552j1569812j1462973j0605487j0435471r438576r106212q061285
14243A72003736p806886p984519p166781o872628o662332n596580n307381n597495
14235A19009134n240328m811117m340806m127468l802168l826512m068612l269021
14227H5523102l384080k901308l220696k831714k473613k376011k466427k080414
14219F3788839j966601k507842k026735j738651j856958j467984j563742j722041
14211D8938285j366896j626232j404018r78524p28347r46211j884303j540928
14203C8462826p09492q66388p95140q14123j111845j035388q84374j048661n62426
$$ plain form
14194 30634989 30133350 29110734 28722375 27589509 26561356 26362888 25913264 25059506 24627378
14185 24627378 24184570 23549105 22786299 22642852 21831326 21636601 21152866 20418445 20233545
14176 20233545 19630996 19558400 18960561 18500856 18209979 18113101 17696195 17447629 16771168 16695262
14166 16695262 16180914 15880348 15848610 15606657 15249185 14852826 14664537 14606564 13985550 13860492
14156 13860492 13703511 13269814 13037302 13017494 12721052 12400320 12464714 12087620 11822856 11923601
14146 11923601 11602338 11357939 11226318 10750232 11084130 10963053 10935364 10245856 10243010 10118420
14136 10118420 10019838 9775508 9933485 9658621 9476805 9221868 9314196 9139274 9059975 8641206
14126 8641206 8570338 8563371 8531135 8588751 8004495 8054316 7770726 7713231 7520931 7546860 7770351
$$ packed form
14194C0634989n01639j022616l88359j132866j028153j98468m49624q53758m32128
14185B4627378m42808o35465p62806j43447q11526j94725m83735p34421j84900
14176B0233545o02549p2596n97839m59705k90877r6878m16906k48566o76461p5906
14166A6695262n14348l00566l1738k41953l57472l96359j88289n7973o21014j25058
14156A3860492j56981m33697k32512j9808k96442l20732O4394l77094k64764J00745
14146A1923601l21263k44399j31621m76086L33898j21077k7689o89508k846j24590
14136A0118420r8582k44330J57977k74864j81816k54937R2328j74922p9299m18769
14126H641206p0868o967l2236N7616n84256M9821k83590n7495j92300K5929K23491
$$ plain form
14115 7770351 7367653 7544590 7399366 7000336 7221283 7110524 7155318 6876726 6607775 6611767
14105 6611767 6683175 6513370 6275781 6448819 6140166 6259506 5978270 5953486 6049591 6005384
14095 6005384 5613040 6038031 5487409 5502056 5525943 5412977 5387963 5788203 5184545 5306465
14085 5306465 5255423 5315088 5240932 5274886 4657997 5038049 5313065 4707387 4663759 4876126
14075 4876126 4639669 4824867 4597523 4485173 4610848 4627020 4385757 4331824 4385225 4106789
14065 4106789 4290622 4132524 4206795 4271478 4380820 4251131 4096493 4079375 4296000 4301152
14055 4301152 3712431 3927067 3824727 3638234 3800853 3598916 3492869 3463303 3573971 3526425
14045 3526425 3521372 3529423 3409272 3347501 3105193 3303415 3133540 3174466 3014623 3320035
$$ packed form
14115G770351m02698J76937j45224l99030K20947j10759M4794k78592k68951L992
14105F611767P1408j69805k37589J73038l08653J19340k81236k4784R6105m4207
14095F005384l92344M24991n50622J4647K3887j12966k5014M00240o03658J21920
14085E306465n1042N9665p4156L3954o16889L80052K75016o05678m3628K12367
14075D876126k36457J85198k27344j12350J25675J6172k41263n3933N3401k78436
14065D106789J83833j58098P4271O4683J09342j29689j54638j7118K16625N152
14055D301152n88721K14636j02340j86493J62619k01937j06047k9566J10668m7546
14045C526425n053Q051j20151o1771k42308J98222j69875M0926j59843L05412
$$ plain form
14035 3320035 3027295 3084423 3311950 3317394 3013306 3044588 2968831 3049266 2924746 3076452
14025 3076452 2796630 2523322 2728320 2802459 2631590 2730922 2508497 3099103 2816702 2551769
14015 2551769 3047130 2539518 2551712 2522368 2248200 2462523 2130000 2137906 2508682 2261735
14005 2261735 2509468 2026543 2588987 2328859 2097425 2304776 1927965 2278646 2212282 2127929
13995 2127929 1927019 1784051 2280427 2074131 2077011 2366253 3823092 7055789 15347340
13986 15347340 33145194 45783034 25493586 12361754 7637522 5969757 4760410
13979 4760410 4286817 3630055 3296761 3041433 3142330 2949263 3066196 2983118 2805056 2893935
13969 2893935 2483078 2273713 2213799 2293499 2157872 2399477 2238407 2137814 2461445 2464609
$$ packed form
14035C320035k92740N7128K27527N444l04088L1282p5757Q0435j24520J51706
14025C076452k79822k73308K04998P4139j70869R9332k22425N90606k82401k64933
14015B551769M95361n07612J2194k9344k74168K14323l32523P906L70776k46947
14005B261735K47733m82925N62444k60128k31434K07351l76811L50681o6364q4353
13995B127929k00910j42968M96376k06296K880K89242J456839L232697Q291551
13986A5347340J7797854J2637840k0289448A2361754m724232j667765j209347
13979D760410m73593o56762l33294k55328J00897j93067J16933q3078j78062Q8879
13969B893935m10857k09365n9914P9700j35627K41605j61070j00593L23631L164
$$ plain form
13959 2464609 2208238 2294649 2117857 2254694 1959929 1954710 2074938 1910397 1909092 2082067
13949 2082067 1877483 2012362 2151982 1792761 1735750 1574851 1772472 1653574 1656453 1758830
13939 1758830 1844210 1728589 1709763 1814286 1502749 1850034 1871231 1438286 1582432 1992262
13929 1992262 1485627 1397988 1627935 1404325 1718387 1571068 1598788 1751628 1677886 1445631
13919 1445631 1467457 1628487 1737546 1880766 1505059 1626569 1523402 1507377 1251353 1437124
13909 1437124 1636017 1496800 1704450 1109889 1403113 1287616 1478408 1457088 1416031 1276274
13899 1276274 1683852 1260523 1512686 1376429 1640729 1401354 1607116 1188712 1402446
13890 1402446 1245049 1651148 1405172 953105 1268452 1570615 1159981 1536970 895379
$$ packed form
13959B464609k56371Q6411j76792J36837k94765n219J20228j64541j305J72975
13949B082067k04584J34879J39620l59221n7011j60899J97621j18898K879J02377
13939A758830Q5380j15621j8826J04523l11537L47285K1197m32945J44146M09830
13929A992262n06635q7639K29947k23610L14062j47319K7720J52840p3742k32255
13919A445631K1826J61030J09059J43220l75707J21510j03167j6025k56024J85771
13909A437124J98893j39217K07650n94561K93224j15497J90792k1320m1057j39757
13899A276274M07578m23329K52163j36257K64300k39375K05762m18404K13734
13890A402446j57397M06099k45976m52067L15347L02163m10634L76989o41591
$$ plain form
13881 895379 1133194 1241040 1355461 1102509 1016360 1371654 1195629 1461160 972239 1195066
13871 1195066 1032543 896534 999847 976804 1415416 1093764 1196193 1207038 1300212 1262865
13861 1262865 936822 1152539 1137871 1120335 1333966 1118085 972175 1170394 1088266 1798941
13851 1798941 1187609 1438639 1393714 833122 965133 1127626 822577 1028976 995559 1065673
13841 1065673 1243618 1009822 987320 889556 1216831 913003 1220323 913380 1132115 841074
13831 841074 881537 1043409 1041410 1070064 857543 1140501 731617 637433 978517 1159274
13821 1159274 733605 1320021 851981 725253 976414 1008018 738323 872611 884811 745593
13811 745593 871416 713881 882421 895628 811381 677360 1128197 685823 907676 965364
$$ packed form
13881H95379K37815J07846J14421k52952q6149L55294j76025K65531m88921K22827
13871A195066j62523j36009J03313k3043M38612l21652J02429J0845R3174l7347
13861A262865l26043K15717j4668j7536K13631k15881j45910J98219q2128P10675
13851A798941o11332K51030m4925n60592J32011J62493l05049K06399l3417P0114
13841A065673J77945k33796k2502r7764L27275l03828L07320l06943K18735k91041
13831H41074M0463J61872j999K8654k12521K82958m08884r4184L41084J80757
13821A159274m25669N86416m68040j26728K51161L1604k69695J34288J2200j39218
13811G45593J25823j57535J68540J3207q4247j34021M50837m42374K21853N7688
$$ plain form
13801 965364 856836 994488 722894 791978 756178 1129300 760625 891034 763522 716384
13791 716384 750150 844004 729061 803228 836484 759577 504608 555494 845251 874524 875399
13780 875399 626489 455093 1186252 879671 741145 786405 755421 296650 780470 678692
13770 678692 778300 1023573 715361 542153 487667 757655 726792 778726 690921 705411 671913
13759 671913 464400 631677 800057 876799 966116 449025 887074 626178 626443 1103321
13749 1103321 647863 740562 681766 884444 442654 869192 728387 695232 404797 947933
13739 947933 615574 749694 518591 607939 515402 743161 516700 432249 602853 481815
13729 481815 623160 649442 694399 573122 515871 827642 480494 885701 316326 599343
$$ packed form
13801I65364j08528J37652k71594O9084l5800L73122l68675J30409j27512m7138
13791G16384L3766R3854j14943P4167L3256p6907k54969N0886K89757K9273Q75
13780H75399k48910j71396P31159l06581j38526M5260l0984B96650M83820j01778
13770F78692R9608K45273l08212j73208n4486K69988l0863N1934q7805J4490l3498
13759F71913k07513J67277J68380P6742Q9317D49025M38049k60896K65M76878
13749A103321m55458R2699n8796K02678m41790M26538j40805l3155k90435N43136
13739I47933l32359J34120k31103Q9348r2537K27759k26461q4451J70604j21038
13729D81815J41345K6282M4957j21277n7251L11771l47148M05207C16326K83017
$$ plain form
13719 599343 342994 744782 528543 541979 727649 568228 395634 495086 555022 189213
13708 807415 583885 628028 470469 304190 356969 553423 748381 278894 351206 822858
13698 822858 777096 385966 283905 259736 473765 371003 481984 812498 344088 634477
13688 634477 482851 547098 802525 610304 898746 557121 332415 391890 278203 466433
13678 466433 613848 586084 285333 428623 611319 603916 546365 416763 260184 797398
13668 797398 238800 345390 405185 538490 269702 439912 253636 707939 275569 388718
13658 388718 665891 435036 652553 739033 731682 680676 169684 669745 238681 497121
13648 497121 621572 444533 151817 551971 149340 502957 387980 406323 408167 527227
$$ packed form
13719E99343k56349M01788k16239J3436J85670j59421j72594R9452N9936A89213
13708H07415k23530M4143j57559j66279N2779J96454J94958B78894P2312M71652
13698H22858m5762C85966j02061k4169K14029j02762J10981L30514C44088K90389
13688F34477j51626O4247K55427j92221K88442l41625k24706N9475j13687J88230
13678D66433J47415k7764B85333J43290J82696p403n7551j29602j56579N37214
13668G97398B38800J06590N9795J33305k68788J70210j86276M54303B75569J13149
13658C88718K77173k30855K17517Q6480p351n1006A69684N00061B38681K58440
13648D97121J24451j77039A51817M00154A49340L53617j14977J8343J844J19060
$$ plain form
13638 527227 481602 678748 520009 511847 338928 615676 402042 435791 456083 376923 504131
13627 504131 566548 159356 326526 521995 680711 626345 395750 212065 318871 385715
13617 385715 368584 309531 698609 518536 545585 501040 303901 490467 65145 365647
13607 365647 420005 209511 303530 233031 149426 739930 7251 407181 442249 331258 517796
13596 517796 704995 415013 504300 610284 724935 307790 502089 35379 251127 301451
13586 301451 89621 413383 342519 287298 203218 217929 98980 273209 394653 292792 269303
13575 269303 318516 336535 576564 275919 283268 452715 415363 190407 457715 343318
13565 343318 131112 570645 165851 521305 496352 89905 510988 251699 232689 166791
$$ packed form
13638E27227m5625J97146j58739q162j72919K76748k13634L3749K0292p9160J27208
13627E04131O2417A59356J67170J95469J58716n4366k30595j83685J06806O6844
13617C85715j7131n9053L89078j80073K7049m4545j97139J86566F5145L00502
13607C65647N4358B09511R4019p0499q3605N90504G251L99930L5068j10991J86538
13596E17796J87199k89982Q9287J05984J14651C07790J94299C5379K15748N0324
13586C01451H9621L23762p0864n5221q4080J4711I8980J74229J21444j01861k3489
13575B69303M9213J8019K40029B75919P349J69447l7352A90407K67308j14397
13565C43318A31112M39533A65851L55454k4953H9905M21083B51699j9010o5898
$$ plain form
13555 166791 472077 352109 107373 438738 130455 6999 222264 480116 411146 592929
13545 592929 479650 468099 342747 67621 269748 242142 294080 597353 336805 222395
13535 222395 86367 298612 281126 174996 141535 345864 220608 159685 351070 237204
13525 237204 134749 491334 252910 292377 266330 138119 740783 70842 236058 224889
13515 224889 58912 380575 368774 193893 326561 495797 291776 276099 319513 395495
13505 395495 450881 257131 520426 462416 167177 88528 101671 406627 151110 417346
13495 417346 423450 26609 200551 90318 195789 422359 468242 629953 40455 442258 218497
13483 190972 15417 208321 633970 336717 247212 378009 187134 358543 218834 315872
$$ packed form
13555A66791L05286j19968A07373L31365A30455F999K15265K57852o8970J81783
13545E92929j13279j1551j25352F7621K02127k7606N1938L03273k60548j14410
13535B22395H6367K12245j7486j06130l3461K04329j25256o0923J91385j13866
13525B37204j02455L56585k38424L9467k6047j28211O02664G0842J65216j1169
13515B24889E8912L21663j1801j74881J32668J69236k04021j5677M3414P5982
13505C95495N5386j93750K63295n8010A67177p8649J3143L04956A51110K66236
13495D17346O104B6609J73942I0318J05471K26570M5883J61711D0455M01803B18497
13483A90972A5417J92904M25649k97253q9505J30797A87134J71409j39709R7038
$$ plain form
13473 315872 165111 227485 129083 231733 373947 488364 372262 213465 97070 143933
13463 143933 190961 37015 279148 167855 178408 302356 195733 317821 169619 561422
13453 561422 172722 473839 308808 216574 -18854 26711 279906 -80713 62332 51911 334503
13442 334503 165033 9511 680720 300027 303880 184370 228524 2579 265158 164907 -155574
13430 191273 205550 250990 -75990 -8277 176240 404973 136750 126633 311893 132118 -45988
13418 153943 256984 249794 46957 162986 138980 97632 143487 180489 262394 52838 -87144
13406 276507 49656 -110695 66686 58 186839 76823 -90713 -33062 99829 238683 441748
13395 441748 177499 -119047 425835 324315 103242 106408 115104 128336 145484 76857 295673
$$ packed form
13473C15872j50761O2374r8402J02650J42214J14417j16102j58797I7070M6863
13463A43933M7028C7015K42133j11293J0553J23948j06623J22088j48202L91803
13453E61422A72722L01117j65031r2234a8854B6711K53195h0713F2332j0421K82592
13442C34503A65033I511O71209C00027L853j19510M4154B579K62579j00251a55574
13430A91273J4277M5440g5990h277A76240K28733A36750j0117J85260A32118d5988
13418A53943J03041p190D6957J16029k4006m1348M5855L7002Q1905E2838h7144
13406B76507D9656a10695F6686E8J86781G6823i0713c3062I9829J38854K03065
13395D41748A77499a19047D25835j01520A03242L166Q696J3232J7148o8627K18816
$$ plain form
13384 295673 211488 177308 202145 -21315 21874 237191 90723 1977 758856 9799 144772
13373 144772 239000 173509 250573 429908 343408 272152 -131484 165878 194563 32405 298515
13362 298515 33865 685 352401 106500 211983 -12063 -13943 250759 246293 153021 73164
13350 14492 138852 215674 338890 122931 436883 -60306 485991 534621 456765 291987
13340 291987 91569 227870 391481 237760 302514 398238 377668 214080 225549 150848 138176
13329 138176 213509 380901 113981 61971 217534 154075 -214747 -5953 327323 353330 193832
13318 193832 520590 335226 76005 27005 203469 24335 246529 293824 -85863 35753 -105147
13306 126321 222978 283797 -217633 198971 224979 518281 400573 93958 263047 -109296
$$ packed form
13384B95673q4185l4180K4837b1315B1874K15317I0723A977P56879I799J34973
13373A44772R4228o5491P7064J79335q6500p1256a31484A65878K8685C2405K66110
13362B98515C3865F85L51716A06500J05483a2063j880B50759m466r3272G3164
13350A4492J24360P6822J23216A22931L13952f0306D85991M8630p7856j64778
13340B91987I1569J36301J63611j53721O4754R5724k0570j63588J1469p4701j2672
13329A38176P5333J67392A13981n2010J55563o3459b14747e953C27323K6007j59498
13318A93832L26758j85364G6005B7005J76464B4335K22194M7295h5863C5753a05147
13306A26321R6657O0819b17633A98971K6008K93302j17708I3958J69089a09296
$$ plain form
13295 266261 300963 50349 3503 317211 219978 177326 -157491 36264 405786 348140 -2242
13283 281987 123641 3387 214031 119812 108341 -38850 6359 150393 230717 28923 134629
13272 134629 -17574 265543 92978 297712 182170 484484 14439 30122 27892 -8832 354281
13260 32591 154793 56540 486836 141495 -241878 380944 166046 98081 61225 198662
13250 198662 117846 274667 268907 112365 210325 160298 150243 283421 138246 3003 304653
13239 304653 294047 117662 -31967 -154936 51069 260310 66810 53856 152634 217812 115922
13228 115922 367822 229265 -52426 47382 104862 5160 109758 -172682 305535 -376213
13217 25969 153073 205614 -225586 185019 -34923 433 242136 220329 -49411 -111769 -129495
$$ packed form
13295B66261L4702E0349C503L13708r7233m2652a57491C6264L69522n7646b242
13283B81987A23641C387K10644r4219j1471c8850F359J44034Q0324B8923J05706
13272A34629a7574B65543I2978K04734j15542L02314A4439J5683k230h832C54281
13260C2591J22202E6540M30296A41495b41878C80944A66046o7965l6856J37437
13250A98662q0816J56821n760A12365R7960n0027j0055J33178A38246C003L01650
13239C04653j0606A17662c1967j22969E1069K09241F6810j2954R8778O5178j01890
13228A15922K51900j38557e2426D7382N7480E160J04598a72682C05535c76213
13217B5969J27104N2541b25586A85019c4923D33K41703k1807d9411o2358j7726
$$ plain form
13206 -129495 -135432 136423 -173394 263926 -11002 150996 -285185 46125 50189 10512 95274
13195 95274 178741 233997 290351 105577 -41699 72386 184712 178366 137677 -160786 362120
13183 64810 184124 -215605 321428 240643 169925 -19490 65722 -129608 151868 141076 122968
13172 122968 -143357 -132379 -41479 -84153 409465 156498 69945 326385 -9419 47316 320668
13161 320668 184819 134812 -17145 516052 399426 18370 395794 -69921 228917 85192
13150 -99541 -161963 453496 129516 99016 316556 20379 11192 -25895 184559 -64859 -180502
13139 -180502 158599 125952 -42699 228561 61724 253005 45453 35639 -102026 26204 -86491
13127 31392 -65137 -123246 55093 73176 141375 -274293 2283 -23966 112788 43458 206043
$$ packed form
13206a29495n937A36423a73394B63926a1002A50996b85185D6125M064A0512Q4762
13195I5274Q3467N5256N6354A05577d1699G2386J12326o346m0689a60786C62120
13183F4810J19314b15605C21428q0785p0718a9490F5722a29608A51868j0792j8108
13172A22968a43357J0978d1479m2674D09465A56498F9945K56440i419D7316K73352
13161C20668j35849n0007a7145E16052j16626A8370L77424f9921B28917H5192
13150i9541o2422D53496A29516l0500K17540B0379r187b5895A84559f4859j15643
13139a80502A58599l2647d2699B28561F1724J91281D5453r814a02026B6204h6491
13127C1392f5137n8109E5093J8083O8199b74293B283b3966A12788D3458J62585
$$ plain form
13116 206043 -1881 129475 102535 -75480 -250373 305713 -206920 -99594 413377 38320 114197
13105 114197 241047 199664 528649 316169 -171644 262964 237150 281550 83714 221117
13095 221117 184227 133281 -107114 97349 179407 -41957 -11077 -250411 -17040 -40581 -116839
13084 -116839 -259476 422143 6 198982 128071 -93616 246910 109134 381449 405094 72466
13072 -189448 119644 338526 102989 -49519 -152424 184476 -172537 141326 -465641 138366
13061 312564 22201 -54625 63937 68492 238785 -94302 24952 26309 -202647 193219 115400
13050 115400 311976 150479 219019 57022 -244397 -113476 -8587 -45655 -67401 -34850 415445
13038 242399 151480 -124287 280489 127094 122509 421951 195327 332549 186506 238805
$$ packed form
13116B06043a881A29475k6940g5480j74893C05713b06920i9594D13377C8320P5877
13105A14197J26850m1383L28985k12480a71644B62964k5814M4400H3714J37403
13095B21117l6890n0946a07114I7349Q2058d1957a1077k39334a7040k3541p6258
13084a16839j42637D22143FJ98976p0911i3616B46910A09134K72315K3645G2466
13072a89448A19644K18882A02989d9519j02905A84476a72537A41326d65641A38366
13061C12564B2201e4625F3937M555J70293i4302B4952J357b02647A93219p7819
13050A15400J96576A50479O8540E7022b44397a13476h587l7068k1746L2551D15445
13038B42399r0919a24287B80489A27094m585K99442A95327J37222j46043N2299
$$ plain form
13028 238805 389689 111560 -212958 19232 -48041 337027 386536 353172 68962 -105732
13017 -45436 61122 301330 164771 -67234 25772 -12651 206343 -89789 55543 -70902 110195
13005 278579 352086 -320090 175514 373874 66682 -113875 299792 -76096 239597 30238
12994 -157224 236036 130235 211948 -52056 616639 145919 163579 145349 -48961 119667
12983 179768 -176144 420493 47629 -48982 -226400 -531922 -71444 -3449 162098 -98433 82630
12971 -168738 119012 212201 -50684 71260 -119482 209959 172570 34311 331572 -317254
12960 218444 -186351 -43644 -185443 54765 280420 -416735 45902 202704 185393 33945
12949 113419 43719 73182 -42846 224664 133513 135425 -146042 -100958 25748 136491 -239004
$$ packed form
13028B38805J50884A11560b12958A9232d8041C37027M9509l3364F8962a05732
13017d5436F1122K40208j36559f7234B5772a2651B06343h9789E5543g0902A10195
13005B78579P3507c20090A75514J98360F6682a13875B99792g6096B39597C0238
12994a57224B36036j05801Q1713e2056F16639A45919J7660j8230d8961A19667
12983A79768a76144D20493D7629d8982j77418l05522g1444c449A62098i8433H2630
12971a68738A19012R3189e0684G1260a19482B09959l7389C4311K97261c17254
12960B18444a86351d3644j41799E4765K25655d16735D5902J56802j7311C3945
12949A13419D3719K9463d2846B24664r1151J912a46042M5084B5748J10743b39004
$$ plain form
12937 102377 9185 121417 -30300 40157 -156136 112061 -16488 -7389 206038 -21527 -59446
12926 -59446 -146291 -297083 -114530 100096 -174664 42077 74811 -115669 33945 -186858
12915 -91793 -112900 154518 217856 335765 -142309 23516 -71779 560363 -45261 51520 -34075
12903 14166 220292 -31891 64133 -55880 74567 -70425 108944 51158 187042 -539135 278290
12891 34405 27266 280775 -82874 -175355 41744 217613 405845 42726 454780 48777 18527
12879 -91366 -169814 169033 238057 109640 -82959 -193370 -127148 38179 90529 21459 -4121
12867 14602 -20449 -185381 90646 3621 26940 -32529 17297 201168 60896 181789 -117283
12855 190566 -13541 167701 9618 -181362 142277 -87931 156552 236882 226850 34780 249961
$$ packed form
12937A02377I185J12232c0300D0157a56136A12061a6488g389B06038b1527l7919
12926e9446q6845j50792a14530A00096a74664D2077L2734a15669C3945a86858
12915i1793k1107A54518O3338J17909a42309B3516g1779E60363d5261E1520c4075
12903A4166K06126c1891F4133e5880G4567g0425A08944E1158J35884e39135B78290
12891C4405p139K53509h2874r2481D1744J75869J88232D2726M12054D8777A8527
12879i1366p8448A69033O9024A09640h2959j10411O6222C8179N2350B1459d121
12867A4602b0449j64932I0646C621K3319c2529A7297J83871F0896J20893a17283
12855A90566a3541A67701I618a81362A42277h7931A56552Q0330j0032C4780K15181
$$ plain form
12844 249961 249472 -25563 -92094 238166 56508 23085 214602 -33114 -31439 39680 108557 -5127
12831 110112 272273 11264 -187205 126486 171107 222330 24343 -137024 -109976 -120282 -95355
12820 -95355 -108495 81389 137859 -31113 95343 -52942 102406 54902 15278 97341 210452
12809 210452 42669 -58632 -28587 -97840 70702 -5251 -83915 -132323 230966 -218131 -23589
12797 108212 -160971 -57481 -48699 211457 216515 -13200 105476 -96756 -255475 -310614 -233537
12786 -233537 -25572 -204977 -190786 -97589 -49592 279400 -317397 -113382 -185675 284962
12775 175399 -189710 248026 169832 -222464 154 69853 -216727 -61400 32282 -42630 5114
12763 214021 144215 178757 -98763 291149 -38158 226873 -177821 173515 155221 65197 144595
$$ packed form
12844B49961m89b5563o6531B38166E6508B3085J91517c3114J675C9680O8877e127
12831A10112J62161A1264a87205A26486M4621N1223B4343a37024K7048j0306K4927
12820i5355j3140H1389N6470c1113I5343e2942A02406m7504A5278Q2063J13111
12809B10452D2669e8632b8587o9253G0702e251p8664m8408B30966b18131b3589
12797A08212a60971e7481Q782B11457N058a3200A05476i6756j58719n5139P7077
12786b33537b5572j79405J4191R3197M7997B79400c17397a13382p2293B84962
12775A75399a89710B48026p8194b22464A54O9699b16727f1400C2282d2630E114
12763B14021o9806L4542i8763B91149c8158B26873a77821A73515j8294F5197P9398
$$ plain form
12752 144595 413697 -46239 101307 264000 177987 -34896 284573 -88011 -42837 -60663 -116565
12741 -116565 139106 294175 111183 129268 227428 369470 -159677 -150536 61831 98343 -13824
12729 131106 99908 262424 -215614 10748 -14769 -128745 -21751 228838 -97777 194132
12718 -184851 -142397 127115 51362 318441 147881 -146279 19986 131107 315801 377992
12708 377992 163220 158358 -307108 91703 308791 221167 341636 414651 275129 279713 -1248
12696 -49586 177563 -18775 -127417 195665 230005 -35063 -20861 4991 -98960 63157 -132612
12684 -254831 12521 -110607 -3497 258114 -77232 -134489 112604 179610 267870 -370177 101566
12672 420095 433018 -55857 178742 -160246 219263 -66110 195301 -46516 -23428 430121
$$ packed form
12752A44595K69102d6239A01307J62693q6013c4896B84573h8011d2837j7826n5902
12741a16565A39106J55069A11183J8085R8160J42042a59677R141F1831L6512a3824
12729A31106l1198J62516b15614A0748a4769j13976b1751B28838i7777A94132
12718a84851M2454A27115E1362K67079A47881a46279A9986J11121J84694O2191
12708C77992A63220m862c07108I1703K17088q7624J20469P3015j39522M584a248
12696d9586A77563a8775j08642A95665L4340c5063J4202D991i8960F3157a32612
12684b54831A2521a10607c497B58114g7232n7257A12604O7006Q8260c70177A01566
12672D20095J2923e5857A78742a60246B19263f6110A95301d6516K3088D30121
$$ plain form
12661 186074 252824 76339 198116 174382 225385 72745 -41702 138058 -64221 150651 92784
12650 92784 201329 -16483 -2101 -36988 -76784 -139717 309451 387991 -86445 186482 47887
12638 111885 -293695 166562 219783 147287 -65622 -243870 -53504 289124 194895 -95150 116340
12626 10982 288813 571654 -30550 123499 267721 35906 244997 227691 -41253 165176
12615 339225 195112 138853 342621 -190561 145271 132325 41404 -166964 -27144 15061
12604 74456 166512 66601 8439 168753 -107356 171578 -40795 196410 54191 -128014 -16549
12592 176143 176953 -69658 304840 -255727 11554 -252331 292889 -18890 -267373 -193198 -107353
12581 -107353 73890 -41550 -135427 -62198 104410 -226199 14667 -276143 145249 -19952 145049
$$ packed form
12661A86074O6750G6339J21777k3734N1003G2745d1702A38058f4221A50651n7867
12650I2784J08545a6483b101l4887l9796o2933C09451P8540h6445A86482D7887
12638A11885b93695A66562N3221p2496f5622j78248e3504B89124r4229i5150A16340
12626A0982K77831K82841c0550A23499J44222C5906K09091j7306d1253A65176
12615C39225j44113n6259K03768a90561A45271j2946D1404a66964b7144A5061
12604G4456R2056F6601H439J60314a07356A71578d0795A96410E4191a28014a6549
12592A76143Q10f9658C04840b55727A1554b52331B92889a8890k48483P4175Q5845
12581a07353G3890d1550r3877f2198A04410b26199A4667b76143A45249a9952A45049
$$ plain form
12569 199553 -67024 -402668 60683 -56454 -61008 -50448 37455 -144400 -105969 290802 72221
12557 -14664 -55268 -82660 -94153 141367 252677 140799 -70289 107344 -210441 -153533 140533
12545 -82121 371200 -267141 -18658 47712 54986 83963 -69974 302716 19250 276305 219172
12534 219172 46606 45950 -70312 -119081 -60678 85413 -64857 120841 -700 3741 210889 409270
12522 409270 -68505 -33200 -233555 192898 112390 20631 -118211 -1281 99511 -171179 175773
12510 108548 145089 141423 42644 212515 187854 -114702 66971 6329 246087 122838 -105923
12498 -53052 -203053 -117265 222508 310621 -259383 -297743 118438 158950 105887 373031 99965
12486 -13245 74870 -187836 151514 157531 -155732 -92784 32442 -110767 334 36821 -115905
$$ packed form
12569A99553f7024l35644F0683e6454m554J0560C7455a44400L8431B90802G2221
12557a4664m0604k7392j1493A41367J11310j11878g0289A07344b10441N6908A40533
12545h2121C71200b67141a8658D7712P274K8977f9974C02716A9250K57055n7133
12534B19172D6606o56g0312m8769N8403H5413f4857A20841g00C741K07148J98381
12522D09270f8505c3200k00355A92898q0508B0631a18211a281I9511a71179A75773
12510A08548L6541l666D2644J69871k4661a14702F6971F329K39758A22838a05923
12498e3052j50001Q5788B22508Q8113b59383l8360A18438M0512n3063K67144I9965
12486a3245G4870a87836A51514O017a55732O2948C2442a10767C34L6487a15905
$$ plain form
12474 -234442 77270 14545 64558 65289 315206 -221672 367439 55530 135165 -135519 126070
12462 -139784 35347 57057 212342 43061 5248 -176311 200381 -24361 2398 285204 154918
12451 154918 133026 -10357 -92498 -226194 -217214 -257613 -66304 30060 92101 -98476 169994
12439 94616 -105957 50557 -14180 -83122 -49461 -10318 -52356 96709 -41236 -126089 -142586
12428 -142586 207478 -82407 -145357 9273 104968 40103 131640 108126 129344 -108571 -35184
12416 -353312 -185172 95269 -525 -85094 64485 114329 -44416 -90407 -70848 170302 11904
12404 210840 222042 -2054 218183 -92159 -180206 -165648 13836 69337 -35067 150424 8983
12392 -1195 28726 -118572 -95244 -276438 46513 -226345 348278 242469 -551 -66884 -180458
$$ packed form
12474b34442G7270A4545N0013P31K49917b21672C67439E5530P9635a35519A26070
12462a39784C5347K1710J55285D3061E248a76311B00381b4361B398K82806j30286
12451A54918k1892a0357q2141j33696Q980m0399f6304C0060O2041i8476A69994
12439I4616a05957E0557a4180o8942L3661a0318m2038I6709d1236q4853j6497
12428a42586B07478h2407o2950I273R5695D0103R1537k3514K1218a08571c5184
12416c53312J68140I5269e25q4569F4485M9844d4416m5991J9559A70302A1904
12404B10840J1202b054B18183i2159q8047J4558A3836N5501c5067A50424H983
12392a195B8726a18572K3328j81194D6513b26345C48278j05809e51o6333j13574
$$ plain form
12381 -180458 -14906 58545 -57478 57522 -59065 -26476 -41122 235000 -131370 -12903 151056
12369 -316765 299458 -2043 253325 11982 16777 -66102 -344020 46408 -91193 113609 155074
12358 155074 78736 72619 63696 -125632 177703 5191 137417 -142049 47867 1440 151130
12347 151130 -210540 82426 16111 -69503 33601 161621 -130227 -62195 -47128 -122095 -265623
12336 -265623 -1971 -68128 22767 42775 153443 -99901 71598 -3766 -60396 47480 -170187
12324 -99476 133157 -113264 85619 102832 -222217 -198645 -173843 186445 182419 190110 -340806
12312 209774 283867 85924 67866 137302 -35542 -241108 74878 207971 63309 -84233 -76536
12301 -76536 -312205 -22597 196759 -213167 70961 -321794 120306 -3124 241875 220722 -18339
$$ packed form
12381a80458a4906E8545e7478E7522e9065b6476j4646B35000a31370a2903A51056
12369c16765B99458b043B53325A1982M795f6102k77918D6408i1193A13609M1465
12358A55074p6338o117q923a25632A77703E191J32226a42049D7867A440J49690
12347A51130b10540H2426A6111f9503C3601J28020a30227f2195J5067p4967j43528
12336b65623a971o6157B2767K0008J10668i9901G1598c766n6630D7480a70187
12324i9476A33157a13264H5619J7213b22217K3572K4802A86445m026P691c40806
12312B09774P4093H5924j8058O9436c5542k05566G4878J33093F3309h4233P697
12301g6536k35669b2597A96759b13167G0961c21794A20306c124B41875k1153a8339
$$ plain form
12289 -144589 39023 186734 -87573 -178045 -101389 48942 -61102 131010 -58300 158638 322284
12278 322284 -53221 325502 235869 -47351 195975 -66685 422806 97681 -102259 46984 5752
12266 -4817 90018 -254946 9164 137876 -19278 227285 -93616 165251 -295768 4044 -31135
12254 231508 135674 205902 -81232 219078 264440 180977 54718 -208334 -266280 137466 227
12242 -350467 358042 -219772 -378879 378140 385037 176607 -187088 108993 22982 151699
12232 151699 -86634 171007 104654 -147509 37129 147229 -150770 115189 180276 332085
12222 332085 9827 244416 237007 52806 368175 351725 257202 175278 -229260 -121986 -110508
12211 -110508 198710 -125614 172259 126594 144426 -53225 164218 311357 212294 -77724
$$ packed form
12289a44589C9023J47711h7573r0472P6656D8942f1102A31010e8300A58638J63646
12278C22284e3221C25502q9633d7351A95975f6685D22806I7681a02259D6984E752
12266d817I0018b54946I164J28712a9278B27285i3616A65251b95768D044c1135
12254B31508r5834P0228h1232B19078M5362q3463E4718b08334n7946A37466B27
12242c50467C58042b19772j59107C78140O897A76607a87088A08993B2982J28717
12232A51699h6634A71007o6353a47509C7129J10100a50770A15189O5087J51809
12222C32085I827K34589p409E2806L15369j6450r4523q1924b29260J07274J1478
12211a10508A98710a25614A72259m5665J7832e3225A64218J47139r9063g7724
$$ plain form
12200 -114559 78530 205164 -37446 244246 191650 91446 -43376 164429 186903 351231 105748
12188 54490 493197 398320 390507 -8285 15082 59906 33045 178312 424044 -77106 222060
12176 112505 189261 333 468356 -129313 34882 45105 -106717 206924 197922 -85784 165531
12164 145105 -12053 275729 71027 -329898 -285371 830 -78117 86482 299193 -6259 82794
12152 46858 106107 116346 198576 183128 112217 382756 -144418 17889 -225598 188565 114328
12141 114328 -257239 147770 178286 35496 -201493 186438 431066 -27133 -138612 380922
12130 -141579 111155 -42187 296300 102089 -164724 -113230 -199619 184037 257393 119432
12119 -50701 -32445 92589 -109778 119991 351293 -320480 108000 -264365 7866 6751 164941
$$ packed form
12200a14559G8530J26634c7446B44246n2596I1446d3376A64429K2474J64328A05748
12188E4490M38707r4877p813h285A5082M4824k6861J45267K45732g7106B22060
12176A12505P6756C33M68023a29313C4882J0223a06717B06924r002h5784A65531
12164A45105a2053B75729G1027c29898M4527H30g8117H6482K12711f259H2794
12152D6858N9249J0239Q2230j5448p0911K70539a44418A7889b25598A88565p4237
12141A14328b57239A47770L0516C5496b01493A86438K44628b7133j11479C80922
12130a41579A11155d2187B96300A02089a64724N1494q6389A84037P3356A19432
12119e0701J8256I2589a09778A19991K31302c20480A08000b64365G866j115J58190
$$ plain form
12108 164941 42876 17873 328068 -217158 -74844 410245 -235240 -106187 332006 -65174
12097 6368 17352 70460 -407565 117925 118643 -94261 40135 -21757 -41485 -208696 190262
12085 192395 271392 -362029 -81745 -160351 124333 60978 474848 1490662 1754130 329720
12074 241723 99061 159785 -151428 33596 111034 -30076 197440 -192915 193046 77498 82494
12063 82494 -48145 132709 -219438 91762 166654 -19400 47492 -209902 85145 -60978 -35063
12052 -35063 -325558 -243474 -180402 -26116 -28721 51262 407780 172496 -30438 192916 14197
12040 -58183 -63413 -53434 -110672 -94556 -12332 -283809 95714 -322626 41 80073 -107665 95042
12027 251224 -151278 -77787 -45950 192394 -272379 -250012 103111 -282439 49415 -317194
$$ packed form
12108A64941D2876A7873L10195b17158g4844D10245b35240a06187C32006f5174
12097F368J0984N3108d07565A17925P18i4261D0135b1757j9728j67211A90262
12085A92395P8997c62029h1745p8606A24333F0978M13870J015814K63468C29720
12074B41723I9061O0724a51428C3596P7438c0076A97440a92915A93046G7498M996
12063H2494d8145A32709b19438I1762P4892a9400D7492b09902H5145f0978K5915
12052c5063k90495Q2084O3072b6116k605E1262L56518A72496c0438A92916A4197
12040e8183n230R979n7238J6116a2332k71477I5714c22626D1Q0032a07665I5042
12027B51224a51278P3491L1837A92394b72379K2367A03111b82439D9415c17194
$$ plain form
12016 -34605 76374 -106646 -1180 -178764 13436 -405 -345146 213324 -4755 -98399 111701
12004 -93124 -46065 156682 21015 -38451 -94006 193915 61199 -244334 -15966 -72295 10078
11992 66851 100129 -60989 -93610 -181979 29856 80954 119576 -170269 82101 42427 -15627
11980 12554 60533 317812 276419 143941 -165914 -311413 -212379 87266 115605 -76072 26621
11968 -63232 -37765 112816 126727 -127534 84368 100862 -250682 199260 -235237 20767 -169510
11956 184085 -33166 252973 14536 67373 -198473 5562 29615 269737 30551 114983 -148382
11944 439113 159871 -186706 81410 -423906 -9040 1038 56791 -208805 -76764 -115606 -427403
11933 -427403 105596 45586 127267 -184628 -21689 -25171 -17898 -295476 -27826 248989 82819
$$ packed form
12016c4605G6374a06646a180j77584A3436d05l44741B13324d755r3644A11701
12004i3124d6065A56682B1015c8451n5555A93915F1199b44334a5966n6329A0078
11992F6851L3278f0989l2621q8369B9856N1098L8622a70269H2101l9674a5627
11980A2554M7979K57279m1393j32478a65914j45499R9034H7266K8339g6072B6621
11968f3232K5467A12816J3911a27534H4368J6494b50682A99260b35237B0767a69510
11956A84085c3166B52973A4536N2837a98473E562K4053K40122C0551Q4432a48382
11944D39113A59871a86706H1410d23906i040A038N5753b08805g6764l8842l11797
11933d27403A05596D5586Q1681a84628b1689l482P273k77578b7826B48989H2819
$$ plain form
11921 27977 32854 -63653 -124434 -63576 101588 31110 21544 -8622 -215109 -97503 -30181 -92294
11909 -92294 171688 -68065 -20169 107761 -47649 -106332 237615 -193165 -194746 229490 -75602
11897 103704 -199581 269685 -86234 -188942 55203 -264876 59977 -250360 301556 103670
11886 -85517 13004 343540 -26104 -12451 -308404 163791 2388 68734 -49154 -7022 151269
11874 -7735 -105413 -106290 189028 266547 91480 -52250 -33891 -301820 60162 -104480 58446 -315163
11861 -358235 96163 -200490 -112797 -25798 -131793 -248546 -54348 281220 250866 45757 89435
11850 89435 149604 -403157 7467 -273477 -260119 -349817 166529 -104351 -255361 68054 107471
11839 107471 -154324 117076 80415 -252174 241793 319694 -14934 -513385 143831 22958
$$ packed form
11921B7977M877f3653o0781O0858A01588C1110r566h622k06487i7503c0181o2113
11909i2294A71688f8065b0169A07761d7649n8683B37615a93165j581B29490g5602
11897A03704a99581B69685h6234j02708E5203b64876E9977b50360C01556A03670
11886h5517A3004L30536b6104a2451k95953A63791B388O6346d9154g022A51269
11874g735r7678q77A89028P7519I1480e2250J8359k67929F0162a04480E8446c15163
11861c58235I6163b00490Q7693b5798j05995j16753e4348B81220l0354D5757M3678
11850H9435O0169d03157G467b73477J3358q9698A66529a04351j51010F8054L9417
11839A07471a54324A17076l6661b52174B41793P7901a4934m98451A43831B2958
$$ plain form
11828 -119646 78223 144646 -106394 -416195 -436039 -135666 92369 3854 -101619 -132877 -116670
11817 -116670 10532 -122669 -243174 36053 2964 351830 -150242 -213392 -205414 -8194 -156927
11806 -156927 -17941 -382565 12160 -142785 547633 47308 -144906 156351 164321 -3380 13706
11794 -23325 -126335 124273 -20966 147439 7761 -164226 45357 -104784 -49572 -8319 17902
11782 179434 105887 6571 -321088 -51805 -35542 237187 -121534 80173 42196 -531295 -23047
11770 -471540 -128415 219585 -22188 45143 -304399 -118157 60138 -6706 -298533 -147518
11759 270809 126342 245151 -69873 -196378 128366 217388 164574 -3004 173094 143793 -44876
11747 82986 116766 -72722 111502 153235 -232935 273849 -132204 69769 138152 39491 -154492
$$ packed form
11828a19646G8223O6423a06394l09801j9844a35666I2369C854a01619l1258J6207
11817a16670A0532a22669j20505C6053B964L48866a50242o3150P978h194j48733
11806a56927a7941l64624A2160a42785E47633D7308a44906A56351P970c380A3706
11794b3325j03010A24273b0966A47439G761a64226D5357a04784d9572h319A7902
11782A79434p3547F571c21088e1805J6263B37187a21534H0173l7977e31295b3047
11770d71540a28415B19585b2188D5143c04399a18157F0138f706k91827a47518
11759B70809A26342J18809f9873j26505A28366Q9022n2814c004A73094k9301d4876
11747H2986L3780g2722A11502M1733b32935B73849a32204F9769O8383C9491a54492
$$ plain form
11735 -155616 -177077 157286 280166 84947 -105184 168796 149545 -231845 -28626 -133255
11725 -133255 -130603 -30328 -151545 -150246 -47183 91948 39632 99685 104422 16140 -103179 130369
11712 -192733 -137111 -65212 49875 -115865 288176 -105815 79831 34826 -140440 281199
11701 -44809 -41719 -212289 96010 -369 145908 -18661 -86369 -37801 -40330 -14245 -31237 -85992
11689 -85992 -32181 4606 -3340 -265859 -18650 245747 208923 195999 -17758 140120 68489
11677 172547 182997 227711 267398 -90374 -72133 -20838 -98967 121156 10858 -30591 -314767
11666 -314767 -393058 -103221 87541 -158273 2501 144321 38653 270683 21579 451 168580
11655 168580 99618 -153026 -134750 100532 -168341 -105330 -73751 -44790 -112756 120298 -119800
$$ packed form
11735a55616k1461A57286J22880H4947a05184A68796j9251b31845b8626j04629
11725a33255K652c0328j21217J299d7183I1948C9632O0053M737A6140a03179A30369
11712a92733N5622f5212D9875a15865B88176a05815G9831C4826a40440B81199
11701d4809L090j70570I6010c69A45908a8661o7708c7801k529a4245j6992n4755
11689h5992c2181D606c340k62519a8650B45747l6824j2924a7758A40120F8489
11677A72547J0450M4714L9687i0374J8241b0838p8129A21156A0858c0591k84176
11666c14767p8291a03221H7541a58273B501J41820C8653K32030B1579D51J68129
11655A68580o8962a53026J8276A00532a68341O3011L1579K8961o7966A20298a19800
$$ plain form
11643 41005 -122592 -252140 -22880 -64465 -80721 -83018 -220775 -238030 -49904 141738 100131
11632 100131 106267 -207449 -49206 -66234 164034 -64362 108778 214281 -14006 -74446 -43709
11621 -43709 -105614 -124338 -114745 -238532 -142855 -100989 319742 207540 -60123 -38058 -11002
11609 -178924 240775 -30658 60267 175270 -68711 -93757 74604 161001 226012 306277 138019
11597 91571 278317 119376 -239107 228044 272063 -81843 184541 108191 115385 -63076 97017
11585 -5406 -217443 207702 295008 -114706 -3406 -78478 107220 377624 -160475 380390 198988
11574 198988 -122994 -359202 -25525 55138 -90958 -73400 -84080 3088 22881 -25449 -390275
11563 -390275 132378 118444 -95948 232677 434287 76359 -287892 -233954 90716 75738 -87070
$$ packed form
11643D1005a22592j29548b2880m1585j6256k297j37757j7255d9904A41738m1607
11632A00131O136b07449d9206j7028A64034f4362A08778J05503a4006o0440L0737
11621d3709o1905j8724R593j23787R5677M1866C19742j12202f0123K2065a1002
11609a78924B40775c0658F0267J15003f8711k5046G4604Q6397O5011Q0265A38019
11597I1571J86746A19376b39107B28044M4019h1843A84541p6350P194f3076I7017
11585e406k12037B07702Q7306a14706c406p5072A07220K70404a60475C80390j81402
11574A98988a22994k36208b5525E5138i0958J7558j0680C088J9793b5449l64826
11563c90275A32378j3934i5948B32677K01610G6359b87892N3938I0716j4978h7070
$$ plain form
11551 -138418 33736 27537 176299 91200 189291 -63625 126438 -251594 23238 260567 2161
11539 -84958 -29927 125730 -112873 5249 179236 217653 218811 270773 164379 384400 -133715
11527 -26343 -42345 -32017 80392 -4869 202407 -39083 -80800 76466 -29513 -15308 -260883
11516 -260883 195672 27311 124306 277623 71465 347711 -13007 19529 368723 281389 320598
11505 320598 -191115 349106 381630 370098 -4125 -6828 9433 140192 334876 219034 325674
11494 325674 -204780 245750 -102874 282174 300700 148412 -64993 228718 141430 -26935
11483 94378 269791 111404 130202 -82272 307475 113804 122475 327619 427616 271939 187536
11472 187536 -43718 265763 -164091 -45168 5705 91365 -23384 428697 91654 141944 176521
$$ packed form
11551a38418C3736o199J48762q5099R8091f3625A26438b51594B3238K37329B161
11539h4958b9927A25730a12873E249J73987L8417J158N1962j06394K20021a33715
11527b6343j6002J0328H0392d869B02407c9083m1717G6466b9513J4205k45575
11516b60883A95672B7311R6995J53317G1465K76246a3007A9529L49194q7334L9209
11505C20598a91115C49106L2524j1532d125k703I433J30759J94684j15842J06640
11494C25674b04780B45750a02874B82174J8526A48412f4993B28718q7288b6935
11483I4378J75413A11404J8798h2272C07475A13804Q671K05144R9997j55677q4403
11472A87536d3718B65763a64091d5168E705Q5660b3384D28697I1654N0290L4577
$$ plain form
11461 176521 -49079 284601 260498 204595 69250 58255 9782 147803 226680 122861 167107
11450 167107 -96075 -139795 320418 42009 -310076 -16947 46271 103674 -135408 173118 187237
11439 187237 151345 218669 124304 -168345 -380022 -225995 75886 -46608 237113 278792 -127588
11427 -36210 -143801 -135758 4657 44821 144388 -128016 154086 -20519 8740 79239 -88412 101309
11414 33535 -82377 86610 271864 -120663 -28318 -216955 -183321 159901 -86842 -271372 123071
11402 106275 -123208 -294496 220667 437514 -161161 247410 16263 165628 -265101 108920
11391 108692 -78248 108377 699 67758 -2594 157255 -238873 124624 399189 -75740 -243406
11380 -243406 120370 -116910 -123559 305455 -38068 197198 198341 -78472 331040 66385 266598
$$ packed form
11461A76521d9079B84601k4103n5903F9250j0995I782J38021P8877j03819M4246
11450A67107i6075m3720C20418D2009c10076a6947D6271N7403a35408A73118J4119
11439A87237l5892O7324r4365a68345k11677J54027G5886d6608B37113M1679a27588
11427c6210j07591Q043D657M0164R9567a28016A54086b0519H740P0499h8412A01309
11414C3535h2377H6610J85254a20663b8318j88637L3634A59901h6842j84530A23071
11402A06275a23208j71288B20667K16847a61161B47410A6263J49365b65101A08920
11391A08692g8248A08377F99O7059b594A57255b38873A24624K74565g5740j67666
11380b43406A20370a16910o649C05455c8068A97198J143g8472C31040F6385K00213
$$ plain form
11369 266598 -186475 -344544 183551 37872 112207 -102003 160050 -226449 -1563 -84675
11359 -84675 -82658 -355051 35118 -185773 -332733 230456 -130223 257523 131876 155015
11349 155015 378807 -98767 -57731 -46774 -1992 -38304 111155 33913 83583 257744 -100417
11337 168152 -164964 -27476 -78891 -40292 184782 19591 -93957 92238 -47599 -287719 8239
11325 269791 -182379 59731 231034 128201 -122366 109077 -344823 -120557 120001 220316
11315 220316 -15292 259097 -109872 116692 79363 -152194 -284341 -107816 24238 -185699
11304 -6988 -119500 -41341 370350 114795 -112362 279285 -39176 -101942 -94809 33814 31920
11293 31920 -155822 47193 41315 21232 146076 -225521 -100555 189000 57972 100738 -69799
$$ packed form
11369B66598a86475j58069A83551C7872P4335a02003A60050b26449a563q3112
11359h4675K017k72393C5118a85773j46960B30456a30223B57523j25647K3139
11349A55015K23792i8767M1036J0957a992l6312A11155C3913M9670J74161a00417
11337A68152a64964b7476n1415L8599A84782A9591i3957I2238d7599k40120H239
11325B69791a82379E9731J71303j02833a22366A09077c44823a20557A20001J00315
11315B20316a5292B59097a09872A16692l7329a52194j32147a07816B4238a85699
11304f988j12512d1341C70350A14795a12362B79285c9176o2766P133C3814j894
11293C1920a55822D7193n878k0083J24844b25521a00555A89000E7972M2766f9799
$$ plain form
11281 -161980 -32217 29704 82382 -136055 -25313 328947 -252546 -180383 -176122 -195041 -223881
11270 -223881 69047 -363319 65761 -150037 -150845 258491 284170 14463 274471 -63694 -275991
11259 -275991 -34261 -6807 176636 -54306 -16859 256837 -57126 -149759 -339403 -4636 -65832
11248 -65832 -77768 11816 249319 -344724 38153 -77728 -268069 95762 -21102 -409683 119800
11236 -393695 61094 53896 128043 198414 13760 69299 -103468 -22421 -18336 31255 -275360
11224 67296 177700 -224333 -135786 -45570 -17855 92795 207605 -75933 5848 212986 201917
11213 201917 84469 -215070 -150681 195849 -101299 -86425 -117318 75432 -113070 -12228 267537
11201 -256640 -59077 -150902 -167333 90401 151683 83487 94109 57956 316627 307849 93634
$$ packed form
11281a61980c2217B9704N2678a36055b5313C28947b52546P2163M261j8919k8840
11270b23881F9047c63319F5761a50037q08B58491K5679A4463K60008f3694k12297
11259b75991c4261f807A76636e4306a6859B56837e7126r2633j89644d636o1196
11248f5832j1936A1816K37503c44724C8153g7728j90341I5762b1102l88581A19800
11236c93695F1094p198P4147P0371A3760N5539a03468b2421M085C1255b75360
11224F7296J10404b24333Q8547d5570a7855I2795J14810g5933E848K07138j1069
11213B01917H4469b15070O4389A95849a01299J4874l0893G5432a13070a2228B67537
11201b56640e9077r1825j6431I0401O1282o8196J0622l6153K58671q778I3634
$$ plain form
11189 25095 -133177 -3024 -597671 44904 63601 -72402 20472 16310 -140332 -17919 -28776
11178 -28776 -39480 -33667 -35013 -141592 -4540 -15076 -248953 -90060 -106121 143260 48193 -57463
11165 -182245 -59318 199587 -14640 -210157 146891 -233925 -70373 256737 97349 -23643
11154 111185 -6119 -276242 -207381 35094 47127 -268219 51583 -69142 3163 -346293 -270452
11143 -270452 -151744 35578 199333 39647 -9827 -155488 -256522 56340 -293691 68209 -56658
11131 214968 86866 -26934 -78991 -384644 -161141 -3470 196293 157560 14631 -6944 19100
11119 401797 140159 152697 71177 278069 872 140300 83665 -143158 -208328 275860 264922
11108 264922 497071 169501 10816 152368 21063 17259 270811 236418 131338 -93393 74101
$$ packed form
11189B5095a33177c024n94647D4904J8697g2402B0472m162a40332a7919j0857
11178b8776j0704N813j346j06579d540j0536k33877i0060j6061A43260D8193e7463
11165a82245e9318A99587a4640j95517A46891b33925g0373B56737I7349b3643
11154A11185f119k70123O8861C5094J2033b68219E1583f9142C163c46293P5841
11143b70452J18708C5578J63755C9647i827j45661j01034E6340b93691F8209e6658
11131B14968H6866b6934n2057l05653a61141c470A96293l8733A4631f944A9100
11119D01797A40159J2538G1177K06892H72J39428n6635a43158o5170B75860j0938
11108B64922K32149A69501A0816J41552B1063l804K53552l4393j05080i3393G4101
$$ plain form
11096 54788 200213 366294 108994 -46966 252100 18210 207967 79859 290612 380223
11086 380223 432799 -37223 67070 126351 331663 143897 160926 211970 119910 142803 147787
11075 147787 268006 -34908 515301 111974 287625 612507 57717 -72206 165468 359793
11065 359793 187253 404086 435692 134901 824757 593434 495555 517635 533364 452461
11055 452461 271452 439710 464501 333586 558637 700667 1046132 787835 545072 447261
11045 447261 542060 634902 608363 664923 817942 756458 796576 385915 841173 705228 821133
11034 821133 734914 699700 557127 433352 571397 583403 680983 550517 601636 729475
11024 729475 574806 693870 675590 254300 408552 644052 525752 807233 583741 507619
$$ packed form
11096E4788J45425J66081A08994d6966B52100A8210J89757G9859K10753Q9611
11086C80223N2576c7223F7070N9281K05312A43897J7029N1044r2060K2893M984
11075A47787J20219c4908E15301A11974J75651L24882E7717g2206A65468J94325
11065C59793j72540K16833L1606A34901O89856k31323r7879K2080J5729q0903
11055D52461j81009J68258K4791j30915K25051J42030L45465k58297k42763r7811
11045D47261R4799R2842k6539N6560J53019o1484M0118C85915M55258j35945J15905
11034H21133q6219l5214j42573j23775J38045J2006R7580j30466N1119J27839
11024G29475j54669J19064j8280B54300J54252K35500j18300K81481k23492p6122
$$ plain form
11014 507619 647865 645001 475272 617123 408351 480212 546940 559271 693565 605681 350989
11003 350989 580877 517017 476070 714746 704995 368351 590758 446395 764529 270132
10992 453137 686233 835450 301458 936079 470243 325231 1179812 1007682 795589 1202609
10982 1202609 728900 843786 1067101 1119043 1503059 1576505 1462673 1714743 1778427 2151296
10972 2151296 2197466 2340473 2638168 2012375 2068545 1769059 1666661 1567917 1452875 1627452
10962 1627452 1677293 1351886 1576971 1694464 1485211 1511706 1480440 1851591 1469736 1195060
10952 1195060 947593 1130789 600729 385215 432850 920161 67632 405293 -103020 286984
10941 -39372 188258 260064 -40163 -52530 10064 60821 -62159 146529 -216684 125316 113776
$$ packed form
11014E07619J40246k864j69729J41851k08772P1861O6728J2331J34294q7884k54692
11003C50989K29888o3860m0947K38676r751l36644K22407j44363L18134B70132
10992D53137K33096J49217C01458O34621m65836j45012Q54581j72130k12093M07020
10982A202609m73709J14886K23315N1942L84016P3446j13832K52070O3684L72869
10972B151296M6170J43007K97695o25793N6170k99486j02398r8744j15042J74577
10962A627452M9841l25407K25085J17493k09253K6495l1266L71151l81855k74676
10952A195060k47467J83196n30060k15514M7635M87311F7632L37661a03020B86984
10941c9372A88258P1806d0163j2367A0064N0757f2159A46529b16684A25316j1540
$$ plain form
10930 113776 116380 129574 -413972 221586 -45708 -321364 -110396 -79376 92178 -126018 -31646
10918 106434 -122688 -33631 -11363 349537 182410 -145807 -223238 -121040 -92839 53433
10907 73948 -210227 81692 -127591 -183488 79237 65606 94107 -284961 -57632 187706 369100
10896 369100 224240 165519 91941 -24666 -149023 144668 318744 -56372 -221825 49429
10885 98082 -173093 -325075 -3354 -93449 126328 -61020 32965 -53231 -41112 -82238 8421
10873 75673 -285506 -392111 169596 148602 63952 31029 -143624 -84018 131186 -129357
10862 -124074 114977 264631 147663 96700 36070 -211529 -38583 -38746 -96160 -133988 -226392
10851 -226392 81213 -56669 65979 232022 135094 -202175 -306883 11046 -35357 -72645 -30940
$$ packed form
10930A13776K604J3194d13972B21586d5708k75656a10396L1020I2178a26018c1646
10918A06434a22688c3631a1363C49537j67127a45807p7431J02198K8201E3433
10907G3948b10227H1692a27591n5897G9237j3631K8501b84961e7632A87706J81394
10896C69100j44860n8721p3578b4666j24357A44668J74076e6372j65453D9429
10885I8082a73093j51982c354r0095A26328f1020C2965e3231J2119m1126H421
10873G5673b85506j06605A69596k0994F3952C1029a43624N9606A31186a29357
10862a24074A14977J49654j16968n0963C6070b11529c8583j63n7414l7828r2404
10851b26392H1213e6669F5979J66043r6928b02175j04708A1046c5357l7288c0940
$$ plain form
10839 193143 -251814 54417 85799 81296 109091 70611 95772 -4379 110197 25838 29490 -327451
10826 -6995 52035 -80350 140168 -183523 46944 -173106 -261965 8221 -113439 -74929 -145996
10815 -145996 -132403 -90642 242695 47549 -103678 29567 18701 674582 54811 216078 -320650
10803 -231579 -69457 -152241 -42006 -88712 -67245 102280 -124115 -184473 75828 -38071 -38837
10792 -38837 100364 14548 -143801 -305858 133286 -31938 -61743 25110 185649 -5715 -212288
10781 -212288 106750 -145054 -279053 66042 123274 13366 -105695 -92851 -60535 33954 163237
10770 163237 -161853 -126847 208206 163198 -270026 -146164 -103368 -5954 -17098 137097 143894
10759 143894 -216574 43197 -394350 -241815 -63634 13213 43680 91536 198916 49349 -260507
$$ packed form
10839A93143b51814E4417L1382m503K7795l8480K5161d379A10197B5838L652c27451
10826f995E2035h0350A40168a83523D6944a73106q8859H221a13439L8510p1067
10815a45996J3593M1761B42695D7549a03678B9567j0866O55881E4811J61267c20650
10803b31579f9457q2784d2006m6706K1467A02280a24115o0358G5828c8071p66
10792c8837A00364A4548a43801j62057A33286c1938k9805B5110J60539e715k06573
10781b12288A06750a45054j33999F6042N7232A3366a05695J2844L2316C3954J29283
10770A63237a61853L5006B08206m5008b70026J23862M2796e954j1144A37097O797
10759A43894b16574D3197c94350J52535f3634A3213L0467M7856J07380D9349b60507
$$ plain form
10747 -29014 116804 -164287 234469 -101547 -33370 -156033 70658 -18108 -275432 64233
10736 316539 -176001 -225731 -53878 70806 122258 168710 14818 290153 -23442 144303 -256704
10724 -151438 151600 -116683 99058 -23538 -203103 19198 -150943 59382 -147083 -207208
10714 -207208 -126303 51437 -185823 99344 -224068 -136292 121555 411738 -63092 -258344
10704 -258344 -139764 2721 -72398 -45376 -42362 76286 -129697 -278596 160343 -146444 11668
10692 -320854 -158190 -395244 -218235 -85932 -93863 45447 -85503 -155359 55863 -114575 -145115
10681 -145115 192634 -129963 47556 -32889 -153833 3661 -100424 -372559 205555 -43893
10670 278849 -22859 -120642 135068 172783 363742 -9944 -85365 -136380 -263806 182120 -160796
$$ packed form
10747b9014A16804a64287B34469a01547c3370j22663G0658a8108k57324F4233
10736C16539a76001m9730e3878G0806N1452M6452A4818K75335b3442A44303b56704
10724a51438A51600a16683I9058b3538j79565A9198a50943E9382a47083o0125
10714b07208Q0905E1437a85823I9344b24068Q7776A21555K90183f3092j95252
10704b58344J18580B721g2398K7022L014G6286a29697j48899A60343a46444A1668
10692c20854a58190k37054J77009h5932p931D5447h5503o9856E5863a14575l0540
10681a45115A92634a29963D7556c2889j20944C661a00424k72135B05555d3893
10670B78849b2859r7783A35068L7715J90959i944p5421n1015j27426A82120a60796
$$ plain form
10658 196558 -100090 -148973 -199081 -93986 -154559 -269748 -48727 -320759 -271895 -186710 25847
10646 147240 -274631 57480 -287968 151489 60009 -92251 68709 183883 39615 -423302
10635 223400 -185697 -114172 71618 -255551 -415443 71955 -290886 -128361 -16908 -106750
10625 -106750 -93434 -80301 -349145 -403748 328776 -28552 89054 -179187 2836 -45021 -19113
10613 -23564 -203640 58047 -84931 194671 132643 311147 -63482 -307835 169168 -145592
10602 -64646 -10064 -25164 -253743 -95666 276171 26352 -215651 764 -368145 -113677 226978
10590 -227131 -120931 78800 -214644 -282577 -144555 45791 -87848 -154657 -173848 -30425 30418
10578 -63068 -994 -150782 -367627 226990 83 -55887 288594 175409 127087 -275073 150459
$$ packed form
10658A96558a00090m8883n0108i3986o0573j15189d8727k72032M8864Q5185B5847
10646A47240b74631E7480b87968A51489F0009i2251F8709J15174C9615d23302
10635B23400a85697P1525G1618b55551j59892G1955b90886a28361a6908q9842
10625a06750J3316J3133k68844n4603C28776b8552H9054a79187B836d5021a9113
10613b3564j80076E8047h4931A94671o2028J78504f3482k44353A69168a45592
10602f4646a0064j5100k28579i5666B76171B6352b15651G64c68145a13677B26978
10590b27131J06200G8800b14644o7933J38022D5791h7848o6809j9191c0425C0418
10578f3068i94j49788k16845B26990H3e5887B88594j13185m8322b75073A50459
$$ plain form
10566 -33211 -83401 290600 -50500 12871 -303610 -140114 -67866 -130219 -156592 -263484 301898
10554 50235 155579 -154236 -168844 61794 298653 -47588 -383429 222845 -104670 -207975
10544 -207975 7994 10399 -96783 22227 79964 -66609 -198154 -66841 -61421 -135447 102458 -279506
10531 -79250 -162387 -31185 342925 -58571 162271 37018 -390070 9566 145008 -14510 -214093
10520 -214093 97133 26888 -221513 -321640 -81190 -2770 87668 209788 101589 -63434 128894
10508 -61307 -125978 -14899 -133244 238354 150945 -101277 -235701 -98531 427454 40289 183561
10497 183561 17041 17583 -49841 -124486 -224898 -42166 -171559 436934 190496 -216651 230534
10485 220691 14306 11194 111194 388433 374700 416023 391084 537403 323195 209990 -69432
$$ packed form
10566c3211n0190B90600e0500A2871c03610a40114f7866o2353k6373j06892C01898
10554E0235J05344a54236j4608F1794K36859d7588l35841B22845a04670j03305
10544b07975G994K405i6783B2227N7737f6609j31545f6841N420p4026A02458b79506
10531g9250q3137c1185C42925e8571A62271C7018c90070I566J35442a4510j99583
10520b14093I7133B6888b21513j00127h1190b770H7668J22120A01589f3434A28894
10508f1307o4671a4899j18345B38354q7409a01277j34424i8531D27454D0289J43272
10497A83561A7041N42d9841p4645j00412d2166j29393D36934A90496b16651B30534
10485B20691A4306l112J00000K77239j3733M1323k4939J46319k14208j13205f9432
$$ plain form
10473 199047 177378 203113 -187954 -316365 -25462 34307 183236 -718 4590 -117692 36258
10461 79420 -71999 204373 33771 -111402 -432287 20658 285323 -22067 55812 47188 -129298
10449 -197106 -121654 -187788 -37365 -25651 -237731 106849 -110294 211879 89652 -196931
10438 522 304945 -154558 -22155 72484 -208099 -129302 203962 -53925 117665 282382 -214657
10426 -108552 -20078 -139518 51467 -353877 25676 228378 70499 128010 -322861 -22634 186029
10414 163029 78299 -147702 201072 9325 63194 226450 189056 24738 26329 40348 -359724
10402 -174217 207345 -356414 -176849 84372 -7286 -85242 227324 382699 113039 265826
10392 265826 142549 -10830 186651 -165090 -175166 244140 -92380 178419 -114235 85050
$$ packed form
10473A99047k1669K5735a87954j28411b5462C4307J48929g18D590a17692C6258
10461G9420g1999B04373C3771a11402l20885B0658K64665b2067E5812q624a29298
10449a97106P5452o6134c7365J1714k12080A06849a10294B11879H9652a96931
10438E22L04423a54558b2155G2484b08099P8797B03962e3925A17665J64717b14657
10426a08552b0078j19440E1467c53877B5676K02702G0499N7511c22861b2634A86029
10414A63029G8299a47702B01072I325N3869J63256l7394B4738J591J4019c59724
10402a74217B07345c56414a76849H4372g286p7956B27324J55375A13039J52787
10392B65826j23277a0830A86651a65090j0076B44140i2380A78419a14235H5050
$$ plain form
10381 71823 255905 88858 114799 53523 238620 -104823 188699 -23610 41074 237829 121675
10370 121675 15740 649112 129226 90096 153107 546779 51052 -82089 -39487 344856 61411
10358 137142 75606 52088 207681 -86373 160973 265754 82923 664112 557842 290945
10348 290945 283924 335873 102947 196567 378813 191734 322090 369630 216571 495523
10338 495523 128967 -44875 249933 205490 -5817 -193483 149607 32298 -113846 -94931 7608
10326 109831 -39045 154789 301338 86342 31924 301771 182871 100512 192655 171845 83334
10314 -66733 -179863 -29222 73559 -19191 -75064 -114618 -98128 149195 347149 -117958 -199890
10303 -199890 -33734 41438 908 -114612 -282400 170592 -322184 -352485 213709 142368 -18962
$$ packed form
10381G1823J84082H8858K5941E3523J85097a04823A88699b3610D1074J96755j16154
10370A21675A5740O33372A29226l9130O3011L93672E1052h2089c9487C44856F1411
10358A37142o1536k3518J55593h6373A60973J04781H2923N81189j06270k66897
10348B90945p021N1949A02947R3620J82246j87079J30356M7540j53059K78952
10338D95523A28967d4875B49933m4443e817j87666A49607C2298a13846J8915G608
10326A09831c9045A54789J46549H6342C1924K69847j18900q2359R2143k0810H3334
10314f6733j13130b9222G3559a9191n5873l9554J6490A49195J97954a17958q1932
10303a99890c3734D1438I08a14612j67788A70592c22184l0301B13709p1341a8962
$$ plain form
10291 277587 -37524 150553 178946 413 75331 -206506 88131 -389500 54096 -323862 -365795
10280 -365795 168586 25584 -79232 -269636 -111542 223568 149909 -205231 -259702 -326660
10270 -326660 -276158 270686 -58858 148024 -133519 68424 -39963 76837 275748 308066 181132
10259 181132 194919 68381 42584 -47442 -7685 284746 58544 62513 -412203 25844 -76733
10247 -70849 18365 -104878 141369 -108647 69731 64867 -346856 -123506 31877 -288739 -66473
10235 -81437 122034 332294 -56042 -488034 -111199 29610 -156780 -204995 273840 -353579
10224 45862 207761 -369089 -113506 -37076 253691 104153 -83574 209025 -179339 159594
10213 73914 189657 95162 -108209 119607 185003 106729 -108775 18673 -8444 161243 -57419
$$ packed form
10291B77587c7524A50553K8393D13P4918b06506H8131c89500E4096c23862m1933
10280c65795A68586B5584g9232j90404a11542B23568p3659b05231n4471o6958
10270c26660N0502B70686e8858A48024a33519F8424c9963G6837J98911L2318j26934
10259A81132J3787F8381k5797d7442g685B84746E8544L969d12203B5844g6733
10247g0849A8365a04878A41369a08647F9731m864c46856a23506C1877b88739f6473
10235h1437A22034K10260e6042m31992a11199B9610a56780m8215B73840c53579
10224D5862J61899c69089a13506c7076B53691A04153h3574B09025a79339A59594
10213G3914J15743r4495a08209A19607O5396p8274a08775A8673h444A61243e7419
$$ plain form
10201 6756 58093 99774 72916 12750 -63465 76884 -113574 -62725 122306 -102329 -426162
10190 -426162 49509 -404446 -297895 132209 21021 -39703 78659 -247116 -426099 -137526
10179 -15628 -158015 78405 27576 190808 -59921 -85955 -213008 350783 -13531 -91149 -50424
10168 -50424 -117204 -13425 17491 -276651 -409159 -263308 -56567 62851 47156 -316611 -210499
10157 -210499 -287659 190484 -8538 169085 -26105 -111143 363550 -65470 -227018 -310878 10104
10145 49264 63371 149909 -335905 22209 -61978 -146600 -249137 200460 -126876 -196276 111169
10133 -18607 145483 -91495 -156463 90248 56480 53882 -166292 63127 72832 47220 94119 -249450
10120 -246713 -258127 -70945 -152971 112518 99838 70054 113188 -136630 -193422 -192461 112347
$$ packed form
10201F756N1337M1681k6858A2750f3465G6884a13574N0849A22306a02329l23833
10190d26162D9509d04446J06551A32209B1021c9703G8659b47116j78983a37526
10179a5628j42387G8405B7576J63232e9921k6034j27053C50783a3531p7618M0725
10168e0424o6780a3425A7491b76651j32508J45851e6567F2851j5695c16611J06112
10157b10499p7160A90484h538A69085b6105q5038C63550f5470j61548q3860A0104
10145D9264J4107Q6538c35905B2209f1978q4622j02537B00460a26876o9400A11169
10133a8607A45483i1495o4968I0248l3768k598a66292F3127R705k5612M6899b49450
10120b46713j1414g0945q2026A12518j2680k9784M3134a36630n6792R61A12347
$$ plain form
10108 -34471 93399 379141 119719 -216651 -401745 -51776 -99194 -419360 -350857 -317950 -47869
10096 84361 -259685 116586 -185330 193566 -132952 149685 -26137 -46936 -303501 79032
10085 -123988 -233482 -251713 34489 -130541 -110955 26677 -453794 -202113 -173814 -123010 158247
10073 15661 -108293 111707 53084 -219174 -76904 -295754 115383 -77424 -96058 73945 -89911
10061 159680 23202 -34333 -184331 103585 -469256 284860 -60728 -94867 96326 -130142
10050 211402 -315722 163199 -343384 -207878 76935 -197836 68813 -194671 11633 79942
10040 79942 -109772 -244718 16094 396407 24182 94636 -17877 -2993 7524 -172847 -140583
10029 -140583 -366065 -16460 -194867 -27066 60942 23533 -213933 -117452 65048 93959 347844
$$ packed form
10108c4471I3399K85742A19719b16651j85094e1776m7418l20166O8503L2907d7869
10096H4361b59685A16586a85330A93566a32952A49685b6137k0799k56565G9032
10085a23988j09494j8231C4489a30541J9586B6677d53794b02113K8299N0804A58247
10073A5661a08293A11707E3084b19174g6904k18850A15383g7424j8634G3945h9911
10061A59680B3202c4333j49998A03585d69256B84860f0728l4139I6326a30142
10050B11402c15722A63199c43384J35506G6935a97836F8813a94671A1633O8309
10040G9942a09772j34946A6094L80313B4182P0454a7877b993G524a72847L2264
10029a40583k25482a6460j78407b7066F0942B3533b13933R6481F5048K8911K53885
$$ plain form
10018 347844 -287037 12248 -58412 -445354 -17531 -188795 -197569 132623 -89724 241095 351772
10007 351772 -41231 94869 178089 -54544 -284 37318 -36979 36240 -255903 -73004 -214091
9996 -214091 -125692 -227921 -343975 -90649 307142 80615 -26091 -292308 -141173 -155542 15265
9984 -303227 -254069 -254379 13255 -34499 -126394 404929 84352 -55749 81119 93492 98147 -274784
9971 -80279 -244579 80665 -203040 -93936 222268 -161371 -1897 -9331 310813 -153765 144217
9959 28905 75423 -21069 38729 44584 -200203 -19168 35726 138035 63868 -318859 15533
9947 -102459 -174075 89285 25803 -30799 119888 -274404 -346601 -238285 -64442 176364 -117799
9935 605 -142450 -247114 -364129 -17064 155434 6869 202528 6486 -172840 107511 -134500
$$ packed form
10018C47844b87037A2248e8412l86942a7531j71264q774A32623h9724B41095J10677
10007C51772d1231I4869Q3220e4544b84C7318c6979C6240b55903g3004j41087
9996b14091Q8399j02229j16054i0649C07142H0615b6091k66217a41173j4369A5265
9984c03227M9158l10A3255c4499r1895D04929H4352e5749H1119J2373M655b74784
9971h0279j64300H0665b03040i3936B22268a61371a897p434C10813a53765A44217
9959B8905M6518b1069C8729N855b00203a9168C5726J02309F3868c18859A5533
9947a02459p1616H9285B5803c0799A19888b74404p2197J08316f4442A76364a17799
9935F05a42450j04664j17015a7064A55434F869J95659F486a72840A07511a34500
$$ plain form
9923 16755 100318 -165512 121732 -173349 -40055 -351226 119900 -17176 -297254 23225 -105879
9911 -14739 93867 -45403 173944 52508 -205870 -421212 -31883 -255978 -52305 42675 -193209
9899 -119303 144071 -200108 -100389 -4833 -104204 -193249 57369 -184298 166613 -121254 -261786
9888 -261786 -164728 -125131 37522 -93738 15015 60319 -361100 122486 -187383 -83933 -144755
9877 -144755 -42374 -41437 -141543 -36431 -128481 -207775 -143186 -63857 14789 -174367 487470
9865 374310 -55617 154425 161184 -10552 297317 -149043 -318879 131292 -432834 -141450
9854 -153832 256750 -105352 379237 -29279 -465025 -133010 -236731 52430 -92245 60818
9843 -124729 -179746 -367219 28656 -16109 -18316 -54514 -7112 -56148 166566 -299038 -119268
$$ packed form
9923A6755Q3563a65512A21732a73349d0055l11171A19900a7176k80078B3225a05879
9911a4739I3867d5403A73944E2508b05870k15342c1883k24095e2305D2675a93209
9899a19303A44071b00108R9719d833r9371q9045E7369a84298A66613a21254j40532
9888b61786R7058L9597C7522i3738A5015M5304c61100A22486a87383h3933o0822
9877a44755d2374R37j00106c6431r2050p9294O4589f3857A4789a74367D87470
9865C74310e5617A54425O759a0552B97317a49043j69836A31292d32834a41450
9854a53832B56750a05352C79237b9279m35746a33010j03721E2430i2245F0818
9843a24729n5017j87473B8656a6109k207l6198g112m9036A66566b99038a19268
$$ plain form
9831 99210 146060 171233 -136924 -51138 -166899 -245414 299677 224296 7722 -250084 -107525
9819 202731 390483 -213684 168338 59643 -259705 -97743 168680 198384 -197156 -31721
9808 -161457 -104022 -491779 210538 -42098 -42807 -237071 -51777 -246427 -32187 -404437 -92941
9796 40603 -37793 203562 -102136 150053 146320 -162375 144447 -549 118349 128612 -45448
9784 -103751 -390387 134441 -116728 -30305 -1996 181441 -105437 -149071 -223005 -119057 -187405
9773 -187405 69867 134305 -277192 79346 -84036 35290 149101 -115898 1096 139028 -140283
9761 -134806 5389 -89834 -242841 -225992 -118630 85705 -34850 -235433 100623 -11423 131243
9749 42721 -305303 -73784 -275515 142803 -251608 219256 308456 -191755 -215617 -74679 65392
$$ packed form
9831I9210M6850K5173a36924e1138j15761p8515B99677p5381G722b50084a07525
9819B02731J87752b13684A68338E9643b59705i7743A68680K9704a97156c1721
9808a61457N7435l87757B10538d2098p09j94264e1777j94650c2187l72250i2941
9796D0603c7793B03562a02136A50053l733a62375A44447e49A18349J0263d5448
9784a03751k86636A34441a16728c0305a996A81441a05437m3634p3934J03948o8348
9773a87405F9867O4438b77192G9346h4036C5290J13811a15898A096J37932a40283
9761a34806E389h9834j53007J6849J07362H5705c4850k00583A00623a1423A31243
9749D2721c05303g3784k01731A42803b51608B19256Q9200a91755k3862g4679F5392
$$ plain form
9737 19905 -215445 -131510 -118070 -120266 -86718 -86880 -19646 -53897 19879 -367338 150368 -5654
9724 -239218 -124609 -190104 -121211 -106589 -194510 -154202 -14732 -184071 -206852 40921 61646
9713 61646 45889 -234311 -450873 -13605 -12159 -106012 -83544 242386 -82450 62505 17024
9701 204587 44842 -229723 -24333 -166539 -119508 -105062 111669 -238011 109518 -104395
9690 36213 -132898 278818 -157496 -217161 -85524 -152568 -164402 -50013 -18207 -237112 118090
9678 43057 -7478 129046 -383827 -31908 202409 184736 43301 218721 -110448 119625 -168142
9666 -231332 -10208 -189078 70628 223729 -117835 15907 -26810 132802 69747 -222487 -239295
9655 -239295 153119 169188 -140385 -207087 199461 59564 -103556 -88722 319683 -195332
$$ packed form
9737A9905b15445Q3935J3440k196L3548j62a9646l4251A9879c67338A50368e654
9724b39218J14609o5495O8893J4622q7921M0308a4732j69339k2781D0921K0725
9713F1646j5757b34311k16562a3605J446r3853K2468B42386h2450F2505A7024
9701B04587D4842b29723b4333j42206M7031J4446A11669b38011A09518a04395
9690C6213a32898B78818a57496n9665h5524o7044j1834e0013a8207k18905A18090
9678D3057g478A29046c83827c1908B02409j7673D3301J75420a10448A19625a68142
9666b31332a0208j78870G0628J53101a17835A5907b6810A32802o3055b22487j6808
9655b39295A53119J6069a40385o6702A99461E9564a03556J4834C19683a95332
$$ plain form
9644 -82388 139846 163913 4793 152318 -37798 22188 -196654 2979 -235919 139455 -184557
9632 4768 -138590 41813 -21461 129054 -347805 -100479 62059 -79912 -113925 -43098 -6359
9620 61417 179699 -290972 163961 -48639 85994 -171458 137860 116786 -11399 -267764 42401
9608 115387 -155067 49609 -241845 72182 54207 -166900 -98616 -16368 -63571 29337 -78274
9596 190396 -138539 -242474 160909 58079 -162475 173998 -207629 34466 -190085 -89645
9585 -271074 -81800 -4358 -112234 -409994 273549 -431763 -179476 44744 65054 -388632 207354
9573 -177566 119553 49265 -116325 40026 43765 -154615 -137466 100050 86774 -51322 -38810
9562 -38810 -281692 -155078 239490 81838 16218 88234 -62269 -20541 -52711 -6701 -27315
$$ packed form
9644h2388A39846K4067D793J47525c7798B2188a96654B979b35919A39455a84557
9632D768a38590D1813b1461A29054c47805a00479F2059g9912l4013d3098f359
9620F1417J18282b90972A63961d8639H5994a71458A37860k1074a1399k56365D2401
9608A15387a55067D9609b41845G2182j7975a66900O8284a6368m7203B9337g8274
9596A90396a38539j03935A60909E8079a62475A73998b07629C4466a90085h9645
9585b71074h1800d358j07876k97760B73549d31763a79476D4744K0310c88632B07354
9573a77566A19553D9265a16325D0026L739a54615J7149A00050j3276e1322J2512
9562c8810k42882J26614B39490H1838A6218P2016f2269b0541l2170f701k0614
$$ plain form
9551 -27315 -361684 -178363 -122106 19131 151005 -249581 21576 -356797 -295701 -67327 88125
9539 -168538 -105224 -294310 -132793 -409962 -190714 -521662 22074 267242 92392 -36164
9528 77005 16844 -254071 -467199 154080 -57525 2632 -202949 -317412 -340706 166474 74481
9516 81352 52117 -492283 -216591 67462 -60919 225384 216732 -105003 104778 -77980 118890
9504 -217193 -11110 100520 -125438 -204830 -85602 74588 -37425 259490 59799 -121172 -198873
9493 -198873 -91436 -133455 -26501 6697 -27996 -162400 -147777 78632 132425 458149 -156955
9481 40569 -34680 82770 109862 90949 -53643 23173 68219 77925 -37198 -25652 -152252 -108558
9469 -108558 -5052 -327820 -228879 177945 141160 314027 -151443 -9953 -14413 -191391 -153707
$$ packed form
9551b7315l34369a78363N6257A9131J31874b49581B1576c56797O1096f7327H8125
9539a68538O3314j89086a32793k77169a90714l30948B2074K45168I2392c6164
9528G7005A6844b54071k13128A54080e7525B632b02949j14463k3294A66474G4481
9516H1352k9235d92283b16591F7462f0919B25384q652a05003A04778g7980A18890
9504b17193a1110A00520a25438p9392h5602G4588c7425B59490E9799a21172p7701
9493a98873i1436m2019b6501F697b7996j34404J4623G8632N3793L25724a56955
9481D0569c4680H2770K7092j8913e3643B3173M5046R706c7198J1546j26600M3694
9469a08558e052l22768R8941A77945l6785J72867a51443i953m460j76978L7684
$$ plain form
9458 -153707 37905 -74124 52767 -132930 -160071 144113 -244656 -178077 91848 -36394 395390
9446 101718 74968 3084 64226 -164432 11184 -209245 -140290 -198653 73966 8076 190344
9435 190344 -132484 181635 23009 14199 -140335 -209976 91090 -217273 -72173 -73572 -599053
9424 -599053 -274787 98564 -125350 -31623 48306 174897 19026 198782 -586585 -317865
9414 -317865 -157562 -315463 -87885 -19588 -283090 -107489 26389 -28383 147911 11410 193947
9403 193947 -281079 -141162 170858 -181372 -17800 153056 -203182 -290273 -156019 -162985
9393 -162985 23069 140301 -180207 -35815 402149 -71248 -38865 60076 -395376 -236989 -237310
9382 -237310 105738 -147642 -117507 -70151 198193 -297914 -73689 528314 13627 107384 -200754
$$ packed form
9458a53707C7905g4124E2767a32930k7141A44113b44656O6579I1848c6394C95390
9446A01718k6750C084O1142a64432A1184b09245O8955n8363G3966H076J82268
9435A90344a32484A81635B3009q810a40335o9641I1090b17273g2173j399n25481
9424e99053b74787I8564a25350c1623D8306J26591A9026J79756e86585K68720
9414c17865a57562j57901h7885a9588k63502a07489B6389b8383A47911A1410J82537
9403A93947b81079J39917A70858a81372a7800A53056b03182q7091J34254o966
9393a62985B3069J17232a80207c5815D02149g1248L2383F0076c95376J58387l21
9382b37310A05738a47642L0135M7356A98193b97914g3689E28314A3627R3757b00754
$$ plain form
9370 -105080 11282 180071 18953 121191 167267 -183234 -152982 -246865 297486 172586 -242482
9358 -72407 -262328 10493 226077 -168479 -407702 -131419 -162110 -40606 -17221 42602 110692
9347 110692 -254059 -122447 -205382 -67592 148292 -219938 -399671 -360263 -37071 193431
9336 -128390 178989 268251 82015 141199 -58322 -136752 108711 8665 -239532 92027 -30003
9324 -92312 -351058 -32448 -19108 -521042 -160984 -117669 -81215 -11358 2915 -71207 57130
9312 -11421 -301763 -333755 -130530 -339947 266265 -71254 -218857 27494 -129300 137671
9301 -88953 -21248 -284830 -284944 135112 -503696 -474697 51686 -142270 -119147 113862 -77819
9289 56827 86716 -270390 -213171 106021 -22122 -76381 -81111 27683 -249658 281561 -470680
$$ packed form
9370a05080A1282J68789A8953J02238M6076a83234L0252r3883B97486j24900b42482
9358g2407j89921A0493K15584a68479k39223a31419l0691d0606a7221D2602O8090
9347A10692b54059a22447q2935f7592A48292b19938j79733L9408c7071A93431
9336a28390A78989Q9262H2015N9184e8322p8430A08711H665b39532I2027c0003
9324i2312k58746c2448J3340n01934a60984M3315L6454a1358B915g1207E7130
9312a1421k90342l1992a30530k09417B66265g1254j47603B7494a29300A37671
9301h8953b1248k63582j14A35112e03696K8999E1686a42270K3123A13862g7819
9289E6827K9889b70390N7219A06021b2122n4259m730B7683b49658B81561d70680
$$ plain form
9277 -99161 -194916 40724 74682 -172902 -81766 41755 -133721 -22149 112414 30180 -265456
9265 -75506 22251 -59869 -110595 -247509 -100440 -193801 71163 24342 -202859 3103 -142781
9253 115010 -318101 -48518 102748 -146402 -45029 23630 -330248 -3193 294805 -180719 291469
9241 -159260 -60220 103698 79330 -157688 -49903 -172022 -164488 -200898 -6037 -132711 -165436
9230 -165436 -216581 187886 -90618 -107179 -122694 -199720 250597 -41333 32399 -27302 -38690
9219 -38690 29963 52194 -57303 -101527 -289916 -239163 -260832 -246684 -244333 -35673 -2564 -111984
9207 -111984 227349 -201596 -446211 92251 -59992 91133 8863 313184 -216445 -69177 65917
9195 -66509 -53371 -269569 67869 193205 -59154 -287044 47759 142517 36010 -35023 -83189
$$ packed form
9277i9161r5755D0724L3958a72902h1766D1755a33721b2149A12414C0180b65456
9265g5506B2251e9869n0726j36914a00440r3361G1163B4342b02859C103a42781
9253A15010c18101d8518A02748a46402d5029B3630c30248c193B94805a80719B91469
9241a59260f0220A03698k4368a57688d9903j22119P534l6410f037j26674l2725
9230a65436n1145A87886i0618j6561j5515p7026B50597d1333C2399b7302j1388
9219c8690B9963K2231e7303m4224j88389N0753k1669J4148K351c5673b564j09420
9207a11984B27349b01596k44615I2251e9992I1133H863L04321b16445f9177F5917
9195f6509J3138k16198F7869J25336e9154k27890D7759R4758C6010c5023m8166
$$ plain form
9184 -83189 92016 -251361 71245 -476299 118340 -141148 9418 -78506 -7237 -39177 172364
9172 -280340 45935 -406053 -140759 -26004 -128613 45265 131569 12566 -113706 -22623 -105266
9161 -105266 -189839 -91629 315048 -310405 -118020 122892 -59884 221655 -1785 52527 -146125
9149 48061 -309241 192539 -271585 -318375 138137 133338 -8914 18636 165355 -126443 -24487
9137 -377334 79360 -27090 116110 -110877 -286362 15466 -114677 -369685 -176499 -135414
9127 -135414 81734 42881 186053 -19241 -205744 -34045 -189995 -307453 -171317 96606 -165017
9115 -357406 57751 107890 -25261 -296544 -136110 -97144 -189486 -19443 -325739 93264 379590
9104 379590 46356 147043 -201239 -203789 255541 -81427 -181267 340041 -205353 -110069 -83636
$$ packed form
9184h3189I2016b51361G1245d76299A18340a41148I418g8506g237l1940A72364
9172b80340D5935d06053a40759b6004j02609D5265Q6304A2566a13706b2623q2643
9161a05266q4573i1629C15048c10405a18020A22892e9884B21655a785E2527a46125
9149D8061c09241A92539b71585m6790A38137m799h914A8636J46719a26443b4487
9137c77334G9360b7090A16110a10877j75485A5466a14677k55008a76499M1085
9127a35414H1734l8853J43172a9241j86503c4045j55950j17458J36136I6606a65017
9115c57406E7751N0139b5261k71283a36110L8966r2342a9443l06296I3264K86326
9104C79590D6356J00687b01239k550B55541h1427r9840C40041b05353R5284K6433
$$ plain form
9093 -83636 -79779 -34995 174544 -125422 -475085 -282088 -2860 83742 -276942 217094 56592
9081 -204371 -82729 -24147 -276263 216060 -133378 -148014 -155067 127824 237969 -49338 136974
9069 -129543 73825 53669 -11227 181017 -186403 79947 -225224 -4892 -180684 -139622 -10214
9057 -340350 -265738 -157936 -278381 61015 -114779 -39492 125531 -267382 -304034 -321657 -154354
9045 -89877 -91038 -163301 -84695 222710 -96035 161441 -21163 80279 242996 -95088 93394
9033 -155978 221501 43265 -261319 345957 -204264 -56383 163982 -159757 277603 515619
9023 515619 50374 -76259 -119913 -207942 -187789 -110571 83510 -35053 65748 -52395 -458926
9012 -458926 -8076 -52766 11278 -180131 -128543 -311399 39893 -123819 -271154 229013 -68369
$$ packed form
9093h3636L857c4995A74544a25422l49663J92997b860H3742b76942B17094E6592
9081b04371h2729b4147k52116B16060a33378j4636p053A27824J10145d9338A36974
9069a29543G3825k0156a1227A81017a86403G9947b25224d892j75792M1062a0214
9057c40350P4612J07802j20445F1015a14779c9492A25531b67382l6652j7623a54354
9045h9877j161p2263P8606B22710i6035A61441b1163H0279J62717i5088I3394
9033a55978B21501D3265b61319C45957b04264e6383A63982a59757B77603K38016
9023E15619E0374g6259m3654q8029K0153P7218H3510c5053F5748e2395m06531
9012d58926h076m4690A1278a80131N1588j82856C9893a23819j47335B29013f8369
$$ plain form
9000 -137511 42342 -48452 -123199 -158650 -164742 -180619 -45029 -20471 282917 97975 98978 138980
8988 138980 -82350 52012 11565 37107 15367 141382 52960 80037 117627 207089 33508
8976 -85699 -84634 17231 -26647 -318547 145156 -90755 -93438 76361 170072 -201129 -42949 91366
8963 -13650 -22353 -281847 -50266 -32202 -242534 221509 73102 -250350 -256740 86271 -313088
8951 207625 92998 174395 -299086 246743 -182942 129910 100333 45713 274959 -261685
8940 21658 -249742 201833 -45994 -40894 -3302 198577 240533 -127143 -37951 38729 -204859
8928 -171607 243107 171360 -126874 662129 1875665 4201855 12781489 10428922 2682868
8918 838431 329967 161796 135413 -162296 57532 20695 120872 137462 -95759 97441 202395
$$ packed form
9000a37511D2342d8452p4747l5451o092j5877d5029b0471B82917I7975J003M0002
8988A38980h2350E2012A1565K5542A5367J26015E2960K7077L7590Q9462C3508
8976h5699J065A7231b6647k91900A45156i0755k683G6361R3711b01129d2949I1366
8963a3650q703k59494e0266J8064k10332B21509G3102b50350o390H6271c13088
8951B07625I2998Q1397b99086B46743a82942A29910k9577D5713K29246b61685
8940B1658b49742B01833d5994N100c302A98577M1956a27143c7951C8729b04859
8928a71607B43107p1747a26874F62129J213536K326190Q579634k352567B682868
8918H38431C29967A61796k6383a62296E7532B0695J00177J6590i5759I7441J04954
$$ plain form
8907 202395 -56827 178433 -62444 15648 -170677 -88558 -196420 42733 44594 -198444 -293728
8896 -293728 46542 -309442 105001 -263563 -112688 130655 -101232 151093 233752 -260144
8885 91653 109146 51696 56739 444293 -46491 84050 -295663 190596 -21854 -227458 -221312
8874 -221312 -224145 -14945 -31449 -194666 -118818 -216798 -20056 -225404 -84889 74241 200926
8863 200926 -167946 -525653 175187 -213695 -445698 -126317 7660 -64719 26565 29667 -18295
8851 -4636 26481 124271 -262276 -20319 -352779 -108548 231 -252265 -248082 -91482 -368161 -211612
$$ packed form
8907B02395e6827A78433f2444A5648a70677Q2119j07862D2733J861a98444r5284
8896b93728D6542c09442A05001b63563a12688A30655a01232A51093Q2659b60144
8885I1653J7493E1696N043L87554d6491H4050b95663A90596b1854k05604O146
8874b21312k833a4945j6504j63217P5848r7980b0056k05348h4889G4241J26685
8863B00926a67946l57707A75187b13695k32003a26317G660f4719B6565L102a8295
8851d636B6481R7790b62276b0319l32460a08548B31b52265M183i1482k76679J56549
$$ [...]
##END NTUPLES=NMR SPECTRUM
##END=
