##TITLE=AC1573_ROEFFECT0022_8271116_8PyWePruJo
##JCAMPDX= 6.0         $$ Bruker NMR JCAMP-DX V2.0
##DATA TYPE= NMR SPECTRUM
##DATA CLASS= NTUPLES
##ORIGIN= BRUKER
##OWNER= Administrator
$$ 1.72 TOPSPIN		Version 2.1
$$ 2013-10-12 16:26:50.662 -0700  Administrator@X
$$ Compression mode = diff/dup
##.OBSERVE FREQUENCY= 400.02188249412
##.OBSERVE NUCLEUS= ^1H
##.ACQUISITION MODE= SIMULTANEOUS (DQD)
##.ACQUISITION SCHEME= undefined
##.AVERAGES= 64
##.DIGITISER RES= 22
##SPECTROMETER/DATA SYSTEM= spect
##.PULSE SEQUENCE= noesygpps1d.comp
##.SOLVENT NAME= COFFEE_meoh
##.SHIFT REFERENCE= INTERNAL, COFFEE_meoh, 1, 14.96074
##AUDIT TRAIL= $$ (NUMBER, WHEN, WHO, WHERE, PROCESS, VERSION, WHAT)
$$ ##TITLE= Audit trail, TOPSPIN		Version 2.1
$$ ##JCAMPDX= 5.01
$$ ##ORIGIN= Bruker BioSpin GmbH
$$ ##OWNER= Administrator
$$ $$ E:\/data/COFFEE/nmr/AC1573_ROEFFECT0022_8271116_8PyWePruJo/12/pdata/1/auditp.txt
$$ ##AUDIT TRAIL=  $$ (NUMBER, WHEN, WHO, WHERE, PROCESS, VERSION, WHAT)
(   1,<2013-10-12 16:26:45.865 -0700>,<Administrator>,<X>,<go>,<TOPSPIN 2.1>,
      <created by zg
	started at 2013-10-12 16:15:16.461 -0700,
	POWCHK enabled, PULCHK disabled,
       configuration hash MD5:
       C8 4E 4E 5D D3 5C D8 9E 9F 52 82 E0 59 8A DE 15
       data hash MD5: 64K
       85 5D D3 55 48 1F 8D AF 0B 2B 6C 82 B4 A8 8E FF>)
(   2,<2013-10-12 16:26:48.787 -0700>,<Administrator>,<X>,<proc1d>,<TOPSPIN 2.1>,
      <Start of raw data processing
       efp LB = 0.3 FT_mod = 6 PKNL = 1 PHC0 = 0 PHC1 = 0 SI = 128K 
       data hash MD5: 128K
       B2 6A C0 8B 81 33 4F 09 B7 39 80 4D DF D1 CD 80>)
(   3,<2013-10-12 16:26:49.724 -0700>,<Administrator>,<X>,<proc1d>,<TOPSPIN 2.1>,
      <pk PHC0 = -80.38147 PHC1 = 0 
       data hash MD5: 128K
       98 94 8E 21 B2 5B 90 05 5E 1D 86 D3 87 D9 3B 69>)
(   4,<2013-10-12 16:26:50.130 -0700>,<Administrator>,<X>,<proc1d>,<TOPSPIN 2.1>,
      <abs ABSG = 1 
       data hash MD5: 128K
       84 B4 46 D3 8B 1E 11 23 06 C3 62 CE F0 5C 63 86>)
(   5,<2013-10-12 16:26:50.240 -0700>,<Administrator>,<X>,<proc1d>,<TOPSPIN 2.1>,
      <abs ABSG = 2 
       data hash MD5: 128K
       BD AE C8 3A 51 12 62 9F 98 D9 46 70 67 48 31 4E>)
(   6,<2013-10-12 16:26:50.302 -0700>,<Administrator>,<X>,<proc1d>,<TOPSPIN 2.1>,
      <abs ABSG = 3 
       data hash MD5: 128K
       CE F9 AA 10 2D 67 5C 48 60 38 AB 3E FE 28 F9 DE>)
(   7,<2013-10-12 16:26:50.396 -0700>,<Administrator>,<X>,<proc1d>,<TOPSPIN 2.1>,
      <abs ABSG = 4 
       data hash MD5: 128K
       8F 17 00 B7 BB B0 4A 9B 74 D9 59 9E F4 81 35 75>)
(   8,<2013-10-12 16:26:50.474 -0700>,<Administrator>,<X>,<proc1d>,<TOPSPIN 2.1>,
      <abs ABSG = 5 
       data hash MD5: 128K
       66 82 D2 13 6E 17 45 6B 40 8E 5E 9A 23 2E 2C 43>)
$$ ##END=
$$ 
$$ $$ hash MD5
$$ $$ 19 73 C0 24 09 3E 30 BE 6A 28 F1 FF 77 43 6F 61
##$RELAX= 
##$RELAX= 
##$RELAX= 
##$RELAX= 
##$RELAX= 
##$RELAX= 
##$RELAX= 
##$RELAX= 
$$ Bruker specific parameters
$$ --------------------------
##$DU= <E:\>
##$EXPNO= 12
$$ [...]
150 150 150 150 150 150 150 150
##$TP07= 0
##$TPNAME0= <>
##$TPNAME1= <>
##$TPNAME2= <>
##$TPNAME3= <>
##$TPNAME4= <>
##$TPNAME5= <>
##$TPNAME6= <>
##$TPNAME7= <>
##$TPOAL= (0..7)
0.5 0.5 0.5 0.5 0.5 0.5 0.5 0.5
##$TPOFFS= (0..7)
0 0 0 0 0 0 0 0
##$TUNHIN= 0
##$TUNHOUT= 0
##$TUNXOUT= 0
##$USERA1= <user>
##$USERA2= <user>
##$USERA3= <user>
##$USERA4= <user>
##$USERA5= <user>
##$V9= 5
##$VALIST= <valist>
##$VCLIST= <CCCCCCCCCCCCCCC>
##$VD= 0
##$VDLIST= <DDDDDDDDDDDDDDD>
##$VPLIST= <PPPPPPPPPPPPPPP>
##$VTLIST= <TTTTTTTTTTTTTTT>
##$WBST= 1024
##$WBSW= 4
##$XGAIN= (0..3)
0 0 0 0
##$XL= 0
##$YL= 0
##$YMAX_a= 6373856
##$YMIN_a= -12701635
##$ZGOPTNS= <>
##$ZL1= 120
##$ZL2= 120
##$ZL3= 120
##$ZL4= 120
##$ABSF1= 14.96074
##$ABSF2= -5.597442
##$ABSG= 5
##$ABSL= 3
##$ALPHA= 0
##$AQORDER= 0
##$ASSFAC= 0
##$ASSFACI= 0
##$ASSFACX= 0
##$ASSWID= 0
##$AUNMP= <proc_prof1d_extract.lims>
##$AXLEFT= 0
##$AXNAME= <>
##$AXNUC= <1H>
##$AXRIGHT= 0
##$AXTYPE= 0
##$AXUNIT= <>
##$AZFE= 0.1
##$AZFW= 0.1
##$BCFW= 0
##$BC_mod= 0
##$BYTORDP= 0
##$COROFFS= 0
##$CY= 15
##$DATMOD= 1
##$DC= 0
##$DFILT= <>
##$DTYPP= 0
##$F1P= 0
##$F2P= 0
##$FCOR= 0.5
##$FTSIZE= 131072
##$FT_mod= 6
##$GAMMA= 0
##$GB= 0
##$INTBC= 1
##$INTSCL= 1
##$ISEN= 128
##$LB= 0.3
##$LEV0= 0
##$LPBIN= 0
##$MAXI= 10000
##$MC2= 0
##$MEAN= 0
##$ME_mod= 0
##$MI= 0
##$NCOEF= 0
##$NC_proc= -2
##$NLEV= 6
##$NOISF1= 0
##$NOISF2= 0
##$NSP= 0
##$NTH_PI= 0
##$NZP= 0
##$OFFSET= 14.96074
##$PC= 1
##$PHC0= -80.38147
##$PHC1= 0
##$PH_mod= 1
##$PKNL= yes
##$PPARMOD= 0
##$PPDIAG= 0
##$PPIPTYP= 0
##$PPMPNUM= 2147483647
##$PPRESOL= 1
##$PSCAL= 4
##$PSIGN= 0
##$PYNMP= <proc.py>
##$REVERSE= no
##$SF= 400.02000973967
##$SI= 131072
##$SIGF1= 0
##$SIGF2= 0
##$SINO= 400
##$SIOLD= 131072
##$SPECTYP= <>
##$SREGLST= <1H.CDCl3>
##$SSB= 0
##$STSI= 131072
##$STSR= 0
##$SW_p= 8223.68421052631
##$SYMM= 0
##$S_DEV= 0
##$TDeff= 65536
##$TDoff= 0
##$TI= <>
##$TILT= no
##$TM1= 0
##$TM2= 0
##$TOPLEV= 0
##$USERP1= <user>
##$USERP2= <user>
##$USERP3= <user>
##$USERP4= <user>
##$USERP5= <user>
##$WDW= 1
##$XDIM= 131072
##$YMAX_p= 416077209
##$YMIN_p= -11943
##$CURPLOT= <Network HP LaserJet P1505>
##$CURPRIN= <$Network HP LaserJet P1505>
##$DFORMAT= <normdp>
##$LAYOUT= <+/1D_H.xwp>
##$LFORMAT= <normlp>
##$PFORMAT= <normpl>
##$SURQMSG= 1
$$ End of Bruker specific parameters
$$ ---------------------------------
##NTUPLES= NMR SPECTRUM
##VAR_NAME=  FREQUENCY,     SPECTRUM/REAL,   SPECTRUM/IMAG
##SYMBOL=    X,             R,               I
##VAR_TYPE=  INDEPENDENT,   DEPENDENT,       DEPENDENT
##VAR_FORM=  AFFN,          ASDF,            ASDF
##VAR_DIM=   131072,        131072,          131072
##UNITS=     HZ,            ARBITRARY UNITS, ARBITRARY UNITS
##FACTOR=    0.0627417313425164, 1,          1
##FIRST=     8223.62146879497, -2180,        -63203
##LAST=      0,             -51,             -63987
##MIN=       0,             -11943,          0
##MAX=       8223.62146879497, 416077209,    0
$$ Real data points
##PAGE= N=1
##DATA TABLE= (X++(R..R)), XYDATA
$$ [...]
63914C239174j96782j99235j97658j92418j84403j74398j62754j49811j36279
63905A645436j22880j09927r7496q5737p4806o4657n5311m7103m0367l4888l0082
63894H82182k5703k1996j9043j6415j3712j1148r252q153p570p365p679q404r007
63881G16735r100q884q709q416p404n334k443P72M002P259J0727J4435J7970K0615
63867G42225K2045K2775K3696K5171K6792K7913K8116K7321K5856K4400K3358
63856A019668K2227K0067J6677J2823R140N419J373k600o008r169j2716j6539
63844A060362j9915k2586k4930k7073k8723k9963l1390l3124l4458l4850l4592
63833G38758l4024l2839l0883k9008k8151k7933k7079k5148k2932k1097j9416
$$ plain form
63914 3239174 3042392 2843157 2645499 2453081 2268678 2094280 1931526 1781715 1645436
63905 1645436 1522556 1412629 1315133 1229396 1154590 1089933 1034622 987519 947152 912264 882182
63894 882182 856479 834483 815440 799025 785313 774165 764913 756760 749190 741825 734146 725742 716735
63881 716735 707635 698751 690042 681626 674222 668888 666445 667217 671219 678478 689205 703640 721610 742225
63867 742225 764270 787045 810741 835912 862704 890617 918733 946054 971910 996310 1019668
63856 1019668 1041895 1061962 1078639 1091462 1100602 1106021 1107394 1104794 1098786 1089617 1076901 1060362
63844 1060362 1040447 1017861 992931 965858 937135 907172 875782 842658 808200 773350 738758
63833 738758 704734 671895 641012 612004 583853 555920 528841 503693 480761 459664 440248
63822D40248j7588j5918j4745j3792j2627j1327j0209r279q397p654p131o528
63810C05053n571m609m305m807n546n782n142l768k307j549j728k288k604k619
63796B52428k522k199j592j222j597k298k457k060j907k217k235j531p50n73p15
63781B26553n67j99m7p1Rmm72j139j327q76l07o8j75n04r61j343j490j520j584
63762B13908j467r01j29L07K98K01J89J39J14L80Q49J046Q22N54M92M33K30J17
63744B17582K13J96j99o87p96m24K48J099J959K477K446K154K043K208K470K704
63728B35693K854K819K668K756L257L803L955L946M390N289N865N568M769M182
63714B91814L915L491K602J468M65k19n49n62n12q43j778k947l710l770l338k727
$$ plain form
63822 440248 422660 406742 391997 378205 365578 354251 344042 334763 326366 318712 311581 305053
63810 305053 299482 294873 290568 285761 280215 274433 269291 265523 263216 261667 259939 257651 255047 252428
63796 252428 249906 247707 246115 244893 243296 240998 238541 236481 234574 232357 230122 228591 227841 227268 226553
63781 226553 225986 225787 225740 225669 225678 225674 225202 224063 222736 221860 221553 221485 221310 220806 219845 218502 217012 215492 213908
63762 213908 212441 211540 211411 211718 212016 212217 212406 212545 212659 213039 213888 214934 215756 216310 216802 217235 217465 217582
63744 217582 217795 217991 217792 217105 216309 215885 216133 217232 219191 221668 224114 226268 228311 230519 232989 235693
63728 235693 238547 241366 244034 246790 250047 253850 257805 261751 266141 271430 277295 282863 287632 291814
63714 291814 295729 299220 301822 303290 303755 303536 302987 302425 301913 301070 299292 296345 292635 288865 285527 282800
63698B82800k027j235m49J71N22N49L31K10N54J270J840K023K189K650L048K896
63682B97342K454K408K758K716J882R09O44J045J370J180P41M87M81M55J93k17
63666C16848m55k66L07R79J406J308O04m20j223j523j591j847k352k949l652m460
63650C00714m971m739l965l324l049k738k093j310o19J2N15O11L63L19Q35J645
63634B78206K351K864L178L226L270L767M562M858M482M401N341O525O736O073
63620C39840N742O293P167P861Q542R392J0222J1079J2447J4506J6716J8501J9881
63607D88189K1164K2494K3932K5605K7458K9094L0110L0330K9601K7713K4652
63596G80342K0676J5990J0708N224L15l357n576o420o199n673n852p238r553j2356
$$ plain form
63698 282800 280773 279538 279089 279260 279782 280331 280662 280872 281426 282696 284536 286559 288748 291398 294446 297342
63682 297342 299796 302204 304962 307678 309560 310469 311113 312158 313528 314708 315449 315936 316417 316872 317065 316848
63666 316848 316393 316127 316434 317413 318819 320127 320731 320311 319088 317565 315974 314127 311775 308826 305174 300714
63650 300714 295743 291004 287039 283715 280666 277928 275835 274525 273906 273918 274433 275044 275407 275726 276561 278206
63634 278206 280557 283421 286599 289825 293095 296862 301424 306282 310764 315165 320506 327031 333767 339840
63620 339840 345582 351875 359042 366903 375445 384837 395059 406138 418585 433091 449807 468308 488189
63607 488189 509353 531847 555779 581384 608842 637936 668046 698376 727977 755690 780342
63596 780342 801018 817008 827716 832940 833255 829898 824322 817902 811703 806030 800178 792940 783387 771031
63582G71031j5488j8718k1463k3354k4707k5897k6547k5954k4168k2022k0033
63571E22680j7843j5022j1918r351p584o075m240k127j78J494L186M977O400P024
63557D71423P176P621Q578R503R987J0395J1332J2773J4247J5741J7885K1110
63545F17771K4962K8567L1582L4462L7721M1064M3266M2836L8810L1152K0804
63534I92997R534n03p606j1376j2687j2719j2001j0467q335o603o451q250j1381
63521H94152j5116j9334k4162k9079l2925l4990l5719l6005l5990l4987l2547
63510E63298k9141k5678k2693k0240j8260j6659j5123j3293j1230r481q424p727
63498C65349o778n518m510m069l806l313k844k790k772k089r56m05p35r51k44
$$ plain form
63582 771031 755543 736825 715362 692008 667301 641404 614857 588903 564735 542713 522680
63571 522680 504837 489815 477897 468546 460962 454887 450647 448520 448342 449836 453022 457999 464399 471423
63557 471423 478599 486220 494798 504301 514288 524683 536015 548788 563035 578776 596661 617771
63545 617771 642733 671300 702882 737344 775065 816129 859395 902231 941041 972193 992997
63534 992997 1002531 1002028 994422 983046 970359 957640 945639 935172 926837 920234 913783 905533 894152
63521 894152 879036 859702 835540 806461 773536 738546 702827 666822 630832 595845 563298
63510 563298 534157 508479 485786 465546 447286 430627 415504 402211 390981 381500 373076 365349
63498 365349 358571 353053 348543 344474 340668 337355 334511 331721 328949 326860 325904 325499 324764 323813 323569
63483C23569Q01J165R39R85J534K083K421K773L017K786K329K337K750K752K161
63468C54402J766J891J685M48j194k252k734l214l702l847l787l828l640k745
63454C29249j535q11m98J78J238J788J458R90J083J555K104L016M469N817O353
63439C56454O386O876Q285J0377J2870J5643J8437K1070K3949K7690L2044L5609
63427E75690L6833L5048L0521K3994J6479R136L040j048k665j710J342N562J0175
63414G42397J4938J9793K4416K8373L1544L3957L5217L4508L1316K5959J9333
63403A041751J2363N797K06m060o897q370q768q763r167j0423j2529j5564j9747
63390I55829k4707k9276l2601l5040l7245l8664l8046l5402l2321k9961k7768
$$ plain form
63483 323569 324370 325535 326474 327459 328993 331076 333497 336270 339287 342073 344402 346739 349489 352241 354402
63468 354402 356168 358059 359744 360192 358998 356746 354012 350798 347096 343249 339462 335634 331994 329249
63454 329249 327714 326903 326405 326583 327821 329609 331067 332057 333140 334695 336799 339815 344284 350101 356454
63439 356454 362840 369716 378001 388378 401248 416891 435328 456398 480347 508037 540081 575690
63427 575690 612523 647571 678092 702086 718565 727701 730741 729693 727028 725318 726660 732222 742397
63414 742397 757335 777128 801544 829917 861461 895418 930635 965143 996459 1022418 1041751
63403 1041751 1054114 1059911 1060117 1056057 1049160 1040790 1032022 1023259 1014092 1003669 991140 975576 955829
63390 955829 931122 901846 869245 834205 796960 758296 720250 684848 652527 622566 594798
63379E94798k4797k1358j8379j5848j3077j0161p924o387m493j770Q22K235K869
63366D76530L965O024Q477J0681J2490J4013J5434J7178J9642K2610K5278K7078
63354F59400K8238K9370L0833L2582L4424L6028L6823L6165L3685K9446K3858
63343A010852J7543J1183N250r8m730q214j0075j0459j0220j0235j0818j2042
63331I67937j4247j7769k2194k6413k9604l1803l3410l4391l4266l2668k9646
63320F61526k5615k1166j6788j2556q217l918p04J4k404p335j3325j8840k2744
63307E07928k4482k4153k2244j9390j6290j3645j1783j0389q863p029n255l930
63295C40475l159k933l208l654l716l200k580k421k645k665k182j548j269j415
$$ plain form
63379 594798 570001 548643 530264 514416 501339 491178 483254 476867 472374 470604 471426 473661 476530
63366 476530 480495 486519 494996 505677 518167 532180 547614 564792 584434 607044 632322 659400
63354 659400 687638 717008 747841 780423 814847 850875 887698 923863 957548 986994 1010852
63343 1010852 1028395 1039578 1044828 1044730 1040000 1031786 1021711 1011252 1001032 990797 979979 967937
63331 967937 953690 935921 913727 887314 857710 825907 792497 758106 723840 691172 661526
63320 661526 635911 614745 597957 585401 577184 573266 572562 572576 570172 562837 549512 530672 507928
63307 507928 483446 459293 437049 417659 401369 387724 375941 365552 356689 349660 344405 340475
63295 340475 337316 334383 331175 327521 323805 320605 318025 315604 312959 310294 308112 306564 305295 303880
63281C03880j671j791j801j734j436p94m8M52O93R32J124Q90K45j09L28J046J210
63264C01416Q97R11J491J975J943J805J919J902J483J312K127L480M209M049L893
63249C34812M398N135N378N082M639M278M125M526N701P257Q506R245R875J0723
63235D23680J1631J2334J2953J3869J5190J6600J7723J8481J9027J9398J9450
63224F00336J9085J8459J7898J7679J7927J8539J9176J9472J9372J9123J8857
63213H05923J8372J7456J6189J4660J2539R351N088K83m498q952j2884j6078j8429
63200H39020j9948k0679k0771k0562k0145j9025j6644j3268r759o440k856J167
63188F70090N009Q228J1298J4714J7989K0396K2257K4517K7244K9499L0729L1347
$$ plain form
63281 303880 302209 300418 298617 296883 295447 294653 294605 295057 295750 296682 297806 298696 298941 298832 299160 300206 301416
63264 301416 302313 303224 304715 306690 308633 310438 312357 314259 315742 317054 319181 322661 326870 330919 334812
63249 334812 339210 344345 349723 354805 359444 363722 367847 372373 378074 385331 393837 403082 412957 423680
63235 423680 435311 447645 460598 474467 489657 506257 523980 542461 561488 580886 600336
63224 600336 619421 637880 655778 673457 691384 709923 729099 748571 767943 787066 805923
63213 805923 824295 841751 857940 872600 885139 894490 899578 899861 895363 886411 873527 857449 839020
63200 839020 819072 798393 777622 757060 736915 717890 701246 687978 678219 671779 668923 670090
63188 670090 675099 683327 694625 709339 727328 747724 769981 794498 821742 851241 881970 913317
63176I13317L1827L2099L2113L2165L2240L1783L0526K8976K7569K5936K3476
63165A242027K0163J6164J1199M964k163r490j6824k4249l1345l7394m2225m6183
63153A084644m9290n1090n1373n0389m8290m5024m0886l6612l2717k9181k5937
63142F23855k3140k0801j8658j6664j5040j3649j1868r447p065n606n217n295
63130D71405n155m424l176j956j354j302j093k69Q73J819K389K521K162J720K007
63115D66167L160M197M288L861L749L820L451K922L118L960M321L694K867K584
63101E16159K468J783N46o18j166p95M56J815K144J277M08N64J195J110L16k9
63085E27633N58J160Q11j77p77o28k63p8L03J391K916L977M122L868L993M598
$$ plain form
63176 913317 945144 977243 1009356 1041521 1073761 1105544 1136070 1165046 1192615 1218551 1242027
63165 1242027 1262190 1278354 1289553 1294517 1292354 1282864 1266040 1241791 1210446 1173052 1130827 1084644
63153 1084644 1035354 984264 932891 882502 834212 789188 748302 711690 678973 649792 623855
63142 623855 600715 579914 561256 544592 529552 515903 504035 494588 487523 481917 476700 471405
63130 471405 466250 461826 458650 456694 455340 454038 452945 452676 453549 455368 457757 460278 462440 464160 466167
63115 466167 469327 473524 477812 481673 485422 489242 492693 495615 498733 502693 507014 510708 513575 516159
63101 516159 518627 520410 520956 520338 519172 518377 518833 520648 522792 524069 524477 525041 526236 527346 527662 527633
63085 527633 528191 529351 530162 529985 529208 528580 528317 528239 528542 529933 532849 536826 540948 544816 548809 553407
63069E53407N295N987O959Q237R481J0610J1871J3090J3550J3120J2920J4226
63057F78753J6964J9957K2407K4513K6697K8975L1214L3425L5625L7722L9741
63046I95993M1824M3849M5366M6094M6237M6153M5943M5572M5214M5222M5702
63035A493169M6375M6871M7093M7095M6649M5180M2297L8225L3370K7577K0293
63024A934194J1511J987p665j7504k7498l6790m4311m9768n3411n5125n4511n1762
63012A549347m7658m2677l6756k9977k2787j5375p488Q20Q854J6052K2609K9016
63000A423980L5330M1199M6307N0525N3877N6525N8491N9466N9306N8701N8592
62989B002299N8829N8198N6179N3721N1706M9417M5412L9237L1363K1896J0539
$$ plain form
63069 553407 558702 564689 571648 579885 589366 599976 611847 624937 638487 651607 664527 678753
63057 678753 695717 715674 738081 762594 789291 818266 849480 882905 918530 956252 995993
63046 995993 1037817 1081666 1127032 1173126 1219363 1265516 1311459 1357031 1402245 1447467 1493169
63035 1493169 1539544 1586415 1633508 1680603 1727252 1772432 1814729 1852954 1886324 1913901 1934194
63024 1934194 1945705 1947692 1940027 1922523 1895025 1858235 1813924 1764156 1710745 1655620 1601109 1549347
63012 1549347 1501689 1459012 1422256 1392279 1369492 1354117 1346629 1347449 1356303 1372355 1394964 1423980
63000 1423980 1459310 1500509 1546816 1597341 1651218 1707743 1766234 1825700 1885006 1943707 2002299
62989 2002299 2061128 2119326 2175505 2229226 2280932 2330349 2375761 2414998 2446361 2468257 2478796
62978B478796k428j6152l0184m4472n8280p0238p9656q6965r2502r5813r6578
62967A805528r5382r2854q8745q2719p5499o8447o2149n6213n0364m5027m0703
62956A047426l7321l4471l1903k9566k7443k5529k3875k2535k1469k0561j9667
62945G53086j8748j7965j7566j7494j7266j6412j5026j3659j2688j1977j1193
62934E83092j0254r315q415p351n998m621l672l302l235l212l283l439l272k413
62920E11310j210m63m32o18o23o78j074j603j968k292k674k682j933r83r14j993
62904D89170l327l945l755l285k970k941l079l063k648k063j817j957j823q55
62890D51642O22J776K178K013J530P19l49j220j337o74J01K56j56k99M10J449
$$ plain form
62978 2478796 2476368 2460216 2430032 2385560 2327280 2257042 2177386 2090421 1997919 1902106 1805528
62967 1805528 1710146 1617292 1528547 1445828 1370329 1301882 1239733 1183520 1133156 1088129 1047426
62956 1047426 1010105 975634 943731 914165 886722 861193 837318 814783 793314 772753 753086
62945 753086 734338 716373 698807 681313 664047 647635 632609 618950 606262 594285 583092
62934 583092 572838 563523 555108 547757 541759 537138 533466 530164 526929 523717 520434 516995 513723 511310
62920 511310 510100 509637 509205 508587 507964 507286 506212 504609 502641 500349 497675 494993 493060 492077 491163 489170
62904 489170 485843 481898 478143 474858 471888 468947 465868 462805 460157 458094 456277 454320 452497 451642
62890 451642 452264 454040 456218 458231 459761 460480 460131 458911 457574 456900 457001 457257 457101 456802 457212 458661
62874D58661J689P73m82j062p87j89J91P5o35j690k380k091j025p6L9n86j321
62857D49104j583j239o06j26N7J90M58O46M95J83N6j7m83j230j410n05P90J225
62839D46005L72j008j934k105j851j552j389j413j582j686j490r88m07O2L97N64
62823D29995M17mk28K51J274K056K131J908K013K342K263J691J385J964L093L980
62807D56531M417M832N454N893N737N184M835M971N359N730O204P040Q151R121
62793E39459R744J0271J1029J2001J3060J4378J6264J8582K0791K2707K4879K7955
62781G41120L1968L6531M1413M6559N1659N6242O0253O4102O7972P1352P3445
62770A342616P3833P2513O9476O4493N7393M8328L7753K6105J3611M30j2961k5743
$$ plain form
62874 458661 460350 461123 460641 459579 458792 458603 458794 458869 458234 456544 454164 452073 451048 450972 451011 450425 449104
62857 449104 447521 446282 445676 445550 445607 445797 446255 446901 447396 447579 447635 447618 447135 445905 444495 443990 444780 446005
62839 446005 446377 445369 443435 441330 439479 437927 436538 435125 433543 431857 430367 429379 428972 429034 429431 429995
62823 429995 430412 430408 430180 430431 431705 433761 435892 437800 439813 442155 444418 446109 447494 449458 452551 456531
62807 456531 460948 465780 471234 477127 482864 488048 492883 497854 503213 508943 515147 522187 530338 539459
62793 539459 549203 559474 570503 582504 595564 609942 626206 644788 665579 688286 713165 741120
62781 741120 773088 809619 851032 897591 949250 1005492 1065745 1129847 1197819 1269171 1342616
62770 1342616 1416449 1488962 1558438 1622931 1680324 1728652 1766405 1792510 1806121 1806551 1793590 1767847
62758A767847l7249m7311n5880o2474o6531o8217o8484o8131o7226o5621o3468
62747A097255o0885n7587n3415m8901m4726m0834l6684l2244k8136k4732k1806
62736F47305j9113j6796j4939j3292j1645j0022q346o416m450l080k488k045j174
62723E33499p0Q35J590K401L106L648M587O359Q387R816J0881J2577J5066J7450
62709F30132J9297K1386K4556K8633L2944L7183M1269M5044M8727N3230N9309
62698A041710O6689P4408Q1720Q8234R3715R8326J02766J07291J10804J11554
62688A977217J08791J03080R5034Q4422P0801N4442L6192J6717l723k4734m5364
62677B472875o4284q0400r3227j02749j09006j12078j12370j10565j07148j02269
$$ plain form
62758 1767847 1730598 1683287 1627407 1564933 1498402 1430185 1361701 1293570 1226344 1160723 1097255
62747 1097255 1036370 978783 925368 876467 831741 790907 754223 721979 693843 669111 647305
62736 647305 628192 611396 596457 583165 571520 561498 553152 546736 542286 539206 536718 534673 533499
62723 533499 533429 534264 535854 538255 541361 545009 549596 555955 564342 574158 585039 597616 612682 630132
62709 630132 649429 670815 695371 724004 756948 794131 835400 880444 929171 982401 1041710
62698 1041710 1108399 1182807 1264527 1352761 1446476 1544802 1647568 1754859 1865663 1977217
62688 1977217 2086008 2189088 2284122 2368544 2439345 2493787 2529979 2546696 2542973 2518239 2472875
62677 2472875 2408591 2328191 2234964 2132215 2023209 1911131 1798761 1688196 1581048 1478779
62667A478779r6205q9654q3246p7098p1088o5248n9548n3655m7464m1584l6783
62656G57206l3086l0001k7399k5464k3878k1872j9246j6604j4403j2493j0864
62645E21896j0034j0170j0475j0072r100q236p528o512n239m328l916l342k197
62632D30747j066p51j170j506j311q99p51r54j334j814k299k511k299j972k010
62617D08100k360k370j549j51J159J991K397K630L008L824M973N812N839N504
62603D38807N934P641R904J1540J2175J2511J3527J5530J7973K0085K1739K3538
62591F10904K6013K8859L1298L3031L4338L5250L5113L3327L0097K6137K1774
62580I46141J6685J0467L272m134j0864j6532k1459k6128l0393l3425l4529l3847
$$ plain form
62667 1478779 1382574 1292920 1209674 1132576 1061488 996240 936692 883037 835573 793989 757206
62656 757206 724120 694119 666720 641256 617378 595506 576260 559656 545253 532760 521896
62645 521896 511862 501692 491217 481145 472045 463809 456281 449769 444530 440202 436286 432944 430747
62632 430747 429681 428930 427760 426254 424943 424044 423293 422339 421005 419191 416892 414381 412082 410110 408100
62617 408100 405740 403370 401821 401670 402829 404820 407217 409847 412855 416679 421652 427464 433303 438807
62603 438807 444741 452382 462286 473826 486001 498512 512039 527569 545542 565627 587366 610904
62591 610904 636917 665776 697074 730105 764443 799693 834806 868133 898230 924367 946141
62580 946141 962826 973293 976565 972431 961567 945035 923576 897448 867055 833630 799101 765254
62568G65254l2204l0416k8836k7353k5649k3612k1534j9806j8385j6848j5034
62557E05577j3260j1725j0103q096o100m847m465m299l713k727j754j057o46n49
62543D32236q60j425j652r22P52K561L589L574K944K283J941K027K456K988L483
62528D55975M111N049O111P022P949R333J1236J3356J5714J8648K2005K5047K7547
62515F29103L0317L4144L8696M3116M7219N1350N5376N8600O0688O1893O2305
62504A172807O1407N8593N3707M6908L8445K8679J8062O954m307j5036k4302l1543
62492A410374l6887m0678m2898m3218m1569l8391l4297k9498k3769j7133j0299
62481A051737m140J298O717J2389J7598K1614K4666K7356K9463K9991K8249K4291
$$ plain form
62568 765254 733050 702634 673798 646445 620796 597184 575650 555844 537459 520611 505577
62557 505577 492317 480592 470489 462393 456293 451446 446981 442682 438969 436242 434488 433431 432785 432236
62543 432236 431376 429951 428299 427377 428129 430690 434279 437853 440797 443080 445021 447048 449504 452492 455975
62528 455975 460086 465135 471246 478268 486217 495550 506786 520142 535856 554504 576509 601556 629103
62515 629103 659420 693564 732260 775376 822595 873945 929321 987921 1048609 1110502 1172807
62504 1172807 1234214 1292807 1346514 1393422 1431867 1460546 1478608 1485562 1481255 1466219 1441917 1410374
62492 1410374 1373487 1332809 1289911 1246693 1205124 1166733 1132436 1102938 1079169 1062036 1051737
62481 1051737 1047597 1048895 1055612 1068001 1085599 1107213 1131879 1159235 1188698 1218689 1246938 1271229
62469A271229J8470J1293L735l164r286j5532k2682l0547l8360m5402n0957n4242
62457A034555n4979n3874n2049n0110m7919m5053m1180l6247l0711k5465k1256
62446E75712j8100j5491j3047j0672q252n603k848n03J047K023K911L858M621
62433E15656N120N616O169O289N470L907K261P45j060l400n868p923r464j0556
62419E12962j0996j0681j0079r799r741r254q107o854o096n786n472m970m463
62406D10664m109l709k927j801r28r25j692k438k554k194j879j796j707j323n39
62391C80143N07J393J743J683J702J920K002J948K226K794K818K060J678K720
62377D07337M448N356N396N769O819P578P560P541Q101Q699Q835R013R879J1224
$$ plain form
62469 1271229 1289699 1300992 1304727 1301563 1292277 1276745 1254063 1223516 1185156 1139754 1088797 1034555
62457 1034555 979576 925702 873653 823543 775624 730571 689391 653144 622433 596968 575712
62446 575712 557612 542121 529074 518402 510150 504547 501699 501196 502243 504266 507177 511035 515656
62433 515656 520776 526392 532561 538850 544320 548227 550488 551233 550173 546773 540905 532982 523518 512962
62419 512962 501966 491285 481206 471407 461666 452412 444305 437451 431355 425569 420097 415127 410664
62406 410664 406555 402846 399919 398118 397190 396265 394573 392135 389581 387387 385508 383712 382005 380682 380143
62391 380143 380650 382043 383786 385469 387171 389091 391093 393041 395267 398061 400879 402939 404617 407337
62377 407337 411785 417141 422537 428306 435125 442703 450263 457804 465905 474604 483439 492452 502331 513555
62363E13555J2569J3966J5624J7424J9471K2307K5933K9399L2213L5316L9705
62352G77482M4670M8607N1184N3456N5782N6843N5077N0338M3719L6240K8218
62341A301616J9623J0754K416m666j0546j5949k1370k6607l1316l5517l9170m1680
62329A107588m2412m1443l9392l6732l3658l0381k7080k3720k0430j7749j6103
62318G78488j5265j4883j5197j6574j8485j9764j9952j9711j9757j9919j9549
62307E79432j8415j6877j5365j3928j2283j0242q118o571n885n626n215m619m166
62294D52122l854l253k089n90O94J307J177P64P77J536K668L514L632K961J847
62279D63213J112J526K912M184M619M598M722M837M558M125M006M085M043M207
$$ plain form
62363 513555 526124 540090 555714 573138 592609 614916 640849 670248 702461 737777 777482
62352 777482 822152 870759 921943 975399 1031181 1088024 1143101 1193439 1237158 1273398 1301616
62341 1301616 1321239 1331993 1334409 1329743 1319197 1303248 1281878 1255271 1223955 1188438 1149268 1107588
62329 1107588 1065176 1023733 984341 947609 913951 883570 856490 832770 812340 794591 778488
62318 778488 763223 748340 733143 716569 698084 678320 658368 638657 618900 598981 579432
62307 579432 561017 544140 528775 514847 502564 492322 484204 477633 471748 466122 460907 456288 452122
62294 452122 448268 445015 442926 442336 443030 444337 445514 446278 447055 448591 451259 454773 458405 461366 463213
62279 463213 464325 465851 468763 472947 477566 482164 486886 491723 496281 500406 504412 508497 512540 516747
62265E16747N135O624Q085R678J2082J5177J8034K0323K2793K6104L0022L4112
62253G24916L8410M2973M7481N1667N5600N9101O1290O1168N8354N3087M5920
62242A299967L7576K8732J9680J0478J495o706j4122k1421k9112l6984m4465n1005
62230A194113n5974n8731n9166n7846n5411n2162m8289m4019l9457l4691l0110
62219F58257k6151k2703j9370j6338j4236j3040j1865j0183q436p145o127n028
62207D97635l969l115k277j354o54k87K52J385K859M277N652O984P909Q353Q900
62192E32550R928J0969J1584J2146J3015J3605J3247J2401J1948J1741J1014R915
62180F74063R276Q991P912N662L289J716N83p83k160k891k901k546j746M2L142
$$ plain form
62265 516747 521882 528506 536591 546269 558351 573528 591562 611885 634678 660782 690804 724916
62253 724916 763326 806299 853780 905447 961047 1020148 1081438 1142606 1200960 1254047 1299967
62242 1299967 1337543 1366275 1385955 1396433 1397928 1391222 1377100 1355679 1326567 1289583 1245118 1194113
62230 1194113 1138139 1079408 1020242 962396 906985 854823 806534 762515 723058 688367 658257
62219 658257 632106 609403 590033 573695 559459 546419 534554 524371 515935 508790 502663 497635
62207 497635 493666 490551 488274 486920 486266 485979 486231 487616 490475 494752 500404 507388 515297 523650 532550
62192 532550 542478 553447 565031 577177 590192 603797 617044 629445 641393 653134 664148 674063
62180 674063 683339 692330 700242 705904 709193 710909 711492 710709 708549 705658 702757 700211 698465 698507 701649
62165G01649P357J2174J7002K1399K5364K9226L3127L6770L9764M1837M2522M1074
62153A049265L7085L1037K3921J6526R319K674l210q517j3507j8071k1975k5504
62141A079043k9301l3324l6374l7176l5754l3332l0862k8117k4400j9782j5209
62130G55412j1526q760o416m186k202p59J01O61J179J502J363J108J641L333N334
62115G37785O511O710O402N384K911p66m025n531n503m876m013k896k037k194
62101G33862l484n383p448r383j0582j0326q478n609k474L34K439L848M944N995
62087F88255O855P369P714Q028Q098P954Q318R836J2172J4481J6449J8227J9661
62074H33417K0458K0892K1534K2375K2905K2968K2718K1915K0189J8070J6744
$$ plain form
62165 701649 709006 721180 738182 759581 784945 814171 847298 884068 923832 965669 1008191 1049265
62153 1049265 1086350 1117387 1141308 1157834 1167153 1169827 1166617 1158100 1144593 1126522 1104547 1079043
62141 1079043 1049742 1016418 980044 942868 907114 873782 842920 814803 790403 770621 755412
62130 755412 743886 735126 728710 724524 722322 721563 721664 722325 723504 725006 726369 727477 729118 732451 737785
62115 737785 744296 751006 757408 762792 765703 764937 760912 755381 749878 745002 740989 738093 736056 733862
62101 733862 730378 724995 717547 708164 697582 687256 678778 673169 670695 671029 673468 677316 682260 688255
62087 688255 695110 702479 710193 718221 726319 734273 742591 752427 764599 779080 795529 813756 833417
62074 833417 853875 874767 896301 918676 941581 964549 987267 1009182 1029371 1047441 1064185
62063A064185J6637J7077J7552J8442K0180K2588K5334K8221L0532L0984K8980
62052A320712K5410K1560J7689J3256Q060K515l029q591j4295k0215k6436l2948
62040A303688l9432m5288m9798n2378n2960n2155n0655m8606m5867m2775l9914
62029G83860l7140l3702k9547k5729k3023k0888j8349j5323j2534j0530r417r118
62017E38560r336r513r301q912q654q468q211p943p572o766n575m674m349l843
62003D35443k366l08J276K088K697L501M320M893N107M845M196L647L478L201
61989D76018K228Q90M0k11n83j534k842m266n785p130p811p769p405o901o145
61974D20794n310m776m375l551k398j674j536j221l31M25M21K13O50J471J712
$$ plain form
62063 1064185 1080822 1097899 1115451 1133893 1154073 1176661 1201995 1230216 1260748 1291732 1320712
62052 1320712 1346122 1367682 1385371 1398627 1406687 1409202 1406173 1397582 1383287 1363072 1336636 1303688
62040 1303688 1264256 1218968 1169170 1116792 1063832 1011677 961022 912416 866549 823774 783860
62029 783860 746720 713018 683471 657742 634719 613831 595482 580159 567625 557095 547678 538560
62017 538560 529224 519711 510410 501498 492844 484376 476165 468222 460650 453884 448309 443635 439286 435443
62003 435443 433077 432769 434045 436133 438830 442331 446651 451544 456651 461496 465692 469339 472817 476018
61989 476018 478246 479136 479176 478965 478382 476848 474006 469740 463955 456825 449014 441245 433840 426939 420794
61974 420794 415484 410708 406333 402782 400384 398710 397174 395953 395622 396047 396468 396681 397331 398802 400514
61959D00514J196P34Q90J331J486J274R87Q44R24J278J869K455K710K544K373
61944D23409K848M128N583O539P213Q383J0212J1972J3091J3823J4523J4908J4599
61931E51231J3941J3620J3664J3480J2776J1941J1386J0985J0246Q814O756M529
61919F83369K584Q70j100l454n477o339o080n473m954m179k728o78J622M002O381
61904F58366Q542J0260J1552J2553J3166J3011J1787R584O786L682L20l253o684
61891G49672r541j1704j3306j4272j4358j3749j3142j2922j2638j1768j0632j0017
61879F01623j0034j0019r544q966q785r002r399r913j0447j0568r809q157o039
61866D80941l996k494j822j768j562m71J425L264M332M806N492O878Q663J0309
$$ plain form
61959 400514 401710 402444 403334 404665 406151 407425 408412 409256 410180 411458 413327 415782 418492 421036 423409
61944 423409 426257 430385 435968 442507 449720 458103 468315 480287 493378 507201 521724 536632 551231
61931 551231 565172 578792 592456 605936 618712 630653 642039 653024 663270 672084 678840 683369
61919 683369 685953 686823 685723 682269 676792 670453 664373 658900 653946 649767 647039 646361 647983 651985 658366
61904 658366 666908 677168 688720 701273 714439 727450 739237 748821 755607 759289 759609 756356 749672
61891 749672 740131 728427 715121 700849 686491 672742 659600 646678 634040 622272 611640 601623
61879 601623 591589 581570 572026 563060 554275 545273 535874 525961 515514 504946 495137 486980 480941
61866 480941 476945 474451 472629 470861 469299 468828 470253 473517 477849 482655 488147 495025 503688 513997
61852E13997J1837J3710J6013J8203J9961K1763K4117K6511K7845K7794K7106
61841G48857K6404K5419K3601K0890J7484J3400Q805M351N81k714n977q945j0813
61828H61343j1148j0111p885m640j030K043M469P053J0223J3106J4435J3951J2405
61815I04214J0309P342L019k469q302j3655j8118k1729k4788k7559k9865l1014
61803G47385l0323k7873k4631k1650j9192j6924j4820j3396j2835j2402j1281
61792E42058r677q475p917p382o559o005o144o370n800m522l395k857k594k312
61778D62049k125k070j858j344q11n50n30o94j163j865k274j936j092m38l43n33
61762D42423m90J01J142K152K558K248J826K008K813L613L956L976L935L735L133
$$ plain form
61852 513997 525834 539544 555557 573760 593721 615484 639601 666112 693957 721751 748857
61841 748857 775261 800680 824281 845171 862655 876055 884860 889211 889792 887078 881101 872156 861343
61828 861343 850195 840084 832199 827559 826529 828572 833041 840094 850317 863423 877858 891809 904214
61815 904214 914523 921865 924884 922415 914113 900458 882340 860611 835823 808264 778399 747385
61803 747385 717062 689189 664558 642908 623716 606792 591972 578576 565741 553339 542058
61792 542058 532381 523906 515989 508607 502048 496043 489899 483529 477729 473207 469812 466955 464361 462049
61778 462049 459924 457854 455996 454652 453841 453291 452761 452067 450904 449039 446765 444829 443737 443299 442956 442423
61762 442423 441933 442034 443176 445328 447886 450134 451960 453968 456781 460394 464350 468326 472261 475996 479129
61747D79129K194J151Pj354k661l321l185k870l006l407l384k788k180j939j750
61732D50636j269p60n69l68M03J459J881J479J159J619K340K410J852J463J601
61717D65336J791J510P71J3j89N81K029K996K470Q05o83j303j539j839j872j387
61701D69490j068j685k922l770l864l664l534l334k977k622k315j962j749j996
61687D32028k507k630k196j805j959k396k580k442k231k008j702j431j383j453
61673D03305j331r01l78q7k43p63j264j411j327j379j547j424r66p29j057j464
61657C87034j260m19N63J282J506J022K9o49l99L87R08J047J187J202O69k3J82
61640C94268J509K908L432L267L003K659K001J180M27l77j220j601j306j073j693
$$ plain form
61747 479129 481323 482474 482481 481127 478466 475145 471960 469090 466084 462677 459293 456505 454325 452386 450636
61732 450636 449367 448607 448038 447670 448073 449532 451413 452892 454051 455670 458010 460420 462272 463735 465336
61717 465336 467127 468637 469408 469421 469232 469813 471842 474838 477308 478113 477430 476127 474588 472749 470877 469490
61701 469490 468422 466737 463815 460045 456181 452517 448983 445649 442672 440050 437735 435773 434024 432028
61687 432028 429521 426891 424695 422890 420931 418535 415955 413513 411282 409274 407572 406141 404758 403305
61673 403305 401974 401073 400695 400608 400365 399602 398338 396927 395600 394221 392674 391250 390284 389555 388498 387034
61657 387034 385774 385355 385918 387200 388706 389728 389757 389108 388709 389096 390004 391051 392238 393440 394109 394086 394268
61640 394268 395777 398685 402117 405384 408387 411046 413047 414227 414654 414277 413057 411456 410150 409077 407384
61625D07384k758l093k340j360j083j587k356k870k827k287j704j456j376j138
61611C79149r67j388k246k696k392k065k560l726m685m940m752m611m622m449
61597C33050l713k509j522j451k224l048l326l233l241l390l328k867k218j681
61583B95299j444j511j751j928j891j664j330r35o08n80r11j261j217p65l17k05
61567B76981l49m43l06K5L62M90K55k70p05o47j24L21J74m20p50l18O08J345J534
61548B77763J382J287J415J634J676J356P53J67j72k68j37L15J025J514J331O91
61532B91732L49P15J424J850J731J154K89n81j028q49m12l27o64q51m13L05M69
61515B94893k60j340k001k026j635q94K44J362J662R83J92J53O51Q61N69K95L20
$$ plain form
61625 407384 404626 401533 399193 397833 396750 395163 392807 389937 387110 384823 383119 381663 380287 379149
61611 379149 378182 376794 374548 371852 369460 367395 364835 361109 356424 351484 346732 342121 337499 333050
61597 333050 329337 326828 325306 323855 321631 318583 315257 312024 308783 305393 302065 299198 296980 295299
61583 295299 293855 292344 290593 288665 286774 285110 283780 282845 282237 281657 280746 279485 278268 277503 277186 276981
61567 276981 276632 276189 275883 275908 276270 276760 277015 276745 276040 275393 275269 275590 275764 275344 274594 274276 274884 276229 277763
61548 277763 279145 280432 281847 283481 285157 286513 287266 287433 287261 286993 286856 287171 288196 289710 291041 291732
61532 291732 292081 292796 294220 296070 297801 298955 299244 298663 297635 296786 296374 296047 295383 294532 294119 294424 294893
61515 294893 294633 293293 291292 289266 287631 286737 286981 288343 290005 290988 291180 291333 291984 292845 293414 293709 294029
61498B94029K99j39q94j609j968j711q79o6Q3k80l74O2L94R0n27q45p70n65l55
61479B83975k07k66m25k26M94J233J533J627J920K234K147J768J526J409J041
61464B99783M25k4j53j77j96j22lR9M96J434K295K021N33r55j392r91m88J9Q18
61445C03422J585J526N67k92j38Q03J534J593J504J895K478K342J267L11O27J981
61429C23005K956K731K043K023K565K527J442K13j17K83M80J90K6M20R80J228
61413C42995J373J836K433K548J968J015Lq73j293j043n69n80j057j309j168j263
61397C45016j804j965j106P3M68J43N4M85O77O4r48j603j600j096l53L94R52J215
61379C39066J061M06m12o09K39J569K486K800K930K946K548J873J575J844K013
$$ plain form
61498 294029 294328 294189 293295 291686 289718 288007 287128 287062 287145 286865 286491 286553 286947 287037 286510 285665 284895 284330 283975
61479 283975 283768 283502 283077 282851 283345 284578 286111 287738 289658 291892 294039 295807 297333 298742 299783
61464 299783 300208 300184 300031 299854 299658 299536 299533 299632 300128 301562 303857 305878 306411 305456 304064 303073 302585 302604 303422
61445 303422 305007 306533 307100 306808 306670 307473 309007 310600 312104 313999 316477 318819 320086 320397 321024 323005
61429 323005 325961 328692 330735 332758 335323 337850 339292 339505 339388 339671 340151 340341 340367 340787 341767 342995
61413 342995 344368 346204 348637 351185 353153 354168 354171 353298 352005 350962 350393 349813 348756 347447 346279 345016
61397 345016 343212 341247 340141 340214 340682 340825 340879 341364 342041 342105 341157 339554 337954 336858 336505 336899 337851 339066
61379 339066 340127 340533 340121 339512 339751 341320 343806 346606 349536 352482 355030 356903 358478 360322 362335
61364C62335J451L66n38q17n31r3L7j69q5Q77K360L376L584L671M247N022N406
61347C90499N419N521N868O191O233N984N545M993M361L697L235L331L990M636
61333D59503M757M556M453M142K969J171j00k66m4l07r61j440j629j734j713j421
61317D71936r56m35K23R78J599K226L440N301O861P325P209P688R064J0634J1783
61302E44876J2565J3197J3657J3755J3272J2085J0368Q470O311L373k55l373m903
61289F43398n271n825p120q536r428r799r789r360q725q420q644q924q643p608
61275E27306o033m316k897j980j321o00P0L67L76N43R83J323J264R89R22J409
61259E18405K561M090N372O066O518P166P702P411O187M696L541K891K823L310
$$ plain form
61364 362335 363786 364152 363614 362797 362266 362173 362210 362041 361956 362833 365193 368569 372153 375824 380071 385093 390499
61347 390499 395918 401439 407307 413498 419731 425715 431260 436253 440614 444311 447546 450877 454867 459503
61333 459503 464260 468816 473269 477411 480380 481551 481451 481185 481141 480834 479873 478433 476804 475070 473357 471936
61317 471936 470980 470545 470768 471746 473345 475571 479011 484312 491173 498498 505707 513395 522459 533093 544876
61302 544876 557441 570638 584295 598050 611322 623407 633775 642245 648556 651929 651674 648301 643398
61289 643398 638127 632302 625182 616646 607218 597419 587630 578270 569545 561125 552481 543557 534914 527306
61275 527306 521273 516957 514060 512080 510759 510159 510229 510596 510972 511515 512498 513821 515085 516074 516996 518405
61259 518405 520966 525056 530428 536494 543012 550178 557880 565291 571478 576174 579715 582606 585429 588739
61245E88739L827L690K934K205J666P68o06j617j579r37o01p32q63q05q23j024
61229E94242j081o29L56J548K509L092L684M779O227P269P510P434P712Q375Q975
61214F62002R172Q864Q030O965O297O330O519O088M981L755K726J783J052J091
61200G35655K133L513M295M300M293N054O512P943Q936R889J1353J3081J4148
61187H31105J3922J2591J0618Q264N851L951K846K151J441R11Q59P66k51k109
61173H92916l593l918l728m118n163o071o476o785p292p739p976q476r676j1236
61159H00669j2461j3217j3852j4406j4491j4025j3428j2944j2308j1320j0208
61148F58009r109p691n772l830k434j567j077j383k955n304p242q107q112p616
$$ plain form
61245 588739 592566 596256 599190 601395 603061 603829 603223 601606 600027 599090 598489 597757 596894 596089 595266 594242
61229 594242 593161 592532 592888 594436 596945 600037 603721 608500 614727 621996 629506 636940 644652 653027 662002
61214 662002 671174 680038 688068 695033 701330 707660 714179 720267 725248 729003 731729 733512 734564 735655
61200 735655 737788 741301 745596 749896 754189 759243 765755 773698 782634 792523 803876 816957 831105
61187 831105 845027 857618 868236 876500 882351 886302 889148 891299 892740 893651 894510 895276 895025 892916
61173 892916 889323 885405 881677 877559 872396 866325 859849 853064 845772 838033 830057 821581 811905 800669
61159 800669 788208 774991 761139 746733 732242 718217 704789 691845 679537 668217 658009
61148 658009 648900 641209 635437 631607 629173 627606 626529 625146 622191 616887 609645 601538 593426 585810
61134E85810o743n691m700l628k212p96j8K91J123K944N148P098Q912J0781J2308
61119F10627J3156J3757J4765J6276J8142K0496K3359K6110K8025K9023K9380
61108H43116K9181K8633K8414K8907K9401K8834K7110K4938K2665K0071J7193
61097A128463J4433J1726Q444M293k84m731q817j2341j5134j7544k0251k3297
61085A064960k5763k6798k6603k6104k5942k6079k6109k5723k4985k4210k3498
61074G83146k2438k0616j8326j6301j4750j3154j1120q981p340o374n816n263
61062F32667m333k845j064M40J324J700J870K164K952M356N864O751P024P479
61048F66349Q653J0207J1599J2801J4075J5474J6986J8751K0815K2944K4988K7056
$$ plain form
61134 585810 579067 573376 568676 565048 562836 562040 562022 562313 563436 566380 571528 578626 587538 598319 610627
61119 610627 623783 637540 652305 668581 686723 707219 730578 756688 784713 813736 843116
61108 843116 872297 900930 929344 958251 987652 1016486 1043596 1068534 1091199 1111270 1128463
61097 1128463 1142896 1154622 1163066 1167359 1167075 1162344 1153527 1141186 1126052 1108508 1088257 1064960
61085 1064960 1039197 1012399 985796 959692 933750 907671 881562 855839 830854 806644 783146
61074 783146 760708 740092 721766 705465 690715 677561 666441 657460 650120 643746 637930 632667
61062 632667 628334 625489 624425 624865 626189 627889 629759 631923 634875 639231 645095 651846 658870 666349
61048 666349 675002 685209 696808 709609 723684 739158 756144 774895 795710 818654 843642 870698
61036H70698K9046L0589L1844L3695L6533L9349M0954M1715M3179M6018M9254
61025A292874N1670N3066N3878N4362N4705N5488N7485O1195O6846P4521Q3928
61014A960018R4379J05452J17674J32287J50611J74061K04803K45886L00332L69832
61004C855335M54026N51030O59086P78515R12508J066309J245659J454823J690947
60995A2668238J931431K119659K167054J987718J556013R46424L15526j70617
60987B3521446m12574m06084k20550L4619K30487K41000j1338n05270j114861
60978B1356875j668651k034947k171370k113957j932360j691759j438173j199250
60970G106408r88770q10883o64095n44400m47105l68011l04162k53578k14188
$$ plain form
61036 870698 899744 930333 962177 995872 1032405 1071754 1112708 1154423 1197602 1243620 1292874
61025 1292874 1344544 1397610 1451488 1505850 1560555 1616043 1673528 1734723 1801569 1876090 1960018
61014 1960018 2054397 2159849 2277523 2409810 2560421 2734482 2939285 3185171 3485503 3855335
61004 3855335 4309361 4860391 5519477 6297992 7210500 8276809 9522468 10977291 12668238
60995 12668238 14599669 16719328 18886382 20874100 22430113 23376537 23692063 23521446
60987 23521446 23108872 22702788 22482238 22516857 22747344 22988344 22977006 22471736 21356875
60978 21356875 19688224 17653277 15481907 13367950 11435590 9743831 8305658 7106408
60970 7106408 6117638 5306755 4642660 4098260 3651155 3283144 2978982 2725404 2511216
60961B511216j83439j59014j39491j23950j11249j00107q9739q0088p1299o3168
60951A389672n5257m7439m0259l4610l1062k9358k8550k7652k6283k4781k3574
60940A020847k2424k0555j7712j4890j3443j3487j3759j3192j2071j1263j0888
60929H57163j0388r579q820q202p384o335n617n552n672n326m459l370k152p82
60915G73525M67J205J463J594J752J850K009K590L677M869N782O408O829O934
60901H20954O686O456O637P071P240O996O697O478N951M894L850L498L558K979
60887H99945J242j017k948m457n930p351q272q523q431q385q522q827r234r577
60873H09713r786j0055j0518j0809j0360r214q092p559p463p386p227p103o991
$$ plain form
60961 2511216 2327777 2168763 2029272 1905322 1794073 1693966 1604227 1524139 1452840 1389672
60951 1389672 1334415 1286976 1246717 1212107 1181045 1151687 1123137 1095485 1069202 1044421 1020847
60940 1020847 998423 977868 960156 945266 931823 918336 904577 891385 879314 868051 857163
60929 857163 846775 837196 828376 820174 812790 806455 800838 795286 789614 784288 779829 776459 774307 773525
60915 773525 773992 775197 776660 778254 780006 781856 783865 786455 790132 795001 800783 807191 814020 820954
60901 820954 827640 834096 840733 847804 855044 862040 868737 875215 881166 886060 889910 893408 896966 899945
60887 899945 901187 900170 897222 892765 886835 879484 871212 862689 854258 845873 837351 828524 819290 809713
60873 809713 799927 789872 779354 768545 758185 748971 740879 733320 725857 718471 711244 704141 697150
60860F97150o746o280n547m577l712l454l893m527m974n520o495p410p356o232
60846F20427n023m684n198n960o634p235p613p422o739o282o724p902q974r359
60832E24678r236r049q836q359p669p066o548n776m669l610k893k361j901j850
60818D44855k431l083k986k106j199p98p40p94j097j696k120j877j127m39m8K31
60802D22545M78N23L67L22M97N25J19l97m45OM48O00P13R17Q17J43o00p33m35
60783D26410n38j311k138k503k664k988l318l444l618m002m027l132j847j265
60769C89615j498j554q50mK33Q3K01O12Q16O87N80O64O88M42nn42j163j750j999
60750C85256j736j127m62J17O35J082J407J678K101K725L148K741J364l67j736
$$ plain form
60860 697150 690404 684124 678577 674000 670288 666834 662941 658414 653440 647920 641425 634015 626659 620427
60846 620427 615404 610720 605522 599562 592928 585693 578080 570658 563919 557637 550913 543011 534037 524678
60832 524678 515442 506393 497557 489198 481529 474463 467915 462139 457470 453860 450967 448606 446705 444855
60818 444855 442424 439341 436355 434249 433050 432252 431512 430718 429621 427925 425805 423928 422801 422362 422314 422545
60802 422545 423023 423546 423913 424235 424732 425257 425376 424979 424534 424540 424988 425588 426301 427218 428035 428178 427578 426845 426410
60783 426410 425872 424561 422423 419920 417256 414268 410950 407506 403888 399886 395859 392727 390880 389615
60769 389615 388117 386563 385713 385709 385942 386025 386226 386838 387654 388341 388921 389585 390273 390715 390710 390168 389005 387255 385256
60750 385256 383520 382393 381931 382048 382683 383765 385172 386850 388951 391676 394824 397565 398929 398562 396826
60735C96826k692l587m254m077l129k557l217m343m343k822j141q16j889l104
60721C54855l336k532j530j198j651k200k136j583j315j695k209k161j565r89
60707C28755q24j010j311j494j285n60L71R80J037O96J01p10j399j332l52P09
60691C22372Q29R6l04M29J660K117J456N89N06J204J964K298K310K390K797L481
60675C46194M066M098L509K798K493K568K637K641K887L398L665L238K230J019
60661C87441k09j345k014j831r40j5L99L71M33R75J806K285K051J508J336J551
60645C93802J471P29j91p41j108j706k353k582k512k618k820k613k096k047k801
60630C69814l757m219m087l474k430j336q94j189j380q68j66l2k66j37M65R89
$$ plain form
60735 396826 394134 390547 386293 382216 379087 376530 373313 368970 364627 361805 360664 359848 357959 354855
60721 354855 351519 348987 347457 346259 344608 342408 340272 338689 337374 335679 333470 331309 329744 328755
60707 328755 327931 326921 325610 324116 322831 322271 322642 323622 324659 325355 325456 324746 323347 322015 321663 322372
60691 322372 323201 323297 322993 323422 325082 327199 328655 329244 329750 330954 332918 335216 337526 339916 342713 346194
60675 346194 350260 354358 357867 360665 363158 365726 368363 371004 373891 377289 380954 384192 386422 387441
60661 387441 387232 385887 383873 382042 381102 381087 381486 381857 382290 383265 385071 387356 389407 390915 392251 393802
60645 393802 395273 396002 395811 395070 393962 392256 389903 387321 384809 382191 379371 376758 374662 372615 369814
60630 369814 366057 361838 357751 354277 351847 350511 349617 348428 347048 346180 346014 345982 345716 345579 346044 347033
60614C47033J121R53N64O3j60P3K80j0m05k92K4j89o49l04Q99J741J575J276J745
60595C55338K511K625K137J785J762J710J525J392J257R90P94P68M33o45j957
60580C72425k544k222j519o24O20J740J753O45j37P52L021N290O665P268P606
60565D00739Q049Q809R934J1159J1985J1931J0716Q398N485K689L68j683l776
60552D84803n822p460q392q388p237n049k469k10J598L264M816N881O372O885
60538D68592Q014R536J0658J1011J1010J1129J1182J0602R189P208M786J763j658
60525E73022m505n802n623n016m841n052n141m883m400l808l212k795k559k099
60511E13286j037L06J141J219J176J628K377K944L611N290Q335J2038J5488J8516
$$ plain form
60614 347033 348154 349107 349671 349734 349574 349647 349927 349917 349512 349220 349244 349055 348406 348102 349001 350742 352317 353593 355338
60595 355338 357849 360474 362611 364396 366158 367868 369393 370785 372042 373032 373826 374594 375027 374382 372425
60580 372425 369881 367659 366140 365516 366136 367876 369629 370274 370137 370889 373910 379200 385865 393133 400739
60565 400739 408788 417597 427531 438690 450675 462606 473322 481720 487205 489894 490262 488579 484803
60552 484803 478981 471521 463129 454741 447504 442455 439986 439776 441374 444638 449454 455335 461707 468592
60538 468592 476606 486142 496800 507811 518821 529950 541132 551734 560923 568131 572917 574680 573022
60525 573022 568517 562715 557092 552076 547235 542183 537042 532159 527759 523951 520739 517944 515385 513286
60511 513286 512249 512555 513696 514915 516091 517719 520096 523040 526651 531941 540276 552314 567802 586318
60497E86318K1549K4884K8517L2392L6364L9966M2576M3829M3572M1512L7221
60486I78700L0584K1944J1841Q68j0201k0558k9697l7398m3304m6927m8174m7511
60474G60167m5404m1992l7517l2725k8432k4907k1939j9284j6775j4267j1892
60463D65033j0144r294q819p872o243m544l495l314l749m313m509m242l924l895
60449C86676l807l072j879j166j413k006k095j621j153j007r97q46n24k29k89
60434C64572r71k104k974k963k182j243n19L0L21N7o14q78j90P98R42J74l02L62
60416C52316J492J906J520J163J155R98N75N24J081J428R04J91L93J384K042J893
60400C70965J530J463J487J390J415J675J817J643J517J693J786J412R05Q74J351
$$ plain form
60497 586318 607867 632751 661268 693660 730024 769990 812566 856395 899967 941479 978700
60486 978700 1009284 1031228 1043069 1043937 1033736 1013178 983481 946083 902779 855852 807678 760167
60474 760167 714763 672771 635254 602529 574097 549190 527251 507967 491192 476925 465033
60463 465033 454889 445595 436776 428904 422661 418117 414622 411308 407559 403246 398737 394495 390571 386676
60449 386676 382869 379797 377918 376752 375339 373333 371238 369617 368464 367457 366460 365614 365090 364861 364572
60434 364572 363601 361497 358523 355560 353378 352135 351616 351646 351967 352024 351410 350532 350342 351140 352082 352256 351954 352316
60416 352316 353808 355714 357234 358397 359552 360550 361125 361649 362730 364158 365062 365253 365646 367030 369072 370965
60400 370965 372495 373958 375445 376835 378250 379925 381742 383385 384902 386595 388381 389793 390698 391572 392923
60385C92923J899K286K535K536K117J526J304J643K177K503K535K406K229K090
60371D22709K003J871J583J236J039J050J149J279J454J549J334Q22L97M58R78
60356D40911J593K018K238K317K278K300K809M035N491O285O155N874O284P138
60342D97726P310O120L979J754r1j599l001m542o328p978q707q065o571n268m710
60327D60029m554m158l396k721k596k933l235l151k730k126j385p09n60j093j597
60312D23085j090N12K338L678M725N947P345Q697J0136J2041J4443J6898J8898
60299E27653K0118K0329J9285J6762J2660P170R09n296j0746j4987j7700j8807
60287E57350j8657j7741j6195j3895j0997q044n515l713k965l296l867l523k176
$$ plain form
60385 392923 394822 397108 399643 402179 404296 405822 407126 408769 410946 413449 415984 418390 420619 422709
60371 422709 424712 426583 428166 429402 430441 431491 432640 433919 435373 436922 438256 439078 439475 439933 440911
60356 440911 442504 444522 446760 449077 451355 453655 456464 460499 465990 472275 478430 484304 490588 497726
60342 497726 505036 511156 515135 516889 516798 515199 512198 507656 501328 493350 484643 476578 470007 464739 460029
60327 460029 455475 451317 447921 445200 442604 439671 436436 433285 430555 428429 427044 426335 425775 424682 423085
60312 423085 421995 422507 424845 428523 433248 439195 446540 455237 465373 477414 491857 508755 527653
60299 527653 547771 568100 587385 604147 616807 623977 624886 619590 608844 593857 576157 557350
60287 557350 538693 520952 504757 490862 479865 471821 466306 462593 459628 456332 452465 448942 446766
60274D46766r59p19j070j290j376j630j884j923k067k594l064k995k791l098l612
60259D15694l471k606j777j328q77k73N3q3k61j07K48N75Q02P93M23L8K28J011
60241D09082J740J977J875J695J409J008O44L54J31K43R13J688J827J398J203
60226D27187J487J578J178J062J933L230L826L440K704K200K028K091K260K396
60212D58600K601L314M784O548P758P923P239O417O208O804P550P628P139P009
60198E47522P682Q484Q555P880O939N953M957M201L826L482K807K018J572J356
60184F17234P71n39k349m109n243n478n196n191n823o631p024o911o429n670n018
60169E46394n104n763n758m323k444j656k047k426k217j975k098k194j900j417
$$ plain form
60274 446766 445807 445088 444018 442728 441352 439722 437838 435915 433848 431254 428190 425195 422404 419306 415694
60259 415694 412223 409617 407840 406512 405635 405362 405415 405332 405071 404964 405212 405787 406589 407382 407805 407843 408071 409082
60241 409082 410822 412799 414674 416369 417778 418786 419430 419784 419915 420158 421071 422759 424586 425984 427187
60226 427187 428674 430252 431430 432492 434425 437655 441481 444921 447625 449825 451853 453944 456204 458600
60212 458600 461201 464515 469299 475847 483605 491528 498767 505184 511392 518196 525746 533374 540513 547522
60198 547522 555204 563688 572243 580123 587062 593015 597972 602173 605999 609481 612288 614306 615878 617234
60184 617234 618005 617466 615117 611008 605765 600287 595091 589900 584077 577446 570422 563511 557082 551412 546394
60169 546394 541290 535527 529769 525446 523002 521346 519299 516873 514656 512681 510583 508389 506489 505072
60155E05072r08k52L56L86q9k04N10J449J888J942K066K192J970J517J315J569
60139E20779K103K715L248L529L596L817M468N302N799N701N135M378L720L307
60125E77597K963K332J367M99J85N11J310K287K960K903K328K032K455L153L562
60110F08444L806M274M750M643L895L014K188J101k53j235j399j253j695k878
60096F27402m067m581m505m417m612m829m640l939l003k148j466q26p9P40J389
60081E86419J604J378R16L19n40j620k390k342j768j603k338l486m324m796n342
60066E60087o101o736o944o808o616o590o761o888o588n792m992m707m757m427
60052D75380l432k314j712j505j004J63J607K611K856K749L024L999N176N760
$$ plain form
60155 505072 504164 503912 504268 504654 504565 504361 504871 506320 508208 510150 512216 514408 516378 517895 519210 520779
60139 520779 522882 525597 528845 532374 535970 539787 544255 549557 555356 561057 566192 570570 574290 577597
60125 577597 580560 582892 584259 584758 584943 585454 586764 589051 592011 594914 597242 599274 601729 604882 608444
60110 608444 612250 616524 621274 625917 629812 632826 635014 636115 635862 634627 633228 631975 630280 627402
60096 627402 623335 618754 614249 609832 605220 600391 595751 591812 588809 586661 585195 584369 584290 585030 586419
60081 586419 588023 589401 590317 590636 590096 588476 586086 583744 581976 580373 578035 574549 570225 565429 560087
60066 560087 553986 547250 540306 533498 526882 520292 513531 506643 500055 494263 489271 484564 479807 475380
60052 475380 471948 469634 467922 466417 465413 465576 467183 469794 472650 475399 478423 482422 487598 493358
60038D93358N605N353N553N984O127N990N952N909N237L740K126J109N14m09j990
60023E50158l901n662o939p503p415p205p378p718p593o919o279n959n609n041
60009D59037m693m790m728l948l030l021l934m659m338l204j976j087o65o38o36
59994D13690k23N66J232J452J372J236J152J343K109L298M306M749M825M755M377
59979D50239L556K531J604Q20K50O4J7n93k011l394l760l148k402k049k036k232
59963D37456k512k458j767r13p32j218j412o91M65J212J319J070P38N12O36J143
59947D32848J704K069K442L099L810M039L629K937K315J761J125M32j13l03j38
59932D61656O9j39r16j895k513k562k260j816j156j70R43J725J905J680J565J878
$$ plain form
60038 493358 498963 504316 509869 515853 521980 527970 533922 539831 545068 548808 550934 552043 552557 552148 550158
60023 550158 546257 540595 533656 526153 518738 511533 504155 496437 488844 481925 475646 469687 464078 459037
60009 459037 454344 449554 444826 440878 437848 434827 430893 426234 421896 418692 416716 415629 414964 414326 413690
59994 413690 413467 414033 415265 416717 418089 419325 420477 421820 423929 427227 431533 436282 441107 445862 450239
59979 450239 453795 456326 457930 458750 459000 459064 459081 458488 456477 453083 449323 446175 443773 441724 439688 437456
59963 437456 434944 432486 430719 429806 429074 427856 426444 425753 426218 427430 428749 429819 430557 431069 431705 432848
59947 432848 434552 436621 439063 442162 445972 450011 453640 456577 458892 460653 461778 462210 462097 461794 461656
59932 461656 461725 461586 460670 458775 456262 453700 451440 449624 448468 448298 449241 450966 452871 454551 456116 457994
59916D57994K375K532K223K003K486L520M293M331M005L801L499K543J072j8k64
59901D96395k94q95j830k146j458l95K75M59N34P63J201J832K503K952L158L545
59885E06599M501N759O540O335N401M428L828L494L175L007L370M205M683M016
59871E69341K453R79Qj086k926n107o666p178o974o496n997n597n227m567l446
59856E11514k200j272o61j23L69Q93K027M222O854Q732R620J0388J1425J1827
59842E73615J0621Q052N027K017p66k635k897j878p17j52j87p88k132l993n552
59827E77635o184o049n695n422n233n080m956m928n135n564n861n719n378n237
59813E01194n070m175k525j114p51j077j271j183j184j264j028n31l63q12j453
$$ plain form
59916 457994 460369 462901 465124 467127 469613 473133 477426 481757 485762 489563 493062 495605 496677 496659 496395
59901 496395 496101 495206 493376 491230 489772 489377 489652 490111 490645 491408 492609 494441 496944 499896 503054 506599
59885 506599 511100 516859 523399 529734 535135 539563 543391 546885 550060 553067 556437 560642 565325 569341
59871 569341 571794 572773 572781 571695 568769 563662 556996 549818 542844 536348 530351 524754 519527 514960 511514
59856 511514 509314 508042 507381 507258 507627 508520 510547 514769 521623 530355 539975 550363 561788 573615
59842 573615 584236 592288 597315 599332 598566 595931 593034 591156 590439 590287 590100 589312 587180 583187 577635
59827 577635 571451 565402 559707 554285 549052 543972 539016 534088 528953 523389 517528 511809 506431 501194
59813 501194 496124 491949 489424 488310 487559 486482 485211 484028 482844 481580 480552 480021 479658 478846 477393
59798D77393j753j653j459j440j676j971j915j359q15r30j536j752j197n12l92
59783D57033o68q40r90j504k128k066j116r1P4o98j661k019j541o83j48j90l25
59766D40439N1Q43J342J168P25O66J169J911K496K748K775K829L093L507L923
59751D69685M296M575M554M208L970M265M817M972M720M718N152N303M657L724
59737E33616L211K917K217J274Q50J055J078L69o37j149r67m24J55O44J000J160
59721E46369J031N36j87o46m00L88J033J037M94k23q16j061p56K7Q32J184R88
59704E49830N15R9j10j35l7J99N43O86K42o03r50j30J361K380K517K317K227K029
59686E62980J526J079J038J124Q70L01k76p79j220j386j183j098j750k997m033
$$ plain form
59798 477393 475640 473987 472528 471088 469412 467441 465526 464167 463352 462422 460886 459134 457937 457425 457033
59783 457033 456365 455525 454535 453031 450903 448837 447721 447630 447704 447006 445345 443326 441785 441102 440954 440764 440439
59766 440439 440490 441333 442675 443843 444568 445234 446403 448314 450810 453558 456333 459162 462255 465762 469685
59751 469685 473981 478556 483110 487318 491288 495553 500370 505342 510062 514780 519932 525235 529892 533616
59737 533616 536827 539744 541961 543235 544085 545140 546218 546587 545950 544801 543834 543410 543565 544209 545209 546369
59721 546369 547400 547936 547749 547103 546703 547091 548124 549161 549655 549432 548616 547555 546799 546826 547658 548842 549830
59704 549830 550345 550444 550334 550199 550162 550361 550904 551590 551832 551229 550279 550149 551510 553890 556407 558724 560951 562980
59686 562980 564506 565585 566623 567747 568617 568918 568642 567863 566643 565257 564074 562976 561226 558229 554196
59671E54196m340m160m039m238m672n024m948m384l712l358l308l204k828k124
59657D99857r54O65K141K688K282J816K104L091M170M843M893M345L515K798K104
59642E40358R45p03k102k781l299m333n355n160l657k174j795k147k304k142k159
59627E01192k427k538k405k374k535k509k118j751j844k319k763k900k746k501
59613D67462k471k795l135k865j848p45k75l16j08P33J762K334K348K160J894
59598D64135J203p7j306j493n77K29j62j267j664r62l23p44j636j743q35K23O90
59581D53691M44m27j628k352j902p19o2m01r19q23m25m34q54j250j578k112k654
59564D35595k513j326M37J832K158J442L81k20j11L30O57P63P79Q93J291J989
$$ plain form
59671 554196 549856 545696 541657 537419 532747 527723 522775 518391 514679 511321 508013 504809 501981 499857
59657 499857 498903 499568 501709 504397 506679 508495 510599 513690 517860 522703 527596 531941 535456 538254 540358
59642 540358 541303 540600 538498 535717 532418 528085 522730 517570 513913 511739 509944 507797 505493 503351 501192
59627 501192 498765 496227 493822 491448 488913 486404 484286 482535 480691 478372 475609 472709 469963 467462
59613 467462 464991 462196 459061 456196 454348 453603 453328 453012 452904 453637 455399 457733 460081 462241 464135
59598 464135 465338 465261 463955 462462 461885 462114 461952 460685 459021 458059 457736 456992 455356 453613 452778 453001 453691
59581 453691 454135 453708 452080 449728 447826 447107 447045 446644 445725 444902 444477 444043 443189 441939 440361 438249 435595
59564 435595 433082 431756 432193 434025 436183 437625 438006 437786 437675 438005 438662 439425 440204 441097 442388 444377
59548D44377K569K515J919J445J490J840K361L430N313P559R433J0663J1460J2243
59534E18617J3668J6199J9056K0018J7204J0872L021m357r971j2821j2449r757
59522E69300o557l934j606R07L273M778N162M642L550K247R68m88k529m974o961
59507E67778p851p879p679p624p849q433r115r237q485p403o782o696o506n705
59493D60534m361k840j497o27m09p19j103j036l28O54J240J110P42R31J892L033
59477D57216L659L602L190K869L003L652M380M595M218L764L580L392K896K371
59463E06387K273K475K415J996J806K339L248L717L484L238L806N106O283O885
59449E55458P458Q570R723R915R064Q044P285O204M250J761p18l234n966q444
$$ plain form
59548 444377 446946 449461 451380 452825 454315 456155 458516 461946 467259 474818 484251 494914 506374 518617
59534 518617 532285 548484 567540 587558 604762 615634 618655 614298 604327 591506 579057 569300
59522 569300 562743 558809 557203 558110 561383 566161 571323 575965 579515 581762 582730 582242 579713 574739 567778
59507 567778 559927 552048 544369 536745 528896 520463 511348 502111 493626 486223 479441 472745 466239 460534
59493 460534 456173 453333 451836 451209 450800 450081 448978 447942 447614 448268 449508 450618 451360 452291 454183 457216
59477 457216 460875 464477 467667 470536 473539 477191 481571 486166 490384 494148 497728 501120 504016 506387
59463 506387 508660 511135 513550 515546 517352 519691 522939 526656 530140 533378 537184 542290 548573 555458
59449 555458 562916 571486 581209 591124 600188 608232 615517 621721 625971 627732 627014 623780 617814 609370
59435F09370r930j0281r893r071p948o818o016n542n185m770l990k376L0K322
59421E29902L708M588O018Q265J0634J2646J4580J6709J8668J9952K0613K1249
59409F87532K2489K4417K6018K5221K0114J0626j046j1676j8680k1104j9763j6462
59397G27686j2516p863k099L731O989N423j026j0241j9160k5091k6846k5247k2232
59384E91508j9124j6125j3280j1047r445p612m958k233o53k93j25N20J303J642
59370E10078J517J375J655K439L275L542L260L309M367N882O647O300N665N618
59356E64929O248P199Q229R195R910J0394J0960J1827J2826J3630J4139J4544
59344F94030J5171J6246J7532J8259J7831J6593J5484J4790J3786J1767R001O234
$$ plain form
59435 609370 599440 589159 579266 570195 562247 555429 549413 543871 538686 533916 529926 527550 527580 529902
59421 529902 533610 538198 544216 552481 563115 575761 590341 607050 625718 645670 666283 687532
59409 687532 710021 734438 760456 785677 805791 816417 815371 803695 785015 763911 744148 727686
59397 727686 715170 707307 705208 708939 715928 721351 720325 710084 690924 665833 638987 613740 591508
59384 591508 572384 556259 542979 531932 522487 514875 509917 507684 507031 506738 506613 507133 508436 510078
59370 510078 511595 512970 514625 517064 520339 523881 527141 530450 534817 540699 547346 553646 559311 564929
59356 564929 571177 578376 586605 595800 605710 616104 627064 638891 651717 665347 679486 694030
59344 694030 709201 725447 742979 761238 779069 795662 811146 825936 839722 851489 860490 866724
59332H66724L616O40k972o763r911j1939j3031j3855j4949j6215j7077j7235j6946
59319G30087j6524j5828j4629j3163j1959j1153j0388r335q019o633n316m098
59307F03042k837j311M73K101L179L840M543N592P226R838J3410J6685J7696J5468
59293F98945J0709M648k085q976j4858j8437j9368j8219j5692j2581r995q577
59281E85514p539n538k650m83Q2K01J385L433N060N977P122Q914J0529J1263J1658
59266F34928J2607J3952J4656J4055J2372J0157P746N330L055P52k079n685r485
59253G12361j2338j3544j3456j2982j2583j1951j0690r047p705o968o433n523
59241E89141m166k746j519l35J015K349L249L671M107M966N952O358N888M910
$$ plain form
59332 866724 870340 870980 868008 861245 851334 839395 826364 812509 797560 781345 764268 747033 730087
59319 730087 713563 697735 683106 669943 657984 646831 636443 627108 619089 612456 607140 603042
59307 603042 600205 598894 599367 601468 604647 608487 613030 618622 625848 635686 649096 665781 683477 698945
59293 698945 709654 714302 712217 703241 688383 669946 650578 632359 616667 604086 594091 585514
59281 585514 577975 572437 569787 569304 569386 569587 570972 574405 579465 585442 592564 601478 612007 623270 634928
59266 634928 647535 661487 676143 690198 702570 712727 720473 725803 728858 729610 727531 721846 712361
59253 712361 700023 686479 673023 660041 647458 635507 624817 615770 608065 601097 594664 589141
59241 589141 584975 582229 580710 580375 581390 583739 586988 590659 594766 599732 605684 612042 617930 622840
59227F22840L895K964K053J182L10p33k029l471n037o726q070q202o921n279m530
59212E82246m718m896m503l810l066k112r48m1K61N8m95j312k007k070j685j641
59196E49261k082k122j197m6L67J68L2j08p03j303r35L30J274J278J102J538K287
59179E49141K707K911L338L787L669K945K153J650J452J706K663M051N108N441
59165E92722N563O306P850R578J0710J0909J0328R320Q236P347O648N718L979
59152F95214J390j260l015l690l981m613n701o957q194r333j0166j0424j0061
59139F19209r320q546p972p655p466p219o858o467o084n654n106m389l431k285
59125E30757j331r97j145j014J1J757L515M778N578O304P303Q479R212Q998Q241
$$ plain form
59227 622840 626735 629699 631752 632934 633244 632511 630482 627011 621974 615248 607178 598976 592055 586776 582246
59212 582246 577528 572632 568129 564319 561253 559141 558193 558152 558413 558471 557976 556664 554657 552587 550902 549261
59196 549261 547179 545057 543860 543814 544181 544349 544381 544273 543570 542267 541332 541662 542936 544214 545316 546854 549141
59179 549141 551848 554759 558097 561884 565553 568498 570651 572301 573753 575459 578122 582173 587281 592722
59165 592722 598285 604591 612441 622019 632729 643638 653966 663286 671522 678869 685517 691235 695214
59152 695214 696604 695344 692329 688639 684658 680045 674344 667387 659193 649860 639694 629270 619209
59139 619209 609889 601343 593371 585716 578250 571031 564173 557706 551622 545968 540862 536473 533042 530757
59125 530757 529426 528429 527284 526270 526281 528038 531553 536331 541909 548213 555516 563995 573207 582205 590446
59110E90446P964Q502Q994Q556P474O623O172N624M865M274L860L213K435K178
59096F71180K474K373J275j40r77j449k323l468l908l236k186j667j808k084j969
59081F52087j370q36j286l144n667p581q405q684q873q691p833o746o140o066
59067E70765o014n713n384n208n039m684m175l643l147k725k415k215k095k088
59053E16220k186k203j942j476j052o84j53M49N43k61j451k041j672r93p94j109
59037D99195j360j156n98K4N22P49O64M96O33J190J888K502L155M024M965N692
59021E22585O157O536O978P625Q717J0270J1701J2128J1199R367P348N495L762
59008F29868J981P8j786l208l787l423k318p17J078K586L411L714M084M882N968
$$ plain form
59110 590446 598410 606912 615906 624462 631936 638559 644731 650355 655220 659494 663354 666567 669002 671180
59096 671180 673654 676027 677302 677162 676185 674736 672413 668945 665037 661801 659615 657948 656140 654056 652087
59081 652087 650717 649881 648595 645451 639784 632203 623798 615114 606241 597550 589717 582971 576831 570765
59067 570765 564751 559038 553654 548446 543407 538723 534548 530905 527758 525033 522618 520403 518308 516220
59053 516220 514034 511831 509889 508413 507361 506677 506524 506973 507516 507255 505804 503763 502091 501098 500304 499195
59037 499195 497835 496679 496081 496105 496627 497376 498040 498536 499169 500359 502247 504749 507904 511928 516893 522585
59021 522585 528742 535278 542256 549881 558598 568868 580569 592697 603896 613263 620611 626106 629868
59008 629868 631849 631927 630141 626933 623146 619723 617405 616688 617766 620352 623763 627477 631561 636443 642411
58993F42411P065P975Q349P788O378M729L283J994R24M71N45J02j711m232n846
58978F80225n734m515l141j912o11J014L101N524P767R324J0341J1413J2683J3628
58964G39107J3878J3754J3731J3826J3772J3438J2754J1584R953Q182O439M446
58952H74864J844j348m851q409j1731j4396j6224j7486j8466j8976j8584j7250
58940G28987j5447j3733j2366j1227j0012q587p219o241n532m654l573k786k491
58927F25119k263j757j259r70m51N91J404J034j58q10l91K41K69J6J88P95J397
58910F22995J825K079J925J297Q14J273K647M166N359O497P972R718J1408J2865
58896F92840J3957J4434J4211J3705J3555J3932J4442J4778J5224J6323J8170
$$ plain form
58993 642411 649476 657451 665800 673588 679966 684695 687978 689972 690896 691367 691912 692014 690303 686071 680225
58978 680225 674491 669976 666835 664923 664312 665326 668427 673951 681718 691042 701383 712796 725479 739107
58964 739107 752985 766739 780470 794296 808068 821506 834260 845844 855797 863979 870418 874864
58952 874864 876708 875360 870509 862100 850369 835973 819749 802263 783797 764821 746237 728987
58940 728987 713540 699807 687441 676214 666202 657615 650396 644155 638623 633969 630396 627610 625119
58927 625119 622856 621099 619840 618870 618419 619010 620414 621448 621290 620480 620089 620330 620599 620615 620803 621598 622995
58910 622995 624820 626899 628824 630121 630935 632208 634855 639021 644380 650877 658849 668567 679975 692840
58896 692840 706797 721231 735442 749147 762702 776634 791076 805854 821078 837401 855571
58885H55571K0297K2129K3298K3551K2775K1249J9501J7687J5358J2102Q133M005
58873A065656j8l898p417j0351j2940j5626j8267k0091k0550j9867j8651j7325
58861I00655j6084j4953j3728j2241j0853j0290j0729j1393j1416j0830j0372
58850G67766j0592j1414j2366j2903j2646j1686j0554r635q734p489o058n023
58838F48666m677m761m887m971n172n582o044o209n832n072m368l934l581l113
58824E80463k602k086j344l00O94J409K242L657N323O406O590O205N473M408L495
58809F20033L567M590N280M555K898J723J674K092J979R75n63k035l060l777m602
58794F35329n590o262o311o134o281o643o715o376n824m895l270j388k98k53j48
$$ plain form
58885 855571 875868 897997 921295 944846 967621 988870 1008371 1026058 1041416 1053518 1061651 1065656
58873 1065656 1065638 1061740 1054323 1043972 1031032 1015406 997139 977048 956498 936631 917980 900655
58861 900655 884571 869618 855890 843649 832796 822506 811777 800384 788968 778138 767766
58850 767766 757174 745760 733394 720491 707845 696159 685605 675970 667236 659747 653689 648666
58838 648666 643989 639228 634341 629370 624198 618616 612572 606363 600531 595459 591091 587157 583576 580463
58824 580463 577861 575775 574431 574131 574825 576234 578476 582133 587456 593862 600452 606657 612130 616538 620033
58809 620033 623600 628190 633470 638025 640923 642646 644320 646412 648391 649366 648803 646768 643708 639931 635329
58794 635329 629739 623477 617166 611032 604751 598108 591393 585017 579193 574298 571028 569640 569342 569089 568941
58779E68941J085L059M491M778M350L742L016K141J216J42j447l668o126q254
58765E77466r619r860q813o939n167m019l248k601k439l043l739l502k297j052
58751E11128k67N34J714K713K941K895L514M725N443N080M329M198M825N596O054
58736E65422O266O453O667O803O730O341N640M774L987L547L637M132M518M334
58722F39251L743L384L490L507K934K154J975K546L308L990M951O348P505P647
58708F96733O966O408O491O683O020M051J120k047m869p169r156j1134j3163j4952
58694F71982j6163j6782j7146j7453j7341j6176j3910j1415r680q754p846o429
58682E12887m860l788l399l403l468l355k992k719l099m102m750m078k274l64
$$ plain form
58779 568941 570026 573085 577576 582354 586704 590446 593462 595603 596819 596961 595514 591846 585720 577466
58765 577466 567847 557987 549174 542235 537068 533049 529801 527200 524761 521718 517979 514477 512180 511128
58751 511128 510861 511395 513109 515822 518763 521658 525172 529897 535340 540420 544749 548947 553772 559368 565422
58736 565422 571688 578141 584808 591611 598341 604682 610322 615096 619083 622630 626267 630399 634917 639251
58722 639251 642994 646378 649868 653375 656309 658463 660438 662984 666292 670282 675233 681581 689086 696733
58708 696733 703699 710107 716598 723281 729301 733352 734472 732425 727556 720387 711231 700097 686934 671982
58694 671982 655819 639037 621891 604438 587097 570921 557011 545596 535916 527162 519316 512887
58682 512887 508027 504239 500840 497437 493969 490614 487622 484903 481804 477702 472952 468874 466600 466236
58668D66236J088K343L650M783N571O323P382Q650R662R847Q684O167L194Q84
58654E44464o81k322m148n066m449l390l252l733l541k547j944k313k876k895
58640E01307k628k466k215j786j624j745j246L81K177K916K810K987L651L938
58626E06457L431K729K386K234K028J918J903J555O91j54l45K60J524L281N040
58611E34938O046O123N970O155O292N749M621L405K156P83k00k26K14J2r12j505
58595E79621j306j264k243l608m081l393k277j320n69j5M22J252L027N479P698
58580E77423R144R981J0447J0554J0438J0343J0116R317Q062P094O778O663O441
58567F92801O635P843R792J1816J3859J6293J8981K1263K2844K4033K5059K5692
$$ plain form
58668 466236 467324 469667 473317 478100 483671 489994 497376 506026 515688 525535 534219 540386 543580 544464
58654 544464 543783 541461 537313 532247 527798 524408 521156 517423 513882 511335 509391 507078 504202 501307
58640 501307 498679 496213 493998 492212 490588 488843 487597 487978 490155 493071 495881 498868 502519 506457
58626 506457 509888 512617 515003 517237 519265 521183 523086 524641 525332 525178 524833 525093 526617 529898 534938
58611 534938 540984 547107 553077 559232 565524 571273 575894 579299 581455 582238 582038 581812 582026 582038 581126 579621
58595 579621 578315 577051 574808 571200 567119 563726 561449 560129 559560 559545 559967 561219 564246 569725 577423
58580 577423 586567 596548 606995 617549 627987 638330 648446 657763 665825 672919 679697 686360 692801
58567 692801 699436 707279 717071 728887 742746 759039 778020 799283 822127 846160 871219 896911
58555H96911K5666K4988K3633K1305J7770J3155P863K383k619o333q276q721q511
58542I99214q386q505q669q905r641j1202j3304j5368j7213j9043k0774k1896
58530H36308k2175k1836k0851j8676j5269j1708r137p448n821m096k741j761o70
58517F94119L87O45o0r92j749k747m052m727m057k662j662j319j203j229j643
58502F67049k290k721k872l003l091k863k372j976j825j829j959k083j735o73
58488F35757N14J059J203J904L332M520M811M880N776P523R311J0685J1895J3219
58474G16389J4549J5687J6536J6865J6221J4281J1150P172K648k084o462r755
58462H13197j1457j1512j0346q635o958n366l311k75L401O562Q329Q979R502J0449
$$ plain form
58555 896911 922577 947565 971198 992503 1010273 1023428 1031291 1033674 1031055 1024722 1016446 1007725 999214
58542 999214 990828 982323 973654 964749 955108 943906 930602 915234 898021 878978 858204 836308
58530 836308 814133 792297 771446 752770 737501 725793 716656 709208 703387 699291 696550 694789 694119
58517 694119 694506 695151 695091 694099 692350 689603 685551 680824 676767 674105 672443 671124 669921 668692 667049
58502 667049 664759 662038 659166 656163 653072 650209 647837 645861 644036 642207 640248 638165 636430 635757
58488 635757 636271 637330 638533 640437 643769 648289 653100 657980 663756 671279 680590 691275 703170 716389
58474 716389 730938 746625 763161 780026 796247 810528 821678 828850 831498 829414 822952 813197
58462 813197 801740 790228 779882 771247 764289 758923 755612 755337 758738 765300 773629 782608 792110 802559
58448H02559J1493J1947J1260R043N222M15m239p936j0652j2524j3268j2608j1050
58435G79662r556q484p311n521l406j643l45J046K884M709N760O061O443P485
58421G77784Q789R671J0091J0398J0369R267O877L853Q80j922m548o670p990q614
58407H18235q751q515q207q266q550q248o971n451m641m535m367l622k336p85
58393G34990N73J213J199J341K096K709K204Q25l19p94j029j132m65J355L889
58378G48655O468Q742J0509J1680J2543J3505J4397J4554J3728J2356J0903R547
58366H87587Q581Q416Q923R372R294Q987Q961R399J0297J1581J2901J3809J4235
58353A022343J4318J3737J1943R212O639M748K931O47j489k499k251j240L18K417
$$ plain form
58448 802559 814052 825999 837259 846302 851524 851939 847700 839764 829112 816588 803320 790712 779662
58435 779662 770106 761622 754311 748790 745384 743741 743396 744442 747326 752035 757795 763856 770299 777784
58421 777784 786573 796244 806335 816733 827102 836369 843246 847099 847979 846057 841509 834839 826849 818235
58407 818235 809484 800969 792762 784496 775946 767698 760727 755276 750635 746100 741733 738111 735775 734990
58393 734990 735563 736776 737975 739316 741412 744121 746325 747150 746831 746037 745008 743876 743411 744766 748655
58378 748655 755123 763865 774374 786054 798597 812102 826499 841053 854781 867137 878040 887587
58366 887587 896168 904584 913507 922879 932173 941160 950121 959520 969817 981398 994299 1008108 1022343
58353 1022343 1036661 1050398 1062341 1071553 1078192 1082940 1085871 1086518 1085029 1082530 1080279 1079039 1079357 1081774
58339A081774M635O333P378Q147Q859R503J0291J1617J3451J5171J6216J6657
58327A210032J6924J7084J6639J5207J3245J1708J0833R741P667N166L450K847
58315A340543K748K935L949N902P870Q945R167R113R202R785J1156J2957J4248
58302A448520J4695J5089J6126J7304J7767J7626J7666J8102J8498J8632J8661
58291A638686J8669J8719J9268K0784K2952K4854K5965K6540K7044K7658K8386
58280A899525K9263L0383L1834L3487L4818L5324L5379L6146L8175M0561M2083
58269B286978M2796M3763M5469M7369M9017N0807N3315N6489N9834O2991O5873
58258B864701O8487P0854P3064P5167P7062P8575P9680Q0654Q1891Q3490Q5218
$$ plain form
58339 1081774 1086409 1092742 1100120 1108267 1117126 1126629 1136920 1148537 1161988 1177159 1193375 1210032
58327 1210032 1226956 1244040 1260679 1275886 1289131 1300839 1311672 1321413 1329080 1334246 1337696 1340543
58315 1340543 1343291 1346226 1350175 1356077 1363947 1372892 1382059 1391172 1400374 1410159 1421315 1434272 1448520
58302 1448520 1463215 1478304 1494430 1511734 1529501 1547127 1564793 1582895 1601393 1620025 1638686
58291 1638686 1657355 1676074 1695342 1716126 1739078 1763932 1789897 1816437 1843481 1871139 1899525
58280 1899525 1928788 1959171 1991005 2024492 2059310 2094634 2130013 2166159 2204334 2244895 2286978
58269 2286978 2329774 2373537 2419006 2466375 2515392 2566199 2619514 2676003 2735837 2798828 2864701
58258 2864701 2933188 3004042 3077106 3152273 3229335 3307910 3387590 3468244 3550135 3633625 3718843
58247C718843Q7087Q9814R4287J00600J08000J15719J23458J31127J38726J46641
58237D854302J55433J65224J75716J86869J98925K11745K24838K38289K52879
58228F664220K69174K87178L07028L29251L54072L81401M11633M45500M82992
58219I932449N23562N67775O17550O74418P38903Q12119Q96381R93538J104327
58210A6861022J230527J376380J547007J747268J983761K266600K608075L021449
58202C2642089L523273M135928M886771N806490O928964Q287049R900812J1768556
58194H7879932J3874958J6212541J8795505K1651606K4796541K8193403L1674585
58187B43079071L4802137L6717364L6152469L1800332K3021998J0503838l685073
$$ plain form
58247 3718843 3805930 3895744 3990031 4090631 4198631 4314350 4437808 4568935 4707661 4854302
58237 4854302 5009735 5174959 5350675 5537544 5736469 5948214 6173052 6411341 6664220
58228 6664220 6933394 7220572 7527600 7856851 8210923 8592324 9003957 9449457 9932449
58219 9932449 10456011 11023786 11641336 12315754 13054657 13866776 14763157 15756695 16861022
58210 16861022 18091549 19467929 21014936 22762204 24745965 27012565 29620640 32642089
58202 32642089 36165362 40301290 45188061 50994551 57923515 66210564 76111376 87879932
58194 87879932 101754890 117967431 136762936 158414542 183211083 211404486 243079071
58187 243079071 277881208 314598572 350751041 382551373 405573371 416077209 412392136
58180D12392136j6852492k6841570l2819889l5235912l5151766l3554824l1069652
58173B00866031k8042710k4724941k1357455j8154532j5263489j2752569j0628127
58166F9942208q861686p410408o226825n263468m477512l833733l303453k862501
58158B7702622k491575k177199j910336j684033j492468j330766j194239j078175
58150A4343831r78809q93392q18696p50615o86178o25089n68472n16880m70189
58141H035511m28350l91210l58132l28667l03128k82021k65259k52260k41958
58132E184526k32441k21484k08229j93787j79728j66684j54699j44016j34760
58123C548698j26562j19092j12438j06573j01160r6249r2303q9167q5870q2008
$$ plain form
58180 412392136 395539644 368698074 335878185 300642273 265490507 231935683 200866031
58173 200866031 172823321 148098380 126740925 108586393 93322904 80570335 69942208
58166 69942208 61080522 53670114 47443289 42179821 37702309 33868576 30565123 27702622
58158 27702622 25211047 23033848 21123512 19439479 17947011 16616245 15422006 14343831
58150 14343831 13365022 12471630 11652934 10902319 10216141 9591052 9022580 8505700 8035511
58141 8035511 7607161 7215951 6857819 6529152 6226024 5944003 5678744 5426484 5184526
58132 5184526 4952085 4730601 4522372 4328585 4148857 3982173 3827474 3683458 3548698
58123 3548698 3422136 3303044 3190606 3084033 2982873 2886624 2794321 2705154 2619284 2537276
58113B537276p8263p5033p1607o7479o3409o0123n7002n3292m9779m7824m7176
58102A866289m6300m4646m3166m2509m2035m0957l9417l7884l6354l4630l2823
58091A425568l1072k9227k7214k5339k3926k2853k1816k0841k0273k0303k0725
58080A161979k1131k1242k1009k0479j9630j8493j7294j6353j5823j5684j5935
58069I58906j6559j7259j7557j7156j6075j4460j2634j1202j0654j0734j0666
58058H03950j0176r795r989j0490j0841j1012j1179j1241j1016j0615j0191r639
58046F77766q860q025p257o344n181m175l755l730l622l402l453l903m463m933
58032F06663n414o046o801p546q189q734r292r851j0049r516q542p975q201q633
$$ plain form
58113 2537276 2459013 2383980 2312373 2244894 2181485 2121362 2064360 2011068 1961289 1913465 1866289
58102 1866289 1819989 1775343 1732177 1689668 1647633 1606676 1567259 1529375 1493021 1458391 1425568
58091 1425568 1394496 1365269 1338055 1312716 1288790 1265937 1244121 1223280 1203007 1182704 1161979
58080 1161979 1140848 1119606 1098597 1078118 1058488 1039995 1022701 1006348 990525 974841 958906
58069 958906 942347 925088 907531 890375 874300 859840 847206 836004 825350 814616 803950
58058 803950 793774 783979 773990 763500 752659 741647 730468 719227 708211 697596 687405 677766
58046 677766 668906 660881 653624 647280 642099 637924 634169 630439 626817 623415 619962 616059 611596 606663
58032 606663 601249 595203 588402 580856 572667 563933 554641 544790 534741 525225 516683 508708 500507 491874
58018D91874q477p652o652n866n446n409n489n226m655m509n198o005n901m859
58004D10530l742l087k716k358j971j497q57j29Q04K524N300Q219R945J0255J0000
57989D41220R535Q206N679K795N73q75j939k662k990l311m075n073n769o033o044
57974D29237n673m638l229k270k223k664k740k008p60K10K76l97q80m71M93J009
57958D03272O08j74n71n28o23j268k184k713k539k028j844k223k737k791k232
57943C79425j306j87J154K624L866M623N003N306N698O249P063Q084Q942R310
57929D45854R354R410R233Q049N651L002J296O23Jj370l382n478p295q631r241
57914D57076r052q365p618p031o622o394o289o104n603m739l679k735k283k551
$$ plain form
58018 491874 483397 475745 469093 463227 457781 452372 446883 441657 437002 432493 427295 421290 415389 410530
58004 410530 406788 403701 400985 398627 396656 395159 394302 394173 394977 397501 402801 411020 420965 431220 441220
57989 441220 450755 458961 464640 467435 468008 467133 465194 462532 459542 456231 452156 447083 441314 435281 429237
57974 429237 423564 418926 415697 413427 411204 408540 405800 403792 403032 403242 403518 403121 402241 401770 402263 403272
57958 403272 403880 403706 403135 402607 401984 400716 398532 395819 393280 391252 389408 387185 384448 381657 379425
57943 379425 378119 377932 379086 381710 385576 390199 395202 400508 406206 412455 419518 427602 436544 445854
57929 445854 455208 464618 473851 481900 487551 490553 491849 492472 492473 491103 487721 482243 474948 466317 457076
57914 457076 448024 439659 432041 425010 418388 411994 405705 399601 393998 389259 385580 382845 380562 378011
57900C78011l333m035m166l758l280l216l632m047l747k531j022N3P25J530K452
57885C46004K838K513K273K772L535L603K793J708Q08J09m15p38j014j410j702
57870C63677j568j185j100j499k093k644l193l720m002l875l305k310j109k32
57856C31842K7R7N93J399J881J920K029K430K698K546K303K277K201J657O64m35
57840C56129j315j739j686j578j963k759l260l064k560k236k058j852j771k001
57826C26287k329k431k212j630n61Q24J962K539K806K997K953K715K807L444L916
57811C44087L458K186N70j486m052o193o686n696m668m471m522l990k972k086
57797C03479j562j152n67L03J202J506Q31l07r70r30p23n71j06O56J028P86P44
$$ plain form
57900 378011 374678 370643 366477 362719 359439 356223 352591 348544 344797 342266 341244 341297 342022 343552 346004
57885 346004 348842 351355 353628 356400 359935 363538 366331 368039 368847 368956 368541 367803 366789 365379 363677
57870 363677 362109 360924 359824 358325 356232 353588 350395 346675 342673 338798 335493 333183 332074 331842
57856 331842 331869 331966 332559 333958 335839 337759 339788 342218 344916 347462 349765 352042 354243 355900 356564 356129
57840 356129 354814 353075 351389 349811 347848 345089 341829 338765 336205 333969 331911 330059 328288 326287
57826 326287 323958 321527 319315 317685 317124 317948 319910 322449 325255 328252 331205 333920 336727 340171 344087
57811 344087 347545 349731 350301 348815 344763 338570 331884 326188 321520 317049 312527 308537 305565 303479
57797 303479 301917 300765 300198 300501 301703 303209 304040 303733 302763 301833 301110 300539 300433 301089 302117 302903 303647
57780C03647J519K488K708K337K226K552K759K651K633K882L079L062L025K948
57766C40516K430J365J74p97j669k477k804k306j357p36q13j325j807j919j503
57751C24972n84N22J384J818K039K336K607K364J399K83r0L94P94K37r64j747
57735C37764j699j450j680k232k521k377k097j918j716j258m98L51R75J145Q84
57720C21673M05n7l32l76m39j019k319l809m643m539l954l409l077l086l611m371
57704B83037m589l938l157l175l879m256l694k593j689j299j290j391j367j111
57690B45609p65n35l92j60Q8P1j80j53N79J859L236M534N895P370Q856J0458J2610
57673B98980J5648J9386K3415K7783L3049L9498M6525N3067N8319O1388O0295
$$ plain form
57780 303647 305166 307654 310362 312699 314925 317477 320236 322887 325520 328402 331481 334543 337568 340516
57766 340516 342946 344311 344485 343688 342019 339542 336738 334432 333075 332339 331526 330201 328394 326475 324972
57751 324972 324388 324910 326294 328112 330151 332487 335094 337458 338857 339140 339050 339444 340238 340475 339511 337764
57735 337764 336065 334615 332935 330703 328182 325805 323708 321790 320074 318816 318318 318669 319644 320789 321673
57720 321673 322078 322021 321689 321313 320874 319855 317536 313727 309084 304545 300591 297182 294105 291019 287408 283037
57704 283037 278448 274510 271353 268178 264299 260043 256349 253756 252067 250768 249478 248087 246720 245609
57690 245609 244844 244309 243917 243757 243845 243916 243736 243583 244162 246021 249257 253791 259686 267056 275912 286370 298980
57673 298980 314628 334014 357429 385212 418261 457759 504284 557351 615670 677058 737353
57662G37353N2215L5561J1961j4035l7186n3732o2298o3665n9880n3195m5380
57651D47719l7737l1115k5630k0704j5914j1636q536o643n379m348l526k807j920
57638B71824q60J03Q28J306J385J007N94O20P92M48k25k59N64J155N51q12j794
57621B77227j961j698j410j339j745k650l522l811l579l245k935k584k378k474
57607B41896k529k086j336r01r34j006q52o59n17j72M17P19J51j208k634l452
57591B24897l607l605l864m199m120l634l361l621l851l296k052r37n00n80p48
57576A82922p68o31m72n01q07j296j878k502k827k351j163k07k44q80j188r40
57560A64267o32n27m09k00r6l8K30N79N69K40J84P60J685K397K341J101j010k575
$$ plain form
57662 737353 789568 825129 837090 823055 785869 732137 669839 606174 546294 493099 447719
57651 447719 409982 378867 353237 332533 316619 304983 296447 289804 284425 280077 276551 273744 271824
57638 271824 270964 271067 271895 273201 274586 275593 276187 276807 277599 278047 277822 277563 278127 279282 279833 279021 277227
57621 277227 275266 273568 272158 270819 269074 266424 262902 259091 255512 252267 249332 246748 244370 241896
57607 241896 239367 237281 235945 235044 234110 233104 232252 231593 231076 230904 231321 232040 232191 230983 228349 224897
57591 224897 221290 217685 213821 209622 205502 201868 198507 194886 191035 187739 185687 184750 184250 183670 182922
57576 182922 182154 181523 181051 180550 179743 178447 176569 174067 171240 168889 167726 167519 167275 166395 165207 164267
57560 164267 163635 163108 162699 162499 162403 162365 162595 163174 163743 163983 164167 164927 166612 169009 171350 172451 171441 168866
57542A68866k289o46M95L11j07L94J331J583J154R36J215J427J190P28K77j36
57526A76729m14l73n7L34P95J327J570J165M29J22N02J069J417J794K539L287
57510A92235L174J873J21r44r45n78o16r23q07k16Qp57k102l158l578l536l224
57493A76027k888l002l741m416m022k471q22j46m98j106j202o16K65Q91J034R24
57477A54211Q46P02J81o76j409j657j501j291j274j463j712j834j702j340q89
57462A39192n47m83o68p91n43p0J29r3k11K21Q20P60j06r94j133n69J04M58M69
57443A35945K78Q7J53N62R99J003M94j47o01r44j251j233o51J40N37O17R88J640
57425A38616J681O98l01j07J012J750J607J253J157Q87J18o81j066j285j607j605
$$ plain form
57542 168866 166577 165931 166426 166737 166630 167024 168355 169938 171092 172028 173243 174670 175860 176588 176865 176729
57526 176729 176315 175942 175885 176219 177014 178341 179911 181076 181505 181627 182129 183198 184615 186409 188948 192235
57510 192235 195409 197282 197403 196459 195514 194936 194320 193397 192590 192374 192382 191625 189523 186365 182787 179251 176027
57493 176027 173139 170137 166396 161980 157958 155487 154665 154519 154021 152915 151713 151097 151362 152253 153287 154211
57477 154211 155057 155759 155940 155264 153855 152198 150697 149406 148132 146669 144957 143123 141421 140081 139192
57462 139192 138645 138162 137494 136703 136160 136090 136219 136126 135915 136136 136956 137716 137610 136616 135483 134914 135018 135476 135945
57443 135945 136223 136310 136463 137025 138024 139027 139521 139374 138773 137829 136578 135345 134694 134834 135371 135988 136976 138616
57425 138616 140297 140995 140694 140587 141599 143349 144956 146209 147366 148253 148371 147690 146624 145339 143732 142127
57409A42127q32L21J035J036O83L47J94K04Q6n06j307j505q54j23N1O6M28O55
57391A42106J13o13m20N25R90P26R18K283L827M193L367K318J601J093O63L69
57375A64059Q8m09j008j304j133p73n70n88p02q40j018j141r61m03J49J86k23
57358A53409m16j1O25J026J352J926K472K415J824J311J117R40O92O67P85M43
57342A70577n53j447j406n56K61M71J93j83m44o57r62j293j345r30k41M16R75
57325A62876J390J420R74N43O39R48P51R6k11J67O39O98N74O17P65J030J717K685
57307A78318L041K309J239Q77J209J506J550J726K156K512K630K639K475J940
57293B06127J136L99k34q83j279r41K1Q46J009P22M16K51K39M86R33J221J047
$$ plain form
57409 142127 141295 141616 142651 143687 144370 144717 144911 145115 145201 144695 143388 141883 141029 140906 140957 141023 141451 142106
57391 142106 142219 141606 141186 141711 142701 143427 144345 146628 150455 154648 158015 160333 161934 163027 163690 164059
57375 164059 164147 163738 162730 161426 160293 159520 158950 158362 157660 156820 155802 154661 153700 153297 153446 153632 153409
57358 153409 152993 152982 153607 154633 155985 157911 160383 162798 164622 165933 167050 167990 168682 169349 170134 170577
57342 170577 170024 168577 167171 166615 166876 167347 167540 167357 166913 166256 165294 164001 162656 161726 161485 161901 162876
57325 162876 164266 165686 166660 167203 167842 168790 169541 169637 169426 169593 170232 170930 171504 172121 172886 173916 175633 178318
57307 178318 181359 183668 184907 185784 186993 188499 190049 191775 193931 196443 199073 201712 204187 206127
57293 206127 207263 207662 207428 206545 205266 204325 204346 205192 206201 206923 207339 207590 207829 208315 209248 210469 211516
57276B11516N33J15J99R47K171L343L989M139M220M463M709M843N049N427N709
57261B61372N648N442N404N402N056M370L845L806M020M107M076M208M567M960
57247C26283N225N317N090M415L597L266L667M312M690M980N653O507O732N992
57233C95726M953M437M471M522M372M265M296M125L577L158L602M896O157O651
57219D59208O673P071Q080R104R691J0152J0901J1702J2100J2199J2432J2755
57207E82068J2757J2458J2342J2560J2810J3102J3935J5393J6703J7175J7131
57196G38434J7488J8655K0297K1848K2914K3380K3516K3852K4619K5480K5920
57185I86403K5738K4969K3657K1971K0261J8625J6709J4380J2352J1586J2175
$$ plain form
57276 211516 212049 212164 212363 213310 215481 218824 222813 226952 231172 235635 240344 245187 250236 255663 261372
57261 261372 267020 272462 277866 283268 288324 292694 296539 300345 304365 308472 312548 316756 321323 326283
57247 326283 331508 336825 341915 346330 349927 353193 356860 361172 365862 370842 376495 383002 389734 395726
57233 395726 400679 405116 409587 414109 418481 422746 427042 431167 434744 437902 441504 446400 452557 459208
57219 459208 465881 472952 481032 490136 499827 509979 520880 532582 544682 556881 569313 582068
57207 582068 594825 607283 619625 632185 644995 658097 672032 687425 704128 721303 738434
57196 738434 755922 774577 794874 816722 839636 863016 886532 910384 935003 960483 986403
57185 986403 1012141 1037110 1060767 1082738 1102999 1121624 1138333 1152713 1165065 1176651 1188826
57174A188826J3336J4567J6308J9128K2656K5640K7098K7201K6972K7318K8389
57163A437439K9735L0732L0818K9750K7909K6188K5254K5021K5125K5602K6627
57152A740200K7779K8290K8052K7755K7932K8398K8808K9156K9513K9788K9992
57141B055663L0238L0291K9664K8431K7370K7010K7154K7665K8942L1072L3123
57130B376623L4035L3851L3424L3267L3310L3500L4099L5503L8182M2492M8181
57119B776467N4460O1093O8927P8685Q9496R9248J06353J10875J14272J18577
57109C678453J25406J35295J48090J64313J85669K13857K49472K92679L44464
57100E537698M06864M82665N75642O90363Q30481R96855J186933J394732J610820
$$ plain form
57174 1188826 1202162 1216729 1233037 1252165 1274821 1300461 1327559 1354760 1381732 1409050 1437439
57163 1437439 1467174 1497906 1528724 1558474 1586383 1612571 1637825 1662846 1687971 1713573 1740200
57152 1740200 1767979 1796269 1824321 1852076 1880008 1908406 1937214 1966370 1995883 2025671 2055663
57141 2055663 2085901 2116192 2145856 2174287 2201657 2228667 2255821 2283486 2312428 2343500 2376623
57130 2376623 2410658 2444509 2477933 2511200 2544510 2578010 2612109 2647612 2685794 2728286 2776467
57119 2776467 2830927 2892020 2960947 3039632 3129128 3228376 3334729 3445604 3559876 3678453
57109 3678453 3803859 3939154 4087244 4251557 4437226 4651083 4900555 5193234 5537698
57100 5537698 5944562 6427227 7002869 7693232 8523713 9520568 10707501 12102233 13713053
57091A3713053J824103K025897K212659K384308K540543K679205K796682K888457
57083C3064907K949391K971865K937533K807125K525461K051710J395063O20729
57075E1323784j82663r43943j624429k206053k676183l024394l246276l345554
57067C4074289l333578l228206l051452k825826k571580k305827k042088j789961
57059A2925771j556007j345030j159707r99450q61379p42933o42638n58539m87463
57050D572625m26485l74101l29482k91521k59079k31260k06948j84848j64492
57041B104409j46440j31001j17414j04781r3065q2560p2972o3705n4655m6156
57031A191660l8342l1022k3873j6340p694K516J4042K5904L5887L9931L3334J4254
$$ plain form
57091 13713053 15537156 17563053 19775712 22160020 24700563 27379768 30176450 33064907
57083 33064907 36014298 38986163 41923696 44730821 47256282 49307992 50703055 51323784
57075 51323784 51141121 50197178 48572749 46366696 43690513 40666119 37419843 34074289
57067 34074289 30740711 27512505 24461053 21635227 19063647 16757820 14715732 12925771
57059 12925771 11369764 10024734 8865027 7865577 7004198 6261265 5618627 5060088 4572625
57050 4572625 4146140 3772039 3442557 3151036 2891957 2660697 2453749 2268901 2104409
57041 2104409 1957969 1826968 1709554 1604773 1511708 1429148 1356176 1292471 1237816 1191660
57031 1191660 1153318 1122296 1098423 1082083 1074389 1076905 1090947 1116851 1152738 1192669 1226003 1240257
57019A240257j3655m2759o5957p9874q4574q1725p3661o3292n3441m5556l9233
57008E96530l3426k8057k4138k2181k1081j9099j5843j2584j0599r835r497r191
56996C80999q913q398p319o001n210n053m715l476j575L11K003L867O028P915
56982C50463Q652P736N356K094j658n922j0615j4849j7138j6690j4344j1820j0047
56969B71218q594o696m348k014K24K601M985O931Q511J0501J3318J6239J8082
56956C30958J8381J7338J4833J0220L398m415j1423j6484j9411k0312j9309j6927
56944B86847j4098j1434q759n746k713k23J909M595Q210J1986J4964J7154J9233
56931C21925K1445K3204K3528K1343J5669O367n025j5782k3624k7823k8869k7676
$$ plain form
57019 1240257 1226602 1183843 1117886 1038012 953438 871713 798052 734760 681319 635763 596530
57008 596530 563104 535047 510909 488728 467647 448548 432705 420121 409522 399687 390190 380999
56996 380999 372086 363688 356369 350368 345158 340105 335390 331914 330339 330650 332653 336520 342548 350463
56982 350463 359115 366851 372207 374301 372643 366721 356106 341257 324119 307429 293085 281265 271218
56969 271218 262624 255928 251580 249566 249790 252391 257376 264307 272818 283319 296637 312876 330958
56956 330958 349339 366677 381510 391730 395128 390713 379290 362806 343395 323083 303774 286847
56944 286847 272749 261315 252556 246810 244097 243874 245783 250378 258588 270574 285538 302692 321925
56931 321925 343370 366574 390102 411445 427114 433481 428456 412674 389050 361227 332358 304682
56919C04682k5232k2396j9567j6732j3905j1180q437n587l207k208k486k667j702
56906A69376j29R10J264J585K031K139J797J412J162J067J656L602O386Q450R139
56891B11847R575J1033J3218J4983J6107J7266J8513J8860J7397J4047R065K658
56879C74569m426j0593j4350j5427j4562j2481r495n938k354R36M152P722J1824
56866C09577J6324K0913K5180K8878L2238L5809L9614M2628M3257M0202L2743
56855F67363K0705N006j1750k6025l5281l9087l8444l4560k8551k1618j4612p544
56843D35602J2Q023J5925K3411L0767L8325M5980N3391O0257O6105O9887O9985
56831I17670O4564N2111L2265O717k0638m4928o2278p1229p2698o8846o1764n2852
$$ plain form
56919 304682 279450 257054 237487 220755 206850 195670 187233 181646 178439 176231 173745 171078 169376
56906 169376 169247 170157 171421 173006 175037 177176 178973 180385 181547 182614 184270 187872 194258 202708 211847
56891 211847 221422 232455 245673 260656 276763 294029 312542 331402 348799 362846 371911 374569
56879 374569 370143 359550 345200 329773 315211 302730 293235 287297 284943 285879 290031 297753 309577
56866 309577 325901 346814 371994 400872 433110 468919 508533 551161 594418 634620 667363
56855 667363 688068 693074 681324 655299 620018 580931 542487 507927 479376 457758 443146 435602
56843 435602 435614 443637 459562 482973 513740 552065 598045 651436 711693 777798 847685 917670
56831 917670 982234 1034345 1066610 1073327 1052689 1007761 945483 874254 801556 732710 670946 618094
56819F18094m2919l2561k2355j2771m043L922J1399J8538K5184L1158L6662M2101
56807F72409M7179N0246M8780M0732K5723N463j6696l6814n1730o0051o2226n9783
56795F03232n4417m7413l9612l1616k3922j6830j0438m796L0M273Q536J3155J7594
56782D17776K0991K3198K4607K4760K1903J4530L148r866k1838l0908l6222l7917
56770D14162l7001l4716l1827k8624k5331k2096j8776j5259j2005r772q791q480
56758A61484q071p244o180n291m828m569l942k765j591j061j108j199j138j114
56744A11383j112q03j22N33P75N51O1l57l58kR1m88j182j110l16K60J57n2K54
56725A08163R29J474J693J576J102N75N89J180J491Q33k54n79K02J205J467J021
$$ plain form
56819 618094 575175 542614 520259 507488 503445 507367 518766 537304 562488 593646 630308 672409
56807 672409 719588 769834 818614 859346 885069 890532 873836 837022 785292 725241 663015 603232
56795 603232 548815 501402 461790 430174 406252 389422 378984 374188 374218 378491 387027 400182 417776
56782 417776 438767 461965 486572 511332 533235 547765 550913 541047 519209 488301 452079 414162
56770 414162 377161 342445 310618 281994 256663 234567 215791 200532 188527 178755 169964 161484
56758 161484 153413 146169 139989 134698 129870 125301 121359 118594 117003 115942 114834 113635 112497 111383
56744 111383 110271 109468 109346 109879 110654 111205 111266 110909 110551 110549 110640 110152 108970 107860 107544 107804 107961 107909 108163
56725 108163 109092 110566 112259 113835 114937 115512 116101 117281 118772 119605 119351 118772 118974 120179 121646 122667
56709A22667O73R21J425J541J226J080J379J537R37l7l99Q5O71P52M87K15l1j58
56691A34971J27O83Q23K98k03n4L81M29K00K66N89O39L18N8P8K11M14P76R86N04
56671A42494n29j167p73J77P35O20L71M38N70K36m33m83Q03K760L735K895J220
56654A53669L78Q22J534J472P14K4j24J57N61R42J240J362J215Q52N33M79O12
56637A66442O55N20L72K88Q3l37p15p71n59l17j54j66n80j427k218k333j719q72
56619A56192j74L46O41M51k80j125j542j401r75n53k36o8j54m91q02p20k36J50
56601A49023o5p22j013k76J239K502K538J298j87o47K62J594K114J522M45n05
56585A59122j181j490j212m48K74O61R80J412J572J056J52m82o05m61k72m9K50
$$ plain form
56709 122667 123340 124261 125686 127227 128453 129533 130912 132449 133386 133349 132950 133035 133706 134458 134945 135160 135129 134971
56691 134971 135098 135781 136604 136902 136699 136645 137026 137455 137655 137921 138510 139149 139467 139525 139603 139814 140228 141004 141990 142494
56671 142494 141965 140798 140025 140202 140937 141557 141928 142366 142936 143172 142739 142256 143059 145819 149554 152449 153669
56654 153669 154047 154869 156403 157875 158589 158613 158489 158646 159207 160149 161389 162751 163966 164818 165351 165830 166442
56637 166442 167097 167617 167989 168277 168360 168023 167308 166537 165978 165661 165507 165341 164761 163334 161116 158783 157064 156192
56619 156192 156018 156364 157005 157456 157176 156051 154509 153108 152133 151580 151344 151276 151122 150631 149829 149109 148873 149023
56601 149023 148958 148236 147223 146947 148186 150688 153226 154524 154337 153690 153952 155546 157660 159182 159627 159122
56585 159122 157941 156451 155239 154791 155065 155726 156706 158118 159690 160746 160898 160416 159811 159350 159078 159029 159279
56568A59279P25J557K719L847M628N152N646O120O648P583R111J0745J1745J1809
56554B47314J1006R233O379K878l93k775m093m353l705k660j855j538j556j801
56540B52081k308k929l326l355l196l079l043k998k811k441k101k081k291k304
56526B13818k051j999k329k426j792r39o86r17q64m41l32q25j405j680j880k212
56510A91040k442k350k056j625q78J49J011J320J071M42k83o22k57M77R08Q79
56494A86784O79K96m19r25l83Q50J284K87r25j012k85R1j09j84J28L70K92J69
56476A86988J65J63K05N70J284J991K339K222J750J245J126J430J644J373Q54
56461B05349N34M26L64N15J019J417J097J98n76r30j123j229r81m23J9K76P71
$$ plain form
56568 159279 160004 161561 164280 168127 172755 177907 183553 189673 196321 203904 213015 223760 235505 247314
56554 247314 258320 267553 273932 276810 276417 273642 269549 265196 261491 258831 256976 255438 253882 252081
56540 252081 249773 246844 243518 240163 236967 233888 230845 227847 225036 222595 220494 218413 216122 213818
56526 213818 211767 209768 207439 205013 203221 202282 201596 200679 199815 199374 199042 198217 196812 195132 193252 191040
56510 191040 188598 186248 184192 182567 181689 181838 182849 184169 185240 185682 185399 184777 184520 184997 185905 186784
56494 186784 187463 187759 187340 186415 186032 186882 188166 188453 187528 186516 186231 186322 186213 186029 186157 186527 186819 186988
56476 186988 187153 187316 187521 188091 189375 191366 193705 195927 197677 198922 200048 201478 203122 204495 205349
56461 205349 205883 206309 206673 207188 208207 209624 210721 210919 210343 209413 208290 207061 206080 205657 205676 205952 206723
56444B06723J558J957J463N41K2N6J04k34p76j054p75o6N98P19K39m38r14j104
56426B08619j046p12j99J49J06j25k00j08o5n8J18M30N67M21K72L48N13N85O70
56407B10285R20J178J161R42P71O21K71l1L35J387K156J819Q89O00J246J813J431
56390B27794N55K77R22J781K101J804J237O29L3m25n56l22Q5N23J052J696K151
56373B41337K005J297N71K68K72K58J86K10K76K27J83L84O98P06L95L44J023K194
56355B52834L150L409L001K309J700J269Q60L75K8O9M38Q89J367J923K381K504
56339B78506K447K586K779K430J447P07J153K636M022M303L485K469K172K653
56325C13795L117K918K404K419L065L497L026J960J094Q09Q31O16j95j389k163
$$ plain form
56444 206723 208281 210238 211701 212242 212264 212320 212424 212190 211414 210360 209585 209519 210117 210836 211075 210637 209723 208619
56426 208619 207573 206861 206662 206811 206917 206792 206592 206484 206419 206361 206479 206909 207476 207897 208169 208517 209030 209615 210285
56407 210285 211205 212383 213544 214486 215257 215878 216149 216118 216453 217840 219996 221815 222704 223304 224550 226363 227794
56390 227794 228349 228626 229548 231329 233430 235234 236471 237100 237133 236708 236152 235830 235915 236438 237490 239186 241337
56373 241337 243342 244639 245210 245478 245750 246008 246194 246404 246680 246907 247090 247474 248172 248878 249273 249617 250640 252834
56355 252834 255984 259393 262394 264703 266403 267672 268532 268907 268935 269004 269442 270331 271698 273621 276002 278506
56339 278506 280953 283539 286318 288748 290195 290902 292055 294691 298713 303016 306501 308970 311142 313795
56325 313795 316912 319830 322234 324653 327718 331215 334241 336201 337295 338104 338935 339551 339356 337967 335804
56310C35804j875q81j95j92j94M85J640K643L291L740M001L900L401K708K251
56295C60527K526L543M435M306L527L429M454N489N511N007N065N797O549P021
56281D27186P357P515P448P559Q192Q936R221R271R710J0567J1511J2718J4521
56268E51712J6390J7376J7520J7855J9000K0649K2558K4994K8012L1123L4094
56257H01283L7301M1097M5421N0293N5995O2565O9766P7739Q6955R7250J07724
56246A533389J17921J28373J39477J50463J60036J67522J72853J75830J75913
56237B921777J72508J65151J53640J38201J19173R6455O9842M0121R172k1309
56227C864731n0561p7897j01942j21448j36347j47293j54641j58596j59918j59448
$$ plain form
56310 335804 333929 333048 332853 332661 332467 332952 334592 337235 340526 344266 348267 352167 355568 358276 360527
56295 360527 363053 366596 371031 375337 378864 382293 386747 392236 397747 402754 407819 413616 420165 427186
56281 427186 434543 442058 449506 457065 465257 474193 483414 492685 502395 512962 524473 537191 551712
56268 551712 568102 585478 602998 620853 639853 660502 683060 708054 736066 767189 801283
56257 801283 838584 879681 925102 975395 1031390 1093955 1163721 1241460 1328415 1425665 1533389
56246 1533389 1651310 1779683 1919160 2069623 2229659 2397181 2570034 2745864 2921777
56237 2921777 3094285 3259436 3413076 3551277 3670450 3766905 3836747 3876868 3886040 3864731
56227 3864731 3814170 3736273 3634331 3512883 3376536 3229243 3074602 2916006 2756088 2596640
56217B596640j57105j52256j45152j37122j29090j20689j11222j01024r1388q3332
56207A368260p6821p1120o5563n9902n4111m8204m2474l7688l4479l2414l0137
56196H15347k6848k3278k0688j9195j7794j5903j4077j2906j1999j0603q790p289
56184F25977o384n627m710l951l737l884l931l715l294k585j491l36K69P5n41
56169E82135r18n93N07J966L061L393L362L663M394N111N674O366P126P431P294
56154F39972P615Q979J0707J1766J2151J2713J3985J5980J8870K2997K8196L3819
56142H37750L9510M5504N2150N9616O7958P6887Q5491R2628R7507R9373R7013
56131A651387Q9526P7748O4276N1864M2167L5727L2151K9951K7085K2190J5185
$$ plain form
56217 2596640 2439535 2287279 2142127 2005005 1875915 1755226 1644004 1542980 1451592 1368260
56207 1368260 1291439 1220319 1154756 1094854 1040743 992539 950065 912377 877898 845484 815347
56196 815347 788499 765221 744533 725338 707544 691641 677564 664658 652659 642056 633266 625977
56184 625977 619593 613966 609256 605305 601568 597684 593753 590038 586744 584159 582668 582332 582601 582676 582135
56169 582135 581217 580624 581131 583097 586158 589551 592913 596576 600970 606081 611755 618121 625247 632678 639972
56154 639972 647587 656566 667273 679039 691190 703903 717888 733868 752738 775735 803931 837750
56142 837750 877260 922764 974914 1034530 1102488 1179375 1264866 1357494 1455001 1554374 1651387
56131 1651387 1740913 1818661 1882937 1934801 1976968 2012695 2044846 2074797 2101882 2124072 2139257
56120B139257O661k597j1388j8288k2717k5560k8486l2985m0066n0029o1882p3343
56108A778577q1942q6194q5778q1238p3800o5015n6018m7335l9337l2484k6821
56097A102615k1805j7066j2983j0106q276o719m816k537k87J445K496L244M275
56084A029480N706P105Q062Q534Q581Q212P686P511P908Q596R285J0053J1041
56071A137760J2096J2963J3574J3964J4169J4308J4524J4774J4973J5266J5879
56060A294250J6699J7392J7911J8478J9137J9794K0603K1789K3064K3854K4060
56049A517031K4015K3763K3045K2038K1392K1354K1630K2104K3013K4270K5478
56038A769133K6710K8467L0605L2218L2964L3610L4914L6682L8360L9834M1165
$$ plain form
56120 2139257 2145918 2143321 2131933 2113645 2090928 2065368 2036882 2003897 1963831 1913802 1851920 1778577
56108 1778577 1696635 1610441 1524663 1443425 1369625 1304610 1248592 1201257 1161920 1129436 1102615
56097 1102615 1080810 1063744 1050761 1040655 1032379 1025660 1020844 1018307 1018020 1019465 1021961 1025205 1029480
56084 1029480 1035186 1042291 1050353 1058887 1067468 1075680 1083366 1090877 1098785 1107381 1116666 1126719 1137760
56071 1137760 1149856 1162819 1176393 1190357 1204526 1218834 1233358 1248132 1263105 1278371 1294250
56060 1294250 1310949 1328341 1346252 1364730 1383867 1403661 1424264 1446053 1469117 1492971 1517031
56049 1517031 1541046 1564809 1587854 1609892 1631284 1652638 1674268 1696372 1719385 1743655 1769133
56038 1769133 1795843 1824310 1854915 1887133 1920097 1953707 1988621 2025303 2063663 2103497 2144662
56027B144662M2269M3277M4636M6474M8409N0262N2289N4486N6406N7940N9589
56016B700699O1686O4071O6691O9749P3100P6352P9755Q4077Q9357R4766R9838
56005C560141J04874J09980J14963J20257J26673J33959J41015J47787J55471
55996D715120J64512J74020J83565J93803K04819K15813K27184K40919K57900
55987F577655K76722K96283L17634L42006L68936L97845M29646M65195N03895
55978I975817N45498N91798O45032P06077P75584Q55189R46244J049354J166697
55969A7257290J302968J462822J649986J870733K135790K457228K846855L320586
55961C4304258L902023M619604N503241O585079P896350R455073J1257358J3286547
$$ plain form
56027 2144662 2186931 2230208 2274844 2321318 2369727 2419989 2472278 2526764 2583170 2641110 2700699
56016 2700699 2762385 2826456 2893147 2962896 3035996 3112348 3192103 3276180 3365537 3460303 3560141
56005 3560141 3665015 3774995 3889958 4010215 4136888 4270847 4411862 4559649 4715120
55996 4715120 4879632 5053652 5237217 5431020 5635839 5851652 6078836 6319755 6577655
55987 6577655 6854377 7150660 7468294 7810300 8179236 8577081 9006727 9471922 9975817
55978 9975817 10521315 11113113 11758145 12464222 13239806 14094995 15041239 16090593 17257290
55969 17257290 18560258 20023080 21673066 23543799 25679589 28136817 30983672 34304258
55961 34304258 38206281 42825885 48329126 54914205 62810555 72265628 83522986 96809533
55953I6809533J5532845J8004350K0723179K3710653K6952438L0318210L3422296
55946B65473504L5471243L5241483L1377702K3053478J0685982l848460j7822251
55939C79632681k8785406l5473828l7968323l7208565l4367890l0466432k6249463
55932A49112774k2191952j8544203j5400168j2765215j0597916q831946p396019
55925E3385355o228875n279905m504207l864459l334356k894479k526516k214651
55917B2537907j948905j722423j527463j357192j208783j081084r70954q74674
55909A1846429p90650p17828o53316n94325n40736m93319m51196m13342l80617
55900F811100l53599l30079l07339k85485k66086k48850k32154k15802k00723
$$ plain form
55953 96809533 112342378 130346728 151069907 174780560 201732998 232051208 265473504
55946 265473504 300944747 336186230 367563932 390617410 401303392 397454932 379632681
55939 379632681 350847275 315373447 277405124 240196559 205828669 175362237 149112774
55932 149112774 126920822 108376619 92976451 80211236 69613320 60781374 53385355
55925 53385355 47156480 41876575 37372368 33507909 30173553 27279074 24752558 22537907
55917 22537907 20589002 18866579 17339116 15981924 14773141 13692057 12721103 11846429
55909 11846429 11055779 10337951 9684635 9090310 8549574 8056255 7605059 7191717 6811100
55900 6811100 6457501 6127422 5820083 5534598 5268512 5019662 4787508 4571706 4370983
55891D370983j86824j73300j60474j49203j39123j29247j19701j11199j03511
55882C098401r6055q9352q4355q1080p9310p9678q2294q5159q5708q3514p9967
55871B171929p5977p1615o7393o4135o1724n9392n6938n4472n1587m8080m4927
55860A515689m3050m1662l9352l6308l3887l2351l0744k8791k7177k6007k4629
55849A151731k3180k2716k3449k4166k3978k3409k3279k3443k3171k2215k0910
55838H97815j9697j8783j8083j7364j6643j6107j5451j3881j1335r118q511r178
55826G23664r798r834r762r919j0101j0230j0465j0744j0946j1289j1860j1997
55814E96719j1056r546q549q241p941p464p296p386o897n411l591k276j591j138
$$ plain form
55891 4370983 4184159 4010859 3850385 3701182 3562059 3432812 3313111 3201912 3098401
55882 3098401 3002346 2912994 2828639 2747559 2668249 2588571 2506277 2421118 2335410 2251896 2171929
55871 2171929 2095952 2024337 1956944 1892809 1831085 1771693 1714755 1660283 1608696 1560616 1515689
55860 1515689 1472639 1430977 1391625 1355317 1321430 1289079 1258335 1229544 1202367 1176360 1151731
55849 1151731 1128551 1105835 1082386 1058220 1034242 1010833 987554 964111 940940 918725 897815
55838 897815 878118 859335 841252 823888 807245 791138 775687 761806 750471 741353 732842 723664
55826 723664 713866 704032 694270 684351 674250 664020 653555 642811 631865 620576 608716 596719
55814 596719 585663 576117 567568 559327 551386 543922 536626 529240 522343 516932 513341 511065 509474 508336
55800E08336n23N04J843K926L177K638J776Q93J62j16J39M29K93J3L6Q8l85j223
55782E21006j862k410l491n273p527j0373j3879j7152j8855j8713j7519j5795
55770C88157j3507j0961q795o998n089l358k702l107l558l642l896m233l540j447
55756C13324Q71K519M157O449Q474Q925Q000O707N027K222j343m237n807o732
55742C48556p650q253q172p758p445o977n904m475l446l110k997k604k051j795
55728B75919j991k474l263m512n840o312n495m148l301k997k631k177k146k466
55714B26166k371j583p02p2Q13K284L648M028L532K985K804K740K351J294n60
55699B47357k815m624n503n814o099o196n574m266k980k301k175k129j723q51
$$ plain form
55800 508336 507813 508317 510160 513086 516263 518901 520677 521570 521732 521616 521755 522184 522477 522490 522526 522614 522229 521006
55782 521006 519144 516734 513243 507970 500443 490070 476191 459039 440184 421471 403952 388157
55770 388157 374650 363689 354894 347896 342807 339449 336747 333640 330082 326440 322544 318311 314771 313324
55756 313324 314195 316714 320871 327320 335794 344719 352719 359426 364453 366675 365332 361095 355288 348556
55742 348556 340906 332653 324481 316723 309278 302301 296397 291922 288476 285366 282369 279765 277714 275919
55728 275919 273928 271454 268191 263679 257839 251527 246032 241884 238583 235586 232955 230778 228632 226166
55714 226166 223795 222212 221510 221438 222251 224535 228183 232211 235743 238728 241532 244272 246623 247917 247357
55699 247357 244542 239918 234415 228601 222502 216306 210732 206466 203486 201185 199010 196881 195158 194307
55685A94307J92J030J652K387L298L956M020L720L442L166K599J673O25k78q36
55670B24953r47p83p27r47j193j204j042q49n76j85J65L94O64J060J366J412J378
55653B22939J492J688J751J558R83n3j209j832j674j193q37o23o14j245k535l586
55637B15010l588l037l157m312n632o176n837n136m649m619m711m227k961j668
55623A55300j170j222r67k86O4l66j109j583j795j979k097j999j727j420j218
55608A36426j333j870k445k476j929j356j048p13k28q5o61j493j797j444r18n81
55592A16049m25m58p58j126j130o45j9L68M82M67L31M1k32j70L00Q51J042P61
55574A15729L73M01J075K130K998L268K974K563K444K596K643K224J329K03q40
$$ plain form
55685 194307 194499 195529 197181 199568 202866 206822 210842 214562 218004 221170 223769 225442 226067 225789 224953
55670 224953 224006 223223 222496 221549 220356 219152 218110 217261 216685 216500 216665 217059 217723 218783 220149 221561 222939
55653 222939 224431 226119 227870 229428 230411 230358 229149 227317 225643 224450 223613 222990 222376 221131 218596 215010
55637 215010 211422 208385 205228 200916 195284 189108 183271 178135 173486 168867 164156 159929 156968 155300
55623 155300 154130 152908 151941 151655 151719 151353 150244 148661 146866 144887 142790 140791 139064 137644 136426
55608 136426 135093 133223 130778 128302 126373 125017 123969 123256 123028 122943 122282 120789 118992 117548 116630 116049
55592 116049 115624 115166 114408 113282 112152 111507 111488 111856 112338 112805 113136 113177 112945 112775 113075 113926 114968 115729
55574 115729 116102 116503 117578 119708 122706 125974 128948 131511 133955 136551 139194 141418 142747 142950 142110
55559A42110j541j758j564j214j018j190j744k395k643k210j446r55q82q29o12
55544A20109n65q31q57q4J081J634J220N10K67N19Q60J126J487K001K399K347
55528A33223J844J290J088J166J030L76n34j261j670j898k031k158k501l077l398
55513A21489k931j856r69p91j146j639k112k487k555k120j235k48K98o7j223k296
55497I8112k445j800j201r98o92L5O11L17o49j374j310o96n6L21M21L86L63L01
55479H9646m8p07j200j018l03K61K93J37K72N72M64k62j096j426j224q83n41M9
55461H2986Q89J417J129K39n46p78m30L65J266J601R49j31n88k28Q3k41o66m88
55443H6828J3J18j50j24L77Q39R78J148J595J859J298p9j532k199j749o48J53
$$ plain form
55559 142110 140569 138811 137247 136033 135015 133825 132081 129686 127043 124833 123387 122432 121550 120721 120109
55544 120109 119544 118713 117856 117772 118853 120487 121707 122217 122484 123003 123863 124989 126476 128477 130876 133223
55528 133223 135067 136357 137445 138611 139641 140017 139483 138222 136552 134654 132623 130465 127964 124887 121489
55513 121489 118558 116702 115733 114942 113796 112157 110045 107558 105003 102883 101648 101400 101698 101631 100408 98112
55497 98112 95667 93867 92666 91668 90976 91011 91622 91939 91290 89916 88606 87910 87854 88175 88596 88982 89345 89646
55479 89646 89598 88891 87691 86673 86370 86631 86924 87061 87333 87905 88369 88107 87011 85585 84361 83478 82937 82986
55461 82986 83875 85292 86421 86660 86114 85336 84906 85271 86537 88138 89087 88956 88368 88140 88223 87982 87316 86828
55443 86828 86841 86959 86809 86685 87062 87901 88879 90027 91622 93481 94779 94700 93168 90969 89220 88572 88725
55426H8725R0m64p06m60k76m16l54L86J333J618J187Q67J154J485R99k78j405
55409I3485j619j142q12j072j524j512r19k08K23L99M40K27k65n97l02L84O92
55392H5878L84J08M04Q22N52l18q68o33k05l00p54q45k99M32P82O38L41L03N94
55373H7016P57K64p57j456j230m57N3J25K54O95J050Q60J62o21j074r82m74p5
55355H4110k53q17j096q05l69k71n11q41j117j087l78Q92J820J647P06k3j94k93
55337H1120o73r95q15k20L70P08P68N75K89K74P28J328J443Q11j53q45j085j153
55319H2475j209j006l38M17O35K77j0K40P12Q56O90O19P42P34L86j59o26p36k42
55300H4457P08J333R21j63p23k18N76P14L27K05N63Q59O72J50l88p57p84l71J81
$$ plain form
55426 88725 88815 88351 87645 87185 86909 86493 86139 86525 87858 89476 90663 91530 92684 94169 95168 94890 93485
55409 93485 91866 90724 89912 88840 87316 85804 84885 84677 84900 85299 85739 85966 85701 85104 84802 85186 85878
55392 85878 86262 86370 86774 87596 88148 87830 86962 86329 86124 85824 85070 84225 83926 84358 85140 85778 86119 86422 87016
55373 87016 87773 88037 87280 85824 84594 84137 84190 84315 84569 85264 86314 87174 87336 86715 85641 84659 84185 84110
55355 84110 83857 83040 81944 81139 80770 80499 79988 79147 78030 76943 76565 77457 79277 80924 81630 81607 81413 81120
55337 81120 80447 79452 78637 78417 78787 79495 80263 80838 81127 81401 82129 83457 84900 85711 85558 84713 83628 82475
55319 82475 81266 80260 79922 80339 80974 81251 81241 81481 82193 83049 83739 84358 85100 85834 86220 86061 85435 84699 84457
55300 84457 85165 86498 87419 87256 86533 86315 86891 87605 87932 88137 88700 89559 90231 90381 89993 89236 88452 88081 88262
55281H8262L91L00M46R51J101K98r61j617j344p30k70J87Q24J275J094M34j00
55264I0541j40K19O51Q25N40j4k24L46J356J974J730Q43j81r65j338j377j424
55247I3362j642j633q75L31R89O45rj04L33P10P77O57K92m05j025r54k28M51O29
55228I2301M92L28J69R0K68N13K94m55r98p35k0M05L95K77J8p24j733k111j304
55209H7470J91J433J962J902J441O92j26p37j055j175j089p06r7M54P71R03Q91
55192I3125O17P5m55p10p35p05n63j64L41N49L17j15m86p48q15n59j44m4m11p58
55172H7612o03j07K65N12R94J647J894J439O86K09J22J76K07K24K36K01P6j38
55154I5652l24k74J07N07M26k56j041j319r51l06J98M18M69M77L95J25k66n19
$$ plain form
55281 88262 88653 88953 89399 90350 91451 91749 90788 89171 87827 87097 86827 87014 87838 89113 90207 90641 90541
55264 90541 90401 90620 91271 92096 92636 92622 92398 92744 94100 96074 97804 98647 98466 97501 96163 94786 93362
55247 93362 91720 90087 89212 89543 90532 91177 91168 91064 91397 92107 92884 93541 93833 93428 92403 91449 91221 91672 92301
55228 92301 92793 93121 93290 93380 93648 94161 94455 94000 93002 92267 92247 92652 93047 93324 93342 92618 90885 88774 87470
55209 87470 87661 89094 91056 92958 94399 95091 94965 94228 93173 91998 90909 90203 90106 90560 91331 92234 93125
55192 93125 93742 93817 93362 92652 91917 91212 90649 90485 90826 91375 91692 91577 91091 90343 89528 88969 88825 88781 88370 87612
55172 87612 87009 86902 87167 87679 88673 90320 92214 93653 94339 94548 94670 94846 95053 95277 95513 95714 95790 95652
55154 95652 95328 95054 95161 95668 96094 95838 94797 93478 92527 92221 92419 92837 93306 93783 94178 94303 94037 93518
55136I3518m74j94K55R05J529J545P19k81n40l6M40M32L02M66P83Q69N90m8q77
55117I9903j378j026j26L56N6l45l03k12m34m28K79R52O08l56p30m12m45j086
55099I4873j249k16J212J874J603Q40j89j183j420o06M28P36N67Q47J636K047
55083A01800J660J135J206J719J947J480M90m99j034j061r31r02o92J16J252J804
55067A09490J305L27k34j97p0j95l86l70k31k38m46o77p47n57k5P13J142P38k83
55048A09059r28n24L94P00Q5o71q67o93o50o93m71o8L6l02o88p17l64J27M83N07
55028A03755K05j62l30l27k93k16m8L5j61m00j76N92J365J620J367Q56J23q34
55010A06971j596j514n08N93Q00M4p65q44l91j02j32j2M57R01J086J266J522J328
$$ plain form
55136 93518 93044 92850 93105 94010 95539 97084 97803 97522 96982 96946 97386 97818 98120 98586 99369 100238 100828 100780 99903
55117 99903 98525 97499 97373 97729 97785 97440 97137 96925 96491 96063 96342 97294 97902 97546 96816 96404 95959 94873
55099 94873 93624 93408 94620 96494 98097 98937 98748 97565 96145 95539 95967 96703 97270 98117 99753 101800
55083 101800 103460 104595 105801 107520 109467 110947 111437 110938 109904 108843 107912 107010 106318 106434 107686 109490
55067 109490 110795 111122 110888 110691 110621 110426 110040 109670 109439 109201 108755 108078 107331 106774 106749 107462 108604 109342 109059
55048 109059 108131 107607 108001 108701 108786 108115 107248 106555 105905 105212 104741 104673 104709 104407 103719 103002 102638 102765 103248 103755
55028 103755 103960 103798 103468 103141 102848 102632 102584 102619 102458 102058 101882 102474 103839 105459 106826 107682 107805 106971
55010 106971 105375 103861 103353 103946 104746 104790 104025 103181 102790 102688 102556 102544 103001 103902 104988 106254 107776 109104
54992A09104L85o27q20l73k38q12j586k075k289k152j316J65J561K272K384K238
54976A05821J945J596J467J580J556J156N35j95j094j732j201O10K351K591J492
54961A18478L69l2pR1L28O41O53K44k60o52j066j448j401p65L4N23P21R25J218
54942A18594J340R57K6r56j160k68R98J542J072K06m67q62r53n53K34R03J161
54925A21814J198J163R22O09Q33J860L031L541L461L499L987M639N109N349N453
54910A66468N487N381M789L349J325m18j495k574m246n820o121n265m670n124
54896A51066n884n977n474m896m095k619q22L08M00Q0K2K05L94P76J648K656K932
54879A30720K142J064Q09J576K517K877K846L043L530L882M047M500N340N879
$$ plain form
54992 109104 109489 108862 108042 107669 107431 106619 105033 102958 100669 98517 97201 97366 98927 101199 103583 105821
54976 105821 107766 109362 110829 112409 113965 115121 115656 115461 114367 112635 111434 112044 114395 116986 118478
54961 118478 118847 118815 118808 118899 119227 119868 120521 120765 120505 119853 118787 117339 115938 115173 115207 115730 116451 117376 118594
54942 118594 119934 120891 120917 119961 118801 118533 119531 121073 122145 122351 121884 121022 120069 119516 119750 120653 121814
54925 121814 123012 124175 125097 125706 126539 128399 131430 134971 138432 141931 145918 150557 155666 161015 166468
54910 166468 171955 177336 182125 185474 186799 186381 184886 182312 178066 172246 166125 160860 156190 151066
54896 151066 145182 139205 133731 128835 124740 122121 121299 121607 122007 122087 122109 122314 122708 123484 125132 127788 130720
54879 130720 132862 133926 134735 136311 138828 141705 144551 147594 151124 155006 159053 163553 168893 174772
54865A74772N434M156K600R33r53k781m043m715n270n826n994n633n182m897m372
54850A38229l318k330k166k526k369j427o27p46j345j481r63l66q1N5K32L37K27
54833A19335Kj51j69p6J15L66N82O74N81L31J51L15P06P13l8j024j329q03k21
54814A20060j86m41m91m36p14j296j684j546r86k73L65O50M07j36m87m21j55P3
54796A12303L21O84R70Q92M96J52Q0Q4j61o43r98r08l90L33J063J582J650J284
54778A18794R75J246J935K247J630L78o63q00J04J548K625K770K376K367K972
54763A40504L475L426L405M071N057N617N883O470P074O591M759K626J031m32
54749A99557k401m552o111o891p101o620n333l858k999k655k086j303j237k264
$$ plain form
54865 174772 180206 184362 186962 187895 186942 184161 180118 175403 170133 164307 158313 152680 147498 142601 138229
54850 138229 134911 132581 130415 127889 125520 124093 123466 122720 121375 119894 118931 118565 118484 118539 118771 119108 119335
54833 119335 119337 119186 119017 118941 119056 119422 120004 120678 121259 121590 121741 122056 122762 123475 123437 122413 121084 120281 120060
54814 120060 119874 119433 118942 118506 117792 116496 114812 113266 112280 112007 112372 113022 113429 113293 112806 112385 112230 112303
54796 112303 112624 113308 114278 115170 115666 115818 115898 115982 115821 115178 114180 113272 112882 113215 114278 115860 117510 118794
54778 118794 119769 121015 122950 125197 126827 127205 126542 125742 125846 127394 130019 132789 135165 137532 140504
54763 140504 143979 147405 150810 154881 159938 165555 171438 177908 184982 191573 196332 198958 199989 199557
54749 199557 197156 192604 186493 179602 172501 165881 160548 156690 153691 151036 148950 147647 146410 144146
54735A44146l425l550k648j594r04m31p3rk07j97L17J009J415J602K037K808L406
54718A43702L398L049L030L628M468M978M889M336L655L126K701J939M53j550
54704A85802l351m428m894n175n474n695n661n227m357l317k621k494k545k233
54690A28330j487o25J82R12J262P95l10j108q63R2P62N72k36j109j708j930j725
54673A21806j109k86L45L78k16r29j090o14j00p9l38l89k99n30r77r12j75L15
54655A14801k00j034q10N97J751J472K71m17L3R95J613J677J471J235R74O51L73
54638A25453L32N39O98M82m7n33q23j090j379j360p66J62R37J259R99J13j065
54621A23911j747j493q02m65m99k95K76O16L60r6j86K05Q39J392J442P67j11k52
$$ plain form
54735 144146 140721 137171 134523 132929 132025 131594 131521 131512 131305 131108 131425 132434 133849 135451 137488 140296 143702
54718 143702 147100 150149 153179 156807 161275 166253 171142 175478 179133 182259 184960 186899 187352 185802
54704 185802 182451 178023 173129 167954 162480 156785 151124 145897 141540 138223 135602 133108 130563 128330
54690 128330 126843 126218 126400 127312 128574 129369 129059 127951 127088 127180 127942 128514 128278 127169 125461 123531 121806
54673 121806 120697 120411 120756 121134 120918 119989 118899 118285 118185 118106 117768 117379 117080 116550 115573 114661 114486 114801
54655 114801 114601 113567 112757 113354 115105 116577 116848 116431 116464 117459 119072 120749 122220 123455 124429 125080 125453
54638 125453 125785 126324 127022 127504 127457 126924 126101 125011 123632 122272 121506 121668 122605 123864 124863 124976 123911
54621 123911 122164 120671 119869 119404 118905 118610 118886 119502 119862 119766 119580 119785 120624 122016 123458 124225 124114 123862
54603A23862M94J189J016K90j77j94j07l6J58L86L86J68r2m71j077j564j386n32
54585A22313M42J015R99M14m70j061r54m78k47k89j42K30L14p0l62r3M44O53M17
54566A23075J41J86N59R50J008O87L15J35m7m04m84K82J516K055J343R8p01q29
54548A29885o04k80p9k73o94o72L6P64Q36N29N03P61R46J229K000K847K791J614
54530A42139J41q86j439j593j148k16N03M97N7k94m92o81p40n32k89l07m84n88
54512A33648p24j111j561j640j252o53L3Q36J554J767J356O74J18k13l96n02n90
54495A31344o88o88m54r3J02L8o7l8Kp3r1K28Q23J215R21n3j118j490q48L87J456
54474A30815J925J901J721J588J569J639J640J370Q15K58M4K63O71Q19M03l55
$$ plain form
54603 123862 124356 125545 126561 126851 126674 126480 126373 126337 126495 126881 127267 127435 127343 126872 125795 124231 122845 122313
54585 122313 122755 123770 124769 125183 124713 123652 122698 122220 121973 121684 121542 121772 122086 122016 121654 121561 122005 122658 123075
54566 123075 123216 123402 123961 124911 125919 126606 126921 127056 127009 126605 126121 126403 127919 129974 131317 131415 130714 129885
54548 129885 129281 129001 128922 128649 127955 127283 127319 128083 128919 129448 129951 130712 131658 132887 134887 137734 140525 142139
54530 142139 142280 141394 139955 138362 137214 136998 137501 137998 138055 137761 137269 136588 135848 135316 135027 134720 134236 133648
54512 133648 132924 131813 130252 128612 127360 126707 126740 127576 129130 130897 132253 132927 133045 132832 132436 131934 131344
54495 131344 130656 129968 129514 129421 129523 129561 129494 129456 129458 129385 129294 129522 130345 131560 132481 132428 131310 129820 128972 129359 130815
54474 130815 132740 134641 136362 137950 139519 141158 142798 144168 144983 145241 145285 145548 146219 147038 147441 147086
54458A47086p70m40J55J44o04j328j455j254j179j127q47n58n49n30j21K68r7
54441A36794r86j292o32P0m4n70o18j35K90M83P74J169J178N40l79r83q68K6J251
54422A36068J888J336J51m60r8M04K61j40J00R54J394P52m23j089r12l77N9M27
54404A40295P89Q02K22m27k63P84J747J784J164O75M93K15j77j33O20J537J909
54387A52036J588R02J75l51m13N9P42J182J279J243J129O67k77j265j634j327
54371A55735j083j473j932j321M82K195K658K172J738J537J125O77R02J582J450
54356A66444P4j187r10M07J068N01j45L20J736L063L627L618L654M073M498M173
54340A95014K911J491P80O13M8j224k419k730k465k623l606m718m982m202l080
$$ plain form
54458 147086 146316 145876 146031 146175 145571 144243 142788 141534 140355 139228 138381 137823 137274 136744 136623 136891 136794
54441 136794 135808 134516 133884 133954 133910 133340 132722 132587 132877 133360 134134 135303 136481 137021 136642 135659 134791 134817 136068
54422 136068 137956 139292 139443 138983 138885 139289 139550 139410 139510 140464 141858 142610 142187 141098 140186 139809 139868 140295
54404 140295 141084 141886 142108 141681 141418 142202 143949 145733 146897 147572 148065 148280 148103 147970 148590 150127 152036
54387 152036 153624 154526 154701 154350 153937 153996 154738 155920 157199 158442 159571 160238 159961 158696 157062 155735
54371 155735 154652 153179 151247 149926 150408 152603 155261 157433 159171 160708 161833 162510 163412 164994 166444
54356 166444 166518 165331 164421 164828 165896 166397 166252 166572 168308 171371 174998 178616 182270 186343 190841 195014
54340 195014 197925 199416 200196 200809 200857 199633 197214 194484 192019 189396 185790 181072 176090 171888 168808
54325A68808k359k023j521p02j82o07j731k558k370j392m54k03n73r59q52l67
54309A49955n7k19n86p45n77j64L30N23K0r56j498j097l26J7P2M60J062J109M66
54290A47789q7qL96O85Q72R76P37J69j99j18k9l04n65l23K13N06N19N45N41K19
54270A52534l47p06n31J61J087J697J405L42n22m65R9L62L68P29J376J524R56
54253A60069M15M41N86J95n83j027o82K86J338J843J474N48k81p98j319j945k215
54236A58345j771r47k91P7K61R8n41j218j217m40M46P90O10L79M25O20N87J88
54218A56401k42l21j60j72l02L1R63J696J500P83N04P96R10M52j49m68o03o45
54200A60974l50K30M57m2o75o55r1K15q9n82p37l85L79J229J557R54j32p23m44
$$ plain form
54325 168808 166449 164426 162905 162203 162021 161414 159683 157125 154755 153363 152909 152706 152133 151174 150322 149955
54309 149955 149898 149679 149093 148348 147771 147607 147937 148460 148480 147524 146026 144929 144603 144620 144692 145152 146214 147323 147789
54290 147789 147702 147694 148090 148775 149647 150623 151360 151529 151330 151212 151183 150879 150314 149991 150204 150710 151229 151774 152315 152534
54270 152534 152187 151481 150950 151111 152198 153895 155300 155642 155120 154655 154754 155116 155484 156213 157589 159113 160069
54253 160069 160484 160925 161511 161706 161123 160096 159414 159700 161038 162881 164355 164903 164622 163824 162505 160560 158345
54236 158345 156574 155627 155336 155413 155674 155772 155231 154013 152796 152356 152802 153592 154202 154581 155006 155626 156213 156401
54218 156401 156159 155838 155678 155506 155204 155235 156198 157894 159394 160177 160681 161477 162387 162839 162690 162222 161619 160974
54200 160974 160624 160854 161311 161269 160594 159939 159848 160063 159974 159392 158655 158270 158649 159878 161435 162389 162257 161534 161090
54181A61090O2J7o12j288j577j387q72m03l53o15n90M9Q64J219J061P29L04l68
54163A57330j054j215p43j64Q1R7J69K31Q0j88k67k9L41N78N65M47N21Q60J030
54144A58670M75p61j958k420k023j045J14R19R49M89L93R74J487J193M88K93O59
54127A58896P92L63r9j81j36k27k76j42k6K4L32Q75J009L73m35o24k09K90O95
54108A61294J058J128O78J57K21P42J014Q84Q43J056J061P01M27M21J79n48j114
54091A70202q54j73J2m38q05n90l5M39P07P95O77M37L35N59J014J434J597J426
54073A76739J027O29M37N20Q75J464K121K558K573K187J518P51K64M77J339K198
54057A97677K512K474K686L367M246N067N865O738P749Q928J0027J0375R298O867
$$ plain form
54181 161090 161152 161169 160557 159269 157692 156305 155433 155030 154677 154062 153472 153521 154385 155604 156665 157394 157698 157330
54163 157330 156276 155061 154318 154154 154235 154332 154501 154732 154812 154624 154357 154328 154669 155247 155812 156259 156780 157640 158670
54144 158670 159145 158384 156426 154006 151983 150938 151052 151971 152920 153409 153802 154776 156263 157456 157944 158237 158896
54127 158896 159688 160051 159952 159771 159635 159408 159132 158990 158964 158988 159320 160195 161204 161577 161142 160518 160309 160599 161294
54108 161294 162352 163480 164158 164315 164536 165278 166292 167176 168019 169075 170136 170837 171264 171685 171864 171316 170202
54091 170202 169348 169175 169187 168749 167944 167354 167319 167758 168465 169260 169937 170374 170709 171268 172282 173716 175313 176739
54073 176739 177766 178395 178832 179352 180227 181691 183812 186370 188943 191130 192648 193399 193663 194140 195479 197677
54057 197677 200189 202663 205349 208716 212962 218029 223894 230632 238381 247309 257336 267711 277009 283876
54043B83876L810Q07j756l392l549k304o30M91R85J498K485L854N300O586P461
54028C05522P601O858N539M307L637L390L001K173J224O28M75N69P99R42M03j200
54012C45868l208m454m784n264o586p975q306p622o786o114n273m367m041m387
53998B66701m657m385m039m065m014l296k289j964k536l222l313k869k212j424
53984B22416o78n58j428k698l286k817j910j232p47j11O17J012Q58L07l33p25
53968B08687n58R8O43M88k01o72l88N47J715K632K793J999P92R3K38P88J373K164
53950B23231L265M274M865N305N934O546O831O990P388P837P821P183O148M886
53936C08504L622K889K993L421L379K778K125J630J209J161J952L225L997M020
$$ plain form
54043 283876 287686 288493 286737 283345 279796 277492 276862 277353 278338 279836 282321 286175 291475 298061 305522
54028 305522 313123 319981 325520 329827 333464 336854 339855 342028 343252 343880 344355 344924 345723 346665 347068 345868
54012 345868 342660 338206 333422 328158 321572 313597 305291 297669 290883 284769 279496 275129 271088 266701
53998 266701 262044 257659 253620 249555 245541 242245 239956 237992 235456 232234 228921 226052 223840 222416
53984 222416 221738 221180 219752 217054 213768 210951 209041 207809 207062 206951 207568 208580 209438 209745 209412 208687
53968 208687 208129 208227 208870 209358 209157 208485 208097 208644 210359 212991 215784 217783 218575 218668 218906 219694 221067 223231
53950 223231 226496 230770 235635 240940 246874 253420 260251 267241 274629 282466 290287 297470 303618 308504
53936 308504 312126 315015 318008 321429 324808 327586 329711 331341 332550 333711 335663 338888 342885 346905
53922C46905M145N038O276P104P388P451P583Q120R337J0854J1704J1501J0953
53909D54359J0787J0841J0758J0784J1050J0765R275P508P099Q140R070Q997Q819
53896E78252R400R563P061J162o548j3861j9619k3592k5577k5454k3875k2101
53884D44811k0760j9257j6854j4015j1948j0971j0165q843p526o982o950o615
53872C03925n813n046m519m005l564l574l981m255m178m078m094l882l242k550
53858B47144k215k229k455k851l134k734j562m16j51p34j472j880j854j336m12
53843B21709L45K19q29k018k559k319j674j002m42K2M31P49Q33O08K41Q1L45R32
53825B15672J522J816J732J476J372J566J907K180K367K523K526K179J582J195
$$ plain form
53922 346905 351050 356088 362364 369468 376856 384307 391890 400010 409347 420201 431905 443406 454359
53909 454359 465146 475987 486745 497529 508579 519344 528619 536127 543226 551366 560436 569433 578252
53896 578252 587652 597215 604276 605438 598890 585029 565410 541818 516241 490787 466912 444811
53884 444811 424051 404794 387940 373925 361977 351006 340841 331998 324472 317490 310540 303925
53872 303925 298112 293066 288547 284542 280978 277404 273423 269168 264990 260912 256818 252936 249694 247144
53858 247144 244929 242700 240245 237394 234260 231526 229964 229548 229397 228663 227191 225311 223457 222121 221709
53843 221709 222054 222273 221444 219426 216867 214548 212874 211872 211430 211452 211883 212632 213465 214073 214314 214395 214740 215672
53825 215672 217194 219010 220742 222218 223590 225156 227063 229243 231610 234133 236659 238838 240420 241615
53811B41615J340J796K068K029K059K509L276M022M662N315N903O186O174O189
53797B95143O320O251N851N530N616N713N197M194L394K996K482J585Q17O81Q48
53782C52618N32n67k048l323m059m371m744n608o720p292o974o361o228o548o709
53767B81598o436n974n537n087m672m422m201l639k690j843j627k075k769l167
53753B27459k921k114j210o02k63j5K9k85o43n08R4M65J34n54q97n60K69J102
53735B18980J346P31k61o76p9R73J645J647J207N72l8l64l41j69P6N87J309J734
53717B28879J632J514J870K327K269J922K003K517K734K343J741J223P59O70J469
53702B55872K807L539L290K994L353L762L460K806K497K319J800J410J806K348
$$ plain form
53811 241615 242955 244751 246819 248848 250907 253416 256692 260714 265376 270691 276594 282780 288954 295143
53797 295143 301463 307714 313565 319095 324711 330424 335621 339815 343209 346205 348687 350272 351089 351770 352618
53782 352618 353150 352583 350535 347212 343153 338782 334038 328430 321710 314418 307444 301083 294855 288307 281598
53767 281598 275162 269188 263651 258564 253892 249470 245269 241630 238940 237097 235470 233395 230626 227459
53753 227459 224538 222424 221214 220612 220349 220334 220363 220078 219435 218927 219021 219486 219620 219066 218169 217609 217878 218980
53735 218980 220326 221057 220796 220120 220041 221014 222659 224306 225513 226085 226047 225683 225342 225173 225249 225836 227145 228879
53717 228879 230511 232025 233895 236222 238491 240413 242416 244933 247667 250010 251751 252974 253733 254403 255872
53702 255872 258679 262218 265508 268502 271855 275617 279077 281883 284380 286699 288499 289909 291715 294063
53688B94063J819M33l23R6O19M58K39N93Q62J44j246k244k418k071j527j038r33
53671B87526j167j151o67m26j024j876k027j620j522j771j530n88K07K37ML31
53655B72936J232J981J879Q55l73p10K52J635K178J657Q06Q4o29j148q50K58J232
53638B83275J372J029Q53R53J275J972K862L225K867K641L201L843L501K395J663
53623C16927J720K010K245K686L249L311K757K287K416K845L183L558M071M354
53609C57619M153L873L929M010L599K888K609L007L596L878L819L574L167K633
53595D06354K124J749J455J233J270J704K346K770K679K080J142M4j059k025k827
53580D21039l606m469n209n411m902m007l269k982l014l044k842k444k084j924
$$ plain form
53688 294063 295882 296315 295992 296088 296707 297165 297404 297997 298859 299003 297757 295513 293095 291024 289497 288459 287526
53671 287526 286359 285208 284541 284115 283091 281215 279188 277568 276046 274275 272745 272157 272364 272601 272605 272936
53655 272936 274168 276149 278028 278883 278510 277800 278052 279687 281865 283522 284328 284412 283783 282635 281785 282043 283275
53638 283275 284647 285676 286529 287482 288757 290729 293591 296816 299683 302324 305525 309368 312869 315264 316927
53623 316927 318647 320657 322902 325588 328837 332148 334905 337192 339608 342453 345636 349194 353265 357619
53609 357619 361772 365645 369574 373584 377183 380071 382680 385687 389283 393161 396980 400554 403721 406354
53595 406354 408478 410227 411682 412915 414185 415889 418235 421005 423684 425764 426906 426950 425891 423866 421039
53580 421039 417433 412964 407755 402344 397442 393435 390166 387184 384170 381126 378284 375840 373756 371832
53566C71832j863j667j309r49n96j21L55M25J6l06j0O77J100J004N71p2q14j086
53548C67187k45J383K528K479K055K520L921N120N349N043N042N512O024O299
53534D20217O493O785P090P257P336P485P755Q172Q913J0163J1801J3443J4803
53521E37713J5841J6519J6743J6602J6415J6403J6581J7054J8043J9438K0704
53510G28056K1583K2468K3703K4891K5454K5514K5559K5541K5061K4262K3657
53499I95749K3157K2200K0962K0364K0622K0751K0079J9283J9178J9298J8652
53488A220295J7351J6508J6751J7717J8804J9560J9490J8373J6872J5945J5586
53477A413252J4803J2989J0569Q152N779L329J017j043l144n501p787r655j1291
$$ plain form
53566 371832 369969 368302 366993 366044 365448 365327 365682 366107 366123 365817 365807 366484 367584 368588 369159 369087 368273 367187
53548 367187 366942 368325 370853 373332 375387 377907 381828 386948 392297 397340 402382 407894 413918 420217
53534 420217 426710 433495 440585 447842 455178 462663 470418 478590 487503 497666 509467 522910 537713
53521 537713 553554 570073 586816 603418 619833 636236 652817 669871 687914 707352 728056
53510 728056 749639 772107 795810 820701 846155 871669 897228 922769 947830 972092 995749
53499 995749 1018906 1041106 1062068 1082432 1103054 1123805 1143884 1163167 1182345 1201643 1220295
53488 1220295 1237646 1254154 1270905 1288622 1307426 1326986 1346476 1364849 1381721 1397666 1413252
53477 1413252 1428055 1441044 1451613 1459765 1465544 1468873 1469890 1468847 1465703 1460202 1452415 1442760 1431469
53464A431469j3056j4848j6239j7011j7176j6784j6211j6272j7473j9199k0296
53453A246904k0464k0500k1048k1689k1602k0686j9642j9086j8973j8767j7935
53442A026512j6342j4334j2450j0846r152p082n059l873l668l647k908j328N37
53429I36360K221L646M894O027P142Q321R416J0253J0992J2103J3762J5579J7130
53416A057846J8560K0354K2561K4611K5994K6933K8190L0254L2811L5126L6877
53405A360117L8453M0327M2380M4136M5563M7238M9511N1932N3738N4725N5301
53394A883421N5892N6572N7228N7682N7649N6871N5413N3698N2125N0747M9331
53383B486629M7654M5679M3478M0958L7733L3480K8415K3210J8375J3891R544
$$ plain form
53464 1431469 1418413 1403565 1387326 1370315 1353139 1336355 1320144 1303872 1286399 1267200 1246904
53453 1246904 1226440 1205940 1184892 1163203 1141601 1120915 1101273 1082187 1063214 1044447 1026512
53442 1026512 1010170 995836 983386 972540 963388 956306 951247 947374 943706 940059 937151 935823 936360
53429 936360 938581 942227 947121 953148 960290 968611 978027 988280 999272 1011375 1025137 1040716 1057846
53416 1057846 1076406 1096760 1119321 1143932 1169926 1196859 1225049 1255303 1288114 1323240 1360117
53405 1360117 1398570 1438897 1481277 1525413 1570976 1618214 1667725 1719657 1773395 1828120 1883421
53394 1883421 1939313 1995885 2053113 2110795 2168444 2225315 2280728 2334426 2386551 2437298 2486629
53383 2486629 2534283 2579962 2623440 2664398 2702131 2735611 2764026 2787236 2805611 2819502 2829046
53372B829046N231P73m234j0003j6286k2773k9491l6340m2600m7420n0671n2817
53360B522415n4125n4611n4570n4420n4037n2981n1460n0319m9808m9162m7748
53349A949174m5932m4371m3151m2161m1705m1959m2287m1820m0529l8998l7408
53338A488853l5435l3084l0834k8818k6568k3813k1039j8931j7625j6815j6367
53327A219524j6456j7128j7910j7995j6928j5102j3432j2421j1746j0854r639
53316A059913q322p014n781m793l964k638k85K634N041O565P811R276J0690J1750
53302A080883J2866J4611J6785J8535J9405J9896K0929K2971K5668K8186K9841
53291A310576L0447L0232K9556K8788K8123K7295K5706K3203K0503J8429J6909
$$ plain form
53372 2829046 2834277 2835050 2830816 2820813 2804527 2781754 2752263 2715923 2673323 2625903 2575232 2522415
53360 2522415 2468290 2413679 2359109 2304689 2250652 2197671 2146211 2095892 2046084 1996922 1949174
53349 1949174 1903242 1858871 1815720 1773559 1731854 1689895 1647608 1605788 1565259 1526261 1488853
53338 1488853 1453418 1420334 1389500 1360682 1334114 1310301 1289262 1270331 1252706 1235891 1219524
53327 1219524 1203068 1185940 1168030 1150035 1133107 1118005 1104573 1092152 1080406 1069552 1059913
53316 1059913 1051591 1044577 1038796 1034003 1030039 1027401 1027116 1029750 1034791 1041356 1049167 1058443 1069133 1080883
53302 1080883 1093749 1108360 1125145 1143680 1163085 1182981 1203910 1226881 1252549 1280735 1310576
53291 1310576 1341023 1371255 1400811 1429599 1457722 1485017 1510723 1533926 1554429 1572858 1589767
53280A589767J5229J3109J0804Q193M707L85l734o849r345j2047j5009j7663j9773
53267A557774k1554k3086k4277k5210k6067k6766k7142k7340k7585k7742k7601
53256A273404k7439k7712k8246k8364k7825k7116k6688k6433k6074k5626k5301
53245I76580k5244k5498k5893k5967k5385k4484k3880k3510k2598k0772j8652
53234G14697j6954j5556j3936j2129j0699r883r355q879q707r205j0237j1160
53222E77997j1393j1010j0721j1180j2244j3157j3430j3309j3191j2946j2174
53211D43242j0949r890r456r378q942p737o133m990m861n415n822n641n134m697
53197C44197m420m339m662n366n902n749n062m336l675k878k120j855j993j848
$$ plain form
53280 1589767 1604996 1618105 1628909 1637102 1641809 1642194 1638460 1631611 1622266 1610219 1595210 1577547 1557774
53267 1557774 1536220 1513134 1488857 1463647 1437580 1410814 1383672 1356332 1328747 1301005 1273404
53256 1273404 1245965 1218253 1190007 1161643 1133818 1106702 1080014 1053581 1027507 1001881 976580
53245 976580 951336 925838 899945 873978 848593 824109 800229 776719 754121 733349 714697
53234 714697 697743 682187 668251 656122 645423 635540 626185 617306 608599 599394 589157 577997
53222 577997 566604 555594 544873 533693 521449 508292 494862 481553 468362 455416 443242
53211 443242 432293 422403 412947 403569 394627 386890 380757 375767 370906 365491 359669 354028 348894 344197
53197 344197 339777 335438 330776 325410 319508 313759 308697 304361 300686 297808 295688 293833 291840 289992
53183B89992j150n34o30j139j306j034r36j394k045k357k293k180k153j989j457
53168B67395p20k39l07o70p85m16J07L75M11M89N19j3j216k295k228j012J83K85
53150B59863n25j179j117q34r84j445j628j439j332j460j364p18L0K50P5J75O78
53133B47046R04M38q4K24J135J439N60n43n43N80J544J399N41j08l16m33m38J85
53115B53530J458K472K340J317M84M69Q74R98O79K22j51m34o36p26p99r45j043
53098B60109r06o70p34j141j452j345j177j459k024k162j604r10o91p69m65M56
53082B43056J447J786J315M99r9l07l44m40n14l26J72P18J044J137J179J277J291
53065B52891R49J76o27q34l23K44J73l68o78o27p71j249j328n21M66O59J82p7
$$ plain form
53183 289992 288842 288308 287678 286539 285233 284199 283263 281869 279824 277467 275174 272994 270841 268852 267395
53168 267395 266675 266436 266129 265459 264674 264258 264365 264740 265151 265640 266159 266146 264930 262635 260407 259395 259578 259863
53150 259863 259338 258159 257042 256208 255224 253779 252151 250712 249380 247920 246556 245838 245868 246118 246193 246368 247046
53133 247046 247950 248388 248304 248528 249663 251102 251662 251119 250576 251156 252700 254099 254640 254532 254216 253783 253345 253530
53115 253530 254988 257460 259800 261117 261601 262070 262944 263942 264621 264843 264692 264258 263622 262896 262097 261152 260109
53098 260109 259203 258533 257799 256658 255206 253861 252684 251225 249201 247039 245435 244525 243834 243065 242600 243056
53082 243056 244503 246289 247604 248103 248004 247697 247353 246913 246399 246073 246245 246963 248007 249144 250323 251600 252891
53065 252891 253840 254016 253389 252555 252232 252476 252649 252281 251603 250976 250205 248956 247628 247107 247573 248232 248414 248337
53047B48337Q4L0m44o74k57K65K70m9k24l51p58j224j244q24l83j6N31J184J496
53028B45749J317J005Q30P04N65N72O68N37J95K09Q68J601J639R95K71k47o98
53011B56780j033r69o68p31j303j669j236m63k52o68q62l20M66P16L56kJ31O45
52993B48918J068J028N43j6k48r9J57L05M02N22N12K54L5L25J153J934K059J525
52975B60377Q65N57N99P01P60J047J757K538K723K188J610J607J821J338j3j302
52959B79173j589r02J02R83J579J577P07n83j287r93m74p16j614k135j677p49
52943B71402k32l76q30j304j801k301k691k952l089k837j863m42N05L77l33o48
52927B50585k90J66K34J19J89K78q9r22j547j319l57N55Q06N49L57M12L23k50
$$ plain form
53047 248337 248421 248451 248007 247333 247076 247341 247611 247562 247338 246987 246229 245005 243761 242937 242554 242538 243069 244253 245749
53028 245749 247066 248071 248901 249605 250170 250742 251410 251947 252142 252351 253219 254820 256459 257454 257725 257478 256780
53011 256780 255747 254778 254110 253379 252076 250407 249171 248708 248456 247788 246926 246606 247072 247788 248144 248142 248273 248918
52993 248918 249986 251014 251557 251541 251293 251194 251351 251656 252058 252580 253092 253346 253381 253706 254859 256793 258852 260377
52975 260377 261242 261799 262398 263099 263859 264906 266663 269201 271924 274112 275722 277329 279150 280488 280475 279173
52959 279173 277584 276682 276784 277767 279346 280923 281630 281047 279760 278767 278293 277577 275963 273828 272151 271402
52943 271402 271170 270794 269964 268660 266859 264558 261867 258915 255826 252989 251126 250684 251189 251566 251233 250585
52927 250585 250295 250461 250695 250814 251003 251281 251192 250270 248723 247404 247047 247602 248408 248957 249314 249726 250049 249799
52909B49799j031j477j425j156q73m66J44P28R29O14l8p07j179j444j465j006
52893B39947J7J028J154M07p2N24J347R97l27r21N4J371J520P06K09L67L96o4
52875B48660l07K61J142J395P96o6n46m21J63R17J540J835J833J653J288O48j19
52858B60672m94r4O84Q55N1q82r35m15o07j936l299l564k963k439k223j932j576
52841B38903j555j802j828j637j770k293k505j935r80k42K08N21N61K35q9J1M02
52824B24205O46O79P54Q99Q06L39k47o50q10q29p93p27n95k80K85R38J342J364
52806B27326J247J345J714K065K191K215K334K349J836P90k23p97j260k121l137
52791B37874l441k664j469p93q85j258j335q95r4O76J081J098R47P44M21N1k1
$$ plain form
52909 249799 248768 247291 245866 244710 243837 243371 243515 244243 245172 245786 245748 245041 243862 242418 240953 239947
52893 239947 239964 240992 242146 242553 242481 243005 244352 245349 245022 244101 244155 245526 247046 247752 247961 248328 248724 248660
52875 248660 248353 248614 249756 251151 251947 251881 251335 250914 251077 251994 253534 255369 257202 258855 260143 260791 260672
52858 260672 260178 260084 260768 261623 261674 260792 259857 259442 258835 256899 253600 250036 247073 244634 242411 240479 238903
52841 238903 237348 235546 233718 232081 230311 228018 225513 223578 222598 222356 222564 223085 223646 223881 223792 223803 224205
52824 224205 224851 225530 226284 227183 227989 228328 228081 227431 226621 225792 224999 224272 223677 223397 223682 224620 225962 227326
52806 227326 228573 229918 231632 233697 235888 238103 240437 242786 244622 245412 245189 244392 243132 241011 237874
52791 237874 234433 231769 230300 229507 228622 227364 226029 225134 225040 225716 226797 227895 228842 229586 230007 230058 230037
52774B30037M40J163J632J570J143O97M22K30j43q30j651k274k513k283j516l71
52758B25753N61P46M52M89J101J625J451Q83O01P81J168J652K126K119J260O0
52742B42828m70o7M71M18K0PO15J446K016K169K052J946J997K050J816J296Q83
52725B61493Q96J197J376J189O83N2m25n41m40o39j468k531l025k642j901j413
52709B51861j098m56M79R17K28j194k290k437j873j081k48N18R20P84M62M50P31
52692B46673R13Q84R55J233J393J201Q27M42o6o34p36p6P18P69J98OO21J225Q83
52673B57429k48j228j482j125m58K63P00N97P4n75j270j915k001j088K87R21M95
52656B49376Q8P19J965K610K275J754J841K510L155L171K264O59r71k054k567
$$ plain form
52774 230037 230477 231640 233272 234842 235985 236682 237104 237334 237191 236361 234710 232436 229923 227640 226124 225753
52758 225753 226314 227060 227512 228001 229102 230727 232178 233061 233662 234443 235611 237263 239389 241508 242768 242828
52742 242828 242358 242291 242762 243180 243200 243207 243822 245268 247284 249453 251505 253451 255448 257498 259314 260610 261493
52725 261493 262389 263586 264962 266151 266834 266886 266461 265920 265480 264841 263373 260842 257817 255175 253274 251861
52709 251861 250763 250307 250786 251703 251931 250737 248447 246010 244137 243056 242808 243326 244246 245030 245492 245942 246673
52692 246673 247586 248470 249425 250658 252051 253252 254079 254521 254455 253821 253085 253009 253727 254496 254694 254700 255321 256546 257429
52673 257429 257181 255953 254471 253346 252888 253151 253851 254448 254522 253947 252677 250762 248761 247673 247960 248881 249376
52656 249376 249464 250183 252148 254758 257033 258787 260628 263138 266293 269464 271728 272387 271416 269362 266795
52641B66795k738k530j890j236j077j180q38O7Q55J011Q04P63J098J785K608K984
52625B67281K421J394J084J871K783K777J960R29k60j699k795k827k042j335j069
52610B70473r71r84j301j635j365m97L24Q30J320J740J570Q82N83J078J543J101
52594B74691J04n34o60p54q48n23J78O20M95K00J56K40J08k73o36p26m42Q7N69
52575B72052P91Q89J130J442J403P56k30j021j264r96n04j22oj15l74p25r44o46
52557B71516J94Q25L53j048k089j806p27j49n56j211j321r13m37j2M57P78O34
52540B64488K01P0M31P50M37l65j025j147q01j63O15J151R39jq77q99j76N20P83
52521B64931R39J272J410R14J68M1O55J087O09k70m36M43J681K577L095L449L613
$$ plain form
52641 266795 264057 261527 259637 258401 257324 256144 255306 255373 256228 257239 258043 258806 259904 261689 264297 267281
52625 267281 269702 271096 272180 274051 276834 279611 281571 282500 282240 280541 277746 274919 272877 271542 270473
52610 270473 269502 268518 267217 265582 264217 263720 264044 264874 266194 267934 269504 270386 270969 272047 273590 274691
52594 274691 274795 274261 273601 272847 271999 271476 271654 272274 272769 272969 273125 273365 273473 273200 272564 271838 271396 271483 272052
52575 272052 272843 273732 274862 276304 277707 278463 278233 277212 275948 274952 274448 274326 274320 274205 273831 273106 272162 271516
52557 271516 271710 272535 272888 271840 269751 267945 267218 267069 266513 265302 263981 263068 262631 262619 263076 263854 264488
52540 264488 264689 264759 265190 265940 266377 266012 264987 263840 263039 262876 263491 264642 265581 265580 264703 263804 263628 264148 264931
52521 264931 265870 267142 268552 269466 269634 269675 270330 271417 272026 271756 271320 271763 273444 276021 279116 282565 286178
52504B86178L495L266L097K815K055P49q21k283l397m046m174l807l032k103j432
52489B76560j303j503j531j233r03p28n07j43N3k3J65J043K047K201J473Q04P51
52472B77223Q96P59O11Q98J452J836K096K508K833K523J672J149J564K562L369
52457C03951L657L548L030J931L87j083k162l031l905m537m529m046l742l894
52443B85575l954l244j929q81o87j045j269j085p43m37n4M00M42l11j328j485
52427B67965m63O77Q28K34%M64R84J160J311J555J428Q72O52J174J694J536J273
52410B83344J770K654K992L011L863N769P707R056J0206J1215J1131R342O604
52397C68664L975J446j527m731p227q384q290p401o313n543n059m292l015j809
$$ plain form
52504 286178 289673 292939 296036 298851 300906 301655 300834 298551 295154 291108 286934 283127 280095 277992 276560
52489 276560 275257 273754 272223 270990 270087 269359 268852 268709 268762 268739 268904 269947 271994 274195 275668 276472 277223
52472 277223 278119 278878 279489 280387 281839 283675 285771 288279 291112 293635 295307 296456 298020 300582 303951
52457 303951 307608 311156 314186 316117 316504 315421 313259 310228 306323 301786 297257 293211 289469 285575
52443 285575 281621 278377 276448 275567 274880 273835 272566 271481 270738 270301 270247 270647 271089 270778 269450 267965
52427 267965 267502 268179 269007 269241 269241 269705 270689 271849 273160 274715 276143 277015 277667 278841 280535 282071 283344
52410 283344 285114 287768 290760 293771 297634 303403 311110 320166 330372 341587 352718 362060 368664
52397 368664 372639 374085 372558 367827 360600 352216 343926 336525 330212 324669 319610 315318 312303 310494
52383C10494j250j033n27K33P81J120J629K250K554K592K912L614M037L693K999
52368C36098K787L397M460N351N641N265M451L463K400J285K15p01j442j917j860
52353C68893j197l91o2k57l74J26J184K238K708K409J751J527K203L429M425M848
52337C93460N006N289N736O273O990Q013R237J0403J1316J1981J2590J3461J4796
52324E14551J6451J8042J9343K0442K1418K2037K1988K1360K0611J9977J9173
52313G35393J7849J6297J5260J5061J5211J5109J4734J4367J3937J3222J2399
52302H98839J1859J1505J0864R850Q771P581N907M003K805K601K361J012j256
52289I76702l524n425p156q643r520r697r269q143o359m517l158j975l68J511
$$ plain form
52383 310494 309244 308211 307684 307917 308698 309818 311447 313697 316251 318843 321755 325369 329406 333099 336098
52368 336098 338885 342282 346742 352093 357734 362999 367450 370913 373313 374598 374813 374112 372670 370753 368893
52353 368893 367696 367305 367243 366986 366612 366738 367922 370160 372868 375277 377028 378555 380758 384187 388612 393460
52337 393460 398466 403755 409491 415764 422754 430767 440004 450407 461723 473704 486294 499755 514551
52324 514551 531002 549044 568387 588829 610247 632284 654272 675632 696243 716220 735393
52313 735393 753242 769539 784799 799860 815071 830180 844914 859281 873218 886440 898839
52302 898839 910698 922203 933067 942917 951688 959269 965176 969179 971984 974585 976946 977958 976702
52289 976702 973178 967753 960597 951954 942434 932737 923468 915325 908966 904449 901291 899316 898948 900459
52275I00459L104M595O665R139J0947J1644J1973J2650J3463J4017J4478J5043
52263A028177J5306J4803J3755J2755J2052J1499J0903J0068Q906P845P658Q516
52251A162243R547R720Q850P400N752M116K764J757O49j057l264n412p003p772
52237A188290p588o727n852n338m770l668k496k263l168m240m443l673k486j350
52223A130228m06L15Q37J332K001K862L728M384M836N369O257P391Q267Q509Q283
52208A194193Q113Q324Q780R112R109Q891Q722Q577Q026O785N310M487M595M996
52194A298020N074N021N325N791N722M961M156L866L849L499K695J881J396R75
52180A352231K8j636l486m835n659o584q002r534j0559j1002j1167j1027j0188
$$ plain form
52275 900459 903563 908158 914823 923962 934909 946553 958526 971176 984639 998656 1013134 1028177
52263 1028177 1043483 1058286 1072041 1084796 1096848 1108347 1119250 1129318 1138224 1146069 1153727 1162243
52251 1162243 1171790 1181510 1190360 1197760 1203512 1207628 1210392 1212149 1212798 1211741 1208477 1203065 1196062 1188290
52237 1188290 1180702 1173975 1168123 1162785 1158015 1154347 1151851 1149588 1146420 1142180 1137737 1134064 1131578 1130228
52223 1130228 1129822 1130137 1130974 1132306 1134307 1137169 1140897 1145281 1150117 1155486 1161743 1169134 1177401 1185910 1194193
52208 1194193 1202306 1210630 1219410 1228522 1237631 1246522 1255244 1263821 1271847 1278632 1283942 1288429 1293024 1298020
52194 1298020 1303094 1308115 1313440 1319231 1324953 1329914 1334070 1337936 1341785 1345284 1347979 1349860 1351256 1352231
52180 1352231 1352259 1350623 1347137 1342302 1336643 1330059 1322057 1312523 1301964 1290962 1279795 1268768 1258580
52167A258580q566o627m840l327k179j665j745j693o80J288L370M752N212M835
52153A246715L727K220J013N64M31k69j697l049l592l562l560l577l159k430k133
52138A227642k515k805k220j114o13j238k286k576j510O49L269N902Q428J0868
52124A239881J3218J5544J8078K0985K4063K6804K8843L0139L0792L0885L0489
52113A509721K9671K8377K6588K4582K2755K1049J8917J5980J2481Q950N644K551
52101A727266k87k653m263m974n025n059n459n734m995l275j783j568k475l744
52087A675972n102o643q147r238r958j0506j0633r940q612p029m894j599K412
52074A586083N636P214P893Q881J0399J1880J2995J3900J4723J5405J5824J5783
$$ plain form
52167 1258580 1250014 1243387 1238547 1235220 1233041 1231376 1229631 1227938 1227258 1228546 1231916 1236668 1241880 1246715
52153 1246715 1250442 1252662 1253675 1254239 1254670 1254401 1252704 1249655 1246063 1242501 1238941 1235364 1232205 1229775 1227642
52138 1227642 1225127 1222322 1220102 1218988 1218375 1217137 1214851 1212275 1210765 1211414 1214683 1220585 1229013 1239881
52124 1239881 1253099 1268643 1286721 1307706 1331769 1358573 1387416 1417555 1448347 1479232 1509721
52113 1509721 1539392 1567769 1594357 1618939 1641694 1662743 1681660 1697640 1710121 1719071 1724715 1727266
52101 1727266 1726979 1724326 1720063 1715089 1710064 1705005 1699546 1693812 1688817 1685542 1683759 1682191 1679716 1675972
52087 1675972 1670870 1664227 1656080 1646842 1636884 1626378 1615745 1605805 1597193 1590164 1585270 1583671 1586083
52074 1586083 1591719 1598933 1606826 1615707 1626106 1637986 1650981 1664881 1679604 1695009 1710833 1726616
52062A726616J5070J3799J2421J1059R260O814M398K717J369o80l493n927p195
52049A786228p877q968j0522j1799j2495j3152j4436j6397j8502k0046k0637k0542
$$ plain form
52062 1726616 1741686 1755485 1767906 1778965 1788225 1795039 1799437 1802154 1803523 1802843 1799350 1793423 1786228
52049 1786228 1778351 1769383 1758861 1747062 1734567 1721415 1706979 1690582 1672080 1652034 1631397 1610855
$$ [...]
##END NTUPLES=NMR SPECTRUM
##END=
