##TITLE=AC1588_HBRAH13318_8313931_AQnde7Me39
##JCAMPDX= 6.0         $$ Bruker NMR JCAMP-DX V2.0
##DATA TYPE= NMR SPECTRUM
##DATA CLASS= NTUPLES
##ORIGIN= BRUKER
##OWNER= Administrator
$$ 1.72 TOPSPIN		Version 2.1
$$ 2013-11-09 15:29:13.439 -0800  Administrator@X
$$ Compression mode = diff/dup
##.OBSERVE FREQUENCY= 400.02188249412
##.OBSERVE NUCLEUS= ^1H
##.ACQUISITION MODE= SIMULTANEOUS (DQD)
##.ACQUISITION SCHEME= undefined
##.AVERAGES= 8
##.DIGITISER RES= 22
##SPECTROMETER/DATA SYSTEM= spect
##.PULSE SEQUENCE= zg30
##.SOLVENT NAME= COFFEE_meoh
##.SHIFT REFERENCE= INTERNAL, COFFEE_meoh, 1, 14.98509
##AUDIT TRAIL= $$ (NUMBER, WHEN, WHO, WHERE, PROCESS, VERSION, WHAT)
$$ ##TITLE= Audit trail, TOPSPIN		Version 2.1
$$ ##JCAMPDX= 5.01
$$ ##ORIGIN= Bruker BioSpin GmbH
$$ ##OWNER= Administrator
$$ $$ E:\/data/COFFEE/nmr/AC1588_HBRAH13318_8313931_AQnde7Me39/10/pdata/1/auditp.txt
$$ ##AUDIT TRAIL=  $$ (NUMBER, WHEN, WHO, WHERE, PROCESS, VERSION, WHAT)
(   1,<2013-11-09 15:29:06.376 -0800>,<Administrator>,<X>,<go>,<TOPSPIN 2.1>,
      <created by zg
	started at 2013-11-09 15:28:00.595 -0800,
	POWCHK enabled, PULCHK disabled,
       configuration hash MD5:
       C8 4E 4E 5D D3 5C D8 9E 9F 52 82 E0 59 8A DE 15
       data hash MD5: 64K
       50 9E CF DA B3 57 A1 37 15 27 43 2B E1 4B A8 05>)
(   2,<2013-11-09 15:29:09.439 -0800>,<Administrator>,<X>,<proc1d>,<TOPSPIN 2.1>,
      <Start of raw data processing
       efp LB = 0 FT_mod = 6 PKNL = 1 PHC0 = 0 PHC1 = 0 SI = 32K 
       data hash MD5: 32K
       EA 70 29 80 05 06 B8 83 B0 C7 1B B0 45 F4 F0 D0>)
(   3,<2013-11-09 15:29:09.860 -0800>,<Administrator>,<X>,<proc1d>,<TOPSPIN 2.1>,
      <pk PHC0 = 89.53857 PHC1 = 0 
       data hash MD5: 32K
       23 5A B3 17 D6 54 30 5F C4 E0 D6 ED 4E CF 0A 1A>)
(   4,<2013-11-09 15:29:09.954 -0800>,<Administrator>,<X>,<proc1d>,<TOPSPIN 2.1>,
      <abs ABSG = 1 
       data hash MD5: 32K
       F0 8F 92 A1 B0 E3 D1 BB 0D 54 74 4D 6A 25 84 05>)
(   5,<2013-11-09 15:29:10.017 -0800>,<Administrator>,<X>,<proc1d>,<TOPSPIN 2.1>,
      <abs ABSG = 2 
       data hash MD5: 32K
       7A 97 C6 58 E1 6C 66 C2 3E 95 17 20 B2 50 74 7A>)
(   6,<2013-11-09 15:29:10.079 -0800>,<Administrator>,<X>,<proc1d>,<TOPSPIN 2.1>,
      <abs ABSG = 3 
       data hash MD5: 32K
       96 77 7E 1B 59 25 9A 1A 91 30 43 46 6B CA 9C 5E>)
(   7,<2013-11-09 15:29:10.126 -0800>,<Administrator>,<X>,<proc1d>,<TOPSPIN 2.1>,
      <abs ABSG = 4 
       data hash MD5: 32K
       85 78 DE 15 A6 D4 43 DD 02 78 74 DD 48 FB C6 63>)
(   8,<2013-11-09 15:29:10.204 -0800>,<Administrator>,<X>,<proc1d>,<TOPSPIN 2.1>,
      <abs ABSG = 5 
       data hash MD5: 32K
       85 F4 B7 9F C8 2A D7 0A 7C 27 6C BF 8B 3D B0 7C>)
$$ ##END=
$$ 
$$ $$ hash MD5
$$ $$ 16 EF B2 55 69 42 74 28 C0 F3 65 FB 5E 94 B6 D2
##$RELAX= 
##$RELAX= 
##$RELAX= 
##$RELAX= 
##$RELAX= 
##$RELAX= 
##$RELAX= 
$$ Bruker specific parameters
$$ --------------------------
##$DU= <E:\>
##$EXPNO= 10
##$NAME= <AC1588_HBRAH13318_8313931_AQnde7Me39>
$$ [...]
150 150 150 150 150 150 150 150
##$TP07= 0
##$TPNAME0= <>
##$TPNAME1= <>
##$TPNAME2= <>
##$TPNAME3= <>
##$TPNAME4= <>
##$TPNAME5= <>
##$TPNAME6= <>
##$TPNAME7= <>
##$TPOAL= (0..7)
0.5 0.5 0.5 0.5 0.5 0.5 0.5 0.5
##$TPOFFS= (0..7)
0 0 0 0 0 0 0 0
##$TUNHIN= 0
##$TUNHOUT= 0
##$TUNXOUT= 0
##$USERA1= <user>
##$USERA2= <user>
##$USERA3= <user>
##$USERA4= <user>
##$USERA5= <user>
##$V9= 5
##$VALIST= <valist>
##$VCLIST= <CCCCCCCCCCCCCCC>
##$VD= 0
##$VDLIST= <DDDDDDDDDDDDDDD>
##$VPLIST= <PPPPPPPPPPPPPPP>
##$VTLIST= <TTTTTTTTTTTTTTT>
##$WBST= 1024
##$WBSW= 4
##$XGAIN= (0..3)
0 0 0 0
##$XL= 0
##$YL= 0
##$YMAX_a= 621640
##$YMIN_a= -540274
##$ZGOPTNS= <>
##$ZL1= 120
##$ZL2= 120
##$ZL3= 120
##$ZL4= 120
##$ABSF1= 14.98509
##$ABSF2= -5.573092
##$ABSG= 5
##$ABSL= 3
##$ALPHA= 0
##$AQORDER= 0
##$ASSFAC= 0
##$ASSFACI= 0
##$ASSFACX= 0
##$ASSWID= 0
##$AUNMP= <proc_prof1d_extract_pilot.lims>
##$AXLEFT= 0
##$AXNAME= <>
##$AXNUC= <1H>
##$AXRIGHT= 0
##$AXTYPE= 0
##$AXUNIT= <>
##$AZFE= 0.1
##$AZFW= 0.1
##$BCFW= 0
##$BC_mod= 0
##$BYTORDP= 0
##$COROFFS= 0
##$CY= 15
##$DATMOD= 1
##$DC= 0
##$DFILT= <>
##$DTYPP= 0
##$F1P= 0
##$F2P= 0
##$FCOR= 0.5
##$FTSIZE= 32768
##$FT_mod= 6
##$GAMMA= 0
##$GB= 0
##$INTBC= 1
##$INTSCL= 1
##$ISEN= 128
##$LB= 0
##$LEV0= 0
##$LPBIN= 0
##$MAXI= 10000
##$MC2= 0
##$MEAN= 0
##$ME_mod= 0
##$MI= 0
##$NCOEF= 0
##$NC_proc= -8
##$NLEV= 6
##$NOISF1= 0
##$NOISF2= 0
##$NSP= 0
##$NTH_PI= 0
##$NZP= 0
##$OFFSET= 14.98509
##$PC= 1
##$PHC0= 89.53857
##$PHC1= 0
##$PH_mod= 1
##$PKNL= yes
##$PPARMOD= 0
##$PPDIAG= 0
##$PPIPTYP= 0
##$PPMPNUM= 2147483647
##$PPRESOL= 1
##$PSCAL= 4
##$PSIGN= 0
##$PYNMP= <proc.py>
##$REVERSE= no
##$SF= 400.02
##$SI= 32768
##$SIGF1= 0
##$SIGF2= 0
##$SINO= 400
##$SIOLD= 32768
##$SPECTYP= <>
##$SREGLST= <1H.CDCl3>
##$SSB= 0
##$STSI= 32768
##$STSR= 0
##$SW_p= 8223.68421052631
##$SYMM= 0
##$S_DEV= 0
##$TDeff= 65536
##$TDoff= 0
##$TI= <>
##$TILT= no
##$TM1= 0
##$TM2= 0
##$TOPLEV= 0
##$USERP1= <user>
##$USERP2= <user>
##$USERP3= <user>
##$USERP4= <user>
##$USERP5= <user>
##$WDW= 1
##$XDIM= 32768
##$YMAX_p= 459144855
##$YMIN_p= -680657
##$CURPLOT= <Network HP LaserJet P1505>
##$CURPRIN= <$Network HP LaserJet P1505>
##$DFORMAT= <normdp>
##$LAYOUT= <+/1D_H.xwp>
##$LFORMAT= <normlp>
##$PFORMAT= <normpl>
##$SURQMSG= 1
$$ End of Bruker specific parameters
$$ ---------------------------------
##NTUPLES= NMR SPECTRUM
##VAR_NAME=  FREQUENCY,     SPECTRUM/REAL,   SPECTRUM/IMAG
##SYMBOL=    X,             R,               I
##VAR_TYPE=  INDEPENDENT,   DEPENDENT,       DEPENDENT
##VAR_FORM=  AFFN,          ASDF,            ASDF
##VAR_DIM=   32768,         32768,           32768
##UNITS=     HZ,            ARBITRARY UNITS, ARBITRARY UNITS
##FACTOR=    0.250966925370066, 1,           1
##FIRST=     8223.43324360094, 10670,        -127469
##LAST=      0,             -57987,          -146849
##MIN=       0,             -680657,         0
##MAX=       8223.43324360094, 459144855,    0
$$ Real data points
##PAGE= N=1
##DATA TABLE= (X++(R..R)), XYDATA
$$ [...]
19558c05224A08237b2951j51298Q4785B31198J1239a01804j84752G0475c08562
19547G6367a2659j0842E4027b70427i5896n3604E1576O495a4668l65871A709J54554
19535A56263b79326J8947H70c9507A15539b48993O2626i0053A41687h5542A12090
19523c28600A77380a5928C5373c13419J06756B37695a52729f0345l41749G7220
19512a04246m2826A08569a40209e7895p0388j48244a733j39058B06518e442j3033
19501a8475o8469I7826g9308A85739D5797F307a20881j52585K5694B67567D3191
19489d1153A04403b15027M0229d3444k12489j36397J49154j8120g1754k26690
19479b98444j20410C6216M01274c3664k6607a3843A68362O5622c44592M500A14884
$$ y = [-305224, 108237, -22951, -174249, -89464, 231198, 242437, -101804, -286556, 70475, -308562, 76367, -12659, -23501, 54027, -270427, -95896, -149500, 51576, 58071, -14668, -380539, 1709, 156263, -279326, -260379, 870, -39507, 115539, -248993, -186367, -90053, 141687, -85542, 112090, -328600, 177380, -15928, 35373, -313419, -206663, 237695, -152729, -60345, -402094, 77220, -104246, -147072, 108569, -140209, -57895, -128283, -276527, -1733, -140791, 206518, -5442, -18475, -86944, 97826, -79308, 185739, 45797, 6307, -120881, -273466, -247772, 267567, 43191, -41153, 104403, -215027, -174798, -43444, -255933, -392330, -243176, -261296, -71754, -298444, -418854, 36216, 437490, -33664, -60271, -13843, 168362, 233984, -344592, -340092, 114884]
19467d7686C4777a47061C64858c9692j32226j8485b8581B64696a99800r0251A28613
19455A58271g2420K2408j68759F6945O1429b15390k06248a65A32783b18254K4483
19444a93771i0331C57221d6081J5000A15827G924c02032J5269c3016D1279J31644
19433A72923P0961c5534a380I3915c43304a61726B01941c22046a43223G39a52286
19421b61420D200a47773A08848f2484r6026F0173I924b61868R0161h604r6161
19410a04765A4501h9108A75944D3174M0855g6454B11186a50282E455k402b32929
19398b61159A29986n0597a57704f5173A09250a07698M9144A60770a09581A55364
19387A44872b18850e9485D94684h4426k45718q3772A54308b07447k56322E5976
$$ y = [-47686, 34777, -147061, 364858, -39692, -171918, -190403, -28581, 264696, -199800, -290051, 128613, 158271, -72420, -50012, -218771, 66945, 128374, -215390, -421638, -165, 132783, -218254, -193771, -90331, 357221, -46081, -31081, 115827, 7924, -302032, -286763, -33016, 41279, 172923, 243884, -35534, -1380, 93915, -343304, -161726, 201941, -322046, -143223, 739, -152286, -261420, 4200, -147773, 108848, -62484, -158510, 60173, 9924, -261868, -171707, -8604, -104765, 14501, -89108, 175944, 43174, 84029, -76454, 211186, -150282, 5455, 3053, -232929, -261159, 129986, 79389, -157704, -65173, 109250, -107698, -58554, 160770, -109581, 155364, 144872, -218850, -59485, 494684, -84426, -330144, -413916, 154308, -207447, -463769, 55976]
19376C0566a85111n2737d5763A23255i12j32302C30594I058c21068a8784l84487
19365d03271G3007c93440a08792k94249H3173a40923k20991J51793B4480P6463
19355A00943m1671a59031A61291l1141J02985o9947K7918a60116F3391J17874
19345A81265d2013A81246F6549a13562F6046c31969B58889g8429K2954j33728
19335a89203R2489A81222i3797E1308J70283k604K70089c9713B35625a07258L742
19324a03516L8528j74439c5023j36852D0432b0574H6819b85632B12516d24398
19313i6788q7369D5651b66810A51654a6897j52684j64710i533A41324e5190A03275
19301c94500A08914N1499a70961J7819H0741a52262P2419k21619e0679J9953B6957
$$ y = [30566, -185111, -237848, -45763, 123255, -912, -133214, 330594, 9058, -321068, -18784, -403271, 73007, -393440, -108792, -403041, 83173, -140923, -361914, -210121, 24480, 100943, 59272, -159031, 161291, 130150, 233135, 163188, 191106, -160116, 63391, 181265, -42013, 181246, 66549, -113562, 66046, -331969, 258889, -78429, -55475, -189203, -96714, 181222, -93797, 51308, 221591, 218987, 489076, -39713, 235625, -107258, -103516, -64988, -239427, -35023, -171875, 40432, -20574, 86819, -285632, 212516, -424398, -96788, -184157, 45651, -266810, 151654, -16897, -169581, -334291, -9533, 141324, -55190, 103275, -394500, 108914, 160413, -170961, -153142, 80741, -152262, -79843, -301462, -50679, -30726, 26957]
19289h9865m8508K1496A41297n2802O6894a23261A38284e3469B36001m2745P351
19278B00607c17671K3960R4077B2962e6277o9264j67839A07093a82336g9638q7007
19267a66645g6324b8487j03563h274D4532b39397a06924F9606L17420A57924b82522
19255g7666m9592r1078G5664a40663K4310J0898D2173c00914J0445L3596a10447
19243F9584a74221L823I5167a09266l08749G9551d61j11712e031k3406E1542J24504
19231A76046b34391A74557a46029b100B7876b37754A08189n0734a79787j05462
19221b85249J42601L9254m6035e3793m3818G473a23779e2624p181j17715B41396
19209c88513h7178m0135B4134f1823I1288a42513A00654a43507B62883a03998
$$ y = [-89865, -138373, -116877, 141297, 88495, 155389, -123261, 138284, -53469, 236001, 193256, 200607, -317671, -293711, -199634, 22962, -56277, -125541, -293380, 107093, -182336, -79638, -166645, -76324, -28487, -132050, -8274, 44532, -239397, -106924, 69606, 387026, 157924, -282522, -77666, -127258, -218336, 75664, -140663, -116353, -105455, 42173, -300914, -290469, -256873, -110447, 69584, -174221, -170398, 95167, -109266, -418015, 79551, -461, -112173, -5031, -28437, 51542, 176046, -234391, 174557, -146029, -2100, 27876, -237754, 108189, 57455, -179787, -285249, -142648, -103394, -149429, -53793, -97611, 7473, -123779, -52624, -59805, -177520, 241396, -388513, -87178, -127313, 24134, -61823, 91288, -142513, 100654, -143507, 262883, -103998]
19198b21613C5188b29828D6104b33193J09573q5483P8532c5312j84065g548j05364
19187a12912q6682P5289I6975f6573m8204j08662R8009A55160c85240a66669c5424
19175a51065j95523a03950A93133K34623a47713I4671J78559I6025B7840n933
19165B1907J30143b14733G1415a76120N2995l125m3141L833D6363c42698a63526
19153g8427A04308B6121a00778i656r9131q688B0488c0856k41099E4326R6208
19142A50534d7286E7483L9948c02359a20373J429k3551k8359P4227k23032J15612
19131b04047M9614g4211j45380e26k27356a6353j3683k50244e6055j19500A8056
19119g0382L3369q304B0789J61301A488a59274B16899e4763m27978A27367a20651
$$ y = [-221613, 35188, -229828, 46104, -233193, -123620, -209103, -130571, -35312, -219377, -7548, -112912, -199594, -124305, 96975, -66573, -114777, -223439, -125430, 155160, -385240, -166669, -35424, -151065, -346588, -103950, 193133, 427756, -147713, 94671, 273230, 96025, 27840, 21907, 152050, -214733, 71415, -176120, -123125, -126250, -169391, -165558, 46363, -342698, -163526, -78427, 104308, 26121, -100778, -9656, -108787, -117475, 20488, -30856, -271955, 54326, 150534, -47286, 57483, 97431, -302359, -120373, -118944, -142495, -170854, -96627, -319659, -204047, -154433, -74211, -219591, -526, -227882, -16353, -30036, -280280, -56055, -175555, 18056, -70382, -37013, -45317, 20789, 182090, 1488, -159274, 216899, -54763, -482741, 127367, -120651]
19107c4888m80568K34761J101C76513a81543d6143q6862M6287l6311f1070j69479
19096b30549D9414H721P258a10505b0192n4635q0806J9231m4523B65678B3954
19084b20044H3257a21461D2004c48405E3877c707k70703A6691a10874a3167H0169
19072C54008H1918a06942A16282c8190k21958g4593a5897l18254i5460B04241
19061b88613A13127b3518p2689j69998A84812i1953n9064j7796A90376q9099J70317
19050B71594b6897j72487b4144A20514C427a07848j1611C3232a17779q0050l863
19039b01692c3369C31135b31628o4305B71661j02149F2447e0988A43871N6635
19029B00506a1183C6858Q2563C0838N3696J33715J6074d8495A80524I58d0581
$$ y = [-34888, -515456, -280695, -279594, 376513, -181543, -46143, -133005, -86718, -123029, -61070, -230549, 49414, 8721, 15979, -110505, -20192, -74827, -155633, -136402, -180925, 265678, 23954, -220044, 83257, -121461, 42004, -348405, 53877, -3707, -274410, 16691, -110874, -13167, 80169, 354008, 81918, -106942, 116282, -38190, -260148, -74593, -15897, -334151, -95460, 204241, -288613, 113127, -23518, -96207, -266205, 184812, -91953, -151017, -168813, 190376, 101277, 271594, -26897, -199384, -24144, 120514, 3427, -107848, -119459, 33232, -117779, -197829, -201692, -33369, 331135, -231628, -295933, 271661, 169512, 62447, -50988, 143871, 200506, -11183, 36858, 119421, 30838, 84534, 218249, 234323, -48495, 180524, 958, -40581]
19017b7821A94824H6977J05645a62441A62777a79846E2738a45581p9895I0392
19006H7857J170B1351c5220A84328a84363C4724i9898j04894R9862p4346J727
18995a77549A84524a17869k2886O8455F1157J61700K02883c92008J32527B11622
18984D9986a97061d0406o5802H6387O45j1766b01931C9824c2133l3871j03317
18973a69321O6049B0514a99906q1430G0395K7007a57526I9293a85819j88658E5183
18961H1630f1905j66066Q4241B38877a81721C18863a14882n1847m2934f7796k03077
18950b70873L115D19406b13547i478G4965b78830c3409k70817B75482D246a85873
18938b02604j37885g284j64524B07795a6650j18985A88740a3417l00485J37107
$$ y = [-27821, 194824, 86977, 192622, -162441, 162777, -179846, 52738, -145581, -225476, 90392, 87857, 89027, 21351, -35220, 184328, -184363, 34724, -99898, -204792, -104930, -179276, -177549, 184524, -117869, -140755, -72300, 61157, 222857, 425740, -392008, -259481, 211622, 49986, -197061, -40406, -106208, 86387, 87032, 75266, -201931, 39824, -32133, -66004, -169321, -103272, 20514, -199906, -281336, 70395, 97402, -157526, 99293, -185819, -374477, 55183, 81630, -61905, -227971, -143730, 238877, -181721, 318863, -114882, -166729, -209663, -67796, -270873, -267758, 419406, -213547, -9478, 74965, -278830, -33409, -304226, 275482, 4246, -185873, -202604, -340489, -7284, -171808, 207795, -16650, -135635, 188740, -13417, -313902, -176795]
18928a76795G0290c95615E9593R6570J38344J05420h1205B02634a29648C2459
18917e9961j08519k7469N6096a7005E7627j2540J57385b99636B10357m020a15546
18905a43015j53193e5167A5586b88526B61078a2493k17264m1702g1931j28927
18895b00858C4280a02608c037j21728N5612c2753P28l7013a9308j56005b9979
18883a29727A11364R6217a63683A29873i2552H8500N8962a05360l2840C9550A2538
18871a37175H1683a50107o940B35810A8111a70927A13388J7850a41003N9842j04554
18860a85715O5248B52250A6000O3146A4693B516L57169H1290k2039L4996J13964
18849B08211b44429B34195b2732j6659l9590A14463i4420B87990d58149a62203
$$ y = [-176795, 70290, -395615, 59593, 156163, 294507, 399927, -81205, 202634, -129648, 32459, -59961, -168480, -195949, -139853, -17005, 57627, 45087, 202472, -299636, 210357, 206337, -115546, -143015, -296208, -55167, 15586, -288526, 261078, -12493, -229757, -271459, -71931, -200858, 34280, -102608, -3037, -124765, -69153, -32753, -32025, -69038, -19308, -175313, -29979, -129727, 111364, 207581, -163683, 129873, -92552, 88500, 147462, -105360, -138200, 39550, 12538, -137175, 81683, -150107, -157047, 235810, 18111, -170927, 113388, 131238, -141003, -81161, -185715, -120467, 252250, 16000, 79146, 14693, 2516, 359685, 81290, 59251, 94247, 208211, -244429, 234195, -22732, -39391, -78981, 114463, -94420, 287990, -458149, -162203]
18838e8346C16984A41614a70916P0296n6679n7661I6486b5759B80103a3460A51857
18826b5216j07658j11213H9885a23769e9066q5027K4141D29438j78305J8926H0561
18814A08295J70163o265J61544a47901E4106j9398K08264b5956E8579M8485h7652
18802A33065a16045D3188J25100d5789j6388j0234J1578r6550A64963D6304m26
18791D5878d9384k41279H6789J4726J39365a73043a2249j2750k70362I2283j373
18780I0910b50860b8698r4158k03495h6524A7652d34321a38531e6403k3777b4154
18768b05286N1722A74566p0801J28362E9708c13047i6896B00770f3126j69606
18758b32732O7448A20712P541a36697n0395K1135L3323r2198n7843m6338A88117
$$ y = [-58346, 316984, 141614, -170916, -100620, -157299, -214960, 96486, -25759, 280103, -13460, 151857, -25216, -132874, -244087, 89885, -123769, -59066, -144093, -119952, 429438, 251133, 270059, 80561, 108295, 278458, 272193, 433737, -147901, 54106, 34708, 242972, -25956, 58579, 107064, -87652, 133065, -116045, 43188, 168288, -45789, -62177, -72411, -60833, -157383, 164963, 46304, 45878, -49384, -290663, 86789, 101515, 240880, -173043, -12249, -24999, -295361, 92283, 90910, -250860, -28698, -122856, -326351, -86524, 17652, -434321, -138531, -56403, -80180, -24154, -205286, -153564, 174566, 103765, 232127, 59708, -313047, -96896, 200770, -63126, -232732, -165284, 120712, 128253, -136697, -187092, -165957, -132634, -224832, -282675, -329013, 188117]
18746c4198j52090A11560c63393J12833h5358F3539L8086d1085A23878a04316
18735b30986L9967m68772A4007a17045N5901A12444L4751a88490H5138a83245
18724g0361k08696A97376e8744A0596J92128I6276a17390B15313b42459A32234
18713A55134a10629j455L4040A12109a35322j91747K8155I0830J6608K04505A2370
18701a9528I6655J36257q6503a79551e1954j27014r0246h5987I6680L5305C1496
18689A12442D1270b78852f149p4985k01675A60546b15513e249C8573d4481j16529
18678a61010m2384b002k7319B12876i6252A30868a25868N3788b5182A31031a30220
18666a04728B76029A35501B5802K20481F6329h289j44705q1166Q7832c9727k28726
$$ y = [-34198, -186288, 111560, -363393, -250560, -85358, 63539, 101625, -41085, 123878, -104316, -230986, -191019, -659791, 14007, -117045, -61144, 112444, 147195, -188490, 85138, -183245, -70361, -279057, 197376, -58744, 10596, 202724, 96276, -117390, 215313, -242459, 132234, 155134, -110629, -112084, -78044, 112109, -135322, -327069, -298914, 90830, 107438, 311943, 12370, -19528, 96655, 232912, 146409, -179551, -51954, -178968, -269214, -85987, 96680, 131985, 31496, 112442, 41270, -278852, -6149, -81134, -282809, 160546, -215513, -5249, 38573, -44481, -161010, -203394, -2002, -29321, 212876, -96252, 130868, -125868, -72080, -25182, 131031, -130220, -104728, 276029, 135501, 25802, 246283, 66329, -8289, -152994, -234160, -146328, -39727, -268453]
18655b68453j0465M2699B04659c8403k27979F3250a86079A70563d19621a63204
18644D54079C2839b1507B0425h9503j49981B01333Q8191a30455q3261A6786a04087
18632a18073a9557k37070C9635b86050a703C35196j17378f0779p2546B48301o388
18621B41913c26997A4642J5514a70094D37g9375j42428F9393b59430d1472A5815
18609B1694N1859L027A3217c2065l7065A7175b57768f6145J8169p705k69160a06361
18596a4897A58012c57336Q0607A08400D7973b49126O0972e6623m31833f5604k09674
18585b75278b016j7986B31720b48696q9752b8893J3709H4054c8303B55555a56204
18573C0712K81195K1923b26681j89263B4303F583R2628a97216A29133b01589I9533
$$ y = [-268453, -278918, -236219, 204659, -38403, -266382, 63250, -186079, 170563, -419621, -163204, 454079, 32839, -21507, 20425, -89503, -239484, 201333, 289524, -130455, -213716, 16786, -104087, -118073, -19557, -256627, 39635, -286050, -1703, 335196, 217818, -60779, -133325, 248301, 241913, -326997, 14642, 30156, -170094, 437, -79375, -221803, 69393, -259430, -41472, 15815, 21694, 73553, 76580, 13217, -32065, -69130, 17175, -257768, -66145, -47976, -55681, -324841, -106361, -14897, 158012, -357336, -276729, 108400, 47973, -249126, -188154, -56623, -488456, -65604, -275278, -2016, -20002, 231720, -248696, -338448, -28893, -15184, 84054, -38303, 255555, -156204, 30712, 311907, 333830, -226681, -415944, 24303, 6583, 99211, -197216, 129133, -201589, 99533]
18561b37919g4302k29718a1001j4270m57913A83113d39548B13325a54830N6751
18551i8079k16129F9461N5787a57455J2265e30A27061a58911A96932b71366M8076
18540b23290h361k26843J03885F0022R3583E56J98787b12254A0241J3542K05802
18529B29585B0467a51024A65393n6523I67K8041e4188D6356c60394g8201r3341
18518a71542b2911n3414j3419j02129H6974a91672A95905o2269a35804A06245
18507G3381N1531m5624C4082c7746C02783a64870Q0378k20494d5343l7663a5362
18495f3338A78121L9005c79423g5844D70402b62438B66835a98363R3880J3673
18485i0810C60803a87479f180j56172f4367C22392i2518n1176l2907A30892L2015
$$ y = [-237919, -74302, -304020, -11001, -25271, -483184, 183113, -439548, 213325, -154830, -98079, -314208, 69461, 125248, -157455, -145190, -530, 127061, -158911, 196932, -271366, -223290, -8361, -235204, -131319, 60022, 153605, 556, 199343, -212254, 10241, 23783, 229585, 20467, -151024, 165393, 108870, 967, 29008, -54188, 46356, -360394, -78201, -171542, -22911, -76325, -89744, -191873, 86974, -191672, 195905, 133636, -135804, 106245, 73381, 124912, 79288, 34082, -37746, 302783, -164870, -84492, -304986, -45343, -83006, -15362, -63338, 178121, 217126, -379423, -75844, 470402, -262438, 266835, -198363, -104483, -90810, 360803, -187479, -6180, -162352, -64367, 322392, -92518, -143694, -176601, 130892, 162907]
18474A62907b05867Q6086q3884F2447A3914K04355e67227a23252J8598R921J0951
18463h3782n8636C9498a26524L4008D1057H926c2494q5854l2318H685J29611O6029
18451B04325b3644A53874a51375A87928b46644I2358d30749A92360b686B35917
18440c39540g0722b3522k6474A23649n2445N4757B618J21455c5055l70126a69656
18428B38860a00747J7214m34612a14510D4884O5466k1698Q2750D4307a93744Q2193
18417a11551A2729b16007F617a78045A05558k8967b94335A58327i3996H7914e4255
18405D4196j6448O4826b4725m0907B07234j03478c00961C08822a60579g3063F570
18393e2279F5870K47980d8342p9137E4949c6533k63642A46932a39595A28244c52311
$$ y = [162907, -205867, -119781, -203665, 62447, 13914, 218269, -567227, -123252, -104654, -94733, -83782, -142418, 39498, -126524, -92516, 41057, 8926, -32494, -118348, -150666, 8685, 138296, 204325, -23644, 153874, -151375, 187928, -246644, 92358, -430749, 192360, -2686, 235917, -339540, -70722, -23522, -49996, 123649, 71204, 125961, 2618, 124073, -35055, -405181, -169656, 238860, -100747, -83533, -518145, -114510, 44884, 110350, 88652, 171402, 44307, -193744, -111551, 12729, -216007, 6617, -178045, 105558, 76591, -294335, 158327, -93996, 87914, -54255, 44196, 27748, 92574, -24725, -65632, 207234, 103756, -300961, 308822, -160579, -73063, 6570, -52279, 65870, 313850, -48342, -127479, 54949, -36533, -300175, 146932, -139595, 128244, -352311]
18381a81171A94406d1603k87234A93673b27179P0628I7672j269J12608b71223
18370a72426A98133h5646c3874K434A86891a32932A15438f884A39745a19644A52199
18358i5097p8236B57127D2368b47187a6575E7005g0596B0200d2291q8086d2327
18346a00453P849K5653j14874b1076A86657b2500k69052b9136k14778J09676j39593
18335b73831D07534A60543C9096N3683J38568B4738J72695e7648E1742g4400b0988
18323B0253d0081q2396r7986B58444d42579a92669A49394g4981F0006J19772D0741
18311a41362A81720b27359M3502C26505B6807b4880k42423I0270f4327D4775a16941
18299a95878k11382J10947J11847c9820j80527a9058h127m3341B2769P6044b50810
$$ y = [-181171, 194406, -41603, -328837, 193673, -227179, -156551, 97672, 96403, 209011, -271223, -172426, 198133, -85646, -33874, -31440, 186891, -132932, 115438, -6884, 139745, -119644, 152199, -95097, -173333, 257127, 42368, -247187, -16575, 57005, -70596, 20200, -42291, -130377, -42327, -100453, -92604, -66951, -181825, -21076, 186657, -22500, -291552, -29136, -243914, -134238, -273831, 407534, 160543, 39096, 92779, 231347, 24738, 197433, -57648, 51742, -74400, -20988, 20253, -40081, -122477, -220463, 258444, -442579, -192669, 149394, -74981, 60006, 179778, 40741, -141362, 181720, -227359, -183857, 326505, 26807, -24880, -267303, 90270, -64327, 44775, -116941, -195878, -407260, -296313, -184466, -39820, -220347, -19058, -8127, -51468, 22769, 98813, -250810]
18287C9838K08171a78571k8155A5371J36852E1063a22193j25925e9419a0245m4721
18276e4966j95885a7379l29198d2169J767I6195J3491I330b07151h83j69941B63184
18263e0576p6372d0287H6637K16033a20191k96905c3781H7695j9846a51151M5497
18252a05654A68578b56310D5365J92041k4872f1850J7278m19154a52654I7243
18241g4481B6907b18340R6916C09244j53454h1481B80624a02733A07097B6045
18230a54239D6120K9787J29527G7971b02891e9201b5582I5408b30722r5036a03913
18218i0955j57856o4565i895H3252b47732J844A36563C4391c297l076C2768a07672
18205A96857k6400l8504B5493K681b55531B8779j89J97853a47682G7663C3598
$$ y = [39838, 248009, -178571, -206726, 15371, 152223, 51063, -122193, -248118, -59419, -10245, -54966, -250851, -17379, -346577, -42169, -40402, 96195, 109686, 9330, -207151, -883, -170824, 263184, -50576, -126948, -40287, 86637, 302670, -120191, -417096, -33781, 87695, 67849, -151151, -105654, 168578, -256310, 45365, 237406, 212534, -61850, -44572, -463726, -152654, 97243, -74481, 26907, -218340, -121424, 309244, 155790, -81481, 280624, -102733, 107097, 26045, -154239, 46120, 75907, 205434, 77971, -202891, -59201, -25582, 95408, -230722, -325758, -103913, -90955, -248811, -313376, -9895, 83252, -247732, -245888, 136563, 34391, -3297, -6373, 32768, -107672, 196857, 170457, 131953, 25493, 28174, -255531, 28779, 28590, 226443, -147682, 77663, 33598]
18193C40498b54557J21821f0589p7337B0484i0895j33624d0513l03962J54155
18183a90320c8308B34O475f6438a0251A60524a19363m5504B2233L18440F5718
18171A66738b69462R8707n7952A07421e2431H763e551l1025k29484B05536e9290
18159a94266a621B26029h0092I6791d1509l71291D9632h8457K5991D93200b04308
18147b97795O4152J11821C16809a9673q0912j73301a6757A92020Q5290a91493
18136g9446k25141a37069B45697a72949B98265i9734B18971c20821a2031q9694
18126a01725k36308c9497D9322j8596J58740k9594a58991q3374B8061b4112p9470
18115a03582k7501C5765c5837A7294K92348I9978c37817b6923C18972h0839m3167
$$ y = [340498, -254557, -132736, -60589, -137926, 20484, -90895, -224519, -40513, -344475, -190320, -38308, 234, 6709, -66438, -10251, 160524, -119363, -164867, 22233, 340673, 65718, 166738, -269462, -170755, -228707, 107421, -52431, 8763, -5551, -36576, -266060, 205536, -59290, -194266, -1621, 226029, -80092, 96791, -41509, -412800, 49632, -88457, -62466, 493200, -204308, -297795, -233643, -121822, 316809, -19673, -100585, -273886, -16757, 192020, 277310, -191493, -79446, -304587, -137069, 245697, -172949, 298265, -99734, 218971, -320821, -12031, -101725, -338033, -39497, 49322, 30726, 189466, 159872, -158991, -242365, 28061, -24112, -103582, -131083, 35765, -35837, 17294, 309642, 99978, -337817, -26923, 318972, -80839, -124006]
18104a24006D1417J64490b98209g5644j14599f7342A5464a87428B58924a00542
18093G2865J12899a33598l0442G6087L3676d2127D3359c20781J16140D2811a01914
18081e131l3603E2698J38122a86025j34079N2371R3873B816c13679g7080A72683
18069a14771A03137R8459a54183B5757a10707m9309A48352D8226f8992j48905
18059b17897k38346K24532N7055A54401a88369c32k18342e2877j90716j08490
18049c52083B31687a60864r6038k105J26176c8131B73907G0303a30195c6756k11500
18038b48256F2395R1746g1142C1541J26926g862D72237g1290A34999a13817A45479
18026f0661A27504b00607D2838j8772a34685E2291c5996I9147b65432F2506J60929
$$ y = [-124006, 41417, 205907, -298209, -75644, -190243, -67342, 15464, -187428, 258924, -100542, 72865, 185764, -133598, -164040, 76087, 109763, -42127, 43359, -320781, -204641, 42811, -101914, -5131, -38734, 52698, 190820, -186025, -320104, -267733, -173860, 2816, -313679, -77080, 172683, -114771, 103137, 201596, -154183, 25757, -110707, -160016, 148352, 48226, -68992, -217897, -456243, -231711, -174656, 154401, -188369, -332, -218674, -52877, -243593, -352083, 231687, -160864, -256902, -259007, -132831, -38131, 273907, 70303, -130195, -36756, -248256, 62395, 154141, -71142, 31541, 158467, -7862, 472237, -71290, 134999, -113817, 145479, -60661, 127504, -200607, 42838, 24066, -134685, 52291, -35996, 99147, -265432, 62506, 223435]
18015B23435a59432D03863f3118q3589B27373c02257A1837a2740c50A58582J7641
18004A76223g3910e140C29804c44571J65279M1921C0181K04051a43451A48472
17993b9812j26944g8109h883B31933E6359a68864r7689A24101i6453A31303D9150
17981a34547J8606K7834b8798I7677J11298A7733d0879o1937B4211a82817A40339
17969A13868g4105A707b45433B17071I7223a99077Q7171N1202A9831L122J58672
17958A81625b2644k93332C0463A0194c1168P60p9488D6413b60815E9439c23239
17946A2840l912b19241e8463B9688f5876q9368j41973F8517b52975J414R3517
17935a58044C64080C7093N6042g1567K951o3885C0989J19479q7L0781a60717j25507
$$ y = [223435, -159432, 403863, -63118, -146707, 227373, -302257, 11837, -12740, -350, 158582, 176223, -73910, -5140, 329804, -344571, -179292, -137371, 30181, 234232, -143451, 148472, -29812, -156756, -78109, -8883, 231933, 56359, -168864, -266553, 124101, -96453, 131303, 49150, -134547, -115941, -88107, -28798, 97677, 208975, 17733, -40879, -102816, 24211, -182817, 140339, 113868, -74105, 1707, -245433, 217071, 97223, -199077, -111906, -60704, 19831, 22953, 181625, -22644, -315976, 30463, 10194, -31168, -30408, -109896, 46413, -260815, 59439, -323239, 12840, 8928, -219241, -58463, 29688, -65876, -155244, -297217, 68517, -252975, -251561, -158044, 364080, 37093, 93135, -71567, -68616, -132501, 30989, 150468, 150381, 181162, -160717, -286224]
17923b86224B2601g6067l1862q7966A72683a40100q9561c8018j08506j21466a01156
17911A60311a925B37800b27411C9872a56906J2291f4816m24587i1198B14672E3041
17899b21255B99260e1829A69448b13131A25590A6936L1047N6322N9721a17679
17888c0199G107J45831A2241b00546B84135h9177k5364H3096c0560C44016a36074
17876E5685a25638B69706c872E7433a79136j41390J45986b3504q3925G6751a0714
17864b34415g2468A94982P2509A27892a46355c0024A08154j4913d53851a524j88135
17853a89659Q2632C2183c3058A67913h7729l20A58961a18425A05445O5008J8969
17842A89422Q5275Q1967a18419B18801B5887c1807o8332m08834J41093f2238K9795
$$ y = [-286224, 22601, -76067, -107929, -195895, 172683, -140100, -229661, -38018, -146524, -267990, -101156, 160311, -1925, 237800, -227411, 39872, -156906, -144615, -64816, -489403, -91198, 214672, 53041, -221255, 299260, -51829, 169448, -213131, 125590, 16936, 47983, 104305, 164026, -117679, -30199, 7107, 152938, 12241, -200546, 284135, -89177, -114541, 83096, -30560, 344016, -136074, 55685, -125638, 269706, -3872, 57433, -179136, -320526, -174540, -23504, -107429, 76751, -10714, -234415, -72468, 194982, 267491, 127892, -146355, -30024, 108154, 93241, -453851, -1524, -189659, -107027, 32183, -33058, 167913, -87729, -88049, 158961, -118425, 105445, 170453, 189422, 274697, 356664, -118419, 218801, 25887, -31807, -100139, -508973, -367880, -62238, -32443]
17831c2443k39744J8425B02829e0442n470I643a79327G7008a03866D9093N638
17820E4731g3278D1302J04665a95785F8681h7921L7950B3833f8992C62M4106d6339
17807a08258a0851E3616Q7508a398A64025c53036J15787D09560a55016J5267k1736
17796a61485a8291j86438j3572E1136d7356q0026k3659b116A10897B8730h6007
17784B5313d07475a29661C10637F6821a11534n4131g4487P938l3926j15203a9782
17772b01824a2851A6292J29507a28843a5920j11660J0128r2660N3110D17331E5087
17760a29297A53891i8943r34j6062A02245c13243C1444c49625p058A96397a48303
17748h0318c3077G9810P965m1938J82429j5793a86761Q8065B80096g9411E33h0763
$$ y = [-32443, -272187, -253762, 202829, -50442, -55912, 9643, -179327, 77008, -103866, 49093, 54731, -73278, 41302, 145967, -195785, 68681, -87921, -49971, 23833, -68992, 362, 44468, -46339, -108258, -10851, 53616, 141124, -1398, 164025, -353036, -237249, 409560, -155016, -139749, -161485, -18291, -204729, -218301, 51136, -47356, -127382, -151041, -2116, 110897, 28730, -86007, 25313, -407475, -129661, 310637, 66821, -111534, -165665, -74487, -66549, -100475, -215678, -19782, -201824, -12851, 16292, 145799, -128843, -15920, -127580, -117452, -210112, -157002, 417331, 55087, -129297, 153891, -98943, -99877, -115939, 102245, -313243, 31444, -349625, -356683, 196397, -148303, -80318, -33077, 79810, 87775, 45837, 228266, 212473, -186761, -98696, 280096, -79411, 533, -80763]
17735I0534a04229Q757A83078D2233a76480f2359m7062I6290a62671c2609A25640
17723d7527B64853l5447m5645i0635j41204a10783A09510M4185I371J73355a20508
17711A10562B8573L6520b30231A18784l3236K74683j75725G7180a78867L7743
17701a41124B47067A22260d1084n4062L5147j92803A14597J7111P2331a08903
17690A73408J3340J47702b09700f4173L161o2078n4686L2015A12593b0842j03786
17679a24628N595H3977a05918A91941f8150c3764n3874G0196J15490a43435q1869
17668b25304C70801F5280d2245j59542p7944B84534j21374m4877K68721A13978
17657F7085J32023A7912c56710E3240K020J34921J43493a67168A28230D4758a24777
$$ y = [90534, -104229, -95472, 183078, 42233, -176480, -62359, -109421, 96290, -162671, -32609, 125640, -47527, 264853, 229406, 183761, -90635, -231839, -110783, 109510, 153695, 9371, 182726, -120508, 110562, 28573, 65093, -230231, 118784, 85548, 360231, 184506, 77180, -178867, -141124, 247067, 122260, -41084, -95146, -59999, -252802, 114597, 131708, 204039, -108903, 173408, 186748, 334450, -209700, -64173, -61012, -123090, -177776, -145761, 112593, -20842, -124628, -119033, 83977, -105918, 191941, -68150, -33764, -87638, 70196, 185686, -143435, -225304, 370801, 65280, -42245, -201787, -279731, 284534, 163160, 118283, 387004, 113978, 67085, 199108, 17912, -356710, 53240, 55260, 190181, 333674, -167168, 128230, 44758, -124777]
17645D5555a85215c3099F8335b93779h5704I8807c45510G7814c59618a27620J9759
17634a07861D9942N7385b8693j84559A72954C1303j4285P1794A0124a45019F5646
17622D06153e2202j2950A640K04494a49393P748q5066a5496k1059A33304C8834
17610A64367J22993D9427B4180g7175H8886i5434B89622B1921a79432A07420b0104
17598E57757i5912I7542J11771k0589c42862M3263H9270M4801B1195f1665q2310
17587a43975A94192o8108q84C6353L29381j30858H8147a167l49797P6592P193
17576b67179A27567m004c38808h4744I0912b50454C89298H7533L7772b31508j44190
17565c75698A14271R6265p446J4067f8511A63752m2632Q0204i3871j7708M2765
$$ y = [45555, -185215, -33099, 68335, -293779, -85704, 98807, -345510, 77814, -359618, -127620, -107861, 49942, 107327, -28693, -213252, 172954, 31303, 17018, 88812, 10124, -145019, 65646, 406153, -52202, -65152, 1640, 206134, -149393, -141645, -226711, -15496, -36555, 133304, 38834, 164367, 287360, 49427, 24180, -77175, 88886, -95434, 289622, 21921, -179432, 107420, -20104, 557757, -95912, 97542, 209313, 188724, -342862, -299599, 89270, 134071, 21195, -61665, -143975, 194192, 126084, 125200, 36353, 365734, 234876, 88147, -1167, -350964, -274372, -267179, 127567, 123563, -338808, -84744, 90912, -250454, 389298, 87533, 125305, -231508, -375698, 114271, 210536, 203090, 217157, -68511, 163752, 121120, 201324, -93871, -111579, -68814]
17554f8814B07384b84915B4348K28269b44569A35043F0807a385A58020G4120e792
17542f3682q7027E4355R1884k9817l669K49946A13981a14207B6237i97B70471
17530A591O4692J8738K76h7519L0868E023g2156B87330i2629K995A34684a37349
17517a65178P3485k60898A08353b35339A27388K5538C5755a32239K5499D6665
17506B03034J36598H0274a46407D6351m143J11782M1869H7205r487L44566j14630
17495C07654K6908j23260D0588K10952c30353c6261B11113a49705A5094K06290
17485B21384I8412h5326B9755L57282J9130l9680K07913a86650A43785R989k9315
17474A24459J9911b37603f3039C34255K32396A25828n9893l1181c7192C32859
$$ y = [-68814, 207384, -284915, 24348, 252617, -244569, 135043, 60807, -1385, 158020, 74120, -5792, -63682, -150709, 54355, 146239, 116422, 112753, 362699, 113981, -114207, 26237, -997, 270471, 1591, 66283, 85021, 85297, -87519, -56651, 5023, -72156, 287330, -92629, -89634, 134684, -137349, -165178, -91693, -352591, 108353, -235339, 127388, 152926, 35755, -132239, -106740, 46665, 203034, 339632, 80274, -146407, 46351, 42208, 153990, 195859, 87205, 77718, 422284, 307654, 334562, 211302, 40588, 251540, -330353, -36261, 211113, -149705, 15094, 221384, 98412, -85326, 29755, 387037, 406167, 366487, 574400, -186650, 143785, 153774, 124459, 144370, -237603, -63039, 334255, 566651, 125828, 65935, 34754, -37192, 332859]
17463a59796A21614E2780j057M8335J07020m3904K27469A69302j3000b2207C25439
17451C74205E4898J69575l3002H0902K09347G8075L78430k18704J29105b81836
17440I2001c3783A15754L50072r1351G1367J42368e9536A48951K4796p0487J75164
17429B78424l3805A9589K57553j6487p6218e4222A38434K91017m2698a08844k9809
17418a38653B83357K3009L7004j50511J16241K25351j38790m2788A62559P1904
17408B34463G1673e4277m4734B38343r8079i5524A60705P876J17559B827J78341
17397A81168J30072j24665n8903C4338N18430A31743a207E3865R8655G3283a66599
17385B33287J55052j14533I0413L2626J55433K16849B32700a31194G5045N4209
$$ y = [-159796, 121614, 52780, 51723, 100058, 207078, 163174, 390643, 169302, 156302, -22207, 325439, 374205, 54898, 224473, 191471, 80902, 290249, 78075, 456505, 237801, 366906, -281836, 92001, -33783, 115754, 465826, 374475, 71367, 213735, -59536, 148951, 173747, 103260, 278424, 244619, 19589, 277142, 260655, 184437, -54222, 138434, 429451, 386753, -108844, -138653, 283357, 306366, 343370, 192859, 309100, 534451, 395661, 352873, 162559, 234463, 71673, -54277, -99011, 238343, 140264, -95524, 160705, 168581, 286140, 2827, 181168, 311240, 186575, 127672, 34338, 552768, 131743, -1207, 53865, 152520, 73283, -166599, 233287, 388339, 273806, 90413, 123039, 278472, 495321, 232700, -131194, 75045, 129254]
17375A29254h4459C57699A56697K43226C5570K86603a8285p4317c4309H6257K24010
17364C10267q8721G0176L81398j90946d00683h0825b4556B72391A20697E1038
17353i3759C13076n3976d0025D36265d7009H2606L00391h7474H7938k8610b6793
17341F6608i2327F2036R4873J06371F9807a61701F9017J91709I922K63315p5477
17330A97760J18715A10762c6632a6774A49810E9851L9094J23221A09377J19381
17320B28758j793G8907L52129f7693A21582J2539d4928A31985j487J08650a28265
17308c55683g483E8978K14152D1175j0402R4707q431Q6197E0193Q5128J48440
17297B83761j10700a71675H9048M5086L8737O8759a72404F8761K2560K21510j06459
$$ y = [129254, -84459, 357699, 156697, 399923, 35570, 322173, -18285, -92602, -34309, 86257, 310267, 221546, 70176, 451574, 260628, -400683, -80825, -24556, 272391, 120697, 51038, -93759, 313076, 259100, -40025, 436265, -47009, 82606, 382997, -87474, 87938, 59328, -26793, 66608, -92327, 62036, 156909, 263280, 69807, -161701, 69017, 260726, 9922, 273237, 197760, 316475, 110762, -36632, -16774, 149810, 59851, 98945, 222166, 109377, 228758, 226965, 78907, 431036, -67693, 121582, 134121, -44928, 131985, 130498, 239148, -128265, -355683, -7483, 58978, 273130, 41175, 30773, 125480, 117049, 203246, 50193, 135321, 283761, 173061, -171675, 89048, 134134, 172871, 241630, -172404, 68761, 91321, 312831, 206372]
17286B06372K70465j38954h7854C3003O0202J75039I210Q3736J26471p0124p3618
17275G5675q75L87835E1380M69836j66460a04399E5547J20069J93847A22974L7014
17264A59988M5858H725M51491b2372B12615r5060M1150o0275J10709m4620b29581
17252A74611E6438k579O6739E8422B2030J82661k0615q8963M0544m4074b88817
17240c6759C12388c3694A96934K4276l06C2981J77629K20480A59463L11207j23268
17229C47402a3526B43781c4281A0588N6403g2807K0195B09423k0039K3376b9692
17217B72302j21231k4972Q9220R477J39219J27952l5698b41240A6363L7616J75890
17206B29869B4993i4171c699D53515G3953a54260B68759j05820K7993o4166K7364
$$ y = [206372, 476837, 337883, -87854, 33003, 93205, 268244, 9210, 92946, 219417, 149293, 75675, 74800, 462635, 51380, 521216, 354756, -104399, 55547, 175616, 369463, 122974, 159988, 205846, 8725, 460216, -22372, 212615, 117555, 158705, 98430, 209139, 164519, -229581, 174611, 56438, 53859, 120598, 58422, 22030, 204691, 184076, 95113, 135657, 91583, -288817, -36759, 312388, -33694, 196934, 221210, 220904, 32981, 210610, 431090, 159463, 470670, 347402, -13526, 243781, -34281, 10588, 66991, -72807, -52612, 209423, 189384, 212760, -29692, 272302, 151071, 126099, 215319, 224796, 364015, 491967, 456269, -241240, 16363, 53979, 229869, 24993, -94171, -3699, 453515, 73953, -154260, 268759, 162939, 190932, 126766, 154130]
17195A54130J14802J33791a3145E13098B24161H387M28114A70774J00728i1191
17184A95723Q0431A35922K08462A56559L9245K01191A732L05662j24865N9236
17174B41765L6299J67872A33327O7331J59400H6748J20210l8973a4000A46227
17163C21195B5794J79564r7537L59300A65435m11J39085b75465A74709K90017
17153D64726j37112J98221k60749J75889j91425J56809p9426c4113B98173r7576
17143B00597B1943L16766j64587j2547A7867M21854j8334j35320J39297G4288
17132B34820D2565P7505K07218f5281E00442M3564B65605i9885A55397M09871
17122E65268k41650l7556N14764B23790p3445K62612J0168B10973J86614J6652
$$ y = [154130, 268932, 402723, -13145, 513098, 224161, 8387, 436501, 170774, 271502, -91191, 195723, 276154, 135922, 344384, 156559, 195804, 396995, 1732, 307394, 182529, 241765, 278064, 445936, 133327, 200658, 360058, 86748, 206958, 167985, -14000, 146227, 321195, 25794, 205358, 107821, 467121, 165435, 165024, 304109, -275465, 174709, 464726, 327614, 525835, 265086, 440975, 249550, 406359, 326933, -34113, 298173, 200597, 21943, 338709, 174122, 161575, 17867, 439721, 421387, 286067, 425364, 74288, 234820, 42565, 120070, 327288, -65281, 500442, 544006, 265605, -99885, 155397, 565268, 323618, 286062, 800826, 223790, 150345, 412957, 423125, 210973, 397587, 414239]
17112D14239J1907Q0896k26492G2127M95775j72398A17459J79964j39742K77850
17102D35531j25462J12541A99050L72571B02476J35661A20697j5352k962N52738
17092F55121k29131O5734l9096K2568k602j19766J98559n4600r2141l2949J65093
17081E36790B22475J49722q764J5633k0182l3890A55527e9421A79536P8014P9809
17070C37359j34727J21953K2453A56953L00369L1118A47506J17709G1718M31748
17060E03466p677A38741J94896J4542J78617n0070r8694o2373k3379O4702K05475
17049E62457j7534J02449j29778J31209f0165E07490j50586M8930L02515C15186
17038E45783B48852N60660B82034N28118C90045k7909K26626j69335J20173K51812
$$ y = [414239, 426146, 507042, 280550, 72127, 567902, 395504, 117459, 297423, 157681, 435531, 310069, 422610, 199050, 571621, 202476, 338137, 120697, 105345, 102383, 655121, 425990, 491724, 452628, 475196, 472594, 352828, 551387, 496787, 404646, 371697, 536790, 222475, 372197, 363433, 379066, 358884, 324994, 155527, -59421, 179536, 257550, 337359, 202632, 324585, 347038, 156953, 457322, 488440, 147506, 265215, 71718, 503466, 495789, 138741, 333637, 348179, 526796, 476726, 378032, 315659, 292280, 356982, 562457, 544923, 647372, 517594, 648803, -60165, 507490, 356904, 405834, 708349, 315186, 545783, 248852, 809512, 282034, 810152, 390045, 362136, 588762, 419427, 539600, 791412]
17028G91412r5012q9671J25535l43395j21274J81024P9166q916L74978l05182
17018E88665j46325j80923K87519K9934J39769B41838N09423j81043j7388j02547
17008D50283L59779K8957l80219J01608L08017R349k44079R0610k01386j34281
16998C88638J15122J86622j22598k6037L09645l81508L0807J19490j23178J76547
16988F73550L65414j62775m28171J70611R6369Q6351p4507R0391k35085K58032
16978H40180M5553l25531K65298k77847K69866n5057K9468M6815k44568N00423
16968A094600k15517k07563K24302k21681N26135l97142L81990C79305M18687
16959G97992j16637K72257j16970k70522J89784K97273k63273J70075L0335o9183
$$ y = [791412, 696400, 606729, 732264, 388869, 267595, 448619, 527785, 518869, 893847, 588665, 442340, 261417, 548936, 578870, 718639, 241838, 751261, 570218, 552830, 450283, 810062, 839019, 458800, 560408, 868425, 877774, 633695, 724305, 522919, 388638, 503760, 690382, 567784, 541747, 851392, 469884, 500691, 620181, 497003, 673550, 1038964, 876189, 448018, 618629, 714998, 801349, 726842, 817233, 582148, 840180, 885733, 560202, 825500, 547653, 817519, 762462, 791930, 838745, 594177, 1094600, 879083, 671520, 895822, 674141, 1200276, 803134, 1185124, 379305, 797992, 681355, 953612, 836642, 566120, 755904, 1053177, 789904, 959979, 990314, 921131]
16949I21131j47408P7218j86688M96015J44123k41551K9246J05648M031k96463
16939I05302J67339j67128K06204j4515j6055R4700q160j57471k92781N42115
16929A259550n396J67914l12484J84000l3900L2916n42966O59159J0717m59920
16919I59590O54902o05707J2358J23335J98599L37523o69981K61436K0827J39123
16909A432005k41094J00731J22122K4842K84220j92737j56343K67119j18801K41423
16899A763487l24628K49631n4882R0553J29629k71497q9896K97943r8731q9246
16889A602363Q0413p6860k14722N72953r2361k20877j6237K41275J3723J9570
16879A909240n741K3259k713k06718J97304p1132M79371N6274L9056k39977j20045
$$ y = [921131, 773723, 850941, 664253, 1160268, 1304391, 1062840, 1092086, 1197734, 1201765, 905302, 1072641, 905513, 1111717, 1097202, 1081147, 1175847, 1167687, 1010216, 717435, 1259550, 1254154, 1422068, 1109584, 1293584, 1259684, 1292600, 749634, 1408793, 1419510, 959590, 1614492, 1008785, 1021143, 1144478, 1343077, 1680600, 1010619, 1272055, 1292882, 1432005, 1190911, 1291642, 1413764, 1438606, 1722826, 1530089, 1373746, 1640865, 1522064, 1763487, 1438859, 1688490, 1633608, 1724161, 1853790, 1582293, 1492397, 1790340, 1691609, 1602363, 1682776, 1605916, 1391194, 1964147, 1871786, 1650909, 1634672, 1875947, 1889670, 1909240, 1903499, 1926758, 1924045, 1717327, 1914631, 1843499, 2322870, 2379144, 2418200, 2178223, 2058178]
16868B058178J03068m961J45569j86881M12755o6249l2168q895n7866J0150j65106
16857B207594L41485m2813J28303j75892p9832L52678q461J50246m1719p6695
16847B754894M53043j89053k7219L7548J99621l63574L28028J54749K51569k51311
16837C348295k4774J94619q1398L38501k85500L89764j78289L0606K19323k60118
16827C691029L44253J17993J98817l538J13794k14372J05913O7157J99921N6220
16817D677187j29587L40870M33750L2907l43956L84340K29495k13617L80235k99249
16807E492375N15923j14028N68599j8847m62082O10544J12326J6982K15859K84220
16797G221871n1505J80753N96532j02124M32050j53629K93588J18572M25585Q5262
$$ y = [2058178, 2161246, 2156285, 2301854, 2114973, 2527728, 2461479, 2429311, 2420416, 2362550, 2372700, 2207594, 2549079, 2506266, 2634569, 2458677, 2378845, 2731523, 2723062, 2873308, 2831589, 2754894, 3207937, 3018884, 2991665, 3029213, 3228834, 2865260, 3193288, 3348037, 3599606, 3348295, 3323521, 3518140, 3436742, 3775243, 3489743, 3879507, 3701218, 3731824, 3951147, 3691029, 4035282, 4153275, 4352092, 4348554, 4462348, 4247976, 4353889, 4421046, 4620967, 4677187, 4547600, 4888470, 5322220, 5355127, 5011171, 5395511, 5625006, 5411389, 5791624, 5492375, 6008298, 5894270, 6462869, 6444022, 5981940, 6592484, 6704810, 6721792, 6937651, 7221871, 7170366, 7351119, 7947651, 7845527, 8277577, 8123948, 8417536, 8536108, 8961693, 9046955]
16787I046955K3998N57567N27838p674L77419Q7346N58163J86107n1003M12235
16777A1718951Q61803K31740M03099M57195p1055K65563R50291K56452O01596
16768A5675635M08845Q52879R3705N89574Q79357R58620O67090M31857J087592
16759B1645154Q52417P90085R56137P86882R90103J629705J474218P54090J883553
16750C1762344R45495J332945K000542J576713J618507K628911K178206K017250
16742D6060913K445760L166135K572569L125832L213402L912995L750241M262873
16734G2510720M175778M732455N641389N355559O166159O516362O662409P300450
16726A19061281P257993P479848Q301259Q000609Q123259P942755P421627P228435
$$ y = [9046955, 9070953, 9628520, 10156358, 10148684, 10526103, 10613449, 11171612, 11357719, 11306716, 11718951, 12580754, 12812494, 13215593, 13672788, 13601733, 13867296, 14817587, 15074039, 15675635, 16084480, 16937359, 17031064, 17620638, 18499995, 19458615, 20125705, 20557562, 21645154, 22497571, 23287656, 24243793, 25030675, 26020778, 27650483, 29124701, 29878791, 31762344, 32707839, 34040784, 36041326, 37618039, 39236546, 41865457, 44043663, 46060913, 48506673, 51672808, 54245377, 57371209, 60584611, 64497606, 68247847, 72510720, 76686498, 81418953, 87060342, 92415901, 98582060, 105098422, 111760831, 119061281, 126319274, 133799122, 142100381, 150100990, 158224249, 166167004, 173588631, 180817066]
16718A80817066O515606N361749M016624L033797J841712m3748j710321k707489
16710A97124996l685345n024065o761446o869270p831717p839283q103612p886570
16702A43123688q199073q237343p380629p412966o904904o450764n937285n702084
16694H6898640n519153m979822m371946m389690m094277l685577l411875l219870
16686E3226430l049908k582429k491305k603917j999708j570549k319715j504334
16678C5104565j868992j541081j515380j326797j385296j016028r48620j398770
16670B4103601q86187j085139o04342r32283j265265k42846q69312o56860k40034
16661A7321333q35416n20629p87692n36709l25644n95111l85636p86631j33881
$$ y = [180817066, 187332672, 192694421, 196711045, 199744842, 201586554, 201542806, 199832485, 197124996, 193439651, 188415586, 181654140, 174784870, 166953153, 159113870, 151010258, 143123688, 134924615, 126687272, 119306643, 111893677, 104988773, 98538009, 92600724, 86898640, 81379487, 76399665, 72027719, 67638029, 63543752, 59858175, 56446300, 53226430, 50176522, 47594093, 45102788, 42498871, 40499163, 38928614, 36608899, 35104565, 33235573, 31694492, 30179112, 28852315, 27467019, 26450991, 25502371, 24103601, 23217414, 22132275, 21527933, 20595650, 19330385, 19087539, 18218227, 17561367, 17321333, 16485917, 15965288, 15177596, 14640887, 14315243, 13720132, 13334496, 12547865, 12413984]
16652A2413984p83858k7791m53359j05195k82833p18042J80401n16565l33568
16643I373174l25316J26227n22300j19233k93757O1232p66400K69443m84606o5869
16633G252595l07444K4645j53378l65476j187j74831p57144J80174k77494M82255
16623E902715l61682M13583n24646k23009K29287n96090j10490l2445R2600l38239
16613D451584q1798j6826j91373K59078k25851j12473k76357j25288L7157J49300
16603C867153l93861j28518K58105k57389j65001j951K80727p1261n3696m69765
16593B864543P45459r60389J11165J39126k18416K19674p657j13847r1908k94807
16583B392943J08385M7603k8407k10873N5060J45587l56367J29411m9502Q1890
$$ y = [12413984, 11630126, 11602335, 11148976, 11043781, 10760948, 10042906, 10223307, 9706742, 9373174, 9047858, 9174085, 8651785, 8532552, 8238795, 8300027, 7533627, 7803070, 7318464, 7252595, 6945151, 6969796, 6816418, 6450942, 6449755, 6274924, 5517780, 5697954, 5420460, 5902715, 5541033, 5954616, 5429970, 5206961, 5436248, 4840158, 4729668, 4697223, 4789823, 4451584, 4369786, 4352960, 4161587, 4420665, 4194814, 4082341, 3805984, 3680696, 3717853, 3867153, 3473292, 3344774, 3602879, 3345490, 3180489, 3178538, 3459265, 3388004, 3334308, 2864543, 3610002, 2649613, 2760778, 2899904, 2681488, 2901162, 2893505, 2779658, 2687750, 2392943, 2501328, 2548931, 2520524, 2309651, 2364711, 2510298, 2153931, 2283342, 2233840, 2315730]
16573B315730P9878n9996k47271K02142k26909J4843Q6987k50522j99078K90354
16563B006158J12292n02009N61882m18267K1803K8409J93454k54080K01928l90215
16553A561355K99238j73210k04264R9094p219O6042k74947O6282r6986Q2825O8484
16542A486694k4767L07624k36621m13493L7408K34628P7478j57158j65187J84777
16532A331383k07890l1590L15316n5138j52592p4044O1557k21031M18675J99491
16522A584137m45942K26943m44129q648K18646j78271L67392l61735J9066J39640
16512A117099J23856j6671k83873K29107j43475m39468N90289k36463p7366k42045
16502F20990L30456j79181M78962n08393K96215j20068l73633N35803k57613J41877
$$ y = [2315730, 2395608, 2335612, 2088341, 2290483, 2063574, 2078417, 2165404, 1914882, 1715804, 2006158, 2118450, 1616441, 2178323, 1760056, 1781859, 1810268, 2003722, 1749642, 1951570, 1561355, 1860593, 1687383, 1483119, 1582213, 1574994, 1641036, 1366089, 1432371, 1335385, 1418210, 1486694, 1461927, 1769551, 1532930, 1119437, 1156845, 1391473, 1468951, 1311793, 1146606, 1331383, 1123493, 1091903, 1407219, 1352081, 1199489, 1125445, 1187002, 965971, 1384646, 1584137, 1138195, 1365138, 921009, 912361, 1131007, 952736, 1320128, 958393, 977459, 1117099, 1240955, 1224284, 940411, 1169518, 1026043, 586575, 1176864, 940401, 863035, 620990, 951446, 772265, 1251227, 742834, 1039049, 918981, 545348, 1081151, 823538, 965415]
16492I65415k20371k51908M71759p3322k53953K85772l61486J82755k89285K23095
16482F78471K83638C71958J22568K03932K96685k73862j47968J96629k72362L2337
16472E29917J13887l1721K17234j18754k48609k23942O28876l07990j6340J40246
16462F82804j60167M32279k93304j09095N5896J68931l66357J90487m020k26152
16452C71302L15j36311O66117l69553k680k12844j2941k097n4167H9925Q6078
16441A76003K73193j9333J23184j09802B21230E9524N15745k83736L19982N1956
16431F63471k71180n3191K74064k87916q8686K15622p5252A05291M75601k87071
16421B93821j35857J00496Q5218K48824k30012Q2303K11287j17477l3175j41787
$$ y = [965415, 745044, 493136, 964895, 891573, 637620, 923392, 561906, 744661, 455376, 678471, 962109, 371958, 494526, 698458, 995143, 721281, 573313, 769942, 497580, 529917, 643804, 612083, 829317, 710563, 461954, 238012, 866888, 558898, 542558, 682804, 522637, 954916, 661612, 552517, 608413, 777344, 410987, 601474, 597454, 371302, 371617, 235306, 901423, 531870, 529190, 316346, 303405, 301308, 247141, 89925, 176003, 449196, 429863, 553047, 443245, 221230, 59524, 575269, 291533, 611515, 663471, 392291, 339100, 613164, 325248, 236562, 452184, 376932, 105291, 580892, 293821, 157964, 258460, 343678, 592502, 362490, 444793, 656080, 538603, 505428, 363641]
16411C63641K24177j83133n8845J11172J10941B30596J09858A61569L7896J23118
16401C22583K3507J47808k36248n7563L9383O6702L29085c0267A26908Q691L89097
16390E24696F5058L37175n9961L8815F2858K31053G5799N2302L60442k00265N4108
16379C42386q6874P2534q0133L82195A92004K46133E2456L57062k00954I9191
16368D13759J87107l597k11223a78329P9978B19667K0869n9378K45372p9768j52885
16357A93877K9712R063J64703a03070A3587L27112L4974A42160g964B24206J67650
16346C91856N3824B20347L4048J25870j37949L2981f1452B59893K641D9501M43423
16335D92924B17783A0624N7836J73308c9999k233B75656J04014B1788J41744L76072
$$ y = [363641, 587818, 404685, 345840, 457012, 567953, 230596, 340454, 161569, 199465, 322583, 346090, 493898, 257650, 200087, 239470, 306172, 635257, -30267, 126908, 135599, 524696, 65058, 402233, 342272, 381087, 62858, 293911, 75799, 128101, 488543, 288278, 342386, 255512, 328046, 247913, 630108, 192004, 438137, 52456, 409518, 208564, 99191, 413759, 600866, 597269, 386046, -178329, -98351, 219667, 240536, 181158, 426530, 346762, 193877, 223589, 232652, 397355, -103070, 13587, 340699, 375673, 142160, -7964, 224206, 391856, 445680, 220347, 254395, 380265, 242316, 275297, -61452, 259893, 262534, 49501, 492924, 217783, 10624, 68460, 241768, -39999, -42232, 275656, 379670, 21788, 163532, 539604]
16324E39604k65291J65342F815Q3408A5831J02817K62968A8129c4116B84768A40978
16312I6821c6219C00093E4687K23882c5616P692E01090A30596o297J53437p2201
16301B05535N0612l3805R7899c2778a765l077I0807P014a35734D7907a06349F2424
16288f8375A84751m6887e7506A74352k2801f3502A6755K23546M1581K2926I4974
16276E55652A25185d2507C09147E027K30475A212L40537A47664e2879m4661A70863
16264B45082j02853L22235B1830e9568j372B4361a995j46508D2987b77354A64918
16252c0380A09401a07347C9119K90238j59832n8682A8713d63668A30022K44206
16242C74228f1752R428j3110B36078a65529A23925d960q6778F1435P5854r585
$$ y = [539604, 274313, 439655, 6815, 90223, 15831, 118648, 381616, 18129, -34116, 284768, 140978, 96821, -36219, 300093, 54687, 278569, -35616, -27924, 501090, 130596, 124299, 277736, 205535, 256147, 222342, 320241, -32778, -1765, -4842, 90807, 97821, -135734, 47907, -106349, 62424, -68375, 184751, 137864, -57506, 174352, 151551, -63502, 16755, 240301, 281882, 304808, 94974, 555652, 125185, -42507, 309147, 5027, 235502, 1212, 341749, 147664, -52879, -97540, 170863, 245082, 142229, 464464, 21830, -59568, -60940, 24361, -1995, -148503, 42987, -277354, 164918, -30380, 109401, -107347, 39119, 329357, 169525, 110843, 18713, -463668, 130022, 374228, -61752, -52324, -65434, 236078, -165529, 123925, -4960, -91738, 61435, 137289, 127704]
16231A27704K9540P1974b57096B05303a96718B65190H4330J3992P4388J4444J37484
16220C24638A09959b45132a5316A14054e18282A17059M2507h554A79610M1555
16210B21165j177a56872A15459P6574G9192K0502O8533R1054n3577D4158K2098
16199F6256N6204a28475B19086I3505d0294k4012j18635B081g4912j6503C14909
16187B43364A21675J73235I8023b23242h2831j45865B85699A4367P3416m2150
16177D5633g6986A26317a76641A97939b67630B3738a35715A55114N9000f4457
16166F7766b8004I9481M7170L6646L4255B9637c8859I0327a94177A57548B1192
16154f1620a7282q7873F9849C4070a8936j5092G3255c75949A72404i0972o8921
$$ y = [127704, 157244, 229218, -257096, 205303, -196718, 265190, 84330, 98322, 172710, 187154, 324638, 109959, -245132, -15316, 114054, -518282, 117059, 159566, -8554, 179610, 221165, 219988, -156872, 115459, 192033, 79192, 99694, 168227, 259281, 205704, 44158, 66256, 122460, -128475, 219086, 93505, -40294, -64306, -182941, 2081, -74912, -91415, 314909, 243364, 121675, 294910, 98023, -223242, -82831, -228696, 285699, 14367, 87783, 45633, -76986, 126317, -176641, 197939, -267630, 23738, -135715, 155114, 214114, -64457, 67766, -28004, 99481, 146651, 183297, 217552, 29637, -38859, 90327, -194177, 157548, 21192, -61620, -17282, -105155, 69849, 34070, -18936, -34028, 73255, -375949, 172404, -90972, -159893]
16143a59893k1381k6534J02138m8921B59464b67196d8333B39582G8178a3732l27552
16132c41284R9316B19856A1711K39336b57418C7254e2706k0843j72177F2285a78340
16120e2698A00466b46535A76203b28929f1641B65608b36768A01978a74922f0329
16109a45615B19668F7490Q5766f062p1487B56138o9992a36524A58052L60609f1508
16097A15980J92353H2712a24624A68423o0823e6292j44708A67918L31976i927
16086b26077r8979a09231A12288l2135M1425g9003A8349K54751j11115k2272F2795
16074A21282l9627N1788b16459j8187q386f0871H5759a8592A28773D3957c29130
16062A43816Q1596b06848C10378a56995o5875I5584C8402b41705a14086D0506
$$ y = [-159893, -181274, -207808, -105670, -154591, 259464, -267196, -48333, 239582, 78178, -13732, -341284, -241968, 219856, 11711, 251047, -257418, 37254, -52706, -73549, -245726, 62285, -178340, -52698, 100466, -246535, 176203, -228929, -61641, 265608, -236768, 101978, -174922, -60329, -145615, 219668, 67490, 153256, -6062, -77549, 256138, 186146, -136524, 158052, 518661, -61508, 115980, 308333, 82712, -124624, 168423, 107600, -56292, -201000, 167918, 499894, -9927, -226077, -325056, -109231, 112288, 80153, 121578, -79003, 18349, 273100, 161985, 139713, 62795, 121282, 81655, 133443, -216459, -234646, -243032, -60871, 85759, -18592, 128773, 43957, -329130, 143816, 225412, -206848, 310378, -156995, -222870, 95584, 38402, -241705, -114086, 40506]
16051b67296B66497B4880b47391i2774A79546g5304r208q6146I728b55750A59602
16039a92307C8040d3987B9632a73750A41437k2425C5874J4108L13456E4000a9944
16027A20853R8807b769A81780p3259H124b44295g5032j45259B3219a27101I8802
16015A63936A4667M07961C6334B537c9250H0864C101M8838d55780c2804D1922
16003b8830M484L750j39153e9246F4195J54919c68151a74674I2335a59548j19855
15992b79403j00550H977b8411B9537J5210a59543N8350F7852K08264E2286J14979
15981A67265R2504O0112g5280l033k50396M2523A28495N2894a43444B81674C5820
15969A17530a14144k88054A4888c40695a2761M987A65759n3649J7924c7978B44482
$$ y = [-267296, 266497, 24880, -247391, -92774, 179546, -75304, -84512, -170658, 9728, -255750, 159602, -192307, 38040, -43987, 29632, -173750, 141437, 119012, 35874, 49982, 363438, 54000, -19944, 120853, 219660, -2769, 181780, 108521, 8124, -244295, -75032, -220291, 23219, -127101, 98802, 163936, 14667, 422628, 36334, 2537, -39250, 80864, 3101, 51939, -455780, -32804, 41922, -28830, -24346, -20596, -159749, -59246, 64195, 219114, -368151, -174674, 92335, -159548, -279403, -379953, 8977, -28411, 29537, 44747, -159543, -101193, 67852, 276116, 52286, 167265, 259769, 319881, -75280, -78313, -328709, -286186, 128495, 181389, -143444, 281674, 35820, 117530, -114144, -402198, 14888, -340695, -12761, -7774, 165759, 112110, 130034, -37978, 244482]
15957i7418A1825a4149m4564A23408c7725k26391K4481A39245g5430j53914M3849
15946a85495C56545a03282k62527N3017d8300k70372e2757B01886b21102P9420
15936a41682N5867j68620a20754M493e3217A61451o0514c00211A51068f748j3408
15925b0156j43679B2776a34328j2375a3142j43048d5476A2072a53341j10612B2334
15913g4743A76953a30678k20103J16260D4316i0640D1907J99819a00091j55590
15903b55681Q2310A1877J23674a11357A09197m1317M3492g4625I4228c41438D2095
15891i7692b1819o3712K0625B90572A8009i491m189B28520b924E8223b43370B41595
15878A97713j0716l0693b83934F8870a85897E945K68068h9507A08548a0009k08861
$$ y = [-97418, 11825, -14149, -58713, 123408, -37725, -264116, -239635, 139245, -75430, -229344, -185495, 356545, -103282, -365809, -312792, -48300, -318672, -52757, 201886, -221102, -141682, -85815, -254435, -120754, -116261, -53217, 161451, 100937, -300211, 151068, -6748, -20156, -163835, 22776, -134328, -146703, -13142, -156190, -45476, 12072, -153341, -263953, 22334, -74743, 176953, -130678, -350781, -234521, 44316, -90640, 41907, 241726, -100091, -255681, -173371, 11877, 135551, -111357, 109197, 67880, 111372, -74625, 94228, -341438, 42095, -97692, -21819, -85531, -64906, 290572, 18009, -9491, -13680, 228520, -2924, 58223, -243370, 241595, 197713, 186997, 156304, -283934, 68870, -185897, 5945, 274013, -89507, 108548, -10009, -218870]
15867b18870J04727o8168N9864q0446A13403J26047e1848A07662E2863B031b22819
15855a37247o5910j73634J06472d8813r5201O0506I1236c515j6752E4884M7738
15844A02622A1265J73589C9529J23672i8148J7044j01706b9633A82130i6049B43452
15832I5929J10983C7930M92661a81108I2921c1707C2021a30677m8114D14761b11948
15820A59456b55057J07131j16588n5112a15855A43396a20921k29817a69670B69633
15809C0709c72019J47723H375N4399B5336a54630A7697a77767A94688I3432C3816
15797a2168j72571h4685j63165I0967d2673l41284A17796Q9532a98999P3602m2632
15786a68029J7393A47272b51168k5764j87204J25481B79317e1339E420a57371
$$ y = [-218870, -114143, -182311, -122447, -202893, 113403, 239450, -51848, 107662, 52863, 2031, -222819, -137247, -203157, -376791, -270319, -48813, -144014, -83508, 91236, -3515, -20267, 54884, 102622, 11265, 184854, 39529, 163201, -98148, -81104, -182810, -29633, 182130, -96049, 243452, 95929, 206912, 37930, 530591, -181108, 92921, -31707, 32021, -130677, -178791, 414761, -211948, 159456, -255057, -147926, -264514, -319626, -115855, 143396, -120921, -350738, -169670, 269633, 30709, -372019, -224296, 8375, 62774, 25336, -154630, 17697, -177767, 194688, 93432, 33816, -12168, -184739, -84685, -247850, 90967, -42673, -383957, 117796, 207328, -198999, -125397, -168029, -150636, 147272, -251168, -276932, -464136, -338655, 279317, -51339, 5420, -157371]
15775i512A49271e0495A19422c72111f4256K2123C7457e8118c582A19105N5410
15764A74515d36021A7717N7729P5335K18636A35130c58306e2321B21561c3501
15753H4751j3292J04092p4002J60216C9285J05058J2364L5959F9446j964b5550
15741C7236J78079h4082j45142j2561J10532D3235A2683a64511A70431B6513c56300
15729a68833N6132O567k9349b7276f97j82717m4897C8981B037a51149c7653q0316
15717a17969B37061p877C4390b650l36610N5769h3553l0680k20439H7444c26715
15705f4268O466G623K7007K92656c00517q0228C2241f9173j78269A91532d2484
15693A60530a43465L4722j92043I8548A9806b7638A01463K06857q7266b5427F1592
$$ y = [-9512, 149271, -50495, 119422, -372111, -64256, -42133, 37457, -58118, -3582, 119105, 174515, -436021, 17717, 75446, 150781, 369417, 135130, -358306, -52321, 221561, -33501, 84751, 71459, 175551, 101549, 261765, 39285, 144343, 156707, 192666, 69446, 67482, -25550, 37236, 215315, -84082, -229224, -241785, -131253, 43235, 12683, -164511, 170431, 26513, -356300, -168833, -112701, -106134, -135483, -27276, -697, -183414, -228311, 38981, 2037, -151149, -37653, -117969, 237061, 229184, 34390, -2650, -339260, -283491, -83553, -114233, -334672, 87444, -326715, -64268, -57802, 7623, 34630, 327286, -300517, -380745, 32241, -69173, -247442, 191532, -42484, 160530, -143465, -108743, -300786, 98548, 19806, -27638, 101463, 308320, 221054, -25427, 61592]
15681a59295f8999F8666c5139j34542M2625p6317m5391j40332a56561l4100B53064
15669A87444g7427A83930a1534o3675o9436a6828j03850A66444f2407p7895I8499
15657B04710b36214a10879L775k16210C4791J01679e33083F1617a59540l917F9223
15645A20960c2256B390a02754k3538K1247l3840A06017f6787N134A285J53300
15634A54585b34345K8636A58057a00496A49352D098c67426J66617h0693A49532
15623a27275O2214J738j98237a19115A76113p9632N2730J40482e31026d1395n2276
15612i3671C3683b60989D0902e3807F4994b08122c0817k71212f5076k43304a05197
15600C61531h4931k8031p6845A51435F7792A5657a84857o0352b5670k13100G2580
$$ y = [-159295, -68999, 68666, -35139, -169681, -127056, -203373, -248764, -389096, -156561, -190661, 253064, 187444, -77427, 183930, -11534, -75209, -144645, -16828, -120678, 166444, -62407, -140302, 98499, 204710, -236214, -110879, -107104, -323314, 34791, 136470, -533083, 61617, -159540, -163457, 69223, 120960, -32256, 2390, -102754, -126292, -105045, -138885, 106017, -66787, -61653, 1285, 154585, -234345, -205709, 158057, -100496, 149352, 4098, -367426, -200809, -80693, 149532, -127275, -65061, -63323, -261560, -119115, 176113, 96481, 149211, 289693, -531026, -41395, -93671, 33683, -260989, 40902, -53807, 64994, -208122, -30817, -302029, -65076, -308380, -105197, 361531, -84931, -112962, -189807, 151435, 67792, 15657, -184857, -245209, -25670, -238770, 72580]
15588H4983a18327M4525e77A11155J62596C1250O9255h0155B3982d1838n3182
15577i5020D3216c59101J03979A75540E8406a68131b2930j47319F7701L8616a54320
15565A47024d4766B44968j74b43180m1790B82428i3398B38495I0900K55783d40211
15553A59185i9431q3308b4710a1879B17328b93255A08599B8019J9945h3300m9981
15542a33281i348I568a68657A70665K8712C6636N0170e2325j52184I4561f166
15530a76245B21086d32728e6519C5340e9990B6032P4280N3046P5705a27817L410
15519a24407C49286A08242N9805a09775B28361G9291M1581H35L34791b67669D9014
15507A34917N1171G9164d7669o7908l99714B62711A19708P5887c80642h0607B51151
$$ y = [84983, -118327, -73802, -577, 111155, 273751, 31250, 100505, -80155, 23982, -41838, -95020, 43216, -359101, -255122, 175540, 58406, -168131, -22930, -170249, 67701, 106317, -154320, 147024, -44766, 244968, 244794, -243180, -284970, 282428, -93398, 238495, 90900, 346683, -440211, 159185, -99431, -182739, -24710, -11879, 217328, -293255, 108599, 28019, 47964, -83300, -133281, -9348, 9568, -168657, 170665, 199377, 36636, 86806, -52325, -204509, 94561, -6166, -176245, 221086, -432728, -56519, 35340, -59990, 26032, 100312, 153358, 229063, -127817, -124407, 349286, 108242, 168047, -109775, 228361, 79291, 120872, 835, 335626, -267669, 49014, 134917, 186088, 79164, -47669, -115577, -515291, 262711, 119708, 195595, -380642, -80607, 251151]
15495B40625C3990a60450a3205A62666b73565E7844m514b11155h1188B36483p2794
15484A63689c19822a31301A0821J07210d25929J44985a3543H7505C3062Q6639
15474A19701a20272p992L5612A1590L26898C529g5736k30193q4904p4367A3733
15462A61759a20815b0566q7863K3581a3164G5167J86268B5821c66902A15217a52366
15450d6929C02d9060I7412b08528A09131f5650C5325d8675l3313j72459A52772
15438F2151i2984A01699b4427l5417J2352A89305a55964j31572A57856p8285a1723
15426B3860K13891J10334b41156F276a17641b1231j72629e7644A30959e5332k27156
15415b82488G2645d5851p9132j04166d7180E8388H533O8490a20664D03785c3490
$$ y = [240625, 33990, -160450, -13205, 162666, -273565, 57844, 53330, -211155, -81188, 236483, 163689, -319822, -131301, 10821, 118031, -425929, -280944, -13543, 87505, 33062, 119701, -120272, -128264, -92652, 11590, 338488, 3529, -75736, -305929, -390833, -465200, 13733, 161759, -120815, -20566, -108429, -84848, -13164, 75167, 261435, 25821, -366902, 115217, -152366, -46929, 302, -49060, 97412, -208528, 109131, -65650, 35325, -48675, -81988, -254447, 152772, 62151, -92984, 101699, -24427, -59844, -47492, 189305, -155964, -287536, 157856, 79571, -11723, 23860, 237751, 348085, -241156, 6276, -117641, -21231, -193860, -57644, 130959, -55332, -282488, 72645, -45851, -124983, -229149, -47180, 58388, 8533, 77023, -120664, 403785, -33490]
15403E6966b10025Q6129k6545C44634a15902F0139e7296D8022b97222N0108h295
15391C88028h0846k9295c7510F0233N9033l1884a36511l6194E4735a87234g7187
15379F3669R1690i1821j33704R9464A04698a56268N1692A89775c07551D333L8757
15368D3090J4368N322O6046C8561a46559A53249f0057j07868C4835J19277k199
15357A51913B8085b17885G4864a24028C7786P9099a44556B12914i1675p8645A01856
15345A56112J3679O181L20516k35793j05819g2451A9660K28176C5144j0555d80128
15333G3003J8779J25643a03175C6442i269o7571b5686k2387j80262b5255k46238
15322b71493G892d66256A28914J05391r5648M1638J1824a05901j43866F5347k7452
$$ y = [56966, -210025, -123896, -150441, 344634, -115902, 60139, -57296, 48022, -297222, -247114, -8295, 388028, -80846, -110141, -37510, 60233, 119266, 87382, -136511, -172705, 54735, -187234, -77187, 63669, 155359, -91821, -225525, -126061, 104698, -156268, -104576, 189775, -307551, 4333, 43090, 57458, 62780, 128826, 38561, -146559, 153249, -60057, -167925, 34835, 154112, 151913, 28085, -217885, 74864, -124028, 37786, 116885, -144556, 212914, -91675, -170320, 101856, 156112, 169791, 175972, 496488, 260695, 154876, -72451, 19660, 247836, 35144, 24589, -480128, 73003, 91782, 217425, -103175, 36442, -9269, -76840, -25686, -48073, -228335, -25255, -271493, 7892, -466256, 128914, 234305, 138657, 180295, 192119, -105901, -249767, 65347, 37895]
15311C7895M0197J10599l7729D4664K91097b24893C82035a95383g2005l1793I757
15299a0173F4488J9817J76922j11095j41D5979J5466K26445g1700D18300c08561
15287D4518a80879k2814H2423c51572A74347a96513A06084b14072g3275C56565
15276D0882g7052c5493C12955g2165j9139B84806I4493B0616d5720m120J4572
15265c5268n3201E6115k0786K08395c87042J77249f7477A40859m7824a57141B14961
15253A33307a08321o803M4666C07869J68613N56975O09602o99837Q93323H22729
15242C14831p8661N3731a60113m9284h7418B39095A5871i8792H2187A1567c65457
15230i2632M0305A75809J24617a49227M9536B04710A5608N4525c3121r4603j86455
$$ y = [37895, 78092, 188691, 150962, 44664, 335761, -224893, 382035, -195383, -72005, -103798, 9757, -10173, 64488, 84305, 261227, 150132, 149991, 45979, 61445, 287890, -71700, 418300, -308561, 44518, -180879, -203693, 82423, -351572, 174347, -196513, 106084, -214072, -73275, 356565, 40882, -77052, -35493, 312955, -72165, -91304, 284806, 94493, 20616, -45720, -49840, -35268, -88469, 56115, 35329, 243724, -387042, -209793, -67477, 140859, 93035, -157141, 214961, 133307, -108321, -115124, -70458, 307869, 476482, 1033457, 1643059, 943222, 1836545, 822729, 314831, 236170, 289901, -160113, -209397, -87418, 239095, 15871, -98792, 82187, 11567, -365457, -92632, -52327, 175809, 300426, -149227, -99691, 204710, 15608, 70133, -33121, -127724, -314179]
15219c14179A18964l6526i4492C33806C4492J74289G2947a15424A34254h0667
15208a24452m5580a7344B07038r9865a3434G5067k5614J2777a56844k0850B37928
15196a83684Q0542F2459d60321a3495A98282k0574J39812D4248R1177J9402A8839
15184B25410b56466A72657c9177B92401l7965L609f3300A69272C7740O2259J25237
15173B25236D3619J1166b8381k51938g8092n9008B56027P1143A55192b5591j4392
15162c9983C42763A65049a95224B29781c6776A96590F0306d89495B89285o7204
15152B22081e0115A10714R6164r334D3062J49320c98847f6186G3284Q2312d2295
15140B03058q1618i4034L2920I3998j5777K39657R5534l5953A51604B8650J90214
$$ y = [-314179, 118964, 82438, -94492, 333806, 34492, 208781, 72947, -115424, 134254, -80667, -124452, -170032, -17344, 207038, 107173, -13434, 75067, 49453, 62230, -156844, -177694, 237928, -183684, -103142, 62459, -460321, -13495, 198282, 177708, 317520, 44248, 135425, 154827, 18839, 225410, -256466, 172657, -39177, 292401, 254436, 258045, -63300, 169272, 37740, 99999, 225236, 43619, 54785, -28381, -280319, -78092, -137100, 256027, 327170, 155192, -25591, -39983, 342763, 165049, -195224, 229781, -36776, 196590, 60306, -489495, 289285, 222081, -50115, 110714, 206878, 197544, 43062, 192382, -398847, -66186, 73284, 155596, -42295, 203058, 121440, -94034, -61114, 93998, 78221, 317878, 413412, 377459, 151604, 28650, 218864]
15129B18864I4488P793a38943B91658B3272m233b2808C06832a69551A53810D5271
15117B55975B414K81629A19003H624a48903B83541J02050a75996A06641L66007
15107D72648c591A04732a22831A07109m5087a30198B79626j37820F2135M4947
15097A07082L5711a72329E682O665J86026M3296a25506A82685A125K96509a6472
15085C35288p6961r306r1080L388M5791L2036a37213L9780B07939J0322L58751
15074E77012I2988J35022D725K26208b23644D31831e548j65003B33681b71792
15063A24337J27647a03742M9818D7301P7889o2351k1408M6342B3689K90554E9748
15051B13894E2142A9484J08251K73986k7339j58482i3903p5825C62017P1194B08665
$$ y = [218864, 94488, 102281, -138943, 291658, 23272, 19039, -22808, 306832, -169551, 153810, 45271, 255975, 2414, 284043, 119003, 8624, -148903, 283541, 385591, -175996, 106641, 472648, -3591, 104732, -122831, 107109, 62022, -130198, 279626, 141806, 62135, 107082, 142793, -172329, 5682, 12347, 198373, 241669, -125506, 182685, 1125, 297634, -16472, 335288, 258327, 249021, 157941, 161329, 207120, 239156, -137213, -97433, 207939, 218261, 577012, 92988, 228010, 4725, 230933, -223644, 431831, -5548, -170551, 233681, -271792, 124337, 251984, -103742, -53924, 47301, 125190, 62839, 41431, 87773, 23689, 314243, 59748, 213894, 52142, 19484, 127735, 401721, 374382, 215900, -93903, -169728, 362017, 433211, 208665]
15039g2457B79960j12921K1782r2857O4885J04286M9632J3536j10647m5373a40781
15027D99383j20045A73883G1889K02131K5596N0354E5666P8694h786B22392q792
15016B13600a56525C93066c5501C9129j9194M24606A37157o1207L93883r3274
15006C76559A58225J64102n6684K96305B26291M5611D7902J79407r894D3531h3248
14994B21714K18245K1702j80322J89219l3317G4325P3870M1539q2649j0331J25613
14983B22367A984c3021B28352N5129J586A06063J09864J29796D2685Q5577j9944
14972A08318j9589g9726m611a4539D42675j85012I5669a85247A72136M03105A28462
14960A15364J07699r6120J53062l6802P356n8082O8351N0643C7726j0862L41440
$$ y = [-72457, 279960, 167039, 188821, 95964, 160849, 265135, 314767, 328303, 217656, 172283, -140781, 499383, 379338, 173883, 71889, 274020, 299616, 349970, 55666, 134360, -8786, 222392, 213600, -156525, 393066, -35501, 39129, 19935, 444541, 137157, 75950, 469833, 376559, 158225, 322327, 265643, 561948, 226291, 271902, 47902, 227309, 217415, 43531, -83248, 221714, 439959, 461661, 281339, 470558, 437241, 74325, 148195, 189734, 107085, 96754, 222367, 1984, -33021, 228352, 283481, 285067, 106063, 215927, 345723, 42685, 128262, 108318, 88729, -79726, -84337, -14539, 442675, 257663, 95669, -185247, 172136, 575241, 128462, 115364, 223063, 126943, 280005, 243203, 250559, 192477, 260828, 311471, 37726, 26864, 368304]
14949C68304a18096I9993L21783A87859D6395J44381G4108J57952K09097B8116
14938f4060D04896G4574l1571M37988a42893C75065j11849J43809j26128q1250
14928A99647M6939J09919C9453M0400J77937K5485C0220L64710b8750F5063O1569
14917A26632k4912J91181k6277A24875L89472l7760L7822k51898Q7492p1180J01168
14906C79991H006K37411D464M60476F4944J60155n7577O2913J02218A17505J76835
14895B94340j06955K48845j47474J37405J658A83130L74907k78389Q3653E5865
14884D15011m2142A72698j4869L79254A22828J80608j1607l2624M17382B66204
14873D58042l8309B5390M96760K6376j65329K6387J40973B55135K87606j92126
$$ y = [368304, -118096, 99993, 421776, 187859, 46395, 190776, 74108, 232060, 441157, 28116, -64060, 404896, 74574, 43003, 480991, -142893, 375065, 263216, 407025, 280897, 199647, 246586, 356505, 39453, 79853, 257790, 283275, 30220, 394930, -28750, 65063, 126632, 101720, 292901, 266624, 124875, 514347, 476587, 514409, 262511, 350003, 278823, 379991, 8006, 245417, 4464, 464940, 64944, 225099, 167522, 230435, 332653, 117505, 294340, 187385, 436230, 288756, 426161, 427819, 183130, 558037, 279648, 363301, 55865, 415011, 372869, 172698, 157829, 537083, 122828, 303436, 291829, 259205, 676587, 266204, 458042, 419733, 25390, 522150, 548526, 383197, 409584, 550557, 255135, 542741, 350615]
14863C50615A57572P4120J18202l7238k5393j19192L26917m5785M3504B01192
14852B85979P0668n3657L53999j36330j12530K12197q9891B48270l504P5368A23625
14840B71228N41965B03375J39866N3269L8275A82996N21122j29657k30327L73971
14830G18105C44943J76840k09338J37958r0605L71543l58481j07560m4666J54830
14820C75464C3625M73688o723j73033J21404q6658L422K88405j5669k11875j47423
14809B79163K28772r3165r2810J7602L73937j83770o4875p7682N4030j2337P273
14798D36138L77205C74036P7097K6934J9217J18259o2349A34583N78061J0251
14788G22895B65101l1518O45880l34100Q3446k02954O1211K5332B43870K64746
$$ y = [350615, 157572, 231692, 349894, 312656, 287263, 168071, 494988, 449203, 492707, 201192, 285979, 356647, 302990, 656989, 520659, 408129, 620326, 530435, 248270, 244766, 320134, 123625, 271228, 813193, 203375, 343241, 396510, 434785, 182996, 704118, 574461, 344134, 718105, 344943, 521783, 312445, 450403, 359798, 731341, 372860, 265300, 220634, 375464, 33625, 507313, 500590, 327557, 448961, 362303, 365725, 654130, 638461, 426586, 279163, 507935, 414770, 321960, 339562, 713499, 529729, 464854, 387172, 441202, 428865, 436138, 813343, 374036, 451133, 478067, 497284, 615543, 553194, 134583, 712644, 722895, 265101, 233583, 879463, 545363, 628809, 425855, 487066, 512398, 243870, 508616]
14778E08616R3822O5234p35p3330j01065l9290j75090K66659M1726J51387C63621
14766E41131R6236m9741j55390N5604N0125j44429J79219J53852j51844o6178
14756E08585K27808j99664n8398K3887K095L08142M3228C52873K83949p4882j24713
14745D37227j4377L35635r4754L8801J04358J32452k01280Q3647k93307J16321
14735F44723J63363n411Q3120l13456K13778L49752k04650j39912O1040k66166
14725E86181r6294K68611k0244l19520M03782j19705K0589J76273j35274R9167
14715H63566j71138l5543L8773J19289o3489r2376k42932M31788l21193M7477
14705E74222M19582m85135M34273j16854K1102j21720J07099K3093O3318j31284
$$ y = [508616, 602438, 667672, 666937, 593607, 492542, 453252, 278162, 544821, 586547, 737934, 363621, 541131, 637367, 587626, 432236, 487840, 537965, 393536, 572755, 726607, 574763, 508585, 736393, 536729, 478331, 502218, 504313, 812455, 855683, 352873, 636822, 561940, 437227, 422850, 758485, 663731, 702532, 806890, 939342, 738062, 821709, 528402, 644723, 808086, 802675, 885795, 572339, 786117, 1135869, 931219, 791307, 852347, 586181, 489887, 758498, 738254, 418734, 822516, 702811, 723400, 899673, 764399, 863566, 692428, 656885, 695658, 814947, 751458, 659082, 416150, 847938, 526745, 574222, 993804, 508669, 942942, 826088, 847190, 725470, 832569, 855662, 918980, 787696]
14695G87696l4580L60558K37087o70730J75536L47638l38449p1963K57222j00504
14685I49511l03563K16777j94326O68211l99924j05323R0131l28005M12077K2539
14675A028105p9123j3639j86924M17461k00153n5509j35489K49800j61303J33879
14665I97105m0161o442J06311j00259K39437j92840O596J14720k78828K92824
14655A138463K27437l30965J11061j89501R8885J0904l28355K78045j19248K84793
14645A181519k20871L18602l41521k2065K60456J32320k77174K3626L77834k53569
14635A179157L84413m13634J08618L31536k98342k8652P3412j22561M03516l31443
14625A286020o9664J81866k87290L02174Q3154j5996m95336L00728r1580l53548
$$ y = [787696, 753116, 1113674, 1350761, 680031, 855567, 1203205, 864756, 792793, 1050015, 949511, 645948, 862725, 668399, 1336610, 936686, 831363, 921494, 593489, 1005566, 1028105, 948982, 935343, 748419, 1165880, 965727, 910218, 774729, 1024529, 863226, 997105, 956944, 950502, 1056813, 956554, 1195991, 1003151, 1009747, 1124467, 845639, 1138463, 1365900, 1034935, 1145996, 956495, 1055380, 1066284, 737929, 1015974, 896726, 1181519, 960648, 1279250, 937729, 915664, 1176120, 1308440, 1031266, 1054892, 1432726, 1179157, 1563570, 1149936, 1258554, 1590090, 1291748, 1263096, 1336508, 1213947, 1617463, 1286020, 1216356, 1398222, 1110932, 1413106, 1496260, 1480264, 984928, 1285656, 1194076, 840528]
14615H40528J006981n20781O0588L64976k33388j12974J12714j08128J90529j78854
14605A422191K0048n9647L08544j09274o7775J33970l0136N7992j3129k9764J44782
14594A777802J9148j28463j72669J47003M99563o74033L40150k22771K41101l22914
14584A503917J58271L7690l0899J16223R1440k18009K35081j59441L29863P5736
14574B139872m8270j20016k822J52214J70087j74456J66259q0048N3896J54636
14564B411352J02297r6479j12283J37750J26393M6082J94068M6037K99361K40753
14554C395331J1190J02238R23757O02324R04126J418204M824894Q954457J7691690
14545C8828211M708509k1258325I435323D701508j740703k00327o50079O2049
$$ y = [840528, 1847509, 1326728, 1387316, 1752292, 1518904, 1405930, 1518644, 1410516, 1601045, 1422191, 1442239, 1382592, 1691136, 1581862, 1514087, 1648057, 1617921, 1675913, 1662784, 1633020, 1777802, 1796950, 1668487, 1495818, 1642821, 2142384, 1468351, 1808501, 1585730, 1826831, 1503917, 1662188, 1699878, 1668979, 1785202, 1876642, 1658633, 1893714, 1734273, 2064136, 2139872, 2091602, 1971586, 1968764, 2120978, 2291065, 2116609, 2282868, 2202820, 2256716, 2411352, 2513649, 2417170, 2304887, 2442637, 2569030, 2615112, 2809180, 2855217, 3154578, 3395331, 3406521, 3508759, 4432516, 5034840, 5938966, 7357170, 12182064, 21136521, 38828211, 43536720, 22278395, 9435323, 4701508, 2960805, 2760478, 2110399, 2172448]
14537B172448k2740O4254l66396L6339K58696J4482k22479L3680K53402K42830
14527B464516m32333Q2419J3450Q0847K17717L32259j27675o8885l54933N04052
14517B711434j85325J57297q8610K14628l12327L20132m26806M64643p8913p7549
14507B698604K14301J31996l25408K72112k02050L11455j29745m2364n0497M50043
14497C328447l22543L26456j60054r7012L22117k02563L85881j58179m21954L24596
14487C325192J9973m650L45674K46712j82428k44188J8288M9219K53621L92Q1616
14476C909421J08685k17285J43906R6284l2363K13900k25042L9525M7560L60553
14466D445144j53288K74539j39443N91683m97855l0023K18252m29334N05512n7684
$$ y = [2172448, 2149708, 2213962, 1847566, 1883905, 2142601, 2157083, 1934604, 1968284, 2221686, 2464516, 2032183, 2114602, 2128052, 2208899, 2426616, 2758875, 2631200, 2562315, 2207382, 2711434, 2526109, 2683406, 2594796, 2809424, 2497097, 2817229, 2390423, 2855066, 2776153, 2698604, 2912905, 3044901, 2719493, 2991605, 2789555, 3101010, 2971265, 2928901, 2878404, 3328447, 3005904, 3332360, 3172306, 3075294, 3397411, 3194848, 3580729, 3422550, 3000596, 3325192, 3345165, 3340515, 3686189, 3932901, 3750473, 3506285, 3524573, 3573792, 3827413, 3827805, 3909421, 4018106, 3800821, 3944727, 4041011, 4008648, 4222548, 3997506, 4037031, 4084591, 4445144, 4291856, 4566395, 4426952, 5018635, 4520780, 4490757, 4709009, 4279675, 4785187, 4727503]
14456D727503J63919p0348M36496j70524J31949p7417O7093L63061l57843O3330
14446E277219j09436O0841M48443j09553J31084M0575M23597k67792L39706j25387
14436F109297L34266r3149M6853J73464M0743J19844L78246l58133L01860l7197
14426G016094L29906K28507j84640J33576K64989l76914J17367J88038O14211
14417H331134l2165j71238K44773l20490M71171L4272K26708L35435j80786N25467
14407I464281L5693J49494k1427J95375J15047J18831O81423k66800P7212L65861
14397A0914990k98774O52322p3210K30140L80953K57134L7426N84186j49751r354
14387A2526062K63103N07897J6438P4594K76475M57670K74387J73299K72076K66109
$$ y = [4727503, 4891422, 4821074, 5257570, 5087046, 5218995, 5141578, 5208671, 5571732, 5213889, 5277219, 5167783, 5228624, 5677067, 5567514, 5698598, 5739173, 6162770, 5894978, 6234684, 6109297, 6443563, 6350414, 6397267, 6570731, 6611474, 6731318, 7109564, 6751431, 7053291, 7016094, 7346000, 7574507, 7389867, 7523443, 7788432, 7411518, 7528885, 7716923, 8331134, 8298969, 8127731, 8372504, 8052014, 8523185, 8557457, 8784165, 9119600, 8938814, 9464281, 9499974, 9649468, 9628041, 9823416, 9938463, 10057294, 10738717, 10471917, 10549129, 10914990, 10616216, 11268538, 11195328, 11425468, 11806421, 12063555, 12100981, 12685167, 12535416, 12526062, 12789165, 13297062, 13313500, 13388094, 13664569, 14122239, 14396626, 14569925, 14842001, 15108110]
14377A5108110L95727K38569K77528M04192N24474P3187M77679L9664K94949N77665
14367A8411744R4182O84994J1725R80674K76076N53145K96609O55386N38654N50502
14357B3053691K94976O16108M64513J032435J76841P92391N30385O10990R88926
14348B8561256O74782L14907Q81687J087057N92454O75931R78345R64092Q96331
14339C5626842J019153R03235J122676J164722J529165R17947J151424J377951
14331D4813115J210604J500650J796164J458938J548640J902305J858020J982826
14323E8071262J852957K274929J492375K650545K655235K446025K555885L259152
14315G7258365K770866L184233L441209L362929L967037L760892M201799M407634
$$ y = [15108110, 15503837, 15742406, 16019934, 16424126, 16948600, 17021787, 17499466, 17539130, 17834079, 18411744, 18505926, 19190920, 19202645, 20183319, 20459395, 21012540, 21309149, 21964535, 22503189, 23053691, 23348667, 23964775, 24429288, 25461723, 25638564, 26430955, 26961340, 27572330, 28561256, 29236038, 29550945, 30432632, 31519689, 32112143, 32788074, 33766419, 34730511, 35626842, 36645995, 37549230, 38671906, 39836628, 41365793, 42283740, 43435164, 44813115, 46023719, 47524369, 49320533, 50779471, 52328111, 54230416, 56088436, 58071262, 59924219, 62199148, 63691523, 66342068, 68997303, 71443328, 73999213, 77258365, 80029231, 83213464, 86654673, 90017602, 93984639, 97745531, 101947330, 106354964]
14307A06354964M402398N011135N561118N665193N603485O191378O264831P635980
14299A52690482P277264P762332Q546910Q966817R454575J0223923J0237661J1346851
14291B26506815J1841948J2160492J3137232J3167320J4075300J4466837J4595262
14284C19951206J4898160J5696773J5218126J4718654J4286747J3355844J2361175
14277D20486685J1358540R689399Q146046O111697L352488n89805k719810k524462
14269D53310778l036649m795165n763823r268278r979190j1372976j2783403j3980056
14261C82331238j4751012j4893060j5395610j5370733j5138427j4811386j3726448
14254B78244562j2937921j3330590j2463985j1791657j1643198j0454070j0067370
$$ y = [106354964, 110757362, 115768497, 121329615, 126994808, 132598293, 138789671, 145054502, 152690482, 159967746, 167730078, 176276988, 185243805, 194698380, 204922303, 215159964, 226506815, 238348763, 250509255, 263646487, 276813807, 290889107, 305355944, 319951206, 334849366, 350546139, 365764265, 380482919, 394769666, 408125510, 420486685, 431845225, 441534624, 449680670, 455792367, 459144855, 458555050, 455835240, 453310778, 450274129, 445478964, 439715141, 430446863, 420467673, 409094697, 396311294, 382331238, 367580226, 352687166, 337291556, 321920823, 306782396, 291971010, 278244562, 265306641, 251976051, 239512066, 227720409, 216077211, 205623141, 195555771]
14247A95555771r327855q951977q532397p858680p564025o870802o815702o348842
14239A33285491n735443n472640m860061n429460m838061m084290m474243l759789
14231I4631504l317527l862471l361649l142964l303187k712922k759136k518210
14223F9653438k670998k064485k170994j969562k242971j756659j933629j999440
14215E2844700j276233j271751j436634j945912j346403j261629j011328j501986
14207D1792824q36860q52495j422039j645770m83209r92901q76531n43316j331406
14198C2808297p90109j081237n09943o21050q30016l60880j300715m76084o25235
14189B6213028n65554o94199m52521n13500q65473k49182p62230o00779m9090
$$ y = [195555771, 186227916, 177275939, 168743542, 160884862, 153320837, 146450035, 139634333, 133285491, 127550048, 122077408, 117217347, 111787887, 106949826, 102865536, 98391293, 94631504, 91313977, 87451506, 84089857, 80946893, 77643706, 74930784, 72171648, 69653438, 66982440, 64917955, 62746961, 60777399, 58534428, 56777769, 54844140, 52844700, 51568467, 50296716, 48860082, 46914170, 45567767, 44306138, 43294810, 41792824, 40955964, 40103469, 38681430, 37035660, 36552451, 35559550, 34683019, 34139703, 32808297, 32018188, 30936951, 30427008, 29805958, 28975942, 28615062, 27314347, 26838263, 26213028, 25647474, 24953275, 24500754, 23987254, 23121781, 22872599, 22110369, 21509590, 21460500]
14180B1460500p22285l39830J16659o05686l75997o68440m44585l91913p7080
14171A7951343j26796p21410k90357j51883l28881l59410k22106m32046r1198
14162A5227256l44516p5033o26131N2503n24859n7629l99722j82776k16865J40193
14152A2992421l16769l24814n74060K14179l58271j7178j49825K5931n27735k49132
14142A0714747j39681k69873l2452j60549k33249J5209m20632M6816K3916k95925
14132I248327j35817j59991J39481p29845K96188l401j15850L4223p01173K40523
14122H112665j0281m07740J02988k35107N6935j7183M1922m17825P3633L8408
14112G338415k21444j48918J523l8588k96568J45937k38624n4449j02123p2873
$$ y = [21460500, 20738215, 20398385, 20515044, 19909358, 19533361, 18864921, 18420336, 18028423, 17951343, 17824547, 17103137, 16812780, 16660897, 16332016, 15972606, 15750500, 15318454, 15227256, 14882740, 14807707, 14181576, 14234079, 13709220, 13651591, 13251869, 13069093, 12852228, 12992421, 12675652, 12350838, 11776778, 11990957, 11632686, 11615508, 11465683, 11491614, 10963879, 10714747, 10575066, 10305193, 10272741, 10112192, 9878943, 9894152, 9473520, 9520336, 9544252, 9248327, 9112510, 8952519, 9092000, 8362155, 8658343, 8654942, 8539092, 8573315, 7872142, 8112665, 8102384, 7694644, 7797632, 7562525, 7619460, 7602277, 7644199, 7226374, 7300007, 7338415, 7116971, 6968053, 6969576, 6930988, 6634420, 6780357, 6541733, 6487284, 6385161, 6312288]
14102F312288L4679k00391k5345M9781K9474k34957j80772J17318j752k14906
14092E685417l99250N04697j13948j37737L10627p11265K1115J24203n5667J1707
14082E239899j09910m75896M53031k01771k17640K8036O2355J8469n8159l32776
14072D405638o7911j3496j20019K30361k21965K52279k41367o8657k2191j5672
14062D117000O2034r4462j19118K34445m29350N60440m64039M30300l59634k11239
14052C726377J768j16416J27414k84361M38113n31423K65411j3668k94292J32860
14042C451783k20564l5063L41292k64794k60092j52522L92759j44008L3040j0429
14032C131402J3448j26049J85657k15679R8793q2699k09978L09746l55310r1552
$$ y = [6312288, 6346967, 6146576, 6121231, 6171012, 6200486, 5965529, 5784757, 5902075, 5900323, 5685417, 5286167, 5790864, 5676916, 5539179, 5849806, 5138541, 5159656, 5283859, 5228192, 5239899, 5129989, 4654093, 5107124, 4905353, 4687713, 4715749, 4778104, 4796573, 4738414, 4405638, 4337727, 4324231, 4204212, 4434573, 4212608, 4464887, 4223520, 4154863, 4132672, 4117000, 4179034, 4084572, 3965454, 4199899, 3770549, 4330989, 3866950, 4297250, 3937616, 3726377, 3728145, 3611729, 3739143, 3454782, 3892895, 3361472, 3626883, 3613215, 3318923, 3451783, 3231219, 3196156, 3537448, 3272654, 3012562, 2860040, 3252799, 3108791, 3141831, 3131402, 3144850, 3018801, 3204458, 2988779, 3087572, 3004873, 2794895, 3104641, 2749331, 2657779]
14022B657779J63527n00986R0098j01103K39610J91158k87581K52402q0179R49
14012B625674k33024N7550J77359l83054K58678J35961m47644J48967k0036k49310
14002B071121q687M1776m711j02697J8529N122n8737L56882o18833O07687k21266
13991B086186M43637N53770Q65661L043591P660583J7517278J2017135j8736060
13983B5451781j2519779m508116k180135j132055j116476n19272J74789n51520
13975C099217j23970J055j37331l2930j31014j14361l0633l92450K68423O9498
13965B475504k54739q2122J62068j25746n5407j11448L24134k50074M6997J43537
13955B272704k74502K6486K24041m07591K38070p4305m2210L9711L23709l87901
$$ y = [2657779, 2821306, 2320320, 2410418, 2309315, 2548925, 2740083, 2452502, 2704904, 2624725, 2625674, 2392650, 2450200, 2627559, 2244505, 2503183, 2639144, 2191500, 2340467, 2320431, 2071121, 2062434, 2104210, 2099499, 1996802, 2015331, 2020453, 1961716, 2318598, 1699765, 2307452, 2086186, 2529823, 3083593, 3949254, 6992845, 14653428, 32170706, 44187841, 25451781, 12932002, 8423886, 6243751, 5111696, 3995220, 3475948, 3650737, 3099217, 2975247, 2976302, 2838971, 2806041, 2675027, 2560666, 2530033, 2137583, 2406006, 2475504, 2220765, 2138643, 2300711, 2174965, 2119558, 2008110, 2332244, 2082170, 2129167, 2272704, 1998202, 2024688, 2248729, 1841138, 2079208, 2004903, 1962693, 2002404, 2326113, 1938212]
13945A938212n6069k12529K62756k31597J82315M1152k36651p6486K19645k65605
13935A565143Q2943Q4487R683O9113k25464k28764L98539J21847j90387k79185
13925A407955Q6158j20105M12020N6102k65313M7328k24629K83345j79602K51502
13915A754761l34575J74806j12960L1863r3570J25499k61222L9753N4572L08675
13905A687602j26362q8133m13209L28183m56007Q40247l04791K22396k33125k58499
13895A198302L49902j07699r9288k2177Q8601M2365K21315l08377j87906L71226
13885A546264k67346k2838J20406J67586q7107k22420J48962l71302J75879q7247
13875A100837k06492K75461q5175J73745k1227o0370p1394L26124j60069J86570
$$ y = [1938212, 1882143, 1669614, 1932370, 1700773, 1883088, 1924240, 1687589, 1611103, 1830748, 1565143, 1648086, 1732573, 1742256, 1811369, 1585905, 1357141, 1755680, 1877527, 1687140, 1407955, 1494113, 1374008, 1786028, 1842130, 1576817, 1624145, 1399516, 1682861, 1503259, 1754761, 1420186, 1594992, 1482032, 1513895, 1420325, 1545824, 1284602, 1324355, 1378927, 1687602, 1561240, 1473107, 1059898, 1388081, 932074, 1772321, 1467530, 1689926, 1456801, 1198302, 1548204, 1440505, 1341217, 1319040, 1407641, 1450006, 1671321, 1362944, 1175038, 1546264, 1278918, 1256080, 1376486, 1544072, 1456965, 1234545, 1383507, 1012205, 1188084, 1100837, 894345, 1169806, 1084631, 1258376, 1237149, 1176779, 1105385, 1431509, 1271440, 1458010]
13865A458010j47827j94044j53810o4653K95399J06472m00466o2915K35292J53507
13855A224965q5696l32130J46500J95751j90121J19249j22401o790r3470L01764
13845A157621q9882j6884k23586L10019j00599j25876j39925J54698j2666K47236
13835A160156k60422L32398j9016j41577j36012n6072L2485J58009r1270J47289
13825A125968l41832M59694l62711p3490L66059k38407L8991j11303N4740j70953
13815G46756J19598r5299N829O958j24224M1708L88593K3522k35858m4161r3866
13804G39556K49004P7137k97527J09537j46224N05805k92853O9240j06626j76519
13794G30530R7034j14175L51145q7276k07620K35888j29651j58173M2201L68684
$$ y = [1458010, 1310183, 1116139, 962329, 897676, 1193075, 1299547, 899081, 836166, 1071458, 1224965, 1139269, 807139, 953639, 1149390, 959269, 1078518, 956117, 949327, 855857, 1157621, 1067739, 1050855, 827269, 1137288, 1036689, 910813, 770888, 925586, 912920, 1160156, 899734, 1232132, 1213116, 1071539, 935527, 879455, 911940, 1069949, 978679, 1125968, 784136, 1243830, 881119, 807629, 1173688, 935281, 974272, 862969, 917709, 746756, 866354, 771055, 776884, 783842, 659618, 701326, 1089919, 1113441, 877583, 833422, 739556, 988560, 1065697, 768170, 877707, 731483, 1237288, 944435, 1013675, 907049, 730530, 827564, 713389, 1064534, 977258, 769638, 1005526, 875875, 717702, 759903, 1128587]
13784A128587p6974k65827P9606k35871K4021j27418L41444j13096j32365J28663
13774G50770k20142L21734J97994j87106k36007o2150K03902o1249J12366J05918
13764I26030D48670M27022l94241O293J02503L5727Q2904o7348j1843M8624J51238
13753H29549k12906M0307L55374C88163L21096C42224N05337k07915Q0582C56709
13742H02171q1071j53682j97841O7737J42686K21310l20638j05839A86809N82836
13732G69645k54764J63777k65812M0460L63978l719m01221K22235j40330k4452
13722D69797J54730M3357B78176L01165N8112B86743N95300L9777j41100r3443
13712F87277p2664r1131L30669k69010j9928j3964m8552K19954l00341J70707
$$ y = [1128587, 1051613, 785786, 865392, 629521, 653542, 526124, 867568, 754472, 622107, 750770, 530628, 852362, 1050356, 863250, 627243, 565093, 768995, 707746, 820112, 926030, 448670, 875692, 481451, 487744, 590247, 625974, 708878, 641530, 629687, 678311, 829549, 616643, 656950, 1012324, 388163, 709259, 342224, 847561, 639646, 720228, 356709, 802171, 721100, 567418, 369577, 437314, 580000, 801310, 480672, 374833, 186809, 769645, 514881, 678658, 412846, 453306, 817284, 813565, 412344, 634579, 494249, 469797, 624527, 667884, 278176, 579341, 637453, 286743, 882043, 921820, 780720, 687277, 614613, 523482, 854151, 585141, 565213, 551249, 502697, 722651, 422310, 593017]
13702E93017j73255P4550j47777L49449j52361B48064L22968J65075k34875A90458
13691E20482O5273k6128k66078O84818l36145K77356k61413j85433K41103k68323
13681D45512K853O1525j22642m2149K05327j26946J71733k28636K973j19919Q1614
13670C31245J92721o3715L44559J61719j88546k8956l32223o771L2653l7657K6788
13659D31817J25401k10218K1631L03532j75877r742j15765A52044K26921J64131
13649E43096j99708j56077L6481K50969b6751C24053E4470M55167A05934M73654
13639E79588k02255J01718j41507K31678B75273J81612j66912M2969K8232J06375
13629D67549M8049k47678J12043O554K968J61712A94989P9815L81388p9371j62528
$$ y = [593017, 419762, 494312, 346535, 695984, 543623, 248064, 571032, 736107, 501232, 190458, 520482, 585755, 559627, 293549, 978367, 642222, 919578, 658165, 472732, 713835, 445512, 448365, 509890, 387248, 345099, 550426, 423480, 595213, 366577, 369550, 249631, 331245, 523966, 460251, 804810, 966529, 777983, 749027, 416804, 410033, 442686, 405029, 431817, 557218, 347000, 368631, 672163, 496286, 486544, 370779, 152044, 378965, 543096, 343388, 187311, 223792, 474761, -26751, 324053, 54470, 509637, 105934, 579588, 377333, 479051, 337544, 569222, 275273, 456885, 289973, 332942, 361174, 467549, 515598, 267920, 379963, 386517, 389485, 551197, 194989, 274804, 656192, 576821, 414293]
13618D14293J94757A18229L22065K44456l40714J49983j63100A06345K41475F4467
13607E48702O8414m9623j53623L30109l69914j42199j1733K02217j01940J56179
13597D76589B04803J79667j48973P0327J88392A63651j7290K16544p1149M9952
13587C41708P691A20903M93754j85506j64838K26510j18063r3627A21828J87345
13577C09173b9905D63619n8590R5775A25813J64425p5497J07731B9537N70698
13567F00235k10201j13306J65113m7514L8074A58505J48732E5387i8276A52614
13556F29768k47128j24746k9779K28051k9802j26578J38700j20377K27352r4646
13546D50815j71635J43833q9105J15626r2290q7718J1501K33664j46738J3370
$$ y = [414293, 609050, 118229, 440294, 684750, 344036, 494019, 330919, 106345, 347820, 64467, 548702, 617116, 567493, 413870, 743979, 374065, 231866, 220133, 422350, 320410, 476589, 204803, 384470, 235497, 305824, 494216, 163651, 146361, 362905, 291756, 341708, 349399, 120903, 614657, 429151, 264313, 490823, 372760, 279133, 121828, 309173, -29905, 463619, 405029, 500804, 125813, 290238, 214741, 322472, 29537, 600235, 390034, 276728, 441841, 394327, 432401, 158505, 307237, 55387, -98276, 152614, 629768, 382640, 257894, 228115, 456166, 426364, 299786, 438486, 318109, 545461, 450815, 279180, 423013, 333908, 449534, 357244, 269526, 281027, 514691, 367953, 381323]
13536C81323A53278M13373q4762L37697C13105F9025L02004j1628A01937O6794
13526A68731c4589D07141L223j88657J89050A92521k9471j5172J84639p6104k2515
13515B33898J17519K96779k81258o6155p1291J01202j2560j4775J15297j18361
13505C00295J20161A58998m4249M88283k76427b9372C39271J44459K13j99243
13495B84700E5011Q3657B4313K52159L52075B20236M5725L3136E8485M60498c5259
13483A56725n7458L8239J98124P1685j72260J1288Q734d4945C51737j26255E8531
13471H7041J63168K15038j73419j9246G9347L62321m2901a01120C22521A42938
13460A5281M13973j69488J58139A48245l8432k1854K73351I5054b2650D62127
$$ y = [381323, 153278, 566651, 481889, 819586, 313105, 69025, 371029, 359401, 101937, 168731, -34589, 407141, 410364, 221707, 410757, 192521, 163050, 147878, 332517, 256413, 233898, 351417, 648196, 366938, 300783, 229492, 330694, 318134, 303359, 418656, 300295, 420456, 158998, 114749, 603032, 326605, -29372, 339271, 483730, 483943, 284700, 55011, 138668, 24313, 276472, 628547, 220236, 265961, 299097, 58485, 518983, -35259, 156725, 99267, 137506, 335630, 407315, 235055, 246343, 255077, -44945, 351737, 225482, 58531, 87041, 250209, 465247, 291828, 272582, 79347, 441668, 398767, -101120, 322521, 142938, 15281, 429254, 259766, 417905, 148245, 109813, 87959, 361310, 95054, -22650, 462127]
13449B57988J06561A72905J09806Q2104o7645l4983K0775L70132B25032J2700
13439B37732P0917E2899R5577K7157B9575M11165B08986H9517P5727L7687q5078
13428A17853O6147e6621A54011g998H1556J73256j485d56B62932j1829b7165B71410
13415D40436j54463J86527m6839A00424B1384K09834p9098n8752a3012G1739J56901
13404B28640e232C5949L37172a6865C27351j56240B0228L11330j08358p6247L9148
13393A86101K25795r7345L01812A03659R7120n381d3967G4498K32331A29742N23346
13382F53088D0749M22960A73502O677O1988F6235M5090a3087A08809f5678p6227
13371a41905C23687j40902O4637K10230F8346a4945A18743N0228J34113A25507
$$ y = [257988, 364549, 172905, 282711, 364815, 297170, 262187, 282962, 653094, 225032, 237732, 308649, 52899, 148476, 175633, 29575, 440740, 208986, 89517, 165244, 202931, 117853, 184000, -56621, 154011, -7998, 81556, 254812, 253327, -456, 262932, 251103, -27165, 271410, 440436, 285973, 472500, 425661, 100424, 21384, 231218, 152120, 93368, -13012, 71739, 228640, -5232, 35949, 373121, -16865, 327351, 171111, 20228, 331558, 223200, 146953, 186101, 411896, 314551, 616363, 103659, 200779, 195398, -43967, 74498, 306829, 129742, 653088, 40749, 463709, 173502, 180179, 242167, 66235, 111325, -13087, 108809, -65678, -141905, 323687, 182785, 247422, 457652, 68346, -14945, 118743, 168971, 303084, 125507]
13360A4686L74574j85127N2883R1211J09855k02821k4002r4995K59437H4416K32201
13349C16617R7453A91834K80109A3589K20267O616k9020j274A04107L7146K81198
13338D22451J35066k50580J37510j84187J8721q1303J34271A6286L46821K67907
13328F31014j82354a52298A06563L3738N65629B23776R3830I33K97439M6269n7598
13317B87043K3239a17296A71639E9146N3302L64748A93824J10612C4177K101Q0644
13306A16922M0728J11437g8138C30051A9732M6196a17308H3668b05881A89098
13295a65755C725M9321b24682B84564P0135A74638J9598E2916M4083O5930m3283
13284A19646c10294A6108a39421I932K29062c1903K53p5015M8726A18392a5480
$$ y = [14686, 389260, 204133, 257016, 348227, 458082, 255261, 231259, 136264, 395701, 84416, 316617, 414070, 191834, 471943, 13589, 233856, 240472, 211452, 210178, 104107, 141253, 422451, 557517, 306937, 444447, 260260, 278981, 197678, 331949, 16286, 363107, 631014, 448660, -152298, 106563, 140301, 705930, 223776, 317606, 933, 298372, 344641, 287043, 310282, -117296, 171639, 59146, 112448, 477196, 193824, 304436, 34177, 36278, 116922, 157650, 269087, -78138, 330051, 19732, 65928, -117308, 83668, -205881, 189098, -165755, 3725, 53046, -224682, 284564, 354699, 174638, 194236, 52916, 96999, 162929, 119646, -310294, 16108, -139421, 9932, 238994, -31903, -31650, -106665, -57939, 118392, -15480]
13272C85214H5133R1780k8159J17833a2909C123L05370A9990J98206L1437c8912
13260A89517F7652J40324q5096a01913B43327L01252B05159D8770Q5091J27123
13250B60984h7024A27051n7662B3487K59332a30991F955L49884E1667J43435R2697
13239B87799A21602K7260p0535O6957j0171a36950O3154a5640B23800k6184b92510
13227H2165M988J8171N6347A8375O0271J30421c4238C55721a10546n2611A79061
13215A90276b6529L168C53459j8729J66955j71193a48992c9530j99830B2082M41919
13204D64001A63842K5760K64396I7776M11646C0146J52884a95371B71690A20160
13193B71361i242q8102j11458C8076a44507A84528c05246B07514q1689J84258
$$ y = [385214, 85133, 176913, 148754, 266587, -12909, 3123, 308493, 19990, 218196, 249633, -38912, 189517, 67652, 207976, 122880, -101913, 243327, 544579, 205159, 48770, 133861, 260984, -87024, 127051, 69389, 23487, 282819, -130991, 6955, 356839, 51667, 195102, 287799, 121602, 148862, 78327, 145284, 135113, -136950, -73796, -15640, 223800, 197616, -292510, 82165, 87153, 105324, 161671, 18375, 78646, 209067, -34238, 355721, -110546, -163157, 179061, 190276, -26529, -23361, 353459, 334730, 501685, 330492, -148992, -39530, -239360, 22082, 464001, 163842, 189602, 453998, 97776, 509422, 30146, 183030, -195371, 271690, 120160, 271361, -9242, -97344, -208802, 38076, -144507, 184528, -305246, 207514, 125825, 310083]
13183C10083l4854B2711K61007j23800J63202a22294j13165L9125b0619D33139
13172a10802b9181D4268J15015i0377b4543k0408B08720k2672O1889f5810C7064
13160A80436d7081I1791J60202A8918L44766f6621E06898b75647J29001F4830
13149B17138E4492b4899H5723O368J17804L1775j1028M6220j26338A8312M0724
13138E9036K77485r0602H8733K850M33248c8139m3679D7300J01255N6013H849
13126B4857K72898k5850a9504D8454a29591j1539j34037A4167j642L7517a23254
13114B19854k3682Q0704b34425B39056i5524c80r917B39182h9916B19804F7494
13102B43594q3723J20410c1136B32039q6850D762d977j00612A09675J15594i8580
$$ y = [310083, 275229, 22711, 283718, 159918, 323120, -122294, -235459, -196334, -20619, 433139, -110802, -29181, 44268, 159283, -90377, -24543, -44951, 208720, 186048, 247937, -65810, 37064, 180436, -47081, 91791, 251993, 18918, 363684, -66621, 506898, -275647, -146646, 64830, 217138, 54492, -24899, 85723, 92091, 209895, 241670, 230642, 276862, 150524, 18312, 59036, 336521, 245919, 88733, 91583, 524831, -38139, -81818, 47300, 148555, 204568, 8849, 24857, 297755, 271905, -19504, 48454, -129591, -141130, -275167, 14167, 12525, 50042, -123254, 219854, 196172, 276876, -234425, 239056, -95524, -380, -10297, 239182, -89916, 219804, 67494, 243594, 159871, 280281, -31136, 232039, 145189, 4762, -4977, -105589, 109675, 225269, -98580]
13090C7321a22258D1942J9271J66279h128C08897p3996B3887g9917A38915a6260
13078B96672A29210L82726B3928J40482A0666L36822q9459e5566C5663J22420
13068A58083h824m6625H4420m1724R563j1362M9850A4712J76978J09952A42607
13056b2044R066B70616a2G443K22592E9337a27182O1408C43164K29663A44978
13044b16011B12023q4621a50217i771j22911B29417h403I1384c5285C43365a4444
13032D22403A0338L17782d9841B23579H7581K30267f8464B93182d2747B33006
13021e71C03395L88995H3259M35035k12742g8273C27712a92743D10297c1650j0615
13010d2265A47440k9988M2969J30515b27778B93361A00298K48653A08349J43741
$$ y = [37321, -122258, 41942, 61213, 227492, -8128, 308897, 234901, 23887, -79917, 138915, -16260, 296672, 129210, 511936, 23928, 164410, 10666, 347488, 258029, -55566, 35663, 158083, -8824, -55449, 84420, 42696, 52259, 40897, 90747, 14712, 191690, 301642, 142607, -22044, -12978, 270616, -12, 7443, 230035, 59337, -127182, -65774, 343164, 572827, 144978, -216011, 212023, 127402, -150217, -9771, -132682, 229417, -8403, 91384, -35285, 343365, -14444, 422403, 10338, 328120, -49841, 223579, 87581, 317848, -68464, 293182, -42747, 233006, -571, 303395, 692390, 83259, 518294, 305552, -78273, 327712, -192743, 410297, -31650, -42265, 147440, 117452, 160421, 290936, -227778, 293361, 100298, 348951, 108349, 252090]
13000B52090d3883A91652J16448q5486B9633R9513P982n5417a33585j13054G9120
12988H6607J02369c1985D2177M1621C2581b88892C07695A46533f6415A7637P1989
12977H9626J93074I1959a52858B721R0162N7111J54506A10616K1975J97370o8403
12966B61558j6681H8995b27992A17162a0028j72702A98310a03003d6323B69464
12955A29051n7449j69K81957b79152D45202H788f6870C84337j10113c130j39542
12944a42672A29897a25456r5709f4029A92445r0810K81069E9797a08996k02499
12934c11495B12978q6473a52140I7153B2543k66L43764A48085e7854j6480B21283
12922b27722g4189F1827b94055A1242K69438h0595j53433c2981k9498o7246B15400
$$ y = [252090, -43883, 191652, 308100, 222614, 29633, 129146, 137128, 81711, -133585, -246639, 79120, 86607, 188976, -31985, 42177, 83798, 32581, -288892, 307695, 146533, -66415, 17637, 89626, 282700, 91959, -152858, 2721, 92883, 149994, 304500, 110616, 132591, 329961, 261558, 244877, 88995, -227992, 117162, -10028, -182730, 198310, -103003, -46323, 269464, 129051, 71602, 71433, 353390, -279152, 445202, 8788, -66870, 384337, 274224, -3130, -142672, 129897, -125456, -221165, -64029, 192445, 101635, 382704, 59797, -108996, -311495, 212978, 126505, -152140, 97153, 22543, 22277, 366041, 148085, -57854, -74334, 221283, -227722, -74189, 61827, -294055, 11242, 280680, -80595, -234028, -32981, -62479, -129725, 215400]
12910a38282L5178H0028c6578k56884B79170a14117A6932c18613B70700H8559
12899A85965J31016b15046A12567a894k62302A8974L50085H155b47313M8103c0957
12887E6001J58449c48580e0080B43812f6499A44159M2811a46635K7568J3479B47210
12875C01640d5558a1303j83123d2265F9268M1698b29649B09877f413D44570b84285
12863B72291a20255A47640a61437p6744B27992l7332e5152B14757D1842K24714
12853B66556m2867P7200b6853F1587J06394a65232B16826a25980K2363M8815p9048
12842a33850M5580C83546F3311K14983j01491n0671Q1858E0329a88128c4990A53710
12830a49187A29448L2359h8736o6294K7143i888D3396J79092D1539B0110l75h2176
$$ y = [-138282, -103104, 80028, -36578, -293462, 279170, -114117, 16932, -318613, 270700, 88559, 185965, 316981, -215046, 112567, -1894, -264196, 18974, 369059, 8155, -247313, -199210, -30957, 56001, 214450, -348580, -50080, 243812, -66499, 144159, 186970, -146635, -119067, -105588, 247210, 301640, -45558, -11303, -194426, -42265, 69268, 110966, -229649, 209877, -6413, 444570, -284285, 272291, -120255, 147640, -161437, -238181, 227992, 190660, -55152, 214757, 41842, 266556, 223689, 300889, -26853, 61587, 167981, -165232, 216826, -125980, -103617, -54802, -133850, -88270, 383546, 63311, 278294, 176803, 126132, 207990, 50329, -188128, -34990, 153710, -149187, 129448, 161807, -88736, -155030, -127887, -9888, 43396, 222488, 41539, 20110, 19735, -82176]
12817E9042A765g0615F3707G71c57883h5693C74762d0328B7074M5540J81633e240
12804B5859c7965A53847N6306A0266b6367H2925a99081e2446G4762a90516L5415
12793a55101I1325a41204a6081D91558H7024j8026a02478j32626c3341B34364
12782h5232B33621b9363I2622b3230j23561o3668C33265a07058D5019j4841L85510
12771D15688b42655A10521a80920A69694c0675B25721e8445j7476A40074c7643
12760a48684A21457K094a11519E1724J89894b16582B2499a78313f7160A62561
12749b12644C60129D7831a78326A22082J86266a64872B06534a45610A94152b9177
12738F0171K58788A57711E4732q268J50885Q0847A07257K62841A2632b01324A81487
$$ y = [59042, 1765, -70615, 63707, 771, -357883, -85693, 374762, -40328, 27074, 72614, 254247, -5240, 25859, -37965, 153847, 210153, 10266, -26367, 82925, -199081, -52446, 74762, -190516, -155101, 91325, -141204, -16081, 491558, 87024, 68998, -102478, -235104, -33341, 234364, -85232, 233621, -29363, 92622, -23230, -146791, -210459, 333265, -107058, 45019, 30178, 415688, -242655, 110521, -180920, 169694, -30675, 225721, -58445, -75921, 140074, -37643, -148684, 121457, 123551, -111519, 51724, 241618, -216582, 22499, -178313, -67160, 162561, -212644, 360129, 47831, -178326, 122082, 308348, -164872, 206534, -145610, 194152, -29177, 60171, 318959, 157711, 54732, 46464, 197349, 278196, 107257, 370098, 12632, -201324, 181487]
12726F5938K05370r5221C1438J71956a88803B30469j09090k201E6974P56d0198
12714d6524j78102C96748H0715c7504A02440Q1061J12239O3097j13407K0506f507
12702H1473K78851D3147L75045A61921i7754j64364A78361b95157f3637D6368
12691A04020J62578a44486m6903n1511A95610J40954a13067q4733D15904A19085
12680A38026l4990E1513J69999K71730B16185o8347Q2236I3420J73775a32426
12669A09294A0907a98236A82952a99432d1587A61940K4016b551C29172r6016g9297
12657C22911A42861J89114a47828O246B46919J37259a95421A86572H0737H633
12646C3443R6952a51899A46907D8156d4483p5763D9732J11518B693K63259A22081
$$ y = [65938, 271308, 176087, 31438, 203394, -188803, 230469, 121379, 119178, 56974, 57730, -40198, -46524, -224626, 396748, 80715, -37504, 102440, 183501, 295740, 358837, 245430, 265936, -6507, 81473, 360324, 43147, 418192, 161921, -97754, -262118, 178361, -295157, -63637, 46368, 104020, 266598, -144486, -191389, -242900, 195610, 336564, -113067, -197800, 415904, 119085, 138026, 103036, 51513, 221512, 493242, 216185, 147838, 230074, 93420, 267195, -132426, 109294, 10907, -198236, 182952, -199432, -41587, 161940, 185956, -2551, 329172, 233156, -79297, 322911, 142861, 331975, -147828, -141582, 246919, 384178, -195421, 186572, 80737, 8633, 33443, 130395, -151899, 146907, 48156, -44483, -120246, 49732, 161250, 2693, 265952, 122081]
12634B42311c2267k28885B35050a78057D12504J8304A50764b50588A11707a36572
12623a1572l9249a2640A26589L45556d2311B84560e893C02440a20590D0263K85285
12612C25548c1549l4234B09499d628q5011B14835l3275o3010M5840o2952m9009
12601E2429A0023K02641K14228G6987N2447f7438B11723a30985A06104A5154a67927
12589b0165o8087A99796I0181J01744J46999I2567k8981b28360M7835p1016D7893
12577C5734K20556a79048Q5423q3431N0382c6180A94181h0456m2056H3844Q3466
12566A67310g3384A13471L2786n6333c46398A76815E2795J97423o3244b67513
12555b61762A68289b22652C7087b65202N8984A10126b43408H9743N2416e30359
$$ y = [242311, -32267, -261152, 235050, -178057, 412504, 430808, 150764, -250588, 111707, -136572, -11572, -50821, -12640, 126589, 472145, -42311, 284560, -5893, 302440, -120590, 40263, 325548, -31549, -65783, 209499, -4628, -89639, 214835, 181560, 118550, 164390, 101438, 52429, 10023, 212664, 426892, 76987, 129434, -67438, 211723, -130985, 106104, 15154, -167927, -20165, -88252, 199796, 90181, 191925, 338924, 92567, 63586, -228360, -180525, -251541, 47893, 35734, 256290, -179048, -93625, -177056, -126674, -36180, 194181, -80456, -122512, 83844, 167310, -73384, 113471, 146257, 89924, -346398, 176815, 52795, 250218, 186974, -267513, -261762, 168289, -222652, 37087, -265202, -206218, 110126, -243408, 89743, 142159, -530359]
12544A34299a38652H5818d41194A65598d0814k1502j16612D0191O5545d07254
12533a97117I2030C4903J51793r2795a38261A37301b43184A35834J00950a62026
12522E9165P0080n8045J5366B6443M8134a28132j20855H0309P562b26382i2069
12510B17303a25223H6320m270J58414C99J37893a1213l65161h0797I6764L39565
12499D36329d1830A6205K7335a99948f4347A17950N001a12114B7602b24460a3534
12487h6237A53953j3166n7526a85897C33899M3212j18521b51953a17410j17805
12477b35215G9413b04742e0480k12828H8166J61745d9501l18095A2405M94537
12467E06942c08865b5416B8025e412A99851c17533C3417i6104A9917f881F6722
$$ y = [134299, -138652, 85818, -441194, 165598, -40814, -62316, -178928, 40191, 105736, -407254, -197117, 92030, 34903, 186696, 93901, -138261, 137301, -243184, 135834, 236784, -162026, 59165, 129245, 71200, 86566, 26443, 74577, -128132, -248987, 80309, 87871, -226382, -92069, 217303, -125223, 86320, 82050, 240464, 399, 138292, -11213, -376374, -80797, 96764, 436329, -41830, 16205, 43540, -199948, -64347, 117950, 122951, -112114, 27602, -224460, -13534, -86237, 153953, 140787, 83261, -185897, 333899, 377111, 258590, -251953, -117410, -235215, 79413, -204742, -50480, -263308, 88166, 249911, -49501, -367596, 12405, 506942, -308865, -25416, 28025, -5412, 199851, -317533, 33417, -96104, 19917, -6881, 66722]
12455a29474j98071A80866b76411g3395o4852A71476k8066o9640L6134L3041M3908
12444A86853A8228J99776r2710J19747A0405J01021R9687i4737n304j18518b0008
12432b87757I8107C5027h5122m37452B3789J99533a32676E7152c1701D1721K50951
12421B92672e0676B39490J57375F7040L6763i3387m7816k05584A1608k117L07587
12410C17078B7583a08661b7279a3572k57014J17664B10454D9141a65083B97309
12399H0672Q6435q2826M6208K23402a30837m4427C89837j60839a48201f9026A76702
12387b68053B33250J01973C4314K47682q0618e3331m3707c3720B58143a56614
12376c4844Q939j4272J5082A63695j8401m5179b01015C34309A40727b22431P9671
$$ y = [-129474, -327545, 180866, -276411, -73395, -138247, 171476, 143410, 73770, 109904, 142945, 186853, 18228, 218004, 125294, 245041, 10405, 111426, 211113, -94737, -100041, -218559, -20008, -287757, 98107, 35027, -85122, -522574, 23789, 223322, -132676, 57152, -31701, 41721, 292672, -50676, 239490, 396865, 67040, 103803, -93387, -141203, -346787, 11608, 9491, 317078, 27583, -108661, -27279, -13572, -270586, -152922, 210454, 49141, -165083, 297309, 80672, 167107, 84281, 130489, 353891, -130837, -175264, 389837, 228998, -148201, -69026, 176702, -268053, 233250, 335223, 34314, 281996, 201378, -53331, -97038, -33720, 258143, -156614, -34844, -25905, -40177, -25095, 163695, 145294, 100115, -201015, 334309, 140727, -222431, -142760]
12365a42760A65538b57939A59751E867K06752a25856A88388I0221e9811m3592
12355a03403B34972p8996M3412a60897H8034M7711Q5208B7427b226A51709b46441
12343A17651B1943b92305A37265k8651K5534J23531E6762J68664a26585A89069
12332a7141A7223i0784B0156a24993A68513e5682H783c7370j6352q1063j08791
12321b43576N5928A87319a9751n2061L0337E9432O2349l5287A0317a48606B1364
12309I3232k0128d9584B00034a29737j17112N1771c8080A27382c2538F0150K7632
12298H7782P1261a72494O1079a9917o8561A1861a44708C3065b88541B68396E9915
12286f8960A42923b2585D6503k1387L8082K04470o2236P3770e2806k151A18211
$$ y = [-142760, 165538, -257939, 159751, 5867, 212619, -125856, 188388, 90221, -59811, -103403, 234972, 155976, 199388, -160897, 88034, 135745, 220953, 27427, -2226, 151709, -246441, 117651, 21943, -292305, 137265, 108614, 134148, 257679, 56762, 225426, -126585, 189069, -17141, 17223, -90784, 20156, -124993, 168513, -55682, 8783, -37370, -53722, -134785, -243576, -187648, 187319, -19751, -71812, -41475, 59432, 121781, 86494, 10317, -148606, 21364, 93232, 73104, -49584, 200034, -129737, -246849, -195078, -38080, 127382, -32538, 60150, 87782, 159043, -172494, -111415, -19917, -88478, 11861, -144708, 33065, -288541, 268396, 59915, -68960, 142923, -22585, 46503, 25116, 63198, 267668, 205432, 279202, -52806, -54957, 118211]
12274D24547F6764M74587b45891B87028b2872A77783a36872M355K9854B03016
12263A02364J22181q3888a6695n1982a2697A77622a57858g7370B97877b27865
12252B12585i6957A87572e9739B64452e6896m7835A18427a15731j25901A48011
12241B4636k586a42518D6129c2612A7867b83222D5130d3608B99359I9213J00956
12230B00169n1492c839A66724p6442L50451a07807D72819j39961a14593B66759
12219B82744h692j25274D27651Q155A0725P7989h5275B09343M1519A23567j9500
12208A04067J88421Q848Q4182j62149h1878C36038B0687c2257B64895J32146A1180
12196a42625C0183J32126J08601A15204O5115e5500B76604n4707K3183a19106
$$ y = [424547, 66764, 541351, -245891, 287028, -22872, 177783, -136872, -132517, -102663, 203016, 102364, 224545, 140657, -16695, -68677, -12697, 177622, -157858, -77370, 297877, -227865, 212585, -96957, 187572, -59739, 264452, -56896, -104731, 118427, -115731, -241632, 148011, 24636, 22050, -142518, 46129, -32612, 17867, -283222, 45130, -43608, 299359, 99213, 200169, 148677, -3839, 166724, 90282, 440733, -107807, 472819, 332858, -114593, 266759, 282744, -8692, -133966, 427651, 435806, 10725, 88714, -85275, 209343, 250862, 123567, 104067, 292488, 301336, 385518, 223369, -81878, 336038, 20687, -32257, 264895, 397041, 11180, -142625, 30183, 162309, 270910, 115204, 180319, -55500, 276604, 221897, 245080, -119106]
12185e8091H1173R8704a17943A1644i394C82926d2374A8325b3521A64037b9057
12173B63825P7857A62748J76586b30239a0128G073b9950A31711O3197K3820c8695
12161E9855J98982F9331J68205a68894c7647A4930K46986A27881e4298A59861
12150d7556i616A82788q2505K8266M19744G8929L2003l349a3903D16869e910r5779
12138a01689B10299H2286k8140K09915L044j9900p3922c99952B72899j10246F7558
12126I977g1807A62567E5659a4085j93676A58918i724F316r33a15180F8631J52950
12114B21581A6931a31210p1924B324c2219A34354l7310d0646A16234b54399B58947
12102a06650B54832j22752e7324o9246A1986M57185E1658L03740G0323K24111
$$ y = [-58091, 81173, 179877, -117943, 11644, -9394, 382926, -42374, 18325, -23521, 164037, -29057, 263825, 341682, 162748, 339334, -230239, -10128, 7073, -29950, 131711, 194908, 218728, -38695, 59855, 258837, 69331, 237536, -168894, -37647, 14930, 261916, 127881, -54298, 159861, -47556, -9616, 182788, 100283, 128549, 548293, 78929, 110932, 107583, -13903, 416869, -5910, -101689, 210299, 82286, 54146, 264061, 267105, 247205, 173283, -399952, 272899, 162653, 67558, 9977, -71807, 162567, 55659, -14085, -207761, 158918, -9724, 6316, 5383, -115180, 68631, 221581, 16931, -131210, -203134, 2324, -32219, 134354, 97044, -40646, 116234, -254399, 258947, -106650, 254832, 132080, -57324, -126570, 11986, 469171, 51658, 355398, 70323, 294434]
12092B94434m9666a09691A25458j1243d5897D9505O2037a34967E7139d7408l71410
12081d18818B1134i1670K5506C73469f1974B18517L66386J106211m35987D51438
12070A08387J38582E6034o72b28666R5981j59332J07367B94505D954J07424a33890
12058C41207A24073n6370b9470A53877a6339j67111k6939E7881a52952C57633
12047a12672D18634b95835k5197A58908d79696H2557K00556q0057b32943F1680
12036a55130f5173C5934g2994B86634e8624J6143H0143a35523e397j182C6830
12024A1321a4352l10814C18728b16419Q8822F6533j8652L1640M8777c17635B14728
12012A5726b1529A68548b7677A68092D8559B2476L16874i0211A45984a81243P3246
$$ y = [294434, 244768, -109691, 125458, 114215, -45897, 49505, 111542, -134967, 57139, -47408, -418818, 21134, -91670, -66164, 373469, -61974, 218517, 584903, 1691114, 1255127, 451438, 108387, 246969, 56034, 55362, -228666, -132685, -292017, -184650, 294505, 4954, 112378, -133890, 341207, 124073, 67703, -29470, 153877, -16339, -183450, -210389, 57881, -152952, 357633, -112672, 418634, -295835, -321032, 158908, -479696, 82557, 283113, 203056, -232943, 61680, -155130, -65173, 35934, -72994, 286634, -58624, -42481, 80143, -135523, -5397, -6579, 36830, 11321, -14352, -325166, 318728, -216419, -127597, 66533, 47881, 79521, 128298, -317635, 214728, 15726, -21529, 168548, -27677, 168092, 48559, 22476, 339350, -90211, 145984, -181243, -107997]
12001a07997A93221e7252k8461D7878g7124I9274b15089B3256a37522B02561e5208
11989A23378b13540G7565d3939B14375H7014M8584B9092K53669K0030H0875J66264
11978B47139h6926A50421e519B09298g939r4345n5032k2987C0434a27726j29089
11967b56815A58843p8033b60618N3263B21415D9262a16340c9193l01769F9180
11956C58705h4027b9741j76008O2655o408L7626E7799b04543F9622P1616a57007
11944A05528h4071c0131I8254l4701c5751C42476a20105f6o6192L2217A43297
11932B5499K0704L63081G6806j5944a03067n57393a94951C31674H1965g2234B06308
11920a60802B54552n104a11314r3013B71755A7085a12953A46966a1146m8963C2435
$$ y = [-107997, 193221, -57252, -85713, 47878, -77124, 99274, -215089, 23256, -137522, 202561, -55208, 123378, -213540, 77565, -43939, 214375, 87014, 135598, 29092, 282761, 302791, 80875, 247139, -86926, 150421, -5519, 209298, -7939, -102284, -157316, -180303, 30434, -127726, -256815, 158843, 80810, -260618, -207355, 221415, 49262, -116340, -39193, -340962, 69180, 358705, -84027, -29741, -205749, -143094, -149502, -111876, 57799, -204543, 69622, 141238, -157007, 105528, -84071, -30131, 98254, 63553, -35751, 342476, -120105, -66, -66258, -34041, 143297, 25499, 46203, 409284, 76806, 60862, -103067, -660460, -194951, 331674, 81965, -72234, 206308, -160802, 254552, 249448, -111314, -204327, 271755, 17085, -112953, 146966, -11146, -60109, 32435]
11908a42822c099I060b82986D04866C1698j4819K23648g3988D2974P0160b95993
11896A38577a04630J8466A97232c18155a22873a3411E5513d823C8102e3393j70931
11885b24324l9812Q4200Q7641L5310D7130J19726d4107C178J86884p6994A3971
11873e0592j4496H5576a1352D4430a81467c924B75687d96066a33646d870j05959
11862a10829k36768h0862L5845j72596L6736A33155K6166L826F6915c1489C493
11850a40926A13117a46980j99764A90103h6396j6558H0008b96297D9080a66323
11839a05026c9827A57659a68910B0126N9793C8109N1015K3548i7295B35095F079
11827a96268P6830q6111L0581G2973a68568A46800a73333I5243a523k2648F7783
$$ y = [-142822, -3099, 9060, -282986, 404866, 31698, 16879, 240527, -73988, 42974, 113134, -295993, 138577, -104630, -86164, 197232, -318155, -122873, -13411, 55513, -4823, 38102, -53393, -224324, -264136, -179936, -92295, -56985, 47130, 166856, -44107, 3178, 190062, 113068, 13971, -50592, -65088, 85576, -11352, 44430, -181467, -3924, 275687, -496066, -133646, -4870, -110829, -347597, -80862, -45017, -217613, -180877, 133155, 159321, 163147, 66915, -31489, 3493, -140926, 113117, -146980, -346744, 190103, -86396, -102954, 80008, -296297, 49080, -166323, -105026, -39827, 157659, -168910, 20126, 79919, 38109, 89124, 112672, -97295, 235095, 6079, -196268, -119438, -205549, -174968, 72973, -168568, 146800, -173333, 95243, -1523, -24171, 67783]
11815F0083h216j4686B87935c27806A39903a67213b8747A44463c8953C9000a32791
11803A05110D519b02160k4385A51339l8184b16263A01893i3292m6983m3485k0929
11792b04689j15705e4583k479m8921d9948G8630j8873J28901a51449e2632l0018
11781h2650A0432J17236J24547h6430n7615I527b3671q7069a5833I6562d8814
11769B02359c17493N9215B4612a57885I4541b5485B03583a74257C6119F543a17766
11757d355n1945B59817a37059e9046I4730A0255d3863k39763a816D3639b68673
11745A31169D4227B534O137K30477I0555K80974a66470C44819c37931B14277n5015
11734A59262g8915G190J89404C1942K07762E7293M8882n1766L4586I859J36944
$$ y = [60083, -8216, -22902, 287935, -327806, 139903, -167213, -28747, 144463, -38953, 39000, -132791, 105110, 4519, -202160, -226545, 151339, 113155, -216263, 101893, -93292, -140275, -183760, -204689, -320394, -54583, -57062, -105983, -49948, 78630, 59757, 188658, -151449, -52632, -82650, 10432, 127668, 252215, -86430, -144045, 9527, -23671, -110740, -15833, 96562, -48814, 202359, -317493, -258278, 24612, -157885, 94541, -25485, 203583, -174257, 36119, 6543, -117766, -4355, -56300, 259817, -137059, -59046, 94730, 10255, -43863, -283626, -1816, 43639, -268673, 131169, 44227, 2534, 8671, 239148, 90555, 371529, -166470, 344819, -337931, 214277, 159262, -78915, 7190, 196594, 31942, 239704, 57293, 106175, 54409, 88995, 9859, 146803]
11723A46803J16731j03642G2894e4416B13361b85121D75959d1499A6312L5836
11713E2148J21939L0765C6045K56309E0160E835b4859B09031a3065o7915R089
11702g1891A28645a14978C025J65161f6397A04859B9968a68380A0198K8198J71922
11691B10318A6648h6034o0615g2209D1368J44045j3692K4474O6069m0525J77383
11680C99122A13477Q6265m5022F5548a66076b4193A1318a4030A88661D5147A7871
11668a13723G0139G290J43547D7923M45511H4793a21467A82000a24752p1196A22594
11656e8404A1698O8285a01673A31519O9518l4070l3850j3665k7476c5096j26820
11645a61916O0413A47117g7021B15160D7695b76887k6462a2084l12710j4478F5156
$$ y = [146803, 263534, 159892, 72894, -54416, 213361, -285121, 475959, -41499, 16312, 52148, 174087, 204852, 36045, 292354, 50160, 5835, -24859, 209031, -13065, -80980, -71891, 128645, -114978, 3025, 168186, -66397, 104859, 29968, -168380, 10198, 38396, 210318, 16648, -86034, -146649, -72209, 41368, 185413, 171721, 196195, 262264, 221739, 399122, 113477, 199742, 154720, 65548, -166076, -24193, 11318, -14030, 188661, 45147, 17871, -113723, 70139, 7290, 150837, 47923, 493434, 84793, -121467, 182000, -124752, -195948, 122594, -58404, 11698, 79983, -101673, 131519, 201037, 166967, 133117, 119452, 91976, -35096, -161916, -101503, 147117, -77021, 215160, 47695, -276887, -303349, -12084, -324794, -339272, 65156]
11633A91882e1548E2900b0270C64945j14936o4782d9071F1483J13769C3062K00488
11622B33550F5835a79153E39021a76618B7717b56919A92968h350A4751K6888j7882
11611B3757K35556j00851a06033E2125b12896a9895p3878J3074b5475j6708H4567
11599f4124j31455A37473L96290d1828B63128d0972n8012L7564B84538F5745O12
11588F6357J591J11635m142J67905B4403M0778J44083e4357l2622a5000r3336
11577a08336C91569A86259p5662J74025C3973K9232b2689C46798a8936E2209B4255
11565c5067A11472N4385L5137O4165M4177j12580K3193J9335a4501F7603C1286
11553A95997a25869A19883J86056A39177J775N2077H238c6606A47141J49023d7955
$$ y = [191882, -51548, 52900, -20270, 364945, 250009, 185227, -49071, 61483, 175252, 33062, 233550, 65835, -179153, 539021, -176618, 27717, -256919, 192968, -8350, 14751, 41639, 23757, 259313, 158462, -106033, 52125, -212896, -19895, -93773, -80699, -25475, -42183, 84567, -64124, -195579, 137473, 533763, -41828, 263128, -40972, -98984, -61420, 284538, 65745, 66357, 67948, 179583, 175441, 343346, 24403, 65181, 209264, -54357, -86979, -15000, -108336, 391569, 186259, 110597, 284622, 33973, 63205, -22689, 346798, -18936, 52209, 24255, -35067, 111472, 165857, 200994, 265159, 309336, 196756, 219949, 239284, -14501, 67603, 31286, 195997, -125869, 119883, 305939, 139177, 140952, 193029, 8238, -36606, 147141, 296164, -47955]
11541G2134K75413a5223p1659D1951a85037c1444q3503k36391B270M67806k00029
11530B70047n9560F5304K5673a23198j23788a9142A01928B2852Q369Q0399a23904
11518B03508o5730R0722m6126e1519F7574P6248J23407j5908j14259m2749a07969
11506A72119n7912K37088B8933a47916A09839e3102k61109D15867d4998H2750
11495B74626c8871A99422p1717c90987G5858J08578a31679N5968C87921d835j89168
11484a94003e4658l1494C02782A6425N50554q9458k20805H4882l0834J09452G6199
11472A90270J3069F1343G070K52262E3128J62926E0570J94258H3639b72449A92125
11460b6135B06145r5079J93366J7470j18677K09102j97199K0116f0427B75501
$$ y = [72134, 347547, -15223, -86882, 41951, -185037, -31444, -114947, -351338, 2270, 470076, 270047, 210487, 65304, 90977, -123198, -246986, -19142, 101928, 22852, 31221, 111620, -123904, 203508, 137778, 228500, 182374, -51519, 67574, 143822, 267229, 251321, 137062, 94313, -107969, 172119, 114207, 351295, 28933, -147916, 109839, -53102, -314211, 415867, -44998, 82750, 274626, -38871, 199422, 127705, -390987, 75858, 184436, -131679, -75711, 387921, -4835, -194003, -54658, -86152, 302782, 16425, 566979, 477521, 256716, 84882, 54048, 163500, 76199, 190270, 203339, 61343, 7070, 259332, 53128, 216054, 50570, 244828, 83639, -272449, 192125, -26135, 206145, 111066, 304432, 321902, 203225, 412327, 215128, 235244, -60427, 275501]
11449B00359B5872e0201B19228n6497Q8856A1599L04218A00418B7623i8836A69968
11437h5823B10507A2730K00929p5801J19271j04283j2612o6522a96986F5393C1169
11425H1374Q1993F8776j1448K68157b50821M4022c1418k08188B9722a69412B12090
11413H0848a01863C80228j64046D97K82530g4108C11036A35411L06436A39837
11402a8069l08804B37731m8527q9186f6208A93690p8931a9675r4117A06858f689
11390H368M9044A4239b06308f1374A4045b38789A95784a16056e2566h99B02793
11378B5002N8565d7428A55997a89202a4268j36186I2979a4770m2322j4820b4342
11366D52196A27360c35782A01176L876a04267B40038C057g7807l64869b8242j21387
$$ y = [200359, 25872, -50201, 219228, 162731, 251587, 11599, 315817, 100418, 27623, -98836, 169968, -85823, 210507, 12730, 213659, 137858, 257129, 152846, 140234, 73712, -196986, 65393, 31169, 81374, 163367, 68776, 57328, 325485, -250821, -206799, -31418, -239606, 29722, -169412, 212090, 80848, -101863, 380228, 216182, 497, 283027, -74108, 311036, 135411, 441847, 139837, -18069, -326873, 237731, 189204, 100018, -66208, 193690, 114759, -19675, -113792, 106858, -6689, 8368, 57412, 14239, -206308, -61374, 14045, -238789, 195784, -116056, -52566, -899, 202793, 25002, 83567, -47428, 155997, -189202, -14268, -150454, 92979, -14770, -57092, -71912, -24342, 452196, 127360, -335782, 101176, 105052, -104267, 240038, 3057, -77807, -442676, -28242, -149629]
11355a49629A05457a08331A52352G5022J03178a49308p6016C01220C3618J59248
11345A92866g0855B61063I1921G806P547K2491e288A76204c0516A18863b7231
11333b81460j31996I8339C8082a42581n6856O8693p5451C7221b18948G5329b8121
11321h9210B108N1380M00335h368j6671l2507A26720e7419j34673O3522D6554
11309G1052a78014a8544C5120J14068J25586b6292J260g80n9848I8120a83723
11297b09464N2283P4435A10162d10o836j23188d6627A12463a11870A19512a48134
11285A0919h8949K3907l52p4034N4617l25780B48019e9086l6965D5018a13H0646
11272c4522a5816A37395b26702h0755j33928j08157A44943J6746p6703a66391
$$ y = [-149629, 105457, -108331, 152352, 75022, 178200, -149308, -225324, 301220, 33618, 192866, -70855, 261063, 91921, 7806, 15353, 37844, -5288, 176204, -30516, 118863, -27231, -281460, -413456, 98339, 38082, -142581, -199437, -130744, -206195, 37221, -218948, 75329, -28121, -89210, 2108, 53488, 453823, -8368, -25039, -57546, 126720, -57419, -192092, -128570, 46554, 71052, -178014, -18544, 35120, 149188, 274774, -26292, -25032, -780, -60628, 98120, -183723, -209464, -157181, -82746, 110162, -410, -7246, -130434, -46627, 112463, -111870, 119512, -148134, 10919, -88949, -65042, -65394, -139428, -84811, -410591, 248019, -59086, -96051, 45018, -113, 80646, -34522, -15816, 137395, -226702, -80755, -214683, -322840, 144943, 161689, 84986, -166391]
11261H1309L9845a63809B7785a16551A02080C1504O221a73552c2724k16581k7584
11250b76889K1929J6728Q8691A0518J13775g1597c172H9107g6695I4865J15872
11239B10737e383h77k48074G1319a32088A74854C1648a25472A49400a71628k2938
11228a94566F4589b19013J09002K4712j73547K4318J08347c2260r0897d9348k48207
11217b97555C647J26256C3946M4980a91230j67603c2243l3341k4373c3340j55795
11206a89135B31201a9157j9422j52889j93406I3263b06019b9719B55895h1554
11195a42901j9560A75430a9281l44154N9385o1488J67452A58863b24904P0070
11185a54834H8146K3599a66076F3008c119C34388E8257g6014j64687B2746J79735
$$ y = [81309, 121154, -163809, 27785, -116551, 102080, 31504, 37725, -173552, -32724, -249305, -276889, -254960, -238232, -149541, 10518, 124293, -71597, -3172, 89107, -76695, 94865, 210737, -5383, -877, -248951, 71319, -132088, 174854, 31648, -125472, 149400, -171628, -194566, 64589, -219013, -110011, -85299, -258846, -234528, -126181, -32260, -123157, -49348, -297555, 3647, 129903, 33946, 78926, -191230, -358833, -32243, -65584, -89957, -33340, -189135, 231201, -19157, -38579, -191468, -384874, 93263, -206019, -29719, 255895, -81554, -142901, -162461, 175430, -19281, -363435, -304050, -365538, -198086, 158863, -224904, -154834, 88146, 111745, -166076, 63008, -3119, 334388, 58257, -76014, -240701, 22746, 202481]
11174B02481D8480Q4682b44393C5228a27363c0823j4536j1443o6353j26787b9718
11162b95318c2576B32684f2203l86640b24122B2656c4760I5345a95175L6965A56059
11150C21956j47460a17172A7171E330J75035a5643A84355A5442J81407M919I9799
11138I0405e0823A72597i8623A93961j908L6546B638c9642l1825B13690e3627
11126H6653M7719c9701G5786f7287H9759r608b97624h4747A78149k9722B0479
11114C3578A5637d4830A32517l1948f2079C12130a67595m8856A80237Q5646M1516
11103C07399d4510a8665A80230j7701J67720H7140P0428B411K98119J60259b21291
11091i8298A74593c2634A09812L0745A2287L17395A8410J658O57712f1927B44528
$$ y = [202481, 48480, 133162, -244393, 35228, -127363, -30823, -45359, -56802, -123155, -249942, -29718, -295318, -32576, 232684, -62203, -448843, -224122, 22656, -34760, 95345, -195175, -158210, 156059, 321956, 174496, -117172, 17171, 5330, 180365, -15643, 184355, 15442, 196849, 201768, 99799, 90405, -50823, 172597, -98623, 193961, 192053, 228599, 2638, -39642, -71467, 213690, -53627, 86653, 134372, -39701, 75786, -67287, 89759, 80151, -297624, -84747, 178149, 148427, 20479, 33578, 15637, -44830, 132517, 100569, -62079, 312130, -167595, -216451, 180237, 265883, 307399, -44510, -18665, 180230, 162529, 330249, 87140, 157568, 2411, 300530, 460789, -221291, -98298, 174593, -32634, 109812, 140557, 12287, 329682, 18410, 20068, 677780, -61927, 244528]
11079D86862b04463D5028O06510A18907N30215B34855J9286j16048O8850P4289
11069B81232L69180k30659A29261L13368A8988J81901L1684K2786K74708J0274
11059E40341r7786L127J93404K2698n1173K6734K42693l88619J41368J56451j99673
11048E89565O2714o3270J5050Q1655K5439N5853j17402N4058J82372o0776L7831
11037H63089N6999m04918j78722N34509K0887o8089j01954k01896m9118J60132
11027F30919L77736m02008J10906q4504m2173j82077R4893K97084j42751k01557
11017D56468L08446k80933J59615o0516J6976N8368K8293O8156j55375J09961
11007G09459l34339K8761J86832P148j81724L53533k28656M4852p1189k8003J30864
$$ y = [486862, -204463, 45028, 651538, 118907, 649122, 234855, 254141, 138093, 206943, 281232, 650412, 419753, 129261, 442629, 18988, 200889, 232573, 255359, 530067, 540341, 442555, 445682, 639086, 661784, 610611, 637345, 880038, 491419, 632787, 789238, 589565, 652279, 589009, 604059, 685714, 711153, 767006, 649604, 703662, 886034, 825258, 863089, 920088, 515170, 336448, 870957, 891844, 823755, 721801, 519905, 470787, 630919, 1008655, 606647, 717553, 633049, 590876, 408799, 503692, 800776, 658025, 456468, 764914, 483981, 643596, 583080, 600056, 658424, 686717, 754873, 599498, 709459, 375120, 403881, 590713, 597861, 416137, 769670, 541014, 585866, 514677, 486674, 617538]
10996F17538M3068j57101R0557q8744P651L00503j68621K20605k44484K33038
10986H54010N3816P0153k09946j55572O10375J12891R6886l082j17512M92481
10976A804500L9673J91221k2248K79045N12584j9288Q4499m98564k45995j36208
10966A989219j11987P7214m8018k05016K1284K13804j48659J33241j10002J29845
10956A940925N3522j87185n83950K11935j69398K38833m39406k20451L6488l58425
10946E22888P0866j50640q052n6232i3335B71950A04836N5273d1872D3831J00780
10935A44611a23378G4204a54330g0652A88522d3063A10608d2371A36431b37370
10924A46312c7381B07018c9116B0260L11452f2900j42172e1423K5254B58539a72149
$$ y = [617538, 660606, 503505, 594062, 505318, 512969, 813472, 644851, 865456, 620972, 854010, 907826, 977979, 768033, 612461, 1222836, 1335727, 1432613, 1429531, 1312019, 1804500, 1844173, 2035394, 2013146, 2292191, 2804775, 2785487, 2869986, 2371422, 2125427, 1989219, 1877232, 1954446, 1906428, 1701412, 1722696, 1936500, 1787841, 1921082, 1811080, 1940925, 1994447, 1807262, 1223312, 1435247, 1265849, 1504682, 1065276, 844825, 881313, 522888, 593754, 443114, 435062, 378830, -93335, 271950, 104836, 160109, -41872, 43831, 144611, -123378, 74204, -154330, -70652, 188522, -43063, 110608, -42371, 136431, -237370, 146312, -37381, 207018, -39116, 20260, 331712, -62900, -205072, -51423, -26169, 258539, -172149]
10912d26346J07079B9597K482K1159M7647c75907e0318A274a10911A44657c2625
10900a2207o7111F4590K1556C7067a50424j45841e3852B7055J68244c7982B16104
10888f0840K9475j1892l0582k2629B46196i4590C65152q7427a26144b2662H499
10876e9393A34055F3102g3040G2774a70655O0382p0468G9651Q7917e0406o3257
10865a13663k12062A73382c4660G1310h6314d2618o4230k5183c3461B58819e2977
10853D5532c4980C9177b43417D7268N3476B3280K30026a25260H8204l9691i6566
10841a60899f1377B9088P8619a55980A37021K30990A39943b8599A90969q4747
10831A06222J05256a47801p8436A02523m9458M5205a86647p7842j5117Q0458A3826
$$ y = [-426346, -319267, 29597, 32079, 53238, 100885, -375907, -50318, 1274, -110911, 144657, -32625, -12207, -79318, 64590, 86146, 37067, -150424, -296265, -53852, 27055, 195299, -37982, 216104, -60840, -31365, -43257, -73839, -96468, 246196, -94590, 365152, 277725, -126144, -22662, 8499, -59393, 134055, 63102, -73040, 72774, -170655, -110273, -180741, 79651, 167568, -50406, -113663, -325725, 173382, -34660, 71310, -86314, -42618, -106848, -132031, -33461, 258819, -52977, 45532, -34980, 39177, -243417, 47268, 100744, 23280, 253306, -125260, 88204, 48513, -96566, -160899, -61377, 29088, 107707, -155980, 137021, 368011, 139943, -28599, 190969, 106222, 211478, -147801, -226237, 102523, 53065, 98270, -186647, -264489, -279606, -199148, 13826]
10819B0363B998J47635a53717f9297l17626R0471a40601c5891p3453I331a06229
10807c00891K876R2566A86018i1361n6262j20078O5484c4349A71542B9532a99712
10795A32438k4441d5969D8271J16181m3877a34226f3065A39328g3990G7528L0317
10784A07845a20364d8774D3757J50064D1312J0574J9643c5120k08417a313j37651
10773a38964p6817f3658J4888G7960a39841A33072o0321A4741a06047m5884E3356
10761D7757a93738r0528a32356F8597a61255j40140E7530b1182e832k31501C0777
10749a00895d0503j88391N5820A94488d6969D4750d3961H8608a55685J7962B74955
10737D9953N1251j2379k2007b51048e9073l2247B32087c8733B53020a78960P4734
$$ y = [20363, 2998, 150633, -153717, -69297, -386923, -296452, -140601, -35891, -109344, 9331, -106229, -300891, -298015, -205449, 186018, -91361, -147623, -267701, -202217, -34349, 171542, 29532, -199712, 132438, 107997, -45969, 48271, 164452, 120575, -134226, -63065, 139328, -73990, 77528, 107845, -120364, -48774, 43757, 193821, 41312, 51886, 71529, -35120, -243537, -1313, -138964, -215781, -63658, -48770, 77960, -139841, 133072, 72751, 14741, -106047, -151931, 53356, 47757, -193738, -284266, -132356, 68597, -161255, -301395, 57530, -21182, -5832, -237333, 30777, -100895, -40503, -228894, -173074, 194488, -46969, 44750, -43961, 88608, -155685, -137723, 274955, 49953, 101204, 88825, 66818, -251048, -59073, -91320, 232087, -38733, 253020, -178960, -104226]
10726a04226p2808q280B62831D7748a18756L5919C516a2963k71153B52480a6211
10714B18244c27778J08386P1217R778m3136d8243o1353G2150i0395K5532C31562
10702b0454A17670h6210j03075B42188d8396k50893Q3093A62639a14401h24B09324
10690a2114o8608r150c490j35630M4723o2502E6276c48548b3157A56124a35524
10678C943R7221b80888J34267A50814b44213B4580b86927J17587k1534q7835E1279
10666A29894a16962B17559j07231c42985C23241b93540H407a01736B48510a50154
10655i451r4530m7258A64651a60682P6641B945a40576B6820e7175b1491m2532
10644f4023A28733k6054a84710Q8404j85801f8043j48633i3910L7207A81960e4219
$$ y = [-104226, -177034, -185314, 262831, 47748, -118756, -82837, 3516, -12963, -284116, 252480, -16211, 218244, -327778, -219392, -148175, -138397, -181533, -48243, -109596, 72150, -90395, -64863, 331562, -20454, 117670, -86210, -189285, 242188, -48396, -299289, -216196, 162639, -114401, -824, 209324, -12114, -80722, -89872, -3490, -139120, -94397, -156899, 56276, -348548, -23157, 156124, -135524, 3943, 101164, -280888, -146621, 150814, -244213, 24580, -286927, -169340, -190874, -278709, 51279, 129894, -116962, 217559, 110328, -342985, 323241, -293540, 8407, -101736, 248510, -150154, -9451, -103981, -151239, 164651, -160682, -84041, 2945, -140576, 26820, -57175, -21491, -64023, 128733, 102679, -184710, -96306, -282107, -68043, -216676, -93910, -56703, 181960, -54219]
10632c32435I5183a20173d5848G7227c5556r1034K8604B16160d35023b07451i4389
10620b32834C8794O2760b5281j26134j1987e7603N398m1122c7407l153j32069
10609a72629d6636A23364A0450b64611A73629e3049K517j67559j56563M3795C07877
10597A00780a33747j67179H3823J01808c31923f3405k5275H0769g5801A35486
10586g1315B97209a11498A93829b8262B2411h37j86298B02796a08891D2399a32282
10574H5729l5764e1646b4848r7242o4918j0785K1591e3196r1600D9928a03794
10562a12962A66094m1746a35372B62785a26168M2698B3113a18904C0507o995N7111
10551H0623a48915B91817b55205A39536C8874a23889A50408A451h9042a4813A02343
$$ y = [-332435, 95183, -120173, -45848, 77227, -35556, -126590, -97986, 216160, -435023, -207451, -94389, -232834, 38794, 101554, -25281, -151415, -163402, -57603, -52205, -93327, -37407, -40560, -172629, -46636, 123364, 10450, -264611, 173629, -53049, -50532, -218091, -374654, -330859, 307877, 100780, -133747, -300926, 83823, 185631, -331923, -63405, -88680, 80769, -75801, 135486, -71315, 297209, -111498, 193829, -28262, 22411, -837, -187135, 202796, -108891, 42399, -132282, 85729, 49965, -51646, -24848, -122090, -187008, -197793, -176202, -53196, -144796, 49928, -103794, -112962, 166094, 124348, -135372, 262785, -126168, -83470, 23113, -118904, 30507, 23512, 80623, -148915, 291817, -255205, 139536, 38874, -123889, 150408, 1451, -89042, -14813, 102343]
10539a2584A42928b5157A77506a71460g0736n463B36363B6961c4888l12338e4701
10527A995a40764O0699b1051l1546K913l4108A56040d91637i7783Q975B6627e7541
10514h2124j24847H6926b05554d4596j46335A50188d0621A8106b30760B26215
10503A76967J01172d30762a33218L1091B90418a36838l798k2459B1306a47465
10492F8646i8304k3821J0047K5962A17934Q3203C9742e4106B38960J71556A85780
10480C96968M2828E2028J84194K870L3729j01892h1894A42890a73511A00400M42626
10469E43026A21868D3618g7127k54192b5923E5825e9298m0229p8988E9880K26726
10458B86606a55178O9804K9482A37979m186b17123A25572B2017a09972A38495
$$ y = [-12584, 142928, -25157, 177506, -171460, -70736, -76199, 236363, 26961, -34888, -347226, -54701, 1995, -140764, -80065, -21051, -52597, -49684, -83792, 156040, -491637, -97783, -88808, 26627, -57541, -82124, -206971, 86926, -205554, -44596, -190931, 150188, -40621, 18106, -230760, 226215, 176967, 278139, -430762, -133218, -102127, 290418, -136838, -140636, -163095, 21306, -147465, 68646, -98304, -122125, -112078, -86116, 117934, 201137, 39742, -54106, 238960, 410516, 185780, 396968, 439796, 52028, 236222, 239092, 272821, 170929, -81894, 142890, -173511, 100400, 543026, 121868, 43618, -77127, -331319, -25923, 55825, -59298, -99527, -178515, 59880, 286606, -155178, -85374, -55892, 137979, 133793, -217123, 125572, 22017, -109972, 138495]
10447C24263O0732a73025b5582q0045E6214a38223D4396M1528A8472J4449j2663
10436B0258b27105P4940A40147a24320a9349j29329e0721E6882a10322K6726B00695
10424C9394J797a43038B19197O845E3349K75884F6701h9655H2124K52858a96082
10412g6574K7143j25807k01146c1233A3956b77309B29162A2507a89299Q0814q1939
10401a90424B11797a881A01396a33823B79002d4417B31793G1693J95604I5293
10390D06463i4030j48380a17503I8677g3074E7171K8862b5511A41503D5746L2613
10379G8359J59411P8977A35481g1299B51302a85844B28812K25054B01170L79284
10369E80454B58731J50837e5832D45694j21072J38880A13951L5077J96518O4545
$$ y = [324263, 384995, -173025, -25582, -105627, 56214, -138223, 44396, 85924, 18472, 32921, 20258, -227105, -152165, 140147, -124320, -19349, -148678, -50721, 56882, -110322, -83596, 200695, 39394, 41191, -143038, 219197, 226042, 53349, 329233, 66701, -89655, 82124, 334982, -196082, -76574, -49431, -175238, -376384, -31233, 13956, -277309, 229162, 12507, -189299, -108485, -190424, 211797, -1881, 101396, -133823, 279002, -44417, 231793, 71693, 267297, 95293, 406463, -94030, -242410, -117503, 98677, -73074, 57171, 86033, -25511, 141503, 45746, 78359, 237770, 316747, 135481, -71299, 251302, -185844, 228812, 453866, 201170, 580454, 258731, 409568, -55832, 445694, 324622, 463502, 113951, 149028, 345546, 410091]
10359D10091j47626j21692J94941j06048L09201B55123j05631M71103k69108J79967
10349E31454K18517k57891J05861B06360K80729j47040J5299N3741A54785J33787
10339B88572j3686e7621A16377J74206J90419A47881C9576O5983a34420B83124
10328b64111a9502D1551F352d025n3126H6918J73050J50916j47074a32412A0194
10316A03484M06735A13488O8436E6834N6636I392a22453G5160e8532H748L63225
10305C71973j03326A01655e5288b4526G3809q67J04050J0766b61342H4720b07542
10293a03228d8995m9279a0865H5519Q1929H806M1535b01683E6547K48554d4713
10281G5933e5971k02704i1716k55877F8959a38374j3094m8984m4521a3691D5851
$$ y = [410091, 262465, 140773, 335714, 229666, 538867, 255123, 149492, 620595, 351487, 531454, 749971, 492080, 597941, 206360, 487089, 340049, 355348, 409089, 154785, 288572, 274886, -57621, 116377, 290583, 481002, 147881, 39576, 105559, -134420, 283124, -264111, -19502, 41551, 6352, -4025, -57151, 86918, 259968, 410884, 263810, -132412, 10194, 103484, 510219, 113488, 181924, 56834, 113470, 9392, -122453, 75160, -58532, 8748, 371973, 268647, 101655, -55288, -24526, 73809, 72942, 176992, 187758, -261342, 84720, -207542, -103228, -48995, -98274, -10865, 85519, 167448, 8806, 50341, -201683, 56547, 305101, -44713, 75933, -55971, -258675, -91716, -347593, 68959, -138374, -151468, -200452, -244973, -13691, 45851]
10269g9908A61344a44709B944J83948K49424A18202L23511c4591B30686K55943
10259D86629j55723K46284k22109A29520J41904J15370b17969F1754a40838C8740
10248a18997m7131d3983j6001A18632b91677D6042b03311j4401b4466H5235f0636
10236A62269b19516A04098D0705g1497F3618f0836m2053G0686N3160E6330K18962
10225B75292h4650K6514I7693c31782B46894a59836j81498a22593o0667N3907
10215a29353A24712A1010c23577D1389h7258l12586F8282P301K63388H9450O6088
10204A55538F9675c73995B58382a82392d8177k79250k8714A74064a80720c26A89868
10192b94382h5271q3162A78857e6277j09147j8067A57132i1084k180A8266c59557
$$ y = [-79908, 161344, -144709, 2944, 186892, 436316, 118202, 441713, -34591, 230686, 486629, 330906, 577190, 355081, 129520, 271424, 386794, -217969, 61754, -140838, 38740, -118997, -166128, -43983, -59984, 118632, -291677, 46042, -203311, -217712, -24466, 85235, -60636, 162269, -219516, 104098, 40705, -71497, 63618, -60836, -102889, 70686, 123846, 56330, 275292, -84650, -58136, 97693, -331782, 246894, -159836, -341334, -122593, -183260, -129353, 124712, 11010, -323577, 41389, -87258, -399844, 68282, 75583, 338971, 89450, 155538, 69675, -373995, 258382, -182392, -48177, -327427, -356141, 174064, -180720, -326, 189868, -294382, -85271, -168433, 178857, -56277, -165424, -183491, 157132, -91084, -93264, 18266, -359557]
10180a46147b9743A723a11344k11365d7735J5624A89h9446o6114g5385m5922N2990
10168f8317j45954o8884E2067a47813j86436I6480a62872P9393k5392L4667p7553
10157a51757r478M3420j12440A3262b49673j11922A8304O8141J57659D5118a68738
10145c4013A67899e2258E9795Q2689c9397k76731i8794A96616A6052J78287B0892
10133A24295j191L7131N0628O350C0974n609a40151K6042G5945l4549a04681m7217
10121a51898c1439n8397A88664a54507b165j78082g98n2842A40851m4486J48647
10110B45012L9471b17778P4090e0704A42406d4448k42141D11975g0956K751q2938
10099a51143M090L2206G1661b13164j29119J36675B18622e832B01490B0352b74235
$$ y = [-146147, -29743, 1723, -111344, -322709, -47735, -32111, 189, -89446, -155560, -75385, -121307, -68317, -214271, -283155, 52067, -147813, -334249, 96480, -162872, -83479, -108871, -74204, -151757, -161235, -117815, -230255, 13262, -249673, -361595, 18304, 86445, 244104, 45118, -168738, -34013, 167899, -52258, 59795, 142484, -39397, -316128, -98794, 196616, 16052, 194339, 20892, 124295, 123104, 160235, 210863, 217213, 30974, 25365, -140151, -114109, 75945, 41396, -104681, -151898, -31439, -89836, 188664, -154507, -2165, -180247, -798, -53640, 140851, 96365, 245012, 284483, -217778, -143688, -50704, 142406, -44448, -286589, 411975, -70956, -68205, -151143, -147053, -114847, 71661, -213164, -342283, -205608, 218622, -5832, 201490, 20352, -274235]
10087g7712A58740M1364f6662j34762d8629l1632b9490k1055j12488j24012J2009
10076b75036J01856j44985J46653P9377j80752P3328P5563l53028P8098A96074
10065b07860d0180h140F7252d9681B19375b05069B6329e6892I4179a72490j84777
10054c57267g5454C8706i0757j09952B0734b99264J35388A22166J39559J70430
10044D32155E3709L37686D7567L27731h3178p061p3652k79335f4668A49757c07819
10032G6958e05785A25074i4238b7774j07509j3070C75415D9908a12318k72980
10022c85298a65930P1500F152a42804J5146A16634c23843J58319G4629e8616o2622
10011a21238k03867e7201B1573q698a40833B38653H2297a76950j52756A00013
$$ y = [-77712, 158740, 200104, -66662, -201424, -48629, -80261, -29490, -50545, -163033, -287045, -275036, -173180, -318165, -171512, -92135, -272887, -199559, -123996, -477024, -398926, 196074, -207860, -40180, -8140, 67252, -49681, 219375, -205069, 26329, -56892, 94179, -172490, -357267, -75454, 38706, -90757, -200709, 20734, -299264, -163876, 122166, 261725, 432155, 53709, 391395, 47567, 375298, -83178, -90239, -163891, -443226, -64668, 149757, -307819, 76958, -505785, 125074, -94238, -27774, -135283, -148353, 375415, 49908, -112318, -385298, -165930, -94430, 6152, -142804, -127658, 116634, -323843, -165524, 74629, -58616, -121238, -325105, -57201, 21573, 12875, -140833, 238653, 82297, -176950, -329706, 100013]
10000a25291A18060h9925C5389a47815B55111I3454N7570a19126j62032a4249
9989B34833a05945a7213o3271n7040k40946A4960a71821j32267Q1441B91917a1467
9977B52993b7333A42752h9434j20187M7277C33646a57666B56867d5218j093J0240
9966c6071j33997L1379c3887B11651a43144a0834j75897f6489j4963E5708c9728
9954b76998D2391P876M8263J3378c36217A6077a39586j37114h6711A10026j8790
9943I1236a98547A72614b96227A16820c4252F158M5794Q2038b53203o2474J546
9932c14131E6788b97144a40116Q096c2315k365I5504b19847K4499B8640O6589
9921I5229a57605g5767m83993A00344A1282Q4133c4561k22268O922I003b58761
$$ y = [-125291, 118060, -89925, 35389, -147815, 255111, 93454, 151024, -119126, -281158, -14249, 234833, -105945, -17213, -80484, -137524, -378470, 14960, -171821, -304088, -222647, 291917, -11467, 252993, -27333, 142752, -89434, -209621, -162344, 333646, -157666, 256867, -45218, -46311, -36071, -170068, -138689, -33887, 211651, -143144, -10834, -186731, -66489, -81452, 55708, -39728, -276998, 42391, 50267, 98530, 111908, -336217, 16077, -139586, -276700, -86711, 110026, 91236, -198547, 172614, -296227, 116820, -34252, 6158, 51952, 133990, -253203, -315677, -314131, 56788, -297144, -140116, -132020, -32315, -34680, 95504, -219847, -195348, 28640, 95229, -157605, -75767, -559760, 100344, 11282, 95415, -34561, -256829, -249907, 9003, -258761]
9909G0444b63647B36453F6340P0086h8647j31576j4958K3387b5841a2613m8021
9898f0634b6917D3066c8554G3439a79748D185b42144c2658H9878J03115b62476
9886d2064H7373a4819j8741i712j32979j7881M8943d780l01517A49395F1888b54568
9873A73673a30490b7792j52128e9774A34862c84967B86553c06336g3858B49416
9862D02916C6530d76851h7133G4740B1108J44729i4601p5118C03712a17676j34033
9851b51709g3667j45135l7682R1010j09761i4005b9331j35647B39516a932D3938
9839c2941m1212C7359Q7830D5476e6172j3464K074j4717k8732B18383b21449A29505
9826a19467k51547A57364a66668j8735Q2530P509B4806c72337a69248q6520g1603
$$ y = [70444, -263647, 236453, 66340, 136426, -88647, -220223, -235181, -211794, -25841, -12613, -60634, -26917, 43066, -38554, 73439, -179748, 4185, -242144, -32658, 89878, 192993, -262476, -42064, 87373, -14819, -33560, -9712, -142691, -160572, -111629, -4780, -306297, 149395, 61888, -254568, 173673, -130490, -27792, -179920, -59774, 134862, -384967, 286553, -306336, -73858, 249416, 402916, 36530, -476851, -87133, 74740, 21108, 165837, -94601, -169719, 303712, -117676, -251709, -73667, -218802, -256484, -165474, -275235, -94005, -29331, -164978, 239516, -1932, 43938, -32941, -74153, 37359, 125189, 45476, -56172, -69636, -67562, -82279, -111011, 218383, -221449, 129505, -119467, -371014, 157364, -166668, -185403, -102873, -95364, 24806, -372337, -169248, -255768, -71603]
9814b66016e1103A52227a47948k61115a40738E2914Q2921c55174g3074k76636
9804c49710I9870b4615l6310j08795D0315J29431g7170g537H718b96512e800l65356
9792c71156a12636A18215D6717a21442K4963h667F380N1851b98431B11162c16956
9780G1419g843I451a9398F8080f2788a2955H6280g249p8963j07501j48121J25319
9768b16515P7658k50019I2363Q484a77438D6354b23040P0984M7372D2947a904
9756b44530A16064b5607q0476l7588f8653D14549g2845q7059d2921G7435a30403
9744c04805P3435m2392A21546b95475J04785A29969e8279k57813G4562b64450
9733a2300A33179a9805A42993a33775n46O0346E8531i0065A73805K3998a43241
$$ y = [-266016, -51103, 152227, -147948, -409063, -140738, 52914, 135835, -355174, -73074, -349710, 99870, -24615, -60925, -169720, 40315, 169746, -77170, -7537, 8718, -296512, -5800, -371156, -112636, 118215, 46717, -121442, -96479, -8667, 6380, 58231, -298431, 211162, -316956, 71419, -7843, 9451, -19398, 68080, -62788, -12955, 86280, -7249, -86212, -193713, -341834, -216515, -138857, -388876, 92363, 100847, -177438, 46354, -223040, -152056, -104684, 42947, -1904, -244530, 116064, -25607, -106083, -143671, -68653, 414549, -72845, -159904, -42921, 77435, -130403, -304805, -231370, -273762, 121546, -295475, -190690, 129969, -58279, -316092, 74562, -264450, -12300, 133179, -19805, 142993, -133775, -134321, -73975, 58531, -90065, 173805, 197803, -143241]
9721G6268N790a02621l5997D5399b45182B49480a80503j5188I1939b54706r13
9710b55619e3916j19426A195J30532i5943A56534l872k5831J82778a00028A34753
9698c52948P6085G5257a45638A82964I029a27584B301a30344j4351a2429l30290
9687c42719a668l96504a97543B84643i712A71554F132b59467A00170a1667j26570
9676a38237F8009C56N3154a0632r2752G4634a27079C9072r308r281L1641c59776
9663g3936J7341B16926f9721k44801A6581J20405P6935b14654A23808I007a73746
9651c30377J30824Q1863c0854B11663C1535a50174A70251a43774d3645k90835
9641c34480i6304j0844B4312K07334a98580l2745A86420q5945a65781B6913b64884
$$ y = [76268, 82058, -102621, -138618, 45399, -245182, 249480, -180503, -195691, 91939, -254706, -255619, -53916, -173342, 1195, 131727, -95943, 156534, 152662, 126831, 309609, -100028, 134753, -352948, -276863, 75257, -145638, 182964, 9029, -127584, 2301, -130344, -144695, -12429, -342719, -1668, -398172, -197543, 284643, -9712, 171554, 6132, -259467, 100170, -11667, -138237, 68009, 356, 53510, -10632, -103384, 74634, -127079, 39072, 29764, 20483, 52124, -359776, -73936, -56595, 216926, -69721, -314522, 16581, 136986, 213921, -214654, 123808, 9007, -173746, -330377, -199553, -117690, -30854, 211663, 31535, -150174, 170251, -143774, -43645, -334480, -96304, -107148, 24312, 231646, -198580, -231325, 186420, 100475, -165781, 26913, -264884]
9629b9771j03477d362q5823n00690d040l4971q807k76128J51578o7400a01471
9617B45290a74396j2237l7438j46234B43356H1292b14330j2471D6143b8738Q648
9606b0090l48882a3550A10802E795L5065a12152j74703E8085a52180A57035a08532
9594A97220I3357c07673a30233A10497B3941J54172a8246j26561A22357a97518
9583B30098c31611M4385A58342a06851B8227a84076e6357l59500H66K2068g4675
9571A2811N116e1848j1036A17118h0572m7056A52543b5143j21051k7911A29061
9559a66542B3064f9627A19953K66073A33657J59514j12715a60705P8189r639j2036
9548a04191K5474A98668e0398k09684B00689e01001G6195b33298a04434m2113
$$ y = [-29771, -133248, -4362, -90185, -590875, -4040, -39011, -47818, -323946, -172368, -239768, -101471, 245290, -174396, -186633, -224071, -370305, 243356, 81292, -214330, -226801, 46143, -28738, -20090, -368972, -13550, 110802, 5795, 40860, -112152, -286855, 58085, -152180, 157035, -108532, 197220, 93357, -307673, -130233, 110497, 23941, 178113, -18246, -144807, 122357, -197518, 230098, -331611, -287226, 158342, -106851, 28227, -184076, -56357, -415857, 866, 22934, -74675, 12811, 17927, -51848, -62884, 117118, -80572, -127628, 152543, -25143, -146194, -174105, 129061, -166542, 23064, -69627, 119953, 386026, 133657, 293171, 180456, -160705, -82516, -92155, -104191, -78717, 198668, -50398, -260082, 200689, -501001, 76195, -233298, -104434, -146547]
9538a46547f4448c0877A19597f9346B836a66496h1234l03182a73220E9044a73945
9526c18719A27898d12056b6289A13961g4767l2903k58259a56179b882B05700A01779
9514b77156J11827P4348H6459k4355b27897k47246C0735d34285C2205L775b38994
9502B64108F4755K64489b53973h6500A60452b78909G0216a33531C0260J657h3907
9490b95564i5284H9692a44490J1445B23852f8259J4577A25140j1118c0960E6152
9478a56824B950a59116m622J8088f4246j13210j60184C17939d5786E4309b53852
9466H5269J68142j17887c7365i815p6437G2364a15993l35907C0762b89216i1850
9454a92828O5680n4734N5426M4153B4884L6730a36207p4564G7043a24241B48686
$$ y = [-146547, -64448, -30877, 119597, -69346, 2836, -166496, -81234, -384416, -173220, 59044, -173945, -318719, 127898, -412056, -26289, 113961, -74767, -107670, -365929, -156179, -2882, 205700, 101779, -277156, -165329, -90981, 86459, 62104, -227897, -475143, 30735, -434285, 32205, 35980, -238994, 264108, 64755, 329244, -253973, -86500, 160452, -278909, 70216, -133531, 30260, 31917, -83907, -295564, -95284, 89692, -144490, -133045, 223852, -68259, -53682, 125140, 114022, -30960, 56152, -156824, 2950, -159116, -163738, -145650, -64246, -177456, -337640, 317939, -45786, 54309, -253852, 85269, 253411, 135524, -37365, -9815, -86252, 72364, -115993, -451900, 30762, -289216, -91850, -192828, -127148, -181882, -126456, -82303, 24884, 61614, -136207, -210771, 77043, -124241, 248686]
9442a02042L2108k48286M5553M6674J04326B19113p6940c78637I835a07003k81941
9431c88944o9478C16941b6208A36641a8162l2840B58751b67534J29054k37123
9421c75603J76552j87163a9821C8661h7879j42741j34967O8859J16468a7589j24818
9410a42407N6254A23028h6996A54368K01305H3857d8683A57585a47132F403a48025
9398b40606e8035B6195J4299a6869A68644b04702F7296L9670b69464A67857a589
9386b94820A18194L6785k0768g4461B84798g8023A3420J00541b4724n7943B4200
9374a74766M2559o124F2150b29446j6685d0339j79587B91599q9004a84403h669
9362a09417B60492b38694f06o2889G7661B5020c05000A27403K5209l4198b27464
$$ y = [-102042, -69934, -318220, -272667, -225993, -121667, 219113, 142173, -378637, 9835, -107003, -388944, -458422, 316941, -26208, 136641, -18162, -51002, 258751, -267534, -138480, -375603, -199051, -386214, -19821, 38661, -87879, -230620, -365587, -296728, -180260, -17589, -142407, -86153, 123028, -86996, 154368, 355673, 83857, -48683, 157585, -147132, 6403, -148025, -240606, -58035, 26195, 40494, -16869, 168644, -204702, 67296, 106966, -269464, 167857, -1589, -294820, 118194, 154979, 134211, -74461, 284798, -78023, 13420, 113961, -24724, -82667, 24200, -174766, -132207, -138331, 62150, -229446, -246131, -40339, -219926, 291599, 202595, -184403, -8669, -109417, 260492, -238694, -606, -63495, 77661, 25020, -305000, 127403, 152612, 118414, -227464]
9350e5207l216H3363d1886J8657j10762B72052C687b84264m8063B2193h5984I9340
9337i7870A99627E0283b2064l23270F1476H868a58673L0439k20056a06683A3238
9325f18783h2234j17100B07262f2119A00661J12821p1550d43675A80524b0289
9314A5622b29871f4477K1824k9438j47495C797J21528a37069O2936o6457n15l7594
9302a78699j10124N5128B57346j12333a14760C45171c2204H6676J5741m40A7612
9290e25846d0224B43765a29709N252r8586c9643j45022A43067N1806e1777j51882
9279b03659A36285L169c38068e2550k3036j53402i8097j087j76737A77734B454
9267C87360D4609P7044l4855i5007n4429A82044a82466B4376a42214M6803H4779
$$ y = [-55207, -58423, 83363, -41886, -23229, -133991, 272052, 3687, -284264, -332327, 22193, -85984, 99340, -97870, 199627, 50283, -22064, -345334, 61476, 8868, -158673, -128234, -348290, -106683, 13238, -618783, -82234, -199334, 207262, -62119, 100661, 213482, 141932, -443675, 180524, -20289, 15622, -229871, -64477, -42653, -72091, -219586, 3797, 125325, -137069, -74133, -140590, -141105, -178699, -288823, -233695, 257346, 145013, -114760, 345171, -32204, 86676, 102417, 101977, 17612, -525846, -40224, 243765, -129709, -124457, -223043, -39643, -184665, 143067, 194873, -51777, -203659, 136285, 139454, -338068, -52550, -75586, -228988, -98097, -99184, -275921, 177734, 2454, 387360, 44609, 121653, 86798, -95007, -149436, 182044, -182466, 24376, -142214, -95411, 84779]
9255a18007r3868B5896e5269j05923A33422h3439H7462l2707c972B69507j27287
9244A42220h8995o7092B34881E9485a31164p854j63370O7491i5715G5674d00614
9232I9994l9535a2142r5496B1846O6019i9846B10602b89805o3874h6089A33274
9220h4049l02079D8703b5502o9161A59638c26106B99721b10015O9884A42319c0860
9208b43137F6188a88269f624c280l63892A79684o759a26095B30206b21721J05003
9197a16718B39506o9170p9179a62445m8560g3896A76778c32370j44247b0286n43323
9186e63609D2976c6909n2832l5555q361e4191r5944H4844b27058O3871F6669G677
9173a00678G1379e913o0919p2620k258b2062r7214d5069a5632G2897c42272C7500
$$ y = [-118007, -211875, 25896, -55269, -161192, 133422, -83439, 87462, 54755, -3972, 269507, 142220, -88995, -156087, 234881, 59485, -131164, -139018, -302388, -234897, -95715, 75674, -400614, 99994, 60459, -12142, -107638, 21846, 87865, -99846, 210602, -289805, -353679, -86089, 133274, -84049, -386128, 48703, -25502, -94663, 159638, -326106, 299721, -210015, -140131, 142319, -30860, -243137, 66188, -188269, -6624, -3280, -367172, 179684, 172925, -126095, 230206, -221721, -116718, 239506, 170336, 91157, -162445, -211005, -73896, 176778, -332370, -476617, -20286, -563609, 42976, -36909, -89741, -125296, -133657, -54191, -150135, 84844, -227058, -163187, 66669, 7677, -100678, 71379, -5913, -66832, -139452, -141710, -22062, -119276, -45069, -15632, 72897, -342272, 37500]
9160b13908o1593H5540N4912a29435G2969a75186g4159C66726G5166K0757f16626
9148E4744C172b51422A6177g4274j13440m1986O6904o1459A6307i8910j02881
9137b01791f3684l64827B9439K01941a66704A11893a39393k39351j20788A37740
9126E6934a00899A58371A6422f618K15p5190F2542c16036f2556b8060p7388b4439
9113h2199m7316a3110k604j03305j71221J38337B55834a6924C1589b32985b3514
9101b06451j45768B72749e7717D6660J67726J39E4370a18082B41388I5137f4179
9089g3165k09875A54123h0907A89914a37579L9399a2256N481q9148j99253B35481
9077A41657a49100e906C9949h5254k13734M7819C0824a25137A36871R9412a21955
$$ y = [-213908, -275501, 85540, 140452, -129435, 72969, -175186, -74159, 366726, 75166, 95923, -616626, 54744, 3172, -251422, 16177, -74274, -187714, -229700, -162796, -224255, 16307, -98910, -201791, -63684, -428511, 29439, 231380, -166704, 111893, -139393, -378744, -499532, 137740, 56934, -100899, 158371, 16422, -6618, -6403, -81593, 62542, -316036, -62556, -28060, -105448, -24439, -82199, -129515, -13110, -15714, -119019, -290240, -151903, 255834, -16924, 31589, -232985, -23514, -206451, -352219, 272749, -57717, 46660, 214386, 214525, 54370, -118082, 241388, 95137, -64179, -73165, -283040, 154123, -80907, 189914, -137579, -98180, -12256, -6775, -95923, -295176, 235481, 141657, -149100, -5906, 39949, -85254, -298988, -251169, 30824, -125137, 136871, 236283, -121955]
9065E1374a36677e5863B50906b3131A32057b60942A56674P3292b6600A09589c433
9053E3745g754b371l94866e952k10778K2212G4374c59199A92943I2a29870n8112
9041a87982I1631b53652L1711O6683d4188j5589l4017r9564g4063F3028c47129
9029a1980l96608a43249G2918b0066k99744l08679g0581A10883h6319a9262p7564
9018i6826j0212o5573F2249J04423I519b4474A59856M3373j5179d5269l43684
9007c88953J10209H9167a1062k81533A68194D4492n445a14496C4082J79613C166
8995C7816D174b03888A48500G3684K56214e00135A32237b59886A63560h7398R029
8984g8369r740B24389J52758j61490F4027a36026A08649j0694a27612A94295J20549
$$ y = [51374, -136677, -55863, 250906, -23131, 132057, -260942, 156674, 229966, -26600, 109589, -3433, 53745, -7754, -2371, -397237, -5952, -216730, -194518, 74374, -359199, 192943, 92, -129870, -187982, 91631, -253652, -221941, -155258, -44188, -59777, -93794, -193358, -74063, 63028, -347129, -11980, -408588, -143249, 72918, -20066, -319810, -628489, -70581, 110883, -86319, -19262, -96826, -107038, -172611, 62249, 166672, 9519, -24474, 159856, 203229, 188050, -45269, -388953, -278744, 89167, -11062, -292595, 168194, 44492, 39047, -114496, 34082, 213695, 3166, 37816, 4174, -203888, 148500, 73684, 329898, -500135, 132237, -259886, 163560, -87398, -78369, -88109, 224389, 377147, 215657, 64027, -136026, 108649, 97955, -127612, 194295, 314844]
8973C14844b16252E7504b0532j63950A0481P1518c08644b6555r4315j04985A28788
8961b90G0983A0877c23443d6131n3168D8378M4648M3146G807J06763c41600J036
8949c40564a66100e1519l8239n18619b88386b1174l32903J44271A52826c41301
8938A78812C34a70380I0225R2885C7653a63195B14911b21243C980i4575B58794
8926a08899C16998M36293M31717K076690P401149r30118B466058I87252m44603
8917E42649D3234L22546n3926C6856c29811i845I0294O6803a6698B67254a76252
8905b8638A27631a21129K1349b4186k09914o1388R3185L3D9368g5135k47096f4793
8892B04086a69394A83823e8348j98958a23220A62914b00971j67166D3186c5835
$$ y = [314844, -216252, 57504, -20532, -184482, 10481, 81999, -308644, -26555, -120870, -225855, 128788, -290, 70983, 10877, -323443, -46131, -99299, 48378, 93026, 136172, 7807, 114570, -341600, -340564, -166100, -51519, -89758, -608377, -288386, -21174, -354077, -209806, 152826, -341301, 178812, 334, -170380, 90225, 183110, 37653, -163195, 214911, -221243, 3980, -94575, 258794, -108899, 316998, 753291, 1185008, 3261698, 10662847, 9732729, 2466058, 987252, 542649, 43234, 365780, 311854, 36856, -329811, -9845, 90294, 157097, -16698, 267254, -176252, -28638, 127631, -121129, -99780, -24186, -234100, -295488, -202303, -202270, 49368, -75135, -322231, -64793, 204086, -169394, 183823, -58348, -257306, -123220, 162914, -200971, -368137, 43186, -35835]
8881h2921o7897f2879a3361A54081J20679A00885a04421k8063r3144A0774J29140
8870A39914b52801A20260m9845A7961i6579A79216d25984F6696c15458F6103P3317
8859A39420e7335C3060c0313n3130L6766n6479k82105D8792N3532d46637d1598
$$ y = [-82921, -150818, -62879, -13361, 154081, 274760, 100885, -104421, -132484, -225628, 10774, 139914, -252801, 120260, 70415, 17961, -96579, 179216, -425984, 66696, -315458, 66103, 139420, -57335, 33060, -30313, -83443, -46677, -103156, -385261, 48792, 102324, -446637, -41598]
$$ [...]
##END NTUPLES=NMR SPECTRUM
##END=
