##TITLE=AC1589_HPIAH13319_8313978_fjU4cUrUpK
##JCAMPDX= 6.0         $$ Bruker NMR JCAMP-DX V2.0
##DATA TYPE= NMR SPECTRUM
##DATA CLASS= NTUPLES
##ORIGIN= BRUKER
##OWNER= Administrator
$$ 1.72 TOPSPIN		Version 2.1
$$ 2013-11-09 11:59:24.454 -0800  Administrator@X
$$ Compression mode = diff/dup
##.OBSERVE FREQUENCY= 400.02188249412
##.OBSERVE NUCLEUS= ^1H
##.ACQUISITION MODE= SIMULTANEOUS (DQD)
##.ACQUISITION SCHEME= undefined
##.AVERAGES= 64
##.DIGITISER RES= 22
##SPECTROMETER/DATA SYSTEM= spect
##.PULSE SEQUENCE= noesygpps1d.comp
##.SOLVENT NAME= COFFEE_meoh
##.SHIFT REFERENCE= INTERNAL, COFFEE_meoh, 1, 14.96124
##AUDIT TRAIL= $$ (NUMBER, WHEN, WHO, WHERE, PROCESS, VERSION, WHAT)
$$ ##TITLE= Audit trail, TOPSPIN		Version 2.1
$$ ##JCAMPDX= 5.01
$$ ##ORIGIN= Bruker BioSpin GmbH
$$ ##OWNER= Administrator
$$ $$ E:\/data/COFFEE/nmr/AC1589_HPIAH13319_8313978_fjU4cUrUpK/12/pdata/1/auditp.txt
$$ ##AUDIT TRAIL=  $$ (NUMBER, WHEN, WHO, WHERE, PROCESS, VERSION, WHAT)
(   1,<2013-11-09 11:59:18.761 -0800>,<Administrator>,<X>,<go>,<TOPSPIN 2.1>,
      <created by zg
	started at 2013-11-09 11:47:47.781 -0800,
	POWCHK enabled, PULCHK disabled,
       configuration hash MD5:
       C8 4E 4E 5D D3 5C D8 9E 9F 52 82 E0 59 8A DE 15
       data hash MD5: 64K
       A8 01 71 9E D4 7B 5E 8C B5 43 A9 63 87 28 BC AE>)
(   2,<2013-11-09 11:59:22.078 -0800>,<Administrator>,<X>,<proc1d>,<TOPSPIN 2.1>,
      <Start of raw data processing
       efp LB = 0.3 FT_mod = 6 PKNL = 1 PHC0 = 0 PHC1 = 0 SI = 128K 
       data hash MD5: 128K
       8D B9 41 06 6D 94 03 9B B3 B8 35 DA 8D B4 72 92>)
(   3,<2013-11-09 11:59:23.247 -0800>,<Administrator>,<X>,<proc1d>,<TOPSPIN 2.1>,
      <pk PHC0 = -88.58826 PHC1 = 0 
       data hash MD5: 128K
       A7 43 05 44 86 6D 60 FB 1B 15 4C C8 79 B1 DB 85>)
(   4,<2013-11-09 11:59:23.746 -0800>,<Administrator>,<X>,<proc1d>,<TOPSPIN 2.1>,
      <abs ABSG = 1 
       data hash MD5: 128K
       6D 30 CC 47 FA 3E 5F 95 EE A1 D7 C9 B9 CB F0 7B>)
(   5,<2013-11-09 11:59:23.849 -0800>,<Administrator>,<X>,<proc1d>,<TOPSPIN 2.1>,
      <abs ABSG = 2 
       data hash MD5: 128K
       24 A1 7B 73 48 DA 78 8F 1F 67 CC 31 4A C2 80 27>)
(   6,<2013-11-09 11:59:23.943 -0800>,<Administrator>,<X>,<proc1d>,<TOPSPIN 2.1>,
      <abs ABSG = 3 
       data hash MD5: 128K
       AD 6C 9A 4A C1 E6 2B 12 27 CF 13 A4 7F BE 3C B7>)
(   7,<2013-11-09 11:59:24.175 -0800>,<Administrator>,<X>,<proc1d>,<TOPSPIN 2.1>,
      <abs ABSG = 4 
       data hash MD5: 128K
       D0 7A 6C 74 E2 35 60 85 77 CC 93 CC 07 17 72 B9>)
(   8,<2013-11-09 11:59:24.268 -0800>,<Administrator>,<X>,<proc1d>,<TOPSPIN 2.1>,
      <abs ABSG = 5 
       data hash MD5: 128K
       88 B1 79 EA 3F 9F 0D 77 4B 24 82 2F B8 82 F1 24>)
$$ ##END=
$$ 
$$ $$ hash MD5
$$ $$ FD D1 0E 65 EB 90 E0 40 53 EF B7 F6 1E A8 25 51
##$RELAX= 
##$RELAX= 
##$RELAX= 
##$RELAX= 
##$RELAX= 
##$RELAX= 
##$RELAX= 
##$RELAX= 
$$ Bruker specific parameters
$$ --------------------------
##$DU= <E:\>
##$EXPNO= 12
$$ [...]
##$TP07= 0
##$TPNAME0= <>
##$TPNAME1= <>
##$TPNAME2= <>
##$TPNAME3= <>
##$TPNAME4= <>
##$TPNAME5= <>
##$TPNAME6= <>
##$TPNAME7= <>
##$TPOAL= (0..7)
0.5 0.5 0.5 0.5 0.5 0.5 0.5 0.5
##$TPOFFS= (0..7)
0 0 0 0 0 0 0 0
##$TUNHIN= 0
##$TUNHOUT= 0
##$TUNXOUT= 0
##$USERA1= <user>
##$USERA2= <user>
##$USERA3= <user>
##$USERA4= <user>
##$USERA5= <user>
##$V9= 5
##$VALIST= <valist>
##$VCLIST= <CCCCCCCCCCCCCCC>
##$VD= 0
##$VDLIST= <DDDDDDDDDDDDDDD>
##$VPLIST= <PPPPPPPPPPPPPPP>
##$VTLIST= <TTTTTTTTTTTTTTT>
##$WBST= 1024
##$WBSW= 4
##$XGAIN= (0..3)
0 0 0 0
##$XL= 0
##$YL= 0
##$YMAX_a= 6315961
##$YMIN_a= -12317621
##$ZGOPTNS= <>
##$ZL1= 120
##$ZL2= 120
##$ZL3= 120
##$ZL4= 120
##$ABSF1= 14.96124
##$ABSF2= -5.596942
##$ABSG= 5
##$ABSL= 3
##$ALPHA= 0
##$AQORDER= 0
##$ASSFAC= 0
##$ASSFACI= 0
##$ASSFACX= 0
##$ASSWID= 0
##$AUNMP= <proc_prof1d_extract.lims>
##$AXLEFT= 0
##$AXNAME= <>
##$AXNUC= <1H>
##$AXRIGHT= 0
##$AXTYPE= 0
##$AXUNIT= <>
##$AZFE= 0.1
##$AZFW= 0.1
##$BCFW= 0
##$BC_mod= 0
##$BYTORDP= 0
##$COROFFS= 0
##$CY= 15
##$DATMOD= 1
##$DC= 0
##$DFILT= <>
##$DTYPP= 0
##$F1P= 0
##$F2P= 0
##$FCOR= 0.5
##$FTSIZE= 131072
##$FT_mod= 6
##$GAMMA= 0
##$GB= 0
##$INTBC= 1
##$INTSCL= 1
##$ISEN= 128
##$LB= 0.3
##$LEV0= 0
##$LPBIN= 0
##$MAXI= 10000
##$MC2= 0
##$MEAN= 0
##$ME_mod= 0
##$MI= 0
##$NCOEF= 0
##$NC_proc= -2
##$NLEV= 6
##$NOISF1= 0
##$NOISF2= 0
##$NSP= 0
##$NTH_PI= 0
##$NZP= 0
##$OFFSET= 14.96124
##$PC= 1
##$PHC0= -88.58826
##$PHC1= 0
##$PH_mod= 1
##$PKNL= yes
##$PPARMOD= 0
##$PPDIAG= 0
##$PPIPTYP= 0
##$PPMPNUM= 2147483647
##$PPRESOL= 1
##$PSCAL= 4
##$PSIGN= 0
##$PYNMP= <proc.py>
##$REVERSE= no
##$SF= 400.020009541151
##$SI= 131072
##$SIGF1= 0
##$SIGF2= 0
##$SINO= 400
##$SIOLD= 131072
##$SPECTYP= <>
##$SREGLST= <1H.CDCl3>
##$SSB= 0
##$STSI= 131072
##$STSR= 0
##$SW_p= 8223.68421052631
##$SYMM= 0
##$S_DEV= 0
##$TDeff= 65536
##$TDoff= 0
##$TI= <>
##$TILT= no
##$TM1= 0
##$TM2= 0
##$TOPLEV= 0
##$USERP1= <user>
##$USERP2= <user>
##$USERP3= <user>
##$USERP4= <user>
##$USERP5= <user>
##$WDW= 1
##$XDIM= 131072
##$YMAX_p= 439192606
##$YMIN_p= -12581
##$CURPLOT= <Network HP LaserJet P1505>
##$CURPRIN= <$Network HP LaserJet P1505>
##$DFORMAT= <normdp>
##$LAYOUT= <+/1D_H.xwp>
##$LFORMAT= <normlp>
##$PFORMAT= <normpl>
##$SURQMSG= 1
$$ End of Bruker specific parameters
$$ ---------------------------------
##NTUPLES= NMR SPECTRUM
##VAR_NAME=  FREQUENCY,     SPECTRUM/REAL,   SPECTRUM/IMAG
##SYMBOL=    X,             R,               I
##VAR_TYPE=  INDEPENDENT,   DEPENDENT,       DEPENDENT
##VAR_FORM=  AFFN,          ASDF,            ASDF
##VAR_DIM=   131072,        131072,          131072
##UNITS=     HZ,            ARBITRARY UNITS, ARBITRARY UNITS
##FACTOR=    0.0627417313425164, 1,          1
##FIRST=     8223.62146879497, -1838,        -64423
##LAST=      0,             -151,            -65462
##MIN=       0,             -12581,          0
##MAX=       8223.62146879497, 439192606,    0
$$ Real data points
##PAGE= N=1
##DATA TABLE= (X++(R..R)), XYDATA
$$ [...]
67862 83862 83985 84408 85048 85547 85632 85401 85154 84888 84219 82920 81282 79739 78368 76985 75561 74278 73301
67845 73301 72701 72452 72329 72025 71600 71566 72199 72967 73064 72442 71861 71988 72800 73924 75083 76106 76827 77194 77350
67826 77350 77481 77764 78428 79670 81403 83247 84865 86256 87720 89574 91774 93750 94840 95079 95336 96310
67810 96310 97582 98028 97108 95305 93339 91406 89319 86930 84209 81176 77959 74792 71934 69710 68561
67795 68561 68649 69390 69807 69556 69260 69587 70268 70366 69349 67640 66141 65457 65637 66404 67435 68391 68895 68763
67777 68763 68261 67868 67714 67574 67510 68063 69440 70963 71825 72092 72319 72448 71946 71006 70695 71649 73344 75045
67759 75045 76764 78830 81080 83072 84716 86104 87024 87199 86878 86647 86725 86880 86986 87214 87594 87791 87497
67742 87497 86869 86440 86601 87204 87660 87468 86564 85052 82785 79639 76197 73621 72563 72540 72625 72346 71619 70281
67724 70281 68309 66238 64701 63638 62515 61340 60804 61228 61991 62410 62794 63987 66008 67743 68190 67572
67708 67572 66826 66313 65624 64676 64277 65110 66603 67458 67225 66688 66581 66564 65822 64262 62693 61961 62228 63015
67690 63015 63732 64200 64675 65325 65825 65736 65205 64825 64751 64480 63697 62832 62437 62424 62340 62081 61940 62187 62979 64418
67670 64418 66319 68069 69074 69247 68873 68289 68000 68664 70416 72410 73579 73787 73806 74300 75294 76529 77810
67653 77810 78917 79576 79644 79121 78039 76559 75061 73813 72675 71465 70425 69917 69753 69275 68100 66445
67637 66445 64814 63697 63450 64030 64903 65611 66308 67336 68472 69208 69665 70515 71965 73498 74792 76226
67621 76226 78190 80389 82115 82790 82062 79915 77020 74523 73151 72812 73169 74111 75413 76556 77365 78330
67605 78330 79757 81032 81265 80429 79329 78628 78440 78660 79134 79476 79280 78563 77639 76586 75237 73714 72527
67588 72527 71995 71892 71807 71580 71244 70845 70491 70397 70666 71144 71571 71788 71683 71120 70092 68872 67809 66958 66069
67569 66069 65004 63989 63340 62999 62622 62137 61958 62427 63174 63394 62741 61696 60996 60924 61279 61745 62125 62326
67551 62326 62365 62398 62669 63400 64607 65881 66461 65918 64795 64155 64339 64541 63913 62698 61828 61706 61890 61873 61604
67532 61604 61233 60857 60700 61125 62199 63524 64667 65503 65947 65710 64663 63265 62241 61833 61639 61223 60650
67515 60650 60344 60529 60931 60961 60207 58796 57281 56168 55556 55285 55234 55382 55690 56164 56939 58008 58843 58694
67497 58694 57446 55941 55147 55230 55697 56227 56875 57566 57996 58217 58809 60094 61549 62388 62484 62244 61830 61050
67479 61050 60012 59292 59233 59535 59773 59948 60206 60327 59898 58865 57539 56133 54652 53268 52435 52487 53291 54498
67461 54498 56021 58050 60563 62966 64390 64458 63716 63136 63215 63738 64367 65083 65806 66049 65520 64926 65413 67021
67443 67021 68369 68278 67201 66432 66287 65869 64566 62915 61740 61183 61046 61529 62913 64769 66163 66716 66922
67426 66922 67324 67758 67599 66511 64797 63162 62187 61894 61808 61502 60924 60109 58948 57662 57163 58193 60123
67409 60123 61363 61187 60451 60204 60298 59923 58954 58043 57646 57650 57811 58014 58114 58017 57899 57959 58028 57833 57536 57566 57944
67388 57944 58226 58121 57765 57356 56943 56680 56878 57630 58570 59100 58851 58070 57640 58342 59791 60522 59641 57995
67370 57995 57051 56992 56864 56359 56237 56821 57237 56720 55762 55373 55880 57044 58640 60219 60959 60576 60006 60367
67352 60367 61556 62565 62916 62972 63057 63103 63186 63607 64283 64686 64518 63957 63144 61967 60493 59196 58548 58627 59183
67333 59183 59779 59948 59589 59184 59235 59528 59475 59117 59187 60115 61594 63319 65443 67931 70036 70937 70572 69461
67315 69461 68041 66644 65778 65816 66518 67348 68214 69429 70981 72278 72815 72761 72662 72738 72680 72174 71480 71355 72253
67296 72253 73678 74550 74344 73591 73155 73296 73658 73889 73808 73197 72023 70873 70587 71215 71813 71619 71055 71104 71932
67277 71932 72681 72591 71814 70919 70094 69149 68076 67186 66688 66383 65854 64899 63828 63396 64288 66416 68822 70471
67259 70471 71115 71175 70950 70364 69485 68766 68469 68290 67883 67428 67253 67167 66743 66119 65914 66264 66568 66412 66217 66576
67239 66576 67374 68044 68433 68906 69680 70535 71154 71302 70642 68888 66409 64264 63319 63539 64429 65801 67638
67222 67638 69410 70234 69917 69350 69502 70384 71358 72212 73386 75167 77141 78585 79079 78600 77382 75946 74973
67205 74973 74752 74818 74422 73365 72183 71568 71783 72634 73743 74814 75780 76752 77706 78275 78013 76924 75587
67188 75587 74673 74419 74558 74662 74542 74418 74649 75237 75737 75903 76233 77453 79458 81243 82066 82215 82295 82198 81377
67169 81377 79964 78972 79237 80582 82181 83384 83935 83745 82819 81354 79639 77877 76277 75209 75020 75649
67153 75649 76660 77766 79199 81395 84294 87073 88662 88569 87181 85332 83659 82449 81894 82199 83318
67138 83318 84837 86315 87644 88912 89995 90598 90731 90850 91301 91790 91708 90998 90458 90995 92669 94680 96230
67121 96230 97187 97866 98431 98791 98994 99363 100168 101390 102949 104879 107062 108956 109949 110020 109805 109937 110500 111154
67103 111154 111611 111811 111808 111637 111314 110859 110342 109909 109755 109999 110609 111442 112315 113055 113507 113557 113188 112664 112603 113602
67083 113602 115560 117569 118783 119330 120077 121530 123347 124955 126242 127449 128704 129926 130988 131789 132369
67068 132369 133056 134301 136189 138322 140292 142000 143362 144091 144111 143836 143764 144050 144798 146327 148602 150742
67052 150742 151784 151842 151867 152358 152998 153595 154569 156235 158253 160181 162050 163988 165735 167056 168344 170307
67036 170307 173128 176316 179324 181986 184395 186637 188633 190136 190960 191366 192070 193682 196152 198813 200921
67021 200921 202171 202986 204382 207203 211222 215259 218422 221007 223886 227283 230534 232970 234667 236315
67007 236315 238650 242026 246191 250397 253930 256669 259084 261679 264524 267302 269667 271589 273428 275665
66993 275665 278445 281440 284227 286745 289302 292234 295707 299735 304137 308449 312106 314931 317449 320600
66979 320600 324988 330402 336103 341596 346919 352152 356979 361105 364830 368779 373128 377647 382479 388218
66965 388218 394985 402060 408825 415517 422537 429482 435561 440718 445690 451109 457176 464142 472301 481322
66951 481322 490228 498443 506420 514891 523830 532569 540781 548891 557475 566567 575762 584926 594586 605439
66937 605439 617461 629704 641156 651698 662085 673111 685028 697672 710802 724204 737697
66926 737697 751222 764857 778710 792924 807824 823896 841430 860184 879447 898512 917127
66915 917127 935569 954278 973461 993060 1013026 1033463 1054486 1076085 1098124 1120331 1142366
66904 1142366 1164235 1186709 1210993 1237710 1266395 1296064 1325996 1355814 1385375 1415072 1445918
66893 1445918 1478698 1513017 1547618 1581686 1615448 1649591 1684545 1720402 1757073 1794256 1831561
66882 1831561 1868920 1906799 1945802 1986030 2026793 2066916 2105529 2142725 2179362 2216005 2252241
66871 2252241 2287236 2320810 2353563 2386039 2418151 2449445 2479543 2508165 2534989 2559610 2581610
66860 2581610 2600752 2617294 2631931 2645036 2656116 2664391 2669896 2673513 2675855 2676602 2675035 2670752 2663602
66847 2663602 2653407 2640124 2624045 2605433 2584124 2559908 2533206 2505013 2475995 2445925 2414192
66836 2414192 2380765 2346379 2311717 2276697 2240805 2203915 2166289 2127841 2088082 2047129 2006153
66825 2006153 1966246 1927237 1888256 1849147 1810517 1772484 1734315 1695549 1656782 1618974 1582447
66814 1582447 1546906 1512036 1477702 1443851 1410607 1378263 1347005 1316694 1286999 1257551 1227995
66803 1227995 1198258 1168909 1140893 1114726 1090149 1066581 1043561 1020665 997427 973683 949837
66792 949837 926713 905191 885754 867906 850161 831270 811626 792852 775870 760007 744245
66781 744245 728538 713388 698814 684568 670979 658664 647446 636199 623971 610868 597773
66770 597773 585482 574150 563342 552559 541827 531704 522644 514504 506763 499016 491106 483063 475117
66757 475117 467551 460329 453017 445296 437368 429694 422547 415905 409547 403115 396404 389768 383889 378994
66743 378994 374632 370358 366151 361875 356931 350985 344658 338956 334216 330041 325991 321924 317860 313951
66729 313951 310390 307002 303188 298660 293956 289799 286264 282979 279866 277133 274800 272742 270935 269117
66715 269117 266537 262724 258289 254271 250855 247468 243979 240933 238548 236302 233704 230776 227622 224224
66701 224224 220917 218335 216602 215147 213637 212436 211749 210907 209122 206526 203915 201690 199591 197384 195294
66686 195294 193661 192441 191155 189336 187085 185157 184262 184216 183988 182711 180458 177931 175676 173776 172097
66671 172097 170555 169195 168136 167435 166918 166194 164831 162586 159615 156589 154408 153478 153298 152940 151833 149956
66655 149956 147562 145098 143167 142039 141277 140265 139021 138040 137489 137172 137217 138016 139345 140219 139936 138722
66639 138722 137174 135683 134652 134529 135115 135382 134504 132672 130496 128176 125813 123998 123268 123263 123165 122783 122493
66622 122493 122278 121634 120483 119393 118650 117767 116287 114601 113526 113302 113411 113246 112712 112157 111902 111872 111626
66605 111626 110792 109470 108189 107464 107412 107708 107831 107460 106761 106186 105894 105486 104475 102897 101266 99999 99132
66588 99132 98515 98044 97682 97467 97501 97775 98004 97867 97455 97300 97857 99050 100353 101247 101592 101646 101669 101498 100633
66569 100633 98878 96705 94751 93133 91584 90142 89195 88802 88465 87821 87160 86911 86921 86661 85982 85191 84443
66552 84443 83510 82249 80949 80055 79817 80270 81220 82096 82200 81465 80675 80561 80895 80959 80735 80978 82012 83126
66534 83126 83454 82966 82173 81285 80202 79130 78579 78747 79284 79673 79551 78787 77699 77109 77646 78903 79748 79601
66516 79601 78985 78645 78622 78485 78050 77468 76862 76297 75992 76154 76630 76973 76849 76268 75472 74731 74133 73481 72578
66497 72578 71717 71565 72316 73253 73514 73137 72922 73354 74101 74615 74810 74949 75149 75249 75112 74840 74656 74528 74027
66478 74027 72749 70952 69569 69372 70272 71620 72945 74080 74806 74916 74623 74420 74376 74025 73137 72187 71747
66461 71747 71723 71574 71112 70693 70685 71055 71501 71757 71737 71573 71538 71809 72295 72733 72919 72787 72465 72385 73094 74613 76108
66440 76108 76603 76054 75325 75044 74934 74487 73866 73667 74056 74615 74978 75132 75100 74812 74441 74420 74814 75060 74704 74190
66420 74190 74372 75231 75604 74466 72184 70103 69039 68642 68317 68180 68643 69349 69294 68136 66768 66173 66220 66188
66402 66188 66103 66711 68186 69704 70556 70916 71156 71101 70586 70142 70316 70631 70067 68544 67080 66389 66095 65677
66384 65677 65499 66333 68205 70294 71856 72763 73138 72936 72130 71086 70383 70225 70236 70014 69694 69721 70156 70620
66366 70620 71003 71689 72801 73676 73639 72989 72583 72540 72080 70756 69200 68311 68172 68127 67638 66730 65806 65300 65412
66347 65412 65953 66498 66766 66754 66558 66308 66322 66980 68249 69560 70285 70183 69398 68339 67653 67904 69021 70269
66329 70269 70975 71096 70984 70908 70999 71320 71729 71893 71648 71122 70350 69135 67552 66258 65875 66282 66848 67174 67255
66310 67255 67154 66998 67194 68109 69503 70654 71151 71244 71351 71536 71621 71532 71316 70923 70249 69393 68739 68654 69124 69790
66290 69790 70363 70886 71448 71848 71819 71519 71421 71677 71916 71828 71631 71750 72221 72574 72174 70684 68469 66547 65780
66271 65780 66046 66497 66615 66518 66278 65718 65130 65338 66535 67762 68257 68667 70023 71986 73081 72540 70998
66254 70998 69500 68671 68828 69877 70902 70734 69294 67783 67275 67737 68596 69520 70272 70511 70245 70011 70128
66237 70128 70268 70159 70174 70653 71116 70882 70165 69869 70434 71544 72855 74238 75280 75337 74440 73544 73388 73512
66219 73512 72922 71522 70281 70034 70656 71571 72552 73606 74431 74575 74136 73795 74045 74752 75658 76877 78533
66202 78533 80151 80888 80341 78933 77545 76971 77477 78585 79352 79189 78352 77463 76797 76380 76486 77418 78821
66185 78821 79819 79999 79792 79765 79951 80073 80021 79868 79670 79506 79470 79561 79742 80056 80359 80029 78536 76439 75157
66166 75157 75456 76628 77528 77909 78280 78907 79513 79669 78980 77171 74592 72456 71976 73223 75195 76854 77684
66149 77684 77499 76480 75409 75176 75818 76564 76956 77346 78043 78589 78417 77805 77586 78089 78846 79292 79290 78992 78581
66130 78581 78242 78071 77939 77701 77577 77995 78989 80063 80867 81596 82409 82822 82250 81062 80435 80995 82115 82885
66112 82885 83303 84024 85184 86092 86120 85395 84480 83743 83294 83281 83917 85191 86703 87855 88309 88356 88764 90024
66094 90024 91801 93324 94269 94926 95509 95770 95498 95038 94927 95246 95707 96223 96944 97771 98229 97990 97245 96415
66076 96415 95722 95213 95067 95550 96570 97442 97296 95819 93583 91602 90504 90110 89742 88907 87754 86975 87224
66059 87224 88532 90278 91747 92597 92712 91857 89948 87681 86355 86659 87834 88448 87974 87279 87511 88839
66043 88839 90492 91812 92897 94155 95537 96509 96721 96436 96164 96123 96272 96697 97618 98957 100210 100881 100938
66026 100938 100835 101186 102406 104386 106474 107966 108738 109197 109636 109915 109876 109724 109744 109880 109881 109701 109492 109331 109226
66007 109226 109303 109794 110852 112551 114914 117715 120414 122585 124417 126542 129363 132787 136557 140555 144644
65992 144644 148512 151916 155054 158505 162694 167358 171591 174539 176022 176428 176090 175116 173811 172755 172136
65977 172136 171337 169635 167041 164032 160670 156642 152072 147635 143724 140131 136781 134158 132570 131430
65963 131430 129813 127486 124951 122717 120992 119961 119828 120484 121477 122410 123170 123808 124419 125094 125780 126291 126744
65946 126744 127833 130209 133593 136958 139657 141977 144430 146984 149247 151062 152583 154008 155476 157033
65932 157033 158489 159591 160551 162062 164432 167082 169273 170994 172604 173991 174814 175439 176825 179384 182699
65917 182699 186457 190839 195696 200186 203871 207536 212226 217848 223361 228066 232011 235345 237996 239995
65903 239995 241516 242546 243004 243143 243308 243305 242614 241320 240244 239915 239932 239600 238738 237525 235976 233956 231463
65886 231463 228533 225038 220841 216031 210777 205124 199156 193212 187705 182770 178217 173698 168932 164010
65872 164010 159549 156200 153826 151557 148894 146427 145056 144802 144813 144348 143295 141896 140492 139518 139253 139445
65856 139445 139550 139408 139315 139400 139410 139277 139429 140208 141275 141964 142035 141743 141334 140864 140499 140594 141324 142468 143659
65837 143659 144774 145927 147205 148480 149500 150152 150667 151497 152827 154283 155317 155958 156985 159224 162811
65822 162811 167228 171894 176579 181406 186718 192793 199434 205846 211172 215143 218037 220120 221462 222187
65808 222187 222464 222157 220911 218685 215806 212439 208486 204133 199940 196043 191923 187462 183642 181459 180544
65793 180544 179657 178294 176955 176006 175223 174599 174648 175530 176625 177384 178062 179193 180812 182586 184362 186232
65777 186232 188471 191703 196670 203412 211003 218500 225810 233293 240883 248080 254503 259930 263939 265949
65763 265949 265561 262607 257089 249446 240653 231683 223003 214910 208014 202864 199267 196537 194428 193421
65749 193421 194072 196470 200353 205398 211388 218381 226747 236806 248447 261246 274806 288647 301942
65736 301942 313736 323396 330597 335025 336496 335276 331806 326143 318081 307858 296318 284243 271854
65723 271854 259100 246121 233386 221542 211163 202314 194382 186609 178808 171340 164477 158225 152757
65710 152757 148485 145468 143105 140641 137764 134594 131431 128719 126945 126216 126060 125886 125567 125445 125820 126591
65694 126591 127384 127941 128371 128974 129836 130737 131570 132641 134310 136420 138435 140096 141653 143438 145518 147837
65678 147837 150429 153387 156792 160689 164964 169346 173810 178883 185176 192684 200983 210104 220666 232977
65664 232977 246543 260716 275355 290521 305947 321221 336144 350442 363356 374068 382429 388813
65652 388813 393329 395662 395766 394308 392242 390220 388593 387718 387957 389372 391602 394143 396697 399115 400928
65637 400928 401072 398339 392240 383250 372118 359123 344216 327675 310248 292609 274972 257399
65625 257399 240256 224156 209544 196593 185489 176487 169502 163842 158724 154063 150391 147830 145541
65612 145541 142601 139198 136416 134852 133985 133069 132079 131355 130707 129523 127741 126150 125541 125859 126417 126676
65596 126676 126554 126163 125622 125156 125058 125360 125723 125879 126090 126900 128477 130484 132685 135300 138480 141669 143971
65579 143971 145235 146448 148908 153169 158929 165736 173564 182681 193213 204986 217802 231657 246559
65566 246559 262089 277363 291546 304333 315767 325654 333386 338367 340490 340074 337418 332523 325296
65553 325296 315976 305232 293720 281565 268472 254469 240428 227631 216803 207602 199043 190398
65541 190398 181789 174035 167945 163688 160778 158552 156633 155055 154135 154175 155093 156337 157399 158337 159541
65526 159541 161013 162222 162692 162331 161125 158994 156141 153056 149958 146664 143274 140439 138509 137000 135404
65511 135404 134039 133388 133050 132172 130733 129545 129047 128837 128437 127890 127486 127476 128064 129144 130107 130494 130745 131566
65493 131566 132678 133078 132604 132312 133055 134600 136476 138721 141247 143400 144984 147065 150865 156223 161857
65478 161857 166785 170705 173319 174247 173751 172889 172711 173546 174948 175909 175263 172442 168017 163197 158771 154785
65462 154785 151137 148021 145618 143645 141507 138956 136521 135135 135123 135611 135273 133709 131755 130310 129314
65447 129314 128181 126792 125582 124880 124656 124828 125394 126287 127449 129059 131350 134158 136884 139040 140725
65432 140725 142571 145221 148801 152835 156735 160253 163293 165492 166566 167060 168065 169776 170894 169970 167034
65417 167034 163418 160292 157893 155897 153870 151438 148627 146185 145065 145512 146939 148712 150621 152485
65403 152485 153799 154138 153756 153511 154073 155280 156397 157036 157685 159079 161251 163619 166029 169055 172988 177075
65387 177075 180240 182102 182801 182221 180157 177099 174150 172052 170788 170088 169845 169854 169615 168615 166702 164231
65371 164231 162042 161108 161791 163491 165325 167053 168971 171112 173118 174909 176946 179716 183425 188273 194521
65356 194521 202036 210121 218072 225742 233431 241490 250148 259389 268738 277245 283834 287736 288784 287556
65342 287556 285135 282395 279468 276047 272159 268246 264521 260558 255698 249716 243051 236486 230505 224779
65328 224779 218418 210978 203133 196045 190286 185695 182036 179220 176898 174507 171907 169510 167627 166070
65314 166070 164578 163167 161864 160464 158892 157455 156421 155580 154518 153161 151746 150421 149143 147919
65300 147919 146882 146116 145588 145339 145638 146837 148956 151455 153615 155292 157110 159711 162954 166008 168077
65285 168077 168790 168173 166688 165189 164297 163768 162840 161247 159504 158160 157241 156518 155828 154989 153841 152658
65269 152658 152135 152678 153927 155157 155898 156013 155567 154916 154615 154863 155154 154783 153577 151923 150282 148985 148373
65252 148373 148768 150131 151891 153211 153527 152903 151936 151191 150720 150148 149153 147690 145864 143886 142193 141297
65236 141297 141315 141795 142134 142054 141666 141236 141022 141184 141755 142694 143930 145233 146152 146337 145938 145495 145387 145527 145612
65217 145612 145506 145319 145221 145127 144616 143366 141786 140891 141251 142321 143164 143531 143807 144181 144556 145130 146319 147990
65199 147990 149397 150009 149910 149287 148114 146509 144920 143752 143225 143601 144940 146503 147134 146533 145643 145427 145874
65182 145874 146541 147448 148923 150937 153115 155103 156614 157526 158204 159264 160645 161433 161059 160172 159807 160132
65166 160132 160602 160949 161344 161869 162476 163305 164457 165679 166847 168571 171631 175827 179972 183114 185398 187740
65150 187740 191015 195506 200782 206180 211665 218052 226150 236007 247358 260319 275038 291120 308180
65137 308180 326654 347054 368428 388514 405695 420144 432934 444845 456315 467633 478448
65126 478448 487535 493661 496468 496174 492839 486533 478024 468683 459544 450660 441348 430791 418454 404215
65112 404215 388350 371460 354332 337702 321950 307016 292756 279341 267140 256203 246072
65101 246072 236176 226316 216837 208438 201711 196639 192591 188973 185740 183003 180353 177137 173408 170080
65087 170080 167930 166816 166100 165467 165089 165242 166056 167413 168841 169707 169829 169740 170106 170960 171803 172353 172860 173643
65069 173643 174658 175625 176389 176933 177182 177058 176739 176567 176545 176132 174864 173081 171704 171192 171098 170816 170394 170248
65051 170248 170418 170580 170714 171236 172360 173724 174763 175124 174632 173248 171307 169504 168372 167879 167676 167519
65035 167519 167208 166350 164621 162287 160174 158908 158332 157790 156920 155962 155252 154610 153482 151666 149622 147936
65019 147936 146739 145876 145483 146031 147734 150160 152526 154250 155185 155500 155511 155637 156376 158108 160750 163622
65003 163622 165951 167624 169253 171367 173782 175967 177730 179164 180211 180802 181377 182677 184818 186957 188140
64988 188140 188227 187843 187662 187942 188572 189357 190328 191770 193821 196096 198034 199672 201717 204617 207873 210462
64972 210462 211751 211730 210592 208456 205418 201589 197061 192068 187132 182847 179440 176739 174507 172628 170927
64957 170927 169107 167099 165338 164391 164292 164412 164108 163306 162292 161136 159661 157927 156357 155209 154253 153213
64941 153213 152246 151698 151592 151748 152180 152954 153753 154095 154069 154331 155203 156196 156689 156725 156844 157362 158126 158812 159160
64922 159160 159030 158500 157883 157471 157299 157220 157105 156841 156333 155742 155587 156346 157927 159714 161103 161885 162228 162514
64904 162514 163137 164304 165992 168224 171249 175282 180100 185163 190153 195218 200683 206778 213635 221213
64890 221213 228991 235982 241408 245394 248822 252425 256185 259560 262175 264170 266004 268050 270301 272334
64876 272334 273502 273296 271665 269011 265741 261802 256702 250180 242938 236522 232216 229978 228583 226896
64862 226896 224864 223180 222235 221727 221165 220329 219087 217161 214375 210965 207294 203307 198582 193033 187317
64847 187317 182388 178730 176185 174429 173369 172939 172754 172325 171679 171411 171874 172539 172592 171990 171447 171332 171223
64830 171223 170816 170702 171570 172978 173641 173031 172070 171991 172976 174275 175370 176505 178084 180044 182045 184059
64814 184059 186435 189374 192673 196139 200034 204840 210629 216977 223503 230289 237684 245926 254997 264555
64800 264555 273902 282217 288934 293682 295857 294718 290219 283427 275742 267854 259757 251513 243537 236195
64786 236195 229518 223380 217759 212825 208939 206481 205485 205491 205916 206471 207147 208052 209448 211605 214345 217020
64770 217020 219274 221524 224367 227939 232343 238214 246008 254953 263552 271163 278351 285615 292602 298836
64756 298836 304434 309666 314375 318305 321628 324727 327687 330246 332026 332696 332318 331669 331768 332780 333737 333460
64740 333460 331381 327376 321425 313871 305491 296869 287998 278847 269944 262000 255274 249685 245253 242031
64726 242031 239900 238705 238237 237860 236735 234888 233459 233237 233553 233432 233322 234535 237223 240179 242748 245677
64710 245677 249596 253795 257330 260538 264377 268648 271898 273108 272670 271434 269451 266085 261098 255203
64696 255203 249524 244720 240633 236667 232405 227879 223372 219113 215229 211824 208920 206357 203950 201790
64682 201790 200256 199614 199720 200328 201563 203911 207639 212452 217798 223317 228864 234300 239610 245182 251668
64667 251668 259447 268346 277867 287424 296306 303708 309082 312350 313584 312562 308821 302273 293701 284508
64653 284508 275891 268193 261111 254495 248726 244234 240912 238308 236258 234986 234665 235244 236808 239657 243848
64638 243848 248905 254255 259864 266350 274461 284407 295543 306765 317470 328085 339446 351676 363971
64625 363971 375345 385126 392731 397512 399086 397472 392854 385589 376497 366540 356007 344574 332437
64612 332437 320779 310705 302292 295219 289723 286169 284062 282359 280634 279268 278594 278541 279040 279904 280236
64597 280236 278817 275559 271956 269584 268501 267558 265997 264141 262536 260945 258577 255153 251353 248032
64583 248032 245244 242511 240032 239008 240367 243527 247051 250406 254457 260071 266728 272882 277452 280647
64569 280647 283380 286144 288597 290155 290733 290685 290112 288577 285575 280941 274719 267082 258713 250787 244066
64554 244066 238231 232618 227382 223340 220715 218697 216379 213684 211210 209565 208998 209358 210212 211173 212174
64539 212174 213273 214333 215205 216101 217352 218821 219964 220501 220569 220218 219226 217529 215349 212781 209739 206509
64523 206509 203876 202380 201786 201504 201220 200907 200619 200532 200821 201273 201390 201201 201582 203322 206141 209047 211456
64506 211456 213617 216096 219225 222940 226849 230577 234294 238753 244539 251460 258945 266728 274840 283188
64492 283188 291604 300029 308129 314932 319485 321799 322484 321504 318128 312415 305915 300287 295647 290958 285779
64477 285779 280957 277576 275791 274861 273931 272520 270446 267610 263926 259474 254706 250378 247060 244683 242672
64462 242672 240620 238741 237670 237905 239443 241878 244784 248012 251506 254812 257021 257549 256988 256803 258006
64447 258006 260335 262836 264922 266605 268041 269380 271028 273522 276960 280837 284614 288322 292521 297873
64433 297873 304839 313507 323563 334626 346859 361129 378374 398875 422318 448526 477975 511641
64421 511641 550506 595301 646666 705424 772525 848597 933557 1026553 1125887 1228668 1330819
64410 1330819 1428185 1518103 1599885 1673816 1739841 1796879 1842616 1873714 1886940 1880903 1856791
64399 1856791 1817453 1765994 1705095 1636611 1560981 1477473 1385918 1288342 1188532 1090217 996076
64388 996076 908057 827602 755269 690738 633468 583087 539175 501213 468833 441684 418933
64377 418933 399398 382314 367556 355003 344155 334622 326504 319920 314424 309244 303951 298710 293939
64364 293939 289787 285781 281038 275089 268486 262261 256877 252131 248001 244924 243085 242072 241597 242020 243758
64349 243758 246598 250006 253758 257876 262332 267257 273060 279754 286378 291599 294769 296052 295786 294246
64335 294246 291825 288796 284958 280095 274847 270549 268042 267034 266709 266584 266656 267141 268285 270086 271989
64320 271989 273103 272938 271784 270281 268870 267797 267316 267505 267974 268077 267483 266497 265800 265843 266345 266355 264954
64303 264954 262025 258223 254179 249907 245162 240096 235248 230938 227018 223336 220166 217978 216867 216451
64289 216451 216314 216361 216682 217312 218294 219812 222031 224846 228034 231651 235961 240916 246012 250915 256020 262038
64273 262038 269119 276666 283958 290686 296919 302898 308935 315143 321007 325513 327991 328727 328528 327837 326557
64258 326557 324629 322351 320144 318333 317305 317472 318751 320313 321113 320580 318553 314715 308620 300370 290985
64243 290985 281823 273694 266568 260003 253703 247754 242469 238071 234556 231893 230198 229583 229899 230862 232387
64228 232387 234532 237129 239781 242258 244563 246493 247531 247456 246748 246072 245523 244748 243624 242459 241578 241013
64212 241013 240595 240033 238854 236568 233090 228959 225048 222015 219985 218786 218487 219507 221913 224767 226724
64197 226724 227405 227681 228405 229492 230605 232122 234724 238433 242844 248060 254585 262426 271083 280541 291474
64182 291474 304237 318272 332621 346432 358693 368149 373909 375880 374423 370032 363425 355399 346217
64169 346217 335596 323595 311045 298836 287279 276500 266931 258884 252086 246166 241319 237851 235358
64156 235358 233027 230680 228913 228161 228172 228552 229380 230985 233353 236043 238613 240962 243297 245865 248783
64141 248783 252083 255750 259587 263129 265921 267974 269754 271663 273618 275151 275802 275432 274370 273296 272758
64126 272758 272684 272464 271504 269656 267282 265131 263977 264081 265083 266741 269503 273958 279956 286918 294800
64111 294800 303978 314157 324300 333857 343308 353177 363262 373118 382526 391026 397811 402688 406474
64098 406474 409815 412368 413937 415735 419516 425801 433864 443077 453190 463416 472379 479249 484180 487467
64084 487467 488938 488410 486106 482361 477269 470818 463070 454153 444351 434139 423815 413209 402120
64071 402120 390962 380538 371306 363221 356148 349962 344421 339437 335366 332565 330798 329607 329020 329286
64057 329286 330106 330868 331532 332500 333687 334610 335519 337504 341134 345796 350804 356467 363524 372013 381306 391054
64041 391054 401725 414309 429534 447074 465545 483696 501558 519852 538318 555390 569739
64030 569739 581299 590386 596568 598935 597003 590936 581494 570218 559007 548840 539274 529645 520180
64017 520180 511424 503289 495513 488461 482458 476665 469661 461037 451500 441506 430890 419952 409905
64004 409905 401777 395543 390588 386347 382195 377502 372340 367647 364228 362032 360743 360403 360901 361439 361321
63989 361321 360978 361484 363296 366209 370223 375437 381036 385535 388580 391765 396994 404519 413142 421880 430640
63974 430640 439567 448626 457949 467982 478940 490483 502124 513749 525729 538822 553918 571474
63962 571474 591078 611943 633929 657643 683455 710982 739914 770932 805403 844528 889228
63951 889228 940580 999838 1068082 1146301 1235796 1338190 1455055 1587841 1738013 1906880
63941 1906880 2095196 2303071 2530029 2774654 3034185 3304904 3583158 3865885 4150100
63932 4150100 4432056 4706786 4968156 5209271 5423204 5603811 5746331 5847652 5906234 5921592
63922 5921592 5893661 5822747 5710059 5557902 5369294 5148046 4899730 4632011 4353139 4069947
63912 4069947 3787568 3510491 3242877 2987814 2747141 2522354 2315173 2127014 1958366
63903 1958366 1808779 1676952 1560800 1458125 1367607 1288745 1220725 1161927 1110783 1066453
63893 1066453 1028222 994781 964660 937023 911544 887765 865041 842922 821165 799544 777984
63882 777984 756729 736072 716108 697097 679837 665300 653998 645979 641166 639257 639469 641070 644315
63869 644315 650330 659785 671992 685656 700306 716525 734754 754341 774205 794143 814840 836426
63857 836426 857729 877420 895411 912388 928183 941550 951623 958736 963506 965876 965554 962724 957621
63844 957621 949855 938897 925025 909131 891647 872242 850531 826540 800433 772347 742763 712647
63832 712647 682900 653754 624981 596626 569367 544040 520903 499535 479543 461108 444549
63821 444549 429497 414998 400570 386750 374373 363600 353882 344635 335665 327237 319953 314325 310147
63808 310147 306516 302752 299045 295869 293012 289746 285904 282311 280005 279284 279575 279950 279637 278242 275746
63793 275746 272434 268829 265539 262924 260851 258944 257099 255512 254185 252722 250757 248282 245419 242230
63779 242230 238974 236266 234601 233910 233781 233868 233869 233481 232735 232150 232173 232607 232904 232768 232201 231236 230091 229350 229469
63760 229469 230195 230827 230910 230283 228743 226291 223611 221670 220737 220330 220129 220384 221289 222542 223803 225129 226672
63743 226672 228290 229781 231191 232614 233917 234942 235846 237035 238848 241419 244647 248133 251340 253960
63729 253960 256028 257640 258833 259893 261500 264202 267791 271436 274478 276969 279517 282671 286470 290439
63715 290439 294053 297192 300117 302979 305486 307144 307733 307459 306676 305589 304225 302611 300916 299396 298211
63700 298211 297323 296651 296251 296239 296539 296838 296913 296939 297354 298375 299815 301477 303650 306888 311192 315626 319040
63683 319040 321139 322601 324228 326220 328269 329967 330958 330924 329785 327894 325968 324731 324501 324916 325132 324600
63667 324600 323670 323157 323352 323882 324553 325698 327315 328467 328158 326587 324889 323643 322184 319476 315268 310260
63651 310260 305431 301369 298039 294984 291804 288554 285678 283647 282674 282611 282986 283213 282972 282389 281870 281862 282694
63634 282694 284380 286459 288353 290096 292419 295889 300229 304759 309238 313951 319196 325050 331458 338185
63620 338185 344868 351453 358434 366308 374978 384128 393967 405099 417706 431435 446157 462322 480414
63607 480414 500405 521938 544747 568738 593884 620118 647179 674470 701195 726490 749155
63596 749155 767451 779697 785396 785610 782215 776874 770623 764006 757307 750642 743818 736187 726906 715572
63582 715572 702371 687455 670502 651270 630290 608586 586971 566083 546793 529834 515043
63571 515043 501689 489611 479474 471770 466213 462305 459975 459394 460599 463511 467916 473188 478417 483077
63557 483077 487287 491391 495672 500554 506551 513833 522315 532350 544805 560119 577794 597180 618316
63544 618316 641662 667480 695996 727751 763047 800815 838221 871371 896635 912038 918026 916859
63532 916859 911022 902228 891749 880896 870688 861445 853127 845642 838353 829741 818228 803203 784799
63519 784799 763036 737870 709854 680019 649164 617954 587614 559647 534587 511718 490357
63508 490357 470838 453857 439318 426372 414349 403211 393304 384960 378235 372684 367474 362010 356439
63495 356439 351347 347077 343609 340956 339261 338403 337773 336751 335291 333968 333477 334155 335813 337882 339768
63480 339768 341281 342711 344378 346174 347723 349011 350519 352550 354681 356226 357213 358498 360729 363315
63466 363315 364662 363563 360396 356873 354455 352960 350974 347640 343702 340490 338336 336599 335052 334375
63452 334375 335025 336311 337119 337156 337001 337252 338186 340082 343200 347387 352200 357610 364140 372086 380960 390070
63436 390070 399477 410030 422486 436889 452933 470745 491071 514586 540965 568535 594819 617529
63424 617529 635325 647978 656091 660777 663525 666099 670262 677370 688167 702977 721983 745175 772088
63411 772088 801780 833184 865375 897414 928013 955461 977942 994037 1003192 1005971 1003802 998257
63399 998257 990441 981074 970955 960906 951046 940345 927298 911013 891410 868507 842087 812306
63387 812306 780222 747374 715048 684189 655578 629474 605235 581975 559699 539330 521621
63376 521621 506596 494164 484553 477791 473322 470582 469554 470358 472741 476439 481686 488865 497915 508551
63362 508551 520793 534720 549927 565825 582425 600404 620445 642848 667564 694210 722259
63351 722259 751662 782946 816127 849799 881907 911190 937091 958511 973701 981655 982918 978919
63339 978919 971177 961201 950258 938845 926923 914816 903039 890966 876612 858397 836548 812211
63327 812211 785871 757485 727754 698295 670517 644880 621298 599833 580910 565153 553119
63316 553119 544998 540474 538687 538052 536139 530355 519302 503547 485065 466082 448298 432518 418601
63303 418601 406003 394686 385300 378331 373393 369563 366158 363008 360287 358304 357123 356235 354907 353033
63289 353033 351208 349745 348123 345779 342993 340544 338775 337447 336270 335200 334332 333762 333393 332758 331386
63274 331386 329518 328066 327647 328058 328878 329945 330919 331103 330352 329656 330145 331877 334197 336764 339462 341729
63258 341729 343009 343818 345441 348471 352347 356330 360225 364060 367776 371501 375564 380004 384518 389104
63244 389104 394284 400480 407575 415300 423722 433098 443516 454911 467245 480538 494827 510130 526359
63231 526359 543394 561458 581218 603085 626525 650493 674504 698739 723048 746534 768445
63220 768445 789049 809163 829140 848808 868302 888418 909880 932445 954940 976167 995580
63209 995580 1013015 1027924 1039212 1045889 1047621 1044550 1036808 1024495 1007998 988041 965426 940923
63197 940923 915441 890173 866445 845303 827157 811963 799910 791794 788356 789359 793853 801361
63185 801361 812215 826565 843804 863441 885916 911911 941189 972779 1005995 1040546 1075821
63174 1075821 1110837 1145024 1178508 1211469 1243605 1274360 1303331 1330326 1355235 1377836 1397600
63163 1397600 1413679 1425184 1431366 1431433 1424566 1410325 1388785 1360114 1324477 1282664 1236243 1186567
63151 1186567 1134133 1079613 1025109 973450 926306 883587 844533 808607 775499 745186 718219
63140 718219 695290 676274 660186 646127 633773 622942 613353 604968 597989 592340 587632 583731 580811
63127 580811 578739 576973 575255 573930 573427 573957 575777 579150 583742 588678 593477 598420 603678 608632 612523
63112 612523 615430 618136 621272 624861 628476 631505 633484 634414 634694 634594 634090 633334 632902 633236 633941 633975 632609
63095 632609 630152 627729 626271 625627 624843 623433 622073 621666 621963 621702 620075 617572 615336 614217 614565 616359
63079 616359 619250 622752 626596 630706 634859 638745 642443 646508 651492 657553 664489 671936 679750 688463
63065 688463 699062 711800 725589 739241 753011 768063 784701 802218 820544 840867 864295
63054 864295 890882 920347 952757 988010 1025611 1065634 1109055 1156342 1206410 1257741 1309942
63043 1309942 1363403 1418025 1473235 1528823 1584792 1640584 1695405 1749281 1802957 1856709 1909931
63032 1909931 1961968 2012746 2062417 2110824 2157340 2200668 2238709 2269077 2290016 2300613 2300201 2288097
63020 2288097 2264187 2229540 2186084 2135698 2079693 2019183 1955886 1892461 1831877 1776385 1727086
63009 1727086 1684281 1647999 1618390 1596059 1582103 1577364 1581588 1593802 1613640 1641682 1678135 1721794
62997 1721794 1770875 1824446 1882336 1943842 2007263 2070905 2134086 2196971 2259676 2321779 2382595
62986 2382595 2441635 2498565 2552725 2602995 2648370 2688237 2721540 2745893 2758334 2757196 2742606
62975 2742606 2715082 2674389 2620188 2553071 2474481 2386217 2290629 2190726 2089255 1987907 1888026
62964 1888026 1791683 1701189 1617556 1540189 1468232 1401697 1341121 1286630 1237585 1192874 1151336
62953 1151336 1112042 1074429 1038374 1004178 972303 942772 914936 888125 862489 838689 816817
62942 816817 796235 776565 758055 740729 724036 707898 693278 680945 670309 660381 651386 644357
62930 644357 639338 635089 630689 626524 623425 621470 620000 618391 616539 614868 613961 613958 614221 613813 612254 609609
62914 609609 606067 601789 597041 592055 586787 581181 575596 570635 566515 562920 559473 556128 553084 550504
62900 550504 548256 545848 542825 539333 535978 533007 530038 526859 523994 522099 521191 520883 520921 520946 520254 518517
62884 518517 516403 514790 513663 512581 511879 512440 514289 516341 517685 518332 518583 518474 518141 518057 518416 518729 518360
62867 518360 517202 515547 513566 511127 508028 504398 500992 498876 498495 499141 499726 499896 500045 500483 501178 502149
62851 502149 503489 505031 506549 508171 509966 511276 511318 510482 510160 511000 512080 512167 511143 509757 508509 507263
62835 507263 505651 503473 500931 498616 497047 496116 495341 494646 494345 494265 493586 491933 490084 489182 489549 490633
62819 490633 491764 492629 493358 494509 496730 500100 503986 507738 511272 514801 518379 522016 525926 530275 534845
62804 534845 539218 543141 546635 550023 554024 559410 566241 573764 581403 589504 598730 608999 619590 630173
62790 630173 641215 653339 666760 681573 698256 717598 740294 766809 797508 832611 871988
62779 871988 915356 962931 1015707 1074703 1139944 1210492 1285467 1364535 1447151 1531798 1616362
62768 1616362 1698906 1777613 1850301 1914634 1968802 2011586 2041883 2058684 2061484 2050270 2025219
62757 2025219 1986939 1936976 1877517 1810501 1737452 1660160 1580818 1501227 1422335 1344805 1269666
62746 1269666 1198172 1131308 1069570 1012920 960824 912657 868275 828051 792400 761451 734933
62735 734933 711957 691112 671483 653590 638718 627176 617792 609179 600905 593324 587034 582794 581289
62722 581289 582413 585177 588643 592619 597294 602769 609249 617146 626544 637019 648413 661420 677084
62709 677084 696015 718369 744118 773001 804661 839258 877643 920662 968724 1022361 1082617
62698 1082617 1150319 1225353 1307162 1395611 1490831 1592546 1700059 1812586 1928986 2047365
62688 2047365 2165444 2281166 2392365 2496039 2588509 2666339 2726769 2767429 2786272 2782014 2754575
62677 2754575 2705217 2636391 2551118 2452160 2341934 2223405 2100569 1977446 1856675 1739473
62667 1739473 1626716 1519608 1419439 1327195 1243317 1167437 1098486 1035462 978035 926073 878919
62656 878919 835722 796374 761385 730765 703589 678880 656416 636433 618860 603134 588551
62645 588551 574634 561253 548536 536610 525475 515264 506421 499323 493726 488912 484388 480255 476872
62632 476872 474459 473014 472308 471852 471098 469828 468232 466592 465016 463477 461929 460279 458411 456288 453993
62617 453993 451718 449823 448829 449170 450899 453741 457421 461772 466538 471293 475742 480108 485111 491447 499249
62602 499249 508086 517537 527699 539042 551863 566083 581620 598792 618293 640778 666437 694884
62590 694884 725610 758636 794483 833173 873477 913577 952306 989193 1023375 1053213 1077217
62579 1077217 1094803 1105829 1109915 1106639 1096022 1078512 1054866 1026391 994829 961479 926663 890422
62567 890422 853411 816661 780794 746049 712922 682179 654259 629080 606455 586350 568774
62556 568774 553754 541386 531571 523693 516891 510642 504901 499758 495299 491785 489540 488505 488069 487543
62542 487543 486732 485990 485702 485770 485727 485429 485464 486589 488831 491509 494075 496542 499045 501530 504109 507308 511692
62525 511692 517536 525022 534321 545345 557968 572733 590730 612367 636863 663510 692889 726181
62513 726181 763759 805297 850972 901661 957906 1019297 1084854 1153321 1222980 1291781 1357942
62502 1357942 1420224 1477584 1528821 1572457 1606728 1629916 1641105 1640553 1629071 1607367 1576488 1538626
62490 1538626 1496804 1453781 1411677 1372453 1337940 1309194 1286333 1269230 1258102 1253402 1255441 1264078
62478 1264078 1278490 1297373 1319806 1345763 1375162 1406302 1435742 1459896 1476557 1485020 1485389 1478100
62466 1478100 1463718 1442640 1414747 1379305 1335480 1283487 1225533 1165185 1105337 1046933 989914
62455 989914 934921 883448 836665 794835 757847 725648 698141 675177 656644 642125 630617
62444 630617 621224 614080 610009 609223 610877 613900 617710 622166 627405 633790 641407 649551 657194 663884
62430 663884 669641 673996 675882 674583 670203 663115 653614 642246 629769 616589 602778 588757 575275
62417 575275 562554 550154 537977 526720 517035 508821 501619 495102 488879 482606 476644 471926 468610
62404 468610 465497 461452 456862 453010 450422 448568 446968 445805 445386 445558 445854 446029 446384 447578 449947
62389 449947 452956 455593 457458 459089 461101 463438 465741 468048 470705 473890 477636 482112 487475 493507
62375 493507 499744 505956 512361 519401 527391 536221 545376 554423 563495 573074 583403 594486 606598
62362 606598 620255 635625 652577 671545 693735 720093 750485 784220 820975 860845 903916
62351 903916 950110 999078 1049844 1100794 1150294 1196989 1239325 1275335 1303436 1323195 1335016
62340 1335016 1339507 1337482 1330047 1317998 1301346 1279952 1254420 1225864 1195028 1162212 1128032 1093784
62328 1093784 1060996 1030894 1004159 980820 960335 941940 924943 908655 892347 875480 857781
62317 857781 838972 818743 797072 774238 750457 726014 701858 679290 658616 638825 619242
62306 619242 600903 585476 573223 562867 553255 544313 536461 529883 524534 520287 516993 514729 513869
62293 513869 514429 515535 516170 516356 516959 518410 520304 522336 524901 528499 533093 538337 544002 549860 555529
62278 555529 560798 566008 571888 579036 587468 596511 605233 613252 621202 630207 640999 653634 667810
62265 667810 683055 698815 714899 731917 750953 772769 797470 824797 854483 886479 921133
62254 921133 958937 999813 1042962 1087789 1134530 1183316 1232986 1281572 1327638 1370253 1407877
62243 1407877 1438456 1460777 1474873 1480993 1479192 1470078 1454735 1433306 1404722 1368532 1326030 1278794
62231 1278794 1227158 1171373 1113528 1056816 1003108 952561 905515 863265 826505 794213 764870
62220 764870 738051 714215 693529 675703 660566 648047 637641 628505 620140 612575 605906 600042
62208 600042 594956 590792 587534 584809 582195 579640 577506 576290 576296 577421 579167 581041 583032 585619 589255
62193 589255 593956 599427 605382 611606 617919 624352 631226 638780 646751 654607 662232 670042 678372 687043
62179 687043 695738 704473 713384 722184 730195 736905 742303 746683 750443 754184 758851 765475 774667 786392
62165 786392 800390 816874 836681 860593 888608 920151 954829 992406 1031861 1071031 1107666
62154 1107666 1140585 1169300 1192823 1209634 1219044 1222012 1220293 1215033 1206374 1194010 1177702 1157429
62142 1157429 1133502 1106679 1078066 1048900 1020439 993828 969767 948327 929348 913008 899749
62131 899749 889607 881871 875608 870300 865799 861813 857774 853169 847706 841194 833651 825634 818138 811898
62117 811898 807050 803595 801852 802043 803806 806634 810602 815929 821745 825945 826689 823786 818416 811906 805041
62102 805041 798234 791885 786475 782329 779048 775238 769341 761092 751870 743324 735976 729495 723924 719970
62088 719970 718180 718359 719883 722236 725232 728988 733809 739923 747303 755833 765508 776309 788099 800887
62074 800887 815006 830741 847946 866349 885966 906793 928200 949162 969079 987978 1005997
62063 1005997 1023203 1040039 1057413 1076116 1096481 1118722 1143080 1169249 1195899 1221137 1243377
62052 1243377 1261618 1275197 1283696 1287144 1286118 1281399 1273397 1261726 1245396 1223599 1196439 1164820
62040 1164820 1129712 1091711 1051262 1008980 965647 922107 879306 838183 799409 763387 730556
62029 730556 701382 675818 653108 632485 613913 597745 583721 570832 558353 546618 536433
62018 536433 527909 520296 512884 505604 498604 491658 484410 477019 470165 464488 460348 458010 457557 458510 460032
62003 460032 461796 464260 467824 472107 476522 481197 486752 493181 499508 504686 508476 511359 513878 516272
61989 516272 518515 520444 521843 522394 521590 518806 513728 506740 498785 490762 483076 475662 468372 461325 454851
61974 454851 449036 443458 437724 432235 427921 425076 422945 420801 418847 417498 416275 414269 411534 409156
61960 409156 407840 407149 406312 405183 404116 403445 403375 403910 404631 404939 404807 404871 405587 406724 408015 409758 412300
61943 412300 415332 418292 421234 424751 429193 434516 440851 448595 457801 467938 478449 489160 499912
61930 499912 510122 519161 527096 534779 543026 551791 560203 567409 573289 578274 582565 585771 587421 587614
61916 587614 586845 585310 582770 579313 575941 574054 574330 576347 579299 582894 587473 593463 600887 609318 618137
61901 618137 626891 635490 643977 652012 658638 662796 664063 662810 659733 655410 650119 643796 636212 627537
61887 627537 618674 610645 603660 597231 591271 586441 583126 580625 577773 573995 569302 563619 556725 548657
61873 548657 539709 530212 520730 512220 505360 499824 494800 490213 486833 485149 484733 484908 485528 486888 489200
61858 489200 492474 496600 501384 506671 512575 519418 527442 536757 547527 559899 573780 588954 605346
61845 605346 622827 640846 658730 676307 693710 710498 725519 737838 747327 754167 758296 759616
61833 759616 758323 754693 748941 741586 733583 725789 718679 712859 709360 708819 710712 714008 718416 724391
61819 724391 731988 740375 748568 756017 762165 765967 766419 763382 757500 749323 738975 726737 713512 700333
61805 700333 687543 674818 661947 649218 636980 625280 614160 604048 595415 588157 581578 574973
61793 574973 568047 560898 553886 547483 542002 537417 533489 529977 526655 523388 520380 518083 516630 515546
61779 515546 514285 512734 510999 509065 507053 505352 503971 502188 499503 496540 494253 492616 491064 489966
61765 489966 490384 492315 494391 495691 496788 498481 500542 502452 504489 507229 510511 513818 517249 521265
61751 521265 525705 529825 533208 535979 538156 539364 539215 537567 534435 530045 524996 520034 515572 511526
61737 511526 507560 503466 499489 496290 494301 493057 491562 489408 487127 485391 484469 484622 486222 488971 491621
61722 491621 493093 493480 493504 493536 493738 494583 496368 498499 500056 500919 501666 502544 503271 503710 503987 503937 503106 501337
61704 501337 498801 495477 491240 486508 482188 478824 476247 474083 472081 469872 466988 463337 459292 455221
61690 455221 451238 447410 443787 440232 436639 433290 430509 428046 425370 422586 420356 418834 417343 415378
61676 415378 413232 411283 409283 406889 404433 402549 401301 400201 398920 397539 396241 395168 394503 394327 394441
61661 394441 394660 395195 396377 398048 399668 401040 402507 404240 405756 406530 406845 407569 409096 410875 412122
61646 412122 412666 412934 413391 414292 415776 417734 419609 420701 420864 420647 420668 421068 421635 422156 422444 422236 421345 419843
61628 419843 417986 416040 414234 412724 411541 410633 409897 409014 407428 404900 402060 399924 398749 397793 396285
61613 396285 394147 391608 388741 385694 382830 380195 377334 374059 370938 368506 366455 364127 361387 358422
61599 358422 355113 351311 347464 344266 341908 340238 339259 338702 337503 334737 330957 327605 325182 323032 320931
61584 320931 319659 319611 319930 319686 319002 318295 317130 314756 311443 308455 306746 306247 306306 306397 306406 306605 307335 308555
61566 308555 309794 310669 311239 311711 312092 312336 312562 312855 313122 313408 314103 315516 317412 319260 320824 322227 323595
61549 323595 324889 325982 326737 327121 327471 328429 330345 332901 335524 337981 340221 341878 342396 341754 340654 339847
61533 339847 339566 339767 340582 342124 343989 345332 345667 345318 344905 344631 344358 344236 344700 345711 346494 346314 345246
61516 345246 343874 342562 341409 340586 340116 339511 338327 337109 337053 338432 339957 340165 339088 338089 338220 339170
61500 339170 339797 339339 338036 336743 336103 336115 336393 336678 336966 337306 337723 338326 339225 340281 341105 341373 341001 340132
61482 340132 339116 338442 338412 338937 339850 341290 343410 345865 348088 350055 352295 355031 357851 360388 362784
61467 362784 365146 367009 367784 367462 366455 365041 363372 361835 360907 360689 360920 361391 361946 362157 361475 359946
61451 359946 358537 358469 360242 363351 366824 369917 372367 374205 375482 376202 376440 376425 376482 376807 377217 377219 376504 375447
61433 375447 374890 375272 376212 377103 377886 378904 380199 381341 381880 381640 380657 379289 378335 378473 379426 380133 379989
61416 379989 379526 379646 380551 381815 383127 384491 385833 386877 387529 388016 388510 388814 388594 387820 386824 385925 385133
61399 385133 384279 383334 382439 381657 380952 380479 380605 381449 382576 383453 384031 384616 385278 385793 386100 386424 386856 387171
61381 387171 387230 387323 387934 389292 391251 393457 395570 397465 399309 401382 403809 406515 409382 412270 414948
61366 414948 417116 418587 419388 419805 420355 421516 423345 425502 427760 430210 432852 435340 437465 439664 442668
61351 442668 446835 452101 458246 464792 470972 476341 481276 486306 491114 494740 496736 497597 498126 498902 500280
61336 500280 502350 504858 507564 510590 514004 517300 519864 521726 523254 524319 524519 524053 523523 522925 521721
61321 521721 519865 517904 516097 514468 513737 514976 517977 521168 523666 526415 530727 536702 543771 551785
61307 551785 560710 570087 579812 590823 604014 618927 634433 650253 666739 683314 698174 709715
61295 709715 717650 722665 725478 726344 725126 721731 716514 710017 702296 692990 682288 671207 660566 650203
61281 650203 639666 629119 619057 609656 600989 593434 587248 582155 577930 574947 573485 572947 572517 572222
61267 572222 572570 573428 574098 574332 574474 574666 574677 574572 574974 576567 579714 584449 590395 596756 602773 608067 612342
61250 612342 615164 616443 616744 616679 616419 616258 617003 619039 621445 622896 623112 622632 621624 619906 617885 616371
61234 616371 615468 614555 613397 612409 611809 611402 611321 612151 614177 617234 621405 627161 634687 643640 653608 664168
61218 664168 674622 684490 694266 704853 716174 727235 737586 747711 757708 766684 773999 780279 786563
61205 786563 793048 799208 804606 809088 812711 816022 819977 825097 831042 837432 844743 853929 865350 878423
61191 878423 892171 905826 919062 931829 943878 954441 962638 968116 971018 971459 969543 965847 961278
61178 961278 956244 950505 943857 936422 928131 918604 907840 896465 885000 873365 861372 849228 837224
61165 837224 825339 813382 801128 788141 774091 759538 745764 733322 721226 708110 693886
61154 693886 679769 667046 656325 647718 641121 636256 632830 630717 629813 629744 629858 629490 628238 626144 623647
61139 623647 621131 618434 615040 610773 606074 601636 598071 595907 595442 596486 598587 601603 605739 611060
61125 611060 617448 625127 634697 646473 660208 675570 692495 710921 730661 751724 774325 798413
61113 798413 823546 849413 876045 903384 931033 958572 985730 1012143 1037395 1061332 1083828
61102 1083828 1104239 1121706 1136146 1148232 1158213 1165406 1169128 1169373 1166176 1159004 1147327 1131371 1111896
61089 1111896 1089683 1065605 1040676 1015580 990504 965715 941805 919064 897160 875886 855730
61078 855730 837314 820721 805732 792247 780128 769130 759349 751223 744812 739722 736057 734647 735772
61065 735772 738358 741116 743861 747090 750905 755179 760273 766756 774675 783783 794124 805857 818882
61052 818882 833217 849289 867204 886283 905997 926855 949604 974056 999591 1026359 1054963
61041 1054963 1085189 1116091 1147288 1179429 1213376 1249552 1287946 1328119 1369309 1411004 1453265
61030 1453265 1496190 1539553 1583505 1628977 1676712 1726475 1777884 1831364 1887439 1945710 2005385
61019 2005385 2066046 2127055 2187327 2247197 2309695 2378376 2454526 2538072 2630369 2733957 2850104
61008 2850104 2978976 3122321 3284138 3469320 3684667 3941636 4255489 4641217 5112707
60999 5112707 5685670 6377493 7203350 8176559 9313735 10634075 12151960 13878356 15830625
60990 15830625 18015335 20360925 22651882 24560723 25800274 26286805 26174141 25741889
60982 25741889 25256591 24912645 24831555 25032759 25370464 25534190 25178254 24105468 22359272
60973 22359272 20164504 17792641 15462089 13311041 11409803 9778035 8401774 7252191
60965 7252191 6298658 5511639 4862279 4324925 3879491 3509824 3201172 2940336 2716715
60956 2716715 2521873 2349220 2194941 2057699 1936111 1827414 1729286 1641437 1564088 1495994
60946 1495994 1435288 1381193 1333329 1289934 1248303 1206764 1165147 1123778 1083225 1044690 1009200
60935 1009200 976309 944658 913924 885197 859279 835611 813220 791884 771955 753646 736958
60924 736958 721910 708477 696510 685920 676653 668459 660967 654022 647630 641635 635918 630851 626985
60911 626985 624174 621619 618991 616868 615713 614938 613575 611529 609530 608004 606655 605227 604127 603916 604446
60896 604446 604854 604320 602578 599683 595629 590443 584541 578635 573225 568384 564056 560189 556427 552088 546853
60881 546853 541221 535767 530142 523395 515321 506984 499721 494070 489718 486005 482216 477858 473047 468343
60867 468343 464005 459812 455897 453252 452770 454079 455895 457462 459135 461614 465110 469355 473982 478719
60853 478719 483483 488374 493343 497881 501324 503532 505071 506673 508745 511397 514583 518075 521497 524484
60839 524484 526667 527553 526699 524083 520103 515190 509651 503864 498250 492935 487760 482707 478018 473789 469808
60824 469808 465987 462635 460048 458065 456319 454615 452776 450332 446834 442438 437814 433446 429278 425061
60810 425061 420710 416254 411706 407170 402912 399103 395549 391901 388207 385090 383198 382435 381939 380913 379392
60795 379392 378030 377232 376689 375805 374326 372464 370541 368748 367292 366670 367520 369935 372987 375333 376490
60780 376490 377141 377958 378629 378644 378602 379726 382110 384464 385962 387378 389724 392550 394497 395182 395553 396512 398041
60763 398041 399760 401569 403408 404960 405992 406747 407716 409144 410824 412217 412752 412237 410992 409415 407535
60748 407535 405272 403025 401449 400597 399790 398580 397457 397201 397774 398176 397346 394951 391391 387270 382909 378282
60732 378282 373358 368447 364061 360456 357471 354823 352322 349747 346842 343705 340970 339331 338875 339100 339527
60717 339527 340112 341100 342660 344698 346832 348535 349475 349916 350646 352336 354909 357606 359697 361101 362276
60702 362276 363627 365153 366662 368120 369631 371139 372405 373352 374282 375585 377266 378930 380238 381240 382159
60687 382159 383010 383638 384113 384796 385866 386976 387557 387425 386888 386380 386198 386542 387458 388632 389563 390089 390558 391320
60669 391320 392300 393285 394369 395719 396964 397241 395931 393154 389436 385186 380672 376339 372828 370519 369175
60654 369175 368164 367125 366319 366236 366928 367978 369229 371219 374519 378666 382195 383990 384415 384805 385866 386930
60638 386930 386911 385639 383849 382003 379643 376191 371985 368118 365381 363730 362719 362038 361525 361059 360641 360380
60622 360380 360240 359994 359576 359285 359475 360153 361021 361753 362110 361948 361308 360471 359834 359775 360605 362418 364890 367387
60604 367387 369368 370568 370842 370180 368978 367950 367476 367291 367093 367188 368192 370196 372566 374584 376091 377500
60588 377500 379365 381896 384774 387396 389389 390820 391921 392789 393401 393699 393575 393033 392472 392530 393435 394781
60572 394781 396175 397886 400610 404779 410297 416740 423605 430663 438315 447383 458173 469947 481603
60559 481603 492650 503151 512988 521606 528366 532769 534490 533579 530497 525644 519128 511495 504309 499159
60545 499159 496134 494031 492202 491369 492327 494683 497606 501302 506888 514951 524996 536462 549654 565222
60531 565222 583106 602483 622600 643083 663288 681863 697465 709638 718511 723732 724353 719979
60519 719979 711537 700680 688765 676626 664814 653601 643012 633262 624982 618661 614069 610525 607522
60506 607522 604855 602540 601060 601381 604175 609185 615877 624556 636324 652035 671795 695433 722955
60493 722955 754475 790092 829764 872982 918548 964961 1010859 1054817 1095131 1130432 1160347
60482 1160347 1184996 1204043 1216904 1223701 1225118 1221170 1210751 1192583 1166148 1131724 1090278 1043535
60470 1043535 993627 942361 891091 841155 793772 749501 708490 671303 638791 611013 587077
60459 587077 566308 548783 534341 521895 510304 499369 489398 480340 471954 464402 458033 452764 448167
60446 448167 443999 440216 436656 433102 429608 426482 424082 422702 422400 422718 422926 422688 422171 421294 419404 416126
60430 416126 412182 408903 407133 406962 408199 410527 413206 415156 415626 414720 413223 411954 411257 411067 411325 412067
60414 412067 413022 413582 413589 413776 414847 416430 417722 418928 421036 424037 426471 427206 426820 426730 427681 429605 432224
60397 432224 435099 437689 440017 442840 446570 450517 453763 456288 458608 460913 463295 466304 470293 474563
60383 474563 478073 480857 483840 487362 490762 493494 495855 498412 501346 504537 507756 510651 513053 515436
60369 515436 518562 522497 526383 529421 531711 533925 536417 538909 540898 542211 543134 544131 545540 547681 551021
60354 551021 555780 561350 566693 571519 576570 582460 588930 595770 603766 613815 625348 636507 645744
60341 645744 652562 656869 658488 657468 654121 648583 640910 631730 622221 613217 604776 596806 589626 583644
60327 583644 578823 574678 570567 565930 560577 554872 549355 544149 538951 533609 528366 523573 519533 516652
60313 516652 515293 515362 516432 518466 522059 527790 535587 544985 555827 568475 583342 600296 618553
60300 618553 637218 655897 674489 692228 707265 717638 722551 722420 717865 709106 696299 679977
60288 679977 661074 640816 620637 601873 585329 571230 559526 550060 542544 536627 532006 528360
60276 528360 525336 522736 520476 518133 514861 510173 504615 499263 494705 490841 487441 484437 481803 479576
60262 479576 477896 476668 475380 473680 471848 470207 468382 465850 462994 460830 459714 459111 458687 458820 459805
60247 459805 461257 462655 463908 465129 466329 467604 469191 471056 472790 474118 475114 475777 475821 475174 474267 473601
60231 473601 473266 473147 473301 473964 475359 477605 480559 483751 486774 489751 493151 497168 501586 506108 510418
60216 510418 514141 517340 520921 525863 532059 538614 545215 552352 560203 568314 576683 586039 596486 606817
60202 606817 615938 624206 632521 640684 647643 652972 657216 660963 664372 667577 670758 673752 676159 677911
60188 677911 679279 680259 680367 679148 676574 672922 668478 663437 657935 652227 646845 642261 638248 633949 628901
60173 628901 623705 619325 616021 613348 610897 608545 606194 603808 601651 600018 598826 597811 596938 596124 594826
60158 594826 592596 590050 588473 588289 588532 588186 587505 587502 588543 589972 591014 591500 591679 591721 591675 591666 591918 592537 593482
60139 593482 594773 596589 599020 601847 604838 608256 612731 618502 625060 631756 638483 645416 652322 658630
60125 658630 664127 669019 673221 676171 677755 678975 681104 684260 687365 689540 691034 692573 694396 696356
60111 696356 698610 701458 704534 706812 707667 707481 706908 705965 704256 701789 698998 696007 692337 687434 681302
60096 681302 674618 668376 663278 659224 655510 651758 648495 646496 645789 645737 645916 646334 646846 646989 646577 645952
60080 645952 645400 644765 643900 643110 642832 643130 643686 644008 643475 641556 638276 634187 629636 624315 617799 610250
60064 610250 602265 594275 586416 578830 571709 565086 558840 552948 547587 543023 539359 536245 532891 528767
60050 528767 524437 521307 520184 520374 520595 520580 521336 523921 528400 534077 540285 546703 553093 559119 564561
60035 564561 569629 574806 580192 585105 588603 590511 591633 592792 593885 594160 593232 591401 588921 585347 579966
60020 579966 572806 564888 557271 549987 542197 533370 523966 514854 506388 498368 490695 483674 477740 473102
60006 473102 469600 466725 463956 461310 459329 458273 457619 456767 455911 455650 455992 456413 456731 457150 457558 457666 457975
59989 457975 459669 463154 467485 471618 475500 479436 483155 486203 488756 491236 493452 494797 495081 494606 493555
59974 493555 491863 489568 486843 483767 480420 477097 474101 471480 469278 467771 467078 466797 466515 466532 467631
59959 467631 470187 473888 478168 482529 486557 490101 493454 496936 500281 502787 504108 504588 504761 504757 504341 503381
59943 503381 502186 501365 501238 501356 500830 499246 497121 495322 494223 493532 492717 491522 490275 489741 490358 491606
59927 491606 492546 493077 494135 496473 499794 503442 507357 511938 517341 523305 529229 534108 536955 537818 537888
59912 537888 538090 538179 537783 537643 538868 541390 544264 547224 550929 555701 561057 566547 572095 577331 581498
59897 581498 584319 586253 587685 588555 589081 590070 592061 594718 597459 600272 603553 607608 612590 618480 624771
59882 624771 630625 635734 640698 646229 652348 658687 665151 671779 678157 683471 687185 689425 690766 691768
59868 691768 692526 692484 690839 687385 682804 677989 673201 668052 662194 655818 649520 643801 638717 634040 629783
59853 629783 626399 624298 623330 623097 623678 625584 628998 633500 638670 644516 651132 658353 666031 674268 682945
59838 682945 691228 697881 702072 703802 703828 703306 703165 703522 703850 703898 704117 704818 705236 703840 699575 692496 683424
59821 683424 673425 663486 654186 645446 636879 628375 620069 611843 603320 594520 586053 578486 571861 566109
59807 566109 561513 558335 556174 554225 552136 550225 548881 548121 547807 547886 548254 548675 548963 549030 548693 547780 546514
59790 546514 545400 544554 543577 542351 541423 541212 541312 541214 541281 542194 543601 544263 543611 542346 541269 540304 539059
59773 539059 537645 536379 535153 533688 532207 531363 531662 533212 535821 539020 542242 545338 548734 552864 557674
59758 557674 562940 568718 575087 581715 588132 594398 601152 609049 618295 628597 639339 649983 660508
59745 660508 671277 682311 692943 702406 710525 717663 724248 730547 736574 741919 745966 748520 749924
59732 749924 750396 749675 747592 744560 741164 737714 734519 731993 729972 727472 723859 719849 716584 714000 710934
59717 710934 706703 701838 697223 693185 689506 685846 682067 678452 675528 673330 671134 668364 665491 663482
59703 663482 662661 662747 663676 665574 668037 670336 672383 674745 677646 680647 683365 685761 687627 688535 688526 688156
59687 688156 687655 686703 685242 683786 682562 681045 678807 676297 674268 672812 671406 669607 667290 664429 660982
59672 660982 656899 652023 646167 639482 632559 626055 620368 615671 611945 608859 605911 602849 599841 597223
59658 597223 595352 594565 594975 596308 598283 601068 604952 609644 614373 618764 623077 627493 631630 634919 637061
59643 637061 637994 637795 636699 634776 631577 626585 620092 613070 606043 598703 590858 583112 576174 570071 564589
59628 564589 560017 556804 554678 552777 550631 548500 546616 544581 541828 538440 535113 532267 529521 526284
59614 526284 522617 519097 515891 512552 508885 505506 503156 501926 501595 502279 504096 506469 508523 510157 512151
59599 512151 515152 518919 522493 524698 524798 523226 521536 520989 521284 521228 520449 519691 519502 519539 519304 518816 518279
59582 518279 517692 517060 516485 515845 514798 513281 511595 509970 508419 506980 505659 504166 502218 500054 498183
59567 498183 496753 495633 494809 494078 492702 490279 487723 486433 486607 487340 488224 489584 491145 491852 491444 490996
59551 490996 491428 492449 493466 494552 495971 497625 499530 502096 505504 509504 514067 519398 525230 531232
59537 531232 538389 548542 562079 577551 594282 613541 635600 656857 671727 677099 673907 665224
59525 665224 654301 643902 635667 629654 625268 622552 621793 622239 622346 621267 619215 616451 612862 608526
59511 608526 603743 598326 591589 583230 573778 564086 554830 546428 539021 532537 527002 522557 518886 515089
59497 515089 510601 505876 501605 497733 493925 490653 488964 489237 490819 492845 494883 496873 498940 501217
59483 501217 503544 505544 507309 509648 513197 517612 522066 526157 529867 533110 535955 538966 542683 546939
59469 546939 551152 554896 557811 559500 560195 560973 562533 564196 564945 565036 565668 567357 569599 572041 575042 579047
59453 579047 584167 590392 597555 605089 612429 619679 627246 634873 641569 646531 649712 651535 652419 652379 650810
59438 650810 646976 641101 634493 628137 621776 615006 608609 603830 600780 598547 596568 595004 594070 594054 595742
59423 595742 599723 605387 611603 618338 626644 637231 650093 665396 683430 703463 723893 743865
59411 743865 763772 783967 804264 825113 847773 871950 893839 907795 910292 902171 887493 870885
59399 870885 855730 843935 836587 834475 838043 846942 859460 871971 879291 876867 863723 843120 819831
59386 819831 797013 775869 757174 741767 729801 720650 713721 708629 704750 701449 698706 696783 695364
59373 695364 693824 692211 691133 690769 690795 691144 691901 692571 692466 691889 691970 693233 695178 697318 699715 702406 705284
59356 705284 708778 713756 720565 728817 738175 748520 759440 770573 782554 796533 812565 829456
59344 829456 846330 863263 880173 896310 911295 925508 938962 950788 960373 967949 973455 975860
59332 975860 974324 969194 961185 950484 937409 923032 908179 892482 875337 857271 839455 822317
59320 822317 805537 789101 773547 759283 746341 734680 724196 714563 705464 696847 688644 680575
59308 680575 672585 665164 658835 653537 648889 644823 641697 639995 640113 642195 646024 651320 658244 667216
59294 667216 678246 690883 704791 719626 734121 745907 752561 752513 745122 730964 712499 693541
59282 693541 677196 664472 654984 648234 643821 641275 640554 642346 647244 654913 664572 675918 689068
59269 689068 703827 719567 735673 751785 767681 783150 797709 810402 820189 826673 830098 830666
59257 830666 828363 823491 816725 808531 799238 789788 781554 775005 769249 763339 757380 752035 747695 744620
59243 744620 743165 743252 744148 745382 747414 750882 755667 761128 766787 772346 777558 782528 787616 792570 796280
59228 796280 797855 797502 795886 793161 789030 783229 775521 765726 754194 741716 728697 715059 701261
59215 701261 688517 677440 667409 657934 649730 643463 638248 632567 626241 620401 615867 612558 610330
59202 610330 609321 609384 609907 610328 610412 610218 610226 611226 613554 616692 620098 623976 628660 633661 638102 641903 645876
59185 645876 650796 656835 663655 670487 676446 681338 685926 690910 695970 700268 703448 705572 706587 706633 706491
59170 706491 706892 707638 708115 708402 709110 710415 712115 714406 717646 721306 724006 724794 723819 721687 718736 715104
59154 715104 710909 706101 700321 693065 684027 673530 662680 652646 643604 634843 626145 618325 611910
59141 611910 606056 599582 592532 585839 579902 574380 569075 564110 559467 555224 552065 550622 550397 550214 549748
59126 549748 549819 551155 553672 557052 561322 566630 572963 580174 587923 595660 603161 610917 619549 628990 638766
59111 638766 648753 658976 668924 677874 685771 693027 699550 704785 708756 712177 715395 717933 719257 719400
59097 719400 718626 717093 715009 712598 709743 706135 701967 698056 695112 693218 691991 690904 689449 687487
59083 687487 685503 684100 683213 682130 680221 677231 673005 667462 660941 654128 647475 640883 633942 626315
59069 626315 618105 610097 603370 598302 594214 590262 586323 582607 578925 575044 571407 568724 566945 565316
59055 565316 563341 561108 558756 556230 553549 550812 548022 545314 543150 541838 541112 540670 540713 541371 541997 541879
59039 541879 541338 541282 541878 542508 542919 543548 544741 546486 548874 552053 555686 559204 562633 566531 571297 577244
59023 577244 585077 595297 607175 619352 631474 644225 657659 670642 682211 692396 701202 707709
59011 707709 710878 710670 707902 703502 698284 692920 687678 682583 678005 674692 673056 672964 674321 677236 681415
58996 681415 686093 690854 695953 701487 706890 711649 716001 720457 725011 729196 732586 734912 736022 736033 735297
58981 735297 734023 732205 730068 728284 727558 728307 730848 735534 742481 751390 761817 773450 786129 799822
58967 799822 814595 830411 847005 864186 881998 900253 918102 934525 949133 962066 973267
58956 973267 982345 988944 992712 993071 989632 982714 972864 960039 943976 925327 905686 886396 867851
58943 867851 849896 832242 814514 796688 779695 764979 753321 744501 737971 733190 729431 726054
58931 726054 723086 720910 719471 718537 718601 720446 723658 726569 728082 728606 728823 728494 727196 725447 724203 723590
58915 723590 722872 721533 719858 718499 717870 717960 718514 719289 720191 721200 722410 724323 727827 733519 741194 750331
58899 750331 760829 772872 786334 800875 816433 833054 850365 867748 884940 902045 919255
58888 919255 937042 956231 977150 998965 1020567 1041814 1063117 1084145 1103788 1121118 1135432
58877 1135432 1145686 1151092 1152243 1150532 1146444 1139428 1129380 1117057 1102958 1087030 1069755 1052376
58865 1052376 1035692 1019637 1004305 990372 978134 967114 956963 947818 939464 931151 922613 914267
58853 914267 906043 897069 887004 876718 867064 857901 848875 840284 832523 825381 818463 811663 804746 797122
58839 797122 788486 779069 769012 758200 747020 736332 726325 716301 706072 696651 689021 683044
58827 683044 678186 674441 671864 669967 668339 667264 667153 667981 669842 673387 679008 686042 693348 700293 706837
58812 706837 713164 719615 726422 733139 738851 743218 746722 749712 751972 753390 754208 754271 752943 750113 746398
58797 746398 741977 736200 728828 720722 712720 704781 696761 689020 681606 673875 665796 658757 654097 651515
58783 651515 649798 648565 648383 649619 651955 654766 657397 659429 661141 663306 666181 669135 671492 673028
58769 673028 673360 671680 667620 661727 654704 646925 638960 631663 625214 618956 612588 606735 601900 597848
58755 597848 594485 592374 591802 592309 593618 595952 598908 601214 602334 603189 604553 605935 606890 608182 610609
58740 610609 613854 617580 622553 629433 637377 645058 652174 658803 664326 668422 672317 677455 683407 688490
58726 688490 692018 694708 697287 699987 703054 706512 709570 711309 711838 712073 712844 714877 718878 724551 730177
58711 730177 734384 737785 741808 746418 750293 752758 754133 754353 752581 748264 741543 732601 721483 708573
58697 708573 694519 679693 664263 648571 632968 617669 603254 590742 580517 571769 563606 556086
58685 556086 549532 543701 538446 534306 531412 528608 524806 520507 516851 513849 510814 507989 506385 506330 507258
58670 507258 508680 510376 512050 513820 516608 521159 527176 534347 543363 554659 566769 577396 585728
58657 585728 592410 597595 600398 600141 596928 591165 583582 575515 568036 560918 553422 545860 539435 534791
58643 534791 531631 529474 527884 526336 524737 523728 523685 524005 524143 524662 526295 528805 531805 535787 540980
58628 540980 546018 549233 550730 551771 552734 553154 553131 553092 552614 551121 549400 548832 549489 550583 552426 556141
58612 556141 561545 567071 571902 576681 581943 587255 592050 596155 599339 601459 603015 604565 605765 605975
58598 605975 605511 605184 604977 604297 603124 601725 599829 597403 595708 596079 598153 600751 603998 608906 615341
58583 615341 622229 629512 638102 647992 658131 668096 678251 688325 697470 705710 713758 721471 728063
58570 728063 733792 739864 746795 754438 763487 775197 789636 805858 823842 844606 868408 894347
58558 894347 921647 949683 976831 1001029 1021556 1038646 1051499 1058498 1059528 1056391 1050908 1044138
58546 1044138 1037241 1031179 1025510 1019271 1012981 1007875 1003230 996489 986164 972659 956214 936335 913657
58533 913657 890197 867184 844465 822535 803147 787242 773937 762137 751717 742796 735386 729970
58521 729970 726802 724584 721520 717671 714444 711925 708882 705383 702955 701821 700437 698223 696386 695426
58507 695426 694182 692119 690254 689026 687478 685427 684267 684629 685284 685248 684980 684675 683584 682057 682065 684415
58491 684415 687402 689444 691225 694051 697812 701878 706447 711834 717828 724679 733331 743931 755672 768623
58477 768623 783903 801321 818834 835145 850888 866283 879659 889340 895197 897341 895197 889018
58465 889018 880469 870675 859446 847342 836571 828717 823473 820588 821063 825239 831692 839344 848806 860380
58451 860380 872598 884139 895412 906869 917334 925241 929941 930762 926625 917835 906632 894790 882371
58438 882371 869755 858851 850941 845138 840258 836506 834160 832479 831248 831704 834651 839221 844482 850510
58424 850510 856971 862732 867956 874484 882966 891567 898553 903894 907277 907120 903053 897117 890934 883863
58410 883863 875324 866607 858765 851022 842838 835290 828797 821855 813794 806453 801402 797805 794772 793359
58396 793359 794281 796060 797553 800036 804674 810101 814657 818870 823691 828441 832589 837380 843564 849615
58382 849615 854290 858759 864111 868993 871946 873941 876470 879332 882401 887159 894172 901409 907331 913373
58368 913373 921101 929464 937289 945959 956985 969282 981444 994287 1008549 1022592 1035148 1047865
58356 1047865 1062311 1076963 1089905 1101823 1113313 1122031 1125976 1127148 1128546 1129863 1129582 1128834 1129493
58343 1129493 1130654 1130788 1131425 1135010 1140891 1146993 1153623 1162152 1171871 1181744 1193397 1208733 1226293 1243458
58329 1243458 1260490 1278949 1297974 1315656 1332298 1348838 1363871 1375631 1385020 1393399 1399555 1402255
58317 1402255 1403554 1406017 1409031 1411452 1415213 1422288 1430634 1437404 1443883 1453005 1464377 1476036 1488692
58304 1488692 1503726 1519340 1533286 1547246 1563997 1582547 1600576 1619088 1639834 1660734 1679011
58293 1679011 1696529 1716817 1739090 1760444 1781593 1805039 1829816 1853621 1878011 1905922 1936119
58282 1936119 1965612 1995350 2027923 2061978 2094724 2127600 2163488 2200656 2235610 2269634 2306281
58271 2306281 2344782 2382443 2421168 2464964 2513138 2562504 2613827 2669382 2726917 2783330 2841671
58260 2841671 2907027 2977951 3049578 3122416 3199990 3280395 3358745 3435731 3515344 3596512 3675705
58249 3675705 3755454 3841344 3932847 4026041 4122725 4227429 4338206 4450335 4566527 4693201
58239 4693201 4829367 4969883 5116911 5276917 5449049 5628154 5816537 6020601 6238580
58230 6238580 6464390 6701015 6956956 7232228 7521728 7829623 8165749 8530518 8918744
58221 8918744 9335675 9793193 10292996 10830559 11412918 12054603 12758934 13522620 14356197
58212 14356197 15279925 16302723 17427089 18672069 20068737 21637130 23393625 25378555
58204 25378555 27650695 30260364 33260439 36742879 40835586 45673521 51415298 58285860
58196 58285860 66559978 76505234 88381998 102483271 119109412 138503873 160866627
58189 160866627 186395221 215210796 247263132 282384636 320189978 359273194 396042395
58182 396042395 424678348 439192606 436417369 417514329 386942338 350153864 311874136
58175 311874136 275478284 242862078 214454569 189596879 167305218 146924624 128277009
58168 128277009 111442299 96525556 83547881 72416866 62949756 54935220 48175684
58161 48175684 42482509 37670668 33581150 30092853 27103731 24519781 22269972 20310514
58153 20310514 18603203 17104118 15777852 14603783 13560720 12621179 11766360 10990701
58145 10990701 10285803 9634832 9028055 8469084 7959894 7492924 7062716 6671719 6319006
58136 6319006 5995558 5696022 5423677 5178843 4953044 4738967 4535985 4342263 4152105
58127 4152105 3965289 3789029 3626575 3473108 3326085 3189818 3066144 2950077 2838757
58118 2838757 2735793 2642807 2555221 2470282 2391140 2319166 2250141 2181857 2118005 2060777 2006736
58107 2006736 1953478 1903491 1857955 1813410 1767862 1723804 1682111 1639231 1593501 1548174 1505331
58096 1505331 1462687 1419009 1376820 1337261 1298163 1259555 1224983 1194990 1165425 1134760 1106969
58085 1106969 1084459 1064211 1043788 1025201 1009636 993978 975941 957601 940838 924158 906787
58074 906787 890886 876961 861909 844411 827459 812996 798900 783853 770152 758894 747332
58063 747332 734050 722007 713314 705526 696267 687203 680166 673428 664979 655709 646445 635625 622828
58050 622828 610881 601667 593431 584760 577376 572229 566777 559147 551474 546126 541996 537360 533043 529863
58036 529863 526175 520745 515103 510477 505475 499135 493008 487728 480987 471548 461915 454246 446918 438004
58022 438004 428880 421333 414161 405810 397553 390969 384865 377778 371086 366659 363675 360566 357845 356331
58008 356331 354763 351852 348645 346449 344598 342509 341552 342538 343706 343620 343588 344837 345823 345005 343834 344333
57992 344333 345923 347261 348831 350973 351637 349032 344543 340317 335975 330417 324839 320990 318239 315142
57978 315142 312236 310556 309088 306461 303603 302036 301060 299285 297450 297020 297365 296953 296133 296207 296953 297410
57962 297410 297893 298994 299880 299831 300076 301839 303935 304609 304338 304442 304327 302612 299751 297042 294153 290075
57946 290075 285476 281807 279023 276452 274868 275398 277301 279061 280825 283730 287716 292089 297272 303974
57932 303974 311485 318712 325953 333742 341077 346763 351443 356258 360425 362061 360556 356411 349892 341613
57918 341613 333249 325826 318405 310216 302610 297031 292584 287759 283100 279889 277663 275469 274229 275223
57904 275223 277371 278662 279296 280748 282687 283530 283363 283659 284584 285059 285058 285439 286000 286016 286256 288193 291555 294807
57886 294807 297590 300640 303887 306772 309841 313791 317492 319230 319397 319672 320072 319112 316489 313228 309470
57871 309470 304493 298773 293822 290022 286616 283569 281452 279913 278321 277484 278477 280177 280310 278717 277299
57856 277299 276972 277120 277871 280334 284349 288389 292058 296502 302065 307579 312344 316836 321243 325153 328829
57841 328829 332875 336542 338394 338778 339537 341034 341611 340370 338332 336289 333568 329715 325611 322055 318680
57826 318680 314970 311089 307244 303513 300557 299166 298819 298008 296172 293917 291377 287998 284129 281097 279333
57811 279333 277895 276172 274573 273241 271570 269274 266454 262453 256267 248441 240924 234668 228850 222861
57797 222861 217441 213345 210422 208627 208438 209550 210406 209841 208208 206418 204895 203944 204054 205211 206759
57782 206759 208424 210742 214247 218879 224258 229859 235048 239757 244840 250878 257075 262496 267783 274148
57768 274148 281017 286365 289329 290911 292126 293058 293814 294765 295588 295468 294398 292975 291005 287827 283967
57753 283967 280812 278627 276578 274737 274190 274854 275089 274010 272535 271610 270961 270212 269728 269727 269780 269699 269785 269905
57735 269905 269595 269187 269457 270051 269810 268824 268533 269509 270848 272061 273803 276348 279094 282103 286270 291343
57719 291343 295578 298079 299840 301756 303346 304300 305457 307214 308543 308660 308232 307856 306764 304171 300631
57704 300631 297020 293326 289446 285929 282908 279448 275043 270717 267631 265606 263986 262912 262788 263310 263835
57689 263835 263829 262363 258427 252586 247137 243664 241481 239326 237413 236734 237503 239539 243312 249435 257853
57674 257853 268679 283148 302702 327717 358056 394195 436785 485603 539928 599635 664856
57663 664856 734184 802892 862360 901679 911855 890289 841662 774800 699150 623214 553576
57652 553576 493591 443426 401885 367639 338964 314174 293136 277003 265668 256778 248114 239686
57640 239686 232586 227123 223095 220646 219563 218655 216991 214965 213310 211968 210884 210786 212034 213521 213812
57625 213812 212700 210801 208479 206068 204228 203085 201747 199609 197302 195541 193974 192079 190225 188820
57611 188820 187357 185362 183431 182316 181803 181469 181582 182182 182240 180906 178820 177072 175672 174157 172761 171765
57595 171765 170512 168332 165678 163142 160231 156457 152769 150358 148712 146426 143408 140759 138899 137382
57581 137382 136218 135789 135563 134425 132426 130910 130720 131281 131618 131316 130397 128993 127307 125388 123054 120374
57565 120374 117816 115465 112702 109246 105834 103199 101116 99265 98179 98271 98655 98159 96981 96189 96110 96407
57549 96407 97279 99297 102317 105732 109526 114020 118672 122189 123712 123194 120973 117881 115338 114302 114301 114255
57533 114255 113885 113577 113464 113605 114480 116195 117696 117917 117221 116616 116070 114915 113485 112929 113532 114581 115799
57516 115799 117681 120326 123103 125516 127456 128683 129073 129342 130486 132415 134030 134681 134703 134533 134109 133187
57500 133187 131665 129661 127733 126633 126278 125475 123375 120559 117903 115127 111580 107815 105046 103458 102280
57485 102280 101239 100672 100459 100086 99601 99402 99240 98527 97422 96628 96377 96556 97316 98404 98455 96374 93010
57468 93010 90084 87864 85470 83051 81745 81547 81143 80155 79780 80686 81838 82068 81561 81179 81405 82409 84141
57451 84141 85904 86732 86515 85943 85295 84255 82933 81871 80915 79365 77432 76291 76384 76939 77511 78681 80655
57434 80655 82415 82977 82603 82198 82249 82783 83537 83852 83255 82456 82852 84723 86877 88339 89316 90108 90251 89428
57416 89428 88263 87491 87043 86510 85827 85021 84022 83170 83237 84420 85960 87174 88232 89503 90799 91693 92059
57399 92059 91914 91301 90604 90431 90858 91331 91449 91354 91234 91132 91350 92343 94065 96064 98287 101013 103967 106406
57381 106406 108261 110299 112930 115643 117814 119204 119485 118270 115968 113708 112013 110296 108002 105432
57367 105432 103059 100831 98596 96560 94891 93371 91783 90188 88704 87479 86825 86780 86718 86145 85672 86264
57351 86264 87746 89187 90568 92706 95510 97833 99307 100864 103000 104979 106384 108021 110452 112815
57337 112815 113982 113929 113189 111924 110353 109142 108519 107757 106305 104713 103792 103572 103778 104484 105581 106335 106256
57320 106256 105825 105658 105509 104744 103275 101486 99769 98484 97796 97204 95978 94412 93768 94575 95923 96874
57304 96874 97558 98311 98904 99386 100637 103034 105405 106338 105926 105346 105357 106066 107553 109694 111774 113143 113968
57287 113968 114768 115646 116596 118050 120419 123483 126799 130285 133945 137585 141249 145310 149659 153516 156572
57272 156572 159555 163055 166613 169666 172577 175911 179394 182440 185098 187641 189856 191560 193206 195125
57258 195125 196747 197396 197270 196842 195977 194692 194172 195762 199215 203044 206571 210665 216469 224167 233073
57243 233073 242318 251398 260420 269769 279372 288696 297604 306570 315706 324354 332239 340248 349323 359185
57229 359185 368907 378182 387242 396110 404873 414177 424522 435446 446240 457144 468883 481336 493662
57216 493662 505717 518480 532983 549351 566940 585002 603302 622393 643087 665403 688426
57205 688426 711467 734838 759054 783850 808509 832703 856501 880041 903674 927992 953145
57194 953145 978500 1003378 1027641 1051263 1073985 1095805 1117095 1137815 1157387 1175885 1194539
57183 1194539 1214416 1235439 1257289 1280381 1305135 1331140 1357939 1385965 1415793 1447129 1479373
57172 1479373 1512582 1547097 1582918 1620242 1659837 1702034 1746075 1791290 1838064 1886722 1936349
57161 1936349 1985774 2034815 2083421 2130548 2175261 2218149 2260123 2300462 2337622 2371578 2403825
57150 2403825 2435368 2466168 2496322 2526250 2555721 2584014 2611145 2637839 2664437 2690834 2717285
57139 2717285 2744073 2770539 2795580 2819005 2841323 2862465 2881910 2899894 2917203 2933821 2949003
57128 2949003 2962750 2976073 2989835 3004452 3020866 3040701 3065285 3095328 3131459 3173985 3222087
57117 3222087 3274263 3329791 3389041 3452480 3520392 3593757 3674679 3765934 3870652 3992178 4133386
57106 4133386 4296252 4482813 4696521 4942355 5226539 5557465 5946870 6409518 6962324
57097 6962324 7624715 8419187 9369914 10499875 11828311 13368559 15126176 17099278 19281845
57088 19281845 21667178 24249334 27023969 29989023 33142362 36476904 39978093 43620433
57080 43620433 47348418 51039080 54475080 57366434 59423025 60436251 60325026 59134972
57072 59134972 57007690 54139632 50742980 47017154 43134497 39235968 35431000 31800276
57064 31800276 28401179 25272339 22434715 19892310 17636022 15648835 13909095 12392508
57056 12392508 11074572 9932072 8942411 8083193 7334056 6678352 6102192 5593001 5140232
57047 5140232 4736465 4376136 4053480 3762745 3499689 3261557 3045861 2850121 2672363
57038 2672363 2510895 2363941 2230257 2109460 2000876 1902663 1813013 1731701 1659446 1596256
57028 1596256 1541418 1494726 1456637 1427363 1406666 1394396 1390606 1395635 1410692 1437218 1473425 1510715
57016 1510715 1534842 1532371 1497381 1433345 1349835 1257438 1164330 1075586 994036 921075 856997
57005 856997 801404 753651 712748 677230 645855 618441 595338 576133 559614 545009 532273
56994 532273 521019 510207 499334 489043 480099 472570 466472 462333 460500 460631 462504 466743 474108
56981 474108 484450 496577 508496 517453 520716 517200 508017 495185 480332 464823 450107 437178
56969 437178 426282 417592 411494 407760 405367 403831 404012 406902 412301 419458 428379 439638 453303 468824
56955 468824 485576 502577 517690 527812 530195 523733 509372 489532 466863 443365 420654 400451
56943 400451 383966 371023 360817 353562 350327 351210 354958 360738 369105 380773 395583 413282 434240
56930 434240 458668 485810 514128 541054 562176 572272 568511 552122 526599 495475 462265 430634
56918 430634 402802 378491 356671 337544 321768 308702 296953 286124 276732 268805 261826 255774
56906 255774 251114 247826 245275 242859 240196 237125 234154 232356 232094 232478 232808 233925 237229 242976 250399
56891 250399 259007 268854 280035 292828 307865 325396 344760 365172 386218 406649 423481 433509
56879 433509 435451 430016 418667 403376 386846 371544 358557 348142 340858 337277 337206 340320 347173
56866 347173 358618 374677 394975 419770 449495 483742 521837 563987 610536 659960 708215
56855 708215 749662 778123 788314 778283 750937 712522 669580 627362 589667 558491 534112
56844 534112 516644 507133 506294 513130 526386 546799 576299 615307 662394 716367 777136 844576
56832 844576 917834 995208 1072454 1140794 1188619 1206740 1192251 1148287 1082031 1003088 921448
56821 921448 844800 777252 720206 673580 636395 607749 587904 577776 577201 584721 599331 621374
56809 621374 651274 688379 731618 780382 833735 888635 939009 976472 992760 983207 949012 896231
56797 896231 832513 764697 698311 637429 584129 538676 500740 470323 447605 432510 424504 422555
56785 422555 425515 433017 445649 463630 485693 510007 535664 562073 586933 605836 614103 608689
56773 608689 588985 557196 517962 476394 435886 398044 364144 335333 311462 291027 272747
56762 272747 256435 242152 229425 217645 206659 196729 188359 182048 177615 173991 170374 167267 165485
56749 165485 164494 162903 160432 158146 156688 155586 154501 153847 153735 153381 152254 150934 150267 150233 150166 149561 148336
56732 148336 146719 145119 143773 142462 140945 139540 138728 138428 138311 138618 139841 141737 143488 144764 145827
56717 145827 146681 147076 147279 147882 148807 149391 149559 150053 151342 153128 155017 156900 158655 160187 161819 163893
56701 163893 166022 167454 168111 168534 168950 169170 169178 168993 168244 166858 165851 166310 167779 168811 168933 168884 169052 169016
56683 169016 168603 168083 167306 165967 164775 164939 166289 167282 167145 166702 166810 167316 167987 169150 170832 172363 173376
56666 173376 174227 175125 175828 176502 177693 179126 179690 179082 178335 178293 178571 178540 178301 178307 178856 180267 182573 184862
56648 184862 186016 186265 186785 187604 187350 185488 183294 182002 181388 180931 180995 181837 182556 182047 180294 177961 175481
56631 175481 173239 171860 171603 171991 172538 173167 173712 173810 173584 173560 173690 173389 172654 172040 171371 169820 167536 165760
56613 165760 164876 163774 161734 159490 157769 156281 155001 154963 156660 158830 160037 160465 161145 162292 163425
56598 163425 164304 164781 164452 163310 162163 161690 161709 161846 162129 162475 162544 162547 163194 164411 165273 165634 166466 168039 169279
56579 169279 169713 170418 172000 173153 172618 171280 170873 171610 172513 173187 173910 174700 175592 177203 179872 182874 185538
56562 185538 188517 192928 198909 205991 214169 223632 234118 245351 257253 268733 277238 280751 279640
56549 279640 275624 269832 262960 256244 250760 246236 241779 237324 233339 229813 226661 224465 223584 223056 221600
56534 221600 219301 217207 215775 214798 214389 214824 215684 216143 215904 215056 213504 211371 209515 208786 209071 209714 210321
56517 210321 210571 210023 208910 208339 208846 209448 208959 207430 205526 203385 201062 199170 197993 196800 195163 194013
56501 194013 194243 195062 195040 194060 192941 191826 190287 188462 186870 185545 184495 184389 185626 187297 188225 188449
56485 188449 188539 188225 187101 186057 186493 188381 190364 191454 191525 190597 188857 187046 185751 184712 183784 183920
56469 183920 185962 189034 191452 192839 194082 195640 197163 198508 199844 200935 201351 201217 200892 200302 199395
56454 199395 198751 198887 199481 200092 200881 201834 202226 201906 202148 203974 206570 208626 210213 211892 213001 212624 211522
56437 211522 211281 211993 212454 212176 211604 210777 209388 207816 206586 205246 203296 201671 201608 202474 202545 201676 201376
56420 201376 202378 203852 205074 206176 207120 207437 207228 207172 207451 207806 208519 210156 212348 214019 214776 215077 215241
56403 215241 215305 215607 216415 217273 217681 218025 218962 220410 222029 223905 225767 226596 226231 226271 227836 229532 229421
56386 229421 228011 227376 228110 229256 230543 232505 234742 236161 236743 237296 237770 237594 237244 237567 238030 237585 236845
56369 236845 237370 239130 240749 241944 243623 245798 247570 249054 251200 253730 255241 255371 255046 254790 254608
56354 254608 255153 256933 258799 259404 259721 261699 264783 266441 266032 265416 265641 265778 265400 265496 266309 266809 266990
56337 266990 268318 271212 274265 276612 278941 281648 284150 286635 290211 294690 298383 300790 303335 306848
56323 306848 310482 313826 317748 322292 325934 327917 329297 330767 331477 330948 330177 329804 329081 327722 326997 327873
56307 327873 329640 331370 333284 335857 338957 342494 346502 350180 352525 354260 357371 362273 367383 371959
56293 371959 377244 384086 391459 398205 404501 410802 416988 423251 430165 437440 444245 451082 459441 469375
56279 469375 479477 489442 500342 512101 523272 533866 545793 559801 574621 589928 607359 627499
56267 627499 648545 669360 691339 715857 742264 769915 799971 833636 870686 911128 956339
56256 956339 1007188 1063146 1124635 1194214 1274008 1363877 1463466 1574067 1697122 1832890 1981966
56245 1981966 2146037 2325513 2518104 2721022 2932738 3151290 3372754 3592734 3807523
56236 3807523 4012668 4202356 4371449 4516194 4632033 4713175 4755938 4760628 4728957 4661955
56226 4661955 4561749 4432963 4280630 4108648 3921614 3725777 3526461 3326453 3128158
56217 3128158 2934952 2749014 2570342 2399622 2239616 2092015 1955414 1828207 1710935
56208 1710935 1603849 1504846 1412264 1327372 1251652 1183714 1121311 1064393 1013769 968576 927454
56197 927454 890469 857723 827766 799526 774049 752289 732985 714780 698433 684708 672040
56186 672040 658723 645713 634881 626022 617835 610265 603754 597613 591246 585573 581407 577935 574451
56173 574451 571807 570520 569442 568010 567699 569373 571442 572589 574023 576955 580163 582280 584226 587159
56159 587159 590358 593475 598392 606290 615151 622761 629977 638559 648168 658151 669947 684852 701651
56146 701651 719235 739358 763978 792176 822615 856779 896775 942118 991717 1046788 1108702
56135 1108702 1176133 1247308 1322650 1401737 1479789 1550737 1612033 1663676 1705154 1737203 1764373
56124 1764373 1791614 1819344 1844819 1866346 1882852 1891585 1890293 1880382 1864676 1843707 1817181 1786675
56112 1786675 1753038 1713075 1662730 1602148 1534419 1461512 1385180 1309745 1239779 1176367 1119006
56101 1119006 1069268 1028966 996637 969607 947660 931215 918202 906670 898221 894819 894360 893501
56089 893501 892652 893987 896833 899357 902594 908284 914874 920132 925548 933608 942934 950751 957837 966350
56075 966350 975209 982671 990965 1003068 1017121 1029427 1040699 1053864 1068018 1080444 1092517 1107599
56063 1107599 1124851 1141088 1157002 1175556 1195837 1214528 1231984 1250974 1270940 1289333 1306929
56052 1306929 1325935 1344673 1360215 1374355 1390818 1408630 1424697 1440695 1460511 1482909 1503860
56041 1503860 1524308 1548349 1575477 1601969 1628113 1656521 1685107 1709648 1731815 1756720 1784030
56030 1784030 1809602 1834356 1863084 1895766 1928598 1962399 2001318 2044347 2086916 2129917 2178327
56019 2178327 2231926 2286344 2342070 2403212 2468505 2533125 2598214 2668868 2743962 2818231 2893250
56008 2893250 2975644 3065312 3156300 3248496 3347286 3452391 3558647 3667247 3784435 3909645
55998 3909645 4037047 4168174 4310515 4464146 4622793 4787568 4966116 5158606 5358653
55989 5358653 5567845 5794809 6040162 6297536 6569340 6865751 7188285 7530872 7897124
55980 7897124 8299295 8740222 9214357 9726549 10290747 10910459 11581121 12311922 13123655
55971 13123655 14025194 15015649 16110239 17339397 18722710 20271731 22020014 24022083
55963 24022083 26323780 28968240 32035070 35641887 39910949 44979362 51047808 58374692
55955 58374692 67216032 77814795 90443175 105387118 122877345 143094107 166223792
55948 166223792 192405316 221615678 253705218 288392494 324652525 359589272 388063271
55941 388063271 404227023 404287852 388348247 359963168 324152539 285568792 247672788
55934 247672788 212642187 181547539 154657907 131801683 112612477 96616314 83293196
55927 83293196 72172492 62876009 55081836 48502262 42912095 38153881 34094516 30603727
55919 30603727 27579626 24957888 22680706 20682698 18915127 17355394 15981206 14758205
55911 14758205 13660802 12681568 11810572 11025642 10310728 9664257 9081549 8546936 8050260
55902 8050260 7593968 7177075 6788211 6420950 6080604 5769531 5480006 5207325 4956032
55893 4956032 4727474 4514317 4312597 4126643 3957252 3797341 3644040 3503018 3376179
55884 3376179 3256824 3141561 3035476 2940816 2851808 2765589 2687569 2620911 2560678 2502842 2449062
55873 2449062 2398002 2341921 2277156 2209144 2142541 2075117 2005727 1939279 1878852 1821047 1763747
55862 1763747 1710611 1663543 1618616 1573911 1533782 1500796 1470657 1439430 1408815 1380102 1350068
55851 1350068 1317316 1286042 1258939 1232537 1203740 1174936 1148564 1122568 1095307 1069290 1046104
55840 1046104 1023092 998764 976095 956935 938506 918939 900904 886287 872607 858111 845120
55829 845120 834824 824070 810916 798317 788774 780311 771146 763199 757283 749783 738055 724667 712595
55816 712595 700668 687401 674923 665227 656521 646933 638056 631473 625633 619409 614874 613333 612457 610549
55802 610549 609832 612290 616098 619382 623644 630160 636687 641084 644627 648439 650194 647738 642605 636781
55788 636781 629348 619548 609679 601571 593442 583610 574225 567928 563718 559244 554233 548569 540090 527622
55774 527622 513569 500538 488200 476209 466961 462218 460065 458522 459211 464006 470764 475813 478214
55761 478214 478431 475554 469253 462023 456002 449733 441210 431681 423267 415267 406258 397484 390650 384422
55747 384422 376639 368064 360555 353396 344912 336084 329145 324014 319225 314945 312075 309864 307361 305747
55733 305747 306285 307414 306775 304711 302970 301480 299286 297136 296110 294996 292002 287867 284471 281622 278039
55718 278039 274283 271834 270292 268318 266414 266108 267250 268628 270312 272948 275817 278047 280661 284931
55704 284931 289724 293016 294947 296803 297948 296522 292492 287510 282271 276293 269737 263406 257526 252398
55690 252398 249240 248521 248482 247327 245810 245696 246969 248658 251024 254551 258038 260237 262320 266219 271444
55675 271444 275977 279331 282211 284140 284111 282926 282271 282027 280925 279249 278394 278301 277797 277006 276996 277412 276887
55658 276887 275579 274992 275433 275854 276019 276722 277984 279030 279904 281211 282385 282038 279845 276480 272034 266271
55642 266271 260075 254813 250486 246088 241449 237090 232710 227489 221570 215725 210015 204256 199219 195780
55628 195780 193482 191451 189989 189688 189837 189476 189165 189798 190448 189456 187113 185285 184781 184894 185016 184896 183866
55611 183866 181648 179405 178293 177591 176029 174090 172995 172204 170192 167169 164828 163756 163119 162515 162126
55596 162126 161475 160042 158673 158401 158426 157372 155886 155645 156324 156153 155166 155221 156711 157838 157522 156727 156525
55579 156525 156953 158147 160636 164043 167299 170369 174104 178338 182056 185603 190666 197774 205645 213310
55565 213310 221041 228762 235308 239741 241966 241829 239156 234855 230394 226022 220975 215373 210215 205559
55551 205559 200595 195561 191611 188588 184928 180198 175768 172534 169901 167639 166779 167803 169540 170838
55537 170838 171989 173683 175743 177671 179388 180836 181769 182381 183198 184038 184026 182801 180806 178349 175453 172602
55521 172602 170337 168089 164737 160414 156445 153333 150151 146163 141864 138163 135567 134214 133640 132665 130652
55506 130652 128660 128122 128662 128693 127822 126975 126358 125192 123523 122398 122034 121547 120817 120835 121776 122380 121781 120505
55488 120505 119248 118032 116959 116421 116287 116183 116684 118677 121437 122945 122424 120955 119415 117634 115946
55473 115946 115620 117004 118838 120072 120867 121283 120720 119383 118677 119250 120000 119864 119198 118649 118017 117131 116636
55456 116636 116997 117700 118097 118091 117511 115954 113820 112309 111845 111589 110975 110535 110754 111277 111745 112236 112494 111967
55438 111967 110993 110612 110834 110521 109410 108711 109164 110039 110703 111571 112752 113319 112877 112445 112825 113391 113362 113000
55420 113000 112667 111974 110846 110208 110627 111400 111839 112271 112953 113300 113234 114022 116567 119837 122108 122892 122663 121637
55402 121637 119893 117982 116454 115370 114838 115147 115819 115639 114325 113069 112695 112568 112121 112123 113242 114583 114913
55385 114913 114374 113748 113016 111906 111033 111132 111746 111936 111824 112302 113596 115087 116178 116542 115929 114501 112970
55368 112970 111898 111331 111429 112508 113966 114335 113197 112008 112045 112579 112207 111036 110268 110326 110685 111112 111890 113049
55350 113049 114278 115349 115963 115650 114547 113690 113844 114535 114940 115038 115137 114972 114143 112916 111785 110743 109766
55333 109766 109393 110078 111404 112572 113153 112881 111574 109900 109321 110396 111898 112465 112366 112690 113590 114357 114628
55316 114628 114492 113888 112838 111849 111310 110965 110597 110561 110897 110730 109465 107832 106834 106347 105763 105285 105521 106399
55298 106399 107506 108901 110550 111615 111454 110821 110933 111764 112331 112217 111743 111064 110244 109860 110382 111169 111141 110252
55280 110252 109397 109122 109369 110102 111174 111849 111514 110738 110658 111485 112529 113357 113972 114043 113137 111664 110598 110174
55262 110174 109721 108882 108156 108084 108563 109145 109478 109397 108953 108409 107912 107332 106636 106091 105908 106054 106668 108004 109652
55243 109652 110510 110013 108708 107260 105782 104692 105061 107125 109421 110518 110787 111274 111623 110620 108331 106236
55227 106236 105403 105722 106806 108375 109841 110628 110999 111674 112684 113460 113873 114236 114401 113863 112781 111948 111663
55210 111663 111426 110834 110096 109592 109481 109783 110328 110761 110995 111429 112299 113191 113660 113814 113764 113107 111720 110429
55192 110429 110016 110037 109588 108786 108559 109291 110612 112205 113908 115370 116423 117489 118798 119643 119261 117999
55176 117999 116731 115619 114448 113578 113433 113527 113198 112900 113443 114378 114492 113713 113168 113429 114011 114550 115199 115787
55158 115787 115840 115537 115556 115878 115819 115295 115000 115273 115786 116363 117098 117697 117737 117504 117527 117385 116240 114444 113335
55139 113335 113353 113698 113937 114517 115419 115760 115259 114821 115014 115103 114293 113038 112359 112575 113323 114243 115152 116000 116974
55120 116974 118242 119430 119915 119661 119193 118786 118415 118391 119120 120169 120550 120105 119697 119848 120068 119784 119119 118527
55102 118527 118416 119193 120817 122215 122114 120681 119416 119245 119650 119840 119764 119631 119481 119594 120383 121482 121861
55085 121861 121301 120864 121461 122801 124235 125793 127710 129634 130921 131313 130950 130183 129600 129671 130169 130532 130820
55068 130820 131597 132766 133441 133196 132534 131826 130730 129091 127563 126818 126819 127218 127745 127913 127211 125986 125329 125591
55050 125591 125752 124743 122667 120325 118306 117034 116915 117791 118835 119508 120046 120649 120914 120506 119736 118992 118249
55033 118249 117567 117332 117492 117317 116534 115995 116544 117829 118956 119754 120653 121693 122449 122725 122743 122742 122766 122729 122492
55014 122492 122100 122055 122923 124562 126200 127364 128182 128655 128416 127488 126580 126272 126475 126934 127608 128223 128258 127759
54996 127759 127494 127849 128253 128131 127750 127610 127647 127609 127687 128200 129104 130191 131369 132345 132627 132205 131696 131455 131128
54977 131128 130474 129979 130160 130765 131143 130951 130208 129218 128688 129278 130709 131950 132527 132875 133177 132856 131704 130543
54959 130543 130104 130114 130188 130765 132284 134179 135540 136213 136523 136568 136518 136951 138014 138805 138450 137266 136110 135185
54941 135185 134341 133864 133952 133890 132849 131165 129884 129364 129346 129997 131741 134167 136264 137798 139528 141950 144722
54924 144722 147451 150198 152994 155601 158051 160928 164824 169880 175932 182712 189845 196960 203822 210046
54910 210046 214766 216963 216171 212658 207086 200227 192820 185372 178165 171638 166401 162590 159523 156412
54896 156412 153203 150402 148393 147244 146869 146952 146989 146762 146506 146332 145914 145134 144580 144886 145965 147402 149252
54879 149252 151842 155064 158502 162156 166531 172040 178638 185872 193083 199761 205960 211963 217306 220645
54865 220645 221016 218757 214787 209539 203156 196164 189158 182148 174915 167820 161629 156735 153066 150558
54851 150558 149141 148403 147724 146671 144955 142376 139217 136295 134181 132610 131108 129755 128873 128395 128090
54836 128090 128002 128133 128067 127514 126853 126633 126896 127481 128465 129679 130395 130242 129942 130282 130843 130647 129721 129022 129035
54817 129035 129368 129534 129280 128299 126596 125135 125211 127076 129827 132582 135042 137002 138151 138504 138410 138075 137563
54800 137563 137158 137089 137054 136659 136161 136095 136358 136371 136005 135526 134775 133334 131514 130364 130548 131882 133955 136442
54782 136442 138747 140173 140665 140804 140976 141133 141377 142066 143215 144464 145758 147488 149849 152621 155705 159375
54766 159375 163929 169489 175993 182958 189551 195557 201914 209456 217335 223697 227768 230228 231560 231235
54752 231235 228743 224292 218120 210217 201216 192581 185234 178696 172167 165758 160139 155660 152363 150271
54738 150271 149028 147822 146315 145215 145320 146373 147484 148385 149566 151358 153458 155401 157033 158494 160049
54723 160049 162007 164615 167968 172056 176857 182366 188585 195379 202218 208204 212654 215557 217170 217316
54709 217316 215483 211521 205790 198758 190922 183063 176031 170143 165212 161140 157999 155520 153106 150546
54695 150546 148288 146865 146430 146835 147734 148544 148784 148517 148039 147166 145430 143012 140846 139628 139257 139413 140047
54678 140047 141012 141749 141811 141441 141331 141941 143122 144197 144431 143685 142533 141463 140244 138491 136580 135327
54662 135327 134929 134926 135028 135186 135005 134023 132689 132134 132792 134045 135333 136652 137767 138071 137728 137908 139255
54645 139255 140937 141843 141977 141941 141778 141178 140292 139561 139091 138817 138897 139358 139740 139746 139823 140427 141110 141063 140295 139516
54625 139516 139012 138338 137141 135726 134738 134638 135373 136261 136388 135506 134368 133886 134163 134716 135279 135886 136397 136540
54607 136540 136389 136383 136876 137943 139472 141094 142195 142339 141601 140292 138676 137268 136915 137942 139455 140162
54591 140162 139815 139231 138953 138659 138049 137565 137729 138197 138076 137065 135805 135055 134907 134964 134989 135015 134945 134502 133749
54572 133749 133248 133391 133877 134243 134637 135475 136498 136974 136926 137405 139112 141331 142725 142809 142143 141390 140744 140206
54554 140206 139881 139895 140286 141069 142296 143950 145754 147105 147399 146693 145892 145873 146521 147079 147390 148140 149744 151669
54536 151669 153208 154306 155168 155567 155189 154343 153744 153724 154076 154444 154489 153881 152625 151246 150266 149652 149086 148529
54518 148529 148039 147278 145817 143902 142399 141921 142385 143406 144630 145588 145754 145020 143869 142841 142045 141347
54502 141347 140806 140683 141093 141864 142722 143474 144007 144213 144046 143584 142949 142210 141454 140965 141107 141989 143370 144930
54484 144930 146375 147279 147296 146827 146976 148254 149651 149715 148405 147133 147031 147999 149534 151497 153587 154920
54468 154920 154923 154212 153890 154263 154823 155272 155839 156589 157031 156682 155751 155036 155158 155949 156650 156789 156750 157304 158667
54449 158667 160338 161735 162564 162573 161575 159936 158596 158229 158658 159261 159582 159384 158575 157454 156641 156403 156275 155640
54431 155640 154438 153138 152265 152084 152488 152964 153085 153089 153589 154566 155273 155394 155612 156556 157819 158649 159128 159888
54413 159888 160985 161791 161970 161907 162115 162694 163438 164159 164789 165334 165747 165861 165652 165595 166365 167958 169516 170255
54395 170255 170277 170200 170366 170663 170784 170420 169570 168855 169079 170259 171627 172784 174125 175763 176894 176865 176121 175349
54377 175349 174398 172930 171522 171032 171286 171464 171453 171765 172365 172816 173477 175336 178484 181853 184669 187138 189452
54360 189452 191294 192843 195214 199108 203741 207792 210847 213177 214611 214548 212950 210587 208157 205591 202360
54345 202360 198254 193818 190053 187590 186095 184674 182894 181144 179883 178954 177862 176467 175057 173871
54331 173871 172860 171865 170849 169903 169128 168479 167754 166867 166134 166114 167050 168569 170039 171097 171755 172126 172278
54314 172278 172324 172440 172606 172432 171533 170115 168939 168491 168398 167968 167124 166334 165714 164841 163566 162486 162214 162613
54296 162613 163015 162856 161820 159861 157604 156329 156918 158875 160767 161561 161254 160470 159924 160128 161117 162400
54280 162400 163478 164398 165595 167285 169189 170713 171278 170758 169757 169141 169055 168800 167897 166792 166166 166167 166793
54263 166793 168409 171116 174106 176431 178066 179410 180101 179397 177644 176291 176258 177099 177960 178640 179418 180474
54247 180474 181753 182971 183653 183586 183242 183207 183276 182709 181376 179902 178664 177443 176235 175566 175630 175772 175250 174068
54229 174068 172746 171784 171535 172068 172832 173026 172607 172412 172969 173789 174236 174460 174876 175180 174634 173218 171840 171363
54211 171363 171750 172237 172177 171637 171225 171325 171648 171730 171672 171913 172333 172169 171000 169307 167868 167045 166918 167576 168853
54192 168853 170140 170837 170839 170361 169620 168906 168624 168916 169502 170138 170982 172196 173528 174604 175385 175989 176265 176012
54174 176012 175505 175415 176108 177247 178169 178548 178601 178679 178748 178467 177842 177507 178016 179044 179690 179558 179059 178661 178321
54155 178321 177746 176780 175374 173688 172366 172272 173658 175921 178334 180564 182313 183049 182541 181311 180096 179109
54139 179109 178210 177570 177692 178767 180287 181295 181043 179618 178014 177274 177426 177489 176622 174908 172901 170972
54123 170972 169440 168875 169631 171259 172793 173585 173627 173286 173061 173415 174470 175877 177205 178328 179243 179798 179961
54106 179961 180209 181170 182907 184857 186493 187774 188952 190258 191874 193952 196467 199098 201433 203298 204891
54091 204891 206565 208546 210884 213591 216571 219337 221070 221186 219734 217094 213558 209502 205607 202346
54077 202346 199408 196300 193446 191990 192352 193634 194737 195465 196184 197019 197942 199208 201075 203312 205475
54062 205475 207525 209702 211887 213591 214646 215552 216965 218942 220875 222176 222967 223926 225344 226622 226968
54047 226968 226339 225228 223795 222012 220653 221162 224040 228039 231478 233878 235813 237761 239921 242843 247371
54032 247371 253775 261374 269124 276347 282958 289272 295561 301658 307165 312123 317129 322531 327847 332317
54018 332317 335669 337957 339045 338828 337751 336492 335164 333302 330546 326859 322180 316440 309996 303580
54004 303580 297668 292210 287030 282151 277607 273264 268966 264644 260222 255689 251328 247655 244964 243106
53990 243106 241737 240593 239430 237897 235677 232768 229615 226944 225381 225041 225431 225829 225804 225386 224832 224324
53974 224324 223880 223501 223363 223763 224773 226024 227005 227550 227899 228314 228859 229538 230344 231110 231698 232433 234019 236805
53956 236805 240383 244147 248045 252514 257870 264085 271107 279136 288412 298801 309541 319342 326732 330491
53942 330491 330097 326192 320558 315133 310690 306822 303435 301592 302201 304457 306615 308134 309983 312785 315856
53927 315856 318360 320329 322019 323254 324137 325603 328508 332731 337800 343730 350506 357429 363902 370378
53913 370378 377619 385432 393105 400779 409327 418882 428408 436778 443520 448505 451717 453528 454551 455003
53899 455003 454673 453488 451563 448735 444745 440009 435551 431870 428340 423995 418531 412300 405622 398369
53885 398369 390095 380562 370223 360092 350901 342564 334620 326962 319757 313045 306966 302079 298694 296027
53871 296027 292751 288497 284097 280300 276928 273520 270090 266867 263800 260751 257808 255052 252291 249386
53857 249386 246570 244235 242539 241431 240832 240594 240400 239915 238967 237641 236335 235673 235995 236834 237175 236318 234346
53840 234346 231739 228909 226223 224180 223251 223549 224695 225976 226757 226955 227110 227773 228850 229692 229801 229253
53824 229253 228534 228190 228563 229579 230777 231807 232855 234408 236598 238989 240949 242051 242299 242214 242653 244217
53808 244217 246808 249869 252894 255567 257755 259735 262201 265642 269890 274649 280136 286633 293575 299873
53794 299873 305189 310245 315680 321169 325963 329847 333174 336176 338624 340183 340978 341648 342674 343679 343733
53779 343733 342481 340565 338621 336374 333238 329348 325240 320829 315583 309629 303829 298630 293615 288377
53765 288377 283141 278280 273871 269992 266861 264379 262013 259457 256990 254934 253150 251245 248880 245809
53751 245809 242109 238559 236180 235130 234502 233472 232097 230791 229629 228577 227879 227670 227549 226987 225950
53736 225950 224813 223973 223799 224544 225906 227050 227463 227564 228127 229368 230926 232413 233598 234340 234772 235388
53720 235388 236570 238201 239979 241861 243845 245617 246798 247356 247460 247219 247019 247778 250226 253920 257524
53705 257524 260162 262082 263948 266001 268144 270424 273017 275847 278582 281050 283488 286288 289642 293542
53691 293542 297972 302760 307265 310628 312650 314135 315952 317951 319279 319619 319454 319064 318014 316007 313672
53676 313672 311967 311110 310559 309859 309039 308272 307628 307189 307063 307140 307086 306746 306432 306640 307461 308402 308882 308845 308658
53657 308658 308437 307805 306588 305356 304850 305068 305431 305749 306445 307742 309171 310062 310113 309361 308076 306886 306585
53640 306585 307492 309203 311148 313073 314929 316694 318553 320813 323396 325719 327360 328540 329700 330918
53626 330918 332018 332981 333979 335246 337178 340232 344430 349158 353703 357912 362160 366863 372067 377239 381437
53611 381437 384106 385892 388200 391689 395659 399202 402400 405882 409628 412975 415688 418412 421926 426258
53597 426258 430622 433991 435777 436239 436297 436791 437851 438904 439234 438552 437246 436113 435615 435415 434841 433697
53581 433697 432244 430558 428500 426373 424864 424059 423115 421276 418725 416072 413621 411570 410346 410072 410107
53566 410107 409737 409013 408324 407518 406142 404389 403043 402512 402493 402614 402827 403112 403272 403181 402899 402473 401926 401473
53548 401473 401445 401951 402792 403660 404278 404489 404486 404868 406193 408533 411605 415115 418745 422115 425181 428499 432697
53531 432697 437784 443312 449101 455401 462460 470285 478781 487756 496869 505972 515489 526124 538113 551016
53517 551016 564229 577473 590797 604396 618507 633398 649371 666752 685646 705680 726272
53506 726272 747236 768856 791235 813978 836767 859737 882947 905922 928248 950289 972679
53495 972679 995252 1017051 1037361 1056364 1074807 1093342 1112123 1130752 1148710 1166009 1183171
53484 1183171 1200374 1217113 1233097 1249059 1266080 1284417 1303460 1322488 1340836 1357710 1372741
53473 1372741 1386615 1400301 1413595 1425068 1433545 1438959 1441734 1442030 1439872 1435424 1428858 1420295 1410017
53460 1410017 1398437 1385880 1372763 1359904 1348073 1337200 1326497 1315297 1303190 1289459 1273270
53449 1273270 1254735 1235101 1215521 1196182 1176926 1158099 1140217 1123220 1106634 1090356 1074888
53438 1074888 1060962 1049154 1039645 1032054 1025625 1019821 1014684 1010457 1007046 1004038 1001143 998472 996471
53425 996471 995687 996530 999115 1003228 1008414 1014132 1020138 1026850 1035135 1045500 1057707 1071405 1086753 1104017
53411 1104017 1122873 1142712 1163517 1185898 1210302 1236722 1265108 1295475 1327517 1360669 1394682
53400 1394682 1429757 1466122 1503974 1543762 1585875 1629996 1675412 1722081 1770683 1821364 1873178
53389 1873178 1925142 1977237 2029825 2082586 2134652 2185574 2235669 2285457 2335036 2383811 2430612
53378 2430612 2474309 2514590 2552032 2587260 2620209 2650233 2676569 2698550 2715704 2727923 2735298
53367 2735298 2737764 2735111 2727386 2714803 2697158 2673890 2645006 2611576 2574964 2535919 2494657 2451541
53355 2451541 2407285 2362662 2318223 2274105 2230050 2185917 2142324 2100440 2060998 2023858 1988547
53344 1988547 1954599 1921126 1886720 1850411 1812493 1774090 1736203 1699429 1664164 1630548 1598434
53333 1598434 1567771 1538782 1511537 1485754 1461350 1438813 1418531 1400076 1382530 1365236 1347817
53322 1347817 1329890 1311341 1292661 1274447 1256788 1239556 1222957 1207193 1191900 1176661 1161955
53311 1161955 1148852 1137835 1128635 1121205 1116009 1113085 1111594 1110760 1110762 1112262 1115470 1120132 1126180 1133898
53297 1133898 1143502 1154961 1168239 1183452 1200664 1219669 1240018 1261325 1283588 1307234 1332673
53286 1332673 1359647 1387015 1413300 1437557 1459745 1480268 1499221 1516216 1531022 1544128 1556298
53275 1556298 1567541 1576857 1583115 1585899 1585374 1581724 1575189 1566375 1556055 1544541 1531537 1516577 1499385
53262 1499385 1479948 1458576 1435972 1412915 1389763 1366420 1342827 1319262 1296047 1273162 1250284
53251 1250284 1227141 1203735 1180327 1157289 1134956 1113489 1092729 1072170 1051140 1029208 1006446
53240 1006446 983218 959763 936181 912789 890120 868463 847644 827507 808354 790626 774320
53229 774320 759055 744665 731401 719553 709041 699408 690015 680252 669748 658424 646294 633286
53217 633286 619394 604874 590119 575334 560512 545662 530896 516313 502005 488199 475253
53206 475253 463433 452754 443050 434199 426276 419474 413720 408407 402729 396353 389529 382506 375204 367700
53192 367700 360605 354528 349355 344512 339765 335249 330782 325874 320625 315997 312711 310245 307474 304125
53178 304125 301014 298814 297140 295147 292630 290109 287998 286241 284783 283875 283572 283296 282340 280679 278878
53163 278878 277307 275885 274594 273743 273493 273519 273327 272636 271308 269363 267344 266216 266401 267148 267349 266770 266002
53146 266002 265354 264442 262951 261271 260098 259685 259687 259532 258837 257681 256566 255920 255581 254994 253955 252865 252188
53129 252188 252022 252370 253483 255610 258566 261871 265110 267959 270029 271127 271601 272068 272738 273341 273770 274403
53113 274403 275581 277083 278386 279211 279509 279096 277788 275871 274051 272790 271970 271330 270917 270867 270926 270499 269175
53096 269175 267147 265122 263837 263474 263506 263296 262838 262614 262696 262466 261511 260270 259319 258403 256864 254858 253357
53079 253357 252834 252646 252036 251231 251108 252070 253685 255268 256468 257277 257729 257778 257462 257051 256753 256292 255145 253411
53061 253411 252023 251649 251760 251410 250626 250228 250428 250552 250270 250165 250685 251427 251943 252514 253521 254683 255618 256594
53043 256594 257965 259286 259775 259415 258882 258580 258440 258456 258677 258745 258204 257279 256706 256701 256785 256714 256890 257522 258036 257730
53023 257730 256755 256001 256151 257055 257938 258121 257636 257128 257088 257332 257424 257383 257594 258174 258934 259938 261513 263594 265546
53004 265546 266896 267784 268465 268734 268246 267151 266020 265213 264707 264519 265003 266474 268573 270226 270527 269663 268771
52987 268771 268742 269424 270179 270860 271808 273140 274654 276430 278865 281916 284842 286985 288421 289537 290362 290708
52971 290708 290705 290735 290879 290832 290391 289791 289508 289886 290942 292366 293721 294712 295303 295553 295467 295064 294454 293716 292798
52952 292798 291711 290718 290110 289844 289602 289185 288624 287839 286484 284398 282047 280216 279199 278583 277867 277046 276337
52935 276337 275659 274733 273637 272800 272379 272035 271543 271247 271546 272143 272182 271112 269156 266978 265169 264025 263481
52918 263481 263116 262474 261553 260905 261099 262103 263274 263920 263856 263435 263110 262973 262747 262232 261718 261850 262981 264653
52900 264653 265838 265857 265080 264532 264752 265259 265295 264791 264238 263836 263266 262357 261495 261169 261462 262154 263026 263859 264401
52881 264401 264602 264715 265016 265544 266203 266897 267532 268191 269336 271390 274018 276250 277563 278375 279221 279953 280197
52864 280197 280196 280589 281538 282570 283222 283519 283913 284981 286925 289046 289991 288945 286402 283519 280959 278681
52848 278681 276446 273995 270956 267177 263003 258849 254728 250694 247428 245683 245254 245193 244965 244788 244841 244898
52832 244898 244850 244939 245212 245310 245090 244993 245482 246366 246959 246794 246044 245360 245260 245542 245506 244940 244579 245153 246314 247230
52812 247230 248009 249687 252628 255742 257665 258180 258111 258279 258942 259944 260978 261668 261593 260316 257672 254299
52796 254299 251595 250558 250669 250444 249115 247244 245730 244859 244503 244543 244723 244636 244259 244138 244677 245558 246171 246340
52778 246340 246363 246594 247224 248200 249162 249706 249899 250275 251143 252199 252938 253132 252749 251790 250526 249596 249499 250046 250504
52759 250504 250285 249440 248601 248397 248762 248869 248019 246522 245441 245548 246745 248304 249331 249280 248606 248704 250516
52742 250516 253370 255882 257817 260099 263037 265740 267628 269397 271811 274488 276609 278129 279504 280800
52728 280800 281889 283045 284554 286057 287014 287521 287981 288224 287697 286401 284974 283838 282827 281629 280133
52713 280133 278369 276484 274742 273266 271918 270749 270280 270846 271852 272219 271554 270455 269651 269252 268938 268547
52697 268547 268312 268623 269597 270824 271639 271650 270930 269823 268887 268881 270192 272118 273331 273323 272859 272738 272785 272491 271922
52678 271922 271270 270110 267986 265433 263541 262600 261980 261283 260876 261173 262032 263035 263867 264242 263855 262651 261012
52661 261012 259608 259108 259852 261560 263516 265239 266802 268367 269787 271001 272447 274595 277333 280226 283130
52646 283130 286026 288464 289735 289608 288526 287138 285883 284818 283574 281753 279624 278021 277220 276448 275060
52631 275060 273599 272974 273071 273119 273110 273805 275440 277397 279261 281214 283230 284748 285479 285779 285865 285299 283684 281407
52613 281407 279314 277969 277454 277564 277972 278419 278828 279055 278767 277921 277086 276729 276423 275568 274718 275174 277197 279622
52595 279622 281516 283189 285015 286290 286098 284714 283243 282239 281489 280979 281247 282679 284879 286889 287862
52580 287862 287601 286714 286127 286306 287065 288194 289888 292283 294927 297087 298424 299039 298980 298063 296163 293476
52564 293476 290522 288008 286532 286213 286602 287079 287272 287127 286731 286187 285551 284870 284333 284262 284733 285299 285410 285046
52546 285046 284540 283876 282714 281235 280433 281156 283168 285381 286844 287304 287141 287002 287349 288124 288905 289374 289421
52529 289421 288885 287653 286127 285119 285046 285547 286119 286737 287580 288562 289541 290686 292198 293807 294933 295303 295176
52512 295176 295085 295536 296810 298784 300993 303064 305029 307130 309448 311761 313588 314303 313561 311741 309619
52497 309619 307419 304574 300701 296467 293023 290824 289417 288273 287337 286767 286502 286245 285687 284748 283717 283115
52481 283115 283258 283997 284935 285765 286316 286500 286491 286776 287774 289446 291451 293525 295518 297242 298666 300166 302215
52464 302215 304762 307238 309263 311071 313098 315360 317474 319203 320703 322092 322967 322635 320903 318404 315953
52449 315953 313736 311391 308731 305942 303088 299947 296553 293477 291225 289716 288729 288528 289405 290762 291358
52434 291358 290710 289667 289164 288859 287596 285070 282344 280571 279803 279439 279300 279599 280095 280159 279810 279941 281156
52417 281156 282993 284740 286433 288428 290500 292182 293735 295905 298821 301963 305263 309327 314286 319325
52403 319325 323855 328518 334466 342069 350772 359781 368269 375220 379707 381389 380421 377050 371613 364833
52389 364833 357720 351163 345696 341473 338232 335434 332737 330281 328384 327133 326439 326309 326805 327866 329350
52374 329350 331172 333308 335777 338713 342259 346379 350961 356087 361815 367670 372819 376916 380310 383182
52360 383182 385055 385527 385036 384380 383779 382960 381944 381181 381012 381417 382252 383353 384446 385328 386113 387094 388408
52343 388408 390020 391821 393531 394820 395832 397357 400115 404092 408837 414128 419961 426237 432934 440334
52329 440334 448645 457671 467348 478235 490778 504398 518174 532270 547768 565012 583076 601110
52317 601110 619315 638124 657184 675800 693931 712119 730732 749819 769394 789328 809092
52306 809092 828135 846531 864874 883490 902069 920149 937682 954985 972231 989137 1005207
52295 1005207 1020278 1034597 1048144 1059968 1068637 1073532 1075388 1075336 1073716 1070201 1064826 1058400 1051786
52282 1051786 1045175 1038264 1030929 1023522 1016674 1011014 1006994 1004715 1003874 1004045 1005151 1007533 1011422 1016493
52268 1016493 1022214 1028651 1036587 1046655 1058526 1071196 1084018 1097185 1111212 1126153 1141447 1156366
52256 1156366 1170527 1184113 1197761 1212195 1227764 1244146 1260519 1276160 1290972 1305307 1319189
52245 1319189 1331852 1342180 1349507 1353824 1355441 1354866 1352913 1350353 1347202 1342753 1336618 1329383 1321953 1314614
52231 1314614 1307208 1300008 1293797 1289033 1285339 1281909 1278156 1273967 1269693 1265989 1263375 1261801 1260782 1260006
52217 1260006 1259602 1259777 1260435 1261292 1262279 1263739 1266253 1270276 1275815 1282402 1289434 1296519 1303562 1310743 1318512
52202 1318512 1327321 1336969 1346312 1353978 1359537 1363856 1368305 1373805 1380520 1388208 1396689 1406025 1416212 1426653
52188 1426653 1436218 1444123 1450610 1456375 1461405 1464876 1466285 1466131 1465096 1462907 1458551 1451575 1442753 1433316
52174 1433316 1423795 1413829 1403020 1391674 1380629 1370511 1361396 1353142 1345791 1339510 1334322 1330093 1326746
52161 1326746 1324327 1322912 1322539 1323155 1324560 1326497 1328912 1331918 1335298 1338173 1339453 1338659 1336195 1332895 1329513
52146 1329513 1326518 1324115 1322341 1321275 1321049 1321495 1321909 1321492 1320060 1318037 1315789 1313227 1310172 1306780 1303455
52131 1303455 1300560 1298446 1297551 1298270 1300795 1305292 1312199 1322045 1334858 1349935 1366440 1384254 1404094
52118 1404094 1426615 1451471 1477415 1503351 1529133 1555223 1581732 1608021 1633230 1656988 1679426
52107 1679426 1700564 1719988 1737329 1752883 1767331 1780810 1792789 1803218 1813283 1824337 1836222
52096 1836222 1847395 1856738 1864461 1871025 1875966 1878340 1877729 1874137 1867281 1856678 1842391 1825222 1806300
52083 1806300 1786852 1768111 1750887 1735212 1720799 1707780 1696641 1687596 1680533 1675544 1672979 1672829
52071 1672829 1674441 1677103 1680749 1685996 1693539 1703500 1715305 1728213 1741924 1756453 1771583 1786902
52059 1786902 1802395 1818354 1834454 1849612 1863188 1875642 1887436 1898008 1906608 1913539 1919488 1924055
52047 1924055 1926043 1924996 1921270 1914716 1904604 1891076 1875402 1858332 1839218 1817419 1793727 1769765
52035 1769765 1746639 1724700 1704035 1684500 1665762 1647868 1631383 1616553 1602752 1589247 1576022
52024 1576022 1563444 1551596 1540476 1530371 1521295 1512332 1502227 1490637 1478318 1466152 1454359 1442604
52012 1442604 1430533 1418193 1406008 1394228 1382425 1369868 1356404 1342469 1328081 1312481 1295005
52001 1295005 1275618 1254193 1230065 1203073 1174456 1145890 1118021 1090746 1064460 1039995 1017480
51990 1017480 996350 976552 958732 942900 927749 911769 894523 876478 858117 839648 821195
51979 821195 802846 784709 767143 750628 735188 720186 705051 690002 675814 662994 651480
51968 651480 641105 632084 624990 620327 618151 618095 619766 623060 627963 634108 640725 647059 652706 657517
51954 657517 661354 663976 665011 663953 660399 654518 647248 639844 633199 627661 623523 621433 622055 625370
51940 625370 630652 637325 645557 655754 667761 681043 695506 711420 728343 744814 759564 772617
51928 772617 784634 795489 804088 809513 811757 811336 808603 803440 795071 782092 763304 739025 711419
51915 711419 683220 656226 631084 608101 587661 569915 554624 541642 531224 523558 518189 514329
51903 514329 511735 510819 511831 514374 518013 522854 529009 535770 541950 546844 550194 551263 548864 542659
51889 542659 533776 523694 513036 501929 490967 481078 472732 465907 460691 457278 455496 455009 455997 459053
51875 459053 464280 471069 478917 487944 498251 509156 519500 528522 536138 542401 546961 549122 548374 544929
51861 544929 539774 534121 528756 523880 519449 515460 511915 508835 506472 505383 506024 508179 510889 513051
51847 513051 514113 514197 513587 512240 509901 506504 502184 496944 490681 483677 476769 470769 465827 461513 457362
51832 457362 453185 449168 445959 444544 445601 448849 453176 457386 460775 463167 464687 465491 465538 464559 462390
51817 462390 459349 456174 453564 451720 450288 448793 447292 446545 447288 449296 451477 452967 453757 454109 453836
51802 453836 452596 450540 448191 445853 443595 441703 440635 440511 441009 441802 442807 443970 445071 445767 445649
51787 445649 444381 442072 439450 437323 435892 434856 434085 433798 434043 434421 434482 434155 433702 433472 433747 434655 436188
51770 436188 438485 442026 447297 454213 462170 470684 479719 489277 498994 508293 516703 523814 529059 531840
51756 531840 531974 529888 526245 521335 514976 507066 498103 488867 479688 470432 461256 452870 445792 439780
51742 439780 434412 429889 426790 425244 424811 425135 426285 428521 432057 436916 442767 449091 455800 463334 471633
51727 471633 479333 484712 487409 488559 489269 489687 489698 489833 491058 493924 497984 501686 502920 500390 494762
51712 494762 488122 482179 477357 473494 470524 468141 465506 461983 457812 453659 449839 446369 443493 441702
51698 441702 441419 442901 446087 450183 453745 455714 456266 456242 455935 454953 453177 451319 450266 450182 450469 450452 449881
51681 449881 448770 446926 443988 440017 435820 432353 429904 428146 426878 426270 426401 427077 428253 430172 432905
51666 432905 436187 439967 444692 450827 458441 467519 478096 489629 500613 509359 514987 517330 516268
51653 516268 511808 504657 496180 487770 480577 475604 473497 474233 477401 482640 489309 495760 499616 499148 494226
51638 494226 485935 475696 464864 454664 445966 438994 433373 428531 424147 420388 417734 416487 416498 417424
51624 417424 419061 421268 423703 425889 427483 428255 427991 426735 425004 423279 421293 418229 413773 408622 403758
51609 403758 399520 395642 391948 388747 386568 385658 385684 385848 385399 384221 382934 382411 383226 385493 389003 393429
51593 393429 398554 404487 411602 420216 430287 441323 452299 461666 467795 469853 468275 464284 459045
51580 459045 453412 448247 444485 442621 442344 442999 444467 447457 452924 461300 472284 485241 499614 515014
51566 515014 531181 548102 566170 585930 607404 629749 651848 673394 695245 718613 744104
51555 744104 771697 801391 833289 866854 900328 931067 956375 974099 982907 982414 973047 955623
51543 955623 931105 900774 866339 829570 791912 754571 718733 685391 655076 628035 604529
51532 604529 584703 568358 555175 545035 537796 532949 529945 528579 528471 528324 526529 522689 517824 512820
51518 512820 507395 501040 494259 488098 482808 477732 472399 467060 462111 457538 453114 448738 444388 440009
51504 440009 435602 431198 426660 421737 416456 411344 407078 403930 401686 400061 399048 398791 399248 400183 401434
51489 401434 402942 404478 405681 406586 407753 409519 411395 412692 413430 414023 414222 413266 411164 408977 407499
51474 407499 406460 405439 404741 404611 404245 402554 399585 396330 393286 390117 386719 383732 381730 380553 379699
51459 379699 378826 377574 375439 372289 368724 365614 363420 362164 361723 361868 362208 362512 363111 364724 367806 372174
51443 372174 377290 382820 388880 395800 403831 413168 424059 436543 449919 462666 473119 480270 484035
51430 484035 485075 484514 483475 482535 481576 480224 478235 475364 471262 465788 459260 452097 444574 437192 430899
51415 430899 426312 422897 419564 416039 413069 411261 410366 409912 409942 410689 411882 412793 412889 412201 411176 410311 409848
51398 409848 409775 410213 411685 414659 418839 423285 427427 431650 436743 443041 450325 458307 466952 476516 487497
51383 487497 500477 515834 533712 554397 578558 606991 640171 678124 720479 766468 815014
51372 815014 865086 915907 966574 1015379 1059514 1095473 1119893 1130566 1127211 1111503 1086065 1053053
51360 1053053 1013582 968469 919400 868942 819247 770991 724030 678987 637610 601333 570068
51349 570068 542888 519504 500337 485195 472714 461401 450805 441299 433112 425989 419642 414080
51337 414080 409406 405483 401946 398516 395270 392568 390703 389629 389094 388975 389384 390448 392055 393825 395374
51322 395374 396654 398015 399727 401473 402634 403109 403415 403706 403238 401332 398509 395980 394177 392500 390514
51307 390514 388669 387594 387311 387413 387590 387622 387209 386170 384641 382921 381278 379938 378973 378115 377055 375922
51291 375922 375024 374112 372532 370338 368558 367959 368023 367738 367009 366759 367884 370632 374787 379860 385177 390229
51275 390229 395010 399747 404401 408693 412440 415508 417615 418609 418828 418784 418578 418052 417445 417422 418466 420651
51259 420651 423979 428341 432942 436297 437220 435698 432579 428636 424218 419631 415371 411750 408425 404603
51245 404603 399842 394576 389739 385946 383251 381566 380879 380917 381032 380751 380193 379604 378756 377293 375519 374322
51229 374322 374226 374868 375468 375563 375231 374951 375325 376688 378839 381257 383575 385676 387420 388596 389144 389169 388727
51212 388727 387908 387083 386656 386502 386096 385375 385034 385704 387152 388723 390339 392613 396006 400200 404395 408001
51196 408001 410932 413375 415444 417084 418246 419024 419492 419474 418715 417313 415792 414626 413874 413417 413322 413651 414020
51179 414020 413748 412628 411315 410700 410958 411457 411625 411581 411689 411757 411202 410122 409659 410827 413204 415280 416094
51162 416094 416092 416293 417093 418161 419196 420301 421695 423304 424725 425471 425235 424079 422322 420206 417639 414332
51146 414332 410229 405824 402036 399610 398495 397878 396960 395655 394424 393618 393300 393495 394140 394727 394584 393758
51130 393758 393181 393646 394953 396405 397725 399050 400387 401637 403000 404748 406701 408481 410243 412523 415259
51115 415259 417599 418894 419386 419691 420078 420599 421502 423062 425249 427869 430746 433480 435385 436137 436286 436712
51099 436712 437713 438976 440195 441302 442255 443151 444444 446493 448855 450542 451063 450776 450201 449518 448900 448711
51083 448711 449010 449303 449210 449106 449641 450825 451967 452457 452328 452175 452783 454687 457733 461115 464080 466607 469241
51066 469241 472402 476081 480123 484489 489274 494716 501242 509319 519249 531229 545550 562524 582110
51053 582110 603556 625260 645051 661150 673339 683089 692283 701922 712190 723158 734584 745169
51041 745169 752978 756982 757622 755583 750637 742171 730399 716528 702087 688681 678035 671277 667786
51028 667786 665153 660698 653054 642425 629814 616318 602930 590527 579807 571222 564980 561061 559238
51015 559238 559147 560492 563217 567404 572975 579630 587233 596108 606648 618598 631021 643134 654885
51002 654885 666568 678072 688851 698527 707179 715041 722087 727993 732293 734573 734660 732824 729739 726215
50988 726215 722810 719639 716585 713822 712097 712241 714341 717716 721897 727427 735389 746405 760455 777450
50974 777450 797316 819364 842133 864271 885470 906337 927640 949983 974049 1000771 1031152
50963 1031152 1066032 1105878 1150610 1199644 1252338 1308451 1368059 1431063 1496910 1564660 1633042
50952 1633042 1700465 1765416 1827109 1885583 1940985 1992951 2040877 2084574 2124391 2160892 2194736
50941 2194736 2226746 2257673 2287911 2317907 2348786 2381772 2416567 2450745 2481308 2506634 2526536
50930 2526536 2540874 2548956 2550284 2545028 2533338 2514663 2488126 2453269 2410117 2358818 2299611 2233008
50918 2233008 2159780 2080943 1998041 1913165 1828278 1744586 1662935 1584696 1511741 1445392 1385676
50907 1385676 1331739 1282705 1238063 1197575 1161081 1128226 1098239 1070208 1043813 1019561 998008
50896 998008 978885 961356 945045 930360 917724 906937 897590 889701 883502 878804 875131 872456 871181
50883 871181 871165 871324 870733 869869 870198 872568 876482 881043 886055 891872 898578 905917 913970 923312 934245
50868 934245 946193 958324 970705 984430 1000399 1018352 1037450 1057653 1080030 1105626 1134475
50857 1134475 1165951 1199719 1236062 1275589 1319089 1367502 1421544 1481376 1547039 1619231 1699219
50846 1699219 1787937 1885529 1991813 2106685 2229801 2360238 2496812 2638534 2784458 2933224
50836 2933224 3082934 3231319 3375814 3513646 3642113 3758877 3862012 3950183 4023176 4082253
50826 4082253 4129776 4168422 4200753 4229228 4256248 4284051 4314647 4349881 4391383 4440271 4496595
50815 4496595 4558763 4623358 4685592 4740042 4781114 4803393 4802349 4775123 4720571 4638611 4529899
50804 4529899 4396175 4240376 4066042 3876841 3676864 3470907 3263977 3060589 2864724
50795 2864724 2679978 2509105 2353373 2212709 2086524 1974260 1875371 1789249 1715235 1652459
50785 1652459 1599756 1555884 1519705 1489944 1465102 1443994 1426165 1411304 1398418 1386118 1373713
50774 1373713 1361492 1349895 1338914 1328358 1318064 1307594 1296243 1283782 1270822 1257989 1245017
50763 1245017 1231147 1216335 1201565 1187863 1175363 1163465 1151630 1139796 1128194 1117146 1107056
50752 1107056 1098364 1091289 1085744 1081653 1079271 1079033 1081169 1085749 1093107 1103959 1119000 1138596 1162872
50739 1162872 1191757 1224811 1261378 1301209 1344775 1392699 1445074 1501499 1561507 1624699 1690678
50728 1690678 1759096 1829548 1901188 1972827 2043783 2114294 2184568 2253688 2320072 2382882 2442336
50717 2442336 2498631 2551077 2598365 2639100 2671986 2696047 2710987 2717129 2715059 2705851 2691805 2676492
50705 2676492 2663717 2656440 2656438 2664374 2679916 2702156 2730110 2762637 2797922 2833500 2866733 2894734
50693 2894734 2913793 2919670 2909001 2880191 2832854 2767056 2683597 2584672 2473819 2355400 2234244
50682 2234244 2115138 2001867 1896611 1800273 1713097 1634911 1565417 1504764 1453578 1412070 1379473
50671 1379473 1354709 1337161 1326339 1321228 1320648 1324008 1331090 1341181 1352972 1365226 1377072 1387862
50659 1387862 1397333 1405916 1414345 1422902 1431452 1440094 1449272 1459335 1470554 1483532 1498883 1516403 1535199
50646 1535199 1554825 1575813 1598932 1624571 1653165 1685543 1722269 1762928 1806478 1852064 1899151
50635 1899151 1947201 1995730 2044542 2093498 2142180 2190138 2237301 2283766 2329273 2373322 2415810
50624 2415810 2457230 2498253 2539336 2580346 2619517 2652317 2672123 2673438 2655420 2622624 2582427
50613 2582427 2541563 2504322 2472790 2447798 2429464 2417232 2409856 2405632 2402848 2400158 2396482 2390464
50601 2390464 2380140 2363381 2338719 2305564 2263711 2213106 2154448 2089638 2021081 1950479 1878708
50590 1878708 1806812 1736510 1669409 1606117 1546591 1491014 1439775 1392643 1348648 1307052 1268122
50579 1268122 1232646 1201011 1173053 1148548 1127395 1109386 1094322 1082454 1074389 1070286 1069444 1071024
50567 1071024 1074954 1081749 1091522 1103576 1116988 1131203 1146006 1161371 1177700 1195851 1216415 1238976
50555 1238976 1262491 1286450 1311268 1337304 1363837 1389393 1412980 1434638 1454821 1473687 1491250
50544 1491250 1507866 1524076 1540052 1555640 1571104 1587532 1606340 1628619 1655087 1686295 1722506
50533 1722506 1763581 1809467 1860806 1918585 1983027 2053156 2127731 2206435 2289966 2379144 2474172
50522 2474172 2574599 2679577 2787914 2898073 3008400 3117410 3223667 3325210 3419360 3503487
50512 3503487 3576047 3636414 3683513 3715058 3728725 3723908 3701829 3664052 3611592 3545659 3468653
50501 3468653 3383937 3295006 3205287 3118487 3038453 2968486 2910858 2866892 2837231 2821954 2820604
50490 2820604 2832141 2854886 2886628 2924753 2966032 3006095 3039444 3060415 3064313 3047789 3008770
50479 3008770 2946804 2863687 2763295 2650411 2529608 2405037 2280716 2160354 2046691 1941131
50469 1941131 1844093 1755676 1675927 1604704 1541598 1486134 1437805 1395738 1358508 1324639 1293369
50458 1293369 1264823 1239502 1217872 1200347 1187212 1178392 1173517 1172412 1175249 1182100 1192533 1205828
50446 1205828 1221374 1238680 1257308 1277062 1298151 1320901 1345373 1371393 1398808 1427458 1456863
50435 1456863 1485949 1512975 1535839 1552901 1563916 1570033 1572747 1572942 1570887 1566706 1560609 1553006 1544748
50422 1544748 1536905 1529990 1523736 1518058 1513868 1512413 1514067 1518508 1525992 1537808 1555336 1579119 1608854
50409 1608854 1643728 1682661 1724816 1770149 1819106 1871551 1926287 1981667 2036251 2088763 2137952
50398 2137952 2182848 2222850 2257317 2285407 2306457 2320062 2325413 2321036 2305737 2279578 2243497 2198240
50386 2198240 2144380 2083423 2018228 1952008 1887206 1825533 1768686 1718519 1676434 1642953 1618098
50375 1618098 1602075 1595273 1597467 1607146 1621856 1639226 1657528 1675247 1690391 1700424 1702872 1695974
50363 1695974 1679001 1652236 1616716 1573888 1525431 1473283 1419623 1366570 1315829 1268557 1225450
50352 1225450 1186824 1152697 1122965 1097578 1076486 1059392 1045658 1034637 1026136 1020366 1017174 1015256
50340 1015256 1012321 1006288 996476 983822 970232 957702 947649 940567 936212 934238 934623 937409 942262
50327 942262 948623 956185 964916 974675 985183 996384 1008437 1021243 1034376 1047671 1061431 1075691
50315 1075691 1089560 1101795 1111965 1120648 1128410 1134961 1139452 1141373 1140996 1139137 1136771 1134807 1133891 1134182
50301 1134182 1135426 1137450 1140625 1145694 1153176 1163146 1175615 1190833 1208999 1230002 1253782 1280743
50289 1280743 1311344 1345384 1382275 1422120 1465616 1511811 1555774 1589099 1603672 1595975 1568825
50278 1568825 1529583 1486460 1445397 1409187 1378559 1353649 1334510 1320699 1310964 1303709 1297840 1293121
50266 1293121 1289714 1287493 1285947 1284602 1283257 1281710 1279547 1276493 1272887 1269549 1267209 1266220 1266756 1268935
50252 1268935 1272713 1277895 1284355 1292086 1300921 1310419 1320157 1330102 1340630 1352204 1364949 1378407 1391730
50239 1391730 1404313 1416183 1427582 1438181 1446986 1453011 1455790 1455152 1450957 1443419 1433582 1423066 1413135
50226 1413135 1404002 1395065 1385793 1376293 1366859 1356892 1344474 1327240 1303809 1274429 1240644 1204655
50214 1204655 1168703 1134393 1102303 1072373 1044571 1018976 995448 973818 954394 937686 923484
50203 923484 910827 899134 888811 880333 873258 866657 860148 853992 848473 843697 839795 836720 833967
50190 833967 830987 827813 824792 821761 818015 813172 807631 802085 796965 792438 788500 784803 780645 775380
50176 775380 768850 761475 754147 747906 743331 740118 737492 734979 732463 729618 725997 721991 719088 718510
50162 718510 719728 720907 720841 719985 719541 720045 721226 722899 725365 728874 733169 737890 743165 749413 756746
50147 756746 764953 774083 784468 795998 807876 819480 831153 843689 857332 871813 887215 904220
50135 904220 923457 945183 969662 997183 1027357 1058924 1090742 1122648 1154952 1187456 1219515
50124 1219515 1250849 1281527 1311043 1337948 1360716 1378464 1390517 1395720 1392933 1382321 1365630 1344924
50112 1344924 1321334 1295258 1267452 1239349 1212302 1186947 1163465 1142108 1123130 1106412 1091508
50101 1091508 1077949 1065238 1052730 1039966 1027125 1014664 1002422 989573 975764 961906 949423
50090 949423 938970 930359 923512 918839 916526 916049 916846 919224 924121 931961 942038 953135 964593 976595
50076 976595 989593 1003592 1018070 1032397 1046207 1059347 1071648 1082920 1093148 1102529 1111181 1118901
50064 1118901 1125305 1130195 1133632 1135582 1135612 1133151 1128156 1121461 1114300 1107396 1100523 1092940 1084235 1074786
50050 1074786 1065552 1057502 1051020 1045727 1040998 1036918 1034596 1035214 1038735 1043913 1049688 1056188 1064173 1073987
50036 1073987 1085457 1098417 1112702 1127788 1143070 1158542 1174616 1191132 1207149 1221944 1235713
50025 1235713 1248965 1261691 1273503 1284205 1293744 1301918 1308618 1314184 1319130 1323697 1328044 1332571 1337503
50012 1337503 1342320 1346141 1348564 1349562 1348722 1345419 1339955 1333886 1328795 1325076 1322035 1318595 1313631 1306134
49998 1306134 1295680 1282555 1267109 1249200 1228682 1206216 1183176 1160736 1139356 1119090 1099936
49987 1099936 1081784 1064299 1047215 1030681 1015131 1000636 986449 971371 954700 936756 918417
49976 918417 900369 882954 866492 851265 837230 824126 811922 800844 790923 781844 773266 764975
49964 764975 756818 748919 741970 736701 732838 729163 724850 720325 716550 713995 712692 712823 714633 718038
49950 718038 722739 728550 735300 742736 750904 760232 770667 781000 789624 795831 799919 802302 803223 803219 803071
49935 803071 803017 802472 800685 797267 791948 784245 773729 760513 745482 730044 715427 701889 688793
49922 688793 675806 663845 654322 647577 642710 638982 636633 636033 636703 637734 638800 640245 642310 644769
49908 644769 647268 649690 652147 654971 658802 664430 672202 681532 691254 700684 710276 720987 733029 745589
49894 745589 757779 769345 780161 789519 796561 801181 803869 804729 803201 798851 791969 783254 773308 762554
49880 762554 751244 739399 726998 714292 701671 689235 676932 665113 654516 645544 637953 631413
49868 631413 625938 621576 618024 614926 612313 610560 610070 611145 613930 618315 624025 630805 638350 646210
49854 646210 654203 662869 672970 684462 696527 708758 721579 735078 748095 759069 767443 773629
49842 773629 777946 780325 780944 780437 779197 776766 772059 764116 752835 739304 725386 712662 701699
49829 701699 692325 684366 677852 672768 668990 666395 664794 663843 663368 663697 665426 668864 673940 680504 688458
49814 688458 697647 707908 719200 731436 744269 757225 769906 781874 792529 801447 808709 814588
49802 814588 819024 821815 823102 823191 821934 818863 814063 808397 802670 796944 790853 784142 776576 767704 757269
49787 757269 745729 734051 723050 713165 704730 697994 692720 688093 683357 678534 674349 671400 669492
49774 669492 667846 665893 663759 661983 660998 661025 662326 665234 669883 676021 683175 690883 698759 706395 713308
49759 713308 718983 723072 725677 727464 729277 731481 733652 734896 734434 731929 727405 721053 713110 703938
49745 703938 694134 684438 675409 667244 660049 654200 650202 648066 647055 646273 645451 644988 645269 646169 647346
49730 647346 648816 651089 654794 660253 667254 674969 682140 687745 691727 695038 698848 703859 710375 718629
49716 718629 728649 740014 752208 765156 778937 792861 805338 814921 821120 823975 823334 819113 812043
49703 812043 803498 794535 785538 776871 769326 763613 759795 757585 756999 758184 760607 762839 763417 761818 758561
49688 758561 754590 750813 748020 746798 747338 749459 752977 757972 764689 773312 783870 796154 809670 823924
49674 823924 838916 855104 872763 891718 911845 933106 954292 972140 982926 985377 981451 974110
49662 974110 965186 955762 947440 941908 939531 939483 941366 945698 952315 958860 961413 956594 943195 922477
49648 922477 897412 871345 846713 824601 805263 788717 774781 762959 752788 744298 737870 733616
49636 733616 731149 730016 730092 731333 733232 734780 735144 734247 732584 730575 728224 725255 721239 715650 708239
49621 708239 699582 690931 683244 676588 670775 666179 663299 661742 660395 658776 657555 657351 657595 657161 655851
49606 655851 654591 654293 655104 656837 659498 662983 666687 669898 672451 674588 676212 676729 675845 674256 673298
49591 673298 673934 676157 679191 682083 684189 685439 686295 687382 688942 690603 691656 691620 690625 689322 688425 688303
49575 688303 688949 690258 692282 695226 699279 704405 710231 716271 722485 729517 738076 748058 758704 769674
49561 769674 781363 793869 806176 816961 825791 832830 837675 839382 837684 833377 827370 820138 812381
49548 812381 805352 799922 795818 792318 789306 787168 786043 785752 786082 786641 786740 786118 785580 786251 788248 790706
49532 790706 793110 795927 799781 804684 810449 817448 826469 837946 851615 866975 883857 902553 923334
49519 923334 945794 968553 989615 1007105 1019935 1028111 1032573 1034556 1034972 1034444 1033814 1034233 1036584 1041144
49505 1041144 1047865 1056519 1066147 1074736 1079992 1080342 1075015 1063632 1046431 1024805 1001040 977302 954993
49492 954993 934801 916834 900801 886524 874282 864358 856395 849706 844141 840144 837952 837219 837473
49479 837473 838428 839799 841279 842843 844669 846668 848446 849790 850770 851386 851622 851949 853213 855784 859224
49464 859224 862946 866799 870795 874753 878509 882128 885612 888688 891175 893302 895382 897338 898753 899187
49450 899187 898353 896148 892668 888082 882594 876704 871328 867164 864049 861430 859380 858552 859107 860503 862533
49435 862533 865782 870662 876655 883038 889868 897704 906757 916802 927621 939096 951117 963809 977648
49422 977648 993141 1010587 1030119 1051431 1073514 1095598 1118528 1143738 1169762 1190700 1199735 1194301
49410 1194301 1177413 1154776 1131785 1112455 1098970 1091391 1088727 1090771 1098173 1110617 1126014 1142061
49398 1142061 1157796 1173236 1188312 1202821 1216812 1230293 1242948 1254633 1265782 1276791 1287268
49387 1287268 1296288 1303058 1307001 1307582 1304579 1298347 1289456 1278304 1265407 1251665 1237832 1223970 1209926
49374 1209926 1196207 1183881 1173665 1165570 1159351 1154926 1152339 1151720 1153219 1156602 1160917 1164879 1167687
49361 1167687 1169210 1169498 1168520 1166411 1163508 1159885 1155134 1148891 1141446 1133607 1126040 1118851 1111827 1105033
49347 1105033 1099112 1094886 1092536 1091290 1090182 1089077 1088683 1089472 1090886 1091815 1091646 1090601 1089108 1087103 1084062
49332 1084062 1079641 1074193 1068629 1063742 1059667 1056054 1052677 1049767 1047725 1046725 1046773 1048071 1051166 1056684
49318 1056684 1064982 1076049 1089595 1105224 1122560 1141199 1160361 1178481 1193226 1202221 1204162 1199480
49306 1199480 1189981 1177634 1163529 1147838 1130676 1112829 1095591 1080001 1066407 1054713 1044884 1037116
49294 1037116 1031657 1028561 1027547 1028080 1029648 1032012 1035029 1038183 1040585 1041701 1041944 1042182 1042640 1042601 1041277
49279 1041277 1038616 1035110 1031216 1027320 1024043 1022086 1021765 1022957 1025432 1028942 1033023 1037193 1041412 1045905
49265 1045905 1050334 1053619 1054956 1054749 1054165 1053911 1053799 1053333 1052310 1050910 1049689 1049496 1051066 1054747 1060985
49250 1060985 1070856 1085313 1103740 1123999 1144269 1164070 1182849 1198368 1207600 1209130 1203737 1192765
49238 1192765 1177117 1158184 1138561 1120805 1105820 1093097 1082194 1073332 1066804 1062608 1060716 1061129
49226 1061129 1063504 1067188 1071738 1077122 1083305 1089959 1096662 1103148 1109349 1115516 1122257 1130040 1138524 1146830
49212 1146830 1154675 1162799 1171996 1182073 1192228 1202185 1212395 1223175 1234251 1245354 1256846 1269457
49200 1269457 1283640 1299467 1316960 1336039 1356142 1376278 1395735 1414547 1433089 1451367 1468993
49189 1468993 1485707 1501545 1516457 1530125 1542395 1553644 1564458 1575103 1585598 1596235 1607707
49178 1607707 1620649 1635315 1651841 1670684 1692542 1717785 1746129 1777105 1810905 1848591 1891325
49167 1891325 1939450 1992293 2048302 2104604 2156419 2197931 2224788 2236216 2234910 2225263 2211744 2198073
49155 2198073 2186764 2178840 2174084 2171643 2170481 2169611 2168371 2166651 2164873 2163830 2164492 2167518 2172750 2179557
49141 2179557 2187840 2198216 2210866 2224812 2238990 2253592 2269572 2287179 2305846 2325347 2346073
49130 2346073 2368073 2390689 2413406 2436339 2459641 2483107 2506600 2530249 2553989 2577552 2601231
49119 2601231 2625991 2652435 2680220 2708865 2738636 2770264 2804331 2841413 2882355 2927942 2978735
49108 2978735 3035704 3100638 3175453 3261565 3360519 3474530 3604581 3746554 3889328 4018759
49098 4018759 4126774 4218515 4308838 4407406 4504515 4572823 4586238 4539393 4450152 4344656 4239952
49087 4239952 4137845 4030913 3912553 3783219 3650067 3522299 3406721 3306526 3222475 3153926
49077 3153926 3099014 3055017 3019211 2989388 2963895 2941750 2922687 2906551 2892565 2879506 2866495
49066 2866495 2853323 2840228 2827775 2816657 2807031 2798184 2789365 2780725 2772877 2765811 2759041 2752609 2747120
49053 2747120 2742774 2739165 2736161 2734132 2733118 2732503 2731818 2731300 2731397 2732306 2734225 2737436 2741769 2746462 2750976
49038 2750976 2755505 2760309 2764796 2767592 2767384 2763710 2757396 2750415 2744792 2741263 2739183 2737836 2737312 2737846 2738787
49023 2738787 2738770 2736767 2732611 2726617 2719095 2710331 2700885 2691737 2683937 2677939 2673438 2670021 2667767 2666932 2667274
49008 2667274 2668196 2669497 2671489 2674424 2678315 2683200 2688991 2695009 2700311 2704616 2708354 2711675 2714069 2715181
48994 2715181 2715408 2715286 2714810 2713665 2711637 2708440 2703660 2697337 2690249 2683152 2676035 2668547 2660916 2653971 2648364
48979 2648364 2644037 2640405 2636866 2633232 2629802 2626900 2624356 2621669 2618628 2615468 2612430 2609625 2607239 2605324
48965 2605324 2603344 2600635 2597534 2595437 2595471 2597714 2601961 2608441 2617251 2627710 2638978 2650881 2663561
48952 2663561 2676774 2690191 2704081 2719048 2735275 2752574 2770902 2790285 2810448 2831112 2852503
48941 2852503 2875029 2898575 2922627 2947026 2972123 2998277 3025743 3054985 3086679 3121305 3158955
48930 3158955 3199422 3242273 3287170 3334462 3385169 3439902 3498076 3558650 3621316 3686297 3753269
48919 3753269 3821324 3890042 3959861 4031178 4103676 4176663 4249494 4321429 4391608 4459461 4524757
48908 4524757 4587029 4645422 4699455 4749595 4796680 4840999 4882217 4920033 4954512 4985870 5014289
48897 5014289 5039938 5062930 5083216 5100701 5115549 5128146 5138608 5146417 5150740 5151099 5147619 5140707
48885 5140707 5130878 5118965 5106090 5092967 5079289 5064087 5046563 5026370 5003409 4977857 4950321
48874 4950321 4921370 4890895 4858369 4823631 4786761 4747215 4704023 4657144 4607827 4557144 4504861
48863 4504861 4450354 4394059 4337357 4281441 4226963 4174302 4123438 4073871 4025409 3978888 3935421
48852 3935421 3895104 3857127 3821015 3786986 3755158 3725206 3697053 3671262 3648476 3628861 3612255
48841 3612255 3598501 3587439 3578889 3572778 3569101 3567757 3568676 3572021 3577943 3586185 3596275 3608091 3621884
48828 3621884 3637705 3655084 3673315 3691823 3710295 3728676 3746977 3764931 3782051 3798326 3814647
48817 3814647 3832113 3850902 3870171 3888958 3906865 3923971 3940441 3956281 3971291 3985276 3998452
48806 3998452 4011425 4024689 4038418 4052974 4069071 4087017 4106189 4125767 4145617 4165900 4186287
48795 4186287 4206303 4226167 4246391 4266627 4285687 4302741 4317778 4330875 4341806 4350596 4357896 4364552
48783 4364552 4371074 4377430 4382866 4386015 4385759 4381911 4374572 4363112 4346604 4325145 4299794 4271132 4238819
$$ [...]
##END NTUPLES=NMR SPECTRUM
##END=
