##TITLE=AC1593_CASAH13323_8314147_4EOzgultl5
##JCAMPDX= 6.0         $$ Bruker NMR JCAMP-DX V2.0
##DATA TYPE= NMR SPECTRUM
##DATA CLASS= NTUPLES
##ORIGIN= BRUKER
##OWNER= Administrator
$$ 1.72 TOPSPIN		Version 2.1
$$ 2013-11-09 12:23:27.199 -0800  Administrator@X
$$ Compression mode = diff/dup
##.OBSERVE FREQUENCY= 400.02188249412
##.OBSERVE NUCLEUS= ^1H
##.ACQUISITION MODE= SIMULTANEOUS (DQD)
##.ACQUISITION SCHEME= undefined
##.AVERAGES= 8
##.DIGITISER RES= 22
##SPECTROMETER/DATA SYSTEM= spect
##.PULSE SEQUENCE= zg30
##.SOLVENT NAME= COFFEE_meoh
##.SHIFT REFERENCE= INTERNAL, COFFEE_meoh, 1, 14.98509
##AUDIT TRAIL= $$ (NUMBER, WHEN, WHO, WHERE, PROCESS, VERSION, WHAT)
$$ ##TITLE= Audit trail, TOPSPIN		Version 2.1
$$ ##JCAMPDX= 5.01
$$ ##ORIGIN= Bruker BioSpin GmbH
$$ ##OWNER= Administrator
$$ $$ E:\/data/COFFEE/nmr/AC1593_CASAH13323_8314147_4EOzgultl5/10/pdata/1/auditp.txt
$$ ##AUDIT TRAIL=  $$ (NUMBER, WHEN, WHO, WHERE, PROCESS, VERSION, WHAT)
(   1,<2013-11-09 12:23:19.798 -0800>,<Administrator>,<X>,<go>,<TOPSPIN 2.1>,
      <created by zg
	started at 2013-11-09 12:22:13.585 -0800,
	POWCHK enabled, PULCHK disabled,
       configuration hash MD5:
       C8 4E 4E 5D D3 5C D8 9E 9F 52 82 E0 59 8A DE 15
       data hash MD5: 64K
       4A 0F CD B1 32 A9 B5 3E 4F 4F 5D D7 A7 5B 23 3C>)
(   2,<2013-11-09 12:23:22.968 -0800>,<Administrator>,<X>,<proc1d>,<TOPSPIN 2.1>,
      <Start of raw data processing
       efp LB = 0 FT_mod = 6 PKNL = 1 PHC0 = 0 PHC1 = 0 SI = 32K 
       data hash MD5: 32K
       9B C3 A3 ED E8 A5 E8 21 4A 13 65 3E 4E 3C D8 16>)
(   3,<2013-11-09 12:23:23.301 -0800>,<Administrator>,<X>,<proc1d>,<TOPSPIN 2.1>,
      <pk PHC0 = 92.59277 PHC1 = 0 
       data hash MD5: 32K
       22 D8 32 22 33 89 10 2D 06 93 99 38 C9 A4 C8 D1>)
(   4,<2013-11-09 12:23:23.416 -0800>,<Administrator>,<X>,<proc1d>,<TOPSPIN 2.1>,
      <abs ABSG = 1 
       data hash MD5: 32K
       48 68 43 60 58 56 A7 A8 17 58 7E 4C EB A3 FD 6D>)
(   5,<2013-11-09 12:23:23.503 -0800>,<Administrator>,<X>,<proc1d>,<TOPSPIN 2.1>,
      <abs ABSG = 2 
       data hash MD5: 32K
       5F DB B4 2E EF 72 B9 24 41 85 1F 04 94 B5 32 29>)
(   6,<2013-11-09 12:23:23.573 -0800>,<Administrator>,<X>,<proc1d>,<TOPSPIN 2.1>,
      <abs ABSG = 3 
       data hash MD5: 32K
       94 01 3B 60 D3 09 8F C8 AD 84 6E FA FF D4 09 BC>)
(   7,<2013-11-09 12:23:23.643 -0800>,<Administrator>,<X>,<proc1d>,<TOPSPIN 2.1>,
      <abs ABSG = 4 
       data hash MD5: 32K
       5C 47 DB 04 C4 24 9B 89 1F 72 5E EE A5 C8 44 8F>)
(   8,<2013-11-09 12:23:23.817 -0800>,<Administrator>,<X>,<proc1d>,<TOPSPIN 2.1>,
      <abs ABSG = 5 
       data hash MD5: 32K
       01 41 7E E3 2B 14 41 B8 5D D0 AB 94 C7 20 0E 08>)
$$ ##END=
$$ 
$$ $$ hash MD5
$$ $$ 1F 7D D0 DF 49 70 16 6D 4E BD FC C0 2B 67 77 5F
##$RELAX= 
##$RELAX= 
##$RELAX= 
##$RELAX= 
##$RELAX= 
##$RELAX= 
##$RELAX= 
$$ Bruker specific parameters
$$ --------------------------
##$DU= <E:\>
##$EXPNO= 10
##$NAME= <AC1593_CASAH13323_8314147_4EOzgultl5>
$$ [...]
150 150 150 150 150 150 150 150
##$TP07= 0
##$TPNAME0= <>
##$TPNAME1= <>
##$TPNAME2= <>
##$TPNAME3= <>
##$TPNAME4= <>
##$TPNAME5= <>
##$TPNAME6= <>
##$TPNAME7= <>
##$TPOAL= (0..7)
0.5 0.5 0.5 0.5 0.5 0.5 0.5 0.5
##$TPOFFS= (0..7)
0 0 0 0 0 0 0 0
##$TUNHIN= 0
##$TUNHOUT= 0
##$TUNXOUT= 0
##$USERA1= <user>
##$USERA2= <user>
##$USERA3= <user>
##$USERA4= <user>
##$USERA5= <user>
##$V9= 5
##$VALIST= <valist>
##$VCLIST= <CCCCCCCCCCCCCCC>
##$VD= 0
##$VDLIST= <DDDDDDDDDDDDDDD>
##$VPLIST= <PPPPPPPPPPPPPPP>
##$VTLIST= <TTTTTTTTTTTTTTT>
##$WBST= 1024
##$WBSW= 4
##$XGAIN= (0..3)
0 0 0 0
##$XL= 0
##$YL= 0
##$YMAX_a= 600397
##$YMIN_a= -513806
##$ZGOPTNS= <>
##$ZL1= 120
##$ZL2= 120
##$ZL3= 120
##$ZL4= 120
##$ABSF1= 14.98509
##$ABSF2= -5.573092
##$ABSG= 5
##$ABSL= 3
##$ALPHA= 0
##$AQORDER= 0
##$ASSFAC= 0
##$ASSFACI= 0
##$ASSFACX= 0
##$ASSWID= 0
##$AUNMP= <proc_prof1d_extract_pilot.lims>
##$AXLEFT= 0
##$AXNAME= <>
##$AXNUC= <1H>
##$AXRIGHT= 0
##$AXTYPE= 0
##$AXUNIT= <>
##$AZFE= 0.1
##$AZFW= 0.1
##$BCFW= 0
##$BC_mod= 0
##$BYTORDP= 0
##$COROFFS= 0
##$CY= 15
##$DATMOD= 1
##$DC= 0
##$DFILT= <>
##$DTYPP= 0
##$F1P= 0
##$F2P= 0
##$FCOR= 0.5
##$FTSIZE= 32768
##$FT_mod= 6
##$GAMMA= 0
##$GB= 0
##$INTBC= 1
##$INTSCL= 1
##$ISEN= 128
##$LB= 0
##$LEV0= 0
##$LPBIN= 0
##$MAXI= 10000
##$MC2= 0
##$MEAN= 0
##$ME_mod= 0
##$MI= 0
##$NCOEF= 0
##$NC_proc= -8
##$NLEV= 6
##$NOISF1= 0
##$NOISF2= 0
##$NSP= 0
##$NTH_PI= 0
##$NZP= 0
##$OFFSET= 14.98509
##$PC= 1
##$PHC0= 92.59277
##$PHC1= 0
##$PH_mod= 1
##$PKNL= yes
##$PPARMOD= 0
##$PPDIAG= 0
##$PPIPTYP= 0
##$PPMPNUM= 2147483647
##$PPRESOL= 1
##$PSCAL= 4
##$PSIGN= 0
##$PYNMP= <proc.py>
##$REVERSE= no
##$SF= 400.02
##$SI= 32768
##$SIGF1= 0
##$SIGF2= 0
##$SINO= 400
##$SIOLD= 32768
##$SPECTYP= <>
##$SREGLST= <1H.CDCl3>
##$SSB= 0
##$STSI= 32768
##$STSR= 0
##$SW_p= 8223.68421052631
##$SYMM= 0
##$S_DEV= 0
##$TDeff= 65536
##$TDoff= 0
##$TI= <>
##$TILT= no
##$TM1= 0
##$TM2= 0
##$TOPLEV= 0
##$USERP1= <user>
##$USERP2= <user>
##$USERP3= <user>
##$USERP4= <user>
##$USERP5= <user>
##$WDW= 1
##$XDIM= 32768
##$YMAX_p= 466916969
##$YMIN_p= -765238
##$CURPLOT= <Network HP LaserJet P1505>
##$CURPRIN= <$Network HP LaserJet P1505>
##$DFORMAT= <normdp>
##$LAYOUT= <+/1D_H.xwp>
##$LFORMAT= <normlp>
##$PFORMAT= <normpl>
##$SURQMSG= 1
$$ End of Bruker specific parameters
$$ ---------------------------------
##NTUPLES= NMR SPECTRUM
##VAR_NAME=  FREQUENCY,     SPECTRUM/REAL,   SPECTRUM/IMAG
##SYMBOL=    X,             R,               I
##VAR_TYPE=  INDEPENDENT,   DEPENDENT,       DEPENDENT
##VAR_FORM=  AFFN,          ASDF,            ASDF
##VAR_DIM=   32768,         32768,           32768
##UNITS=     HZ,            ARBITRARY UNITS, ARBITRARY UNITS
##FACTOR=    0.250966925370066, 1,           1
##FIRST=     8223.43324360094, 22622,        -182671
##LAST=      0,             39840,           -75815
##MIN=       0,             -765238,         0
##MAX=       8223.43324360094, 466916969,    0
$$ Real data points
##PAGE= N=1
##DATA TABLE= (X++(R..R)), XYDATA
$$ [...]
19555A80298a28948d7292k93486A05774d17677g582A12247c0719B6693c03322
19544c82788i7737a1678l77839R2400M7270A98982d0453p7131j5039n4812h2377
19532b25456B90622a16975N6101B65724e6509K3164q1437A05671i8987b3673A05620
19520A68400q1767m888J00648a07011d8673A90830F3906i2053c0034k3446L540
19509d9940J0351B60567H9992Q244b97497o4816c7322B29720m0237C1402a51007
19497A00826c2186A1126R853b98376a10715A53030c1216j37825L4949N0114A97034
19485B23807J14497b63906h0308b0157F1274b60284h9558a3229p453B23504d38533
19473i8175A30399a19413A10877c46651A58409a6550m03255B6395J25027f2787
$$ y = [180298, -128948, -47292, -340778, 105774, -417677, -7582, 112247, -30719, 26693, -303322, -382788, -97737, -11678, -389517, -297117, -249847, 198982, -40453, -117584, -132623, -187435, -82377, -225456, 290622, -116975, -60874, 265724, -56509, -33345, -114782, 105671, -98987, -23673, 105620, 168400, 86633, 81745, 182393, -107011, -48673, 190830, 63906, -92053, -30034, -53480, -49940, -39589, 260567, 89992, 98236, -297497, -362313, -37322, 229720, 189483, 31402, -151007, 100826, -32186, 11126, 20979, -298376, -110715, 153030, -31216, -169041, -134092, -83978, 197034, 223807, 338304, -263906, -80308, -20157, 61274, -260284, -89558, -13229, -20682, 223504, -438533, -98175, 130399, -119413, 110877, -346651, 158409, -16550, -419805, 26395, 151422, -62787]
19462e1503k05405m4369b3768j45233j49700a41779r5210A82629H5550b35990
19451c14370D00815b44304c5761q2763d9191B47606a71122m2344A50770D3003
19440G3946e9034o5097j16794l3951O7030b2752l14509a0486o4294A35632b05779
19428a85327A2843h2624j87167G0918i8000a9195k58553B35725a30478A05100
19417b15080b9423A75726l7982M2844b78817J24568J9725k54840a78018j43111
19407c21129a52037A63864k0142c17916a6592r0605j36205A9454J83735p3293
19397A29896J1354a06283B55879b15111B211b81407A42897E3862b8397p0949M1935
19386e7411I3148A9998a37485a2597p4491B14813q3839b78369K8177D4593J64361
$$ y = [-51503, -256908, -301277, -23768, -169001, -318701, -141779, -236989, 182629, 85550, -235990, -314370, 400815, -244304, -35761, -118524, -49191, 247606, -171122, -213466, 150770, 43003, 73946, -59034, -124131, -240925, -274876, -207846, -22752, -337261, -10486, -74780, 135632, -205779, -185327, 12843, -82624, -269791, 70918, -98000, -19195, -277748, 235725, -130478, 105100, -215080, -29423, 175726, 137744, 180588, -278817, -154249, -134524, -389364, -178018, -321129, -152037, 163864, 143722, -317916, -16592, -107197, -243402, 19454, 203189, 129896, 141250, -106283, 255879, -215111, 2211, -281407, 142897, 53862, -28397, -99346, -57411, 93148, 19998, -137485, -12597, -87088, 214813, 130974, -278369, -250192, 44593, 208954]
19375B08954d5435l23933d3261j35052N1584d8096n4999C5285K09889b55690B08638
19363a54356M8284L1488A75274j4536h2432d614m1834q8439D8940a23426e1908
19351d9972j03747N6371j6174I066b61077p5137a49475k43485B14802d461j45888
19340a50349A28969j6911i4593A20186b1481j49157p7810h0532j45489F4847r344
19329E5503b02406i6564B03341M1582M7275G6105e28710B05748a17640M4292A35222
19317f8821a4044C6426N337a77075p1933k02655E7662J36238g246q7756j5340
19306a10342M9980j07253r2700A40010m5299i367n8580A41417b39153e7889j42438
19295b00327d5784A8329a65006E0569b44632l31359g6100B26742l9736a46067
$$ y = [208954, -45435, -369368, -43261, -178313, -126729, -48096, -103095, 35285, 245174, -255690, 208638, -154356, -106072, -74584, 175274, 160738, -82432, -4614, -46448, -134887, 48940, -123426, -51908, -49972, -153719, -97348, -113522, 9066, -261077, -336214, -149475, -392960, 214802, -4461, -150349, 128969, 112058, -94593, 120186, -21481, -170638, -248448, -80532, -226021, 64847, 55503, -202406, -96564, 203341, 244923, 292198, 76105, -528710, 205748, -117640, -73348, 135222, -68821, -14044, 36426, 41763, -177075, -249008, -451663, 57662, 193900, -7246, -95002, -110342, -60362, -167615, -260315, 140010, 94711, -9367, -67947, 141417, -239153, -57889, -200327, -45784, 18329, -165006, 50569, -244632, -575991, -76100, 226742, 187006, -146067]
19284c83693h2951C320M0237i7050r413A48431E0497R6250a07082d8872D6535
19272a65697A54376L5322e2118n3878j95183C4430a03770k20122C2383a1492m5295
19261e6787D9300a96230j04218j31691f5618j64506J2753F2477a8688G3650o849
19250F6801d79313a68078a60A25342E2367A2785f4487H268K05537i7064J7603
19239g9461L6484r4116j5872M1818J5708A32669A5686a12894j2271A43041a31504
19227B31549K48493a83502J4541c0691A91653P0110b19554B25074a73588A18752
19216c40021D6313i707D8560d8846J7611B08880k7973N2629a93589D4532a60488
19204c95648E0920a39482L294A55434a11153b6328A00237b19376j54831B4461
$$ y = [-383693, -82951, 3320, 43557, -97050, -106463, 148431, 50497, 146747, -107082, -48872, 46535, -165697, 154376, 189698, -52118, -105996, -301179, 34430, -103770, -323892, 32383, -11492, -56787, 49300, -196230, -300448, -432139, -65618, -230124, -217371, 62477, -18688, 73650, 66801, -479313, -168078, -160, 125342, 52367, 12785, -64487, 8268, 213805, -97064, -79461, -42977, -137093, -152965, -111147, -95439, 132669, 15686, -112894, -125165, 143041, -131504, 231549, 480042, -183502, -168961, -30691, 191653, 261763, -219554, 225074, -173588, 118752, -340021, 46313, -9707, 48560, -48846, -31235, 208880, 180907, 233536, -193589, 44532, -160488, -395648, 50920, -139482, -136188, 155434, -111153, -26328, 100237, -219376, -374207, 24461]
19193b62356g9253n2744D0346b4822j5492G1221c37588I3250a84162N4535c7249
19181a94874G8005B1150c21754A55502a33682B62313a41385q0226g1357F0579
19170b60053p3459a0634G8394J64757Q4822b49196J02821A46303H130a64593D1498
19158a04601B13991i3156R142j6700K1770D5462b64255B95764a4111n29609C3900
19146A73634C6230b05343j38762J43658A50572a61696I3848c79945C1355K62379
19136B93734c3815k93988h3103B16013g0803j75316O8662l56286K25675j75608
19126d83676a13626a2337B80128a86869A21891K21693i1637O20C531J4041b15495
19114B56546H0061g8715K3280m7226l5330j41526D8033b19870A76029j615n6459
$$ y = [-262356, -79253, -131997, 40346, -24822, -40314, 71221, -337588, 93250, -184162, -129627, -37249, -194874, 78005, 21150, -321754, 155502, -133682, 262313, -141385, -221611, -71357, 60579, -260053, -333512, -10634, 78394, 243151, 327973, -249196, -146375, 146303, 8130, -164593, 41498, -104601, 213991, -93156, -84014, -100714, -78944, 45462, -264255, 295764, -14111, -543720, 33900, 173634, 36230, -205343, -344105, -200447, 150572, -161696, 93848, -379945, 31355, 293734, -33815, -327803, -83103, 216013, -70803, -246119, -177457, -533743, -308068, -483676, -113626, -12337, 280128, -186869, 121891, 343584, -91637, -91017, 3531, 17572, -215495, 256546, 80061, -78715, -55435, -102661, -137991, -279517, 48033, -219870, 176029, 174414, 117955]
19103A17955g3050r3026D0709h2337l1616K8172G4896J90495c2114I6543K42641
19092C39184E3524m196a06206j84357e5049o1835p1485j87507A67800p1083a00171
19080b29048A33370a39933j86186a57403F3854L7298Q1631A2237a53604e686j71813
19069a77499A90987b84337a05198j43670J06150d2535j94409M7982g8756l20672
19059c99428k3920D98a95036C6733L4178b33245I4075O2196a75491f4899K2974
19048d1925o999B4098a1354E5607b62532A94337c24573d8547B20388g3199A21354
19036a38981r9889e6737A27053a70307C20881j50775a64455B18773N7404J819
19026B77996J04410F0369M9063D5696K30137D6365b01145G302R8245c5654Q835
$$ y = [117955, -73050, -166076, 40709, -82337, -113953, -85781, 74896, 265391, -32114, 96543, 339184, 53524, 49328, -106206, -290563, -55049, -116884, -188369, -375876, 167800, 96717, -100171, -229048, 133370, -139933, -326119, -157403, 63854, 101152, 182783, 12237, -153604, -5686, -177499, 190987, -284337, -105198, -248868, -142718, -42535, -236944, -188962, -78756, -399428, -423348, 498, -195036, 36733, 70911, -233245, 94075, 156271, -175491, -64899, -41925, -48924, 24098, -11354, 55607, -262532, 194337, -324573, -48547, 220388, -73199, 121354, -138981, -238870, -56737, 127053, -170307, 320881, 170106, -164455, 218773, 276177, 277996, 382406, 60369, 109432, 45696, 275833, 46365, -201145, 7302, 105547, -35654, -26819]
19015b6819F8564d7953l70969g2763C457a28883E0759c6310j23088K8469l0644
19004a61573A89187g4564E7207J83585k9637H1768J13468b08026I2883B6322e6273
18992f4488D5515L4635a60096m9340q9341K6387A26241e1599k07636i3458C3182
18980A17702a54103e8371j0789A9513a00258l0213k28677J50854P7431p7412B44077
18968B11d5041n55760a25296N3602b8820C18601b20919A27259h6816A15598k5405
18957I0193J17979a22610J39A24865f8154D77390i0232j4786d0833G1941A6643
18945a14961D0598M4502i4530k50398B49615b23342F2294k8433J01997E3825f5848
18933A50705b20797B63124L614N8925h4965k68055G6401L08129a07824A6220J526
$$ y = [-26819, 68564, -47953, -418922, -72763, 3457, -128883, 50759, -36310, -159398, -130929, -161573, 189187, -74564, 57207, 240792, 211155, 81768, 195236, -208026, 92883, 26322, -56273, -64488, 45515, 80150, -160096, -209436, -298777, -272390, 126241, -51599, -259235, -93458, 33182, 117702, -154103, -58371, -69160, 19513, -100258, -130471, -359148, -208294, -130863, -208275, 244077, 211, -45041, -600801, -125296, -71694, -28820, 318601, -220919, 127259, -86816, 115598, 90193, 208172, -122610, -122471, 124865, -68154, 477390, -90232, -105018, -40833, 71941, 16643, -114961, 40598, 85100, -94530, -344928, 249615, -223342, 62294, 33861, 135858, 53825, -65848, 150705, -220797, 263124, 266738, 325663, -84965, -353020, 76401, 384530, -107824, 16220, 17746]
18922A7746L554a44696f4655o372k58188b4812o7466A54263b7671j07489p5362
18911b10522Q4365L800j45784A28118D2070j3045A3867f8917a9633m2315j14229
18900a76177A617Q5859J31936J88936A6218a9845A27725b35727k8889c9335a3118
18888G2306a9530r9977j63809O0341J1438A41859B3658f5793k83168a54502q3408
18877b37910P3747d007F750c05912a52065g5173l3897l37248J64818R3339K3304
18866a64857E0287J939P7356D7127a88976f5472C6854j0773I134a29514j00158
18855b29672A45196a05822A68709G527J63717a48579n643q4446b5465A8415e9668
18843B26631G1594J25187f8742r9250F7660k7629e9304k39847c8199p191D0302
$$ y = [17746, 21300, -144696, -64655, -71027, -329215, -24812, -92278, 154263, -27671, -135160, -210522, -126157, -122357, -268141, 128118, 42070, 29025, 13867, -68917, -19633, -61948, -176177, 1617, 87476, 219412, 408348, 16218, -19845, 127725, -235727, -264616, -39335, -13118, 72306, -19530, -119507, -283316, -222975, -211537, 141859, 23658, -65793, -348961, -154502, -237910, -164163, -4007, 6750, -305912, -152065, -75173, -109070, -446318, -281500, -188161, -164857, 50287, 52226, 129582, 47127, -188976, -65472, 36854, 26081, 9134, -129514, -229672, 145196, -105822, 168709, 7527, 171244, -148579, -154222, -238668, -25465, 18415, -59668, 226631, 71594, 196781, -68742, -167992, 67660, 40031, -59304, -299151, -38199, -45390, 40302]
18831c10477a8634q5925B36629l5177d4666B35649j07868e3761k8976A82533c3218
18819A11002b09053B8557P1466j0656a71323J2045A06483l9166L74375j77267
18809B64425o5854p9374l7708B092g5546b9567A76870f1569A1686d15695A18751
18797c47070a28657j39058A8882e767C47744b31637J02171j21479g1381B06269
18786b74395a04600C46846d4892j38965b195j97371A41976H798a92434A84845
18775b54095P239d0601B83119a61710p0288j6748D0230a57675c3907n298A43053
18763b16434f0588C52931A21841E7139R3729d480a886k74693a9347k46971a22222
18751a8219r8394q6031i6734k4729o3399A03930c61819A60392c77012a60645p6529
$$ y = [-310477, -18634, -104559, 236629, 201452, -44666, 235649, 127781, -53761, -82737, 182533, -33218, 111002, -209053, 28557, 100023, 89367, -171323, -159278, 106483, 67317, 441692, 264425, 198571, 119197, 81489, 2092, -75546, -29567, 176870, -61569, 11686, -415695, 118751, -347070, -128657, -267715, 18882, -5767, 347744, -231637, -129466, -250945, -71381, 206269, -274395, -104600, 346846, -44892, -183857, -2195, -199566, 141976, 8798, -192434, 184845, -254095, -246856, -40601, 283119, -161710, -231998, -248746, 40230, -157675, -33907, -39205, 143053, -216434, -60588, 352931, 121841, 57139, 150868, -4480, -1886, -276579, -19347, -266318, -122222, -18219, -116613, -202644, -96734, -121463, -184862, 103930, -361819, 160392, -377012, -160645, -237174]
18740b37174a48m3320q1433m5247j95287D6743b06257h6678C49944h3726C14060
18728a70603q4395J18664p4893j28628L0596R8803e3375B23564a07181A1222P0587
18717H1809J43466a15933k43988h2035A19648g3921j37078C2477Q1279a81293
18706B1064c886j65960B11670g5363m859n7088j06373j05572a492A51224C0851
18694d03955a46336I6270b4596A00190c32274N0818a21404C62597b30211F8390
18683B51823a73332j26308D8987A4419a14624A13981b50987o8871J28572J0402
18673a80884a0856n3072j0566A97490h8197J9690E240a58881B74932a51345C53467
18661B25451H376d8618B51129E570N5145K6316e2810D67704i2605D5604B0557
$$ y = [-237174, -148, -43468, -124901, -170148, -365435, 46743, -206257, -86678, 349944, -83726, 314060, -170603, -254998, -136334, -211227, -339855, -309259, -210456, -53375, 223564, -107181, 11222, 81809, 225275, -115933, -359921, -82035, 119648, -73921, -210999, 32477, 113756, -181293, 21064, -3886, -169846, 211670, -75363, -80222, -137310, -243683, -349255, -1492, 151224, 30851, -403955, -146336, 96270, -24596, 100190, -332274, -281456, -121404, 362597, -230211, 68390, 251823, -173332, -299640, 48987, 14419, -114624, 113981, -250987, -319858, -191286, -180884, -10856, -63928, -74494, 197490, -88197, -68507, 5240, -158881, 274932, -151345, 353467, 225451, 8376, -48618, 251129, 5570, 60715, 87031, -52810, 467704, -92605, 45604, 20557]
18649a09352c6385a2526o2349l37507a29064c8108j00960j45280J31248G618J0629
18638A8247a43406A58131a32330d603j11087M5876n7218l54917A54836a28297
18627A51890b68293J7876b3975D7483j221d32001J49875e6228k9564B8874P48
18616B9622a3911A7588a58369r6187a02577H2905h2905b4242A37194a49187j9916
18605a69103j47145a00901C0484K28661c7226l62097a43654A16722d71203B333
18594a11499J554j6381A62893a65339M7492p6973A30394K21435c0160k72568a09973
18582I0319d5595q4830p7896h6863G4630e0365I5571o529a03127I703e1778A4629
18569b25463f9761J1775k9960A24052a33104D4427N3624k5288d49227r9033C0382
$$ y = [-109352, -36385, -12526, -74875, -412382, -129064, -38108, -139068, -284348, -153100, 7618, 18247, -143406, 158131, -132330, -4603, -115690, -69814, -127032, -481949, 154836, -128297, 151890, -268293, -250417, -23975, 47483, 46262, -432001, -282126, -56228, -85792, 28874, 29622, -13911, 17588, -158369, -254556, -102577, 82905, -82905, -24242, 137194, -149187, -169103, -316248, -100901, 30484, 259145, -37226, -399323, -143654, 116722, -471203, 2333, -111499, -109945, -126326, 162893, -165339, -117847, -194820, 130394, 351829, -30160, -302728, -109973, 90319, -45595, -130425, -208321, -86863, 74630, -50365, 95571, 89042, -103127, 9703, -51778, 14629, -225463, -69761, -57986, -87946, 124052, -133104, 44427, 98051, 72763, -449227, -548260, 30382]
18557a40383O2555j28809d8018B3885O1989a6572A60812n4948b75564K3514a05178
18545e6757C4263h0017E3804b89293f5009D1288c52060A02570A228b28800L2720
18534a96080A18822c39463g266l72349a75122P2601L7507A90387p6183a28563
18523b4022G6827B8756b14705B98181a72192A26319E0880a10047j450j26560B2047
18511a39866F5574d69359c3772A459a70263k96875O6556J96368A0636J50759b79307
18499A77641m1971E1939a1199k67949a25921n9643E13J55994J86936c4260A94387
18487a93877B80397r2816b06600E2644J56688c41976g857j30395r624d5115A11630
18475a00607B29000b01346A36348J73827a24443j04505F16981a22960c9845l7611
$$ y = [-140383, -77828, -206637, -48018, 23885, 85874, -16572, 160812, 105864, -275564, -252050, -105178, -56757, 34263, -80017, 53804, -289293, -65009, 41288, -352060, 102570, 1228, -228800, -196080, 118822, -339463, -7266, -379615, -175122, -102521, -65014, 190387, 114204, -128563, -24022, 76827, 28756, -214705, 298181, -172192, 126319, 50880, -110047, -111497, -238057, 22047, -139866, 65574, -469359, -33772, 1459, -170263, -467138, -400582, -204214, 10636, 161395, -279307, 177641, 135670, 51939, -11199, -279148, -125921, -185564, 513, 156507, 343443, -34260, 194387, -193877, 280397, 187581, -206600, 52644, 209332, -341976, -7857, -138252, -147876, -45115, 111630, -100607, 229000, -201346, 136348, 310175, -124443, -228948, 616981, -122960, -39845, -77456]
18465g7456E7555b06927A03362P7742b77927M890B54885e4576G8351b13038M109
18454b08929M7678a9018o0411A0435J56874j2270C3808K1927a10380l1303c9622
18442E8557k4237a01283j98604A84115l3303g3355J0652a233j76520h1368j44072
18431b25440D5680d4659q9024l7417j7336j66260C5559e6671A48511J5063a42982
18419a85807b2045l59975g7501B54248a92121I456b3592k27530g6536B07993A4145
18407A21895a75194L7301M9320A34417a9244B39705b98020b4787A20898b17003
18396B5669a74335l145n135n2982n2416P932h5230A8635a83920p5055j88397B57948
18383a69294j46725A76026c64956C44414A56016h0174A6248Q6997C96a76189k3757
$$ y = [-77456, 57555, -206927, 103362, 181104, -277927, -273037, 254885, -54576, 78351, -213038, -208929, -161251, -19018, -79429, 10435, 167309, 155039, 33808, 55735, -110380, -141683, -39622, 58557, 34320, -101283, -299887, 184115, 150812, -73355, -62703, -1233, -177753, -81368, -225440, 45680, -44659, -133683, -171100, -188436, -354696, 35559, -56671, 148511, 163574, -142982, -185807, -22045, -382020, -77501, 254248, -192121, 9456, -23592, -251122, -76536, 207993, 14145, 121895, -175194, -137893, -88573, 134417, -19244, 239705, -298020, -24787, 120898, -217003, 25669, -174335, -177480, -182615, -235597, -288013, -280081, -85230, 18635, -183920, -258975, -447372, 257948, -169294, -316019, 176026, -364956, 344414, 156016, -80174, 16248, 103245, 396, -176189, -199946]
18372a99946l2151J4098K3413N2240F783N6042b95660B78934m1776A5337e3579
18360a0701A12776b11316N3793A04853c06908J36534E4341f9060G1614M64O3996
18349A36074c09715a53826d2143j74159d7025o477m501j58521h8868j25031O110
18338b07789R2771k18371J44788q8625a29009A67377g3721A8523i3284A32001
18327A71938a25993A1584a26930k22124a5820r2488e878n37913B25370a31691
18316d3963L086H0596g3307k26802g9733k29019D5780J87641a91615c0368j40882
18305a71250b3358E5863M6616c30662A20721P861d19297C32920b07970j61053
18295c69023a82640C8385d7105G3593d7368B22434a94596G9922J90303G6594e8596
$$ y = [-199946, -232097, -217999, -194586, -142346, 6783, 62825, -295660, 278934, 237158, 15337, -53579, -10701, 112776, -211316, -157523, 104853, -306908, -170374, 54341, -69060, 71614, 72078, 136074, -309715, -153826, -42143, -216302, -47025, -53502, -58003, -216524, -88868, -213899, -207789, -115018, -333389, -188601, -277226, -129009, 167377, -73721, 18523, -93284, 132001, 171938, -125993, 11584, -126930, -349054, -15820, -108308, -5878, -543791, 225370, -131691, -43963, -40877, 80596, -73307, -300109, -79733, -308752, 45780, 233421, -191615, -30368, -171250, -23358, 55863, 102479, -330662, 120721, 128582, -419297, 332920, -207970, -369023, -182640, 38385, -47105, 73593, -47368, 222434, -194596, 79922, 270225, 76594, -58596]
18283a31495F178K1673P4558f8473o4014A45847a58555A3070L9517R7878A3254
18271b72731j50394D11195G4372j0751L22821b12468e028A22568a10704b9015
18260A2900h0288J9581r2054A27783c4619F6724M1357J2534P0988G645b64176
18248b94697i5560A73936b73889B26149G2538e2059k39555A05407J9495b07713
18237i0195I9326K5520c03870a09317I0548P0838R7760D1405M8001B0643R61a98831
18224b12482d2283J1026A20421D7595J23452c6189j9076A02953b6040B25658a17212
18212I1219a42007J4039L1921C59888A44026e3293j01369I2356A8769a65265e4372
18200i6344k4943B12350B1661a49455C45399b99070f8634j86397L3728P3290c0307
$$ y = [-131495, 6178, 27851, 102409, -68473, -132487, 145847, -158555, 13070, 52587, 150465, 13254, -272731, -423125, 411195, 74372, 63621, 386442, -212468, -5028, 122568, -110704, -29015, 12900, -80288, -60707, -152761, 127783, -34619, 66724, 108081, 120615, 191603, 7645, -264176, -294697, -95560, 173936, -273889, 226149, 72538, -52059, -291614, 105407, 124902, -207713, -90195, 99326, 124846, -303870, -109317, 90548, 161386, 259146, 41405, 89406, 20643, 21604, -198831, -212482, -42283, -31257, 120421, 47595, 171047, -36189, -55265, 102953, -26040, 225658, -117212, 91219, -142007, -127968, -96047, 359888, 144026, -53293, -154662, 92356, 18769, -165265, -54372, -96344, -121287, 212350, 21661, -149455, 345399, -299070, -68634, -255031, -221303, -148013, -30307]
18188a6574m3653j33572A08031a31305o9714B23132h7804B03857b67057o1371
18178c28428A59629J7028c55072A96709a88243B5060c261k91982C88074a01239
18167a26009l4050D54689a77985b5860j91775A02134a12843j40656b6083l1252
18157e7335j71040D6197f6397k82117I6689d1493D7381h8215o2136i216l3687
18146d2903H2434a72875A37746m0496d5316A52251a832M74F4889K92443j52712
18135B04620G3058J86072b2923n0374j9329l18057a00936k13373C0224d2139m2378
18124h4517K4846H8593P8464b35216P9013f5897A45628M107n6421e0284H3467
18112b19684G9790K27260a39856A12651O3121f129o0760J368F9480a61387r6765
$$ y = [-16574, -60227, -193799, 108031, -131305, -201019, 223132, -87804, 203857, -267057, -328428, 159629, 176657, -355072, 196709, -188243, 25060, -3261, -295243, 388074, -101239, -126009, -160059, 454689, -177985, -25860, -217635, 102134, -112843, -253499, -26083, -57335, -228375, 46197, -66397, -348514, 96689, -41493, 47381, -88215, -150351, -9216, -42903, 82434, -172875, 137746, 97250, -45316, 152251, -1832, -1358, 64889, 357332, 204620, 73058, 259130, -22923, -73297, -92626, -410683, -100936, -314309, 30224, -42139, -84517, -59671, 88593, 167057, -235216, -156203, -65897, 145628, 149735, 93314, -50284, 83467, -219684, 79790, 307050, -139856, 112651, 175772, -6129, -66889, -65521, 69480, -161387, -258152]
18101b58152A99953a20300l85865A13938J47131g080I5257J75294c11536B0138
18090e04463B26098b88653C5716K5105K63202c79642R1069H9018a83234L5382
18080a47852k7905A24856C7133J76703d307B00392b5162q7488A40527O2190d41552
18068a2426k47604k8851H300g607k51979i1028n5254m7839b6555A37929B6376
18056e5548k889j15947f1106q3586B84780C0134a65201F1450j4843M4378g9964
18044a43354A58729A9840b09027l38282A72888a06771D3277R2509R471G1748a73918
18032B08868P4202b14917N6954A4994g1198E6339a68672M0816A51097a16403k65535
18021c81938J53734B45756C5720K4385K0972r674a02158A70470a05643l40950
$$ y = [-258152, 199953, -120300, -506165, 113938, 261069, -7080, 95257, 270551, -311536, 20138, -504463, 226098, -288653, 35716, 60821, 324023, -379642, -288573, 89018, -183234, -147852, -175757, 124856, 37133, 213836, -4307, 200392, -25162, -112650, 140527, 202717, -441552, -12426, -260030, -288881, 8300, -7607, -259586, -91028, -146282, -194121, -26555, 137929, 26376, -55548, -58437, -174384, -61106, -144692, 284780, 30134, -165201, 61450, 46607, 90985, -79964, -143354, 158729, 19840, -209027, -547309, 172888, -106771, 43277, 135786, 145257, 71748, -173918, 208868, 283070, -214917, -157963, 14994, -71198, 56339, -168672, -127856, 151097, -116403, -381938, -228204, 245756, 35720, 60105, 81077, 71403, -102158, 170470, -105643, -446593]
18011d46593A35090n0780A5009f6889F1361b902B8673K77822k8676g9422L7689
18000d1733j95830J13967j48315k2980J7095J21829j26825B69879j6034r8890
17990A54955f4740B00901O761a6815A75022a02555q6244j29722B31895a52128
17979A56128a2239m992A92781b12647H5727a3165C0558d8711A8527a83096B38254
17967b1171A7470c9646o0223j8337j67098G2709a08337K1052A50475a39861A48362
17955A42248G0371a26774B15345a78736D5239a91436O8348j62463E2555a3036
17944A927K5663Q2240O4196h1037j79438D1270b16210Q66p0488C5975a04257I2622
17931a00911o5113b606o220A68771d9847a7964j91052G6830K14071A0790N9473
$$ y = [-446593, 135090, 84310, 15009, -66889, 61361, -2902, 28673, 306495, 277819, -79422, -41733, -237563, -123596, -271911, -294891, -277796, -155967, -282792, 269879, 253845, 154955, -64740, 200901, 207662, -16815, 175022, -102555, -188799, -318521, 231895, -152128, 156128, -12239, -17231, 192781, -212647, 85727, -13165, 30558, -48711, 18527, -183096, 238254, -21171, 17470, -39646, -99869, -118206, -285304, 72709, -108337, -87285, 150475, -139861, 148362, 142248, 70371, -126774, 215345, -178736, 45239, -191436, -123088, -285551, 52555, -13036, 1927, 27590, 109830, 174026, -81037, -260475, 41270, -216210, -215344, -285832, 35975, -104257, 92622, -100911, -166024, -2606, -8826, 168771, -49847, -17964, -209016, 76830, 290901, 10790, 70263]
17920G0263d84768A94779a40473I9701D1756a96435Q3846L7681B34091m490a14424
17908f6375j96617G1041d10766A40443c73015B4028K08907f8597E1583K57705
17898C09288b03700q4735h0061H9190h6880a0793m1318l07158f0888p4547A16939
17886D3665J96332b88032J09124j60424a18673E4203J48166l7317l3773B7404
17875a08872K6541L2539k03923A56351a50461g1156m1625A69414J8108c30286
17864a41628L7243I5636B3420J41563a30633B29303a90748N0757O5376B07694
17853A01713J19875H8439b91008h5068A43751b17899B20790a72802j24832C19253
17842f044l7171l792A37778b05889A1707a52121B52055d75749a95392F8985a01509
$$ y = [70263, -484768, 194779, -140473, 99701, 41756, -196435, -112589, -74908, 234091, 229601, -114424, -66375, -262992, 71041, -410766, 140443, -373015, 24028, 232935, -68597, 51583, 309288, -203700, -288435, -80061, 89190, -86880, -10793, -52111, -359269, -60888, -135435, 116939, 43665, 239997, -288032, -178908, -339332, -118673, 54203, 202369, 165052, 131279, 27404, -108872, -82331, -49792, -253715, 156351, -150461, -71156, -112781, 169414, 187522, -330286, -141628, -104385, 95636, 23420, 164983, -130633, 229303, -190748, -139991, -74615, 207694, 101713, 221588, 88439, -291008, -85068, 143751, -217899, 220790, -172802, -297634, 319253, -6044, -43215, -47007, 137778, -205889, 11707, -152121, 252055, -475749, -195392, 68985, -101509]
17830a44244j95437a00909b4560l6330H8098M3809f9263k8597k12037C72090A8790
17818A110a71682C14478e5515A0478J03269L0824a50576f7516A41271b82515A6038
17806A89471b8661D5619k1921b85609d5343B07210b32413d930A18245a83057i0024
17794A62164c6850l4217A90671C7548c03393c6625j13153A0344M9763g6340H9021
17782E4807a46779j35510g8097A09586b20532p5990i7854a3966j88015f7666C8581
17770H6184c3821A55463p6284K7708k554K62298p3781d3049F9834g2395A60724
17758a05401L3770j92475A7776L3014a37153N3591A5501f2498j59989A63405G4001
17746a28177C62554b7255A54762o6054O9404A9372J86720o7448a27940A28170
$$ y = [-144244, -339681, -100909, -24560, -60890, 88098, 131907, -69263, -97860, -309897, 372090, 18790, 1110, -171682, 314478, -55515, 10478, 113747, 144571, -150576, -67516, 141271, -282515, 16038, 189471, -28661, 45619, 23698, -285609, -45343, 207210, -232413, -4930, 118245, -183057, -90024, 162164, -36850, -71067, 190671, 37548, -303393, -36625, -149778, 10344, 60107, -76340, 89021, 54807, -146779, -282289, -78097, 109586, -220532, -296522, -97854, -13966, -201981, -67666, 38581, 86184, -33821, 155463, 79179, 106887, 104333, 366631, 292850, -43049, 69834, -72395, 160724, -105401, -71631, -264106, 17776, 50790, -137153, -83562, 15501, -62498, -222487, 163405, 74001, -128177, 362554, -27255, 154762, 88708, 158112, 19372, 206092, 138644, -127940, 128170]
17735D850a55836C7994J40461b36188k8220h9469p1383C60524A03119a25217K1905
17724a03312A66583J01180o0562d8922j33962L8625f7043k69659a62507H6313
17713I8645J5107a0488j72F5308b38526Q1298e0962H2541J25186b202B0349g1002
17700i8578k17694a32460B37815a26757j3838C66504b19985C42220j01345q5316
17690A55559c56810B7357K01311c3230B46935f0569J1357f441j61305E4711a35373
17678I0955h7518E2007L35397a20335o8179I6236a93929A10463a07585G9431a46134
17666c7547m1522E274a80352M3773A32511C1149K53003b57629A28293a20546c5145
17654a31501C1316K56148i4922j78344B45864Q6305C0246L04406c93604c7472
$$ y = [4850, -155836, 37994, 178455, -236188, -264408, -89469, -160852, 360524, 103119, -125217, -103312, 166583, 267763, 207201, -48922, -182884, -144259, -67043, -336702, -162507, 86313, 98645, 113752, -10488, -10660, 65308, -238526, -157228, -50962, 82541, 207727, -2202, 20349, -71002, -98578, -316272, -132460, 237815, -126757, -140595, 366504, -219985, 342220, 240875, 155559, -356810, 27357, 228668, -33230, 246935, -60569, -49212, -6441, -167746, 54711, -135373, 90955, -87518, 52007, 387404, -120335, -188514, 96236, -193929, 110463, -107585, 79431, -146134, -37547, -79069, 5274, -180352, -136579, 132511, 31149, 284152, -257629, 128293, -120546, -35145, -131501, 31316, 287464, -94922, -273266, 245864, 332169, 30246, 334652, -393604, -37472]
17643a45840E4948d73152e6458A18483a83388C4342K686J45550b3174A34619n5037
17632G9582e0064J7546j29699B93417h0698A2884O8567a79763r4521J21949A46562
17620a7910k34665B04342c09272B95358a04314j29398J9726A45435i9834B77747
17609A20236J58918b8880n368m0641C8432K50594j41356i1721B999a97731j1677
17598b09408C13518g6188j17605L7511m2277B2540a18336A63130j9508F9863c62272
17586f1481n7851D3164J60129c5748d023k9034B77178A34860K8844a15612Q737
17575a06875j324B27563C5296P8206b04184m7217a18521j99877a39891A62397
17564B00640l9635o1462b2962k82481B34187J30695a37063C86601a08531a5290
$$ y = [-145840, 54948, -473152, -56458, 118483, -183388, 34342, 37028, 182578, -23174, 134619, 79582, -50064, -32518, -162217, 293417, -80698, 12884, 81451, -179763, -274284, -152335, 146562, -17910, -252575, 204342, -309272, 295358, -104314, -233712, -213986, 145435, -99834, 277747, 120236, 279154, -28880, -34248, -74889, 38432, 289026, 147670, -91721, 2999, -197731, -209408, 313518, -76188, -193793, -156282, -198559, 22540, -118336, 163130, 143622, 69863, -362272, -61481, -119332, 43164, 203293, -35748, -4023, -33057, 277178, 134860, 163704, -115612, -106875, -108199, 227563, 35296, 113502, -204184, -251401, -118521, -318398, -139891, 162397, 200640, 161005, 99543, -22962, -305443, 234187, 364882, -137063, 386601, -108531, -15290]
17553b17555E5647b3074B51648b2948A29591e8745C0321K08165m6896J82426B91
17541d7840B76025b8682I9027i8743C73384A46492a25512H4005p925b7357A91395
17529C07779a40389C24121c6029B700b02920A89895A1288J11863K62J47249j01059
17518A69603a95171I581M92576A52081J32224A28334J00548J17599p5807p4615
17508A96059a31531B86559d0549F7425K44709q9501B7504L9787l1401Q1219l1935
17497H5174B3135L99622m7049A37215a16884b2847C50597A340c78402b4988B53301
17485I3287f0993A0811i609A8092L14023J40769h959A69946N8609e5957j45507
17474b01464A21211m7845J26487b4505A1696J51856l8552c24890B16836D7243
$$ y = [-217555, 55647, -23074, 251648, -22948, 129591, -58745, 30321, 238486, 191590, 374016, 291, -47840, 276025, -28682, 99027, -98743, 373384, 146492, -125512, 84005, 76080, -27357, 191395, 307779, -140389, 324121, -36029, 2700, -202920, 189895, 11288, 123151, 123413, 270662, 169603, -195171, 9581, 502157, 152081, 284305, 128334, 228882, 346481, 270674, 196059, -131531, 286559, -40549, 67425, 312134, 222633, 27504, 67291, 35890, 117109, 85174, 23135, 422757, 375708, 137215, -116884, -22847, 350597, 1340, -378402, -24988, 253301, 93287, -60993, 10811, -9609, 18092, 332115, 472884, -8959, 169946, 228555, -55957, -201464, 121211, 73366, 199853, -24505, 11696, 163552, 125000, -324890, 216836, 47243]
17463c9285A52654k8659J36427H6231J82207d0656B31228L15136B28943g2948
17452B9003d1949G1561K182P3182q97N1645M7342F0497L95569B2559b25485C21602
17439A83918Q6030l2868a09063B74114c27524B72829k4716q357H8717K9010J80745
17428B98472Q6549j29122P5154A02546J20154M9614A18777Q4132R6445j34684
17418A64670K0700k1507R9165G0504M66354A39734R6375E177M6956K06358G9472
17406g3802B48064p5979D2151K033L55217j08964a64680Q0929A23688q320J03611
17395B18979b6160m66228e2546I106J57580c25855H3629J11927K20920a31145
17384B34942i3354A96473e758j31364A72284L8649d6066A80372a08618A83041
$$ y = [-39285, 152654, 123995, 260422, 86231, 268438, -40656, 231228, 546364, 228943, -72948, 29003, -41949, 71561, 73743, 146925, 146028, 197673, 245015, 60497, 456066, 22559, -225485, 321602, 183918, 269948, 237080, -109063, 274114, -327524, 272829, 248113, 239756, 88717, 117727, 298472, 385021, 255899, 331053, 102546, 222700, 272314, 118777, 202909, 299354, 164670, 185370, 163863, 263028, 70504, 536858, 139734, 236109, 5177, 52133, 258491, 79472, -73802, 248064, 172085, 42151, 44184, 399401, 290437, -164680, -83751, 123688, 115368, 218979, -26160, -492388, -52546, 9106, 166686, -325855, 83629, 195556, 416476, -131145, 234942, -93354, 196473, -5758, -137122, 172284, 210933, -46066, 180372, -108618, 183041]
17373f933C74010j30221i6372r2746B14396H7227C3038K66737L1087a18110B97132
17361b2883D06386e3093B24113o2632B5980K15972a68619E53834B61512b452A57624
17349b3727D9191K450K192a0942B61336r8328a55628B62505G5029A1665J07383
17338A19048f8700B06265g1625C43362G140M02216j55638Q8063j21025H412a02663
17326G042J12777M1848c5208a4231B36792D8838b37756J9334d6841C44675h5628
17314B98330G6377O8361d7552B23846Q1015j22956a26994E8979c357j15864b589
17302A16624b70475B47709m4860a91268A50155K38884j8803A20711J0270E3593
17291B96198B3522p419J57087F4600a08864C98139J29939F5890J66244L9654J48861
$$ y = [-6933, 374010, 243789, -96372, -189118, 214396, 87227, 33038, 299775, 330862, -118110, 297132, -22883, 406386, -53093, 224113, 161481, 25980, 241952, -168619, 553834, 261512, -2452, 157624, -23727, 49191, 51641, 53833, -10942, 261336, 163008, -155628, 262505, 75029, 11665, 119048, -68700, 206265, -71625, 343362, 7140, 409356, 253718, 341781, 220756, 8412, -102663, 7042, 119819, 161667, -35208, -14231, 236792, 48838, -237756, -218422, -46841, 344675, -85628, 298330, 76377, 144738, -47552, 223846, 304861, 181905, -126994, 58979, -3357, -119221, -2589, 116624, -270475, 247709, 202849, -191268, 150155, 389039, 370236, 120711, 130981, 53593, 296198, 23522, 16103, 173190, 64600, -108864, 398139, 528078, 65890, 232134, 271788, 420649]
17280D20649d994A81583P0176I6037J4946a49800b6311k1357I9253K98215a37559
17268C21631q2272q6319D1937i8174B7386L35654l5992j57492a66313B02076K1339
17257B23415E4275L53432j36728j28056O5828F5793b3753C03406A05049l7525
17247F7524K48367n2156j8008K04614B8268q926N3551L676Q0462b45852A86088
17235A08553J12010I4581J6718L6012L7924H8134L69640F2464K15519j08350J20084
17224B89717j09459J5532a46283D6169K66889j29198q0886K04814a28264a6491
17213I0597a5206o8333G3050K00845A15037K18236K810J78339B16976P6469K1742
17202C15187B6831J03494m9415J49313K95733B42939A4674N13574k50191j1846
$$ y = [420649, -4994, 181583, 251759, 96037, 110983, -149800, -26311, -47668, 99253, 397468, -137559, 321631, 239359, 153040, 41937, -98174, 27386, 363040, 327048, 169556, -166313, 202076, 223415, 54275, 407707, 270979, 142923, 208751, 65793, -23753, 303406, 105049, 67524, 315891, 263735, 245727, 450341, 28268, 19342, 72893, 76569, 157031, -245852, 186088, 108553, 220563, 94581, 111299, 147311, 185235, 88134, 457774, 62464, 277983, 169633, 289717, 180258, 195790, -146283, 46169, 313058, 183860, 102974, 307788, -128264, -16491, 90597, -15206, -83539, 73050, 273895, 115037, 333273, 336083, 514422, 216976, 293445, 315187, 26831, 130325, 80910, 230223, 525956, 242939, 14674, 528248, 278057, 266211]
17192B66211a79876C16994G9584K3509f4019F7318J86721E5585k5808J76655k4226
17181A82206J82623A11740P8507J08692A12747K42411J49531p8671A67346J42974
17171C10320k8850H9222K36872J12748P9581C1915e059j136A71479K20919j00437
17160B91961r3250J6263C3555M34072D5519J18226L8968K04619A53257K83851
17150D37108n6632A89582K73708A79630M915N3765k1101J09629J52730k28318
17140B51250b31302D01553j04004j05689J7735G5908K14571J60017r7199j01213
17130B52084K34720j2928I5836K637K6604J85431L5431J95697j40042J45255F1807
17118C668K38643J84403A95510L81872C5996L88410G732J3919J57297k1635L95953
$$ y = [266211, -179876, 316994, 79584, 103093, -64019, 67318, 254039, 55585, 29777, 206432, 182206, 364829, 111740, 190247, 298939, 112747, 355158, 504689, 426018, 167346, 310320, 281470, 89222, 326094, 438842, 518423, 31915, -5059, -6195, 171479, 392398, 291961, 198711, 214974, 33555, 467627, 45519, 163745, 202713, 407332, 153257, 437108, 380476, 189582, 463290, 179630, 184545, 238310, 217209, 326838, 479568, 251250, -231302, 401553, 297549, 191860, 209595, 75908, 290479, 450496, 353297, 252084, 486804, 473876, 95836, 98473, 125077, 310508, 345939, 541636, 401594, 546849, 61807, 3668, 242311, 426714, 195510, 577382, 35996, 424406, 7732, 21651, 178948, 157313, 553266]
17107E53266A88542J28319L9453J92576A20242M37505d6601A57663L19713B22985
17096B11781L54799N8579k53715l0289p1572Q0911q8292J52304K8021A54853M05577
17085E60430k72131J84630j86988K25145A78755L7647I5600J08986F5927M24238
17075D90165B32800E7978j1952J05732L24567A81408P6731P0008L93823k10122
17065E11848F6288K45532L52564l03007A02235M45495N1271k48468Q5021N4617
17055D90171K3572m0318j92321j22551J75208K38880j36667j8018K57316j16177
17045E59095k70654J20774j95518K94855J53166A01337K24347L27398A47238Q8628
17035B35866J10077r2240M4357K48795n4782j04531K13647M8998M1027k83492
$$ y = [553266, 188542, 316861, 356314, 548890, 120242, 557747, -46601, 157663, 477376, 222985, 211781, 566580, 625159, 371444, 341155, 269583, 350494, 262202, 414506, 442527, 154853, 560430, 288299, 472929, 285941, 511086, 178755, 216402, 95600, 204586, 65927, 490165, 232800, 57978, 46026, 151758, 476325, 181408, 258139, 328147, 721970, 511848, 66288, 311820, 664384, 361377, 102235, 547730, 599001, 350533, 435554, 490171, 513743, 473425, 281104, 158553, 333761, 572641, 435974, 417956, 675272, 559095, 288441, 409215, 213697, 508552, 661718, 101337, 325684, 653082, 147238, 235866, 345943, 253703, 298060, 546855, 492073, 387542, 601189, 650187, 691214, 407722]
17025D07722m3655J96454L26867C44553p3982M98782C49203L36095o3733k47110
17015C74455P73L05725J16256j10332P6888k52103B26260K66864J66550j5490
17005F44184m7471j4002k77971j1187M76463q0421l8630m5272A94674M98887P1440
16994G65001o7483k1139L06471m89478A24447L85754J74144k57529L34598P7725
16984H39139k19080l0680A62357M41339o5939K85521k5639O6161m12077L42257
16974G93980k52178L30943l3221K14043D21562M42854l36493K07244J13087n470
16964H42784Q2276j22790P4161k51959J2131q0655J30477J79417j31050J92051
16954I26843L25933n95649R3184J06390O6329l02790L93331k88184J94354j33341
$$ y = [407722, 364067, 560521, 887388, 344553, 270571, 769353, 349203, 685298, 621565, 374455, 375228, 680953, 797209, 686877, 763765, 511662, 226260, 493124, 659674, 644184, 596713, 582711, 304740, 293553, 770016, 689595, 650965, 605693, 194674, 693561, 765001, 697518, 676379, 982850, 493372, 124447, 510201, 684345, 426816, 761414, 839139, 620059, 589379, 162357, 603696, 537757, 823278, 797639, 863800, 451723, 793980, 541802, 872745, 839524, 1053567, 421562, 864416, 527923, 735167, 848254, 842784, 925060, 802270, 876431, 624472, 636603, 555948, 686425, 865842, 734792, 926843, 1252776, 657127, 750311, 856701, 923030, 620240, 1013571, 725387, 919741, 786400]
16944G86400L56221n11102K63485O2754L1095l0893K17418j41099j93667Q0443
16934I21055p200J79548J25474j97130O35206H06873M85646k53451o9214N01959
16924A471813m85735o9839J98204L607m9820M1564k19882L91624k51306K91309
16914A321539n49889L84939P8340J1455j95709M29169K3559L7088m10353O9994
16904A200132L43266K6709j60261P2887j01844K02619k22331L13521k71274r4325
16894A309099K20107N3589L07607k07911j4114o4951K51296K48014m59167k61244
16884A382325K68768M96034l43165j17660K88083j32304R8196l04259O07907r1069
16874B152856J01294j94165J69019J26870l07023K88485j80272L9511J37267p9774
$$ y = [786400, 1142621, 631519, 895004, 957758, 988853, 957960, 1175378, 1034279, 840612, 921055, 913855, 1093403, 1218877, 1021747, 1656953, 806873, 1292519, 1039068, 969854, 1471813, 986078, 916239, 1114443, 1118050, 1068230, 1109794, 889912, 1281536, 1030230, 1321539, 771650, 1156589, 1234929, 1246384, 1050675, 1479844, 1503403, 1540491, 1130138, 1200132, 1543398, 1570107, 1409846, 1482733, 1380889, 1583508, 1361177, 1674698, 1403424, 1309099, 1529206, 1582795, 1890402, 1682491, 1668377, 1603426, 1854722, 2102736, 1643569, 1382325, 1651093, 2147127, 1803962, 1686302, 1974385, 1842081, 1940277, 1636018, 2243925, 2152856, 2254150, 2059985, 2229004, 2355874, 2048851, 2337336, 2157064, 2196575, 2333842, 2254068]
16864B254068J45045L1297l8666P4000l05799N41449j30905j52009Q257j6551
16854B410186j28901M20622j34333N684L47949j19608J40135j87438j44289J51101
16844B761108M64341k24057K48279j66976p7668N32770k06576J41169k25182L02436
16834C549644k3932k2742N1270K45245l73977K87611J0447k02226M61695l1286
16824C951749K19422M7101k83215N69251J2034j23065j65269K75344K94560r660
16814D788252N54804m15934j7819J91296j3567Q6241L51057Q8403k2782M39695
16804F029646M0227J80495L98097k05477J07690k1296M68476n0397L71355k74715
16794G044101M47054J41604K43177P61717k36096J51971O77110k97663K16679
$$ y = [2254068, 2399113, 2430410, 2391744, 2465744, 2159945, 2701394, 2570489, 2418480, 2426737, 2410186, 2281285, 2701907, 2567574, 2573258, 2921207, 2801599, 2941734, 2754296, 2610007, 2761108, 3225449, 3001392, 3249671, 3082695, 3005027, 3537797, 3331221, 3472390, 3247208, 3549644, 3525712, 3502970, 3554240, 3799485, 3425508, 3713119, 3723566, 3521340, 3983035, 3951749, 4171171, 4218272, 3935057, 4504308, 4516342, 4393277, 4228008, 4503352, 4797912, 4788252, 5343056, 4927122, 4909303, 5100599, 5087032, 5173273, 5524330, 5612733, 5589951, 6029646, 6069873, 6250368, 6648465, 6442988, 6550678, 6529382, 6997858, 6947461, 7318816, 7044101, 7491155, 7632759, 7875936, 8637653, 8401557, 8553528, 9230638, 8932975, 9149654]
16785I149654j62658Q32601J01996k2741N56386J96311J40251R52576l96387M23796
16775A1771785N55081L97471L77658M09703O21237M66877L57905O03775N76449
16766A6137941O25364N84244N77229M58331M22302Q74512N74254R27904Q33285
16757B2015366O58469J258847J000137R85125J149406J291996J200910J434097
16749C0994353J305175J682615J714558J501949J836214K127584K175342K588196
16741D5925986K485169K403301K926467K704815L469957L809656L302250M279130
16733G1306731M281133M641605N000881N638004N399393O193199O459688O410637
16725A15331271O789203P281269P257177P500388P202956O691223O952115N605990
$$ y = [9149654, 8986996, 9819597, 9921593, 9898852, 10455238, 10651549, 10791800, 11744376, 11347989, 11771785, 12326866, 12724337, 13101995, 13511698, 14132935, 14599812, 14957717, 15561492, 16137941, 16763305, 17347549, 17924778, 18383109, 18805411, 19679923, 20254177, 21182081, 22015366, 22673835, 23932682, 24932819, 25917944, 27067350, 28359346, 29560256, 30994353, 32299528, 33982143, 35696701, 37198650, 39034864, 41162448, 43337790, 45925986, 48411155, 50814456, 53740923, 56445738, 59915695, 63725351, 67027601, 71306731, 75587864, 80229469, 85230350, 90868354, 96267747, 102460946, 108920634, 115331271, 122120474, 129401743, 136658920, 144159308, 151362264, 158053487, 165005602, 170611592]
16717A70611592N471572M355132K852490K019499N77767l63532j459584l078062
16709A80986874m077530m712790n967191o529217o906358p337355p062378p164030
16701A31230025p255244o901460p080619o484269o020889n565156n697082m737918
16693H1487388n263976m167624m354656m305378l424324l204180l243069k908507
16685E0615674k450006k738782j877272k477695k253293j882456j729081j516911
16677C3690178j568193j359716j650606j386542j047125j350430r05550j064811
16669B3357205p22467j103851p96516n65093q52804q10374m02881p24944n20951
16660A6857324o54761n36115n88226o38855k64194l97235p14171k30015o66963
$$ y = [170611592, 176083164, 180438296, 183290786, 185310285, 185888052, 185524520, 184064936, 180986874, 176909344, 172196554, 166229363, 159700146, 152793788, 145456433, 138394055, 131230025, 123974781, 117073321, 109992702, 103508433, 97487544, 91922388, 86225306, 81487388, 76223412, 72055788, 67701132, 63395754, 59971430, 56767250, 53524181, 50615674, 48165668, 45426886, 43549614, 41071919, 38818626, 36936170, 35207089, 33690178, 32121985, 30762269, 29111663, 27725121, 26677996, 25327566, 24422016, 23357205, 22634738, 21530887, 20734371, 20169278, 19316474, 18506100, 18103219, 17378275, 16857324, 16202563, 15666448, 15078222, 14439367, 14175173, 13777938, 13063767, 12833752, 12166789]
16651A2166789l14257j64609m97706n17472l52084K2475o15352Q7928o25437k08523
16641H981752k41576P6991o36329j3606j19625l85431l65525K72391l10823l64015
16631F894204l78844J17585m57357J10627K1626j66414j56099l11495j96867L4868
16621E511834j73836K65924n98232l28347J45391k30885O1094l33965K80952l07450
16611D292480L02826l95918J52369k6487n52095L03464p1183l27000p0913Q7766
16601C695309k59935J27296J84202j59666k30213j60381k05591K10367m1622k1503
16591C138263k88895L9432L55555n63283L64967l40021Q2593k07428J38218p6074
16581B643327k34787n1316J88196K7515n40720N73766j37179m42592K32961N9318
$$ y = [12166789, 11852532, 11687923, 11190217, 10672745, 10320661, 10343136, 9727784, 9815712, 9190275, 8981752, 8740176, 8817167, 8180838, 8167232, 8047607, 7662176, 7296651, 7569042, 7258219, 6894204, 6515360, 6632945, 6175588, 6286215, 6307841, 6141427, 5985328, 5673833, 5476966, 5511834, 5337998, 5603922, 5005690, 4677343, 4822734, 4591849, 4652943, 4318978, 4599930, 4292480, 4595306, 4199388, 4351757, 4325270, 3773175, 4076639, 4005456, 3678456, 3607543, 3695309, 3435374, 3562670, 3746872, 3587206, 3356993, 3196612, 2991021, 3201388, 3159766, 3138263, 2849368, 2888800, 3244355, 2681072, 3046039, 2706018, 2788611, 2581183, 2719401, 2643327, 2408540, 2357224, 2545420, 2572935, 2032215, 2605981, 2468802, 2026210, 2259171, 2318489]
16571B318489k22136j4689j16116N87122l93867k9732j8821q1759j40548J21123
16561B009066l33090J43070N6717K15485l32775k62150M54064j35142l84547K52757
16551A683455k4175k17489K95783m17782J90968k66220M23417l39367J3828J33643
16541A476061r8680k46150L10362n3371j11542R0226m5615J10092o9458N7441
16531A419366m55974M22411r4769M6740j98008O9609J20015j46557k27429Q604
16521I64008Q9971L55443m00766j76880j04627M48703l5214l5336l832j24793
16511I76677R0795J27357j12414l234K24740k17294R9966l47011J6678J17187
16501I73447j55093K55161p7250J46815k11374L38793m43649k85248K6831J40109
$$ y = [2318489, 2096353, 2081664, 1965548, 2552670, 2158803, 2129071, 2110250, 2028491, 1887943, 2009066, 1675976, 1819046, 1875763, 2091248, 1758473, 1496323, 1950387, 1815245, 1430698, 1683455, 1659280, 1441791, 1737574, 1319792, 1510760, 1244540, 1667957, 1328590, 1342418, 1476061, 1377381, 1131231, 1441593, 1388222, 1276680, 1366906, 1321291, 1431383, 1361925, 1419366, 963392, 1385803, 1291034, 1337774, 1139766, 1209375, 1329390, 1182833, 955404, 964008, 1053979, 1409422, 1008656, 831776, 727149, 1175852, 1140638, 1105302, 1101470, 976677, 1067472, 1194829, 1082415, 1079181, 1303921, 1086627, 1186593, 839582, 856260, 973447, 818354, 1073515, 996265, 1143080, 931706, 1270499, 826850, 541602, 568433, 708542]
16491G08542L24280j03788k79682j58284P1980K49279k42363R7595j75271K09597
16481G01885O9746j34857l588j75879N09459k57477L73567l8280k23480j08390
16471G12706L6465k4495l6605j52004J49949j07610L2905o303j5990q6403K89848
16460G92463q1890J191J8408J27442o4522k97592N4334J43985k2869r0508j20195
16449D60247K60405O514k17332O9423B40322N72651C99020K44854J64847j68576
16439F40145j12190K68014k74430P5489j16620j6208j00345K36812k81398J45424
16429D64693J28270M2386k31793J04935J52700j78193B29590M02076j57436p233
16419D66997k13416M93543A96636J15189L16822o5844q7342J77652L7441B97952
$$ y = [708542, 1032822, 929034, 649352, 491068, 563048, 812327, 569964, 667559, 492288, 701885, 771631, 636774, 633186, 457307, 966766, 709289, 1082856, 1044576, 821096, 712706, 749171, 724676, 688071, 536067, 686016, 578406, 611311, 605008, 589018, 502615, 792463, 710573, 711764, 730172, 857614, 793092, 495500, 549834, 693819, 670950, 580442, 460247, 720652, 727166, 509834, 579257, 240322, 812973, 399020, 643874, 808721, 640145, 527955, 795969, 521539, 597028, 480408, 464200, 363855, 600667, 319269, 464693, 592963, 635349, 403556, 508491, 661191, 482998, 229590, 631666, 474230, 466997, 253581, 747124, 196636, 311825, 628647, 562803, 475461, 653113, 690554, 297952]
16408C06424J01600k4186o7819K00797A87303b90243B01100R9491A21215L69895
16398D91110P077j36319M12654k76752A79866n7558J78839p034K71838B72496
16387D42411B10028N6756P699l2652l682L2779K20194B12025J66743k5636l7795
16376C15337j7133o1565M0737J8034r6737r7023K57225o164j72256J80885m8570
16365C12770Q7086k3325A08621N0988e6219G2455K64097H4228K71027j30850c418
16353A99338L67306a13350B07409K44840F3666M7645K46185a03824B03109I7544
16342A14425N9646J1085J02333q861A35789D6697J16276o531R2667n5350J07943
16331C01702J29511b9847C14134j17172K761q3495j5728e1266A72800R434Q9709
$$ y = [306424, 408024, 383838, 316019, 516816, 187303, -290243, 201100, 300591, 121215, 491110, 498187, 361868, 774522, 497770, 179866, 122308, 301147, 294113, 565951, 272496, 442411, 210028, 266784, 274483, 241831, 238149, 270928, 491122, 212025, 378768, 353132, 315337, 298204, 236639, 277376, 295410, 198673, 101650, 358875, 352711, 180455, 361340, 312770, 399856, 376531, 108621, 159609, -56219, 72455, 336552, 84228, 355255, 224405, -3418, 199338, 566644, -113350, 207409, 452249, 63666, 111311, 357496, -103824, 203109, 97544, 114425, 174071, 185156, 287489, 278628, 135789, 46697, 162973, 156442, 249109, 193759, 301702, 431213, -29847, 314134, 196962, 199723, 116228, 100500, -51266, 172800, 182234, 271943]
16320B71943N841r899e2515C39042I3754b9387B90721K20784b7108D53225j32850
16309C20375I2055L95645J43005f4A24754M9366p2741O7909M3950I2167J1937
16298A04104D0645K17448B3293L46599A65335E8057J4642K90881j5552j54184
16288A93844J64495A76864D3238a37988G3120K4995k3778c6516a6228e778A34582
16276A47540m6555J85677A687L68237a51887d4201A00248a5109C38001L8051B1177
16264a53097b7261q5492c3126B03162I1060A2286b00895h302m5925a2889B02078
16252a26898C28806B822L80389A45543R8778a01589A40964L20338B22897o9607
16242A53290l7557C076J20784J25152f7690A23395J69422c7542q8792H6522a66118
$$ y = [271943, 277784, 267885, -52515, 339042, 93754, -29387, 290721, 511505, -27108, 453225, 320375, 92055, 487700, 630705, -64, 124754, 174120, 101379, 169288, 213238, 92167, 104104, 40645, 258093, 23293, 369892, 165335, 58057, 72699, 363580, 348028, 193844, 358339, 176864, 43238, -137988, 73120, 98115, 74337, -36516, -16228, -5778, 134582, 147540, 100985, 286662, 1687, 369924, -151887, -44201, 100248, -15109, 338001, 376052, 21177, -153097, -27261, -112753, -33126, 203162, 91060, 12286, -200895, -8302, -54227, -12889, 202078, -126898, 328806, 2822, 383211, 145543, 244321, -101589, 140964, 461302, 222897, 153290, 115733, 3076, 123860, 249012, -67690, 123395, 292817, -37542, -126334, 86522, -166118]
16230c81810B66690j21896R1514j9788F779J4071p292g5140J2665B50636P118
16219B57754o6903r3999M9286n6155j8198P1480d0387E8039J34248J27695B0226
16207A78457K02988A28940j6442L29989C1973J39314d3648B99701j31364M8200
16197B16537G8351B2362N10973B08460F1309J33789a25471A80003a52936L5406
16187a17530A9721d5612m3919B17055j07250i5961A86794D533a12496l764C21768
16175a40327O9505F4423J29796K5088a3261A91639n6751E4371e7705A34118a48364
16163D6428h9580k9339C63267o7567R2617D9437J16759L3464J00180h922A76877
16151a61137j59337A04266m9304J40958h9785B80040A11204E0603c64522a79577
$$ y = [-381810, 266690, 144794, 236308, 216520, 6779, 20850, 13558, -75140, -62475, 250636, 257754, 190851, 96852, 146138, 89983, 71785, 143265, -40387, 58039, 192287, 319982, 20226, 178457, 381445, 128940, 112498, 442487, 31973, 171287, -43648, 299701, 168337, 216537, 78351, 22362, 533335, 208460, 61309, 195098, -125471, 180003, -152936, -117530, 19721, -45612, -89531, 217055, 109805, -95961, 186794, 4533, -112496, -116260, 321768, -140327, -70822, 64423, 194219, 219307, -13261, 191639, 134888, 54371, -57705, 134118, -148364, 46428, -89580, -118919, 363267, 295700, 388317, 49437, 166196, 199660, 299840, -8922, 176877, -161137, -320474, 104266, 54962, 195920, -89785, 280040, 111204, 50603, -364522, -179577]
16140g4560B36254E2483B2722a28476I6731k582A3151a00497C75536J2337A61843
16128A99496a9578D4775b03923A40435d4013B3183K6576L2054i8309G666e809
16116b14437B22357q872d2999J8800k28728A79745Q9081n8164E4003a06496B39157
16104C4354j4174a67907A86406j4524g4204B82168A40410g536j70722e8423k03037
16093b61460B08761e0980l10051I975b29511A7908i3945m3866G8215c58773e0941
16081G9380J74819Q5377A56840E4723a602H2068d8393k01040d6648F8307a5897
16069b55955k5940B40748C4662P0541b46551J18367k8920A75188q1326R4181L4260
16058B22303A07137b629j03103a1157A71598J49110a86127j00189d6092G4146
$$ y = [-74560, 236254, 52483, 22722, -128476, 96731, 94149, 13151, -100497, 375536, 387873, 161843, 199496, -19578, 44775, -203923, 140435, -44013, 23183, 49759, 81813, -98309, 7666, -5809, -214437, 222357, 213485, -42999, -24199, -252927, 179745, 268826, 210662, 54003, -106496, 239157, 34354, 20180, -167907, 186406, 171882, -74204, 282168, 140410, -7536, -178258, -58423, -261460, 208761, -50980, -361031, 9975, -229511, 17908, -93945, -137811, 78215, -358773, -50941, 79380, 254199, 339576, 156840, 54723, -1602, 82068, -48393, -249433, -46648, 68307, -15897, -255955, -281895, 240748, 34662, 105203, -246551, -128184, -157104, 175188, 93862, 188043, 222303, 107137, -2629, -105732, -11157, 171598, 320708, -186127, -286316, -46092, 74146]
16047a24518A65013J39474j00116i2993a3740k33974B16949c26800a04851H5217
16036b19504O2075j38638A52656E7035b44518M5871A77428c8639C8399a56608
16025e802B04317p1745O6251b41786C20612a95638r5214a20151k00363E658b00010
16013g2068K5429F0925B0400L5191A0101O5796h4787m20013b43613c3433m2110
16002g5543G654B498b63885F7257a05106G5794a37211J1290p9702d8241E2512
15990a18771B23947i0871D94946a50569k24047A8945b78343F3871J53673K86536
15980E04080j29827D1024d6061j59638g3719B39712E7806d80146B21777L1666
15970B53443a11735C35074d9863C34193a35897d085j01821N0574A60617h5620
$$ y = [-124518, 165013, 304487, 204371, -92993, -13740, -247714, 216949, -326800, -104851, 85217, -219504, -157429, -296067, 152656, 57035, -244518, -198647, 177428, -38639, 38399, -156608, -5802, 204317, 132572, 198823, -241786, 320612, -195638, -290852, -120151, -320514, 5658, -200010, -72068, -46639, 60925, 20400, 55591, 10101, 75897, -84787, -504800, -243613, -33433, -75543, 7654, 2498, -263885, 67257, -105106, 75794, -137211, -125921, -205623, -48241, 52512, -118771, 223947, -90871, 494946, -150569, -374616, 18945, -278343, 63871, 217544, 504080, 374253, 41024, -46061, -205699, -73719, 239712, 57806, -480146, 221777, 253443, -111735, 335074, -49863, 334193, -135897, -4085, -105906, -55332, 160617, -85620]
15959b95812B12065i3505A03256b44822r0938a8829r8812n3469P8966A60458J92888
15948C53346g0650j41754a00158K1046B3117e3316C4761Q2077d8215r9502k7100
15937a74817N3733A18885a56385B06157j1809b45136B71370d78533g6360A78778
15926b5865C2433J44355a8875H7010a85968H2199C3658b91084E3516h6667A14289
15914c63894A12878J7015f0234k614j62117c2988k53343Q5974q9914J11418b4038
15902F3894d4177A68533N4277k9660O3592l1758h9363J0218B9624c63072a47156
15890A97807c73171c5247J1894F7958J8967f4986G1992g4848l26255B9867g2043
15878c76286B91766D2642c37075J32016A15884a33211F6365b8831C142h7601p3998
$$ y = [-295812, 212065, -93505, 103256, -244822, -335760, -18829, -117641, -171110, -92144, 160458, 353346, -70650, -212404, -100158, -79112, 23117, -53316, 34761, 116838, -48215, -147717, -174817, -121084, 118885, -156385, 206157, 194348, -245136, 271370, -478533, -76360, 178778, -25865, 32433, 176788, -18875, 87010, -185968, 82199, 33658, -291084, 53516, -86667, 114289, -363894, 112878, 129893, -60234, -62848, -224965, -32988, -286331, -200357, -290271, -178853, -24038, 63894, -44177, 168533, 222810, 193150, 256742, 224984, -89363, -79145, 29624, -363072, -147156, 197807, -373171, -35247, -23353, 67958, 86925, -64986, 71992, -74848, -401103, 29867, -72043, -376286, 291766, 42642, -337075, -205059, 115884, -133211, 66365, -28831, 3142, -87601, -161599]
15867a61599A92786O6596n0147a61711r330K1703d0464i215m6366b7245k50583
15856b77828h8040C15115b83788Q6970j81018h2083l8786j28032C6138h0492j34112
15845b14604j58652D1414a29301K5628k68731J07452d1081B17829a0100k18956
15835b29056B99535a13863j68556O2008A40189c5031G325B506J07883c30803b4902
15823a29086A98050L2528A11289j1457b28421F0676c235k02305j00307i7660I81
15811a81839M5168j97581f9436j34735i6901E6356g7155D8836A1186d6179A28456
15799b3854k26399d7971G2951i3418A51859f8820n4861D99882a93339P6956J5763
15788a00620B42454B8331K31923b12012A77643d067E7232Q9733b21963C4590b31129
$$ y = [-161599, 192786, 259382, 209235, -161711, -171041, -149338, -40464, -9215, -55581, -27245, -277828, -88040, 315115, -283788, -196818, -377836, -82083, -120869, -248901, 36138, -80492, -214604, -373256, 41414, -129301, -103673, -372404, -264952, -41081, 217829, -10100, -229056, 299535, -113863, -282419, -220411, 140189, -35031, 7325, 2506, 110389, -330803, -24902, -129086, 198050, 230578, 111289, 99832, -228421, 60676, -3235, -205540, -305847, -97660, 981, -181839, -136671, -334252, -69436, -204171, -96901, 56356, -77155, 48836, 11186, -46179, 128456, -23854, -250253, -47971, 72951, -93418, 151859, -68820, -123681, 499882, -193339, -116383, -100620, 242454, 28331, 260254, -212012, 177643, -4067, 57232, 146965, -221963, 34590, -231129]
15776d4580q44j51681M7289k4585j38751g0496o8017c3773A41038a43538A78907
15764a38642H9539g6052A62186a94557R3951J6433L0791k00067F3000d1151q99
15753d2050B9282b7266l20421d8415H1707K7464M7225a08721H7828j8067a41579
15741F0775J96411a28912j71424G5235a49143J6692a0951k20100a2540A13885
15730D2083J4302h6235B19105i7083m876a1013B52747D0045j9326K7105e6451
15718a61468A22095h8562o715m9103E5439a58672B6718e5935l58248a21904C85350
15706d03140B52364a26819A63773a35696K5282B35732a55483O3285M0208k3659
15696g5649A07247j7177H159J24886h0627A66085K68964D5463a31401B73401a22358
$$ y = [-44580, -45424, -197105, -149816, -174401, -313152, -70496, -138513, -33773, 141038, -143538, 178907, -138642, 89539, -76052, 162186, -194557, -100606, -84173, -53382, -253449, 63000, -41151, -42050, 29282, -27266, -347687, -48415, 81707, 109171, 156396, -108721, 87828, 69761, -141579, 60775, 257186, -128912, -300336, 75235, -149143, -132451, -10951, -231051, -12540, 113885, 42083, 56385, -86235, 219105, -97083, -101959, -11013, 252747, 40045, 20719, 47824, -56451, -161468, 122095, -88562, -95277, -144380, 55439, -158672, 26718, -55935, -414183, -121904, 385350, -403140, 252364, -126819, 163773, -135696, -110414, 235732, -155483, -92198, -51990, -75649, 107247, 90070, 8159, 133045, -80627, 166085, 435049, 45463, -131401, 273401, -122358]
15684a61921A17158e2607j0164O766n8342G9720M6712O0513b18646L3988A87464
15672B2211J01133D5987L38899a42604A12319K02734O193A7259c5221o0368p0749
15661a66338A75518r673p5061a57508r4732n817P5206C14742E0673f9438d302
15649b82274g6481m5310j40022A32083a67705A53896f8647C4411K39951e669j18654
15638a24323I4368a28507k73518a47721e5277b7034F4383f5048q6735E1587a9511
15626a78743B80191O7156A43660F0019J22315J4032P9546G1478M6786B6733b53855
15614d5312B6673j101a90872A3324a14620M8514l413l57301d9893F7568f5592
15602c81252A89742a66955A6781L0578j9742c84668i6382r4998I2122k6049R8170
$$ y = [-161921, 117158, -52607, -62771, -56005, -114347, 79720, 126432, 186945, -218646, -184658, 187464, 22211, 123344, 45987, 384886, -142604, 112319, 315053, 321246, 17259, -35221, -95589, -166338, 175518, 165845, 90784, -157508, -252240, -258057, -182851, 314742, 50673, -69438, -4302, -282274, -76481, -121791, -261813, 132083, -167705, 153896, -68647, 34411, 274362, -5669, -124323, 94368, -128507, -402025, -147721, -55277, -27034, 64383, -65048, -151783, 51587, -19511, -178743, 280191, 347347, 143660, 60019, 182334, 196366, 275912, 71478, 118264, 26733, -253855, -45312, 26673, 25572, -190872, 13324, -114620, -66106, -69519, -426820, -49893, 67568, -65592, -381252, 189742, -166955, 16781, 47359, 27617, -384668, -96382, -191380, 92122, 66073, 164243]
15591A64243k0071c47321b9277a394j72667e3569C36821D3036a45434P0673l3291
15580a08052K8297L5508l035j80766L1378j2786P7256j87056b464G542g9495n3573
15568a33068j08542i9679r0069A33526b68085A90861A7325J57703k5108c4622
15557A51970j1918o8681b31083b4862B1293c12476D5669b28616i7543q6536d7709
15545a27716A074K31106b95559r343K6640b511A13531a71820g7260j97002G525
15533a8811G4633b67693J03963n4011B36625b73218e5849j33713b539C53748b7199
15521A69071O5418b09206i8283j9044p388q5861H1148a01280b7862J291J0073
15510a6498A08411J43936q2893I057J1259J7913c21261e722r3578j34943A23059
$$ y = [164243, 144172, -347321, -29277, -1394, -174061, -53569, 336821, 43036, -145434, -74761, -108052, -79755, -44247, -47282, -228048, -196670, -209456, -132200, -319256, -2464, 7542, -79495, -133068, -241610, -99679, -189748, 133526, -268085, 190861, 17325, 175028, 149920, -34622, 151970, 140052, 71371, -231083, -24862, 21293, -312476, 45669, -228616, -97543, -184079, -47709, -127716, 1074, 232180, -295559, -304902, -278262, -2511, 113531, -171820, -77260, -274262, 7525, -18811, 74633, -267693, -163730, -217741, 236625, -273218, -55849, -189562, -2539, 353748, -27199, 169071, 234489, -209206, -98283, -117327, -124715, -210576, 81148, -101280, -27862, -26571, -16498, 108411, 252347, 169454, 9057, 20316, 38229, -321261, -5722, -99300, -234243, 123059]
15498b2813A7434a20512A32816C9785A8591K05175a92177L9819j92634c7622D2478
15486a37319A84472i6697B32120j8051a21003m5152G1804b68879R7635H3611J89099
15475B72710d8875A3677e8623k3731j8483k29777i976m1969l16917Q8189N4211
15464b26462f1385A62603b8939j33926k5044I8589J5043l0699M2801a27912G0323
15452I1348A1670b1018B35036h1762j29155a9631j82267d0674C6566O925N3208
15441I6699a31523B18533e0673r9917N2186b5655A52977I357J38495J69916p8498
15430B39270b92900F6649b85575A43523M3115F3831P0654P1371i1166k32901J14201
15419b09866j1403g3286D33475g6643H4447R625f9284B99661j35013d7366I9115
$$ y = [-22813, 17434, -120512, 132816, 39785, 18591, 223766, -192177, -152358, -344992, -37622, 42478, -137319, 184472, -96697, 232120, 214069, -121003, -166155, 71804, -268879, -171244, 83611, 272710, -48875, 13677, -58623, -82354, -100837, -330614, -9976, -51945, -368862, -280673, -226462, -61385, 162603, -28939, -162865, -187909, 98589, 113632, 82933, 125734, -127912, 70323, 91348, 11670, -21018, 235036, -81762, -210917, -19631, -201898, -40674, 36566, 43491, 96699, -131523, 218533, -50673, -150590, -98404, -25655, 152977, 9357, 147852, 317768, 239270, -292900, 66649, -285575, 143523, 186638, 63831, 134485, 205856, -91166, -324067, -209866, -221269, -73286, 433475, -76643, 84447, 94072, -69284, 299661, 164648, -47366, 99115]
15407d2680p816r7229C20162A52899g961B05865c64577J51475a463A1211c35732
15395A19626a83346A26657b38946E8147a86600B49393d838A63533c8792k02840
15385b41632h0325l36215A47371h0891A11440c20404a6371m5765K452j10367c7948
15373A73061b59424i1112A06390b33136A11352d06604A78020n6220a38174B71720
15362C91849A2683J154b4137A91564e0226r692D54433h3262B31147F8968b9375
15350D25184b52798f9625k22034A6421b78552J35545j30177e3076q4872c1153
15339e6090H4981a05629A96794a14259b4657A24268J6303Q6294a57912j59787
15329c17699I3163N8119c7385B81124f0823H180K91378B825c1682B03965g0501
$$ y = [-42680, -50496, -147725, 320162, 152899, -7961, 205865, -364577, -213102, -1463, 11211, -335732, 119626, -183346, 126657, -238946, 58147, -186600, 249393, -4838, 163533, -38792, -241632, -80325, -416540, 147371, -80891, 111440, -320404, -16371, -62136, -59684, -170051, -37948, 173061, -259424, -91112, 106390, -233136, 111352, -406604, 178020, 121800, -138174, 271720, 391849, 12683, 13837, -24137, 191564, -50226, -59918, 454433, -83262, 231147, 68968, -29375, 425184, -252798, -69625, -291659, 16421, -278552, -143007, -273184, -53076, -137948, -31153, -56090, 84981, -105629, 196794, -114259, -24657, 124268, 140571, 226865, -157912, -317699, 93163, 151282, -37385, 281124, -60823, 8180, 299558, 2825, -31682, 203965, -70501]
15317a54067D0502g8685A21972k1713a57453N4328b2684k36882D1487Q6842N9125
15306A87454o5095b4415B07294H6609J98212o1294C0498J1953a35700j88771d5718
15294a23640B63551i1075D5956J11626f8070B0874L52991A83146b82735E0206
15283F5595b02670C22461a32897B41040E0684a9854j43431N3950B55040a66232
15272B49621J59864j84446L7955f5558A13462H047M3914J52442a24066a742A5502
15260I1446J18736I6624C9856f6013k8464B40067b99319A92599b8870G6188K77694
15249C53882l2609O74004M31836n03715N27928E73042j66136j37989I2175L03793
15239C95968A92105j3005B2477a79396f8368K9686B55926J30501C5000L04131
$$ y = [-154067, 40502, -78685, 121972, 100259, -157453, -103125, -22684, -259566, 41487, 128329, 187454, 122359, -24415, 207294, 86609, 284821, 223527, 30498, 42451, -135700, -324471, -45718, -123640, 263551, -91075, 45956, 157582, -68070, 20874, 373865, 183146, -282735, 50206, 65595, -202670, 322461, -132897, 241040, 50684, -19854, -163285, -109335, 255040, -166232, 249621, 409485, 225039, 262994, -65558, 113462, 8047, 51961, 204403, -124066, -1742, 15502, 91446, 210182, 96624, 39856, -66013, -94477, 240067, -299319, 192599, -28870, 76188, 353882, 321273, 995277, 1427113, 923398, 1451326, 573042, 406906, 268917, 92175, 395968, 192105, 179100, 22477, -179396, -68368, -38682, 255926, 386427, 35000, 339131]
15229C39131A40809a73536E2010J02663o050b45241N016B65286F827J62661J50380
15218C19868F6151b15085d5154B11315b82252A1495L75875E7778J32745J07786
15208B98309a0773k12551j37731J61541A06503b69593j20986i0881B25172D4294
15197B21945b44118d8970j64169C7687a92374h7288D46825B22440J54070j28427
15187B48083a47088C18857a62086R638f5344C30629I6882a36613A06985d8139
15176F9995L196g952k87749a05937A83045K50585A23614c3106A41124j8770J0178
15165A32532h1923j00503k02951J74190e6778A20939a9265C41536c5296B80892
15154g1573c2994A21974J33373J70589j60794A03010e8095A4091K8340b5355O691
$$ y = [339131, 140809, -173536, 52010, 154673, 148623, -245241, -240225, 265286, 6827, 169488, 319868, 66151, -215085, -45154, 211315, -282252, 11495, 387370, 57778, 190523, 298309, -10773, -223324, -361055, -199514, 106503, -269593, -390579, -90881, 225172, 44294, 221945, -244118, -48970, -213139, 37687, -192374, -87288, 446825, 222440, 376510, 248083, -147088, 318857, -162086, -152448, -65344, 330629, 96882, -136613, 106985, -48139, 69995, 73191, -7952, -295701, -105937, 183045, 433630, 123614, -33106, 141124, 122354, 132532, -81923, -182426, -385377, -211187, -56778, 120939, -19265, 341536, -35296, 280892, -71573, -32994, 121974, 255347, 425936, 265142, 103010, -58095, 14091, 42431, -25355, -18664]
15143a8664k49342A66622K51504B05618a56898C63795a75006B3160K7401J53649
15133B04210d5481C15321I3916j1977l1009K01553A25456O7527b05995B3272J45699
15122A68971h817E1779K00033l6155l8777l9575a44841f7959f420A5744K03952
15111B19696m0722b31194B67417j24043o2341Q5933B9987K6144B1961d0150j85971
15100b26121E938J71232g4913K975A00396b1543B89208i2676J7801J0157D67212
15088a55974A02426i9316J6086B19627k1017a75504j412E80996A34698J69857
15078C04555r5615r3626H146K70414I8457j7893k0380Q9932A24K66785i9987B72714
15065G5610J30285O5532r2375p3724l3924R649a04788j29200B82749p6771q2295
$$ y = [-18664, -268006, 166622, 418126, 205618, -156898, 363795, -175006, 23160, 50561, 204210, -45481, 315321, 93916, 81939, 50930, 252483, 125456, 192983, -205995, 23272, 168971, -8817, 51779, 251812, 215657, 176880, 137305, -144841, -67959, -6420, 15744, 219696, 178974, -231194, 267417, 143374, 81033, 166966, 29987, 56131, 21961, -40150, -226121, 5938, 177170, -74913, -71938, 100396, -21543, 289208, -92676, -74875, -64718, 467212, -155974, 102426, -99316, -83230, 219627, 198610, -175504, -176916, 580996, 134698, 304555, 208940, 115314, 8146, 278560, 98457, 80564, 60184, 150116, 124, 266909, -99987, 272714, 75610, 205895, 271427, 179052, 105328, 71404, 81053, -104788, -233988, 282749, 205978, 123683]
15054A23683J26080d4491A78616B6383f3510C78266j73303J42991I3836D341J66494
15043A70835h4361E09624j10257F7700M1262K25364n3894c0245B33601c5994C22524
15031A29006J35116a24844A29103k0963k6476J30779L0643G152b14163A01929
15020a5226A17088b8956B39794J40693a3835A62629G1209L49295a65847A49325
15009B52012A12818J4495a51050D9650M58072j2332k36138A04846P9849b47750
14998B81727f3902B13153m8860f656B02711K40996E3037b84765D56453k26319
14988B30134F0378M50477A77041A2466J26272b09261C23322G3139c3312A85433
14977B54271L04660B78141J09095e365D59463A77535J26280l8695L0641j04907
$$ y = [123683, 249763, -44491, 178616, 26383, -63510, 378266, 204963, 347954, 93836, 4341, 170835, -84361, 509624, 399367, 67700, 108962, 334326, 280432, -30245, 233601, -35994, 322524, 129006, 264122, -124844, 129103, 108140, 81664, 212443, 243086, 7152, -214163, 101929, -15226, 117088, -28956, 239794, 380487, -13835, 162629, 71209, 420504, -165847, 149325, 252012, 112818, 127313, -151050, 49650, 507722, 495390, 259252, 104846, 184695, -247750, 281727, -63902, 213153, 164293, -6656, 202711, 443707, 53037, -284765, 456453, 230134, 60378, 510855, 177041, 12466, 138738, -209261, 323322, 73139, -33312, 185433, 254271, 558931, 278141, 387236, -5365, 459463, 177535, 303815, 265120, 295761, 190854]
14967A90854L76921C4220L45590A15452n3309Q8013J21278A28590K28284A35005
14956B47717Q3703j9303a74082B17805E1997d0751B86461M9552j53776K80226
14946D62463a5185F0290a16841D20704A57954K37819P0465F1622L28577e388A23697
14934B74378F0233L17402J13866j50994Q1136j42087l504J85588b5355A87008
14923H0392J90893B1555L60529n9971q9223K1262k7554r08L63147A39896N3286
14912A93182n5431K4629J02101o1454Q953J7595n7370D9884K9116J70706c22282
14900A77026i4609D72154L6409D4582J53359R4634L1232K25952i0395A06390K46324
14889C52714j36870P2259K6873J68269B23461J3314b7501G0787M48011A55590
$$ y = [190854, 567775, 34220, 379810, 115452, 62143, 150156, 271434, 128590, 356874, 135005, 247717, 331420, 312117, -174082, 217805, 51997, -40751, 286461, 336013, 182237, 462463, -15185, 60290, -116841, 420704, 157954, 395773, 466238, 61622, 390199, -5388, 123697, 274378, 60233, 377635, 491501, 340507, 421643, 279556, 276052, 461640, -25355, 187008, 80392, 271285, 21555, 382084, 322113, 232890, 254152, 226598, 225690, 588837, 139896, 193182, 137751, 162380, 264481, 203027, 211980, 229575, 172205, 49884, 79000, 249706, -322282, 177026, -94609, 472154, 508563, 44582, 197941, 292575, 323807, 549759, -90395, 106390, 352714, 215844, 288103, 314976, 483245, 223461, 236775, -27501, 70787, 518798, 155590]
14878C50013G1741N25343j41162k00869L80297B14853K84015A64640K85911A22408
14867A27135M42932k77752o4753O7806L2370j06837M9706K05843A10012J65578
14857B75590q3691L54114k30164J02842K10217B54261J08549a02621B17927J88447
14847D06374A67453K69005R4524j82455n4573L38955l07766Q4110o7815j25379
14837B16059M23780m536B59963M98055B52637L88872B74907L28348k05010k3085
14827C75160k6523R1861r1050K4255j8114j7955J88641B58146A03083L13394j93294
14816B23183J15297j7370P1297j00381J41744L08726C22759J37043J60112B43889
14805C83971K77255j41528P91j47420K96007l29890J36704G3614J84619m3073
$$ y = [350013, 71741, 597084, 455922, 255053, 635350, 214853, 498868, 164640, 450551, 122408, 127135, 570067, 292315, 227562, 295368, 327738, 220901, 270607, 476450, 110012, 275590, 191899, 546013, 315849, 418691, 628908, 254261, 362810, -102621, 217927, 406374, 167453, 436458, 530982, 348527, 293954, 632909, 325143, 409253, 341438, 216059, 639839, 635303, 259963, 758018, 252637, 641509, 274907, 603255, 398245, 375160, 348637, 440498, 349448, 373703, 355589, 337634, 526275, 258146, 103083, 416477, 223183, 338480, 321110, 392407, 292026, 433770, 742496, 322759, 459802, 619914, 243889, 383971, 661226, 519698, 520489, 373069, 669076, 339186, 475890, 73614, 258233, 215160]
14795B15160l0234J31840K27919j23968q999r6929R8431P5166N09792C46113J93626
14784E39739J14377l20386o3423M20020j75648k08278O9955L52429B83059M84777
14774G67836j968B26670N02798l09410j3280M83643m02480A08280K03940J84630
14764D96850j40512k8575J12057l2855K24837j96106K21703J57238B80166J31615
14754D11781K58396K1210l40279J35161L08053k42526j06476L28051k59034K76445
14744G90782C83469K34178j61423J88635J16768B67551M51619Q4586J95214k68547
14734G30423k51291J51389k2262M65805l18747k22003k10287J68772M2032K16980
14724G50811o8915C00926N14901m7734j62854J33329K2944K43413l26936m5558
$$ y = [215160, 184926, 316766, 544685, 420717, 411718, 314789, 413220, 488386, 998178, 346113, 539739, 654116, 333730, 270307, 690327, 514679, 306401, 376356, 728785, 283059, 767836, 765868, 226670, 729468, 420058, 406778, 890421, 487941, 108280, 312220, 496850, 356338, 327763, 439820, 406965, 631802, 435696, 657399, 814637, 280166, 411781, 670177, 691387, 351108, 486269, 794322, 551796, 445320, 773371, 514337, 790782, 383469, 617647, 456224, 644859, 761627, 267551, 719170, 803756, 998970, 730423, 479132, 630521, 608259, 1074064, 755317, 533314, 323027, 491799, 533831, 750811, 681896, 300926, 815827, 768093, 605239, 738568, 761512, 1004925, 677989, 632431]
14714F32431o2833Q9514K22694C39294K93562N915L7430k11182K2259J71429n4053
14703F04654J10485L0892J99385k66653M6010r2723N981k19237K90299R6860K32721
14692A038674m77599M45105k06567J0645K07148m8889j32940N1636q0846J77265
14682I83632k76871K49005j30693N1858j30054o3244K92131l257l46150J83475
14672H09832J1595L1231m3161J8J02394J10636J72592j73209j0593l29978R1268
14661G72625j58631L46896K01457K21909l81116j45898L23684q7665j9385m75896
14651E97980O9837J95695L06555k87957J50404K13661l33259j39521N83123j45288
14641A211230j45760j57718l66J26847K25361q5088r144l21823K30910J89372
$$ y = [632431, 569598, 659112, 881806, 339294, 632856, 638771, 676201, 465019, 487278, 658707, 604654, 715139, 746031, 945416, 678763, 724773, 632050, 638031, 418794, 709093, 805953, 1038674, 561075, 1006180, 799613, 810258, 1017406, 968517, 835577, 887213, 806367, 983632, 706761, 955766, 825073, 876931, 746877, 683633, 975764, 972507, 626357, 809832, 821427, 852658, 809497, 809515, 911909, 1022545, 1195137, 1021928, 1011335, 681357, 772625, 613994, 960890, 1162347, 1384256, 1003140, 857242, 1180926, 1093261, 1073876, 597980, 667817, 863512, 1170067, 882110, 1032514, 1246175, 912916, 773395, 1356518, 1211230, 1065470, 907752, 907386, 1034233, 1259594, 1174506, 1165362, 843539, 1074449, 1263821]
14631A263821m21514J29329K96078l08581K21252k42536J90288K20673O1179k61520
14621A148469J14378r6838o6220j18397J49805k1876N15322j81041J56518q0506
14611A519614j65012J14166o1995L7770l56504M36428m008m4231l81953O5196
14601A159471K34493j51176J9635J76703J79467j17450j26757k4970J97058k6364
14591A520110O8817R022k52305J95789J70636k62034j12434l5162M3889L50641
14581A696969j22954K96803k770N4160Q0619m75523N23823l63440q3992M91776
14571B095471k62373L51419l46695J89172m87318L19861J18784q348r4030L47643
14561B223586K10307j33050K15696m5609K90025k52295L55237K29497o4801M82705
$$ y = [1263821, 842307, 971636, 1267714, 959133, 1180385, 937849, 1128137, 1348810, 1409989, 1148469, 1262847, 1166009, 1099789, 981392, 1131197, 1109321, 1624643, 1443602, 1600120, 1519614, 1354602, 1468768, 1406773, 1444543, 1088039, 1524467, 1520459, 1476228, 1094275, 1159471, 1393964, 1242788, 1262423, 1439126, 1618593, 1501143, 1374386, 1349416, 1546474, 1520110, 1588927, 1597949, 1345644, 1541433, 1712069, 1450035, 1337601, 1302439, 1346328, 1696969, 1574015, 1870818, 1868048, 1922208, 2002827, 1527304, 2051127, 1687687, 1603695, 2095471, 1833098, 2184517, 1837822, 2026994, 1539676, 1859537, 1978321, 1969973, 1875943, 2223586, 2433893, 2300843, 2516539, 2470930, 2760955, 2508660, 2863897, 3093394, 3028593, 3511298]
14551C511298N26737J083767J496207M716402R211056J7079899O808293B0137257
14542G680220l280710j720647m94296l05437j2450p7421j68189Q2697J21318O7187
14532A892272m953J06959j87601K73904O0318m7338j69261K08597m96400M38874
14522B075371j06940O9387o3460M2901n1303L97041l75033K02369N2384j10378
14512B132339K89242R6435J8435m2541P8243p4497L9426N3667l7336k1235L1266
14501B563444j8876K18404j90359J6559J37880p3054q3313K96864P6427K76677
14491C220653l71844K5205K8064Q7137o1185M46126k43890J35481L4365j21384
14481C178728P5592q5408m8359M36660q9992j4776m0160j27832J80296p8718M84842
$$ y = [3511298, 4038035, 5121802, 6618009, 11334411, 20545467, 37625366, 44433659, 20137257, 7680220, 4399510, 2678863, 2184567, 1879130, 1866680, 1789259, 1621070, 1703767, 1825085, 1892272, 1887319, 1994278, 1806677, 2080581, 2140899, 2093561, 1924300, 2132897, 1636497, 2075371, 1968431, 2037818, 1974358, 2017259, 1965956, 2362997, 1987964, 2190333, 2242717, 2132339, 2421581, 2518016, 2536451, 2493910, 2572153, 2497656, 2537082, 2590749, 2553413, 2532178, 2563444, 2544568, 2762972, 2572613, 2589172, 2727052, 2653998, 2570685, 2867549, 2943976, 3220653, 2848809, 2874014, 2902078, 2989215, 2928030, 3374156, 3130266, 3265747, 3300112, 3178728, 3254320, 3168912, 3120553, 3557213, 3467221, 3452445, 3412285, 3284453, 3464749, 3386031, 3870873]
14470C870873J54968k36209k15004K05239J36475O6858r1868l8419J84801K33150
14460D270864m64352J017024m61992K4805J6772L76669l86001O7473M11217n16295
14450D356184O22856o6780R3181q6741l68207Q0792N59990k3562J39609l4508
14440E272814J05110j41263L65605J7534k39348M65236J93069K7930q5608j03191
14430E877888N27041k93304L55610R8327j22560j11612L30362O9328L0095O8831
14420F830006l2103N33252j00368L58829l42910J32857j66404M34938K4343M82242
14410H154682k72932K20679J08307K0847J27378N7771K01872M07561P7468J93095
14400I296728J05801k28465L20919p4465O86419k36543J47947N45339M977O50621
$$ y = [3870873, 4025841, 3789632, 3574628, 3779867, 3916342, 3983200, 3891332, 3852913, 4037714, 4270864, 3806512, 4823536, 4361544, 4386349, 4403121, 4779790, 4393789, 4461262, 4872479, 4356184, 4979040, 4912260, 5005441, 4918700, 4550493, 4631285, 5191275, 5167713, 5307322, 5272814, 5377924, 5236661, 5602266, 5619800, 5380452, 5845688, 6038757, 6066687, 5981079, 5877888, 6404929, 6111625, 6467235, 6565562, 6443002, 6331390, 6661752, 6731080, 6761175, 6830006, 6797903, 7331155, 7230787, 7589616, 7246706, 7379563, 7213159, 7648097, 7672440, 8154682, 7881750, 8102429, 8210736, 8231583, 8358961, 8416732, 8618604, 9026165, 9103633, 9296728, 9402529, 9174064, 9494983, 9420518, 10106937, 9870394, 10018341, 10563680, 10568657, 11219278]
14390A1219278l34557J78947L06606J67888J24447K29923L08237j58770R30081
14381A2972080k85787M68011K27704Q1348N32491K81803K4720j12685M34911N02878
14371A5127474N31827l27370N91313L12405M82973K86447M99648L48415M91070
14362A8344202K45393K14847N66375L97350M74991P55394M86496M49915L47693
14353B2282656K50478M55988R12235O11577L53797R66383P06057Q22733O55199
14344B8017103O40486O29771N93989J041787Q17929O10565J007176Q74374J374973
14335C5608153P48514R98262J149196J169160J209266J510603J149642J521335
14327D5064131J328113J680855J168172K181226J831263J775270J996668K065262
$$ y = [11219278, 10884721, 11063668, 11370274, 11538162, 11662609, 11892532, 12200769, 12041999, 12972080, 12686293, 13154304, 13382008, 13463356, 13995847, 14277650, 14302370, 14189685, 14624596, 15127474, 15659301, 15331931, 15923244, 16235649, 16718622, 17005069, 17504717, 17853132, 18344202, 18589595, 18804442, 19370817, 19768167, 20243158, 20998552, 21485048, 21934963, 22282656, 22533134, 22989122, 23901357, 24512934, 24866731, 25833114, 26539171, 27361904, 28017103, 28657589, 29287360, 29881349, 30923136, 31741065, 32351630, 33358806, 34233180, 35608153, 36356667, 37354929, 38504125, 39673285, 40882551, 42393154, 43542796, 45064131, 46392244, 48073099, 49241271, 51422497, 53253760, 55029030, 57025698, 59090960]
14319E9090960J954383K665925K409118K551804K340060L114664L047973L085374
14311H0260261L492552L450604L933359L786940M817953M239292M734006N235852
14303A13950819N187864O034964O247641O323944O939546P466510P984316Q827620
14295A68963224Q683469R747489J0048299J1405203J1114250J2669288J2717691
14288B45348913J3378777J4643950J5051295J5691566J5882689J5915429J6869655
14281C52782274J6970626J6178992J5899488J4795651J3865115J2196229J0315941
14274D53004316Q283352N629301p02275l525174k295892j838027l993937q134218
14266D46427446r835311j0585588j1937499j3317729j4797817j5675928j7025142
$$ y = [59090960, 61045343, 63711268, 66120386, 68672190, 71012250, 74126914, 77174887, 80260261, 83752813, 87203417, 91136776, 94923716, 99741669, 103980961, 108714967, 113950819, 119138683, 125173647, 131421288, 137745232, 144684778, 152151288, 160135604, 168963224, 177646693, 187394182, 197442481, 208847684, 219961934, 232631222, 245348913, 258727690, 273371640, 288422935, 304114501, 319997190, 335912619, 352782274, 369752900, 385931892, 401831380, 416627031, 430492146, 442688375, 453004316, 461287668, 466916969, 466214694, 462689520, 460393628, 458555601, 454561664, 446427446, 436592135, 426006547, 414069048, 400751319, 385953502, 370277574, 353252432]
14259C53252432j6699460j6619473j6184649j5785570j4480649j3772729j3466131
14252B46243771j3110623j2720545j1410349j0884711j0020920j0009743q847289
14245A69239591q516003p910494p116256p097715o882670o190592n780939n178657
14237A14566265n034648n054423m443171m441385l906083l668044l380457l205422
14229H1432632l499992l096844l160206k458294k115466l020382k541872j871532
14221E9668044k318159j447130k133556j496796k239988j724799r91225j353707
14213D5962684j523433j321957j230829j539558j056460j085343o13058j180432
14205C6411614j198805r13246j252206p53900r09081m58614p92424r96067q17937
$$ y = [353252432, 336552972, 319933499, 303748850, 287963280, 273482631, 259709902, 246243771, 233133148, 220412603, 209002254, 198117543, 188096623, 178086880, 169239591, 160723588, 152813094, 145696838, 138599123, 131716453, 125525861, 119744922, 114566265, 109531617, 104477194, 100034023, 95592638, 91686555, 88018511, 84638054, 81432632, 77932640, 74835796, 71675590, 69217296, 67101830, 64081448, 61539576, 59668044, 57349885, 55902755, 53769199, 52272403, 50032415, 48307616, 47316391, 45962684, 44439251, 43117294, 41886465, 40346907, 39290447, 38205104, 37592046, 36411614, 35212809, 34299563, 33047357, 32293457, 31384376, 30925762, 30133338, 29137271, 28319334]
14196B8319334q39608q02122n13013m06217r89408p85410m23352m91337l94146
14187B2674721p52767k56644o19838m14666n07901p37950q6719n30720l69864
14178A8397652m33441l00585o68291k14010k00555o0927p44310j75402r3758n21181
14168A4985192J1076m00719k95228k93624m3197m49571k91185k19260n8345l26148
14158A2618991m99616j21789q0588k26597l81207K74760o13894J8750l45303J80466
14148A0823973l81291l69374K7214j70529j57233k31196j50158k8618Q9314j21439
14138I330663k96569j65669j25709o7872k53219k54723j20292L56434n50626j53367
14128G699051O9926l02498M45365p66568J51920j26443k3891q6999l21278J6139
$$ y = [28319334, 27479726, 26677604, 26164591, 25758374, 24768966, 23983556, 23560204, 23068867, 22674721, 21921954, 21665310, 21045472, 20630806, 20122905, 19384955, 19298236, 18767516, 18397652, 17964211, 17663626, 16995335, 16781325, 16580770, 16519843, 15775533, 15600131, 15506373, 14985192, 14996268, 14595549, 14300321, 14006697, 13963500, 13513929, 13222744, 13003484, 12945139, 12618991, 12119375, 11997586, 11916998, 11690401, 11309194, 11583954, 10970060, 10988810, 10643507, 10823973, 10442682, 10073308, 10100522, 9929993, 9772760, 9541564, 9391406, 9362788, 9452102, 9330663, 9034094, 8868425, 8742716, 8674844, 8421625, 8166902, 8046610, 8403044, 7852418, 7699051, 7768977, 7466479, 7911844, 7145276, 7297196, 7170753, 7146862, 7059863, 6738585, 6754724]
14118F754724J96218l66842j92148M69761o24876j29325M0842J19197k26815m2888
14108E997848J7325J12561k94136l05213q5391M7946K58624k10475k1483m07934
14098E109672r4035L85874o16332M01555j47711P2196J4184m32858L21047j07951
14088D905641j52413j21405j51816J57723j509k94811K81704m12524K39718q8897
14078D361411m11878j1712M1779P5180J78255k24882J09858P2508k76265L12785
14068D227039p47774K81802j62379j96184N13118k43354j16806K06872R1077m02232
14058C451179Q3621Q8915L808j01109k80883K82401j83701q6552N4739j26002
14048C186416j3081J66817l67158M2392R0855l78281O09314n33277l1834K30945
$$ y = [6754724, 6950942, 6584100, 6391952, 6861713, 6236837, 6107512, 6148354, 6267551, 6040736, 5997848, 6015173, 6127734, 5833598, 5528385, 5442994, 5490940, 5749564, 5539089, 5517606, 5109672, 5015637, 5401511, 4785179, 5186734, 5039023, 5111219, 5125403, 4692545, 5013592, 4905641, 4753228, 4631823, 4480007, 4637730, 4636221, 4341410, 4623114, 4210590, 4450308, 4361411, 3949533, 3937821, 3979600, 4054780, 4233035, 4008153, 4118011, 4190519, 3914254, 4227039, 3479265, 3761067, 3598688, 3402504, 3915622, 3672268, 3555462, 3762334, 3853411, 3451179, 3534800, 3623715, 3627523, 3526414, 3245531, 3527932, 3344231, 3257679, 3312418, 3186416, 3173335, 3340152, 2972994, 3015386, 3106241, 2727960, 3337274, 2803997, 2772163, 3003108]
14038C003108J21012m28779K84383k654p5911N536q7003j36418K43238j04135
14028B822377n2247j34715K985L0519l2014n05521K89957k36919K66366l18805
14018B131983J49004r8846K38481l61775L46109k02348R3512L2365q9520R9891
14008B338856m29889M70150l02078K16981j99981l06463J27444O3291l7986P1429
13998B011754l50356J22557j88135O0046K36433P6683j13329M25444J39275O04539
13988C024911L529166P998015J6565677J4033658k1914206A1586220m376122j496730
13980E713368j195750o50233p58597O9186k33410J52893o89229M6406J72259j12292
13970B514601j34508J3559k66359j07811j35845R7721j51456J28672J59630o9538
$$ y = [3003108, 3124120, 2695341, 2979724, 2977070, 2901159, 2906695, 2819692, 2683274, 2926512, 2822377, 2770130, 2635415, 2638400, 2668919, 2636905, 2131384, 2421341, 2184422, 2450788, 2131983, 2280987, 2182141, 2420622, 2058847, 2404956, 2202608, 2296120, 2328485, 2238965, 2338856, 1908967, 2379117, 2077039, 2294020, 2094039, 1787576, 1915020, 1978311, 1940325, 2011754, 1661398, 1783955, 1595820, 1655866, 1892299, 1968982, 1855653, 2281097, 2420372, 3024911, 6554077, 14552092, 31117769, 45151427, 23237221, 11586220, 7210098, 5713368, 4517618, 3867385, 3108788, 3177974, 2944564, 3097457, 2408228, 2454634, 2626893, 2514601, 2380093, 2393652, 2127293, 2019482, 1883637, 1981358, 1829902, 1958574, 2118204, 2048666]
13960B048666k9083l34663L40395q1812j14377J00884M4119k62221k06674L19838
13950A825072j89066K98676m84328L18863k16192J21894l65192J34429L52372
13941A796528J12359m22828J42957o5859J76308k48411K49390l90186J74784K41055
13931A766097j53051l5938r6454k08254M23540j1696l10739J25238k52450M6699
13921A292992p8135J48556K34512k89608K65815k29443j15714J55532j62492j0644
13911A211371j59405K31345j48086n6029K85824j58580K02443l99853K30389j06757
13901A132662K65975j78035l22966J96091K32359l48802M41608l50542J236J52967
13891A222553l36737J53445K13255q2694l24630K80701j7915J69085J53170n52665
$$ y = [2048666, 2019583, 1684920, 2025315, 1943503, 1829126, 1930010, 1974129, 1711908, 1505234, 1825072, 1636006, 1934682, 1450354, 1769217, 1553025, 1674919, 1309727, 1444156, 1796528, 1908887, 1486059, 1629016, 1563157, 1739465, 1491054, 1740444, 1350258, 1525042, 1766097, 1613046, 1577108, 1480654, 1272400, 1695940, 1684244, 1373505, 1498743, 1246293, 1292992, 1214857, 1363413, 1597925, 1308317, 1574132, 1344689, 1228975, 1384507, 1222015, 1211371, 1051966, 1283311, 1135225, 1079196, 1365020, 1206440, 1408883, 1009030, 1239419, 1132662, 1398637, 1220602, 897636, 1093727, 1326086, 977284, 1418892, 1068350, 1069586, 1222553, 885816, 1039261, 1252516, 1169822, 845192, 1125893, 1107978, 1277063, 1430233, 877568]
13881H77568K68235J48767J25790p2309j65287r6475l05861N28019k88843L24259
13871A343863m47018K24302L6383l51902M39832K998j3963j35346k71716N9260
13861H86693j34395K45218k56260K81261k81901Q1053K58558P4620j36789k46837
13851G71221j23958K19575j40320J50909k751M6717k96900M32943j69877m0578
13841H46981j93692K23065n1996K57892l18191J60052o966k14814L39640q9737
13831I52234q4961l06643L25101j96981J37931J09853k67960K22991j77160O7327
13821G81732j29561J82896K91006k80393l31027K19272j81355J96668Q5360k7321
13811H07277l64507N05913l50758J82692k30321J80502o5690K4972l30042K79101
$$ y = [877568, 1145803, 1294570, 1420360, 1348051, 1182764, 1086289, 780428, 1308447, 1019604, 1343863, 896845, 1121147, 1157530, 805628, 1245460, 1248458, 1234495, 1099149, 827433, 886693, 752298, 997516, 741256, 1022517, 740616, 821669, 1080227, 1154847, 1018058, 771221, 647263, 866838, 726518, 877427, 874676, 921393, 624493, 1057436, 887559, 846981, 653289, 876354, 824358, 1082250, 764059, 924111, 917145, 702331, 1041971, 952234, 867273, 560630, 885731, 688750, 826681, 936534, 668574, 891565, 714405, 781732, 652171, 835067, 1126073, 845680, 514653, 733925, 552570, 749238, 834598, 807277, 442770, 948683, 597925, 780617, 550296, 730798, 665108, 690080, 360038, 639139]
13801F39139N7466K21187m09242J88994k17803L92009K3480C17341K79560k37026
13791C59875P40743j54679j36439j07540M1329j63905p5441K10608k28158J78740
13781F65133q3792k8732L89851l49226j33253Q0639J89593j54355n9454j33152
13771C83252m9449L59679j48900K17019A55327O49322m1670j92099k39841Q1856
13761D12895l458J86454p0651q6458K66114k58156K39370j73938K247j74978J09424
13750D48865J66540J50375l5647C16729L86732l02931L41900N2910j5961B28449
13739D10354J13308r9242J91952B97229J25944k9624M32842j20689o4526k57629
13729C83547J02970O4269k09279J25633J0706K5527L3332J05266o647C12547K41670
$$ y = [639139, 696605, 917792, 508550, 697544, 479741, 871750, 895230, 317341, 596901, 359875, 1100618, 945939, 809500, 701960, 743289, 579384, 503943, 714551, 486393, 665133, 581341, 552609, 942460, 593234, 459981, 540620, 730213, 575858, 516404, 383252, 333803, 693482, 544582, 761601, 155327, 804649, 762979, 570880, 331039, 412895, 409437, 595891, 525240, 438782, 704896, 446740, 686110, 512172, 514419, 339441, 448865, 615405, 765780, 730133, 316729, 703461, 400530, 742430, 795340, 779379, 228449, 410354, 523662, 424420, 616372, 297229, 423173, 393549, 826391, 705702, 641176, 383547, 486517, 550786, 341507, 467140, 477846, 503373, 536705, 641971, 635324, 312547, 554217]
13718E54217k64419J33811L09625B75629K47787N7655k85660M88359C33335n2487
13708B80848K48704A08331M26654J25211B89692O09878k83178J0347N9658j89374
13698D97023j01749P088J49074q2643L27687C45028K8412K65631N7349k91792
13688D04628J83763J13539j81442j56525N9713K6737N2116j39942o677O3044l9556
13677C79398J18327k2560j34445J80388j48766j32258K34992j34689j51305M33098
13667F22180A84985K00507K70621j31718j16338K35511j77482j21776K95377j85907
13657D53780j41958J71684L55832D07172Q9832j57351K04712k48834q3514K9030
13647B41047J64468k0682N3667n8331P0222B16165K27543J07673m4853j37919
$$ y = [554217, 289798, 423609, 733234, 275629, 523416, 581071, 295411, 783770, 333335, 280848, 529552, 108331, 534985, 660196, 289692, 899570, 616392, 626739, 686397, 497023, 395274, 402362, 551436, 468793, 796480, 345028, 373440, 639071, 696420, 404628, 588391, 701930, 520488, 363963, 423676, 450413, 502529, 362587, 355910, 418954, 379398, 497725, 475165, 340720, 521108, 372342, 240084, 475076, 340387, 189082, 622180, 184985, 385492, 656113, 524395, 408057, 643568, 466086, 344310, 639687, 453780, 311822, 483506, 839338, 407172, 497004, 339653, 544365, 295531, 212017, 241047, 405515, 384833, 438500, 380169, 450391, 216165, 443708, 551381, 506528, 368609]
13637C68609j67233K21396p3080q8464K13750j02615r7042K00434r9386J27036
13627E03405k0244r6067J32390B01400K02785A67580J5211p9856M10338J94722
13617G07995C09127J5371A48383K15982A10377L48011A70620J49190o4236M18543
13607F74117j13407A41277J66112j0161J4349N8291j54080K7648L07100G7682
13596A82681K69158k18893B8354J49767K32734E4829M05110A35017M57706k27051
13586C65672B8735L63689K04683B14127J69647D4808M31904B01335G1725L67601
13576D39326k08134P6487K83392A80151L39764r6571f7852B80336M1619q0254
13566B41701J26493j17645R8593p8485L73574k91374h9715A89340J45989a1923
$$ y = [368609, 201376, 422772, 349692, 261228, 474978, 372363, 275321, 475755, 376369, 503405, 483161, 387094, 519484, 201400, 404185, 167580, 182791, 102935, 513273, 707995, 309127, 324498, 148383, 364365, 110377, 458388, 170620, 319810, 255574, 674117, 560710, 141277, 307389, 297228, 311577, 369868, 215788, 243436, 550536, 77682, 182681, 451839, 232946, 28354, 178121, 410855, 54829, 459939, 135017, 592723, 365672, 28735, 392424, 597107, 214127, 383774, 44808, 476712, 201335, 71725, 439326, 231192, 307679, 591071, 180151, 519915, 423344, -67852, 280336, 321955, 241701, 368194, 250549, 349142, 270657, 644231, 352857, -89715, 189340, 335329, -11923]
13555B68227J37137J93136A51093K40045k3913Q4399j0873A67863J46522A04710
13544A41050n3141M53633k40727p693E4573Q2457M5056M28152B54311G3628M51783
13533E25411j27551j65354q2226K63241j38513K47091p2299p2684J05702k18061
13523B64757n0602k6009K71962j23561k0024J00800j52108A09064K90973A59925
13512C12361J28979B00997J3295Q334a89331H6096P7726J71396F1317J55182a8459
13500B49013O277K7268q8100r1088K16428l8895J4792J22540j42081F3325R8355
13489A61680J74605D1640a20961A23856N7325J84776m9534J16016A50280K85346
13479D35626A27751K8403J48721j19316J39925A39366J7570F229O3874J601M0572
$$ y = [268227, 405364, 598500, 151093, 391138, 367225, 451624, 440751, 167863, 314385, 104710, 141050, 87909, 541542, 300815, 293122, 54573, 137030, 182086, 610238, 254311, 73628, 525411, 397860, 232506, 150280, 413521, 275008, 522099, 449800, 377116, 482818, 264757, 214155, 188146, 460108, 336547, 316523, 417323, 265215, 109064, 400037, 159925, 312361, 441340, 200997, 214292, 222626, -189331, 86096, 163822, 335218, 61317, 216499, -18459, 249013, 255290, 282558, 194458, 103370, 319798, 280903, 295695, 418235, 276154, 63325, 161680, 336285, 41640, -120961, 123856, 181181, 365957, 316423, 432439, 150280, 435626, 127751, 156154, 304875, 185559, 325484, 139366, 156936, 6229, 70103, 71704, 112276]
13468A12276P3866K53196A12108L563J67365a00582D53828j46211A51888J18344
13458B70232P8741k8722K4721o7387n7732C0962N8695J81844c11515A19019m4950
13447G4069K48788A56665c15286A37198K4902C5478a12947A18080J57047N5355
13437C30482n6264j26280n3601j2461R8579e6469C854J51813a2584C11637A2219
13425D20702A83914O1852A5628K23324L2516N5089A07319P2451q8410i4058B33304
13413A23582J46280c0342C16871C3733J66190M40422B68699H1519b22916D20083
13402h4304H7600k8726F937d108E9024A6740K30684F5402L23073j40844a12437
13390B09211p7532J23909c4210D485K96065A44128K01451c8070A96066L5747j9462
$$ y = [112276, 186142, 439338, 112108, 115671, 283036, -100582, 453828, 307617, 151888, 270232, 348973, 320251, 344972, 277585, 219853, 30962, 89657, 271501, -311515, 119019, 74069, 322857, 156665, -315286, 137198, 162100, 35478, -112947, 118080, 275127, 330482, 274218, 147938, 94337, 81876, 180455, -56469, 3854, 155667, -12584, 311637, 12219, 420702, 183914, 245766, 15628, 238952, 271468, 326557, 107319, 179770, 91360, -94058, 233304, 123582, 269862, -30342, 316871, 33733, 199923, 640345, 268699, 81519, -222916, 420083, -84304, 87600, 58874, 6937, -4108, 59024, 16740, 247424, 65402, 388475, 247631, -112437, 209211, 131679, 255588, -34210, 4485, 300550, 144128, 345579, -38070, 196066, 231813, 212351]
13379B12351F2585J51048K3069j14305K9788d8996E06062A47908e9722H4625J07501
13368A92126p5118M8780b7879j63932A18428J37311k8919L46388k63636j16206
13358A93366N1074H1055a0938C08432d2097C39973F7120K29275D8020N03193I5115
13346D32226j36869k2600C5225O7908L30041N9894A27831R1506K31180B23573
13335C22056o61j49493K06630L08464C40936K54227q2962g2775D00045A9255J76815
13324A96070J01015K01615A63560K7544J45638J74338k35890a3044B13370g7969
13313I7704K42441j05318J1521Q0253J7342k5973l1998D0277R56N421K49167a08939
13300C97118q4474C3051J13352F8637k866J00040k1495m5397J15842K00127k1081
$$ y = [212351, 62585, 213633, 236702, 122397, 152185, -48996, 506062, 147908, -59722, 84625, 192126, 117008, 165788, -27879, -191811, 118428, 255739, 226820, 573208, 309572, 193366, 244440, 81055, -10938, 308432, -42097, 339973, 67120, 296395, 48020, 551213, 95115, 432226, 295357, 272757, 35225, 103133, 433174, 493068, 127831, 219337, 450517, 223573, 322056, 321395, 171902, 378532, 686996, 340936, 595163, 512201, -72775, 400045, 19255, 196070, 297085, 498700, 163560, 191104, 336742, 511080, 275190, -13044, 213370, -77969, 97704, 340145, 234827, 246348, 326601, 343943, 317970, 285972, 40277, 41233, 46654, 295821, -108939, 397118, 312644, 33051, 146403, 68637, 65771, 165811, 144316, 98919, 214761, 414888, 393807]
13289C93807C2861K24459a99015a2919o899A91972F2910f4614o2998D30058N0051
13278D80109G737J73113d90E1697N4443m3471a85280B60571r6939F4410J19597
13267A84007K87745A04267J05685J03197q9736m5855P6439I5352O7614f1969C9733
13255d5932j3615A69915l2042E1457J26542d292A57561K57784a29201D11936j66137
13244B45799a19017A17025K71404j23135b100j52635B91812j15565d5842a6169
13233B46291D1571J58504I6143j1338J8036a69387c0231N589A34470a386j25377
13222a26763B90972b7213A83823L6803R8210g8872A34602n5039L03481L3737j62532
13211B54249G5989c9253k85993a27591A35366M5502J33611a06692I3027a1198
$$ y = [393807, 32861, 257320, -199015, -12919, -19818, 191972, 62910, -64614, -127612, 430058, 480109, 7737, 180850, -490, 51697, 106140, 62669, -185280, 260571, 163632, 64410, 184007, 471752, 104267, 209952, 313149, 223413, 177558, 253997, 95352, 162966, -61969, 39733, -45932, -59547, 169915, 137873, 51457, 177999, -4292, 157561, 415345, -129201, 411936, 245799, -119017, 117025, 388429, 265294, -2100, -154735, 291812, 176247, -45842, -16169, 246291, 41571, 200075, 96143, 84805, 102841, -169387, -30231, -24642, 134470, -1386, -126763, 290972, -27213, 183823, 220626, 318836, -78872, 134602, 79563, 383044, 416781, 254249, 75989, -39253, -325246, -127591, 135366, 180868, 314479, -106692, 93027, -11198]
13200a26524A16197M4746Q145m1222d2627A86504B0305K44575C9045a787B81327
13188A89388a73209A14364L50049A97794J38481G4987L16128j72179e1014A41674
13177A4088J45462m93F2702a27196K9279D55258A07771K3134E5630J26767e1225
13165b18409F5640R5744g0250L4329B77772B5560Q3898a43255A05228c02110b5431
13153d5348I9153J60152O3704b3180n4421K7437j97105A07814l6726d1114q013
13142d9127A26700f5396A37725l4375K35000b68023F0054K95451C3271L58804
13132C92075j63580j09553m6073a19924A31346c689A51839C7437L44229A58240
13121A17083g6020B7670e5321r8464C52800g9143B33090a17809A5874P7419r170
$$ y = [-126524, 116197, 160943, 169088, 127866, -42627, 186504, 20305, 264880, 39045, -1787, 281327, 189388, -173209, 114364, 464413, 197794, 336275, 74987, 391115, 218936, -51014, 141674, 14088, 159550, 159057, 62702, -127196, -97917, 455258, 107771, 130905, 55630, 182397, -51225, -218409, 65640, 161384, -70250, -35921, 277772, 25560, 109458, -143255, 105228, -302110, -25431, -45348, 99153, 259305, 323009, -23180, -77601, -50164, -247269, 107814, 71088, -41114, -49127, 126700, -65396, 137725, 103350, 338350, -268023, 60054, 355505, 33271, 392075, 228495, 118942, 72869, -119924, 131346, -3689, 151839, 37437, 381666, 158240, 117083, -76020, 27670, -55321, -153785, 352800, -79143, 233090, -117809, 15874, 93293, 84123]
13110H4123B6086K88445M4287c57666c2288A29369b8552A82159D9019J41711d4193
13098a02660B5734e0499q5153O4723F8495a45301K7639B7951J9811J89350a0327
13086a38889j97634A53897b5393R483k8934F7400K74747a47760B18894q0485n222
13075A33187i5576r4362b9995I3593d83247B4411L21017a59093f2253K3601A90307
13063B77466A28016Q0455Q8018J08513j39781A30115J13417H3291k1698K96213
13053C57806I9187a33669d6274B58790m8160C1759J24909K78158A00831L9217
13043A40048J09105D3982J66065i5531j08116A53915M4344r4929J18487p7385
13033A44432c9703D44576G0557J45177l0501Q9836j08998J75469q2991a04087
$$ y = [84123, 26086, 314531, 358818, -357666, -32288, 129369, -28552, 182159, 49019, 190730, -44193, -102660, 25734, -50499, -135652, -70929, 68495, -145301, -117662, 27951, 47762, 237112, -10327, -138889, -336523, 153897, -25393, -15910, -44844, 67400, 342147, -147760, 218894, 138409, 133187, -95576, -189938, -29995, 93593, -483247, 24411, 345428, -159093, -62253, -38652, 190307, 277466, 128016, 208471, 296489, 405002, 265221, 130115, 243532, 83291, 61593, 357806, 99187, -133669, -46274, 258790, 210630, 31759, 156668, 434826, 100831, 140048, 249153, 43982, 210047, -95531, -203647, 153915, 198259, 103330, 221817, 144432, -39703, 444576, 70557, 215734, 185233, 275069, 166071, 341540, 258549, -104087]
13022D42182r9076j39590F4930R4812a53363k6816d9401B79233J04937F0939J56849
13011B17788G3240b7421A42543J9667p2591P8126A9406L7052f2818q2778A48316
12999A87339C2347c6989j99636C18582c00860J28027C98856I1980a02841A5958
12988E9984J07931i5625B32758a0460k8134E7688a11455A32285f4682A86242Q0373
12977B66615g7543B16025B9580e8551J9545F8905L0344a32564p2459k5061H375
12965A37574J5010C4061j845J9010R8568d3354G2088K0141l1066b121B4366a04917
12952C56882a776k1330j85968A99422B6013P9396J37460F1005J29289J98283D8443
12940a8110A90212E5298a56160B11402c275B67704P4988q2963b59833B36959f9181
$$ y = [442182, 343106, 203516, 64930, 159742, -153363, -180179, -49401, 279233, 384170, 60939, 217788, 73240, -27421, 142543, 162210, 89619, 167745, 19406, 56458, -62818, -145596, 148316, 187339, 32347, -36989, -236625, 318582, -300860, -172833, 398856, 91980, -102841, 15958, 59984, 167915, -95625, 232758, -10460, -38594, 57688, -111455, 132285, -64682, 186242, 266615, -77543, 216025, 29580, -58551, -39006, 68905, 99249, -132564, -205023, -230084, 8375, 137574, 152584, 34061, 32216, 51226, 149794, -43354, 72088, 92229, 61163, -2121, 24366, -104917, 356882, -1776, -23106, -209074, 199422, 26013, 105409, 242869, 61005, 190294, 388577, 48443, -18110, 190212, 55298, -156160, 211402, -3275, 267704, 342692, 259729, -259833, 236959, -69181]
12928D43278A82375m8971b92328n8404E46973f52944i7172B27948d19032F1795
12917a47765L4269k44394a37285J9255A02259b63191B11702B5368J63875a8385
12906A7572J73861l8142b28083M4733C4538h5710A01736D8254J18353L81822a2682
12894a68453J8656G6243a10296J1885A22204J27292r6723F5993B8141a43526A31241
12882H7851a95712l8322A29790B3026P5518J13580b7705k8091A33937b1193B3102
12870a93669k0845b5542H2297N2154a09585a6533n6386L1439F7336N2955m349
12859A15942C2412a47240C3311J34748K2599D7805j5085J36290F1934J02633B3976
12847F1401c4610a6719A95841M920H8550B8884J02294b8284n6340a1566E712K9402
$$ y = [443278, 182375, 133404, -292328, -350732, 546973, -652944, -97172, 227948, -419032, 61795, -147765, -113496, -357890, -137285, -118030, 102259, -263191, 211702, 25368, 189243, -18385, 17572, 191433, 153291, -228083, -183350, 34538, -85710, 101736, 48254, 166607, 548429, -12682, -168453, -149797, 76243, -110296, -98411, 122204, 249496, 152773, 65993, 28141, -143526, 131241, 87851, -195712, -234034, 129790, 23026, 98544, 212124, -27705, -55796, 133937, -21193, 23102, -193669, -214514, -25542, 82297, 134451, -109585, -16533, -72919, -41480, 67336, 120291, 115942, 32412, -147240, 33311, 168059, 190658, 47805, 32720, 169010, 61934, 164567, 23976, 61401, -34610, -16719, 195841, 200761, 88550, 28884, 131178, -28284, -84624, -11566, 5712, 35114]
12835C5114a86165g1644j73713K1275A2430J32910e6821k3292n4112A12671a69662
12823D9533i4859B01427b772k03923A47393o5618a24981j0884M8728j33466n3952
12812b74555i1756P492l7088A17500c45630A12544c83061A82841f6120F8290a48953
12800E839Q6432a22421a2077j24163B01520E3367i1113k36909c1445p1143c8866
12788a32596r3793B35298b96684J06500B55437r6999a23622M2365A8740h5997
12777A88645b80089I6373a46067A00892j7574d60014a1366j29055B60114g7155
12766A05126f7045A6099c08054B36600N1498c21274B36887O4909a95583g1835
12755D5300a33522B02596f9486I6266J539a77695c0941A16833j8290J96058j9838
$$ y = [35114, -186165, -71644, -245357, -224082, 12430, 145340, -56821, -80113, -134225, 112671, -169662, 49533, -94859, 201427, -2772, -206695, 147393, 81775, -124981, -135865, -87137, -220603, -274555, -91756, -84264, -121352, 117500, -345630, 112544, -383061, 182841, -66120, 68290, -148953, 5839, 92271, -122421, -12077, -136240, 201520, 53367, -91113, -328022, -31445, -102588, -38866, -132596, -226389, 235298, -296684, -190184, 255437, 158438, -123622, -81257, 18740, -85997, 188645, -280089, 96373, -146067, 100892, 83318, -460014, -11366, -140421, 260114, -77155, 105126, -67045, 16099, -308054, 236600, 288098, -321274, 236887, 301796, -195583, -71835, 45300, -133522, 202596, -69486, 96266, 97805, -177695, -30941, 116833, 98543, 294601, 274763]
12744B74763b5045F2800f445B29475J18546F7013a03204B87644D2863i2727B51209
12732A42344N2754J21282A12693K1006J18975b3654H3485M8144f72k0562I192
12720a65499L2249A53844B5974e4963I8272a75972B9105a80480P5671B93053L73709
12709F66762B85125k0165H5491J07923o1738M04661G1668d5641A5871K20631A06349
12697I7123h0684C1654b80314e333F6250h7321C64355b3399o965J2085D9300i3854
12684A03673J38428o5998q4668a4045A72283j229n8321m0602a99097d3512I6261
12672f655E2692g9552H0394P9123a15719I9471k7611J20211a68541G7600K7542
12661A05142k4427M13717A73652F1665A5833P5313l3278K53668A47675c3489Q943
$$ y = [274763, -25045, 62800, -6445, 229475, 348021, 67013, -103204, 287644, 42863, -92727, 251209, 142344, 195098, 316380, 112693, 133699, 252674, -23654, 83485, 131629, -672, -21234, 9192, -165499, -133250, 153844, 25974, -54963, 98272, -175972, 29105, -180480, -104809, 293053, 666762, 285125, 264960, 85491, 193414, 131676, 536337, 71668, -45641, 15871, 236502, 106349, 97123, -80684, 31654, -280314, -5333, 66250, -87321, 364355, -23399, -30364, -18279, 49300, -93854, 103673, 242101, 176103, 91435, -14045, 172283, 171054, 112733, 72131, -199097, -43512, 96261, -6655, 52692, -79552, 80394, 159517, -115719, 99471, 71860, 192071, -168541, 77600, 105142, 80715, 494432, 173652, 61665, 15833, 91146, 57868, 311536, 147675, -33489, -24546]
12650b4546C01069i411B89985j44623f5674k6118E5175b70003d4212j04095G3577
12638B40942L7904a0883n5778k465b4908G5869B2067j861P7481J40695K01126
12627D39508j78805j21457n6141a22882D77949d2188A44845J17507A26313a51275
12616A7390Q1088g7968K2433H0797M6174D9141L2751h177B52559h9201A15235
12604B24613a09071A30440J24255J15797a13693B20719f3027A5951e6823B9541
12593B4191K54046h8900k15181a04631D2030a39312p4279E0460h8706k78022A7906
12581i4481A27580K73109a73950b3781l8024C9361j2041a5187C289L08401b0016
12569g6757B71297A11642D0109N8160J29400f5271L1977o4006F5849c61635A39205
$$ y = [-24546, 301069, -9411, 289985, 145362, -65674, -91792, 55175, -270003, -44212, -148307, 73577, 240942, 278846, -10883, -66661, -69126, -24908, 75869, 22067, 20206, 97687, 238382, 439508, 260703, 139246, 83105, -122882, 477949, -42188, 144845, 262352, 126313, -151275, 17390, 98478, -77968, -55535, 80797, 126971, 49141, 81892, -8177, 252559, -89201, 115235, 224613, -109071, 130440, 254695, 370492, -113693, 220719, -63027, 15951, -56823, 29541, 24191, 278237, -88900, -304081, -104631, 42030, -139312, -213591, 50460, -88706, -366728, 17906, -94481, 127580, 400689, -173950, -23781, -61805, 39361, 27320, -15187, 3289, 311690, -20016, -76757, 271297, 111642, 40109, 98269, 227669, -65271, -33294, -97300, 65849, -361635, 139205]
12557h5857I3760A3106b35518h6437H2323e723k42970C1217R7343b70421B51449
12545D31958j77574E1794R8908J9146a71621l3219e2481D2900J12209d9016n6861
12534a05877j62354g993p696k61613D2390c1158l5106A28681a82906A00936a07445
12522A13992J0857a08570o3214A5390a26903A27682K76459F1313R4754a10286
12511c5761k5169B81053H4032a88750B7350a10824q894L8994k73686G5797j186
12500G4611b19918I1280f0890C9480b1619I3905h0210L4202q7179e2898J8699
12489c4199A67633a16244H4674a46778C93134b05941K1422B13457J55067H873
12478c0066A77158b19067h181o8565A62412B0581L34303a31796C6224b17962A22129
$$ y = [-85857, 93760, 13106, -235518, -86437, 82323, -5723, -248693, 31217, 128560, -270421, 251449, 431958, 254384, 51794, 150702, 169848, -171621, -204840, -52481, 42900, 155109, -49016, -105877, -268231, -7993, -15689, -277302, 42390, -31158, -66264, 128681, -182906, 100936, -107445, 113992, 124849, -108570, -171784, 15390, -126903, 127682, 404141, 61313, 156067, -110286, -35761, -60930, 281053, 84032, -188750, 27350, -110824, -119718, -80724, -354410, 75797, 74611, -219918, 91280, -60890, 39480, -21619, 93905, -80210, -46008, -133187, -52898, -34199, 167633, -116244, 84674, -146778, 393134, -205941, -184519, 213457, 368524, 8873, -30066, 177158, -219067, -8181, -76746, 162412, 20581, 354884, -131796, 36224, -217962, 122129]
12466A08809a13486M9845j68848d6859A48452a28104f1237D10366A40126f5925
12455A99926B0901d9042r6912j54217h4150A31594b26558H0142a13219o9169n6758
12444b39146E7498A0536a04838b7552h946k04325N8699a4016C3248b35905A30167
12432e2224E8251c0064j57861e8243k52616c0912k1005C62499j38617A6079F085
12420B8857K3461n621N40926a80626B07779B9325J51960o2507M820a23009j71766
12409b94775A10684k9806d3303A19233d4432B55701c93432i05l38991B91287C6028
12397A3782J50894c73022A44199N564a13990a8680j21945B3479K09525a08223
12386G3591b67328B12551H0440L00114A63563C3177O2e05561E5242e5401B10754
$$ y = [108809, -113486, -63641, -232489, -46859, 148452, -128104, -61237, 410366, 140126, -65925, 199926, 20901, -49042, -145954, -300171, -84150, 131594, -226558, 80142, -113219, -182388, -239146, 57498, 10536, -104838, -27552, -8946, -213271, -154572, -14016, 33248, -235905, 130167, -52224, 58251, -30064, -187925, -58243, -310859, -30912, -51917, 362499, 223882, 16079, 6085, 28857, 52318, 46697, 587623, -180626, 207779, 29325, 181285, 118778, 123598, -123009, -294775, 110684, 80878, -43303, 119233, -44432, 255701, -393432, -905, -339896, 291287, 36028, 13782, 164676, -373022, 144199, 149763, -113990, -18680, -140625, 23479, 233004, -108223, 73591, -267328, 212551, 80440, 380554, 163563, 33177, 33239, -505561, 55242, -55401, 210754]
12374A15919i6969A25501b65121f2666A34079b19035h3926j15873C17038g3947
12363F0467f1856A04752a34434B01864q6048b08626f4614A30952M504b53674b8394
12351b50447a17883j8319A00085n86B4469i5579B92202i8623j10402D4629N9888
12340A04517A0181J11775k1072b40432A73284p4531h338l2320m2334G7013N065
12329H2078a9849I9729M47781a14393G6961l1623g1867Q961k1086B149K7837i6207
12316E2405a56451M8935B85575A0112J98898b6638j13192A59535c3365o2439A63641
12304A8509J00093k4007J873f8603j32183J1795D0787g291B1583J35716C7426
12292A41798b05250G8076K34703c03127g0676A39165J29660A28509E6844K45889
$$ y = [115919, -96969, 125501, -265121, -62666, 134079, -219035, -83926, -199799, 317038, -73947, 60467, -61856, 104752, -134434, 201864, 115816, -208626, -64614, 130952, 135456, -253674, -28394, -250447, -117883, -136202, 100085, 99499, 24469, -95579, 292202, -98623, -209025, 44629, 104517, 10181, 121956, 100884, -240432, 173284, 98753, -8338, -40658, -82992, 77013, 82078, -19849, 99729, 547510, -114393, 76961, 45338, -71867, -62906, -83992, 2149, 29986, -96207, 52405, -156451, -107516, 285575, 10112, 209010, -26638, -139830, 159535, -33365, -95804, 163641, 18509, 118602, 94595, 96468, -68603, -200786, -188991, 40787, -7291, 21583, 157299, 37426, 141798, -205250, 78076, 312779, -303127, -70676, 139165, 268825, 128509, 56844, 302733]
12282C02733j47209K7644O3617G1708K2101C3299Q7172L9477j0461g0280B08219
12270A59139e6923K6250q9401r144A23344R7004n1678p1592J63896J19839f5855
12258D8212L5269c58942I7750Q3291M3719j2931G8401H845J64050a7155A89421
12246a94114A01810a85281A96797f9051B202J46435N435a2823E0176L1001Q6522
12235A67699E3888K13077H2303O5910o2376h589F1528B1925M75975g0852E48987
12223A96276A1848a82122q5263D66006A30404K121A9735K25007j11793R062J47174
12212B89185j41279b38397B61409a23061A34711M34N6411F1175P7672K0751J46345
12201C05943a38353A36314K8847J2720K48339j17862j50420J2365K5427Q9133
$$ y = [302733, 155524, 183168, 246785, 71708, 93809, 33299, 120471, 159948, 149487, -70280, 208219, 159139, -56923, -30673, -120074, -129218, 123344, 220348, 168670, 97078, 260974, 380813, -65855, 48212, 83481, -358942, 97750, 181041, 224760, 211829, 78401, 8845, 172895, -17155, 189421, -194114, 101810, -185281, 196797, -69051, 2202, 148637, 154072, -12823, 50176, 81177, 167699, 53888, 266965, 82303, 148213, 85837, -8589, 61528, 21925, 497900, -70852, 548987, 196276, 11848, -182122, -267385, 466006, 130404, 132525, 19735, 244742, 132949, 142011, 289185, 147906, -238397, 261409, -123061, 134711, 135145, 191556, 61175, 138847, 159598, 305943, -138353, 136314, 165161, 177881, 426220, 308358, 157938, 170303, 195730, 284863]
12191B84863D1466L45857j79666a34114N732A97641J97284j38519l639J0545d6609
12179a23943I5308A9787a33843C3987L8570h176B03759a91881E6546J24277E3778
12167a42344n7674i2606c7051F1584K45970I3129G317J89955J23851H6980K52722
12156C39702r6330b09560B54213c2638F8435N5545b21277d0708A46491j417D6280
12144E8059M43702a11527r9436I3721a3599I9327k9145b3751o974j62245J8098
12133a74872f694j72585h9131J3D0538M407K7363M3201D2192A5466J29860D5270
12120a49329G4382d51787B07244q5837a43587A03594j4588b92877a32813e7861
12109a57180d6066I2198B326O2451a01765j11910r423e1637B62236c34635f5907
$$ y = [284863, 41466, 387323, 207657, -134114, -128382, 197641, 394925, 256406, 252767, 263312, -46609, -123943, 95308, 19787, -133843, 33987, 72557, -8176, 203759, -191881, 56546, 180823, 53778, -142344, -200018, -92606, -37051, 61584, 307554, 93129, 7317, 197272, 321123, 86980, 339702, 243372, -209560, 254213, -32638, 68435, 123980, -221277, -40708, 146491, 145074, 46280, 58059, 501761, -111527, -210963, 93721, -13599, 99327, 70182, -23751, -30725, -192970, -174872, -6694, -179279, -89131, -89118, 40538, 44945, 72308, 115509, 42192, 15466, 145326, 45270, -149329, 74382, -451787, 207244, 121407, -143587, 103594, 89006, -292877, -132813, -57861, -157180, -46066, 92198, 2326, 64777, -101765, -213675, -223098, -51637, 262236, -334635, -65907]
12097c770j30964r8973L8081H5891C3810D701K12402F3305a03608C3546b08562
12085a24878b6984o6697C61804B6456K4044b54247l5272B35815K2044D3524K37880
12074B81404M51917Q91948G34180j69608b16340L3903H5914a3492j53297A28200
12063b71154K456h6044A08272a69077o8326C37975b8053A16085A3353P7370h9825
12051a78870G9579f0661B4233f6582j22496j27792J08803L2624O8549j63837C33040
12039b88897c9471H9718J31901b8648E5875d3208A03356b51323Q7802A39469o9196
12028G0273b07374P4539k46814g4656D07505d2545A61643d33590B90581a92883
12017A20063b16848D150J85360L3250b92307a1335D39547A51678a70632k538H8622
$$ y = [-3770, -134734, -233707, -195626, 85891, 33810, 4701, 217103, 63305, -103608, 33546, -208562, -124878, -26984, -93681, 361804, 26456, 50500, -254247, -289519, 235815, 257859, 43524, 281404, 733321, 1625269, 734180, 564572, -216340, -182437, 85914, -13492, -166789, 128200, -271154, -268698, -86044, 108272, -169077, -237403, 337975, -28053, 116085, 13353, 90723, -89825, -178870, 79579, -60661, 24233, -66582, -189078, -316870, -208067, -175443, -106894, -270731, 333040, -288897, -39471, 89718, 221619, -28648, 55875, -43208, 103356, -251323, -163521, 139469, 70273, -207374, -132835, -379649, -74656, 407505, -42545, 161643, -433590, 290581, -192883, 120063, -216848, 4150, 189510, 222760, -292307, -11335, 439547, 151678, -170632, -173170, 88622]
12005F5877b22061Q5469A13968A3208f2007l1859A14871J59816H8375R5206E6418
11993b90954C40477b50114h1348a3424j05357F231c3087B51377I3268i7422C90952
11981a49728D9826K46961f7220B62072G5173b60274d0398j10586k08415b1375
11970e1171I7104a55868A78892b41143j23031A64310B3530M4100e981A11573K62473
11959C74046b16k50719i6995A12326Q0398d8853A51144J475e2342A16040d6859
11947b58937G396h8247n100F7197c6308A10801b89761M6781e6424C33995A349
11935G6415c17709R6892m0914I4579O8519a23685A01074e6349B4522G660a60877
11923b0782j24381B1105K46499D6066J56115d59168F7635l298Q7353b42946g0622
$$ y = [65877, -222061, -136592, 113968, 13208, -62007, -93866, 114871, 274687, 88375, 183581, 56418, -290954, 340477, -250114, -81348, -13424, -118781, 6231, -33087, 251377, 93268, -97422, 390952, -149728, 49826, 296787, -67220, 262072, 75173, -260274, -40398, -150984, -359399, -21375, -51171, 97104, -155868, 178892, -241143, -364174, 164310, 23530, 67630, -5981, 111573, 374046, -216, -250935, -96995, 112326, 192724, -48853, 151144, 152619, -52342, 116040, -46859, -258937, 7396, -88247, -93347, 67197, -36308, 110801, -289761, -242980, -56424, 333995, 1349, 76415, -317709, -220817, -261731, 94579, 163098, -123685, 101074, -56349, 24522, 7660, -160877, -20782, -145163, 21105, 267604, 46066, 202181, -459168, 67635, 64337, 151690, -242946, -70622]
11911b1322m0736A33038A8622a09102o5210I299e1059d246C8934L4401k0516K60139
11899C12958a50624M3541C04009D0473K63632B3477d39424e5995j83760Q6794
11889a52961G3582i2095k0529A81398d23934A57691L4178F9920M7112N1066a3437
11877I4306a9869j67422A16141a65134j32954E3315b61335A68262C9425a90853
11866c51691h0891a7465F8579g3718A216N6787a08052A83102b19621a05685j21177
11855b26862A61840K20921C1277J3850I714P9403J6679J49625c27999a33889a0400
11843A21606f7333j65774A05967J5993A0584a29856j83361B63873b78730p5137
11833c53867A58636O290c28018E117b05256d9101F0765c95038B99891A1926a09532
$$ y = [-21322, -62058, 133038, 18622, -109102, -174312, 9299, -51059, -4246, 38934, 73335, 52819, 312958, -150624, -107083, 304009, 40473, 304105, 23477, -439424, -55995, -239755, -152961, 73582, -92095, -112624, 181398, -423934, 157691, 191869, 69920, 117032, 168098, -13437, 94306, -19869, -187291, 116141, -165134, -298088, 53315, -261335, 168262, 39425, -190853, -351691, -80891, -17465, 68579, -73718, 1216, 58003, -108052, 183102, -219621, -105685, -226862, 161840, 382761, 31277, 45127, 9714, 89117, 105796, 255421, -327999, -133889, -10400, 121606, -67333, -233107, 105967, 121960, 10584, -129856, -313217, 263873, -278730, -353867, 158636, 164926, -328018, 5117, -205256, -49101, 60765, -395038, 299891, 11926, -109532]
11821a10026E1062b3152r9239A17081i1040j8453C86475a89110j23797J20796
11811a92111H7829j2751d3164A57137c4021B7933N3413b74978b698q3124k4255
11800a10077B11176c21606A35870b63487A79873A1407O0568R5746N750E3138k5916
11789B7222j1789e4245B29735I5734c66602k8180J68559A5375K04480I93P2206
11778G3199a21692k69514B59334i7428C845K04824e5432j51584A06004K7165b4570
11766B1598M3903b12882a1016l3610l1894I1211A6337d4467C251b0523k27006
11755b47529A70211o4811C0572L7414N911b31088A15139e1930E220b4466E3108
11743A93996C3575c3460B86670o7644H0826L7602h2857l04735B18810k7980H0316
$$ y = [-110026, 51062, -23152, -122391, 117081, -91040, -109493, 386475, -189110, -312907, -192111, 87829, 75078, -43164, 157137, -34021, 27933, 81346, -274978, -2698, -85822, -110077, 211176, -321606, 135870, -263487, 179873, 11407, 71975, 167721, 173471, 53138, 27222, 15433, -54245, 229735, 95734, -366602, -394782, -226223, 15375, 219855, 993, 73199, -121692, -391206, 259334, -97428, 3845, 208669, -55432, -207016, 106004, 133169, -24570, 21598, 65501, -212882, -11016, -44626, -76520, 91211, 16337, -44467, 3251, -20523, -247529, 170211, 105400, 30572, 67986, 73897, -231088, 115139, -51930, 5220, -24466, 53108, 193996, 33575, -33460, 286670, 219026, 80826, 118428, -82857, -387592, 218810, 190830, 80316]
11731c10147a07297a0244m9884F4168a30649D1889b7272R543n9984H3664a2854
11719a6317C47286I6911b0046j50408C3011Q3798L7724c4902A941e293j55154
11708a60447e0085q270A27136i3075K2557A92098C5037a92749f9713E4384i9646
11696a96253R20A79659b96229A95851d1398j2076j3175L1549A81176q5475J46325
11685B42026b7111q2829C55369j10005b77230A71903a97449B50036c8596j21860
11675a60456A16641b40901i7409E0803J71545e355j76216C26639d2597c756A57617
11663a76445O7006B90319c46153E4930p817a0499G8980a18504B19297a81106B59291
11651a58293A51258a43459E7189i9845C24585G5467B8438L7111Q6533b73820h4941
$$ y = [-310147, -107297, -10244, -60128, 64168, -130649, 41889, -27272, -17729, -77713, 83664, -12854, -16317, 347286, 96911, -20046, -170454, 33011, 116809, 154533, -34902, 1941, -5293, -160447, -50085, -58355, 127136, -93075, -70518, 192098, 35037, -192749, -69713, 54384, -99646, -196253, -195333, 179659, -296229, 195851, -41398, -53474, -66649, -35100, 181176, 95701, 242026, -27111, -109940, 355369, 245364, -277230, 171903, -197449, 250036, -38596, -160456, 116641, -240901, -97409, 50803, 222348, -5355, -181571, 326639, -42597, -3756, 157617, -176445, -109439, 290319, -346153, 54930, 47113, -10499, 78980, -118504, 219297, -181106, 259291, -158293, 151258, -143459, 57189, -99845, 324585, 75467, 28438, 65549, 152082, -273820, -84941]
11639H687O3510K4994b03602B39642r8476A669b08950h5331p8106a1958C00073
11627c61703a77093B8606e4659B49485b5312F8199a72484B954b257B18959J77979
11616C96938A19712a95233B22102a83102d1443H5294Q7796a60664e2271H1891
11605c1718j20926B19367a02813A1018R0485K25542D9274a57018C29975a10852
11594B4489K34882a5625r9765n0488H9839a94943O3570A69587K1757J57443J33401
11583D82188b12286A63558J19674j00585D0166g5920A6666L29551N8185k01695
11573B02707e6925D30571a47417C02423e1243e169B04351f8890D3525L33626g4665
11561E0406M774B14L43838I3825P4254l0831b10719B02123r9249N6347a64246
$$ y = [8687, 72197, 97191, -203602, 239642, 141166, 1669, -208950, -85331, -163437, -11958, 300073, -361703, -177093, 28606, -54659, 249485, -25312, 68199, -172484, 2954, -2257, 218959, 396938, 119712, -195233, 222102, -183102, -41443, 85294, 173090, -160664, -52271, 81891, -31718, -152644, 219367, -102813, 11018, 101503, 327045, 49274, -157018, 329975, -110852, 24489, 259371, -15625, -115390, -165878, 89839, -194943, -131373, 169587, 191344, 348787, 482188, -212286, 163558, 283232, 182647, 40166, -75920, 16666, 346217, 404402, 202707, -56925, 430571, -147417, 302423, -51243, -5169, 204351, -68890, 43525, 377151, -74665, 50406, 55180, 214, 344052, 93825, 168079, 137248, -210719, 202123, 102874, 159221, -164246]
11549A32064b07562C0259a33233G1796i5645j7539G6282R5823j7547b67236C11709
11537C78933A27611K92866f9060B025J23486K5191a04653C13400A46629a87361
11526a65446B19424i153A58711n3066j0653Q3733p6262A0075L9474L09302A7891
11514A9615c3040A46569J93414l9666A38761L2076p3256L49320k22447b3716A68485
11502C22064A47629b18213A3977f0797E75796A04566K31852D5019J35520D7586
11491C47993b24948C89228A74488d9065r6642A44402B3604P9017a03841B05880
11480C32538H9202l9160L07185C6983J09855O0851b1886G3554K33866H0655k6145
11469E4510K03517A09939i166A62445j1613J0904J57447B3140h0658K9063B917
$$ y = [132064, -207562, 30259, -133233, 71796, -95645, -113184, 76282, 172105, 154558, -267236, 311709, 378933, 127611, 420477, -69060, 2025, 125511, 150702, -104653, 313400, 146629, -187361, -165446, 219424, -9153, 158711, 105645, 94992, 178725, 102463, 10075, 49549, 358851, 17891, 19615, -33040, 146569, 339983, 300317, 138761, 170837, 97581, 446901, 224454, -23716, 168485, 322064, 147629, -218213, 13977, -60797, 575796, 104566, 336418, 45019, 180539, 47586, 347993, -224948, 389228, 174488, -49065, -145707, 144402, 23604, 102621, -103841, 205880, 332538, 89202, 50042, 357227, 36983, 146838, 207689, -21886, 73554, 307420, 80655, 54510, 258027, 109939, -9166, 162445, 150832, 161736, 319183, 23140, -80658, -51595, 2917]
11457H665a40813B42824H4327M6755a21711B83976J8798a15789B51134b7304A17257
11445D07141D6343f2118C74219E4713L46447A82486p6535L4631J35994p0636C6887
11433a87978d7634n9827C66587a1456o146B69311G7249O3368J704a36972A37334
11421A30529b18626I5672J48316a02120k940f378k66840A36793J5625E1624j4928
11410C6696g8045B27747o0240G1432a35426C19236a30111E0576R928F128a38940
11398A79983B2926d7689k95325C0265c21375B11010o4876B6943J90590p7922a59080
11386a63484a0019n571j60181H2570J00010a15630K7199p9070Q3495b2077k60101
11375b82178b9208E6688k4668L9895a39402A78449b92980Q6121B14374n6597A0677
$$ y = [8665, -140813, 242824, 84327, 131082, -121711, 283976, 302774, -115789, 251134, -27304, 117257, 407141, 46343, -62118, 374219, 54713, 401160, 182486, 105951, 140582, 276576, 205940, 36887, -187978, -47634, -107461, 366587, -11456, -17602, 269311, 77249, 140617, 142321, -136972, 137334, 130529, -218626, 95672, 243988, -102120, -105060, -6378, -273218, 136793, 152418, 51624, 36696, -78045, 227747, 167507, 71432, -135426, 319236, -130111, 50576, 60504, 6128, -138940, 179983, 22926, -47689, -343014, 30265, -321375, 211010, 146134, 26943, 217533, 139611, -159080, -163484, -10019, -15590, -175771, 82570, 182580, -115630, -88431, -167501, -84006, -22077, -282178, -29208, 56688, 32020, 71915, -139402, 178449, -292980, -206859, 214374, 157777, 10677]
11363a46910p8747g5839B06106E027O1332J05367K27230a46378f8477A29351f0362
11351b90283Q5685A87860a79732O8633j2741M8572A4357M8222b8600p1732A82319
11339e52913A73417i8998A64585a61307K7480n5679C4298c25954a2976j06173
11329a19149B0031c70312a0259m8890B3278f4030F913a3537d768A17664N0830
11318A68494b22710A07089C2377a66950E788a63476B03399a60053q0359h1187
11307B8260e5722m16977A40648b42680D3537b21174e0617A68669a41298j345B80790
11295g9020D7354M3286b43403d6621B89247o7893N9219A2081K2599c0783l9730
11284g0513j81688g3118j0762j04654P5852i028B39733K1964c6926k1799q1561
$$ y = [-146910, -225657, -75839, 206106, 5027, 66359, 171726, 398956, -146378, -68477, 129351, -60362, -290283, -204598, 187860, -179732, -111099, -123840, -75268, 14357, 62579, -28600, -100332, 182319, -552913, 173417, -98998, 164585, -161307, -133827, -189506, 34298, -325954, -12976, -119149, 20031, -370312, -10259, -59149, 23278, -64030, 6913, -13537, -4768, 117664, 168494, -222710, 107089, 32377, -166950, 5788, -163476, 203399, -160053, -240412, -81187, 28260, -55722, -472699, 140648, -242680, 43537, -221174, -50617, 168669, -141298, -142643, 280790, -79020, 47354, 90640, -243403, -46621, 289247, 221354, 280573, 12081, 34680, -30783, -70513, -252201, -73118, -83880, -188534, -112682, -9028, 239733, 261697, -36926, -58725, -140286]
11273a40286j03004B38317A11808D2700L6932R647e36032A6656d7671a8188f634
11261b31442a9156H6102a7170m4266l5381A47491e557m5210m5280a4820A25233
11249G0441J35162A9571d2508k2462n0404A39409J35677C1393c24038A42562b36548
11237b23299C1521J47347o6831a15263j6754A22704a36455j27843D7870L9548
11227H7418a450m545B75831g7532F9013i2455q8695I7559b16933I9012a51675
11215B14311j03985c5602A48185a2348A91135h1984H3521d8318a587G5413K2366
11204I7779f138o2676A75878b33150E5941a14855k091c8846j91595L9975A23863
11192d46392a30849b3515A7878K6193h6033n2006j258K022A35055a06376A14929
$$ y = [-140286, -243290, 238317, 111808, 42700, 79632, 89279, -536032, 16656, -47671, -18188, -6634, -231442, -19156, 86102, -17170, -61436, -96817, 147491, -5557, -50767, -96047, -14820, 125233, 70441, 205603, 19571, -42508, -64970, -115374, 139409, 275086, 31393, -324038, 142562, -236548, -223299, 31521, 178868, 112037, -115263, -132017, 122704, -136455, -264298, 47870, 87418, -1450, -5995, 275831, -77532, 69013, -92455, -181150, 97559, -216933, 99012, -151675, 214311, 110326, -35602, 148185, -12348, 191135, -81984, 83521, -48318, -1587, 75413, 97779, -6138, -68814, 175878, -233150, 55941, -114855, -116946, -38846, -230441, -190466, 123863, -446392, -130849, -23515, 17878, 44071, -86033, -138039, -139297, -137275, 135055, -106376, 114929]
11180a37789d4539H9075J29935f1326b3049j34402A42627l6907b0213B05310c13622
11168e1745a6836n6589A78028a07428b3750k5429p2952C8075J50681E1541A6308
11156B0845b95308E4176c12086A14836M622b64731H8105P4360e2247k52392k55451
11145e60090i8146a2913F2986a06588B77948I88a8852D8768h683B87274E6601
11133A8938L4110L3443b01525k253B53071o1152F9796M2408J41104a04819l11175
11122d15994A23125R6664b42611B11720L9622f4696o3388b5611k6314E7820K22868
11111B80688r3833E7837r401e2944A65729f3722A72444n0799K66927A46412m3179
11100A03233b77507B04121J7967J87929A40181K44130j90390P5503E6596P298
$$ y = [-137789, -44539, 89075, 219010, -61326, -23049, -157451, 142627, 105720, -20213, 205310, -313622, -51745, -16836, -73425, 178028, -107428, -23750, -49179, -122131, 38075, 188756, 51541, 16308, 20845, -295308, 54176, -312086, 114836, 119458, -264731, 88105, 162465, -52247, -304639, -560090, -98146, -12913, 62986, -106588, 277948, 988, -18852, 48768, -8683, 287274, 56601, 18938, 53048, 86491, -201525, -203778, 253071, 191919, 69796, 112204, 253308, -104819, -415994, 123125, 219789, -242611, 211720, 251342, -64696, -128084, -25611, -51925, 57820, 280688, 186855, 57837, 48436, -52944, 165729, -63722, 172444, 121645, 388572, 146412, 103233, -277507, 204121, 222088, 410017, 140181, 384311, 193921, 269424, 56596, 63894]
11090F3894c01004f7176B01875d197A18163c1165D6858R5843E9383R483L21476
11079C90342A46953J76196m6299K22538N4793k53726j28336L7106J0292K25902
11069D45419j57157Q8132E8744K58041k981j35537M04922j63128m6473J8402A48436
11057E24899j68101K73329K76500l94207N484J627J57879k37532N7119A63910
11046G03093L1152j54606M0946K57128j30934J26795k53611J57543l1940J27130
11036H72696k53373p8517J20042J17472l69845j39726K00673p0095J33532R8318
11026F31177J27802q8232M686j5611J21811j94967j32155m8348m4767P7885L17548
11015G56829A98838J00919J82260L2258l2649o9650L03849B31104M65238B29270
$$ y = [63894, -301004, -67176, 201875, -4197, 118163, -31165, 46858, 142701, 59383, 68866, 390342, 146953, 323149, 276850, 499388, 554181, 300455, 172119, 209225, 219517, 445419, 288262, 376394, 58744, 316785, 313804, 178267, 583189, 420061, 373588, 391990, 148436, 524899, 356798, 630127, 906627, 512420, 517904, 519531, 677410, 439878, 496997, 163910, 703093, 734245, 579639, 620585, 877713, 746779, 873574, 619963, 777506, 745566, 872696, 619323, 540806, 660848, 778320, 408475, 268749, 469422, 399327, 532859, 631177, 758979, 670747, 675433, 659822, 781633, 586666, 454511, 406163, 361396, 439281, 756829, 198838, 299757, 482017, 514275, 481626, 411976, 715825, 231104, 696342, 229270]
11004C96042J84038j14392J37315K04808j6213k39775P9038j02888k1231K62040
10994G68782B60418J84665K78002Q239n4455j80396J46726L34253j61891O5895
10984H81456l89685O80945l02424l0150L64749j90664L97839r3807J10690M80956
10974A909905L92104J04148O0186j42209J11366j13265l57722j8160j15694k53121
10964A577538j68187j7869J52426k52K35488j51605l17193N16881L6685k73367
10954A590545L92022n55984j05771j39646j53787m25502q518k27772J99144p8517
10944D86214K1376j80989J76774K7354j24657G750K61396a15846B33211D7219
10933B57833F052c2775A48901a86799j5113F2026k9414h7469n446k09162J34153
$$ y = [396042, 580080, 465688, 603003, 807811, 791598, 551823, 630861, 527973, 506742, 768782, 260418, 445083, 723085, 731324, 676869, 496473, 643199, 977452, 815561, 881456, 491771, 1172716, 870292, 840142, 1204891, 1014227, 1412066, 1318259, 1428949, 1909905, 2302009, 2406157, 2466343, 2324134, 2435500, 2322235, 1964513, 1946353, 1830659, 1577538, 1409351, 1391482, 1543908, 1543656, 1779144, 1627539, 1310346, 1827227, 1863912, 1590545, 1982567, 1426583, 1320812, 1181166, 1027379, 601877, 593359, 365587, 564731, 486214, 507590, 326601, 503375, 530729, 406072, 7750, 269146, -115846, 233211, 47219, 257833, 6052, -32775, 148901, -186799, -201912, 62026, 32612, -87469, -92915, -302077, -167924]
10922a67924H1973j5522g4108A25647J04955l0183h4505B00665L04020D731O2061
10911F6792K2783K91786F9233J74138b9788j4391F5071a07953B56914J4292B3290
10899B34114i1477G4774J16491E7768K0244h3512I483i5561B53878B3403R7800
10888A21203J47189c19131e0339k7102j4823L3552I7580m8254a93572R6198G2787
10876A3606e9074k6992j90794i4544A96268q1572b14528j0450j29813E0552a33272
10864B20999b60938A63505a36593j25584h495k21418h9177A21881c9071A01663
10853D3484b80759C4164c7507J1665A46575a17542d5053C17909j38314a70031
10842a67049A59354n4668m8598J26299A5816i7131b8680q1387C79563k6413C1826
$$ y = [-167924, 81973, 66451, -74108, 125647, 230602, 200419, -84505, 200665, 504685, 4731, 66792, 89575, 381361, 69233, 243371, -29788, -44179, 65071, -107953, 256914, 271206, 23290, 234114, -91477, 74774, 191265, 57768, 78012, -83512, 9483, -95561, 253878, 23403, 121203, 268392, -319131, -50339, -77441, -92264, -58712, 97580, 49326, -193572, -97374, 72787, 13606, -59074, -86066, -276860, -94544, 196268, 114696, -214528, -224978, -354791, 50552, -133272, 220999, -260938, 163505, -136593, -262177, -8495, -229913, -89177, 121881, -39071, 101663, 43484, -280759, 34164, -37507, -25842, 146575, -117542, -45053, 317909, 179595, -170031, -167049, 159354, 104686, 56088, 182387, 15816, -97131, -28680, -110067, 379563, 353150, 31826]
10830a54781A9663a03357f819l07718a19388M181o0323Q2816p7443m7355A69184
10818C6363a47294F1453a21344A80904a85861J290f4857B09494r8944f3401A6503
10806b54172A86774D091b73790g954I0319N4627f8273p0456b3165k27966h700
10794G5165f3128A73503D2176b21464O7380A6019a35788B18344b51883A87523
10783b919m1093l06978F1674B6545e6990I8116l8094B7615J25858b97875a03037
10771A26090a70162k04343B83844H7920L5280b22565A65741D180a0716j07392
10761a18108A85694B4648i8336m0590A12820i1221q5409G4894b05005q7322B85068
10749B09072g2936n5068j25126H5189c6818m1563q060j075a5758A53900c5687
$$ y = [-154781, 19663, -103357, -6819, -314537, -119388, -115207, -175530, -92714, -170157, -217512, 169184, 36363, -147294, 61453, -121344, 180904, -185861, -184571, -64857, 209494, 110550, -63401, 16503, -254172, 186774, 4091, -273790, -7954, 90319, 144946, -68273, -138729, -23165, -251131, -8700, 75165, -63128, 173503, 42176, -221464, -154084, 16019, -135788, 218344, -251883, 187523, -2919, -44012, -350990, 61674, 26545, -56990, 98116, 60022, 27615, 153473, -297875, -103037, 126090, -170162, -374505, 283844, 87920, 123200, -222565, 165741, 4180, -10716, -118108, 185694, 24648, -98336, -138926, 112820, -91221, -176630, 74894, -205005, -292327, 285068, 209072, -72936, -128004, -253130, 85189, -36818, -78381, -86441, -87516, -15758, 153900, -35687]
10737a44877D5912K7535J11842c39447c9941j27990b5945l53918e6113I3073a62159
10725C6267a27650K9272B94206j13363b99359A85801b8183l8253f193B66478a39434
10713b4791A06352a51369m6437d7792J4277o609k7778A33201h7719a5842k75581
10702b91423E8264e5428A6231e1698A87539P3051A01052a8736B39604d20454J33090
10691b87364A19160B0247M0589a45788b7108k72007J1977a05097j95010C5615
10680B2620a10977k11511g3209C6203N4019c2771k01926J16244k43527f4082j36147
10669b00229H6619D2037a66789E2128b70339E6401O4363b95138d4486J4113j15226
10658a45599F4304b71255o170e3163A10041b03043o5364i5767E4709H974a36725
$$ y = [-144877, 45912, 73447, 185289, -339447, -39941, -167931, -25945, -379863, -56113, 93073, -162159, 36267, -127650, -98378, 294206, 180843, -299359, 185801, -28183, -66436, -6193, 266478, -139434, -24791, 106352, -151369, -197806, -47792, -33515, -40124, -67902, 133201, -87719, -15842, -291423, 58264, -55428, 16231, -51698, 187539, 260590, 101052, -18736, 239604, -420454, -287364, 119160, 20247, 60836, -145788, -27108, -299115, -287138, -105097, -300107, 35615, 22620, -110977, -322488, -73209, 36203, 90222, -32771, -234697, -118453, -361980, -64082, -200229, 86619, 42037, -166789, 52128, -270339, 56401, 120764, -295138, -44486, -30373, -145599, 64304, -271255, -277425, -53163, 110041, -203043, -268407, -95767, 54709, 8974, -136725]
10646A68768h9899c0127B1879J49712b32452O6807H5458d68245P9701B49913a52993
10634a35873L6958p6621O5994b4352A06737a17855B1831g099j2441k11008E2655
10622B49435a24928l28029F7003b71868E26250A06934k7481b45529m4052p7190
10612c66771B01205a49843j39516J27627f0108n287I4374K8939L5309g4756H9871
10600B74280b44621H1981c99236c1383A51182K1354D1822F808J925J67541i0995
10588f7757C47086c20217A97789a90302D744K03372a80796h4973p4437h985A75795
10576A08620e8680j16432e7598r179A10637d73910B4009a40704a3635A1053J45204
10565A56257E9233a82837I5618i9819A66349F6255a13859D8372a12946F2829e6905
$$ y = [168768, -89899, -30127, 21879, 171591, -232452, -165645, 85458, -468245, -388544, 249913, -152993, -135873, -98915, -175536, -109542, -24352, 106737, -117855, 21831, -7099, -19540, -230548, 52655, 249435, -124928, -452957, 67003, -271868, 526250, 106934, 79453, -245529, -289581, -366771, 201205, -149843, -289359, -161732, -60108, -65395, 94374, 123313, 158622, -74756, 89871, 274280, -244621, 81981, -399236, -31383, 151182, 172536, 41822, 6808, 8733, 176274, -90995, -67757, 347086, -320217, 197789, -190302, 4744, 208116, -180796, -84973, -159410, -8985, 175795, 108620, -58680, -175112, -57598, -66777, 110637, -473910, 24009, -140704, -13635, 11053, 156257, 59233, -182837, 95618, -99819, 166349, 66255, -113859, 48372, -112946, 62829, -56905]
10553c5241B9897c95681B30550c01683K3448J9321q6837B75070i1957m3166C43468
10541B44109C7914P4899M077b38275c391j06701k60276f6323r560l58702F2308
10529G4787J15675C5556d13183C14680d16969a17368A16344a8216B02953A7154
10518a88771A03353a55699p2248N3189A99425C9135a06960B60669a44486q2132
10508b26618A58796j0221a22719C9762a98204K364R928B29453b13137A79109c6841
10496B3728K09001o1012i6870k0500E9245P4642C5730O0373K84882f9434K9186
10485d0248A18613n4575b41731B62382M66189k67074m4947m8342H0766a3381C12552
10473A74521R2670a1703H8329K62929a65088G783e5497D8127N4879J1813M68105
$$ y = [-35241, 29897, -395681, 230550, -301683, -278235, -258914, -345751, 275070, -91957, -135123, 343468, 244109, 37914, 112813, 116890, -238275, -3391, -110092, -370368, -66323, -75883, -434585, 62308, 74787, 190462, 35556, -413183, 314680, -416969, -117368, 116344, -18216, 202953, 17154, -188771, 103353, -155699, -227947, -174758, 199425, 39135, -106960, 260669, -144486, -226618, 158796, 148575, -122719, 39762, -198204, -195840, -185912, 229453, -213137, 179109, -36841, 23728, 232729, 171717, -96870, -117370, 59245, 133887, 35730, 96103, 380985, -69434, -40248, 118613, 64038, -241731, 262382, 728571, 461497, 416550, 368208, 80766, -13381, 312552, 174521, 267191, -11703, 88329, 351258, -165088, 7783, -55497, 48127, 103006, 114819, 582924]
10462E82924A00710a69888C6524J9341b21209J03773R29J9065C7647K3340h4181
10450A79362k5500b78370a37926J3514B2821c23051J55376B12800h6227E1008
10439a20499n98k2618D36505j86934E0475g9207B9446e2973E5968a7053B75176
10427C946J21016N4081c9549E7909J37464l744a39581n1678k0611N5827d4562
10415b5975H0765C3983b33328B48843a01312k9424d7710j15116A0507a09660K6177
10404h3483A6767K06431C6032c54943a5215k58099J31631j97875h498n3831G2570
10392G903J36587Q8526I1168i1669A3401J1061c12174D1462j8997e051B87734
10380b30906g9470g824C23618J8665A60405K7348L65q7408N21161A46957K74704
$$ y = [582924, 100710, -169888, 36524, 55865, -221209, -117436, -116507, -97442, 37647, 60987, -84181, 179362, 153862, -278370, -137926, -124412, 22821, -323051, -167675, 212800, -86227, 51008, -120499, -121097, -143715, 436505, 249571, 50475, -79207, 29446, -52973, 55968, -17053, 275176, 3946, 124962, 179043, -39549, 57909, 195373, 191629, -139581, -191259, -211870, -156043, -44562, -25975, 80765, 33983, -233328, 248843, -101312, -130736, -47710, -162826, 10507, -109660, -83483, 16767, 223198, 36032, -354943, -15215, -273314, -141683, -339558, -8498, -62329, 72570, 7903, 144490, 233016, 91168, -91669, 13401, 24462, -312174, 41462, 22465, -5051, 287734, -230906, -79470, -7824, 323618, 342283, 160405, 187753, 188118, 100710, 621871, 146957, 421661]
10369D21661J893r9303A40863J27060L2348m5944J6595N1315I3471M26376A28336
10357B78836L2786D1893J65280a9791D12521j15114K50341J6162j03566A37525
10346A33893a26690C38958J57206k02691j2444Q1746o7696K06605j52192j50714
10336A98778e1480B77860J24711i0193B19320c9851l0337I8651h1213A8487b19563
10324b01300e1827B28559k6520J03100E3786J46690b2602j17135k3227C75471
10313B45359a26536C21004A4451b50440A25017B9953b637C5320J69285I0972e7801
10301a42962A71107a28383n3532a5550B58669o4936E7855a86876h6789L4474I2886
10289A58802b73131a2655a963A19050R5211D4857a09016l24008a22289B12612
$$ y = [421661, 423554, 324251, 140863, 267923, 300271, 254327, 270922, 322237, 93471, 519847, 128336, 278836, 311622, 41893, 207173, -19791, 412521, 297407, 547748, 563910, 460344, 137525, 133893, -126690, 338958, 496164, 293473, 281029, 362775, 295079, 501684, 349492, 198778, -51480, 277860, 402571, -90193, 219320, -39851, -70188, 98651, -81213, 18487, -219563, -201300, -51827, 228559, 202039, 305139, 53786, 200476, -22602, -139737, -162964, 375471, 245359, -126536, 321004, 14451, -250440, 125017, 29953, -2637, 35320, 204605, 90972, -57801, -142962, 171107, -128383, -181915, -15550, 258669, 193733, 57855, -186876, -86789, -52315, 92886, 158802, -273131, -12655, -1963, 119050, 214261, 44857, -109016, -433024, -122289, 212612]
10278B6033c40639i2273C6603c2073k51400M2605A24989l1352R7123R2138a64267
10266a67016N1480j70654B8890J63698K61372A85539k4354d4736A71284m9771
10256A21513J29343L9383A1770K42675r2023a56057I4472n984a89038m3093P6499
10245a55632B2715b04657d6611m7969b2354A5604J8477b29320c3180l21019A17565
10233b31268E5719f6677F3768O6449g7167O449J2551A05334a76131m0062A8602
10221a32095H2305i7823j2847L0285k88589g1264A51876b89901B48887A01521
10210H8955J83636a68129A98269H2912d1711j13955H8168b75783D9494a11571
10199g5910G2866b53127a9143k56831f929F827J8220c22478Q7859q4328C79567
$$ y = [26033, -340639, -92273, 36603, -32073, -283473, -240868, 124989, 93637, 190760, 282898, -164267, -167016, -115536, -286190, 28890, 192588, 453960, 185539, 161185, -44736, 171284, 121513, 250856, 290239, 11770, 254445, 162422, -156057, 94472, 88488, -189038, -232131, -155632, 22715, -204657, -46611, -94580, -22354, 15604, 34081, -229320, -33180, -354199, 117565, -231268, 55719, -66677, 63768, 130217, -77167, -70718, -58167, 105334, -176131, -216193, 18602, -132095, 82305, -97823, -110670, -80385, -368974, -71264, 151876, -289901, 248887, 101521, 88955, 272591, -168129, 198269, 82912, -41711, -155666, 88168, -275783, 49494, -111571, -75910, 72866, -253127, -19143, -275974, -6929, 6827, 25047, -322478, -234619, -318947, 379567]
10187E7058f380k30448N5880d6812H5474h6113j02528A29095b17791A4970b94682
10175h1178j48559J00422G6929i3454c8970l95556a05890a5580B39588b211A0907
10163a12233L4636A71331a30903r2748A15403a79057f6964B94274a2666j80914
10153a93580m6870f4349B74431a54853G1513a42991G1408d2542j23998A75558
10142f4193k94801C08335o6316C7457a45086C35665b80429A48262a46862G9307
10131A0150J15056c12775B2143h0134B09502j9244b61669A51348O8690P4113a59754
10119c30737J62907L1427q0433F8437M7444h5742c7973j06634j24681k6597A2073
10107E2703f2160j46191j62814E2506a64346B70870d9490o2193e3494n482I0506
$$ y = [57058, -6380, -236828, -180948, -46812, 85474, -86113, -188641, 129095, -217791, 14970, -294682, -81178, -229737, -129315, 76929, -93454, -38970, -434526, -105890, -15580, 239588, -2211, 10907, -112233, -77597, 171331, -130903, -223651, 115403, -179057, -66964, 294274, -12666, -193580, -240450, -64349, 274431, -154853, 71513, -142991, 71408, -42542, -166540, 175558, -64193, -358994, 308335, 242019, 37457, -145086, 335665, -280429, 148262, -146862, 79307, 10150, 125206, -312775, 22143, -80134, 209502, 190258, -261669, 151348, 220038, 294151, -159754, -330737, -167830, -136403, -216836, 68437, 115881, -85742, -37973, -144607, -269288, -295885, 12073, 52703, -62160, -208351, -371165, 52506, -164346, 270870, -49490, -111683, -53494, -58976, 90506]
10095a06670C86154A91738b15608C78147o8170a10385R827j4637A23545a57677
10084A00510K06994e5323p7011k52070a47904k24672A52717a47690A05794P207
10074A13001a61754d2422F7929k379J02796G467b50967O8725A57618b95800e2522
10062A06705a26861E73910A42750a12455l8313A95567p9066A7472d6006o6642
10052a12648A62435h9531A30292d1860j59645J2085g950k50470h1580F4947J40266
10041B05213a29226D8307N0839O5200b90316R2902A01222a94143N2856E7649d2983
10029a26880M1609h171O04m57501J53987J05866H4029k9249i4523B1009J43245
10018A64254c34178j17822a91095j07776J42309r4173j71532A57214c50026i733
$$ y = [-106670, 386154, 191738, -215608, 378147, 309977, -110385, -100558, -115195, 123545, -157677, 100510, 307504, -55323, -132334, -384404, -147904, -372576, 152717, -147690, 105794, 113001, -161754, -42422, 67929, 65550, 168346, 7467, -250967, -182242, 157618, -295800, -52522, 106705, -126861, 573910, 142750, -112455, -150768, 195567, 116501, 17472, -46006, -112648, 162435, -89531, 130292, -41860, -201505, -189420, -7950, -258420, -81580, 64947, 205213, -129226, 48307, 99146, 164346, -290316, -197414, 101222, -194143, -141287, 57649, -42983, -126880, -85271, -8171, -7567, -465068, -311081, -205215, 84029, 54780, -94523, 21009, 164254, -334178, -452000, -191095, -298871, -156562, -250735, -422267, 157214, -350026, -9733]
10007D2198K22635F9299a16943A30039c8476B13108a02129H1940J56539A13391
9996C86579f8491K8512k55744g2958F8394J26674D4005f4392E5331b03172J5232
9985a87940i2588b9983B7097a40548j26340J09773l5750b4868A24324a99705E1917
9973G3037g1649l38977c626r8603m6021k37128P4971a08691j84846A01345b39922
9961E330f4389a098A1300J30376a6035B5351D719K73218a48878C22754d5827n06548
9949e52375b16715Q2000N853H5583b28752A390a14307B86883D9522a8347k90551
9938c08898G3917a65657N6330k23790Q4523a18593J6709D9812c15016h4224J2569
9927g1655A56307l5407b01066f2518n2821F1543j5861m751R8251c5342j43788
$$ y = [42198, 264833, 69299, -116943, 130039, -38476, 213108, -102129, 81940, 238479, 113391, 386579, -68491, -39979, -295723, -72958, 68394, 195068, 44005, -64392, 55331, -203172, -187940, -92588, -29983, 27097, -140548, -266888, -157115, -192865, -24868, 124324, -199705, 51917, 73037, -71649, -410626, -3626, -102229, -148250, -385378, -310407, -108691, -293537, 101345, -239922, 5330, -64389, -1098, 11300, 141676, -16035, 25351, 4719, 277937, -148878, 322754, -45827, -552375, -216715, -134715, -128862, 85583, -228752, 1390, -114307, 286883, 49522, -18347, -308898, 73917, -165657, -109327, -333117, -248594, -118593, -101884, 49812, -315016, -84224, -71655, 156307, 120900, -201066, -62518, -115339, 61543, 45682, 40931, 139182, -35342, -179130]
9916a79130G0180b88781E4892N0935b23338F9974b8371k49250Q9873j78754h0769
9904b88564D415d887A19681m5943d5317j69255E8752J04694g3201B16765c01707
9892i1827b2563L017k11078m553j3297J5268a02702A08770g7421n3699c4726K124
9880c2602q4735j43242A376a57489O4697C60518C188c58236a36506d3207i620
9868A9440J4119b45573m5647P2241L5485h9551E84g5544F1353f1845E2833d9127
9855F2347d2699k79415B24100H0929L3642a71986H2826a02244m8621A09560A2611
9843A88627H3797N6360e2093A50115J22230d6320p7423p3502o6299g3478k03415
9832b76893n1986b9609j62697d604k83075N7445E9969c02788B9173J3877C252
$$ y = [-179130, 70180, -288781, 54892, 105827, -223338, 69974, -28371, -277621, -187748, -366502, -80769, -288564, 4415, -4887, 119681, 73738, -45317, -214572, 58752, 163446, -73201, 216765, -301707, -91827, -22563, -19546, -230624, -235177, -248474, -233206, -102702, 108770, -77421, -131120, -34726, -32602, -117337, -260579, 1376, -157489, -92792, 360518, 3188, -358236, -136506, -43207, -9620, 19440, 33559, -245573, -291220, -218979, -183494, -89551, 584, -75544, 61353, -61845, 52833, -49127, 62347, -42699, -322114, 224100, 80929, 114571, -171986, 82826, -102244, -150865, 109560, 12611, 188627, 83797, 140157, -52093, 150115, 272345, -46320, -123743, -197245, -263544, -73478, -276893, -328879, -29609, -192306, -4604, -287679, -230234, 59969, -302788, 29173, 43050, 3252]
9820a32517I0645J70194j11193b21621C06030G8174h3761c6164A24464Q8919b22339
9808a9530c055j89044p0084E0076c0642A21655h037A96387a36445B39559a44513
9796a50335e210C64277a16911k4634A41040N6843b5575k77019a11334r4593B66374
9784D14160F5629b66527A66552G135J5550a78639j19750a17691k15718C24046
9773A30119d7320k90333A96980b21818n6577B25590b7907j33582G5826l0956d05765
9761f0570j0276A14878R715k3098b95715A5930K1817a50857C7066A5727K64086
9750B79813C6006J3692b4823j4646b077m7324j55520A74470b09100N2008A26987
9738a61376o3964J07878d7240j61895K1307q9498B07654g7812F5567n091B3984
$$ y = [-132517, 90645, 260839, 149646, -221621, 306030, 78174, -83761, -36164, 124464, 213383, -222339, -19530, -3055, -192099, -262183, 50076, -30642, 121655, -8037, 196387, -136445, 239559, -144513, -150335, -5210, 364277, -116911, -141545, 141040, 197883, -25575, -302594, -111334, -205927, 266374, 414160, 65629, -266527, 166552, 7135, 22685, -178639, -298389, -117691, -333409, 324046, 130119, -47320, -337653, 196980, -221818, -278395, 225590, -27907, -161489, 75826, 44870, -405765, -60570, -70846, 114878, 124593, 101495, -295715, 15930, 37747, -150857, 37066, 15727, 279813, 36006, 49698, -24823, -39469, -2077, -49401, -204921, 174470, -209100, -157092, 126987, -161376, -225340, -117462, -47240, -209135, -187828, -277326, 207654, -77812, 65567, 60476, 23984]
9726G865K70429b14904C3266c93073a68797J7218c1498B8087c4312j37284c2129
9714b35450e9546H1008J77465b93853a06762G3545B6010J38713e6026b5035k34467
9703b59502h2150n7333a0988q6151B3892a53702f2938k00434A38086Q2917a26314
9691b6153p2756k18762H2295J90436d49754D6249h6000n7283O4125K7025p295
9680e9428j02480e984j20371G4085k5192K3530e8190j85363o7934a47075A11593
9668b3709l8729m1196M2126j27949N0716C5322i5640k3394o2040C84673D3983
9656H121K6087c21457A9894A817b20481L9635A29982a4470l82542D2890J78256
9645B21146f595A4610g8234k0896d955k2008M311j18367f079j39924e4529k19439
$$ y = [7865, 278294, -214904, 33266, -393073, -168797, -151579, -31498, 28087, -34312, -171596, -32129, -235450, -59546, 81008, 258473, -293853, -106762, 73545, 26010, 164723, -56026, -25035, -259502, -82150, -139483, -10988, -97139, 23892, -153702, -62938, -263372, 138086, 221003, -126314, -26153, -98909, -317671, 82295, 272731, -449754, 46249, -86000, -143283, -79158, -52133, -59428, -161908, -5984, -126355, 74085, 48893, 72423, -58190, -243553, -311487, -147075, 111593, -23709, -62438, -103634, -61508, -189457, -138741, 35322, -95640, -119034, -181074, 384673, 43983, 8121, 34208, -321457, 19894, 1817, -220481, -180846, 129982, -14470, -397012, 42890, 221146, -6595, 14610, -78234, -99130, -4955, -26963, -22652, -141019, -6079, -146003, -54529, -273968]
9633b73968g2005c4435A01952B2266O0958k974k9136N394a16074o1666A45293
9621b26461J00342A87076n8336g8547l52778j9530f9875n4015a7302j57002O9626
9610a04678M7249k36394A00577a68059O602k62258A91983J32227E7343f786k27189
9599b33975o8120O7697D9632L5544l3716c06989G8512f5252q2966A1613a53565
9587A70450c0748I1547f8716K572A70763a90130H2417B386b181p2422A43243N271
9575A48514a12257M4537k56290H3306N3735a3633j11018A7248O2903d2376j99817
9564b42193G4662a03215j38101C07967g0327j3215B9204I600d2626k33908j43300
9553d19834a84538J8553e6422p5341k01616A87566a89566b5002g426q9080A1150
$$ y = [-273968, -72005, -34435, 101952, 22266, 83224, 80250, 51114, 56508, -116074, -177740, 145293, -226461, -126119, 187076, 128740, -78547, -431325, -450855, -69875, -123890, -17302, -174304, -104678, -57429, -293823, 100577, -168059, -161457, -423715, 191983, 324210, 57343, -6786, -233975, -302095, -234398, 49632, 85176, 51460, -306989, 78512, -65252, -148218, 11613, -153565, 170450, -30748, 91547, -68716, -66144, 170763, -190130, 82417, 2386, -2181, -74603, 143243, 148514, -112257, -67720, -324010, 83306, 137041, -13633, -124651, 17248, 80151, -42376, -242193, 74662, -103215, -241316, 307967, -70327, -83542, 29204, 9600, -42626, -276534, -419834, -184538, -165985, -56422, -131763, -333379, 187566, -189566, -25002, -7426, -96506, 11150]
9541a64126c6611B16013C4586b84097G4007a3695r0883m2883j321b1596C49641
9529a1260k69045A4069a31261I4133d7070I3574C2209K03233a00056j31166l631
9518b34853A82616a19658c6187A96010i608B46116c12617H8156h9597M1135l09329
9507c57791J27975D8712a05913q8660R7264G6914C3553b39712k8533D4520g5907
9495b85745a27225q0615d9523A42273A8656b10339C9122a37990k52436a46901
9484F2316J0919O886A0992d23597e6226P64A0592J37373C1356J46772c73015A91505
9471a26864l8023j05032L0270K4356Q6747i937m11182J85816A2551d383p6157
9460h0540L2884k79280e7103B5609b45729b5299N910m5366j50976n9789h2726
$$ y = [-164126, -36611, 216013, 34586, -284097, 74007, -13695, -104578, -147461, -148782, -21596, 349641, -11260, -280305, 14069, -131261, 94133, -47070, 93574, 32209, 235442, -100056, -231222, -234853, 182616, -119658, -36187, 196010, -9608, 246116, -312617, 88156, -89597, -48462, -357791, -229816, 48712, -105913, -194573, -97309, 76914, 33553, -239712, -268245, 44520, -75907, -285745, -127225, -207840, -49523, 142273, 18656, -210339, 39122, -137990, -390426, -146901, 62316, 73235, 80121, 10992, -423597, -56226, -55462, 10592, 147965, 31356, 178128, -373015, 191505, -126864, -164887, -269919, -239649, -215293, -128546, -9937, -421119, -235303, 12551, -4383, -80540, -47656, -326936, -57103, 25609, -245729, -25299, -19389, -64755, -215731, -275520, -82726]
9448a91869A96224E2790h0152j45590a11491p0179E4482d4432n9884K6050c8376
9436h0951B10770b69713G6085O9683c69136a44040j4572c2701L862E9212a56058
9424d3412L619k57452a46888L0099n41496c0765m31166A7995b91644G2744a59706
9412i4953K0934A41700J45123p1542E7526p155J68866h3111H6956f0516j66731
9401b27247A06596d11040A38742a24204A70219b04996a136o2797j20014j97464
9391c81411j01805c073o2846B89533c63030J4283k8261Q3013B7999J30752G57
9379b16521i0193k42870F259b33218C1565R2952L4316J31933g6722q6516B36634
9367e21884i3601I3539e76034K33561a5176D9623d549G2009N9930a45268F4531
$$ y = [-191869, 196224, 52790, -80152, -225742, -111491, -181670, 54482, -44432, -104316, -78266, -38376, -80951, 210770, -269713, 76085, 145768, -369136, -144040, -158612, -32701, -28839, 59212, -156058, -43412, -39793, -297245, -146888, -116789, -658285, -30765, -461931, 17995, -291644, 72744, -159706, -94953, -74019, 141700, 286823, 215281, 57526, 50371, 219237, -83111, 86956, -60516, -227247, 106596, -411040, 138742, -124204, 170219, -204996, -1136, -63933, -183947, -381411, -483216, -3073, -65919, 289533, -363030, -348747, -377008, -293995, 27999, 158751, 757, -216521, -90193, -333063, 6259, -233218, 31565, 124517, 158833, 290766, -76722, -163238, 236634, -521884, -93601, 93539, -576034, -342473, -15176, 49623, -4549, 72009, 131939, -145268, 64531]
9355C35369A08722f3324B9219a01632H1978b16614k02240j04230b56573h9912
9344d6338j00172B95899a62304A6736a66235b6832o5882M855j52082C0529a5864
9332A367J87547d0393l3982j33699I2299c20591B80799c16886N1326c3174j25647
9321a58821d6279G5548b3380j13858j0044A11798a01036A05147a64998k11450
9311c76448g4862E171c42703a51996j16449g6128r1137k32899F9332Q1827g8875
9299a1829E0940a22665o7726A36595k3046I899J44603l7869b02161h2271B37712
9287a38460A55453h638j7372k15839B1987a98678A05753i6194B39688a20703R612
9276a11091A65028b29950J0176a3986n9825j59365a06918A03683h8833K909A6758
$$ y = [335369, 108722, -63324, 29219, -101632, 81978, -216614, -418854, -523084, -256573, -89912, -46338, -146510, 295899, -162304, 16736, -166235, -26832, -92714, -87859, -239941, 30529, -15864, 1367, 188914, -40393, -74375, -208074, 92299, -320591, 280799, -316886, -265560, -33174, -158821, -46279, 75548, -23380, -137238, -147282, 111798, -101036, 105147, -164998, -376448, -74862, 5171, -342703, -151996, -268445, -76128, -167265, -400164, 69332, 151159, -78875, -11829, 50940, -122665, -190391, 136595, 113549, 9899, 154502, 116633, -202161, -82271, 237712, -138460, 155453, -8638, -26010, -241849, 21987, -198678, 105753, -96194, 239688, -120703, -111091, 165028, -229950, -219774, -13986, -73811, -233176, -106918, 103683, -88833, -85924, 16758]
9264I3053K40680c25654J25449K1340d4784q3582A10136B4381b79360Q5843A0559
9252b90271C73111i7945M6964H7604J27192a42310A05738b99803A46545b92304
9241a73086K9762j17505a17085j72143a41529L4025j47823L8942g3207A25238
9230H9729a53389c1435A81254G4204b66970E7736k4015d6646D1712f7602J8124
9219d9478k00242A7624h6256a1011k15767g3594G5572a66777j35649J45405A78160
9207A62566a8388l8470b6426l27958c2169C8120f9138B07594j175H4908O7866
9196A52774j9983D1837J40071a34935A03089J30936b09646J3618D32215e4310
9185E6970b57754c4504k8516b336m0590A77718K7811b90225l2025f2880A94426
$$ y = [93053, 333733, -325654, -200205, -178865, -44784, -128366, 110136, 24381, -279360, -193517, 10559, -290271, 373111, -97945, -50981, 87604, 214796, -142310, 105738, -299803, 146545, -292304, -173086, -143324, -260829, -117085, -289228, -141529, -107504, -255327, -216385, -73207, 125238, 89729, -153389, -31435, 181254, 74204, -266970, 57736, 33721, -46646, 41712, -67602, -49478, -249720, 17624, -86256, -11011, -226778, -73594, 75572, -166777, -302426, -157021, 178160, 162566, -18388, -56858, -26426, -354384, -32169, 38120, -69138, 207594, 206419, 84908, 152774, 132791, 41837, 181908, -134935, 103089, 234025, -209646, -196028, 432215, -54310, 56970, -257754, -34504, -63020, -2336, -42926, 177718, 205529, -290225, -322250, -62880, 194426]
9173a82418p3954r2265J57994m517c4846k07168B22101r2588a91496B6790a53591
9161h0906A20359D4163J83156a10132B80901Q6793A70560a56003q2769k7443j46570
9150d12785f9790k89221A36649a16880I890g2494k6869j1625F9947a00923i499
9138I8826M2828c1847k08138a08755B92805a59018N7839k2640H6481e7682A1799
9126B55868B5025g3222E469a30270a8913k77526R1997k60122a37530b1307l0214
9115e1521l86416A16378b5358j7307n8092B91818b34268A32858a4992k0820a0498
9103A21566j73b05457j48483c5627A87584b3101B74921a08406A0137h172G5229
9091F481g0842j26691A49441a18775B78687c80285J27384P4000P3679E5050a83932
$$ y = [-182418, -256372, -348637, -190643, -195160, -34846, -242014, 222101, 129513, -191496, 26790, -153591, -80906, 120359, 44163, 227319, -110132, 280901, 367694, 170560, -156003, -238772, -266215, -412785, -69790, -359011, 136649, -116880, 9890, -72494, -99363, -110988, 69947, -100923, -9499, 98826, 141654, -31847, -239985, -108755, 292805, -159018, -101179, -123819, 86481, -57682, 11799, 255868, 25025, -73222, 5469, -130270, -18913, -296439, -204442, -464564, -137530, -21307, -51521, -437937, 116378, -25358, -42665, -100757, 291818, -234268, 132858, -14992, -35812, -10498, 121566, 121393, -205457, -353940, -35627, 187584, -23101, 274921, -108406, 10137, -8172, 75229, 6481, -70842, -197533, 149441, -118775, 278687, -380285, -252901, -178901, -105222, 55050, -183932]
9079b71527m3417A88786H702b91297A59149J08254a73483j62334a25726q2587
9069b08313k1668n1446A40936R6254m1672p5301a0200A50334a20689F0756K2967
9058H3723a82845J4616A7915J50341b8378A37808d18905a18420j13733b5518j71279
9047a96797n1937B7479a16192A06599a54362A9243a01118B59914N9347a33994
9036i8077A95219g1364H8377b40902D659b3190m5141C12106A5009K47641A07388
9024I2961L377a01746A77307C8583p700d18641C3129h3622m99555g8838m30902
9013e09740a69903Q2539A54748c65123a12616I2621b13475b6837k04411d9088
9002b48636a06879M7810A33712J96095a26022f476j14822C2304a06046j13831
$$ y = [-271527, -314944, 188786, 8702, -291297, 159149, 267403, -173483, -335817, -125726, -208313, -229981, -281427, 140936, 237190, 195518, 120217, -10200, 150334, -120689, 60756, 83723, -182845, -168229, 17915, 168256, -28378, 137808, -418905, -118420, -232153, -25518, -196797, -248734, 27479, -116192, 106599, -154362, 19243, -101118, 259914, 319261, -133994, -98077, 195219, -71364, 88377, -240902, 4659, -23190, -68331, 312106, 15009, 262650, 107388, 92961, 96338, -101746, 177307, 38583, 30883, -418641, 33129, -83622, -583177, -78838, -509740, -169903, -87364, 154748, -365123, -112616, 92621, -213475, -26837, -231248, -49088, -248636, -106879, -59069, 133712, 329807, -126022, -6476, -121298, 32304, -106046, -219877]
8992b19877b8941j1843k25674j3963O5718I0552i2034F2224k6580b8892I2745
8980c65430a29169k58853J39316R392l2404G0214i8396A07824k1485M7132E3782
8968a99201o3518d171E4579c41148i8101k0618B632O5996R0609l0434b1926l08811
8956c30737B15185g2862B25328c17926J25229f1915C1418A4474a87228k6353B4586
8944a05374J8568H7050c3454l50430A00391d87956G8988e5037H5325K73693N6015
8933D15033A9362P6800a18793A20998d9541H7238c20260C90462H6423P66551J683841
8922B536815N297354N729411B703198A004001l90751m6168B55012i2065b0854
8912E282a56949C041O0860P582N01829A37866a31279N9005j5805A70203B7004
$$ y = [-219877, -28941, -40784, -266458, -280421, -214703, 90552, -92034, 62224, 35644, -28892, 92745, -365430, -129169, -388022, -248706, -239314, -271718, 70214, -98396, 107824, 86339, 133471, 53782, -199201, -262719, -4171, 54579, -341148, -98101, -118719, 2632, 68628, 159237, 128803, -21926, -330737, 215185, -72862, 225328, -317926, -192697, -61915, 31418, 14474, -187228, -213581, 24586, -105374, -86806, 87050, -33454, -383884, 100391, -487956, 78988, -55037, 85325, 359018, 415033, 19362, 96162, -118793, 120998, -49541, 87238, -320260, 390462, 86423, 852974, 2536815, 7834169, 13563580, 2703198, 1004001, 613250, 567082, 255012, -92065, -20854, 5282, -156949, 3041, 63901, 71483, 573312, 137866, -131279, -72274, -88079, 170203, 27004]
8900F9782Q5260d5846j35868A29279M0327a2805H2317b43969A03259J5932a06766
8888b61387a12250B7075a76460j28324A98178d50304J77022D2821b6583O45B8338
8876H5464c01350O8428N5579A5475J52585a23219a5589j72036Q0199j51649A22063
8864b71623G0421J71685D473Q3770Q7439C1441b06477j63312a21938A9791K32887
8853B52678h4399k6611A4821d1579A24748b5692A8883J71607a22117A88938a334
8841B6503a27810j7731a9478Q538j01820B90803I7118i2754A03069b10049J0944
$$ y = [69782, 155042, -45846, -181714, 129279, 169606, -12805, 82317, -243969, 103259, 119191, -106766, -261387, -112250, 27075, -176460, -304784, 198178, -450304, -273282, 42821, -26583, -25938, 28338, 85464, -301350, -232922, -177343, 15475, 168060, -123219, -15589, -187625, -107426, -259075, 122063, -271623, 70421, 242106, 4473, 88243, 175682, 31441, -206477, -369789, -121938, 19791, 252678, -84399, -111010, 14821, -41579, 124748, -25692, 18883, 190490, -122117, 188938, -1334, 26503, -127810, -145541, -19478, -10940, -112760, 290803, 97118, -92754, 103069, -210049, -199105]
$$ [...]
##END NTUPLES=NMR SPECTRUM
##END=
