##TITLE=AC1595_CASAH13325_8314296_jPeCuXUwKw
##JCAMPDX= 6.0         $$ Bruker NMR JCAMP-DX V2.0
##DATA TYPE= NMR SPECTRUM
##DATA CLASS= NTUPLES
##ORIGIN= BRUKER
##OWNER= Administrator
$$ 1.72 TOPSPIN		Version 2.1
$$ 2013-11-09 13:14:00.365 -0800  Administrator@X
$$ Compression mode = diff/dup
##.OBSERVE FREQUENCY= 400.02188249412
##.OBSERVE NUCLEUS= ^1H
##.ACQUISITION MODE= SIMULTANEOUS (DQD)
##.ACQUISITION SCHEME= undefined
##.AVERAGES= 64
##.DIGITISER RES= 22
##SPECTROMETER/DATA SYSTEM= spect
##.PULSE SEQUENCE= noesygpps1d.comp
##.SOLVENT NAME= COFFEE_meoh
##.SHIFT REFERENCE= INTERNAL, COFFEE_meoh, 1, 14.96083
##AUDIT TRAIL= $$ (NUMBER, WHEN, WHO, WHERE, PROCESS, VERSION, WHAT)
$$ ##TITLE= Audit trail, TOPSPIN		Version 2.1
$$ ##JCAMPDX= 5.01
$$ ##ORIGIN= Bruker BioSpin GmbH
$$ ##OWNER= Administrator
$$ $$ E:\/data/COFFEE/nmr/AC1595_CASAH13325_8314296_jPeCuXUwKw/12/pdata/1/auditp.txt
$$ ##AUDIT TRAIL=  $$ (NUMBER, WHEN, WHO, WHERE, PROCESS, VERSION, WHAT)
(   1,<2013-11-09 13:13:55.577 -0800>,<Administrator>,<X>,<go>,<TOPSPIN 2.1>,
      <created by zg
	started at 2013-11-09 13:02:22.454 -0800,
	POWCHK enabled, PULCHK disabled,
       configuration hash MD5:
       C8 4E 4E 5D D3 5C D8 9E 9F 52 82 E0 59 8A DE 15
       data hash MD5: 64K
       8D 6C 36 09 33 2D C8 57 AA 41 1E 8D 2D 22 59 6C>)
(   2,<2013-11-09 13:13:58.429 -0800>,<Administrator>,<X>,<proc1d>,<TOPSPIN 2.1>,
      <Start of raw data processing
       efp LB = 0.3 FT_mod = 6 PKNL = 1 PHC0 = 0 PHC1 = 0 SI = 128K 
       data hash MD5: 128K
       96 B3 F9 E6 A7 B0 07 79 1D 96 37 F1 10 E4 0D 5C>)
(   3,<2013-11-09 13:13:59.367 -0800>,<Administrator>,<X>,<proc1d>,<TOPSPIN 2.1>,
      <pk PHC0 = -86.94031 PHC1 = 0 
       data hash MD5: 128K
       84 26 FC D3 62 63 94 FB 87 2D C8 78 F2 A2 BB 7A>)
(   4,<2013-11-09 13:13:59.819 -0800>,<Administrator>,<X>,<proc1d>,<TOPSPIN 2.1>,
      <abs ABSG = 1 
       data hash MD5: 128K
       8B 3A C9 F4 99 B4 18 0C 02 A7 17 0C 4B DF BA C3>)
(   5,<2013-11-09 13:13:59.912 -0800>,<Administrator>,<X>,<proc1d>,<TOPSPIN 2.1>,
      <abs ABSG = 2 
       data hash MD5: 128K
       31 D5 8A 4A 83 40 AB B0 89 68 44 F8 86 B4 21 51>)
(   6,<2013-11-09 13:13:59.979 -0800>,<Administrator>,<X>,<proc1d>,<TOPSPIN 2.1>,
      <abs ABSG = 3 
       data hash MD5: 128K
       85 A8 F3 AC 7E B6 FE E7 68 AD 09 12 E9 15 3D 2F>)
(   7,<2013-11-09 13:14:00.072 -0800>,<Administrator>,<X>,<proc1d>,<TOPSPIN 2.1>,
      <abs ABSG = 4 
       data hash MD5: 128K
       2A C2 AC EE 15 EE 90 3B 92 A3 6C 8C 03 96 0C 0B>)
(   8,<2013-11-09 13:14:00.152 -0800>,<Administrator>,<X>,<proc1d>,<TOPSPIN 2.1>,
      <abs ABSG = 5 
       data hash MD5: 128K
       4A 61 B6 97 35 56 2E 03 4E 86 15 62 2A C1 25 5A>)
$$ ##END=
$$ 
$$ $$ hash MD5
$$ $$ 00 E4 20 00 39 3D 7E 54 2C B6 F7 98 B0 20 39 5E
##$RELAX= 
##$RELAX= 
##$RELAX= 
##$RELAX= 
##$RELAX= 
##$RELAX= 
##$RELAX= 
##$RELAX= 
$$ Bruker specific parameters
$$ --------------------------
##$DU= <E:\>
##$EXPNO= 12
$$ [...]
##$TP07= 0
##$TPNAME0= <>
##$TPNAME1= <>
##$TPNAME2= <>
##$TPNAME3= <>
##$TPNAME4= <>
##$TPNAME5= <>
##$TPNAME6= <>
##$TPNAME7= <>
##$TPOAL= (0..7)
0.5 0.5 0.5 0.5 0.5 0.5 0.5 0.5
##$TPOFFS= (0..7)
0 0 0 0 0 0 0 0
##$TUNHIN= 0
##$TUNHOUT= 0
##$TUNXOUT= 0
##$USERA1= <user>
##$USERA2= <user>
##$USERA3= <user>
##$USERA4= <user>
##$USERA5= <user>
##$V9= 5
##$VALIST= <valist>
##$VCLIST= <CCCCCCCCCCCCCCC>
##$VD= 0
##$VDLIST= <DDDDDDDDDDDDDDD>
##$VPLIST= <PPPPPPPPPPPPPPP>
##$VTLIST= <TTTTTTTTTTTTTTT>
##$WBST= 1024
##$WBSW= 4
##$XGAIN= (0..3)
0 0 0 0
##$XL= 0
##$YL= 0
##$YMAX_a= 5556675
##$YMIN_a= -11208267
##$ZGOPTNS= <>
##$ZL1= 120
##$ZL2= 120
##$ZL3= 120
##$ZL4= 120
##$ABSF1= 14.96083
##$ABSF2= -5.597352
##$ABSG= 5
##$ABSL= 3
##$ALPHA= 0
##$AQORDER= 0
##$ASSFAC= 0
##$ASSFACI= 0
##$ASSFACX= 0
##$ASSWID= 0
##$AUNMP= <proc_prof1d_extract.lims>
##$AXLEFT= 0
##$AXNAME= <>
##$AXNUC= <1H>
##$AXRIGHT= 0
##$AXTYPE= 0
##$AXUNIT= <>
##$AZFE= 0.1
##$AZFW= 0.1
##$BCFW= 0
##$BC_mod= 0
##$BYTORDP= 0
##$COROFFS= 0
##$CY= 15
##$DATMOD= 1
##$DC= 0
##$DFILT= <>
##$DTYPP= 0
##$F1P= 0
##$F2P= 0
##$FCOR= 0.5
##$FTSIZE= 131072
##$FT_mod= 6
##$GAMMA= 0
##$GB= 0
##$INTBC= 1
##$INTSCL= 1
##$ISEN= 128
##$LB= 0.3
##$LEV0= 0
##$LPBIN= 0
##$MAXI= 10000
##$MC2= 0
##$MEAN= 0
##$ME_mod= 0
##$MI= 0
##$NCOEF= 0
##$NC_proc= -2
##$NLEV= 6
##$NOISF1= 0
##$NOISF2= 0
##$NSP= 0
##$NTH_PI= 0
##$NZP= 0
##$OFFSET= 14.96083
##$PC= 1
##$PHC0= -86.94031
##$PHC1= 0
##$PH_mod= 1
##$PKNL= yes
##$PPARMOD= 0
##$PPDIAG= 0
##$PPIPTYP= 0
##$PPMPNUM= 2147483647
##$PPRESOL= 1
##$PSCAL= 4
##$PSIGN= 0
##$PYNMP= <proc.py>
##$REVERSE= no
##$SF= 400.020009704377
##$SI= 131072
##$SIGF1= 0
##$SIGF2= 0
##$SINO= 400
##$SIOLD= 131072
##$SPECTYP= <>
##$SREGLST= <1H.CDCl3>
##$SSB= 0
##$STSI= 131072
##$STSR= 0
##$SW_p= 8223.68421052631
##$SYMM= 0
##$S_DEV= 0
##$TDeff= 65536
##$TDoff= 0
##$TI= <>
##$TILT= no
##$TM1= 0
##$TM2= 0
##$TOPLEV= 0
##$USERP1= <user>
##$USERP2= <user>
##$USERP3= <user>
##$USERP4= <user>
##$USERP5= <user>
##$WDW= 1
##$XDIM= 131072
##$YMAX_p= 400050807
##$YMIN_p= -12814
##$CURPLOT= <Network HP LaserJet P1505>
##$CURPRIN= <$Network HP LaserJet P1505>
##$DFORMAT= <normdp>
##$LAYOUT= <+/1D_H.xwp>
##$LFORMAT= <normlp>
##$PFORMAT= <normpl>
##$SURQMSG= 1
$$ End of Bruker specific parameters
$$ ---------------------------------
##NTUPLES= NMR SPECTRUM
##VAR_NAME=  FREQUENCY,     SPECTRUM/REAL,   SPECTRUM/IMAG
##SYMBOL=    X,             R,               I
##VAR_TYPE=  INDEPENDENT,   DEPENDENT,       DEPENDENT
##VAR_FORM=  AFFN,          ASDF,            ASDF
##VAR_DIM=   131072,        131072,          131072
##UNITS=     HZ,            ARBITRARY UNITS, ARBITRARY UNITS
##FACTOR=    0.0627417313425164, 1,          1
##FIRST=     8223.62146879497, 1269,         -56149
##LAST=      0,             1919,            -56351
##MIN=       0,             -12814,          0
##MAX=       8223.62146879497, 400050807,    0
$$ Real data points
##PAGE= N=1
##DATA TABLE= (X++(R..R)), XYDATA
$$ [...]
61753D44868K357K007J553Q87R2n02o94p37j071j807k613l076l065k825k732k886
61737D29756k954k564j809j165r25r19q12m57R2O12P77L93j90k48N53J679K269
61720D24088K093J705J707K074K309K104J724J604J763J747J173J84p69j439j909
61705D40158k337k798l364m054m664m861m587m122l730l343k808k269k093k418
61691C92710k976l333l271k867k384k078k080k292k443k411k454k897l494l451
61677C54279k342q54k08p95j797k193j788j055m15J1J92J37k7j58k32k38j39k2
61659C42356l5o1K55Q89J219Q55K61J02K94L23K40N43J109J116K88m42n1J278
61641C50539K422K614K036J319R26R46J133J061M49n69j548k147k333k291k165
$$ y = [444868, 447225, 449232, 450785, 451672, 451764, 451262, 450568, 449831, 448760, 446953, 444340, 441264, 438199, 435374, 432642, 429756, 426802, 424238, 422429, 421264, 420339, 419420, 418608, 418151, 418243, 418855, 419632, 420025, 419835, 419587, 420140, 421819, 424088, 426181, 427886, 429593, 431667, 433976, 436080, 437804, 439408, 441171, 442918, 444091, 444275, 443506, 442067, 440158, 437821, 435023, 431659, 427605, 422941, 418080, 413493, 409371, 405641, 402298, 399490, 397221, 395128, 392710, 389734, 386401, 383130, 380263, 377879, 375801, 373721, 371429, 368986, 366575, 364121, 361224, 357730, 354279, 351937, 351083, 350875, 350080, 348283, 346090, 344302, 343247, 342832, 342843, 343035, 343172, 343145, 342987, 342755, 342517, 342378, 342356, 342321, 342260, 342515, 343404, 344623, 345478, 345739, 345841, 346135, 346458, 346698, 347241, 348350, 349466, 349754, 349312, 349261, 350539, 352961, 355575, 357611, 358930, 359856, 360802, 361935, 362996, 363445, 362876, 361328, 359181, 356848, 354557, 352392]
61626C52392j931j561j241j345k000k790l061k542j544o03j41l54j072j718j753
61611C28736j303j042j377k008k517k940l489l921l777l109k571k597k888k881
61597B92316k508k165k126k278k434k547k558k304j810j445j498j781j861j629
61583B63372j300r99o80m51n55r35j216j227j153j035o09J23O08M53l3l46n09
61566B53508o99n83K67J458J969J369K78l82j77Q52K265L213K915J503j5q09q54
61549B66078l92N96J917K713K200P42l80l80L12Q06P89N76M50M53P32J475K331
61532B81018K364J107n65j229n79L50O53N55N81M86k87j503k271k107j321m49
61516B76803J09P2n03r71p21jL61K1o30j178j468j256l19Q94J426Q90j29r03j321
$$ y = [352392, 350461, 348900, 347659, 346314, 344314, 341524, 338463, 335921, 334377, 333774, 333633, 333279, 332207, 330489, 328736, 327433, 326391, 325014, 323006, 320489, 317549, 314060, 310139, 306362, 303253, 300682, 298085, 295197, 292316, 289808, 287643, 285517, 283239, 280805, 278258, 275700, 273396, 271586, 270141, 268643, 266862, 265001, 263372, 262072, 261073, 260393, 259942, 259387, 258452, 257236, 256009, 254856, 253821, 253212, 253335, 253943, 254396, 254363, 254017, 253508, 252809, 252226, 252493, 253951, 255920, 257289, 257567, 257185, 257008, 257860, 260125, 263338, 266253, 267756, 267741, 266932, 266078, 265686, 266282, 268199, 270912, 273112, 273854, 273474, 273094, 273406, 274212, 275001, 275577, 276027, 276480, 277212, 278687, 281018, 283382, 284489, 283924, 282695, 282116, 282466, 283119, 283674, 284255, 284741, 284454, 282951, 280680, 278573, 277252, 276803, 276912, 276984, 276481, 275510, 274789, 274788, 275149, 275170, 274540, 273362, 271894, 270638, 270319, 271213, 272639, 273529, 273400, 272497, 271176]
61497B71176j583j669j408p05L84J453J680O45p90j130nJ419J942J517P34j2l87
61480B73261k7Q51J417J354J355J873K177J432J37m97k11K22K97K27K39J95K4
61463B84326j81m22o55m94K95J138J244P29N22J076J872K267K133J555N86m16
61447B95575p68k23O23R75O99L01K33N23R80J582K496L628M316L901K598J411
61431C18850R14O51R7l96k10M47Q48Q72R69J151Q70kq29j001n27K24Q40Q97L34
61412C24999k10p9M48N63J82l5qm40j481k209k000j468j385j478j120n07k38k18
61394C13316Q8N50M91j81p15n28J24O22O74M69M65R61J709K003J455M99j30j55
61376C21717K40Q65J562K036K148K169K266K049J142O0j86O15J564J736J121M10
$$ y = [271176, 269593, 267924, 266516, 265811, 266195, 267648, 269328, 269973, 269183, 268053, 268048, 269467, 271409, 272926, 273660, 273648, 273261, 273234, 274085, 275502, 276856, 278211, 280084, 282261, 283693, 283830, 283333, 283122, 283344, 283641, 283868, 284107, 284302, 284326, 284145, 283723, 283068, 282574, 282869, 284007, 285251, 285980, 286502, 287578, 289450, 291717, 293850, 295405, 295991, 295575, 294807, 294584, 295207, 296182, 296881, 297182, 297415, 297938, 298918, 300500, 302996, 306624, 310940, 314841, 317439, 318850, 319764, 320415, 320512, 320116, 319906, 320353, 321201, 322073, 323042, 324193, 325063, 325061, 324232, 323231, 322704, 322928, 323768, 324665, 324999, 324789, 324710, 325158, 325721, 325903, 325868, 325860, 325420, 323939, 321730, 319730, 318262, 316877, 315399, 314279, 313772, 313534, 313316, 313404, 313954, 314445, 314264, 313549, 313021, 313145, 313767, 314441, 314910, 315375, 316336, 318045, 320048, 321503, 322002, 321872, 321717, 321957, 322822, 324384, 326420, 328568, 330737, 333003, 335052, 336194, 336254, 336068, 336683, 338247, 339983, 341104, 341514]
61360C41514L07J121K588L962M590M513M216L973L786L849M409N158N400M986
61346C94372M505M366M245L768L132K708K477K297K357K778L107K765J920J424
61332D36221J870K912L553K977J260n90j500j383j131j390j788j658j022l21M06
61317D38416J360K197K262J705J584K563M142N548O827Q515J0587J2372J3463
61304E11541J4137J4759J5152J4753J3280J1092Q846O904M997K610l44l243n339
61291F09145o518p362q416r564j0266j0292r996r818r735r421q776p986p119o064
61277D87812m979m325m174l768k317k9K059L261L762L987L940L383K340J202N57
61262D92711R31K409M377N930O689O983P090O741N614L999K601J811J476J247
$$ y = [341514, 341821, 342942, 345530, 349492, 354082, 358595, 362811, 366784, 370570, 374419, 378828, 383986, 389386, 394372, 398877, 403243, 407488, 411256, 414388, 417096, 419573, 421870, 424227, 427005, 430112, 432877, 434797, 436221, 438091, 441003, 444556, 447533, 448793, 448203, 446703, 445320, 444189, 442799, 441011, 439353, 438331, 438010, 438416, 439776, 441973, 444235, 445940, 447524, 450087, 454229, 459777, 466604, 475119, 485706, 498078, 511541, 525678, 540437, 555589, 570342, 583622, 594714, 603560, 610464, 615461, 618071, 617727, 614484, 609145, 602627, 595265, 586849, 577285, 567019, 556727, 546731, 536913, 527178, 517757, 508981, 500995, 493876, 487812, 482833, 478508, 474334, 470566, 468249, 468220, 470279, 473540, 477302, 481289, 485229, 488612, 490952, 492154, 492711, 493642, 496051, 500428, 506358, 513047, 520030, 527120, 533861, 539475, 543474, 546075, 547886, 549362, 550609]
61248E50609R00M20n9l90o41j005j476j851k112k464k806k566j457l3R06J218
61232E37193J298J347J292J325J871K947M008M588M732M851N405O618Q123R028
61218E94626Q825Q146P994Q353Q283P503O874O987P098O196M479K940J988J339
61204F81631R77J244J931K224J925K002L450O046Q664J0499J1530J2062J2354
61191G56539J2626J2908J2742J1422Q792N575K782Q98k48r58j398j728k184k866
61177H14902l660m498n509o750p928q646q888q984r142r225r141r185r754j0796
61163G02796j1786j2232j2124j1778j1376j0808r960r023q317p903p459o629n369
61150E78032l977k822k010j283l21O56P60p10l289n659p024p670q025p819o649
$$ y = [550609, 551509, 551929, 551870, 551480, 550839, 549834, 548358, 546507, 544395, 541931, 539125, 536559, 535102, 535069, 535975, 537193, 538491, 539838, 541130, 542455, 544326, 547273, 551281, 555869, 560601, 565452, 570857, 577475, 585598, 594626, 603451, 611597, 619591, 627944, 636227, 643730, 650604, 657591, 664689, 670885, 675364, 678304, 680292, 681631, 682608, 683852, 685783, 688007, 689932, 691934, 695384, 701430, 710094, 720593, 732123, 744185, 756539, 769165, 782073, 794815, 806237, 815029, 820604, 823386, 824284, 824036, 823078, 821680, 819952, 817768, 814902, 811242, 806744, 801235, 794485, 786557, 777911, 769023, 760039, 750897, 741672, 732531, 723346, 713592, 702796, 691010, 678778, 666654, 654876, 643500, 632692, 622732, 613709, 605392, 597489, 590030, 583401, 578032, 574055, 571233, 569223, 567940, 567619, 568275, 569035, 568325, 565036, 559377, 552353, 544683, 536658, 528839, 522190]
61135E22190m922l464k450j407j86Q81J785L050M778O251O916P311Q438J0481
61121E59652J2635J4162J5186J6402J8230K0344K1958K2640K2788K3138K3909
61110G71044K4715K5268K5618K5563K4491K2255J9758J8019J6882J5271J2583
61099A001467R210N627J772k393o352r581j2289j4995j7629j9592k0747k1621
61087H92877k2557k3184k3107k2628k2319k2130k1493k0167j8466j6718j5007
61076F65101j3501j2391j1419r973p948n989m669l885l280k738k101r76O49K062
61062E88942K732L069L736M579N008N086N476O401P465Q449R543J0796J1967J2982
61048F86231J3992J5005J6027J7347J9094K0685K1528K2112K3494K5737K7814
$$ y = [522190, 517268, 513804, 511354, 509947, 509761, 510642, 512427, 515477, 520255, 526506, 533422, 540733, 549171, 559652, 572287, 586449, 601635, 618037, 636267, 656611, 678569, 701209, 723997, 747135, 771044, 795759, 821027, 846645, 872208, 896699, 918954, 938712, 956731, 973613, 988884, 1001467, 1010677, 1016304, 1018076, 1015683, 1009331, 999750, 987461, 972466, 954837, 935245, 914498, 892877, 870320, 847136, 824029, 801401, 779082, 756952, 735459, 715292, 696826, 680108, 665101, 651600, 639209, 627790, 617817, 609869, 603880, 599211, 595326, 592046, 589308, 587207, 586231, 586880, 588942, 591674, 594743, 598479, 603058, 608066, 613152, 618628, 625029, 632494, 640943, 650486, 661282, 673249, 686231, 700223, 715228, 731255, 748602, 767696, 788381, 809909, 832021, 855515, 881252, 909066]
61037I09066K9139L0115L1068L1716L2078L2881L4543L6582L8529M0611M2931
61026A289259M4831M5720M5893M5980M6175M6682M8252N1583N6617O2975P0606
61015A854573P9535Q9437R9932J11009J23061J37162J55593J81103K15350K59088
61005C305843L14196L84086M71551N78044P06342Q62247J052001J279033J542241
60996A0495584J828562K095643K261533K227999J937142J420675P97999K22993
60988B3288130j78069l40257k66490k6816K48693M03058L14748m4323n97124j203321
60978B1598229j722178k059481k184795k124433j938657j692741j435408j193834
60970G246702r80705q01180o54853n36895m41403l64163l02568k54380k17337
$$ y = [909066, 938205, 968320, 999388, 1031104, 1063182, 1096063, 1130606, 1167188, 1205717, 1246328, 1289259, 1334090, 1379810, 1425703, 1471683, 1517858, 1564540, 1612792, 1664375, 1720992, 1783967, 1854573, 1934108, 2023545, 2123477, 2234486, 2357547, 2494709, 2650302, 2831405, 3046755, 3305843, 3620039, 4004125, 4475676, 5053720, 5760062, 6622309, 7674310, 8953343, 10495584, 12324146, 14419789, 16681322, 18909321, 20846463, 22267138, 23065137, 23288130, 23110061, 22769804, 22503314, 22476498, 22725191, 23128249, 23442997, 23398674, 22801550, 21598229, 19876051, 17816570, 15631775, 13507342, 11568685, 9875944, 8440536, 7246702, 6265997, 5464817, 4809964, 4273069, 3831666, 3467503, 3164935, 2910555, 2693218]
60961B693218j89078j67017j48927j33702j20904j09680r8974q8627p9087p0172
60951A487050o1278n2801m6094m1886l9679l8793l8800l8868l8033l6439l5076
60940A019303l4092l2564l0267k8242k7107k6132k4670k3238k2399k1686k0566
60929G28340j9388j8516j7445j5750j4073j3084j2281j0863r135p960p331o627
60917E75887n930n915o571o997o498n201l628k264j460j127o97J67R95J162Q96
60902E32819R45J467J896J812J339O71j71j036j534j458j066q21r89j465j938
60887E30471k235k520l020l580l851l955m511n775p156p826p586o882o267o023
60873D59284o004n750m986m031l377k895k145j376j451k464l275k902j676n01
$$ y = [2693218, 2504140, 2337123, 2188196, 2054494, 1933590, 1823910, 1724936, 1636309, 1557222, 1487050, 1425772, 1372971, 1326877, 1284991, 1245312, 1206519, 1167719, 1128851, 1090818, 1054379, 1019303, 985211, 952647, 922380, 894138, 867031, 840899, 816229, 792991, 770592, 748906, 728340, 708952, 690436, 672991, 657241, 643168, 630084, 617803, 606940, 597805, 589845, 582514, 575887, 569957, 564042, 557471, 550474, 543976, 538775, 535147, 532883, 531423, 530296, 529599, 529766, 530761, 531923, 532819, 533764, 535231, 537127, 538939, 540278, 540949, 540778, 539742, 538208, 536750, 535684, 534863, 533874, 532409, 530471, 528236, 525716, 522696, 519116, 515265, 511310, 506799, 501024, 493868, 486042, 478456, 471574, 465307, 459284, 453280, 447530, 442544, 438513, 435136, 432241, 430096, 428720, 427269, 424805, 421530, 418628, 416952, 416451]
60859D16451L97J287K125K606K682K458J822Q30J00K83J302K522L373L487K575
60844D44300Q57p81j542j548j448j492j511j567j993k831l624l870l432k627k006
60829D14885j848j801j287l65K77K86L4j44m39r07j081p33m78r84k037k913l264
60812C97201l140k667k210k268k710k704k014j662k477l685l959l326k873k912
60798C58594k668j825j108j172j760k301k575k531k111j503j119j137j398j763
60784C33623k122k129j455l65M60P08O51N68M51K69J41J64L45P22J274J794K099
60767C37198K280K542K922L310L495L110J966P09M71J449K430K302J398P29M44
60752C66755Po28r62r30r15r47p15l68l50n27k89L55N75k37j816l556n067o136
$$ y = [416451, 416848, 418135, 420260, 422866, 425548, 428006, 429828, 430658, 430758, 431041, 432343, 434865, 438238, 441725, 444300, 445157, 444376, 442834, 441286, 439838, 438346, 436835, 435268, 433275, 430444, 426820, 422950, 419518, 416891, 414885, 413037, 411236, 409949, 409584, 409861, 410147, 410181, 410037, 409598, 408691, 407610, 406877, 406399, 405415, 403378, 400465, 397201, 394061, 391394, 389184, 386916, 384206, 381502, 379488, 377826, 375349, 371664, 367705, 364379, 361506, 358594, 355926, 354101, 352993, 351821, 350061, 347760, 345185, 342654, 340543, 339040, 337921, 336784, 335386, 333623, 331501, 329372, 327917, 327552, 328012, 328720, 329371, 329939, 330390, 330659, 330800, 330964, 331309, 332031, 333305, 335099, 337198, 339478, 342020, 344942, 348252, 351747, 354857, 356823, 357532, 358003, 359452, 361882, 364184, 365582, 366311, 366755, 366762, 366134, 365172, 364242, 363327, 362380, 361665, 361297, 360947, 360420, 360131, 360486, 361061, 360824, 359008, 355452, 350385, 344249]
60734C44249o648o672o299n422m048k612j586j006p50q90j285j327p45k46n13
60719C04200j067r97l99j06k69l57k80m74q89j027q72p69m74N16J782K300J954
60702C02772J581J474J082L61Q3N12R85J146J441K017K379K504L029L837L752
60687C28955K356R17P13J458K187K651K957K794K052J450J587J997J997J811J953
60672C57835K113J623N62m11j016j365j453j387j721k755l881m266l904l338k721
60657C33915j921j171q80r34q45m36J30P70J419J821J860J815J882J765J186M20
60641C40796j39n79j145j717k092k381k709k908k906k927k861k135p77R8l01j152
60625C14165j048J12J188J429J109O85K69j36n45j043j415j029K07J215R09k43
$$ y = [344249, 337601, 330929, 324630, 319208, 315160, 312548, 310962, 309956, 309206, 308316, 307031, 305704, 304959, 304713, 304200, 303133, 302136, 301737, 301631, 301362, 301005, 300725, 300251, 299362, 298335, 297463, 296694, 296220, 296736, 298518, 300818, 302772, 304353, 305827, 306909, 307270, 307353, 307865, 308850, 309996, 311437, 313454, 315833, 318337, 321366, 325203, 328955, 331311, 332228, 332941, 334399, 336586, 339237, 342194, 344988, 347040, 348490, 350077, 352074, 354071, 355882, 357835, 359948, 361571, 362133, 361722, 360706, 359341, 357888, 356501, 354780, 352025, 348144, 343878, 339974, 336636, 333915, 331994, 330823, 329943, 329009, 328164, 327728, 327858, 328628, 330047, 331868, 333728, 335543, 337425, 339190, 340376, 340796, 340657, 340078, 338933, 337216, 335124, 332743, 330034, 327126, 324220, 321293, 318432, 316297, 315520, 315618, 315317, 314165, 313117, 313229, 314417, 315846, 316955, 317640, 317909, 317773, 317228, 316185, 314770, 313741, 313948, 315163, 316072, 315829]
60609C15829q25m22K4k03o60n98R1J045J885K317K276K081J979J674R27L63Q08
60592C28591J864K236J595J050J433K156K309J967J657J241L07q47j475j467j347
60577C41270j231n70R00K528L449L574L631M363N921P852R529J0601J1220J1889
60563D14926J2873J3739J3645J2217R949P521M943J737k047n507p748q638q509
60550D59101p586o045m296k713j184O13K606M328N521O418P455Q895J0728J2741
60536D96582J4693J6502J8202J9660K0581K0856K0573J9530J7098J2933P627K256
60524F87093k544o725j0189j2497j3315j2910j2091j1564j1364j0869r625p917
60512E65483o310m787k966j083O8M20R78K424M239N845P853J1217J5670K0098
$$ y = [315829, 315004, 314582, 314606, 314403, 313743, 313145, 313236, 314281, 316166, 318483, 320759, 322840, 324819, 326493, 327420, 327783, 328591, 330455, 332691, 334286, 335336, 336769, 338925, 341234, 343201, 344858, 346099, 346406, 345559, 344084, 342617, 341270, 340039, 339469, 340369, 342897, 346346, 349920, 353551, 357914, 363835, 371687, 381216, 391817, 403037, 414926, 427799, 441538, 455183, 467400, 477349, 484870, 489813, 491550, 489503, 483996, 476248, 467610, 459101, 451515, 445470, 441174, 438461, 437277, 437890, 440496, 444824, 450345, 456763, 464218, 473113, 483841, 496582, 511275, 527777, 545979, 565639, 586220, 607076, 627649, 647179, 664277, 677210, 684837, 687093, 684549, 677824, 667635, 655138, 641823, 628913, 616822, 605258, 593894, 583025, 573400, 565483, 559173, 554386, 551420, 550337, 550405, 550825, 551803, 554227, 558466, 564311, 572164, 583381, 599051, 619149]
60498F19149K4188K8612L3607L8373M2075M4632M6286M7016M6618M4837M1345
60487A056738L6158L0151K4547J9659J4620Q511J301o429j4149k1567k8705l5912
60475A084923m3289m9904n4170n5338n4184n1884m8790m4723l9906l4978l0296
60464E77461k5914k2139j9449j7718j6076j3824j1227r041p583o561n773n440
60452D16716n672n973n652m643l562k985l013l431l896l941l233j995q46j56R6
60437C67814j44j004k056k378j689q56p48j129j280j211j463j980k078j479o63
60422C47656r2K68N74P51P27O08N18M87N30N81M81K18Q1K43M48M42M48P13R33
60403C56615P03L94Q26K057L118L154K274J248P05P95J220J437J165O59L43L51
$$ y = [619149, 643337, 671949, 705556, 743929, 786004, 830636, 876922, 923938, 970556, 1015393, 1056738, 1092896, 1123047, 1147594, 1167253, 1181873, 1190384, 1191685, 1185256, 1171107, 1149540, 1120835, 1084923, 1041634, 991730, 937560, 882222, 828038, 776154, 727364, 682641, 642735, 607757, 577461, 551547, 529408, 509959, 492241, 476165, 462341, 451114, 442073, 434490, 427929, 422156, 416716, 411044, 405071, 399419, 394776, 391214, 388229, 385216, 381785, 377889, 373948, 370715, 368720, 367874, 367718, 367814, 367670, 366666, 364610, 362232, 360543, 359687, 358939, 357810, 356530, 355319, 353856, 351876, 349798, 348319, 347656, 347564, 347832, 348406, 349157, 349884, 350492, 351010, 351497, 352027, 352608, 353089, 353307, 353388, 353631, 354079, 354521, 354969, 355682, 356615, 357318, 357712, 358538, 360595, 363713, 366867, 369141, 370389, 371094, 371889, 373109, 374546, 375711, 376370, 376713, 377064]
60387C77064O33J232K033K549K463K135K010J829J154L45K03P85J433J877K378
60372D00123K765K410J459J016J684K677K962K531J952J322M75k20m6J052K224
60357D24386K599K209J920K519L837M906N071M748M793N409O137O646O870O545
60343D88595N336L463J503m74k756m915n838n163l922l278l320l521l666l712
60329D58332l358k477j638j551k169k848l220l402l522l414k785j553o8R63J107
60314D28397P41O95J296K242L386M927O771Q366R572J0962J2939J5057J6710J7818
60300E39879J8311J7536J4824J0435N314K46m394q429j1888j4938j7355j8432
60288E31109j7793j5898j3382j0435p356n088m318m439m222l367k570k254k110
$$ y = [377064, 377697, 378929, 380962, 383511, 385974, 388109, 390119, 391948, 393102, 393447, 393650, 394435, 395868, 397745, 400123, 402888, 405298, 406757, 407773, 409457, 412134, 415096, 417627, 419579, 420901, 421376, 421156, 421110, 422162, 424386, 426985, 429194, 431114, 433633, 437470, 442376, 447447, 452195, 456988, 462397, 468534, 475180, 482050, 488595, 493931, 497394, 498897, 498423, 495667, 490752, 484914, 479751, 475829, 472551, 469231, 465710, 462044, 458332, 454974, 452497, 450859, 449308, 447139, 444291, 441071, 437669, 434147, 430733, 427948, 426395, 426327, 427290, 428397, 429138, 429833, 431129, 433371, 436757, 441684, 448455, 456821, 466393, 477355, 490294, 505351, 522061, 539879, 558190, 575726, 590550, 600985, 606299, 606545, 602151, 593722, 581834, 566896, 549541, 531109, 513316, 497418, 484036, 473601, 466245, 461157, 456839, 452400, 448178, 444811, 442241, 439987, 437877]
60275D37877j940k085k784l654m117l931l205k244j491j347j791k389k713k637
60261D01549k267j828j553j484j464j425j498j660j581j081n21l07k83K1P03J407
60245C86728J802J727J135L05p8L79J102J169N13l5M3L53L41J00J13O00J428K356
60227D00081L103L378L131K635K205J914J729J735K010K410K686K822L066L614
60213D36519M337M921N187N216N097M793M314L974M203N064O116O771O726O118
60199E09356N463N323N769O169N792M597L187K029J124M24Qk60p81j731k807l676
60183E39986m230m319l790l008k805l509m507n120n414n659n513m479k864j605
60169D83164j258j645k308k819k823k327j796j550j277p14l81r04j758j658k92
$$ y = [437877, 435937, 433852, 431068, 427414, 423297, 419366, 416161, 413917, 412426, 411079, 409288, 406899, 404186, 401549, 399282, 397454, 395901, 394417, 392953, 391528, 390030, 388370, 386789, 385708, 385187, 384880, 384597, 384618, 385321, 386728, 388530, 390257, 391392, 391697, 391619, 391998, 393100, 394269, 394782, 394747, 394790, 395143, 395484, 395584, 395697, 396297, 397725, 400081, 403184, 406562, 409693, 412328, 414533, 416447, 418176, 419911, 421921, 424331, 427017, 429839, 432905, 436519, 440856, 445777, 450964, 456180, 461277, 466070, 470384, 474358, 478561, 483625, 489741, 496512, 503238, 509356, 514819, 520142, 525911, 532080, 537872, 542469, 545656, 547685, 548809, 549233, 549241, 548981, 548200, 546469, 543662, 539986, 535756, 531437, 527647, 524639, 521834, 518325, 513818, 508698, 503284, 497625, 492112, 487633, 484769, 483164, 481906, 480261, 477953, 475134, 472311, 469984, 468188, 466638, 465361, 464647, 464266, 463362, 461604, 459946, 459654]
60154D59654J161J590J250J073J332J570J530J444J492J482J197P63M97N46Q56
60139D77437J372K083K785L080K871K707L294M597N777O077N486M470L455K800
60125E28291K745L069L126K548J704J176J145J525K236K989L285L144L304M116
60111E64403M705M010K316R18M47M30L26O7m93j703l383m731n268n274n044m425
60095E47301l395k487k143k158k115j884j382l50J073K001J679N01l64k90K83
60080E36270N49J95m66r35j028j036j341j919k381k618l109m303n885o935o835
60065D98223n822m715m187m286m570m664m642m756m909m716m129l640l627l790
60051D35770l500k572j429n18J35P65J494K250K907L434L922M554N462O497P159
$$ y = [459654, 460815, 462405, 463655, 464728, 466060, 467630, 469160, 470604, 472096, 473578, 474775, 475538, 476035, 476581, 477437, 478809, 480892, 483677, 486757, 489628, 492335, 495629, 500226, 506003, 512080, 517566, 522036, 525491, 528291, 531036, 534105, 537231, 539779, 541483, 542659, 543804, 545329, 547565, 550554, 553839, 556983, 560287, 564403, 569108, 573118, 575434, 576352, 576799, 577229, 577555, 577622, 577129, 575426, 572043, 567312, 562044, 556770, 551726, 547301, 543906, 541419, 539276, 537118, 535003, 533119, 531737, 531387, 532460, 534461, 536140, 536641, 536277, 535987, 536270, 536819, 537014, 536548, 535613, 534585, 533549, 532208, 530289, 527908, 525290, 522181, 517878, 511993, 505058, 498223, 492401, 487686, 483499, 479213, 474643, 469979, 465337, 460581, 455672, 450956, 446827, 443187, 439560, 435770, 432270, 429698, 428269, 427751, 427886, 428651, 430145, 432395, 435302, 438736, 442658, 447212, 452674, 459171, 466330]
60036D66330O968O016M946M174L345J898P4j208j489j290j276j464j672k161l249
60021D79942m563n418n815o337p124p664p679p515p417o993n891m541l773l842
60007C95370m182m022l090j802q95p49r69q89m63k95o64r05j65J431K796L060
59991C83567K442J863J859K124K113J937K295L366M190L616J797K00n8N55P34
59976D12600l6j107j750k054k557l317l756l455k735k228k064j873j529j385j471
59961C81283j035N20K454L205K188N19l08J2O30P59L82o0k15l9K88N98R81J677
59943C93839K627L231K904J782O62J18p7m91j181j613j417q52m15j76J75Q41J704
59926D01661K559L249L598L581L560L989M835N638O240O917P616P583O190L804
$$ y = [466330, 473298, 479314, 484260, 488434, 491779, 493677, 493751, 492543, 491054, 489764, 488488, 487024, 485352, 483191, 479942, 475379, 469961, 464146, 457809, 450685, 443021, 435342, 427827, 420410, 413417, 407526, 402985, 399212, 395370, 391188, 387166, 384076, 382274, 381379, 380630, 379661, 378772, 378309, 378014, 377350, 376445, 376280, 377711, 380507, 383567, 386009, 387872, 389731, 391855, 393968, 395905, 398200, 401566, 405756, 409372, 411169, 411369, 411311, 411866, 412600, 412564, 411457, 409707, 407653, 405096, 401779, 398023, 394568, 391833, 389605, 387541, 385668, 384139, 382754, 381283, 380248, 380768, 383222, 386427, 388615, 389134, 388826, 388838, 389468, 390227, 390609, 390549, 390334, 390295, 390583, 391181, 392162, 393839, 396466, 399697, 402601, 404383, 405045, 405163, 405086, 404595, 403414, 401801, 400384, 399532, 399117, 398941, 399116, 399957, 401661, 404220, 407469, 411067, 414648, 418208, 422197, 427032, 432670, 438910, 445827, 453443, 461026, 467216, 471020]
59912D71020J448j08o37k31P03J494J763J752J737J450O37k36m93k23j8P7M94
59895D80629J080J128O05M19J086J920K102J872K000K512K714K329J940K219L107
59880E07662L891L953L434L111L532M292M469L784K846K138J296j74j928l111
59866E39195l511l751m297m755m440l342k210j742j912k087j698o53P12J988K961
59851E10458L652M223M820N518O401P601R015J0041R841Q020M981J612j209k927
59837E82047l497l382l022k313j021K50J87j786m690p051q264q520p997o841n553
59822E18547m623l912l016k064j616j877k515l104l281k857k191k073k614k794
59808D80010j899p83o77j274j286n76k16n46p30m76o42j559k214j839j128j003
$$ y = [471020, 472468, 472360, 471723, 471492, 472195, 473689, 475452, 477204, 478941, 480391, 481028, 480792, 480299, 480076, 480058, 480135, 480629, 481709, 482837, 483442, 483861, 484947, 486867, 488969, 490841, 492841, 495353, 498067, 500396, 502336, 504555, 507662, 511553, 515506, 518940, 522051, 525583, 529875, 534344, 538128, 540974, 543112, 544408, 544234, 542306, 539195, 535684, 531933, 527636, 522881, 518441, 515099, 512889, 511147, 509235, 507148, 505450, 504797, 505509, 507497, 510458, 514110, 518333, 523153, 528671, 535072, 542673, 551688, 561729, 571570, 579590, 584571, 586183, 584974, 582047, 578550, 575168, 572146, 569833, 568812, 569062, 569249, 567463, 562773, 555722, 547458, 538938, 530941, 524100, 518547, 513924, 510012, 506996, 504932, 503316, 501439, 498924, 495820, 492539, 489682, 487491, 485418, 482804, 480010, 478111, 477328, 476651, 475377, 474091, 473515, 473299, 472753, 472023, 471547, 470905, 469346, 467132, 465293, 464165, 463162]
59792D63162j225j138q56q53j041j172j473k095k520k318j958k080k514k714k645
59777D36560k491k120j536j315j636j576l32J340K086J958K265L555M881N175
59763D46814M426L340K630K733L504M134L994L529L685M520N185N253N187N375
59749E04309N629N804O127O487O254N250M235L812L458K303N92m68k84L63L06
59734E54177o27j576j783j375r77q61q07o18l68j18J45J48n80j907k835k573j546
59717E35919q64r62j344j483j353j036m28M06J033J116Q82R13J471K193K431J935
59701E40829J177R13J362K048K442K526K605K880L376L958M240L768K567J195
59687E75886J23o12r77p56j13K21j42o71q04q81j471k257k535k540l153m395n226
$$ y = [463162, 461937, 460799, 459943, 459090, 458049, 456877, 455404, 453309, 450789, 448471, 446513, 444433, 441919, 439205, 436560, 434069, 431949, 430413, 429098, 427462, 425886, 425554, 426894, 428980, 430938, 433203, 436758, 441639, 446814, 451240, 454580, 457210, 459943, 463447, 467581, 471575, 475104, 478789, 483309, 488494, 493747, 498934, 504309, 509938, 515742, 521869, 528356, 534610, 539860, 544095, 547907, 551365, 553668, 554260, 553792, 553508, 553871, 554177, 553550, 551974, 550191, 548816, 547839, 546978, 546171, 545553, 545185, 545067, 545212, 545360, 544780, 542873, 540038, 537465, 535919, 535055, 534093, 532749, 531266, 529913, 528877, 528449, 528855, 529888, 531004, 531886, 532799, 534270, 536463, 538894, 540829, 542006, 542919, 544281, 546329, 548771, 551297, 553902, 556782, 560158, 564116, 568356, 572124, 574691, 575886, 576009, 575397, 574420, 573664, 573551, 573772, 573630, 572959, 572155, 571274, 569803, 567546, 565011, 562471, 559318, 554923, 549697]
59670E49697n086m711m977n669n917n324m230l131k227j372l24Q05J395J058M39
59655E10426O89J951K994K794J954J937L126M320M252L051J866J305P77m86k301
59640E38655l818m701n347n947o113n736n387n372n008l665j992j184j314j398
59626D81673j009p91j191j730j870j817j957k152k178k320k977l963m642m628
59612D48448m019l178k439j859j094J72J587K288J927J163Q22R73J161J169J120
59597D48241R72N00k58q51q37k01O10R62N01m59j111r70l95j35m07p19o04k59
59579D44580k34p13j344j734j825j739j461r84o01o88j194j638j682j438j136
59564D26169q46o38o42p37n37L5N01M30j2l83n26m19R9R35J420J012J95N5J000
$$ y = [549697, 544611, 539900, 534923, 529254, 523337, 518013, 513783, 510652, 508425, 507053, 506729, 507534, 508929, 509987, 510426, 511115, 513066, 516060, 518854, 520808, 522745, 525871, 530191, 534443, 537494, 539360, 540665, 541442, 540956, 538655, 534837, 530136, 524789, 518842, 512729, 506993, 501606, 496234, 491226, 487561, 485569, 484385, 483071, 481673, 480664, 479873, 478682, 476952, 475082, 473265, 471308, 469156, 466978, 464658, 461681, 457718, 453076, 448448, 444429, 441251, 438812, 436953, 435859, 436031, 437618, 439906, 441833, 442996, 443818, 444791, 445952, 447121, 448241, 449213, 449713, 449455, 448604, 447767, 447566, 448176, 449138, 449639, 449180, 448069, 447099, 446704, 446569, 446162, 445443, 444839, 444580, 444346, 443633, 442289, 440555, 438730, 436991, 435530, 434546, 433945, 433257, 432063, 430425, 428743, 427305, 426169, 425323, 424685, 424043, 423306, 422769, 422804, 423305, 423735, 423723, 423340, 422814, 422395, 422494, 423429, 424849, 425861, 426056, 426111, 427111]
59545D27111K401L472M050M495N229O439Q001R734J1914J5036J8628K0757J9435
59532E56702J4518P659P44m948q514r582q847p463n744l242k73J786K108J415
59518E36319Q53O50N11L94R7j183l840o751q155p639o467n979o347o892p016o549
59502D72006n689m852m398m294m147l648k878k171j770j578j272o76K8O69J462
59487D36792K654L819M016K954J533R16J300K009K509K880L373L964M413M484
59473D77616M015L037J900J189J324K224L275L712L133J793L56n92q35m49L65
59458E02063J353K300L118L834M469N002N457N926O529P300Q044Q285P616O155
59444E77451M419K689Q07j310l345n034o431p457p741p295o851o865o737n710
$$ y = [427111, 429512, 432984, 437034, 441529, 446758, 453197, 461198, 470932, 482846, 497882, 516510, 537267, 556702, 571220, 578879, 579623, 574675, 566161, 556579, 547732, 540269, 534525, 531283, 531010, 532796, 534904, 536319, 537172, 537822, 538333, 538727, 538824, 537641, 533801, 527050, 518895, 511256, 504789, 498810, 492463, 485571, 478555, 472006, 466317, 461465, 457067, 452773, 448626, 444978, 442100, 439929, 438159, 436581, 435309, 434633, 434661, 435330, 436792, 439446, 443265, 447281, 450235, 451768, 452684, 453984, 455993, 458502, 461382, 464755, 468719, 473132, 477616, 481631, 484668, 486568, 487757, 489081, 491305, 494580, 498292, 501425, 503218, 503574, 502982, 502147, 501698, 502063, 503416, 505716, 508834, 512668, 517137, 522139, 527596, 533522, 540051, 547351, 555395, 563680, 571296, 577451, 581870, 584559, 585366, 584056, 580711, 575677, 569246, 561789, 554048, 546753, 539902, 533037, 526300, 520590]
59430E20590m133k942k278j541n23N11J747L623N736P136P857Q986J0985J3081
59416E68835J4759J6520J8640K0437K1607K3077K5341K6719K4598J8056Q529j604
59404G85514j0175j5587j7306j6049j2776p693r64N950J0600J1266P744Q89p693
59391G33720j5641k0764k2452k1713j9674j6642j2717q564n112k838j584r04m25
59378E84690l3K00L91Q92J781K475K285J245P8n47m20L02J181J678J656J568J717
59361F01139J631P94k44k31J214L106M374N068N945P357Q910J0020J0473J0594
59347F70150J1024J2161J3728J4990J5455J5174J4447J3448J2242J0846R232P353
59335H20250N195K727n5k900n287o961q330r961j1769j3114j3633j3599j3344
$$ y = [520590, 516457, 513515, 511237, 509696, 509173, 509684, 511431, 515054, 520790, 527926, 535783, 544769, 555754, 568835, 583594, 600114, 618754, 639191, 660798, 683875, 709216, 735935, 760533, 778589, 787118, 785514, 775339, 759752, 742446, 726397, 713621, 705928, 704964, 710914, 721514, 732780, 740524, 741413, 733720, 718079, 697315, 674863, 653150, 633476, 616834, 604117, 595553, 590441, 587603, 586019, 585115, 584690, 584657, 584857, 585248, 586140, 587921, 590396, 592681, 593926, 594004, 593457, 593037, 593339, 594520, 596198, 597854, 599422, 601139, 602770, 603564, 603320, 603089, 604303, 607409, 611783, 616851, 622796, 630153, 639063, 649083, 659556, 670150, 681174, 693335, 707063, 722053, 737508, 752682, 767129, 780577, 792819, 803665, 812897, 820250, 825445, 828172, 828117, 825217, 819930, 812969, 804639, 794678, 782909, 769795, 756162, 742563, 729219]
59322G29219j2859j2082j1222j0585j0233j0021r794r449q976q538q322q259q068
59309F00811p627p063o361n146l118o08J573K865L498M278N900Q438J1256J3301
59295F21997J3497J1092O009j015q572j5013j8986j9941j8395j5572j2525r587
59283E32989o778m485l217k786k265j010O93K252L596N029O607Q130R575J1079
59269E59409J2510J3376J3296J2393J1212J0221R317P867N459K618L55j028k255
59256F54750l962n753o840p109p050o862o271n193m010l086k390j704r53j64P01
59241E94104J771L080M359N091M994M498M380M823N222N071M616M339M173L693
59227F54214K769J559J17j554l223m662n973p291q376q877q906q834q697q259
$$ y = [729219, 716360, 704278, 693056, 682471, 672238, 662217, 652423, 642974, 633998, 625460, 617138, 608879, 600811, 593184, 586121, 579760, 574614, 571496, 570888, 572461, 575326, 578824, 583102, 589002, 597440, 608696, 621997, 635494, 646586, 652595, 651580, 643008, 627995, 609009, 589068, 570673, 555101, 542576, 532989, 526211, 521726, 518509, 515723, 513458, 512448, 513141, 515393, 518989, 524018, 530625, 538755, 548330, 559409, 571919, 585295, 598591, 610984, 622196, 632417, 641734, 649601, 655060, 657678, 658033, 657005, 654750, 650788, 645035, 638195, 631086, 624036, 617174, 610903, 605710, 601700, 598614, 596224, 594520, 593567, 593403, 594104, 595875, 598955, 603314, 608405, 613399, 617897, 622277, 627100, 632322, 637393, 642009, 646348, 650521, 654214, 656983, 658542, 658659, 657105, 653882, 649220, 643247, 635956, 627580, 618703, 609797, 600963, 592266, 584007]
59213E84007p564o944o502o092n737n594n504n029m075l008k195j679j376j158
59199E21550p96k18K18J71K3N33J672K420K059J176R68J787K883L440L466L574
59183E44926M160M966N388N100M293L403K726K390K494L008L607L851L606L234
59169E97152L231L753M449M741M323L386K445J920J892K073J832N61j647l807
59155F26304m996n370n784o579p403q169r272j0590j1197j0630r633r027q523
59142E19131p490o262n703n841n912n611n320n189m870m208l503k922k320j693
59128D52287j240q74k96M46R71J279J839K921M296N669O866P593P552O939O352
59113E02600O162O362O921P685Q046P462O347N702N716N586M917M359M437M538
$$ y = [584007, 576443, 569499, 562997, 556905, 551168, 545574, 540070, 535041, 530966, 527958, 525763, 524084, 522708, 521550, 520754, 520536, 520754, 520925, 520948, 521481, 523153, 525573, 527632, 528808, 529776, 531563, 534446, 537886, 541352, 544926, 549086, 554052, 559440, 564540, 568833, 572236, 574962, 577352, 579846, 582854, 586461, 590312, 593918, 597152, 600383, 604136, 608585, 613326, 617649, 621035, 623480, 625400, 627292, 629365, 631197, 631758, 630111, 626304, 621308, 615938, 610154, 603575, 596172, 588003, 578731, 568141, 556944, 546314, 536681, 527654, 519131, 511641, 505379, 499676, 493835, 487923, 482312, 476992, 471803, 466933, 462725, 459222, 456300, 453980, 452287, 451047, 450173, 449877, 450323, 451294, 452573, 454412, 457333, 461629, 467298, 474164, 481757, 489309, 496248, 502600, 508762, 515124, 522045, 529730, 537776, 545238, 551585, 557287, 563003, 568589, 573506, 577865, 582302, 586840]
59099E86840L813K435J183K42p85j884k506k454k184k003j541m32Q36J221L01
59084E83082j184k186k452k522k846l337l880m635n591o186n973n338n024n170
59070E26758n310n186m968m669m025l038k141j642j447j406j538j718j624j241
59056D86805j035j392k143k826l161l094k647j931j161m81R7N51P63O42K63j89
59040D69061n41p67j032j432j659j207p2J073J676J879K021K014J716J573K222
59025D76525L602N095O394P690Q982R909J0284J0294J0153R890R457Q611O934
59012E83820M401J849K01n90j268k099k659k728k595k401j878q87L84J801L339
58997E78690M704N478N655N492M906L766K583K111K212K052J477J180J277Q59
$$ y = [586840, 590653, 593088, 594271, 594513, 593728, 591844, 589338, 586884, 584700, 582697, 581156, 580724, 581560, 582781, 583082, 581898, 579712, 577260, 574738, 571892, 568555, 564675, 560040, 554449, 548263, 542290, 536952, 531928, 526758, 521448, 516262, 511294, 506625, 502600, 499562, 497421, 495779, 494332, 492926, 491388, 489670, 488046, 486805, 485770, 484378, 482235, 479409, 476248, 473154, 470507, 468576, 467415, 466934, 467031, 467582, 468345, 468987, 469250, 469061, 468520, 467753, 466721, 465289, 463630, 462423, 462351, 463424, 465100, 466979, 469000, 471014, 472730, 474303, 476525, 480127, 485222, 491616, 499306, 508288, 518197, 528481, 538775, 548928, 558818, 568275, 576886, 583820, 588221, 590070, 590271, 589681, 588413, 586314, 583655, 580927, 578332, 575931, 574053, 573166, 573550, 575351, 578690, 583394, 588872, 594527, 600019, 604925, 608691, 611274, 613385, 615597, 617649, 619126, 620306, 621583, 622442]
58983F22442n36j963k306j710j051n11M71K150M082N716O981Q201R604J0905J1521
58968F73996J1416J1440J2275J3341J3477J2564J1557J0934J0183Q974P709O505
58956H04371M681J910j046l464n667q221j0822j2840j4291j5520j6376j6544j6236
58943F89935j5825j5117j3748j2027j0581r402p908n868l665j757l67L92N48L63
58929E94973P2k90n77m36J43N33J96n81j110j187j095j002q11m72k8M19N15j45
58911E89117j261j711p58R55K195K686L200M328N930P766R864J1969J3265J3167
58897F60712J2254J1827J2455J3253J2930J1476J0270J0435J1602J2770J3834
58886G93818J5398J7314J8440J8042J6565J4697J2440R584O468L678J383o65k752
$$ y = [622442, 621906, 619943, 617637, 615927, 614876, 614365, 614836, 616986, 621068, 626784, 633765, 641966, 651570, 662475, 673996, 685412, 696852, 709127, 722468, 735945, 748509, 760066, 771000, 781183, 790157, 797866, 804371, 809052, 810962, 809916, 806452, 800785, 792564, 781742, 768902, 754611, 739091, 722715, 706171, 689935, 674110, 658993, 645245, 633218, 622637, 613235, 605327, 599459, 595794, 594037, 593670, 594062, 594610, 594973, 595045, 594755, 594178, 593742, 593885, 594418, 594614, 594033, 592923, 591736, 590641, 589639, 588828, 588356, 588328, 588747, 589262, 589117, 587856, 586145, 585387, 586342, 588537, 591223, 594423, 598751, 604681, 612447, 622311, 634280, 647545, 660712, 672966, 684793, 697248, 710501, 723431, 734907, 745177, 755612, 767214, 779984, 793818, 809216, 826530, 844970, 863012, 879577, 894274, 906714, 916298, 922766, 926444, 927827, 927162, 924410]
58873I24410n099p703j0096j1585j2026j1927j1722j1428j1058j0723j0215r208
58861H01620q026p463p599p649p321p305p999q682q634q266q314q648q623q116
58847F88975p463o909o677p056p791q000p397o911p372q222q385p824p315p136
58833E84517o934o540o010n145l787k416j659j448j219p06J22J439L137M429M696
58818E62476M472M771N670O299O097N314M503M055M125M376M102L084K049J657
58804F23050J490O55r98k910m613n844o259n887n456n580n996o267o646p357p669
58789E53713o789n255m293m066l650k536j073L83J642K221J866J471K229L838
58775E39701M700M033K685J657Q67k60j922l964o015p373p526o972o780p161p285
$$ y = [924410, 919311, 911608, 901512, 889927, 877901, 865974, 854252, 842824, 831766, 821043, 810828, 801620, 793594, 786131, 778532, 770883, 763562, 756257, 748258, 739576, 730942, 722676, 714362, 705714, 697091, 688975, 681512, 674603, 667926, 660870, 653079, 645079, 637682, 630771, 623399, 615177, 606792, 598968, 591653, 584517, 577583, 571043, 565033, 559888, 556101, 553685, 552026, 550578, 549359, 548653, 548775, 550214, 553351, 557780, 562476, 566948, 571719, 577389, 583688, 589785, 595099, 599602, 603657, 607782, 612158, 616260, 619344, 621393, 623050, 624540, 625195, 624197, 621287, 616674, 610830, 604571, 598684, 593228, 587648, 581652, 575385, 568739, 561382, 553713, 546924, 541669, 537376, 533310, 529660, 527124, 526051, 526434, 528076, 530297, 532163, 533634, 535863, 539701, 544401, 548434, 551119, 552776, 553643, 553383, 551461, 547497, 541482, 534109, 526583, 519611, 512831, 505670, 498385]
58760D98385o588n412m210l050k156j962k198j784k05J675K697K715K298J773
58746D81978J164P13P99J376K042K621L358M408N323N310M169K804K470L471M999
58731E27005O204O896O995O173M585L237K891L095L011K681K672K950L025K935
58717E84355L144L702M341N130O203P073P075O334N444M362K631M74j282k398
58703F36588l431m772o305p978r857j1575j2588j2996j3406j3943j4143j3697
58691E11897j2639j0931q641o424m978m172l467k927k941l243l192k883k918l228
58677D39313l144k520j781j013j05M36P8m52K08K122M048N382O655P993Q565Q084
58661D73869P429P163O615N099K980Q88j157l182m700n346n413n319n066m606
$$ y = [498385, 491797, 486385, 482175, 479125, 476969, 475007, 472809, 471025, 470820, 472495, 475192, 477907, 480205, 481978, 483142, 483855, 484654, 486030, 488072, 490693, 494051, 498459, 503782, 509092, 513261, 516065, 518535, 522006, 527005, 533209, 540105, 547100, 553273, 557858, 561095, 563986, 567081, 570092, 572773, 575445, 578395, 581420, 584355, 587499, 591201, 595542, 600672, 606875, 613948, 621023, 627357, 632801, 637163, 639794, 640268, 638986, 636588, 633157, 628385, 622080, 614102, 604245, 592670, 580082, 567086, 553680, 539737, 525594, 511897, 499258, 488327, 479686, 473262, 468284, 464112, 460645, 457718, 454777, 451534, 448342, 445459, 442541, 439313, 436169, 433649, 431868, 430855, 430750, 431186, 431264, 430812, 431020, 433142, 437190, 442572, 449227, 457220, 465785, 473869, 481298, 488461, 495076, 500175, 503155, 504043, 502886, 499704, 495004, 489658, 484245, 478926, 473860, 469254]
58647D69254m084l538k960k679k983l337k929j981j466j528j394q91o82o72K69
58632D38399K396M196M284L121K011J370Q45L59P6j44m86p32o01j60M42J211K088
58615D58675K921L822M944N876N919N089M086L322K705K273K079J616M40o99o35
58600E02433L16O16k09j045j230j461k162k518j904r90n27k18M23J268K332M148
58584D99272O524Q111Q103P416P247P509P543P378P318P105O523O072O162O355
58570E98638O237O353P436R286J1141J2676J4033J5500J7559K0518K3636K5422
58558G68435K5245K3840K1911J9251J5703J1833Q021L942l39l766n561o173o304
58545H76038n946n078m400m604n659p342r629j2114j4137j5789j7730j9650k0273
$$ y = [469254, 465170, 461632, 458672, 455993, 453010, 449673, 446744, 444763, 443297, 441769, 440375, 439484, 438802, 438130, 438399, 440795, 444991, 449275, 452396, 454407, 455777, 456622, 456981, 457057, 456913, 456427, 455695, 455094, 454934, 455376, 456587, 458675, 461596, 465418, 470362, 476238, 482157, 487246, 491332, 494654, 497359, 499632, 501711, 503327, 503767, 503068, 502433, 502749, 503365, 503156, 502111, 500881, 499420, 497258, 494740, 492836, 491846, 491319, 491101, 491524, 492792, 495124, 499272, 505796, 513907, 522010, 529426, 536673, 544182, 551725, 559103, 566421, 573526, 580049, 586121, 592283, 598638, 604875, 611228, 618664, 627950, 639091, 651767, 665800, 681300, 698859, 719377, 743013, 768435, 793680, 817520, 839431, 858682, 874385, 886218, 894239, 898181, 897842, 894076, 888515, 882342, 876038, 870092, 865014, 860614, 856010, 850351, 843009, 833380, 821266, 807129, 791340, 773610, 753960, 733687]
58532G33687j9353j8116j7133j5461j2652r878p977o105l683j914j866k430j989
58519F15130r08o68j437k254k804l385l737l451l052l240l545l005j776r21r14
58504E80033j292j406q00N10J590J223l32j269o21M99Q46P81R94R82K34k84N90
58487E82278K402L973N119O154O745O735P194R122J1823J3870J4866J5124J4647
58474G00052J3699J3152J2876J1074O797J867j389l147n003p089q361q703q619
58461G17206p620n045j874L17J721L703O380Q640J0034J0873J0950R948Q513P214
58447G80960N108J235l176o074p453q814j0333j0841j0233r592r023p565n235
58434F98964l176j694k7J828K887K879K635K803L522N089P439R329R608Q930Q607
$$ y = [733687, 714334, 696218, 679085, 663624, 650972, 641094, 633117, 627012, 623329, 621415, 619549, 617119, 615130, 614222, 613554, 612117, 609863, 607059, 603674, 599937, 596486, 593434, 590194, 586649, 583644, 581868, 580947, 580033, 578741, 577335, 576535, 577045, 578635, 579858, 579526, 578257, 577636, 578135, 578981, 579762, 580756, 581738, 581972, 581688, 582278, 584680, 588653, 593772, 599926, 606671, 613406, 620600, 629722, 641545, 655415, 670281, 685405, 700052, 713751, 726903, 739779, 750853, 757650, 759517, 758128, 754981, 749978, 742889, 734528, 725825, 717206, 709586, 704541, 702667, 702984, 704705, 708408, 714788, 723428, 733462, 744335, 755285, 765233, 773746, 780960, 786068, 787303, 784127, 778053, 770600, 761786, 751453, 740612, 730379, 720787, 711764, 704199, 698964, 695788, 694094, 694067, 695895, 698782, 701661, 704296, 707099, 710621, 715710, 723149, 732478, 742086, 751016, 759623]
58419G59623Q345O852M182J557o89l054n159o112o266o720p363p314o921p246
58405G23715p909p529o130n051m580l755k378j225l75P53J881K278K448L382M479
58390G00004M319L200K709K959K513R87m79j298j887k076j210K62J305K214M031
58375G17553O248P356P374P643Q366Q648Q623R193R926R698R055R430J0415J0487
58361H40015J0027J0736J2274J2653J1787J1515J1997J1401R370P583O431M481
58349I60270J793M39R29J298O67O48K151L778M502N215O532P645Q375R749J1669
58334A025660J2539J2074J1954J2909J3771J4015J4532J5203J4533J2448J0688
58323A170326R656P831N008L106K895K888K387K555L599M000L544M013N817P106
$$ y = [759623, 767968, 774820, 779002, 780559, 779870, 776816, 771657, 765545, 759279, 752559, 745196, 737882, 730961, 723715, 715806, 708277, 702147, 697096, 692516, 688761, 686383, 685158, 684783, 685536, 687417, 689695, 692143, 695525, 700004, 704323, 707523, 710232, 713191, 715704, 716691, 716212, 714914, 713027, 710951, 709741, 710003, 711308, 713522, 717553, 723801, 731157, 738531, 746174, 754540, 763188, 771811, 781004, 790930, 800628, 809683, 819113, 829528, 840015, 850042, 860778, 873052, 885705, 897492, 909007, 921004, 932405, 941775, 949358, 955789, 960270, 962063, 962502, 963431, 964729, 965396, 966044, 968195, 971973, 976475, 981690, 988222, 995867, 1004242, 1013991, 1025660, 1038199, 1050273, 1062227, 1075136, 1088907, 1102922, 1117454, 1132657, 1147190, 1159638, 1170326, 1179982, 1187813, 1192821, 1195927, 1198822, 1201710, 1204097, 1206652, 1210251, 1214251, 1217795, 1221808, 1227625, 1234731]
58309A234731P220P851R722J1304J1937J2954J4590J5167J4508J4719J6332J7127
58297A388162J6179J5514J6346J7200J7266J7923J9381J9536J7970J7386J9196
58286A582059K1265K1966K2744K4667K6046K5761K5541K6753K8167K8877L0129
58275A863975L2451L4359L5683L8548M3375M7575M9916N2236N5203N6672N6024
58264B366017N5807N7085N7662N6918N7544O0240O1763O0685O0077O1765O3066
58253C018629O2185O1694O3447O5266O5847O7841P2703P7649Q1057Q5578R2577
58242C814473R9103J03746J09727J18564J26770J32592J39705J50265J60867J69516
58232E125328J79716J93282K06414K17582K31554K50522K69330K85168L03577
$$ y = [1234731, 1241951, 1249802, 1259524, 1270828, 1282765, 1295719, 1310309, 1325476, 1339984, 1354703, 1371035, 1388162, 1404341, 1419855, 1436201, 1453401, 1470667, 1488590, 1507971, 1527507, 1545477, 1562863, 1582059, 1603324, 1625290, 1648034, 1672701, 1698747, 1724508, 1750049, 1776802, 1804969, 1833846, 1863975, 1896426, 1930785, 1966468, 2005016, 2048391, 2095966, 2145882, 2198118, 2253321, 2309993, 2366017, 2421824, 2478909, 2536571, 2593489, 2651033, 2711273, 2773036, 2833721, 2893798, 2955563, 3018629, 3080814, 3142508, 3205955, 3271221, 3337068, 3404909, 3477612, 3555261, 3636318, 3721896, 3814473, 3913576, 4017322, 4127049, 4245613, 4372383, 4504975, 4644680, 4794945, 4955812, 5125328, 5305044, 5498326, 5704740, 5922322, 6153876, 6404398, 6673728, 6958896, 7262473]
58223G262473L28663L55952L81759M10717M46832M86203N26298N73021O30521
58214A1402439O93906P60687Q38855R34399J042383J160647J300185J470688J669133
58205B1273322J895440K165468K494721K885118L344923L906328M606563N471448
58197D8043331O539643P882272R571998J1653872J4175199J7213886K0829475
58190A35909676K4993003K9561135L4186756L8074459L9841235L7906650L1365763
58183C71838677K0673287P538843n833600j7532491k6346084l1838778l4251224
58176B84248630l4257092l2633745l0020008k6868028k3505728k0180843j7068381
58169I9714805j4280865j1878963r868762q209973o849157n743683m853440m130842
$$ y = [7262473, 7591136, 7947088, 8328847, 8739564, 9186396, 9672599, 10198897, 10771918, 11402439, 12096345, 12857032, 13695887, 14630286, 15672669, 16833316, 18133501, 19604189, 21273322, 23168762, 25334230, 27828951, 30714069, 34058992, 37965320, 42571883, 48043331, 54582974, 62465246, 72037244, 83691116, 97866315, 115080201, 135909676, 160902679, 190463814, 224650570, 262725029, 302566264, 340472914, 371838677, 392511964, 400050807, 394217207, 376684716, 350338632, 318499854, 284248630, 249991538, 217357793, 187337785, 160469757, 136964029, 116783186, 99714805, 85433940, 73554977, 63686215, 55476242, 48627085, 42883402, 38029962, 33899120]
58161C3899120l534351l040685k633303k290595j995376j744112j535574j359676
58153A5765448j206538j076429r70827q82151q01588p29031o66486o09235n52328
58144H270835m98879m53427m13141l73442l36438l06166k80875k57304k37423
58135E113740k24032k14324k04355j95292j89015j82284j71595j59549j50260
58126C423034j42438j32876j22886j15414j09417j02592r6337r2672q9603q4548
58116B334251p9019p5135p1054o4759n8775n6023n4378n0505m5866m3642m2727
58105A692368m0151l6799l5383l5040l3099l0248k9002k8786k7258k4887k3855
58094A347860k3932k3570k3426k4819k6381k6132k5087k5006k4600k1968j8863
$$ y = [33899120, 30364769, 27324084, 24690781, 22400186, 20404810, 18660698, 17125124, 15765448, 14558910, 13482481, 12511654, 11629503, 10827915, 10098884, 9432398, 8823163, 8270835, 7771956, 7318529, 6905388, 6531946, 6195508, 5889342, 5608467, 5351163, 5113740, 4889708, 4675384, 4471029, 4275737, 4086722, 3904438, 3732843, 3573294, 3423034, 3280596, 3147720, 3024834, 2909420, 2800003, 2697411, 2601074, 2508402, 2418799, 2334251, 2255232, 2180097, 2109043, 2044284, 1985509, 1929486, 1875108, 1824603, 1778737, 1735095, 1692368, 1652217, 1615418, 1580035, 1544995, 1511896, 1481648, 1452646, 1423860, 1396602, 1371715, 1347860, 1323928, 1300358, 1276932, 1252113, 1225732, 1199600, 1174513, 1149507, 1124907, 1102939, 1084076]
58083A084076j8211j9181j8938j7763j8067j9628k0206j9788k0064k0499j9159
58072H72572j6795j6062j6992j6992j5160j3150j1885j0680r499r189r495r427
58060G17246r238r690j0051r266q268q603r680r965r843j0493j1012r718p480
58047E93939o629p140o959n692m939n224n409n068m906m882m329l740m209n342
58033E19471n870n936o634p772q286q346q904r626r427q541p975p547o538n557
58019D12512n538n727m949l992m315n185m716l085k071j988j718j323j851k827
58005C63227k681j537r69j194j003l15k10m58L63K238L656M247M984N749N230
57990C81327L483K126J588N14j606l462m130m270m548m723m670m708m643m039
$$ y = [1084076, 1065865, 1046684, 1027746, 1009983, 991916, 972288, 952082, 932294, 912230, 891731, 872572, 855777, 839715, 822723, 805731, 790571, 777421, 765536, 754856, 745357, 736168, 726673, 717246, 708008, 698318, 688267, 679001, 670733, 662130, 652450, 642485, 632642, 622149, 611137, 601419, 593939, 587310, 580170, 573211, 567519, 562580, 557356, 551947, 546879, 541973, 537091, 532762, 529022, 524813, 519471, 513601, 507665, 501031, 493259, 484973, 476627, 467723, 458097, 448670, 440129, 432154, 424607, 418069, 412512, 406974, 401247, 396298, 392306, 387991, 382806, 378090, 375005, 372934, 370946, 369228, 367905, 366054, 363227, 360546, 359009, 358040, 356846, 355843, 355528, 355318, 354860, 355223, 357461, 361117, 365364, 370348, 376097, 381327, 384810, 386936, 388524, 389038, 387432, 383970, 379840, 375570, 371022, 366299, 361629, 356921, 352278, 348239]
57976C48239l489l923m807m775l837l087k564j495l66m08j142q69L51P60O2n9
57960C18591R59J595J024M31O29O33l62j523j972k047k161j981j566j718k468
57945C08064k763k241j728j461n65J157K649L514M686O519P915Q178Q050Q077
57931C50051P593O170M566L316J925J85j194k073l393n300o445o113n587o148
57917C37553p169p372o737n939m969l628k434j927j679r83J28J266K381L403L899
57902C05793L694L111K242Q54n70q56K19J362J453Q82N66O04O07N03L55R0j09
57885C20800J01M65K59n51j274j704k298k963l000k575k753l674m113l466k635
57870B90619k271j643k57Q18M71p62j589j616j132k07J015J916K290K842M053
$$ y = [348239, 344750, 340827, 336020, 331245, 327408, 324321, 321757, 320262, 319896, 319488, 318346, 317477, 317828, 318588, 318650, 318591, 319550, 321145, 322169, 322600, 323229, 323862, 323500, 321977, 320005, 317958, 315797, 313816, 312250, 310532, 308064, 305301, 303060, 301332, 299871, 299306, 300463, 303112, 306626, 311312, 317831, 325746, 333924, 341974, 350051, 357644, 363814, 368380, 371696, 373621, 373806, 372612, 370539, 367146, 361846, 355401, 349288, 343701, 337553, 330384, 323012, 316275, 310336, 305367, 301739, 299305, 297378, 295699, 294716, 294844, 296110, 298491, 301894, 305793, 309487, 312598, 314840, 315694, 315124, 314268, 314487, 315849, 317302, 318184, 318750, 319354, 319961, 320464, 320819, 320909, 320800, 320901, 321366, 321625, 321074, 319800, 318096, 315798, 312835, 309835, 307260, 304507, 300833, 296720, 293254, 290619, 288348, 286705, 286448, 287266, 287737, 286975, 285386, 283770, 282638, 282431, 283446, 285362, 287652, 290494, 294547]
57855B94547N312N966O288O632O571N803M968M646M371L571K609J964J208j89
57841C54267j738k654l055l526m111m610n247o086o448n823m836m358m206l651
57827B93918k716k047j820j665j341q10l2O95P17M8j94Q55K492L274K754J573
57811B95701K85j115k721m504o344p821q293p651o589n733m990m176l579l305
57797B29165k759j571m28k35p83j026l20J105K580L325K876J761J347K378M083
57782B41498N190N357N112M917M956N363O001O383O298O114O062N769M957L946
57768C17923K977J721Q4j295k040k794m170n578o051n678n260n016m671m396m593
57753B71163m871m331k936j659j150r69m56K84N80J89l08j36O41J010K66q87j085
$$ y = [294547, 299859, 305825, 312113, 318745, 325316, 331119, 336087, 340733, 345104, 348675, 351284, 353248, 354456, 354267, 352529, 349875, 346820, 343294, 339183, 334573, 329326, 323240, 316792, 310969, 306133, 301775, 297569, 293918, 291202, 289155, 287335, 285670, 284329, 283519, 283487, 284182, 284899, 284947, 284753, 285608, 288100, 291374, 294128, 295701, 295986, 294871, 292150, 287646, 281302, 273481, 265188, 257537, 250948, 245215, 240225, 236049, 232470, 229165, 226406, 224835, 224407, 224172, 223389, 222363, 222043, 223148, 225728, 229053, 231929, 233690, 235037, 237415, 241498, 246688, 252045, 257157, 262074, 267030, 272393, 278394, 284777, 291075, 297189, 303251, 309020, 313977, 317923, 320900, 322621, 322705, 321410, 319370, 316576, 312406, 306828, 300777, 295099, 289839, 284823, 280152, 275756, 271163, 266292, 261961, 259025, 257366, 256216, 255247, 254791, 255075, 255655, 255844, 255536, 255400, 256041, 257051, 257317, 256430, 255345]
57736B55345o9J117J718K091K641L000K813K514K595K796K709K563K698K810K375
57721B89716J455M25n94j560k144k103j675j227r74j242k332l824m743m821m832
57706B59525n290n744n758n646n602n098l864k609j919j359m30M43P42P59Q10
57691B18960L96q21k082k524k392k328k207j741j358j315q13Q48K887M144M881
57676B14535O171Q145J0194J2441J5666K0091K5428L1663L8550M4666M8149M7945
57664E23644M3366L3326J7704r72j8713l2799m2224m6341m5066m0156l4324k8837
57652C28608k3427j8365j4781j2718j0805q378o403n674n474m739l411k003p75
57639B11655J20M24K09j42m79p67n64M45J475J377K99n20o25p65j329j705j483
$$ y = [255345, 255276, 256393, 258111, 260202, 262843, 265843, 268656, 271170, 273765, 276561, 279270, 281833, 284531, 287341, 289716, 291171, 291596, 291002, 289442, 287298, 285195, 283520, 282293, 281319, 280077, 277745, 273921, 269178, 264357, 259525, 254235, 248491, 242733, 237087, 231485, 226387, 222523, 219914, 217995, 216636, 216206, 216649, 217391, 218150, 218960, 219356, 218535, 216453, 213929, 211537, 209209, 207002, 205261, 203903, 202588, 201775, 202623, 205510, 209654, 214535, 220706, 228851, 239045, 251486, 267152, 287243, 312671, 344334, 382884, 427550, 475699, 523644, 567010, 600336, 618040, 617068, 598355, 565556, 523332, 476991, 431925, 391769, 357445, 328608, 305181, 286816, 272035, 259317, 248512, 240134, 233731, 228057, 222583, 217844, 214433, 212430, 211655, 211775, 212199, 212408, 212266, 211787, 211020, 210456, 210901, 212376, 213753, 214052, 213532, 212907, 212142, 210813, 209108, 207625]
57622B07625j072q26o10n45j000j642j692j325j569k511k976k417j748j713j796
57607A84183j403r01p33o16l46l75q11r23l62R9j81p21r49j220j907k519k627
57590A67688k775l428l858l196j902j027o27o1N93O37N1m37m83m07m27m21m71
57573A49449q36j314j327p67k24k11n40o77m65l18p49j691k404k248j449p37l44
57556A33148J65J063K019K615K713K304J554J060J318J831J471nj611k441k576
57541A44628k346j738r71o76q36m69Q97K199K180J049o3o51q92p33m4O30N61o6
57523A42659m25l19k49k80J36J095J793J574P96L49O32J289J724J641J286J137
57507A54838J320J377P85l45j301j436p70L0J36p25j963k726k780k592k520k413
$$ y = [207625, 206553, 205727, 205117, 204572, 203572, 201930, 200238, 198913, 197344, 194833, 191857, 189440, 187692, 185979, 184183, 182780, 181879, 181146, 180530, 180184, 179809, 178998, 178075, 177713, 177812, 177631, 176910, 175961, 174741, 172834, 170315, 167688, 164913, 161485, 157627, 154431, 152529, 151502, 150875, 150814, 151407, 152044, 152095, 151658, 151175, 150768, 150341, 149920, 149449, 148613, 147299, 145972, 145205, 144981, 144770, 144230, 143553, 143088, 142770, 142021, 140330, 137926, 135678, 134229, 133492, 133148, 133313, 134376, 136395, 139010, 141723, 144027, 145581, 146641, 147959, 149790, 151261, 151256, 149645, 147204, 144628, 142282, 140544, 139573, 138897, 138061, 137592, 138489, 140688, 142868, 143917, 143854, 143203, 142311, 141578, 141534, 142164, 142725, 142659, 142234, 141915, 141666, 141386, 141522, 142617, 144410, 145984, 146780, 147129, 147761, 149050, 150774, 152415, 153701, 154838, 156158, 157535, 158320, 157975, 156674, 155238, 154468, 154498, 154634, 153909, 151946, 149220, 146440, 143848, 141328, 138915]
57491A38915k086j667j245o46J37P08P64M78J08l56p96p54OJ014J613J637J255
57474A39085N10n05j361j738j864k102k222j687n50M14N57J7n64p47o85q56j395
57457A24307j797j462m59N30R96R79P46N26N49Q29Q64J60q65j168n47M1o0j83
57439A23986N71J864K512J994Q64j44p47r38q02n80n07n25l64O2M96O09L64J40
57421A28855M24J204J851J816J297Q21M90J72J14N35Q67L26o91r24m0Q48Q59L89
57403A39213J14rj18J13P02R21L98j61j05J59O3p9J34K73l7l3J115K737L442L082
57383A51924K665K626K490K111J976K113J869J010J66j26p0j08l29o53j042j343
57367A65279j391j254j163j167j208j251j061j76J362K647K870K336J909J788
$$ y = [138915, 136829, 135162, 133917, 133271, 133408, 134116, 134880, 135358, 135466, 135110, 134314, 133560, 133566, 134580, 136193, 137830, 139085, 139595, 139090, 137729, 135991, 134127, 132025, 129803, 128116, 127566, 127980, 128537, 128554, 127990, 127243, 126558, 125702, 124307, 122510, 121048, 120589, 121119, 122115, 123094, 123840, 124366, 124915, 125744, 126608, 126768, 125903, 124735, 124188, 124229, 124169, 123986, 124557, 126421, 128933, 130927, 131791, 131647, 130900, 129962, 129160, 128580, 128073, 127548, 127184, 127246, 127742, 128351, 128715, 128855, 129279, 130483, 132334, 134150, 135447, 136268, 136758, 136930, 137044, 137579, 138446, 138772, 138081, 137157, 137117, 137965, 138824, 139213, 139327, 139318, 139200, 139313, 140015, 140936, 141334, 141173, 141068, 141227, 141290, 141211, 141345, 141618, 141581, 141548, 142663, 145400, 148842, 151924, 154589, 157215, 159705, 161816, 163792, 165905, 167774, 168784, 168950, 168824, 168754, 168646, 168317, 167664, 166622, 165279, 163888, 162634, 161471, 160304, 159096, 157845, 156784, 156608, 157970, 160617, 163487, 165823, 167732, 169520]
57353A69520J550J107Q54R45J151J331J460J363J016Q52J102J167L68q89j550
57338A81347j368j029r69q98n46j20J29J28j88p27r80n30L14R41J279J546J470
57321A79799O84l62p94o17n77q08n78L64J213J196M73l16p76q17o14o30j069j295
57303A74476n10R71J883J624Q97N42N79O46O66O68O12P25J441K666L533L312K162
57286A96893Q98K52M04R37J232J257J642K542K960K011M75p8N33R87M90l48q11
57269B12276r31p29J36J394K028J725J411J724K023J709J403J841K498K435J817
57254B32760J506J638J735J813K263K822K747J994J329J173J174J018R97J456
57240B56425K212K774K876K598K167J795J608J699K155K918L611L738L191K281
$$ y = [169520, 171070, 172177, 173031, 173976, 175127, 176458, 177918, 179281, 180297, 181149, 182251, 183418, 183786, 182897, 181347, 179979, 178950, 177981, 177083, 176537, 176417, 176546, 176674, 176486, 175759, 174779, 174249, 174563, 175504, 176783, 178329, 179799, 180483, 180121, 179327, 178710, 178133, 177325, 176747, 177111, 178324, 179520, 179993, 179677, 178901, 178084, 177470, 176840, 175771, 174476, 173966, 174937, 176820, 178444, 179341, 179883, 180462, 181108, 181774, 182442, 183054, 183779, 185220, 187886, 191419, 194731, 196893, 197791, 198043, 198447, 199384, 200616, 201873, 203515, 206057, 209017, 211028, 211503, 211425, 211958, 212945, 213435, 213087, 212276, 211345, 210616, 210752, 212146, 214174, 215899, 217310, 219034, 221057, 222766, 224169, 226010, 228508, 230943, 232760, 234266, 235904, 237639, 239452, 241715, 244537, 247284, 249278, 250607, 251780, 252954, 253972, 254969, 256425, 258637, 261411, 264287, 266885, 269052, 270847, 272455, 274154, 276309, 279227, 282838, 286576, 289767, 292048]
57226B92048J318M85J69P95K087L013K875K106J649J869K455L058L574L945M157
57211C25603M288M303L945L128K236J784J874K252K710L196L621L810L675L336
57197C69761L147L501M386N207N346M906M514M489M589M608M660M849N160N789
57183D34912O973Q316Q953Q697Q459R105J0461J1862J3143J4563J6145J7627J8875
57170E88091J9892K0610K1092K1598K2106K2125K1461K0828K1059K1924K2345
57159H23131K1758K0637J9612J8655J7464J6228J5517J5504J5703J5614J5381
57148A015204J5545J6379J7768J9635K2004K4511K6505K7957K9703L2322L5237
57137A282770L7621L9696M2244M5249M8043N0660N3816N7323N9817O0704O1482
$$ y = [292048, 293366, 293851, 294020, 294815, 296902, 299915, 302790, 304896, 306545, 308414, 310869, 313927, 317501, 321446, 325603, 329891, 334194, 338139, 341267, 343503, 345287, 347161, 349413, 352123, 355319, 358940, 362750, 366425, 369761, 372908, 376409, 380795, 386002, 391348, 396254, 400768, 405257, 409846, 414454, 419114, 423963, 429123, 434912, 441885, 450201, 459154, 467851, 476310, 485415, 495876, 507738, 520881, 535444, 551589, 569216, 588091, 607983, 628593, 649685, 671283, 693389, 715514, 736975, 757803, 778862, 800786, 823131, 844889, 865526, 885138, 903793, 921257, 937485, 953002, 968506, 984209, 999823, 1015204, 1030749, 1047128, 1064896, 1084531, 1106535, 1131046, 1157551, 1185508, 1215211, 1247533, 1282770, 1320391, 1360087, 1402331, 1447580, 1495623, 1546283, 1600099, 1657422, 1717239, 1777943, 1839425]
57126A839425O4363O9983P7045Q3855Q9745R5343J01780J09521J17837J25718
57116B774615J33254J41510J51137J61820J73267J85919K00353K16739K35327
57107D373941K56832K81902L10886L44709L85561M36281M99640N78721O77642
57098H146115Q01444R55631J146149J379202J660177J992063K373925K799410
57090B1254116L255793L724893M185721M617055M998707N312321N542392N676622
57082E8567620N704071N609893N367557M934434M260437L312459K101525O92614
57074I0550610q09605k286621l627975m745263n581439o114790o355247o335869
57066E4693801o105153n720483n239759m712717m176883l658882l176725k740695
$$ y = [1839425, 1903788, 1973771, 2050816, 2134671, 2224416, 2319759, 2421539, 2531060, 2648897, 2774615, 2907869, 3049379, 3200516, 3362336, 3535603, 3721522, 3921875, 4138614, 4373941, 4630773, 4912675, 5223561, 5568270, 5953831, 6390112, 6889752, 7468473, 8146115, 8947559, 9903190, 11049339, 12428541, 14088718, 16080781, 18454706, 21254116, 24509909, 28234802, 32420523, 37037578, 42036285, 47348606, 52890998, 58567620, 64271691, 69881584, 75249141, 80183575, 84444012, 87756471, 89857996, 90550610, 89741005, 87454384, 83826409, 79081146, 73499707, 67384917, 61029670, 54693801, 48588648, 42868165, 37628406, 32915689, 28738806, 25079924, 21903199, 19162504]
57058A9162504k354619k018327j729415j483638j275531j099748r51544q26302
57050G423380p19667o28404n50333m83369m25400l75006l31338k93222k59304
57041C357337k29224k03517j82055j63451j46367j30605j16449j03577r1166p8549
57031A912377o5348n1312l6330k0283k526J7948M0999O3229P7351P4646N0089
57020B060840O733m4850r2142j26497j44841j48082j39630j24544j07805r2150
57010A047032p7889o4758n3236m4042l7211l2069k7653k3230j8835j5268j3105
56999F39736j1905j0939j0316j0601j1519j2017j1624j0930j0506j0123r213p501
56987E12542m976j804J617M858P665R547R478O649J388n130j1858j7861k1871
$$ y = [19162504, 16807885, 14789558, 13060143, 11576505, 10300974, 9201226, 8249682, 7423380, 6703713, 6075309, 5524976, 5041607, 4616207, 4241201, 3909863, 3616641, 3357337, 3128113, 2924596, 2742541, 2579090, 2432723, 2302118, 2185669, 2082092, 1990926, 1912377, 1847029, 1795717, 1759387, 1739104, 1736578, 1754526, 1795525, 1858754, 1936105, 2010751, 2060840, 2067573, 2022723, 1930581, 1804084, 1659243, 1511161, 1371531, 1246987, 1139182, 1047032, 969143, 904385, 851149, 807107, 769896, 737827, 710174, 686944, 668109, 652841, 639736, 627831, 616892, 606576, 595975, 584456, 572439, 560815, 549885, 539379, 529256, 520043, 512542, 507566, 505762, 507379, 512237, 519902, 529449, 538927, 545576, 546964, 541834, 529976, 512115, 490244]
56974D90244k2956k1652j9503j7457j5411j3207j1025q794o198l435j087R88L720
56961C54227P555J1835J5709J8866K1083K1721K0025J5567Q391p21j0094j7962
56949D66202k3467k6547k7182k5560k2683j9740j6909j3630r865o117k353J866
56937B74015O236R986J3322J7310K2066K6441K9616L1476L1049K6382J6906M610
56925E09415p960j9535k9122l4902l5796l3231k9781k6531k3069j9337j6030j3376
56913B20745j1023r105q220q153p735o347m768m107m427m754m153k509m35J368
56899A46377K629L496M176M790N476O352P450Q948J1250J4408J7706K0406K2709
56886B76173K5075K6714K5784K1384J4415O298k085r802j5444j8205j8694j7910
$$ y = [490244, 467288, 445636, 426133, 408676, 393265, 380058, 369033, 360239, 354041, 350606, 349519, 350507, 354227, 361782, 373617, 389326, 408192, 429275, 450996, 471021, 486588, 494979, 494258, 484164, 466202, 442735, 416188, 389006, 363446, 340763, 321023, 304114, 290484, 280619, 274502, 272149, 274015, 280251, 290237, 303559, 320869, 342935, 369376, 398992, 430468, 461517, 487899, 504805, 509415, 501455, 481920, 452798, 417896, 382100, 348869, 319088, 292557, 269488, 250151, 234121, 220745, 209722, 200617, 192397, 184244, 176509, 170162, 165394, 161287, 156860, 152106, 147953, 145444, 145009, 146377, 149006, 152502, 156678, 161468, 166944, 173296, 180746, 189694, 200944, 215352, 233058, 253464, 276173, 301248, 327962, 353746, 375130, 389545, 395843, 393758, 383956, 368512, 350307, 331613, 313703]
56874C13703j6082j3122r496n823k128J789N734R629J4123J9885K6592L3356L9868
56861D18028M6380N2566N6883N7038N1020L8261K0413P84j7357l1864m1443m5431
56849F05278m4367m0029l4126k7368k0025j2617n377K204J0554J9448K8828L9500
56837E21903N1991O5341P7831Q8173R4824R4760Q4675O3731L4525J574l0315n6750
56825A092263p4693q3575q5006q1107p3434o3342n2279m1309l0726k0446j0411
56814D75935o20Q911J8178K7403L7067M7279N7061O4477O7206O2920M9941K8708
56802I44466K600k3332m4911o0121o8588p0743o7583o0603n1567m2235l3931k6963
56790C96489k0659j4352q047j932M241J0707J7079K2899K8295L3191L6121L4851
$$ y = [313703, 297621, 284499, 275003, 269180, 267052, 268841, 274575, 284204, 298327, 318212, 344804, 378160, 418028, 464408, 516974, 573857, 630895, 681915, 720176, 740589, 741373, 724016, 692152, 650709, 605278, 560911, 520882, 486756, 459388, 439363, 426746, 421369, 423573, 434127, 453575, 482403, 521903, 573894, 639235, 717066, 805239, 900063, 994823, 1079498, 1143229, 1177754, 1179328, 1149013, 1092263, 1017570, 933995, 848989, 767882, 694448, 631106, 578827, 537518, 506792, 486346, 475935, 475315, 484226, 502404, 529807, 566874, 614153, 671214, 735691, 802897, 865817, 915758, 944466, 947066, 923734, 878823, 818702, 750114, 679371, 611788, 551185, 499618, 457383, 423452, 396489, 375830, 361478, 353431, 351499, 355740, 366447, 383526, 406425, 434720, 467911, 504032, 538883]
56778E38883K8369J7558M096j0400k4055l4763m1167m3430m2600l9696l5520l0925
56766B86350k6640k2924j9567j6346j3397j1140r757q839p786o534n547n002m531
56753A28340l934l538l507l410k986k681k831k893k278j398j001q61k35O69Q24
56738I8280L7o66m99J19M15L03J55J68L10M77M16j06p97r20j40J032J783J752
56720A02119J130M05M8J60L33K03M6M19J165J432Q36Q5O7O76J025O37k3k55oK05
56700A10707J14M2K84N02J94m85q98q79q06p12j35Q37J267O85m8O8P83J261J528
56681A14309K179K950K785J447L0l62K35J049J438J179M23l26o09m68k38O5O04
56664A26690J095R71K79j88J01P77J113Q04pj055j944k181j517k13J167K161K539
$$ y = [538883, 567252, 584810, 588906, 578506, 554451, 519688, 478521, 435091, 392491, 352795, 317275, 286350, 259710, 236786, 217219, 200873, 187476, 176336, 166579, 157740, 149954, 143420, 137873, 132871, 128340, 124406, 120868, 117361, 113951, 110965, 108284, 105453, 102560, 100282, 98884, 97883, 97022, 96787, 97456, 98280, 98317, 97651, 97152, 97271, 97686, 97989, 98144, 98312, 98622, 99099, 99515, 99409, 98612, 97692, 97552, 98584, 100367, 102119, 103249, 103654, 103702, 103862, 104195, 104398, 104444, 104863, 106028, 107460, 108296, 108381, 108448, 109124, 110149, 110786, 110763, 110508, 110502, 110707, 110821, 110863, 111147, 111649, 111843, 111358, 110460, 109581, 108775, 108063, 107928, 108765, 110032, 110717, 110669, 110737, 111520, 112781, 114309, 116488, 119438, 122223, 123670, 123700, 123338, 123573, 124622, 126060, 127239, 127662, 127336, 126727, 126259, 126021, 126086, 126690, 127785, 128756, 129035, 128847, 128948, 129725, 130838, 131642, 131635, 130580, 128636, 126455, 124938, 124725, 125892, 128053, 130592]
56647A30592K299J659J009O79O91P12L13n81j516j927j664r77j02P06R79M40m26
56630A32886q06o27m89n24k21M00M87l32j265j590j599j591r93N04J766J458o5
56613A27399j291j606j605j694j577j113n95j41L36N99L22k41n46o22q30j021
56597A15774p13j6N18P69J006J150R38O15O18P39N29K38L94P21O08M10J018K135
56579A27451K375J301J59J87J178K129K430K026J221O76R71J883K658L089L636
56564A53370M460N153N553O068P026Q376R991J1553J2103J0687P570M088J237
56551B47235q70k292k960l102l074k700j658m40Qm34j136j899k894l595l187k191
56535B14811k070k963l361k566j914k641l924m149l193k255k053k226k163j642
$$ y = [130592, 132891, 134550, 135559, 136238, 136929, 137641, 137954, 137373, 135857, 133930, 132266, 131289, 131187, 131893, 132872, 133312, 132886, 132080, 131453, 130964, 130440, 130219, 130619, 131106, 130774, 129509, 127919, 126320, 124729, 123736, 124240, 126006, 127464, 127399, 126108, 124502, 122897, 121203, 119626, 118513, 117918, 117777, 118113, 118712, 119034, 118793, 118247, 117625, 116795, 115774, 115061, 115045, 115563, 116332, 117338, 118488, 119426, 120041, 120659, 121398, 121927, 122165, 122559, 123280, 123888, 124298, 125316, 127451, 129826, 131127, 131286, 131473, 132651, 134780, 137210, 139236, 140457, 141133, 142104, 143987, 146645, 149734, 153370, 157830, 162983, 168536, 174604, 181630, 190006, 199997, 211550, 223653, 234340, 241910, 245998, 247235, 246365, 244073, 241113, 238011, 234937, 232237, 230579, 230139, 230147, 229713, 228577, 226678, 223784, 220189, 217002, 214811, 212741, 209778, 206417, 203851, 201937, 199296, 195372, 191223, 188030, 185775, 183722, 181496, 179333, 177691]
56521A77691q41k12j14l77n77p21j127j686k037k409l309m278m130k671j068j89
56505A51945K77O91O90J97n7K58L65k97j053j160j031j364j792j456m19M87Q19
56488A47100P98P27P57J008J325J248N61l89j084j181m43J028K404K685J892R43
56472A59379L78K6l4O49J743K126J469P60P29Q67N95K52J83o0p82j332j122n75
56454A65251l53l68l01k19j6P80J949K255J194O6K65J287J590P82j90o33p12o53
56436A71974l51K30P87R18M12m55q83l74L92K66p13j311r57m33l57k43L15P46
56418A69963N63K94M89P95P59O17N15M7p13p60K87J324J366R84J042J152O48Q9
56400A79461M31J318J556Q43j07p20q43l61N32J136J036O82N45L91kk32o2P3M1
$$ y = [177691, 176850, 176638, 176524, 176147, 175570, 174849, 173722, 172036, 169999, 167590, 164281, 160003, 155873, 153202, 152134, 151945, 152222, 152913, 153603, 153800, 153743, 154001, 154366, 154069, 153016, 151856, 150825, 149461, 147669, 146213, 145794, 146281, 147100, 147898, 148625, 149382, 150390, 151715, 152963, 153524, 153135, 152051, 150870, 150427, 151455, 153859, 156544, 158436, 159379, 159757, 159783, 159749, 160398, 162141, 164267, 165736, 166496, 167225, 168092, 168687, 168939, 169122, 169062, 168280, 166948, 165826, 165251, 164898, 164530, 164229, 164010, 163994, 164774, 166723, 168978, 170172, 170238, 170503, 171790, 173380, 174162, 173972, 173339, 172627, 171974, 171623, 171853, 172640, 173558, 173970, 173515, 172632, 172258, 172650, 172916, 172203, 170892, 169935, 169502, 169145, 168902, 169217, 169963, 170526, 170820, 171309, 172104, 172863, 173480, 173995, 174042, 173329, 172569, 172856, 174180, 175546, 176530, 177572, 178724, 179372, 179461, 179892, 181210, 182766, 183609, 183502, 182782, 181939, 181578, 182110, 183246, 184282, 184964, 185509, 185900, 185898, 185666, 185604, 185677, 185718]
56381A85718M49J400J899J377O95O79Q08M09l9L8J13l34o16n8O79P67O49R81J306
56362A96920J157J273K127K495J248m51o72M55J345J534J684J736J159M82O58
56347B13150J293J337J026J257J587R20k22k37R38J871K143K729L834M411M138
56332B40175L949M285M465M162L953M024L812L175K670K425K018J537J501J698
56318B83849J366M99j91n57r40j069l88O59J065Q79R99J535J862K034K632L336
56302B97570L262K706K947M212N356N607N247M629L875L569M257N327N616N032
56288C59212M337L797L401L828N446O950O922O268O982Q892J0031R964J0229J1387
56274D57646J2249J2465J3255J4925J6100J6346J7240J9680K2188K3239K3556
$$ y = [185718, 186167, 187567, 189466, 190843, 191538, 192217, 193025, 193434, 193395, 193433, 193546, 193212, 192596, 192538, 193217, 193984, 194633, 195614, 196920, 198077, 199350, 201477, 203972, 205220, 204769, 204097, 204552, 205897, 207431, 209115, 210851, 212010, 212492, 213150, 214443, 215780, 216806, 218063, 219650, 220570, 220348, 220111, 221049, 222920, 225063, 227792, 231626, 236037, 240175, 244124, 248409, 252874, 257036, 260989, 265013, 268825, 272000, 274670, 277095, 279113, 280650, 282151, 283849, 285215, 285714, 285523, 284966, 284026, 282957, 282569, 283228, 284293, 285172, 286171, 287706, 289568, 291602, 294234, 297570, 300832, 303538, 306485, 310697, 316053, 321660, 326907, 331536, 335411, 338980, 343237, 348564, 354180, 359212, 363549, 367346, 370747, 374575, 380021, 386971, 393893, 400161, 407143, 416035, 426066, 436030, 446259, 457646, 469895, 482360, 495615, 510540, 526640, 542986, 560226, 579906, 602094, 625333, 648889]
56263F48889K4789K7341L0610L4255L8147M2100M6463N2041N8966O6551P4608
56252A144760Q3699R3882J04531J15629J27829J40892J53526J65008J75557J84743
56242B490056J91113J93761J92815J88069J78636J64306J45639J22517R4316O1949
56232D023177K8117n006l6809o6765r3713j17028j36789j52389j62774j68453
56222C111568j71391j72396j70499j65417j58524j50732j41463j30745j20325
56213A730076j11618j04060r6497q8704q0801p2758o5252n9423n5031n0503m5370
56202I00059m0894l7634l4399l0484k6991k4758k2869k0370j7823j5960j4372
56191F13505j2698j1623j1540j1484j0401q391o050l944l056m030n531n258l187
$$ y = [648889, 673678, 701019, 731629, 765884, 804031, 846131, 892594, 944635, 1003601, 1070152, 1144760, 1228459, 1322341, 1426872, 1542501, 1670330, 1811222, 1964748, 2129756, 2305313, 2490056, 2681169, 2874930, 3067745, 3255814, 3434450, 3598756, 3744395, 3866912, 3961228, 4023177, 4051294, 4046288, 4009479, 3942714, 3849001, 3731973, 3595184, 3442795, 3280021, 3111568, 2940177, 2767781, 2597282, 2431865, 2273341, 2122609, 1981146, 1850401, 1730076, 1618458, 1514398, 1417901, 1329197, 1248396, 1175638, 1110386, 1050963, 995932, 945429, 900059, 859165, 821531, 787132, 756648, 729657, 704899, 682030, 661660, 643837, 627877, 613505, 600807, 589184, 577644, 566160, 555759, 547368, 541318, 537374, 534318, 530288, 524757, 519499, 516312]
56178E16312j749k096k519j578l99m28j020r29l57O2P77K232L634M222M499N056
56162E25719N494N542N857O714P334P351P520Q110Q375Q337R248J1385J3288J4191
56148F44465J5348J7887K1307K5118K9900L5687M1406M7004N4056O3081P2343
56137A067602Q0400Q7387R2593R3396Q8362P9282O8656N7481M6925L9372L5596
56126A837052L3046K9049K3686J7791J0563J437p679j4485j9053k2805k6517l1120
56114A830965l8376m8688n9950p0094p8797q5245q6912q2762p5267o7134n8352
56103A079388m8603l9780l3422k8015k1750j5839j2303j0447q382o214m906l817
56091H45910k063o19m22j06J739L838M343L940M241M977N333O176Q153R583Q994
$$ y = [516312, 514563, 512467, 509948, 508370, 507971, 507543, 506523, 505594, 505237, 505299, 506076, 508308, 511942, 516164, 520663, 525719, 531213, 536755, 542612, 549326, 556660, 564011, 571531, 579641, 588016, 596353, 605601, 616986, 630274, 644465, 659813, 677700, 699007, 724125, 754025, 789712, 831118, 878122, 932178, 995259, 1067602, 1148002, 1235389, 1327982, 1421378, 1509740, 1589022, 1657678, 1715159, 1762084, 1801456, 1837052, 1870098, 1899147, 1922833, 1940624, 1951187, 1952624, 1944945, 1930460, 1911407, 1888602, 1862085, 1830965, 1792589, 1743901, 1683951, 1613857, 1535060, 1449815, 1362903, 1280141, 1204874, 1137740, 1079388, 1030785, 991005, 957583, 929568, 907818, 891979, 879676, 869229, 860847, 854633, 849727, 845910, 843847, 843228, 842806, 842700, 844439, 848277, 852620, 856560, 860801, 865778, 871111, 877287, 885440, 895023, 904017]
56076I04017P936Q409R495R397Q850R401J0238R856R181R847J1074J1316J1334
56063A030351J2572J4168J4637J4875J6349J7956J7781J6456J5820J5844J5644
56052A202453J5710J6428J6432J5117J4557J6017J7247J6367J5675J7930K1507
56041A385440K3025K2443K1732K1048K0110K0877K4703K9067L1134L2135L4488
56030A666202L7311L8885M0523M3619M5879M5185M4113M5673M7745M7107M5806
56019B148048M7843N2256N5380N7303O0225O2977O3359O3472O6596P1114P3549
56008B822122P5021P8566Q2798Q4831Q6657R1817R8450J02711J06264J13131J21864
55997C864232J28486J34353J43270J53650J61690J69465J81436J95710K07518
$$ y = [904017, 911953, 920362, 929857, 939254, 948104, 957505, 967743, 977599, 986780, 996627, 1007701, 1019017, 1030351, 1042923, 1057091, 1071728, 1086603, 1102952, 1120908, 1138689, 1155145, 1170965, 1186809, 1202453, 1218163, 1234591, 1251023, 1266140, 1280697, 1296714, 1313961, 1330328, 1346003, 1363933, 1385440, 1408465, 1430908, 1452640, 1473688, 1493798, 1514675, 1539378, 1568445, 1599579, 1631714, 1666202, 1703513, 1742398, 1782921, 1826540, 1872419, 1917604, 1961717, 2007390, 2055135, 2102242, 2148048, 2195891, 2248147, 2303527, 2360830, 2421055, 2484032, 2547391, 2610863, 2677459, 2748573, 2822122, 2897143, 2975709, 3058507, 3143338, 3229995, 3321812, 3420262, 3522973, 3629237, 3742368, 3864232, 3992718, 4127071, 4270341, 4423991, 4585681, 4755146, 4936582, 5132292, 5339810]
55988E339810K18530K33701K51898K68977K86936L10232L36271L59977L84453
55979G990785M16367M54363M93299N36012N88779O49350P12494P83081Q69861
55970A3494391R71189J082029J209833J366990J553225J764121K011562K315882
55962B5769222K684375L120958L651583M315709N140504O153562P414366Q998786
55954F7249065J0958461J3333600J6195423J9619484K3603379K8023854L2581643
55947B11564909L6597461L8810298L7616482L1869198K1673150Q480021n540839
55940C81070680j8272557k8121781l4232604l6578239l5850005l3088526k9272982
55933A65653986k5126564k1128918j7561584j4528879j2012900r955733q296376
$$ y = [5339810, 5558340, 5792041, 6043939, 6312916, 6599852, 6910084, 7246355, 7606332, 7990785, 8407152, 8861515, 9354814, 9890826, 10479605, 11128955, 11841449, 12624530, 13494391, 14465580, 15547609, 16757442, 18124432, 19677657, 21441778, 23453340, 25769222, 28453597, 31574555, 35226138, 39541847, 44682351, 50835913, 58250279, 67249065, 78207526, 91541126, 107736549, 127356033, 150959412, 178983266, 211564909, 248162370, 286972668, 324589150, 356458348, 378131498, 386611519, 381070680, 362798123, 334676342, 300443738, 263865499, 228015494, 194926968, 165653986, 140527422, 119398504, 101836920, 87308041, 75295141, 65339408, 57043032]
55926E7043032o961865n874942m982261m254381l660231l163957k744329k394509
55918B3006557k102254j848716j625737j435950j275632j133364j005248q96084
55910A1683572q05124p24427o51361n89842n38963m92359m48964m13111l83970
55901F635451l55430l26469l01535k80850k59906k38467k20786k06990j92980
55892D252038j78579j67332j58681j48563j37346j28965j22732j14167j03527
55883B992146r5486r0518q4609p7491p3373p3138p3294p2972p4749p7985p8519
55872B120012p5701p3111p1691o8594o3517n9708n7842n4968n0361m6528m3633
55861A454358l8791l1812k6116k3021k0427j7881j7455j8812j8814j7066j6747
$$ y = [57043032, 50081167, 44206225, 39223964, 34969583, 31309352, 28145395, 25401066, 23006557, 20904303, 19055587, 17429850, 15993900, 14718268, 13584904, 12579656, 11683572, 10878448, 10154021, 9502660, 8912818, 8373855, 7881496, 7432532, 7019421, 6635451, 6280021, 5953552, 5652017, 5371167, 5111261, 4872794, 4652008, 4445018, 4252038, 4073459, 3906127, 3747446, 3598883, 3461537, 3332572, 3209840, 3095673, 2992146, 2896660, 2806142, 2721533, 2644042, 2570669, 2497531, 2424237, 2351265, 2276516, 2198531, 2120012, 2044311, 1971200, 1899509, 1830915, 1767398, 1707690, 1649848, 1594880, 1544519, 1497991, 1454358, 1415567, 1383755, 1357639, 1334618, 1314191, 1296310, 1278855, 1260043, 1241229, 1224163, 1207416]
55850A207416j8908k0993k2025k4046k7243k8575k6846k4599k3536k2419k0814
55839I47412k0507k1666k1732j9716j7779j7178j6276j4051j2070j1466j1114
55828G63857j0122r156q404p197o337p689j0758j2754j2699j2381j2725j2568
55816F41067j1574j1102j1334j0727r057p946p789p184n897n259n151l846j404
55803E42797Q6J66O72K135K943K705L010L967L445P74j991l501m663n902o123
55788E40520n423n540o513o075l669j905k687m821o824r099j1822j3446j3021
55775D49675j1613j0087p805m667j914J06K484N006N516L194j50l085o093r006
55761D11561r905q210o138n401m922l473k051j808j951j515j266k094l390m565
$$ y = [1207416, 1188508, 1167515, 1145490, 1121444, 1094201, 1065626, 1038780, 1014181, 990645, 968226, 947412, 926905, 905239, 883507, 863791, 846012, 828834, 812558, 798507, 786437, 774971, 763857, 753735, 744579, 736175, 728978, 722641, 714952, 704194, 691440, 678741, 666360, 653635, 641067, 629493, 618391, 607057, 596330, 587273, 579327, 571538, 564354, 558457, 553198, 548047, 544201, 542797, 542883, 543049, 543721, 545856, 548799, 551504, 554514, 558481, 561926, 562700, 560709, 557208, 552545, 546643, 540520, 535097, 529557, 523044, 516969, 513300, 511395, 508708, 503887, 497063, 487964, 476142, 462696, 449675, 438062, 427975, 420170, 415503, 413589, 413695, 416179, 421185, 426701, 429895, 429745, 426660, 420567, 411561, 401656, 393446, 387308, 381907, 376985, 373512, 371461, 369653, 367702, 366187, 364921, 362827, 359437, 354872]
55747C54872o235q458r738r237q135p524o786n439m515m646m659l558k125j329
55733B72488q87o07j165k325k474j267o36j783l295l761m043n164o048n378l951
55718B29704l172k760j817p27j89L62J609K926L634M361N563O108M910K800J174
55703B54486J5j268k329k763l343m742o069o127n241m522m316m463m950n239m210
55688A94919j944k18j20n50k46L00L50O37J916L174L080K093J454J104K16j108
55672B05057k180k874l213k759j652j041j316j157K69J609J344K38kO57J081J042
55656A95103J068J082R13J240K438L291K564J033L02L59M8q00j381j628k121k746
55640B00765k955k995l516m322m731m756m703m245l122k084j951k298k272j995
$$ y = [354872, 348637, 340179, 330441, 321204, 313069, 305545, 298759, 293320, 288805, 284159, 279500, 275942, 273817, 272488, 271601, 270994, 269829, 267504, 265030, 263763, 263127, 261344, 258049, 254288, 250245, 245081, 239033, 233655, 229704, 226532, 223772, 221955, 221228, 221039, 221401, 223010, 225936, 229570, 233931, 239494, 245602, 250512, 253312, 254486, 254501, 253233, 250904, 248141, 244798, 240056, 233987, 227860, 222619, 218097, 213781, 209318, 204368, 199129, 194919, 192975, 192757, 192637, 192087, 191841, 192141, 192491, 193128, 195044, 198218, 201298, 203391, 204845, 205949, 206165, 205057, 202877, 200003, 196790, 194031, 192379, 191338, 190022, 188865, 189134, 190743, 192087, 192325, 192323, 192980, 194061, 195103, 196171, 197253, 198166, 199406, 201844, 205135, 207699, 208732, 209034, 209393, 209441, 208641, 207260, 205632, 203511, 200765, 197810, 194815, 191299, 186977, 182246, 177490, 172787, 168542, 165420, 163336, 161385, 159087, 156815, 154820]
55626A54820j955j806j122n70q57j285p98J90M65m0m60o05r34j363j520j720k421
55609A38019l132l104k551k081j538o52r0m59j056r57n66o75q16k34L30l00j548
55592A18590j864j222q94j064p32J59N05M5k14J49M02J70L0K42L40K60N99J394
55574A16895J851J673J495J795K277K645L038L531L894L971L675K732J170l06
55560A50336j151j791k766l591l509k870k581k628k360j871j752j815j402o93
55546A19556m27n58m58j55p0J48J070K072J963R06J81J59P4k69k12K60L44r5l54
55527A24135l64q22j631j842j409j442k279k857k523k019j970j851j136l42j04
55512A01544k68n22j009j667j907j555j210j227j208r54r20j195j044j60N49K59
$$ y = [154820, 152865, 151059, 149937, 149367, 148510, 147225, 146427, 146617, 147082, 147042, 146582, 145977, 145043, 143680, 142160, 140440, 138019, 134887, 131783, 129232, 127151, 125613, 124961, 124871, 124412, 123356, 122399, 121833, 121158, 120342, 120108, 120438, 120138, 118590, 116726, 115504, 114610, 113546, 112814, 112973, 113478, 113523, 113309, 113458, 113860, 114030, 114060, 114302, 114642, 114902, 115501, 116895, 118746, 120419, 121914, 123709, 125986, 128631, 131669, 135200, 139094, 143065, 146740, 149472, 150642, 150336, 149185, 147394, 144628, 141037, 137528, 134658, 132077, 129449, 127089, 125218, 123466, 121651, 120249, 119556, 119129, 118571, 118113, 117958, 117888, 118036, 119106, 121178, 123141, 124047, 124228, 124387, 124461, 124192, 123980, 124240, 124584, 124489, 124135, 123771, 122949, 121318, 119476, 118067, 116625, 114346, 111489, 108966, 106947, 104977, 103126, 101990, 101648, 101544, 101276, 100754, 99745, 98078, 96171, 94616, 93406, 92179, 90971, 90017, 89097, 87902, 86858, 86698, 87247, 87506]
55496H7506m98o24LN51M88J12k2K03L57k0o49o10M34J504J467N33k09l61k54J85
55476I0096J262K268J897J82j300j521j095r33j056j171j298j233n58L41L78m80
55460H5779p80L13J598J500K55o46n32j0J94p8o53j167j116l77N22R84R97Q85
55442H7668P27M27J9m03q00r97p39j17M26O35O46N94M90N11Q54J242J142N44m1
55423I2828l29m19k50K74O65K34q09j553j751j935k057j281M41J750J551L77n40
55406H7196p33m21J48N32J07j069j958j829j159o65k06N91J302J219M76j93m69
55389H2869m88k49L06Q44R34O51L82K82L05L96L00l57j443k140j923j232p30m12
55371G8295L6M70M96J85n7k8K07M85M63j33r04j004l30K07J15J50R57J795J611
$$ y = [87506, 87008, 86384, 86387, 86938, 87426, 87538, 87516, 87719, 88076, 88056, 87407, 86797, 87231, 88735, 90202, 90735, 90526, 90165, 89911, 90096, 91358, 93626, 95523, 95705, 94405, 92884, 91789, 90856, 89800, 88629, 87331, 86098, 85540, 85881, 86259, 85779, 84999, 85312, 86910, 88410, 88665, 88019, 87487, 87477, 87671, 87593, 86940, 85773, 84657, 84280, 84802, 85786, 86783, 87668, 88395, 88822, 88841, 88438, 87638, 86641, 85902, 85785, 86211, 86846, 87492, 88086, 88576, 89087, 89941, 91183, 92325, 92869, 92828, 92499, 92080, 91830, 92104, 92769, 93003, 92194, 90641, 88890, 86955, 84898, 83617, 84058, 85808, 87359, 87736, 87196, 86463, 86042, 86190, 86722, 86829, 85760, 83802, 81973, 80814, 80149, 79943, 80534, 81836, 83055, 83531, 83338, 82869, 82381, 82132, 82438, 83282, 84216, 84867, 85249, 85531, 85836, 86232, 86532, 86175, 84732, 82592, 80669, 79437, 78707, 78295, 78331, 78801, 79297, 79482, 79425, 79397, 79604, 80089, 80552, 80419, 79515, 78511, 78181, 78388, 78503, 78653, 79610, 81405, 83016]
55352H3016P21K13J08m73j547k017j381m69p6P5N22J026J009M91J5o4K04O84J190
55333H3247J396R82j9j166j865j757r78r4M07N25N68O35M88j2o10q99p86n91o62
55314G8809r20q94k92N31Q91N69J6k45j40J45N23R32J117P97Mr05j497j484q91
55295G7066j07L79M15K25j7l25o00m81J48Q52J125J018Q78O47j18j345k091j484
55277G6185P4J145Q59j10m96n5M10L97L55O56Q23K85n82r29n35J62Q26J295J210
55258H1975M16m10l57M68J028P25K9l61k67J19M85M81O1k22Q9N02J79p20j168
55239H3052p99k74o5J06L26J41m30n77jM75K03k38q6L71M30J40m3j44l73l83K64
55218H2095J212J704J572J179O93O6n03q22j092j485j631j156l98Q9L80Q37J241
$$ y = [83016, 83737, 83950, 84058, 83585, 82038, 80021, 78640, 78171, 78095, 78170, 78692, 79718, 80727, 81218, 81233, 81169, 81373, 82057, 83247, 84643, 85625, 85606, 84440, 82575, 80818, 79840, 79746, 80153, 80678, 81246, 81881, 82369, 82357, 81747, 80848, 80062, 79471, 78809, 77889, 76995, 76703, 77234, 78125, 78694, 78710, 78465, 78325, 78470, 78993, 79925, 81042, 81839, 81843, 80938, 79441, 77957, 77066, 76959, 77338, 77753, 77978, 77961, 77636, 77036, 76555, 76703, 77555, 78680, 79698, 80576, 81223, 81105, 79760, 77669, 76185, 76259, 77404, 78263, 78153, 77657, 77602, 78012, 78409, 78764, 79420, 80243, 80528, 79946, 79017, 78482, 78644, 79470, 80765, 81975, 82391, 81981, 81624, 82092, 83120, 83845, 83874, 83513, 83246, 83365, 83850, 84331, 84392, 84170, 84259, 84761, 84940, 84220, 83052, 82253, 81979, 81914, 82020, 82346, 82487, 82057, 81480, 81479, 81954, 82157, 81919, 81833, 82204, 82634, 82774, 82731, 82587, 82214, 81831, 82095, 83307, 85011, 86583, 87762, 88455, 88521, 88018, 87196, 86104, 84619, 82988, 81832, 81434, 81523, 81903, 82740, 83981]
55201H3981J135P47O67P50K82p11j286r56l86l47o56o22j23L75N36M35J95k09
55183H3807p10r84p50j39L82N41N40P00R69J068R68Q73Q10N96K22j05l38n69o40
55164H7241k74L35O15M17K14L05M29L44K37K18N6k63l33o3J4l52n53r7M69L31
55144H9290l31o58l99q2q1k02j82LK97O02O90M84K69K71K89J21N8M38R40Q98K66
55123I2981l46n32n14o44q99r83p23k38J76L57M91Q06J065P64l2o11n40k25k08
55104I0145m08m48k64L4M73R33J031P05M66N85O13K46J5L82P51L50l49k69N37
55085I5528R49O18N26J320K185J974P79l41p30o28m40j95J89M77L24j61l69N5
55067A02060O25N55j53p12o71m96p09j064j031o82n33p43r50p96k68L51O10K64
$$ y = [83981, 85116, 85863, 86530, 87280, 87562, 86851, 85565, 84609, 84223, 83876, 83220, 82598, 82475, 82850, 83386, 83821, 84016, 83807, 83097, 82113, 81363, 81224, 81606, 82147, 82687, 83387, 84356, 85424, 86392, 87265, 88075, 88671, 88893, 88788, 88450, 87881, 87241, 86967, 87302, 87917, 88334, 88548, 88853, 89282, 89626, 89863, 90081, 90137, 89874, 89541, 89478, 89492, 89140, 88587, 88490, 88959, 89290, 88959, 88301, 87902, 87820, 87739, 87537, 87355, 87358, 87655, 88257, 88947, 89431, 89700, 89971, 90260, 90381, 90439, 90877, 91817, 92715, 92981, 92635, 92103, 91589, 90945, 90046, 89063, 88340, 88102, 88278, 88635, 89126, 89932, 90997, 91761, 91729, 91118, 90578, 90353, 90145, 89737, 89289, 89025, 89059, 89532, 90465, 91496, 92201, 92667, 93252, 93865, 94111, 94126, 94508, 95259, 95609, 95260, 94991, 95528, 96477, 97095, 97621, 98941, 101126, 103100, 103879, 103538, 102808, 102180, 101740, 101545, 101734, 102211, 102535, 102374, 102005, 102060, 102685, 103240, 103087, 102375, 101704, 101208, 100499, 99435, 98404, 97722, 97189, 96446, 95496, 94700, 94432, 94783, 95393, 95657]
55049I5657l28m99j33J74M2j93j44L5J05J71J79k46r70j061q5J000J063L24k22
55030I4869l41m88o53l54L57Q93J003Q44M22k17m85J02R34R52J58m44l18J20M56
55011I7810O69N81j02j042j449j145p17m93k21J35J88p3j40J35K77O0j23NJ72
54992I4527J52J73M55Q34J083J101P35k1o23m43L07P69O22L27J81n0l73k86L58
54973I9828R53R91P40O83P89P20L83l8l07k86j20j88n24n62jM57J6q40r26j31
54953A01637N32O04O45Q39N03n24j232r22k72j70l68j97K08K91J23J59L72M32
54935A02660M42O81Q79M75m96j289j255l86P79J550J610J336J424K039K723L164
54919A16336L593M255N006N651O137O153N219L430J534l7j552l091m004l859l239
$$ y = [95657, 95329, 94830, 94697, 94871, 94913, 94720, 94576, 94611, 94716, 94887, 95066, 94820, 93850, 92789, 92704, 93704, 94767, 95091, 94869, 94528, 94040, 93387, 93033, 93390, 94283, 95286, 96130, 96552, 96335, 95850, 95952, 96886, 97838, 97996, 97552, 97234, 97354, 97810, 98479, 99060, 98958, 97916, 96467, 95322, 94605, 94112, 93891, 94026, 94214, 94141, 94001, 94136, 94413, 94473, 94350, 94355, 94527, 94679, 94852, 95307, 96141, 97224, 98325, 99060, 99039, 98416, 97973, 98280, 99049, 99671, 99998, 100179, 100129, 99756, 99470, 99828, 100781, 101772, 102512, 103195, 103984, 104704, 105087, 105049, 104742, 104456, 104336, 104148, 103624, 103062, 103061, 103518, 103534, 102694, 101768, 101637, 102169, 102773, 103418, 104257, 104760, 104236, 103004, 102082, 101810, 101640, 101272, 101075, 101283, 101574, 101697, 101856, 102228, 102660, 103102, 103783, 104662, 105137, 104641, 103352, 102097, 101711, 102490, 104040, 105650, 106986, 108410, 110449, 113172, 116336, 119929, 124184, 129190, 134841, 140978, 147131, 152350, 155780, 157314, 157277, 155725, 152634, 148630, 144771, 141532]
54904A41532k958k972k771k453k557l096l429l157k533k016j733j476j004l20
54890A09057L15O73Q12Q38O02K8m09j33O47J151J165J286J910K745L511M332N137
54873A33667N432N075M528M020L177J876O12l66j477k819l662l591l278l391l506
54858A36297l022k412k486l004l075k613k299k368k366k077j774j580j349j154
54844A04718j241j489j526j364j287j242q90k21M41R79J515J871J610O33n35j218
54828A00754j061k86L67K30n02q80m64Kl48j213j581j168o15m05k86J49R15J695
54810I5303K117J912J185M50J67L27O79J090J374J206O18K43N13R69Q60K33k28
54793A09018k09p0j89n12p54p45o15p55j301j574o31J279K506J885K58o15j47
$$ y = [141532, 138574, 135602, 132831, 130378, 127821, 124725, 121296, 118139, 115606, 113590, 111857, 110381, 109377, 109057, 109372, 110045, 110857, 111695, 112297, 112325, 111916, 111783, 112430, 113581, 114746, 116032, 117942, 120687, 124198, 128530, 133667, 139099, 144174, 148702, 152722, 155899, 157775, 158387, 158021, 156544, 153725, 150063, 146472, 143194, 139803, 136297, 133275, 130863, 128377, 125373, 122298, 119685, 117386, 115018, 112652, 110575, 108801, 107221, 105872, 104718, 103477, 101988, 100462, 99098, 97811, 96569, 95679, 95458, 95899, 96878, 98393, 100264, 101874, 102507, 101972, 100754, 99693, 99407, 99774, 100004, 99502, 98622, 98158, 98160, 97812, 96599, 95018, 93850, 93235, 92830, 92544, 92693, 93608, 95303, 97420, 99332, 100517, 100967, 101134, 101461, 102140, 103230, 104604, 105810, 106428, 106671, 107184, 108153, 109013, 109246, 109018, 108809, 108739, 108550, 108038, 107284, 106539, 105924, 105169, 103868, 102294, 101663, 102942, 105448, 107333, 107591, 106976, 106829]
54776A06829Q49J623K170K581K696K425J887J187N74O57J871L831N713P003P408
54761A49304O543M570K754K340K945K973J582n48k415l710m602n285n930o415
54747A44106o109m653k896k198k749l404l275k631k027j499r81o33l69K34J080
54732A11996J359O84j81k79L84J139J671K133K553K738K661K580K765L309M083
54717A39595M742M888M343L193J664J39r60j617k352l485m434m382l496k791k773
54702A32274k934k794k612k747k911k575j727q49l82m53q35j029o77n4J90j01
54686A09784m19m17m07p59j224j232o31J89P58Q49N55J76k3j3N8N5j17n66j172
54667A05444j566j516j221q94l98K88O90M92K44N90J137J024M23L29Q63R76K11
$$ y = [106829, 107678, 109301, 111471, 114052, 116748, 119173, 121060, 122247, 122821, 123478, 125349, 129180, 134893, 141896, 149304, 155847, 160417, 163171, 165511, 168456, 171429, 173011, 172463, 170048, 166338, 161736, 156451, 150521, 144106, 137997, 133344, 130448, 128250, 125501, 122097, 118822, 116191, 114164, 112665, 111684, 111051, 110682, 110916, 111996, 113355, 114039, 113858, 113579, 113963, 115102, 116773, 118906, 121459, 124197, 126858, 129438, 132203, 135512, 139595, 144337, 149225, 153568, 156761, 158425, 158564, 157604, 155987, 153635, 150150, 145716, 141334, 137838, 135047, 132274, 129340, 126546, 123934, 121187, 118276, 115701, 113974, 113125, 112743, 112290, 111455, 110426, 109749, 109695, 109885, 109784, 109365, 108948, 108541, 107782, 106558, 105326, 104695, 104884, 105642, 106491, 107046, 107222, 107199, 107186, 107244, 107299, 107182, 106616, 105444, 103878, 102362, 101141, 100247, 99849, 100137, 100827, 101319, 101563, 102153, 103290, 104314, 104737, 105066, 105929, 106905, 107116]
54650A07116m83k48L93N07J53o6j26l09k80M78J571J910J101m4n70l76m6k9k05
54631A10447j65K18O04O19L53J90J89R2r6m3K73M10J02l59o60q70j050r75n47
54612A08732o6K10L82N26M64K02P3J05j82r19j448j215n84j59J81Q14J440J421
54594A09977Q38L62K17P3j65k30k31o56j445j857j505r01n72k93L22R80J106Q04
54576A06824P12R57R48M05p6J03N43L82l69p39j73P20J088Q90N72K00l66p69m78
54557A11374K85P29O23M66M73K42l20n56n3O55Q81P61Q27J106J225J143J071R38
54539A21870N15l6k41O2N43P88O18J31l03l01L9J13m52j207j440j073o56n84o68
54520A17718m81J31Q41J045M20o35j350j454j335j241q48L1R01J183R87P83O54
$$ y = [107116, 106633, 106385, 106778, 107285, 107438, 107372, 107246, 106937, 106657, 107135, 108706, 110616, 111717, 111673, 111103, 110727, 110681, 110652, 110447, 110282, 110500, 111104, 111723, 112076, 112266, 112455, 112547, 112451, 112408, 112681, 113091, 113193, 112834, 112174, 111304, 110254, 109279, 108732, 108666, 108876, 109258, 109784, 110248, 110450, 110523, 110628, 110446, 109527, 108079, 106864, 106280, 106121, 106302, 107116, 108556, 109977, 110815, 111177, 111394, 111467, 111302, 111072, 110841, 110185, 108740, 106883, 105378, 104477, 103905, 103612, 103934, 104914, 106020, 106824, 107536, 108493, 109441, 109846, 109770, 109873, 110416, 110798, 110429, 109690, 109517, 110237, 111325, 112215, 112787, 112987, 112621, 111852, 111374, 111659, 112388, 113011, 113477, 113950, 114192, 113872, 113316, 113263, 113918, 114799, 115560, 116387, 117493, 118718, 119861, 120932, 121870, 122385, 122349, 122108, 122170, 122713, 123501, 124119, 124250, 123947, 123646, 123685, 123798, 123346, 122139, 120699, 119626, 118970, 118386, 117718, 117237, 117368, 118209, 119254, 119674, 119039, 117689, 116235, 114900, 113659, 112811, 112842, 113743, 114926, 115913, 116696, 117350]
54503A17350L99Q0j10k73n73p65n68k96m99j039j194p00n2K36K28K03K01J20o2
54484A12686k86m25k56K78Q53J109J111J128J084O74M8j80K80J059J706K152K386
54467A25407K142J284K42l05j00M90R02Q13L02l30q47j245j531j486r01k4M86
54450A25299K26n01j058j113q10m13K5N77J133J300O98n30j653j906j206j96L94
54433A20266M40M26P79J290J331O97l4j68K17M61K83K2k6j8l6K16Q30J254R92
54414A29222M35L71Q54J192J005O96P12Q18M68l73j119j189n79J92O76Q69R79
54397A35229R96P36K72o2j83l43n76n19q3K44R7p2L65J285K027K258K062J406
54379A45139K65q92j480j583j671j608q11M98J200Q00K12M51J311J989K348K722
$$ y = [117350, 117749, 117829, 117719, 117446, 116873, 116108, 115540, 115244, 114745, 113706, 112512, 111812, 111760, 111996, 112224, 112427, 112628, 112748, 112686, 112400, 111975, 111719, 111997, 112850, 113959, 115070, 116198, 117282, 117956, 118004, 117824, 118104, 119163, 120869, 123021, 125407, 127549, 128833, 129075, 128770, 128670, 129160, 130062, 130875, 131177, 130847, 130000, 128755, 127224, 125738, 124837, 124813, 125299, 125525, 125024, 123966, 122853, 122043, 121630, 121655, 122232, 123365, 124665, 125363, 124833, 123180, 121274, 120068, 119872, 120266, 120706, 121132, 121911, 123201, 124532, 125229, 125195, 125027, 125244, 125705, 125988, 126010, 125984, 125966, 125930, 126146, 126976, 128230, 129222, 129657, 130028, 130882, 132074, 133079, 133775, 134487, 135305, 135773, 135400, 134281, 133092, 132513, 132705, 133381, 134250, 135229, 136225, 136961, 137233, 137171, 136988, 136645, 136069, 135550, 135467, 135711, 135808, 135736, 136101, 137386, 139413, 141671, 143733, 145139, 145404, 144512, 143032, 141449, 139778, 138170, 137359, 137857, 139057, 139857, 140069, 140520, 141831, 143820, 146168, 148890]
54363A48890K943K543J761J404J695K114K429K997L761L852K776J276L33k05j156
54348A77413k479l240l084k811l122l603l510k949k593k541k246j499q38p51r94
54333A41153r56m55M3l8p03j327j335r46q69j234j282n00M89P25K98J77P64J399
54315A35403J362P00j45r00j409j525j284q79m07RJ3n30r64n06N37J062P06K46
54297A31489J80J9n32p84j29Q13R91L13m73q47p31j45O61J080Q00K32j27l71o45
54278A31794n63J79J030J159M61n20j233j162K7J729K495J733O25M16N99Jj094
54261A37676j379o42J57O68J420K319K505J941J611J787J561N85j20K04Q54Q44
54245A51991K53l68r58j484j457p83l47q09j450j141l1O37K10p17j172p79J19
$$ y = [148890, 151833, 154376, 156137, 157541, 159236, 161350, 163779, 166776, 170537, 174389, 177165, 178441, 178774, 178569, 177413, 174934, 171694, 168610, 165799, 162677, 159074, 155564, 152615, 150022, 147481, 145235, 143736, 142898, 142147, 141153, 140197, 139742, 139785, 139747, 139044, 137717, 136382, 135436, 134567, 133333, 132051, 131551, 132040, 132765, 133063, 133240, 134004, 135403, 136765, 137465, 137320, 136420, 135011, 133486, 132202, 131323, 130916, 130925, 130938, 130408, 129444, 128938, 129475, 130537, 131243, 131489, 131669, 131688, 131156, 130372, 130243, 131056, 132047, 132360, 131887, 131040, 130309, 130164, 130825, 131905, 132705, 132937, 132810, 132439, 131794, 131231, 131410, 132440, 133599, 134060, 133540, 132307, 131145, 131172, 132901, 135396, 137129, 137754, 138170, 138769, 138770, 137676, 136297, 135655, 135812, 136480, 137900, 140219, 142724, 144665, 146276, 148063, 149624, 150209, 150089, 150293, 151147, 151991, 152244, 151876, 150918, 149434, 147977, 147194, 146847, 146038, 144588, 143447, 143416, 144053, 144263, 143546, 142374, 141595, 141714]
54228A41714Q50R46N14L0k96n63o82m00Q4K04l9L2N60O87j59j252j582j259j058
54209A38331j022n24M57J063P11j74p91q65o22k40L57J140J675J435N64m8K22
54192A41669Q19P29r1o69m53q%k94m71n28o34o61n32m89n32j63P81J530J238J13
54172A41354r04j269j113o92j95J22R7o9j21j40k65l27q9L14N59N15K20k04l76
54153A37417O8P61P59j61r63p43P4N60O83R07R20K2j432k201j829j097o47j50
54135A32948P00J371J260O64K94K17l7n63q21l71M93J023Q25K75J05N84J218J335
54117A41520Q61L47L53R06J511J578R45R7k59R0P05J080J100Q76M23k08p99j118
54099A50008j081o71j4M44L30JK34J060J542J097L48J84P04J606K896M382N170
$$ y = [141714, 142564, 143510, 144024, 144054, 143758, 143195, 142513, 142113, 142197, 142401, 142362, 142394, 142954, 143641, 143482, 142230, 140648, 139389, 138331, 137309, 136785, 137242, 138305, 139016, 138842, 138051, 137186, 136564, 136324, 136681, 137821, 139496, 140931, 141495, 141447, 141669, 142488, 143217, 143126, 142457, 142004, 141996, 141996, 141702, 141231, 140703, 140069, 139408, 138876, 138387, 137855, 137692, 138473, 140003, 141241, 141354, 140450, 139181, 138068, 137376, 137181, 137303, 137400, 137331, 137210, 137070, 136805, 136478, 136389, 136703, 137262, 137777, 137997, 137793, 137417, 137485, 138246, 139005, 138844, 137881, 137138, 137212, 137772, 138455, 139362, 140282, 140304, 138872, 136671, 134842, 133745, 133098, 132948, 133648, 135019, 136279, 136943, 137237, 137454, 137417, 136854, 136033, 135662, 136155, 137178, 138003, 138278, 138383, 138967, 140185, 141520, 142381, 142728, 143081, 143987, 145498, 147076, 148021, 148118, 147859, 147949, 148654, 149734, 150834, 151710, 152133, 151925, 151126, 150008, 148927, 148256, 148242, 148686, 149016, 149017, 149251, 150311, 151853, 152950, 153298, 153482, 154186, 155792, 158688, 163070, 168240]
54082A68240M739L975M047M555M033K098j33j801l134m249m480l559k427k005
54068A69899j937j390n47l07p86j028l89N93J005P85O98J140J551J181K45k55
54052A70458J99J016J420J437J509J626J485J283J612K572L614M270M525M482
54038B01508M265M257M782N522N820N719N982O841P477P151O220N482M959L934
54024B79919K038k52k093k924k670j671n22K43L87m2q65j815k565k913l029l419
54008B57807m424n689o281n691m510l744l482k956j958j401j931k820k973k448
53994B07499k068k032j910j742k015k535k489j752j182j303j629j580j283j093
53980A82886r89q83q21o48j20L77M8j024j659j132j85J38o4K4O31J322J767J904
$$ y = [168240, 172979, 176954, 181001, 185556, 189589, 191687, 191554, 189753, 186619, 182370, 177890, 174331, 171904, 169899, 167962, 166572, 166025, 165718, 164932, 163904, 163515, 164108, 165113, 165898, 166596, 167736, 169287, 170468, 170713, 170458, 170657, 171673, 173093, 174530, 176039, 177665, 179150, 180433, 182045, 184617, 188231, 192501, 197026, 201508, 205773, 210030, 214812, 220334, 226154, 231873, 237855, 244696, 252173, 259324, 265544, 271026, 275985, 279919, 281957, 281705, 279612, 276688, 274018, 272347, 271825, 272068, 272455, 272413, 271548, 269733, 267168, 264255, 261226, 257807, 253383, 247694, 241413, 235722, 231212, 227468, 223986, 221030, 219072, 217671, 215740, 212920, 209947, 207499, 205431, 203399, 201489, 199747, 197732, 195197, 192708, 190956, 189774, 188471, 186842, 185262, 183979, 182886, 181897, 181014, 180193, 179545, 179425, 179802, 179850, 178826, 177167, 176035, 175850, 175988, 175924, 175948, 176579, 177901, 179668, 181572]
53962A81572J598Q73K04P9L86P11R78J293J500J396J194J308J831K597L538M546
53946B05604N375O022O962Q433R937J0941J1778J3098J4634J5178J3783J0474
53934C32219N954J228k619m956o104o815p265p012n864m266k675j153K90J412
53920B92374K090K568L129L747M291M892N784O863P607P536O743N849N311M907
53906C63691M088K754J338J58q42j632j972j998k330l148l733l515l055l264m146
53891C42394n042n831o840p771p789o866o079o164o551o313n409m511m057l994
53877B59177m088m117l908l550l302l140k743k174k074k777l654l895l583l394
53863B12778l380k890j744q22j031k074k771k413j454p98p84j001r40n07J7L08
$$ y = [181572, 183170, 184043, 184247, 184326, 184712, 185423, 186401, 187694, 189194, 190590, 191784, 193092, 194923, 197520, 201058, 205604, 210979, 217001, 223963, 232396, 242333, 253274, 265052, 278150, 292784, 307962, 321745, 332219, 338173, 339401, 336782, 331826, 325722, 318907, 311642, 304630, 298766, 294500, 291825, 290672, 290962, 292374, 294464, 297032, 300161, 303908, 308199, 313091, 318875, 325738, 333345, 340881, 347624, 353473, 358784, 363691, 367779, 370533, 371871, 372029, 371187, 369555, 367583, 365585, 363255, 360107, 356374, 352859, 349804, 346540, 342394, 337352, 331521, 324681, 316910, 309121, 302255, 296176, 290012, 283461, 277148, 271739, 267228, 263171, 259177, 255089, 250972, 247064, 243514, 240212, 237072, 234329, 232155, 230081, 227304, 223650, 219755, 216172, 212778, 209398, 206508, 204764, 203942, 202911, 200837, 198066, 195653, 194199, 193401, 192617, 191616, 190676, 190169, 190186, 190494]
53847A90494K31j20n04p27q23r55j124j135q98n45j47L90R14Q57j03j369j904
53830A82532j407n56k3K66O32Q98O71Q9j91K33J103J950K563K890K804K229J463
53813A98146R99J021J227J274J204J313J685K132K509K904L406L917M244M276
53799B30257M006L508K983K662K637K870L352L979M315L882K854K042J949K192
53785B73488K123J655J030J81j000k037k287j970k104l173m485n190n331n521
53771B45379n885n839m851l129j616j293k243l391l521k642j874j825j814j173
53757B04283n79j145k577l271k388q19K09N41O15L78m08j289j468r89o84r37j225
53740A88247j069o95m39j42L60P25O35M60O80J017Q36K33o1J45K61nj26L57J077
$$ y = [190494, 190725, 190605, 190101, 189374, 188551, 187596, 186472, 185337, 184439, 183894, 183747, 184137, 185051, 185908, 185805, 184436, 182532, 181125, 180569, 180546, 180812, 181444, 182342, 183013, 183102, 182911, 183144, 184247, 186197, 188760, 191650, 194454, 196683, 198146, 199145, 200166, 201393, 202667, 203871, 205184, 206869, 209001, 211510, 214414, 217820, 221737, 225981, 230257, 234263, 237771, 240754, 243416, 246053, 248923, 252275, 256254, 260569, 264451, 267305, 269347, 271296, 273488, 275611, 277266, 278296, 278477, 277477, 275440, 273153, 271183, 269079, 265906, 261421, 256231, 250900, 245379, 239494, 233655, 228804, 225675, 224059, 222766, 220523, 217132, 213611, 210969, 209095, 207270, 205456, 204283, 203704, 202559, 199982, 196711, 194323, 193504, 193713, 194254, 194869, 195247, 194839, 193550, 192082, 191093, 190409, 189472, 188247, 187178, 186483, 186044, 185902, 186262, 186987, 187622, 188082, 188762, 189779, 190615, 190848, 190787, 190932, 191193, 191188, 191062, 191419, 192496]
53721A92496J445J476J483J455J319J390J891K310J977J146P73J163J571J411
53707B13306J155J603K688L507L415K655J941J660J619J437J142J217J994L066
53693B42405L570L071K018J248J208J682K106K007J269J39r66j715k028k035j955
53678B52024j881j642j030j85M52O57O63O27K61o06j358j149j31M93r8j353k072
53661B43672j720o99L52J054J264J025O25L99M03M06K40l1k34l14k94j43K45Q80
53643B47130J550J928J844J400P80J30l08j94N09J287J562J389J304J533J787
53628B63631J883K057K448K756K738K659K869L200L260L060K925K937K928K938
53614C02289L163L524L676L569L486L486L239K662K228K339K740K886K614K151
$$ y = [192496, 193941, 195417, 196900, 198355, 199674, 201064, 202955, 205265, 207242, 208388, 209161, 210324, 211895, 213306, 214461, 216064, 218752, 222259, 225674, 228329, 230270, 231930, 233549, 234986, 236128, 237345, 239339, 242405, 245975, 249046, 251064, 252312, 253520, 255202, 257308, 259315, 260584, 260723, 259757, 258042, 256014, 253979, 252024, 250143, 248501, 247471, 247286, 247738, 248395, 249058, 249685, 249946, 249340, 247982, 246833, 246702, 247195, 247097, 245744, 243672, 241952, 241253, 241605, 242659, 243923, 244948, 245573, 245972, 246375, 246781, 247021, 246990, 246756, 246442, 246148, 246005, 246250, 247130, 248680, 250608, 252452, 253852, 254632, 254762, 254454, 254260, 254769, 256056, 257618, 259007, 260311, 261844, 263631, 265514, 267571, 270019, 272775, 275513, 278172, 281041, 284241, 287501, 290561, 293486, 296423, 299351, 302289, 305452, 308976, 312652, 316221, 319707, 323193, 326432, 329094, 331322, 333661, 336401, 339287, 341901, 344052]
53600C44052J654J191R54J063J222J024N48K40J18l48j338k164k052j157l65k37
53584C44405n73r52j208j286j040m32K49N56K60m98j329j879k064k038j834j239
53568C29098k68M27J44q35j367q53M5L84J79O9J84R7j98q6O23J197Q96K8m81k69
53548C29014J73L84N58J068J754K029J683J226J323K089L079L864M323M463M315
53533C61345M140M364N121O042O727P156P522P823Q014Q285Q820R416R739R879
53519D64393J0306J1249J2456J3542J4311J4729J4927J5272J6036J7052J7999
53508F22272J8940K0133K1328K1861K1507K0803K0328K0133K0041J9915J9366
53497H46627J7867J5637J3920J3726J4587J5196J4944J4321J3960J4050J4559
$$ y = [344052, 345706, 346897, 347851, 348914, 350136, 351160, 351708, 351948, 352066, 351718, 350380, 348216, 346164, 345007, 344642, 344405, 343832, 342880, 341672, 340386, 339346, 338914, 339163, 339719, 339979, 339481, 338152, 336273, 334209, 332171, 330337, 329098, 328830, 329257, 329401, 328566, 327199, 326346, 326391, 326775, 326954, 327023, 327207, 327304, 327106, 327020, 327643, 328840, 329736, 329764, 329283, 329014, 329187, 329571, 330129, 331197, 332951, 334980, 336663, 337889, 339212, 341301, 344380, 348244, 352567, 357030, 361345, 365485, 369849, 374970, 381012, 387739, 394895, 402417, 410240, 418254, 426539, 435359, 444775, 454514, 464393, 474699, 485948, 498404, 511946, 526257, 540986, 555913, 571185, 587221, 604273, 622272, 641212, 661345, 682673, 704534, 726041, 746844, 767172, 787305, 807346, 827261, 846627, 864494, 880131, 894051, 907777, 922364, 937560, 952504, 966825, 980785, 994835, 1009394]
53486A009394J5331J5865J5598J4677J3919J3857J4230J4585J4831J4894J4317
53475A171498J2722J0473Q324O548M755K581J82k019l841n474p223r168j1007
53462A178351j2229j2544j2160j1601j1355j1628j2301j2931j3085j2878j3060
53451A042579j4195j5840j6890j6803j6064j5438j5147j4994j4789j4334j3277
53440H74808j1454r183o906m741k828j741j939k825l109k242q75K19J041J918
53426H30143K792L513M252N164N990O579P393Q873J0628J1968J2963J4250J5867
53413I40375J7236J8266J9616K1542K3279K4109K4449K5287K6911K8795L0492
53402A200357L2050L3587L4945L5950L6772L7816L9317M1051M2550M3603M4463
$$ y = [1009394, 1024725, 1040590, 1056188, 1070865, 1084784, 1098641, 1112871, 1127456, 1142287, 1157181, 1171498, 1184220, 1194693, 1203017, 1209565, 1214320, 1216901, 1217083, 1215064, 1211223, 1205749, 1198526, 1189358, 1178351, 1166122, 1153578, 1141418, 1129817, 1118462, 1106834, 1094533, 1081602, 1068517, 1055639, 1042579, 1028384, 1012544, 995654, 978851, 962787, 947349, 932202, 917208, 902419, 888085, 874808, 863354, 854171, 847265, 842524, 839696, 837955, 836016, 833191, 830082, 827840, 826965, 827184, 828225, 830143, 832935, 836448, 840700, 845864, 851854, 858433, 865826, 874699, 885327, 897295, 910258, 924508, 940375, 957611, 975877, 995493, 1017035, 1040314, 1064423, 1088872, 1114159, 1141070, 1169865, 1200357, 1232407, 1265994, 1300939, 1336889, 1373661, 1411477, 1450794, 1491845, 1534395, 1577998, 1622461]
53391A622461M5347M5964M5832M5031M4136M3362M2273M0573L8718L7355L6416
53380B087468L5195L3139L0286K7037K3804K0813J7949J4846J1292P470L630l96
53368B312533n081j0647j6769k2811k8202l2602l5847l7903l8958l9523m0162
53357B004028m0943m1288m0646l9189l7602l6262l5071l3876l2632l1214k9744
53346A605561k9023k9890l1885l3349l3232l2130l1023k9836k7955k5581k3504
53335A278153k1892k0220j8356j6732j5465j4186j2886j2133j2159j2464j2724
53324A108936j3388j4762j6026j5975j4500j2719j1567j0891j0140r329q872q659
53312I62108p934o241m027k065o13M96J240J564J942L063M834O414P465Q702J0726
$$ y = [1622461, 1667808, 1713772, 1759604, 1804635, 1848771, 1892133, 1934406, 1974979, 2013697, 2051052, 2087468, 2122663, 2155802, 2186088, 2213125, 2236929, 2257742, 2275691, 2290537, 2301829, 2309299, 2312929, 2312533, 2307452, 2296805, 2280036, 2257225, 2229023, 2196421, 2160574, 2122671, 2083713, 2044190, 2004028, 1963085, 1921797, 1881151, 1841962, 1804360, 1768098, 1733027, 1699151, 1666519, 1635305, 1605561, 1576538, 1546648, 1514763, 1481414, 1448182, 1416052, 1385029, 1355193, 1327238, 1301657, 1278153, 1256261, 1236041, 1217685, 1200953, 1185488, 1171302, 1158416, 1146283, 1134124, 1121660, 1108936, 1095548, 1080786, 1064760, 1048785, 1034285, 1021566, 1009999, 999108, 988968, 979639, 970767, 962108, 954174, 947933, 943906, 941841, 941228, 941724, 942964, 944528, 946470, 949533, 954367, 960781, 968246, 976948, 987674]
53297I87674J3000J4616J5564J6552J7842J9027J9820K0373K0883K1413K1990
53286A188754K2387K1974K0371J8120J6126J4545J2907J1127R549P996N704K469
53274A352029q85l565n681p731r756j1512j2995j4426j5916j7459j8950k0136
53262A213017k0878k1459k2205k2768k2486k1567k1115k1617k2193k1839k0743
53251I74147j9709j8972j8346j8015j8271j8749j8851j8711j8938j9432j9391
53240G66762j8548j7603j7158j6924j6356j5489j4608j3592j2090j0211q565p605
53228E98013p271p206p138p007o913p075p731q944j0417j1595j2107j2149j2265
53215D80195j2718j3228j3368j3030j2346j1366j0134q894p923p141o248n278
$$ y = [987674, 1000674, 1015290, 1030854, 1047406, 1065248, 1084275, 1104095, 1124468, 1145351, 1166764, 1188754, 1211141, 1233115, 1253486, 1271606, 1287732, 1302277, 1315184, 1326311, 1335860, 1343856, 1349560, 1352029, 1351144, 1347579, 1341898, 1334167, 1324411, 1312899, 1299904, 1285478, 1269562, 1252103, 1233153, 1213017, 1192139, 1170680, 1148475, 1125707, 1103221, 1081654, 1060539, 1038922, 1016729, 994890, 974147, 954438, 935466, 917120, 899105, 880834, 862085, 843234, 824523, 805585, 786153, 766762, 748214, 730611, 713453, 696529, 680173, 664684, 650076, 636484, 624394, 614183, 605618, 598013, 590742, 583536, 576398, 569391, 562478, 555403, 547672, 538728, 528311, 516716, 504609, 492460, 480195, 467477, 454249, 440881, 427851, 415505, 404139, 394005, 385111, 377188, 370047, 363799, 358521]
53203C58521m754n038n715n905n240m344m177m954n949o393o294o134o013n608
53189B82003m905m311l933l272k097j117j223k245l075k949k182j555j488j871
53175B45780k339k437j864q60j22j70q33j472j614j257p21l59l39n59p26o79n76
53158B28853o70r46j112j027r25j013j004l84P03J314P50m91j278j244j055j250
53142B19221j495j327j010j073j333j080j55P60J059R24R25J208J373J036K82
53127B19315l80m87o5M43P04Q20J035J264J187P61K95%k45n95q88p96k20N80J188
53108B23916J317R15J30p83j551j949j965j868j952k158k097j509n68K86O78M79
53092B11321j1q5P16J812J989Q91l50n02K39O86L32k54n20n84o60n87k65J3nj80
$$ y = [358521, 353767, 348729, 343014, 337109, 331869, 327525, 323348, 318394, 312445, 306052, 299758, 293624, 287611, 282003, 277098, 272787, 268854, 265582, 263485, 262368, 261145, 258900, 255825, 252876, 250694, 249139, 247651, 245780, 243441, 241004, 239140, 238280, 238158, 237988, 237155, 235683, 234069, 232812, 232091, 231732, 231393, 230834, 230108, 229429, 228853, 228183, 227237, 226125, 225098, 224173, 223160, 222156, 221772, 222475, 223789, 224539, 224048, 222770, 221526, 220471, 219221, 217726, 216399, 215389, 214316, 212983, 211903, 211748, 212508, 213567, 214491, 215416, 216624, 217997, 219033, 219315, 218935, 218448, 218383, 218826, 219530, 220350, 221385, 222649, 223836, 224597, 224892, 224892, 224647, 224052, 223164, 222368, 222148, 222728, 223916, 225233, 226148, 226278, 225495, 223944, 221995, 220030, 218162, 216210, 214052, 211955, 210446, 209878, 210164, 210842, 211321, 211310, 211225, 211941, 213753, 215742, 216633, 216283, 215781, 216020, 216706, 217038, 216784, 216264, 215680, 215020, 214433, 214168, 214181, 214176, 213996]
53072B13996k95l83n01n27m57m95o85q23r20j253j762j839j093J04J162J925K296
53055B08450J805K48j499k158j472l48M33R65J555J966J726Q26k35q95q40j57
53039B10370O25Q56L86k42m01o9K78K87jl94q35j241j352q90P0J034J509J416
53021B11406J052P08M84M37O37R65J065P30J69k17k53j2M31J012J529J697J347
53004B23187M96o63j634j792j015l0K59j92o42n90k43J17O34J371J834J521P99
52987B23417N59J062J514J066j15r73p42K86J217J614J836K273K631K385J716
52972B39746J405J735K068J798J162O88L28j81m96rJ046J560Q86m10j304j379
52956B48643r55n87p29j399k016j924j307j091j656k193j823q05r1j8j88l29n39
$$ y = [213996, 213701, 213318, 212817, 212290, 211833, 211338, 210653, 209830, 208910, 207657, 205895, 204056, 202963, 203067, 204229, 206154, 208450, 210255, 210503, 209004, 206846, 205374, 205026, 205459, 206424, 207979, 209945, 211671, 212497, 212262, 211367, 210527, 210370, 210995, 211851, 212237, 211995, 211594, 211525, 211803, 212090, 212089, 211695, 210860, 209619, 208267, 207377, 207447, 208481, 209990, 211406, 212458, 213166, 213650, 214087, 214724, 215689, 216754, 217484, 217653, 217436, 217183, 217171, 217602, 218614, 220143, 221840, 223187, 223683, 223020, 221386, 219594, 218579, 218549, 218808, 218616, 217974, 217384, 217141, 217258, 217892, 219263, 221097, 222618, 223417, 223976, 225038, 226552, 227618, 227503, 226530, 225788, 226074, 227291, 228905, 230741, 233014, 235645, 238030, 239746, 241151, 242886, 244954, 246752, 247914, 248602, 248930, 248749, 248253, 248244, 249290, 250850, 251736, 251326, 250022, 248643, 247688, 247101, 246372, 244973, 242957, 241033, 239726, 238635, 236979, 234786, 232963, 232158, 232067, 232049, 231861, 231532, 230993]
52939B30993o93m57M1K08j34m71l82r2M8P0Q1j11n93r41o73N0O21O59K34m10r70
52918B27078j096o76q7J53Rj15K7K62L26K02P7J12L25O15Q16Q10N93K17j96m60
52898B28992m75l77l46k77J0L17K52pK57J169J777J246N7o51n84l43k58p7J71
52879B30853Jo18r58n99j16k30p16p49J4J148J991K190J819J349J237J399J280
52862B39295O82J48L21J210K338L200L254K014k55k303l036k764k709l438m341
52847B33616m672m364l740l019k350j913j684j423j102j002j258j554j447q15
52833B03273J35J000J293Q17M2k37J62N83M64Q0m4m0m26j137j431r45k33L9J6
52814B03411L52J095J422O90n90j205o24N53J485K014K349K281J378j01j260j599
$$ y = [230993, 230300, 229843, 229884, 230092, 229958, 229487, 229105, 229013, 229061, 229131, 229212, 229101, 228508, 227567, 226894, 226944, 227565, 228224, 228458, 228048, 227078, 225982, 225306, 225219, 225372, 225381, 225266, 225293, 225555, 225881, 226083, 226160, 226272, 226597, 227212, 228028, 228838, 229431, 229648, 229452, 228992, 228517, 228140, 227794, 227517, 227527, 227844, 228096, 228089, 228346, 229515, 231292, 232538, 232595, 231944, 231360, 231017, 230759, 230682, 230853, 230854, 230236, 229278, 228679, 228563, 228333, 227617, 226868, 226882, 228030, 230021, 232211, 234030, 235379, 236616, 238015, 239295, 239977, 240125, 240446, 241656, 243994, 247194, 250448, 252462, 252207, 249904, 246868, 244104, 241395, 237957, 233616, 228944, 224580, 220840, 217821, 215471, 213558, 211874, 210451, 209349, 208347, 207089, 205535, 204088, 203273, 203408, 204408, 205701, 206518, 206560, 206323, 206485, 207068, 207532, 207612, 207568, 207528, 207102, 205965, 204534, 203589, 203356, 203395, 203411, 203763, 204858, 206280, 206970, 206380, 205175, 204551, 205104, 206589, 208603, 210952, 213233, 214611, 214510, 213250, 211651]
52798B11651j573j748k035k058j851j646j320o81n6om85q50p36l79q5J19K44K54
52780A96759L53Q00J282J110L26l3O43J487J242L3p59l43N76Q92L75l83q48r26
52762B02586q19q00r76j055n34O74J966K580K252J280J92n25o69n23o13r91j061
52745B02964l99N89J166J296J529K003K150J612R03P84J249J597J386R35Q14J130
52729B21708J515J612J428J159Q71M74m8n52r24j225j503j589j289p24l41n17
52713B20055j233k089k565k301j365j95P29J242J423J349J040N98J79j43l29k69
52697B16126N2L89M92M75O31R43J134J159J254J430J365R50M34q6q13j534j475
52680B22926m01O49N08n57j200q20j14J67J68K72L38Q2k87l92k93k84l12q5M11
$$ y = [211651, 210078, 208330, 206295, 204237, 202386, 200740, 199420, 198739, 198683, 198677, 198192, 197342, 196606, 196227, 196142, 196261, 196505, 196759, 197112, 197912, 199194, 200304, 200630, 200597, 201240, 202727, 203969, 204002, 203243, 202900, 203476, 204368, 204743, 204360, 203512, 202586, 201767, 200967, 199991, 198936, 198402, 199076, 201042, 203622, 205874, 207154, 207346, 206821, 206152, 205629, 205016, 204025, 202964, 202565, 203154, 204320, 205616, 207145, 209148, 211298, 212910, 213813, 214597, 215846, 217443, 218829, 219764, 220578, 221708, 223223, 224835, 226263, 227422, 228293, 228767, 228719, 228167, 227243, 226018, 224515, 222926, 221637, 220913, 220572, 220055, 218822, 216733, 214168, 211867, 210502, 210307, 211036, 212278, 213701, 215050, 216090, 216688, 216867, 216724, 216395, 216126, 216178, 216567, 217059, 217534, 218165, 219108, 220242, 221401, 222655, 224085, 225450, 226400, 226834, 226748, 225935, 224401, 222926, 222525, 223174, 223682, 223125, 221925, 221105, 220991, 221158, 221326, 221598, 221936, 222018, 221731, 221339, 221046, 220762, 220450, 220365, 220776]
52661B20776Q74J086J008P01M88R21K087L125L078K122J357J335J467J113N09
52646B42047J97J18j51o13r91j350j934k398j980n96Q06J236P07m3m32l87q3K65
52628B34418N19P64J241J898K230J827R27Q7n00r57j219j059o54m88n84l73M10
52611B38487J160J198P19M23M93M79J89oJ63M01L69K25K74L68J38l31m74mP31
52592B45002J282J643J960K038J518N40k31l99k92m27p53p23J3J264K554L427
52576B58416L517K661J135m05j357j529j156p25p03j175j677j689j274r84j077
52561B51978j216j114r96j136j287j021m18M6K10L35N29N29J45m72j106j664j973
52544B41369j717q47J31N90M27R0R2N20R76R69M34q2J2O66J262J402J251J023
$$ y = [220776, 221650, 222736, 223744, 224445, 224933, 225854, 227941, 231066, 234144, 236266, 237623, 238958, 240425, 241538, 242047, 242244, 242362, 242211, 241598, 240607, 239257, 237323, 234925, 232945, 232349, 233155, 234391, 235098, 235055, 234623, 234236, 234153, 234418, 234937, 235701, 236942, 238840, 241070, 242897, 243824, 243911, 243411, 242454, 241235, 240176, 239522, 239034, 238450, 238077, 238487, 239647, 240845, 241564, 241987, 242480, 242959, 243148, 243142, 243305, 243706, 244075, 244300, 244574, 244942, 245080, 244749, 244275, 244271, 245002, 246284, 247927, 249887, 251925, 253443, 253983, 253752, 253353, 253061, 252634, 251881, 251158, 251171, 252435, 254989, 258416, 261933, 264594, 265729, 265324, 263967, 262438, 261282, 260557, 259854, 258679, 257002, 255313, 254039, 253055, 251978, 250762, 249648, 248652, 247516, 246229, 245208, 244790, 244836, 245046, 245381, 245910, 246439, 246584, 246112, 245006, 243342, 241369, 239652, 238805, 238936, 239526, 239953, 240043, 240135, 240655, 241631, 242600, 243034, 242952, 242964, 243630, 244892, 246294, 247545, 248568]
52526B48568N66j61o78m93J07L84K25L07J020J801J881J326Q65Q70J010R42Q41
52509B59381J055J536J907J963J827J676J488J148O00j80j229k445l418l671l153
52494B58485k443k154k210j883p80M78Q86K91m00l73J18K36k81q93j035o97j84
52477B47161K63M89M35K55K09L54N48Q38J409K041K089J341N09M51J135J799J955
52460B63281J785J618J533J426J117K94j213k949l967l657k350j069p20j433k431
52445B51265k685j974j156j128j667j786j099j84M04P50R98Q27R1n85m58K99Q01
52428B42713N82P6n5L44R03J150Q77K26m80r99j228j047l65N84J307J556J543
52411B47687J530J528J607K128L277M683N881O875P872Q680Q873Q331P092M921
$$ y = [248568, 249134, 248973, 248295, 247802, 247909, 248293, 248518, 248825, 249845, 251646, 253527, 254853, 255718, 256588, 257598, 258540, 259381, 260436, 261972, 263879, 265842, 267669, 269345, 270833, 271981, 272581, 272401, 271172, 268727, 265309, 261638, 258485, 256042, 253888, 251678, 249795, 249015, 249493, 250379, 250670, 250270, 249897, 250015, 250251, 249970, 249077, 248042, 247345, 247161, 247424, 247913, 248348, 248603, 248812, 249166, 249714, 250552, 251961, 254002, 256091, 257432, 257941, 258392, 259527, 261326, 263281, 265066, 266684, 268217, 269643, 270760, 271054, 269841, 266892, 262925, 259268, 256918, 255849, 255129, 253696, 251265, 248580, 246606, 245450, 244322, 242655, 240869, 239770, 239586, 239990, 240740, 241738, 242565, 242656, 242071, 241613, 241912, 242713, 243295, 243371, 243316, 243660, 244563, 245713, 246590, 246816, 246336, 245337, 244109, 243062, 242697, 243281, 244588, 246144, 247687, 249217, 250745, 252352, 254480, 257757, 262440, 268321, 275196, 283068, 291748, 300621, 308952, 316044, 320965]
52397C20965J649k054m956o421o803o581n799m511l206k365j917j503j012n46
52383B74940j37K16M45N20N41N57N44O37J086J823K456K833L222L708L928L727
52367C01046L568L825M027L481K287J131K08q50k008k513j837m22Q02J296J168
52352C15209Q44P25Q45Q19L73oN11J949L245L457K815K236K186K515L129M130
52336C44982N416O584P401P961Q387Q678Q930R415J0321J1565J2946J4337J5710
52323D72633J7129J8637K0003K0718K0462J9537J8556J7790J7164J6729J6684
52312F76042J6920J7044J7007J7168J7585J7720J7205J6446J6028J5862J5388
52301H60415J4428J3324J2346J1385J0203Q626O602M379K407P92r76l250n469
$$ y = [320965, 322614, 320560, 315604, 309183, 302380, 295799, 290000, 285489, 282283, 279918, 278001, 276498, 275486, 274940, 274803, 275019, 275464, 275984, 276525, 277082, 277626, 278263, 279349, 281172, 283628, 286461, 289683, 293391, 297319, 301046, 304614, 308439, 312466, 315947, 318234, 319365, 319573, 318723, 316715, 314202, 312365, 311943, 312745, 314041, 315209, 316053, 316778, 317623, 318442, 318815, 318809, 319320, 321269, 324514, 327971, 330786, 333022, 335208, 337723, 340852, 344982, 350398, 356982, 364383, 372344, 380731, 389409, 398339, 407754, 418075, 429640, 442586, 456923, 472633, 489762, 508399, 528402, 549120, 569582, 589119, 607675, 625465, 642629, 659358, 676042, 692962, 710006, 727013, 744181, 761766, 779486, 796691, 813137, 829165, 845027, 860415, 874843, 888167, 900513, 911898, 922101, 930727, 937329, 941708, 944115, 944907, 943931, 940681, 935212]
52288I35212o746p105p449q305r237r604r246q266o779n143l813k672j077J105
52274H50875L180M722O245Q184R913J0662J0843J1521J2818J3808J3862J3244
52262I69877J2459J1866J1950J2945J4112J4276J3379J2602J2628J2754J2181
52251A111029J1233J0613J0153R112P262M841J995j001l376m695n726p563r917
52238A133960j1316j1076j0204j0033j0649j1086j0563r176p732p107p426p790
52226A019802p180n679m297l577l037k242j561j376j241n37N32J379K054L001
52212I96041M014M382M121M207N255O658P445P407O936O187N039L733K990L339
52198A067754M518N593N652M560L219K883L976N567O260N562M210L221K829K511
$$ y = [935212, 928466, 921361, 913912, 905607, 896370, 886766, 877520, 869254, 862475, 857332, 853519, 850847, 849770, 850875, 854055, 858777, 865022, 873206, 883119, 893781, 904624, 916145, 928963, 942771, 956633, 969877, 982336, 994202, 1006152, 1019097, 1033209, 1047485, 1060864, 1073466, 1086094, 1098848, 1111029, 1122262, 1132875, 1143028, 1152140, 1159402, 1164243, 1166238, 1165237, 1161861, 1157166, 1151440, 1143877, 1133960, 1122644, 1111568, 1101364, 1091331, 1080682, 1069596, 1059033, 1049857, 1042125, 1035018, 1027592, 1019802, 1012622, 1006943, 1002646, 999069, 996032, 993790, 992229, 990853, 989612, 989075, 989607, 990986, 993040, 996041, 1000055, 1004437, 1008558, 1012765, 1018020, 1024678, 1032123, 1039530, 1046466, 1052653, 1057692, 1061425, 1064415, 1067754, 1072272, 1077865, 1083517, 1088077, 1091296, 1094179, 1098155, 1103722, 1109982, 1115544, 1119754, 1122975, 1125804, 1128315]
52184A128315J772O96l59j354k625m356o196p663q726r683j0438j0438r495q269
52170A051181p455o834n661l908k465j896j598o46Q87K060K384K386K750L340
52156A034525L496K946J980Q77l45j509k106j864j188p15n70l76J36Q84J681K312
52140A040164K389J611K79q76j456j598j319k98J362K844L696M657O661R434J1946
52125A079496J4009J6371J9229K1780K3543K5111K6950K8416K8740K8308K8028
52114A339981K7833K6836K4743K2276K0151J8457J7011J5601J3738J0969P745
52103A545341N273M146L655K888J957J557J626J262j29k159m165o041q131j0585
52089A536495j3156j5595j7787j9469k0099j9368j7663j5717j3813j1654r067
$$ y = [1128315, 1130087, 1130783, 1130424, 1129070, 1126445, 1122089, 1115893, 1108230, 1099504, 1089821, 1079383, 1068945, 1059450, 1051181, 1043726, 1036892, 1031231, 1027323, 1024858, 1022962, 1021364, 1020718, 1021605, 1023665, 1026049, 1028435, 1031185, 1034525, 1038021, 1040967, 1042947, 1043824, 1043479, 1041970, 1039864, 1038000, 1036812, 1036097, 1035527, 1035151, 1035287, 1036171, 1037852, 1040164, 1042553, 1044164, 1044443, 1043567, 1042111, 1040513, 1039194, 1038896, 1040258, 1043102, 1046798, 1051455, 1058116, 1067550, 1079496, 1093505, 1109876, 1129105, 1150885, 1174428, 1199539, 1226489, 1254905, 1283645, 1311953, 1339981, 1367814, 1394650, 1419393, 1441669, 1461820, 1480277, 1497288, 1512889, 1526627, 1537596, 1545341, 1550614, 1554760, 1558415, 1561303, 1563260, 1564817, 1566443, 1567705, 1567576, 1565417, 1561252, 1555211, 1547080, 1536495, 1523339, 1507744, 1489957, 1470488, 1450389, 1431021, 1413358, 1397641, 1383828, 1372174, 1363107]
52078A363107o332l713j153J246K931L634M050N195P305R889J2612J5287J7217
52065A431275J7532J6390J5074J4504J4317J3768J2847J1981J1209J0261R085
52054A578243P817O446M972L554K135K79k220n007p815j0959j4517j7593j9265
52041A526070j9947k0928k2560k3800k3718k2587k1303k0315j9431j8226j6406
52030A296849j4197j2451j1876j2108j2049j1269j0506j0561j1307j2105j2666
52019A165754j3006j3000j2445j1487j0556r971r760r738r696r790j0615j2419
52007A033271j4298j4877j4086j3448j4185j5775j7038j7900j9039k0283k0578
51996H51764j9661j8566j8111j7695j6188j3570j1050r796r901j0524j0782j0537
$$ y = [1363107, 1356775, 1353062, 1351909, 1353155, 1356086, 1359720, 1363770, 1368965, 1376270, 1386159, 1398771, 1414058, 1431275, 1448807, 1465197, 1480271, 1494775, 1509092, 1522860, 1535707, 1547688, 1558897, 1569158, 1578243, 1586060, 1592506, 1597478, 1601032, 1603167, 1603446, 1601226, 1596219, 1588404, 1577445, 1562928, 1545335, 1526070, 1506123, 1485195, 1462635, 1438835, 1415117, 1392530, 1371227, 1350912, 1331481, 1313255, 1296849, 1282652, 1270201, 1258325, 1246217, 1234168, 1222899, 1212393, 1201832, 1190525, 1178420, 1165754, 1152748, 1139748, 1127303, 1115816, 1105260, 1095289, 1085529, 1075791, 1066095, 1056305, 1045690, 1033271, 1018973, 1004096, 990010, 976562, 962377, 946602, 929564, 911664, 892625, 872342, 851764, 832103, 813537, 795426, 777731, 761543, 747973, 736923, 727127, 717226, 706702, 695920, 685383]
51984F85383j0410j0952j1890j2435j2319j2081j2177j2246j1694j0786j0527
51973E57866j1359j2354j2081j0134p418m979k976j074O22J694K397L630N649
51960E09483P449Q021P665P279O806N299K529m88k767m341n590o345o289n696
51946E23015n049m230k731o11J474L210N054P540J0468J2984J4317J4286J3326
51933E93053J2126J1077J0045Q621O562L918Q65k348n294p381q148p536o051m614
51919F04895m086m723o165p983j0068j2288j4188j5308j5719j5776j5459j4411
51907D68721j2574j0340p972n377k624j93J611L025M304N169N175M343K897P83
51893D56948k032m936p052q222r003r641r706q954p791o573n042l023j093J02
$$ y = [685383, 674973, 664021, 652131, 639696, 627377, 615296, 603119, 590873, 579179, 568393, 557866, 546507, 534153, 522072, 511938, 504520, 499541, 496565, 495491, 496113, 497807, 500204, 503834, 509483, 516932, 524953, 532618, 539897, 546703, 552002, 554531, 554043, 551276, 546935, 541345, 535000, 528711, 523015, 517966, 513736, 511005, 510394, 511868, 515078, 520132, 527672, 538140, 551124, 565441, 579727, 593053, 605179, 616256, 626301, 634922, 641484, 645402, 646267, 643919, 638625, 631244, 623096, 615560, 609509, 604895, 600809, 596086, 589921, 581938, 571870, 559582, 545394, 530086, 514367, 498591, 483132, 468721, 456147, 445807, 437835, 432458, 429834, 429641, 431252, 434277, 438581, 443750, 448925, 453268, 456165, 456948, 454916, 449980, 442928, 434706, 425703, 416062, 406356, 397402, 389611, 383038, 377996, 374973, 373880, 373982]
51879C73982Q60J996L647N276O667Q127R530J0026R102P339N700M528L547K403
51865D52730Q33j252l383m676m828m658n030n642n470m220k514q41Q67K516L539
51850D17971L672L298K753J747L0j905l292l934m139m162m174m504n293o005n863
51835C86200m802l556k781k400j913r88L28J676K556K648K044J075o0j240k192
51820C76595k662k826l090l414l255k397j372p64l81L75J491K176J833Q13M7J5
51804C63184L13J87o08j550j921j596j083q48p49l22M75J031O99m65j664k088
51788C52995j654j023q66j184j477j444j309j311j221p12l4J41l16o24k7J251
51772C41185K351K966L589M604N704O505P272Q440R698J0171R601Q708Q115P371
$$ y = [373982, 374842, 376838, 380485, 385761, 392428, 400555, 410085, 420111, 429213, 436552, 442252, 446780, 450327, 452730, 453563, 452311, 448928, 444252, 439424, 434766, 429736, 424094, 418624, 414404, 411890, 411049, 411916, 414432, 417971, 421643, 424941, 427694, 429441, 429471, 427566, 424274, 420340, 416201, 412039, 407865, 403361, 398068, 392063, 386200, 381398, 377842, 375061, 372661, 370748, 369760, 370088, 371764, 374320, 376968, 379012, 380087, 380027, 378787, 376595, 373933, 371107, 368017, 364603, 361348, 358951, 357579, 356815, 356434, 356809, 358300, 360476, 362309, 363122, 363169, 363184, 363497, 363684, 363076, 361526, 359605, 358009, 356926, 356078, 355329, 355007, 355482, 356513, 357212, 356747, 355083, 352995, 351341, 350318, 349452, 348268, 346791, 345347, 344038, 342727, 341506, 340794, 340760, 340901, 340585, 339961, 339934, 341185, 343536, 346502, 350091, 354695, 360399, 366904, 374176, 382616, 392314, 402485, 412086, 420794, 428909, 436280]
51758D36280N564K599o55l464n930q405j0616j1814j1627j0449q994p715o686
51745C58088n785m820l650k387j399q82n12K48J479K723L670M567N738O912P398
51730C71388O844N536L952K395J049J25k35m1N73J257J420N72j139k966m197m603
51714C81930m295l492k524j716j126o71n24r92j814k177j687r03m13K2Q63J781
51698C62262K064J781J612J561Q08q27k112j682L05K320L009K229P42o43j672
51683C71757k620l731m695m853m002k725j808j417j106l69Q32K054K732K656K199
51668C54904J964K222K856L742M875O106P064P476P280O345M457J762j014l033
51654D07006l931l851l134k002m02J834M409O240O213M371J822o04l110o047q870
$$ y = [436280, 441844, 444443, 443788, 440324, 434394, 425989, 415373, 403559, 391932, 381483, 372489, 364774, 358088, 352303, 347483, 343833, 341446, 340047, 339165, 338653, 338901, 340380, 343103, 346773, 351340, 357078, 363990, 371388, 378232, 383768, 387720, 390115, 391164, 391289, 391054, 391013, 391586, 392843, 394263, 394835, 393696, 390730, 386533, 381930, 377635, 374143, 371619, 369903, 368777, 368106, 367582, 366590, 364776, 362599, 360912, 360009, 359596, 359618, 360481, 362262, 364326, 366107, 367719, 369280, 370088, 369261, 367149, 365467, 365772, 368092, 371101, 373330, 374072, 373429, 371757, 369137, 365406, 360711, 355858, 351856, 349131, 347323, 345906, 344800, 344431, 345263, 347317, 350049, 352705, 354904, 356868, 359090, 361946, 365688, 370563, 376669, 383733, 391209, 398489, 404834, 409291, 411053, 410039, 407006, 403075, 399224, 396090, 394088, 393686, 395520, 399929, 406169, 412382, 416753, 418575, 417971, 414861, 408814, 399944]
51639C99944j0556j0698r758q504p516o961o389n038k713k37J372J927K010K172
51625C39055K583L149L495L069J769K76p04j229j733k143k056j582j323j569k072
51610C38985k564k944l015k660k230k192k396k316j878j434r72j01J143K290L239
51595C20955M358N723P073Q538J0345J1592J0557O883K418q94l046m995o600o823
51581C66084n532l785k385j158K50J813L522N542P720R518J0689J1572J2539J3645
51567D30034J4913J6439J8036J9193J9657J9824K0313K1451K3277K5782K8905
51556F57824L2348L5531L7606L7637L4938K9420K1578J2266K505o793j5154k2474
51544H57232k8495l2692l4994l6232l7220l7617l6362l3200k9146k5284k1742
$$ y = [399944, 389388, 378690, 368932, 360428, 352912, 345951, 339562, 334524, 331811, 331574, 332946, 334873, 336883, 339055, 341638, 344787, 348282, 351351, 353120, 353396, 352692, 351463, 349730, 347587, 345531, 343949, 342626, 341057, 338985, 336421, 333477, 330462, 327802, 325572, 323380, 320984, 318668, 316790, 315356, 314384, 314283, 315426, 317716, 320955, 325313, 331036, 338109, 346647, 356992, 368584, 379141, 386024, 388442, 387548, 384502, 379507, 372907, 366084, 360552, 356767, 354382, 353224, 353474, 355287, 358809, 364351, 372071, 381589, 392278, 403850, 416389, 430034, 444947, 461386, 479422, 498615, 518272, 538096, 558409, 579860, 603137, 628919, 657824, 690172, 725703, 763309, 800946, 835884, 865304, 886882, 899148, 901653, 894860, 879706, 857232, 828737, 796045, 761051, 724819, 687599, 649982, 613620, 580420, 551274, 525990, 504248]
51533E04248j8143j4520j1452r524q873q914q493o701l894j459k99J11P48J528
51519D14363J399j12k047l045k839k417k732l669m437m697m823n071n012m196
51505C70665k986k218k191k520k875l250l495l199k331j488j258j544j832j759
51491C37719j292o63l65p81j568j771q71N33J442J563J341J183J075Q56M46j88
51475C38659j015j863k514k837k772k415k125k224k483k335j757j376j464j431
51461C10048q35k00j46k76J61R29J152P86O00P54N70m4j88N77J495J974K668M286
51443C24311O214P368P905Q870J0450J1568J1211R274O167K500o92k364k473j985
51429C98324j673j526j539k260l984n966p073o977o158n025l617k097r47m70l96
$$ y = [504248, 486105, 471585, 460133, 450609, 441736, 432822, 424329, 417628, 413734, 412275, 411976, 412087, 412835, 414363, 415762, 415650, 413603, 410558, 407719, 405302, 402570, 398901, 394464, 389767, 384944, 379873, 374861, 370665, 367679, 365461, 363270, 360750, 357875, 354625, 351130, 347931, 345600, 344112, 342854, 341310, 339478, 337719, 336427, 335764, 335399, 334618, 333050, 331279, 330408, 330941, 332383, 333946, 335287, 336470, 337545, 338401, 338847, 338659, 337644, 335781, 333267, 330430, 327658, 325243, 323118, 320894, 318411, 316076, 314319, 312943, 311479, 310048, 309213, 309013, 308867, 308591, 308752, 309681, 310833, 311619, 312219, 312973, 313543, 313499, 313311, 313888, 315383, 317357, 320025, 324311, 330525, 337893, 345798, 354668, 365118, 376686, 387897, 397171, 403338, 405838, 405146, 402782, 400309, 398324, 396651, 395125, 393586, 391326, 387342, 381376, 374303, 367326, 361168, 356143, 352526, 350429, 349482, 349012, 348616]
51414C48616k29J68N01N17M11O18J174J549J337Q28N57M80J54l27k63N43J291
51397C57925J238P29O44J207J982K713L550M508N412O329P518Q989J0585J2515
51383D25844J5152J8372K1670K5050K9045L3684L8192M2098M5935N0166N3920
51372G99128N5408N3395M7717L8733K7071J3921Q57j0952k1108k9646l6630m2136
51360H95758m6207m8764m9734m9228m7389m4137l9509l4165k9156k5048k1599
51349D60822j8403j5520j3264j1724j0634r609q352o870n574m928m862m745m135
51336C42202l302k791k685k602k345k167k288k430k093j215l59j27m80q25p50
51321C15743l60J28Q17J852K919L457L319K869K420J988J621J559J805J873J272
$$ y = [348616, 348387, 348555, 349056, 349573, 349984, 350602, 351776, 353325, 354662, 355490, 356047, 356527, 356681, 356354, 356091, 356634, 357925, 359163, 359892, 360536, 361743, 363725, 366438, 369988, 374496, 379908, 386237, 393755, 402744, 413329, 425844, 440996, 459368, 481038, 506088, 535133, 568817, 607009, 649107, 695042, 745208, 799128, 854536, 907931, 955648, 994381, 1021452, 1035373, 1036230, 1025278, 1004170, 974524, 937894, 895758, 849551, 800787, 751053, 701825, 654436, 610299, 570790, 536625, 507469, 482421, 460822, 442419, 426899, 413635, 401911, 391277, 381668, 373316, 366446, 360872, 355944, 351082, 346337, 342202, 338900, 336109, 333424, 330822, 328477, 326310, 324022, 321592, 319499, 318284, 317925, 317798, 317318, 316493, 315743, 315383, 315511, 316328, 318180, 321099, 324556, 327875, 330744, 333164, 335152, 336773, 338332, 340137, 342010, 343282]
51306C43282O2j271k309k889k985k671k132j528r16m38l60q01j507k132k636l168
51290C15601l662l749l115j834l61P77J372J677K107K759L414L935M416M852M955
51275C33144M548L836L054K067O55r18j926j805o15R85K145K410K128K017K234
51260C53959K154J383M58M5j39q79k136k968k814k125j591j438j783k864m451
51245C34811n540n258l825k236j206q05p94q76p43l11J26K50Q3j26k49k94l02
51228C12705m23q10j158p98L39J273J128M21M73J658L004L563L383K896K218J476
51212C31348J192J637K183J990J122M36L74M60R7n10n50M28J891K727K302J064
51196C48191J5l95o21j183j861j997j376m55K08M55M87N62P78R29O39k05j118
$$ y = [343282, 343344, 342073, 339764, 336875, 333890, 331219, 329087, 327559, 326643, 326205, 325845, 325044, 323537, 321405, 318769, 315601, 311939, 308190, 305075, 303241, 302880, 303657, 305029, 306706, 308813, 311572, 314986, 318921, 323337, 328189, 333144, 337692, 341528, 344582, 346649, 347304, 346386, 344460, 342655, 342040, 343025, 345170, 347580, 349708, 351725, 353959, 356113, 357496, 357954, 357999, 357860, 356981, 354845, 351877, 349063, 346938, 345347, 343909, 342126, 339262, 334811, 329271, 324013, 320188, 317952, 316746, 315941, 315147, 314271, 313528, 313217, 313343, 313593, 313676, 313550, 313301, 313007, 312705, 312282, 311472, 310314, 309516, 309855, 311128, 312256, 312677, 313150, 314808, 317812, 321375, 324758, 327654, 329872, 331348, 332540, 334177, 336360, 338350, 339472, 339908, 340282, 340742, 340839, 340329, 339779, 340207, 342098, 344825, 347127, 348191, 348206, 347811, 347190, 346007, 344146, 342149, 340773, 340318, 340526, 340981, 341468, 342030, 342808, 343737, 344376, 344171, 343053]
51179C43053j390p88J90Q42Q94O28N29P87J060Q51J84l62m15l56o87j099p90L38
51161C43469J468J993K245K740L279L286K738K089J518P94j26q98j361j774k332
51146C59128k786k803k515k381k609k929k955k593k073j692j546j473j234p46
51132C28793j50L52O92R17J047J062J057J305J995K870L356L217K940L182L883
51117C56518M257L789K926K527K781K985K410J152Rl67q9K44L45N22J076J652
51101C82737J628J047O48Q31J123R53N23L59L84J6r08j863k281j980j008L48J377
51084C83934J391O11P4L84R75R52K88l14m09j92N8L70Q21J225J313J156J205J838
51066C95680K903L832M240M309M518N230O731R335J2852J6038J7324J6309J4096
$$ y = [343053, 341663, 340875, 341065, 341907, 342801, 343429, 343958, 344745, 345805, 346656, 346840, 346478, 346063, 345707, 345020, 343921, 343131, 343469, 344937, 346930, 349175, 351915, 355194, 358480, 361218, 363307, 364825, 365619, 365493, 364595, 363234, 361460, 359128, 356342, 353539, 351024, 348643, 346034, 343105, 340150, 337557, 335484, 333792, 332246, 330773, 329539, 328793, 328643, 328995, 329687, 330604, 331651, 332713, 333770, 335075, 337070, 339940, 343296, 346513, 349453, 352635, 356518, 360775, 364564, 367490, 370017, 372798, 375783, 378193, 379345, 379354, 378987, 378898, 379142, 379487, 380009, 381085, 382737, 384365, 385412, 386060, 386891, 388014, 388967, 389490, 389849, 390233, 390249, 389341, 387478, 385197, 383217, 382209, 382557, 383934, 385325, 385936, 386010, 386394, 387369, 388321, 388609, 388295, 387886, 387694, 387752, 388122, 388943, 390168, 391481, 392637, 393842, 395680, 398583, 402415, 406655, 410964, 415482, 420712, 427443, 436778, 449630, 465668, 482992, 499301, 513397]
51053E13397J1942J0209Q929Q661R944J2179J3914J4215J3213J1317Q664N489
51041F42073K346n23l578p212j0840j3217j3677j2658j1054r437q111p523q120
51028E38469r719j1347j1929j1062r057o479l867j660j7J243K233K651K330J947
51014D83736K518M008N226N488N595O550P965Q694Q663Q895R805J0559J0484J0077
51000E88263J0111J0431J0378R849R196Q411P126N398L756K389Q84r69k572l088
50986F59563k481j595j136q52J40K319N295Q343J1043J3277J4830J5466J5373
50973G39585J5169J5337J5989J7231J9518K3224K7989L2846L7115M1024M5327
50962A030354N0312N5326N9365O2093O4002O5565O6525O6285O4730O2205N8815
$$ y = [513397, 525339, 535548, 544477, 553138, 563082, 575261, 589175, 603390, 616603, 627920, 636584, 642073, 644419, 643896, 640318, 633106, 622266, 609049, 595372, 582714, 571660, 562223, 554112, 546589, 538469, 528750, 517403, 505474, 494412, 485355, 478876, 475009, 473349, 473332, 474575, 476808, 479459, 481789, 483736, 486254, 490262, 495488, 500976, 506571, 513121, 521086, 529780, 538443, 547338, 557143, 567702, 578186, 588263, 598374, 608805, 619183, 629032, 638228, 646639, 653765, 659163, 662919, 665308, 666192, 665223, 662651, 659563, 657082, 655487, 654351, 653499, 653639, 655958, 661253, 669596, 680639, 693916, 708746, 724212, 739585, 754754, 770091, 786080, 803311, 822829, 846053, 874042, 906888, 944003, 985027, 1030354, 1080666, 1135992, 1195357, 1257450, 1321452, 1387017, 1453542, 1519827, 1584557, 1646762, 1705577]
50951A705577N4273M8532M2099L5600K9410K3866J9373J6001J3349J1229J0131
50940B009440J0525J1825J2622J1969J0149Q040O049L838Q84k873p028j1236j5632
50927B048572k0550k5962l1462l6859m2428m8389n4419n9870o4187o6959o7943
50916A529544o7347o5766o3445o0016n5344n0240m5621m1357l6759l2094k8526
50905I83029k6436k4821k2806k0829j9661j8968j7760j5795j3708j1993j0623
50894G79629r521q640p606o092m551l795l716l163j508L88J245R25L98M98J289
50879G35780K402L484M341N040N853O869P817Q507R222J0303J1505J2296J2691
50866H36110J3359J4834J6952J9223K1370K3456K5749K8559L1974L5735L9557
$$ y = [1705577, 1759850, 1808382, 1850481, 1886081, 1915491, 1939357, 1958730, 1974731, 1988080, 1999309, 2009440, 2019965, 2031790, 2044412, 2056381, 2066530, 2074570, 2080619, 2084457, 2085341, 2082468, 2075440, 2064204, 2048572, 2028022, 2002060, 1970598, 1933739, 1891311, 1842922, 1788503, 1728633, 1664446, 1597487, 1529544, 1462197, 1396431, 1332986, 1272970, 1217626, 1167386, 1121765, 1080408, 1043649, 1011555, 983029, 956593, 931772, 908966, 888137, 868476, 849508, 831748, 815953, 802245, 790252, 779629, 770108, 761468, 753862, 747770, 743219, 739424, 735708, 732545, 731037, 731425, 732670, 733595, 733993, 734491, 735780, 738182, 741666, 746007, 751047, 756900, 763769, 771586, 780093, 789315, 799618, 811123, 823419, 836110, 849469, 864303, 881255, 900478, 921848, 945304, 971053, 999612, 1031586, 1067321, 1106878]
50855A106878M3549M8040N3076N8479O4378P1233P9227Q7986R7050J06142J14934
50844A930972J22967J30106J36563J42300J46761J49468J50272J48669J43428
50835C201506J33575J19526J02702Q4332O5194M6234K8663J3354O99q985j5346
50824C771454j8320j8097j4791q568q8R612J9490K8188L3640L3799K8080J7414
50812C881813K877j4979l5359n6737p7743r7862j16712j33306j46647j56582j63255
50801B885508j66198j64834j59656j51995j42587j31284j18354j05195r3180q2295
50791A569930p1588o0742n0625m2228l5584k9946k4694j9785j5412j1706q828
50780A198792o998o169n849n612n590o136p124q053q751r520j0422j1074j1324
$$ y = [1106878, 1150427, 1198467, 1251543, 1310022, 1374400, 1445633, 1524860, 1612846, 1709896, 1816038, 1930972, 2053939, 2184045, 2320608, 2462908, 2609669, 2759137, 2909409, 3058078, 3201506, 3335081, 3454607, 3557309, 3641641, 3706835, 3753069, 3781732, 3795086, 3795785, 3786800, 3771454, 3753134, 3735037, 3720246, 3711678, 3711590, 3721202, 3740692, 3768880, 3802520, 3836319, 3864399, 3881813, 3884690, 3869711, 3834352, 3777615, 3699872, 3602010, 3485298, 3351992, 3205345, 3048763, 2885508, 2719310, 2554476, 2394820, 2242825, 2100238, 1968954, 1850600, 1745405, 1652225, 1569930, 1498342, 1437600, 1386975, 1344747, 1309163, 1279217, 1254523, 1234738, 1219326, 1207620, 1198792, 1191794, 1185625, 1179776, 1174164, 1168574, 1162438, 1155314, 1147261, 1138510, 1128990, 1118568, 1107494, 1096170]
50767A096170j1673j2617j3952j5076j5705j5888j5658j5077j4417j3842j3064
50756I39201j1701r835p929o276m898l677k250j2L181O533R067J0872J3033J6247
50742I51556K0162K4171K8231L2565L7109M1582M5940N0344N4855N9373O3700
50731A409588O7440P0099P1515P2074P2333P2502P2470P2151P1588P0693O9082
50720B191535O6254O1920N6104M8808L9637K8089J4466K78j2604k3143l1152l6308
50708B403884l7879l5565l0122k2764j4334n354L491J1410J7869K2441K4489K3365
50696B360931J8846J0995k28j4592l0881m7121o1801p4406q4635r1697r4907r4606
50684A795898r1837q7308q1187p3780o5710n7281m8436l9564l1710k5391j9724
$$ y = [1096170, 1084497, 1071880, 1057928, 1042852, 1027147, 1011259, 995601, 980524, 966107, 952265, 939201, 927500, 917665, 909736, 903460, 898562, 894885, 892635, 892623, 895804, 902337, 911404, 922276, 935309, 951556, 971718, 995889, 1024120, 1056685, 1093794, 1135376, 1181316, 1231660, 1286515, 1345888, 1409588, 1477028, 1547127, 1618642, 1690716, 1763049, 1835551, 1908021, 1980172, 2051760, 2122453, 2191535, 2257789, 2319709, 2375813, 2424621, 2464258, 2492347, 2506813, 2507091, 2494487, 2471344, 2440192, 2403884, 2366005, 2330440, 2300318, 2277554, 2263220, 2257866, 2261357, 2272767, 2290636, 2313077, 2337566, 2360931, 2379777, 2390772, 2390544, 2375952, 2345071, 2297950, 2236149, 2161743, 2077108, 1985411, 1890504, 1795898, 1704061, 1616753, 1535566, 1461786, 1396076, 1338795, 1290359, 1250795, 1219085, 1193694, 1173970]
50673A173970j3401o307N03O193J0757J4240J6285J6854J6698J6574J6372J5534
50661A284272J3999J2357J1169J0616J0609J0900J1198J1515J2181J3269J4210
50650A416295J4500J4545J5282J7037J9290K1611K4270K7615L1359L4766L7429
50639A673999L9565M1608M3638M5183M5660M5002M3734M2369M0969L9470L8158
50628B139355L7513L7758L8810M0168M0313L6632K6969J1652o423k3626l7176
50617B341945m5298m7221m3663l6750k8732k0859j3571p154j782K561N631O697
50605B111804N129R91n215j3071k2115l1636m1031n0020n8143o4408o8006o9052
50593A695227o8173o5676o1827n7514n3714n0367m6649m2423l8528l5469l2729
$$ y = [1173970, 1160569, 1154262, 1154765, 1160958, 1171715, 1185955, 1202240, 1219094, 1235792, 1252366, 1268738, 1284272, 1298271, 1310628, 1321797, 1332413, 1343022, 1353922, 1365120, 1376635, 1388816, 1402085, 1416295, 1430795, 1445340, 1460622, 1477659, 1496949, 1518560, 1542830, 1570445, 1601804, 1636570, 1673999, 1713564, 1755172, 1798810, 1843993, 1889653, 1934655, 1978389, 2020758, 2061727, 2101197, 2139355, 2176868, 2214626, 2253436, 2293604, 2333917, 2370549, 2397518, 2409170, 2402747, 2379121, 2341945, 2296647, 2249426, 2205763, 2169013, 2140281, 2119422, 2105851, 2098697, 2096915, 2099476, 2105107, 2111804, 2116933, 2117924, 2112709, 2099638, 2077523, 2045887, 2004856, 1954836, 1896693, 1832285, 1764279, 1695227, 1627054, 1561378, 1499551, 1442037, 1388323, 1337956, 1291307, 1248884, 1210356, 1174887, 1142158]
50582A142158k9830k7278k5688k4520k2473j9077j5204j1950r439o962l929m64
50570I45344K869N674P946R794J1214J2293J3448J4994J6606J7630J8062J8716
50558A094590K0194K2153K3912K5386K6848K8052K8320K7450K5954K4283K2336
50547A369478J9946J7476J5604J4797J5131J6355J7989J9761K2140K5988L1352
50536A586017L7045M1888M6087N0760N6354O2249O7891P3499P9388Q5198R0294
50525B276670R4533R8230J01481J03906J04960J04315J01975R8075R2464Q4543
50515C261152P3848O0803M6406L1147J4715k951k0862l7740n3066o6819p8576
50504C228057q7512r3079r5073r3159q7166p7815o6442n3817l9717k3973p422
$$ y = [1142158, 1112328, 1085050, 1059362, 1034842, 1012369, 993292, 978088, 966138, 956699, 949737, 945808, 945344, 948213, 953887, 961833, 971627, 982841, 995134, 1008582, 1023576, 1040182, 1057812, 1075874, 1094590, 1114784, 1136937, 1160849, 1186235, 1213083, 1241135, 1269455, 1296905, 1322859, 1347142, 1369478, 1389424, 1406900, 1422504, 1437301, 1452432, 1468787, 1486776, 1506537, 1528677, 1554665, 1586017, 1623062, 1664950, 1711037, 1761797, 1818151, 1880400, 1948291, 2021790, 2101178, 2186376, 2276670, 2371203, 2469433, 2570914, 2674820, 2779780, 2884095, 2986070, 3084145, 3176609, 3261152, 3335000, 3395803, 3442209, 3473356, 3488071, 3485120, 3464258, 3426518, 3373452, 3306633, 3228057, 3140545, 3047466, 2952393, 2859234, 2772068, 2694253, 2627811, 2573994, 2534277, 2510304, 2502882]
50493B502882Q346K1955L2780M0738M5584M6255M1201K9884J3717n011k5002m5952
50481B707377o6823q5279r9277j08418j13289j14377j12326j08409j03686r7950
50471A697543r0473q1571p2586o4370n6638m9000m1809l5686l0721k6534k2841
50460A125314j9613j6829j4314j1833r282o778m465k224K40K880N250P174R173
50447A064693J1678J4220J6022J7317J9152K1709K3661K3726K2249K0537J9017
50436A273981J6922J3799J0436P930O442N333M213L251K603K099J649J476J711
50423A351845K083K288K502L204M644O703R236J2289J6039K0577K5649L0560L4656
50410A522275L8075M1645M5606M8890N0265M9922M9147M8484M7142M4362M0499
$$ y = [2502882, 2511228, 2533183, 2565963, 2606701, 2652285, 2698540, 2739741, 2769625, 2783342, 2778331, 2753329, 2707377, 2640554, 2555275, 2455998, 2347580, 2234291, 2119914, 2007588, 1899179, 1795493, 1697543, 1607070, 1525499, 1452913, 1388543, 1331905, 1282905, 1241096, 1205410, 1174689, 1148155, 1125314, 1105701, 1088872, 1074558, 1062725, 1053443, 1046665, 1042200, 1039976, 1040216, 1043096, 1048346, 1055520, 1064693, 1076371, 1090591, 1106613, 1123930, 1143082, 1164791, 1188452, 1212178, 1234427, 1254964, 1273981, 1290903, 1304702, 1315138, 1323068, 1329510, 1334843, 1339056, 1342307, 1344910, 1347009, 1348658, 1350134, 1351845, 1353928, 1356216, 1358718, 1361922, 1366566, 1373269, 1382505, 1394794, 1410833, 1431410, 1457059, 1487619, 1522275, 1560350, 1601995, 1647601, 1696491, 1746756, 1796678, 1845825, 1894309, 1941451, 1985813, 2026312]
50399B026312L6250L1499K5541J8051R284m87j1177k2600l4269m5377n4964o2291
50387A915772o7148o9530o9096o5563n9592n2586m5188l6754k6793j6229o566
50376A400727J684Q915J5205J9974K2643K2869K0213J4456O229l150j2645k1801
50364A495319l0261l7523m3189m6997m8671m8204m6273m3891m1593l9288l6855
50353A032574l4439l2123k9741k7030k3781j9952j5839j1916q287m545n30L253
50341H27644O234Q268R020P641L932o19m014n634o060n545l856j442O75K276L908
50326H42428N452O032N760O110P903J0077J1251J1412J1287J0970J0173R042P794
50313I55691O130L870J630P0j043k262l364l733l330k533j420k9J073J489J908
$$ y = [2026312, 2062562, 2094061, 2119602, 2137653, 2146937, 2146450, 2135273, 2112673, 2078404, 2033027, 1978063, 1915772, 1848624, 1779094, 1709998, 1644435, 1584843, 1532257, 1487069, 1450315, 1423522, 1407293, 1400727, 1402411, 1411326, 1426531, 1446505, 1469148, 1492017, 1512230, 1526686, 1532915, 1529765, 1517120, 1495319, 1465058, 1427535, 1384346, 1337349, 1288678, 1240474, 1194201, 1150310, 1108717, 1069429, 1032574, 998135, 966012, 936271, 909241, 885460, 865508, 849669, 837753, 829466, 824921, 824391, 827644, 833878, 842146, 851166, 858807, 862739, 862120, 858106, 852472, 846412, 840867, 837011, 835569, 836244, 838520, 842428, 847880, 853912, 859672, 865782, 873685, 883762, 895013, 906425, 917712, 928682, 938855, 947897, 955691, 961821, 965691, 967321, 967391, 966348, 964086, 960722, 956989, 953659, 951126, 949706, 949677, 950750, 952239, 954147]
50298I54147L363N794Q286J0490J2845J5447J7809J9942K2612K6258L0460L4830
50286A162283L9371M3265M3976L8651K6567R915p626k2747l3322l8364l8056l3925
50274A189988k8369k3334j9198j5307j1565q889p853p642p081o261o149o763o820
50261A034757n500l650k698k848k915j718Q73M118P160R533J1251J2597J3839
50248A074799J5051J6112J6817J7083J7098J7188J7466J7736J7797J7683J7469
50237A262299J7003J5968J3986J0593N489r20p563j3596j8881k3288k6086k6666
50225A208338k5538k3795k1817j9354j6770j5209j5333j6752j8956k1871k5054
50214I87889k7276k7705k6889k5741k4066k1069j7077j3588j1516j0250q832p264
$$ y = [954147, 957510, 963304, 971590, 982080, 994925, 1010372, 1028181, 1048123, 1070735, 1096993, 1127453, 1162283, 1201654, 1244919, 1288895, 1327546, 1354113, 1364028, 1356402, 1333655, 1300333, 1261969, 1223913, 1189988, 1161619, 1138285, 1119087, 1103780, 1092215, 1083326, 1075473, 1067831, 1060750, 1054489, 1048340, 1041577, 1034757, 1029257, 1025607, 1022909, 1020061, 1017146, 1015428, 1016301, 1020419, 1027579, 1037112, 1048363, 1060960, 1074799, 1089850, 1105962, 1122779, 1139862, 1156960, 1174148, 1191614, 1209350, 1227147, 1244830, 1262299, 1279302, 1295270, 1309256, 1319849, 1325338, 1324418, 1316855, 1303259, 1284378, 1261090, 1235004, 1208338, 1182800, 1159005, 1137188, 1117834, 1101064, 1085855, 1070522, 1053770, 1034814, 1012943, 987889, 960613, 932908, 906019, 880278, 856212, 835143, 818066, 804478, 792962, 782712, 773880, 766616]
50202G66616o104n395m735m124l993m349m576m341m132m517n182n321m818m450
50188G00579m848n777o630p143p314p080o511o036n954n921n435m688m395m752
50174F18095n137m954m326l726l336l012k545j747n85N47J096J110J413K576L986
50159E99455M461L740K928L258M738O285O980O943O931P318P751P752P372P021
50145F82933O805O442N841N400N533O186P112Q436J0642J3962J8037K2268K6298
50132H25895L0023L3216L5394L6212L5909L5215L4716L4507L4512L4851L5518
50121A205968L5867L4845L1890K7215K1120J3492M394n202j3827k0691k6063l0481
50109A278527l3936l5999l6457l5545l3710l1382k8902k6464k4006k1370j8630
$$ y = [766616, 760512, 755117, 750382, 746258, 742265, 737916, 733340, 728999, 724867, 720350, 715168, 709847, 705029, 700579, 695731, 689954, 683324, 676181, 668867, 661787, 655276, 649240, 643286, 637365, 631930, 627242, 622847, 618095, 612958, 608004, 603678, 599952, 596616, 593604, 591059, 589312, 588727, 589274, 590370, 591480, 592893, 595469, 599455, 603916, 607656, 610584, 613842, 618580, 624865, 631845, 638788, 645719, 653037, 660788, 668540, 675912, 682933, 689738, 696180, 702021, 707421, 712954, 719140, 726252, 734688, 745330, 759292, 777329, 799597, 825895, 855918, 889134, 924528, 960740, 996649, 1031864, 1066580, 1101087, 1135599, 1170450, 1205968, 1241835, 1276680, 1308570, 1335785, 1356905, 1370397, 1374791, 1369589, 1355762, 1335071, 1309008, 1278527, 1244591, 1208592, 1172135, 1136590, 1102880, 1071498, 1042596, 1016132, 992126, 970756, 952126]
50098I52126j6157j4365j3357j2868j2452j1690j0405q798p257n842m107j676
50086H33152J126L560N373O941Q432R332R212Q507P999P793P396O683O028N449
50072I26983M388K641Q59l34j212k356l634m411m619m835n371n930o331o844p555
50057H81439p961p648o957o475o169n550m529l548k871k251j345m9J636L679N819
50042H37220P650R063J0285J1402J2207J2694J3199J3747J3723J2620J0810R154
50030I73774Q067P405O926O418N570M300L092K423K020J249R4q58j292j274n68
50015A017346J253L850O057P147P436P394O894N850M785M294M434N141O548Q395
50001A096824R782J0208J0222J0304R708P283L003k214p795j3569j8876k2774
$$ y = [952126, 935969, 921604, 908247, 895379, 882927, 871237, 860832, 852034, 844777, 838935, 834828, 833152, 834278, 837838, 843211, 850152, 858584, 867916, 877128, 885635, 893634, 901427, 908823, 915506, 921534, 926983, 931371, 934012, 934871, 934537, 933325, 930969, 927335, 922924, 918305, 913470, 908099, 902169, 895838, 888994, 881439, 873478, 865830, 858873, 852398, 846229, 840679, 836150, 832602, 829731, 827480, 826135, 826086, 827722, 831401, 837220, 844870, 853933, 864218, 875620, 887827, 900521, 913720, 927467, 941190, 953810, 964620, 973774, 981841, 989246, 996172, 1002590, 1008160, 1012460, 1015552, 1017975, 1019995, 1021244, 1021338, 1020480, 1019188, 1017914, 1017346, 1018599, 1022449, 1028506, 1035653, 1043089, 1050483, 1057377, 1063227, 1068012, 1072306, 1076740, 1081881, 1088429, 1096824, 1106606, 1116814, 1127036, 1137340, 1147048, 1154331, 1157334, 1155120, 1147325, 1133756, 1114880, 1092106]
49989A092106k5120k6493k7060k6528k5317k4646k5063k5703k5470k4294k2842
49978H13570k1578k0555j9688j8746j7404j5597j3669j1982j0643r590q615p402
49966F38101n926m764m470m757m891m736m654m501l646k134q13n5O89J775K810
49951E98028L723N388Q264J1260J2810J2560J1276R591P723N966M561L297J966
49938F96413R49O17M61m43k299m691p551j1051j4602j6911j7324j6501j5422j4241
49924E77404j2417r646o463l970k939l010k964k050p48J16O30J478K676L428L285
49909E44810K758K631L177M221N398O238O520O687P500R049J0563J1406J1782
49896F32740J2188J2561J2304J0976Q669N908L295J160o20k361m257o354q686
$$ y = [1092106, 1066986, 1040493, 1013433, 986905, 961588, 936942, 911879, 886176, 860706, 836412, 813570, 791992, 771437, 751749, 733003, 715599, 700002, 686333, 674351, 663708, 654118, 645503, 638101, 632175, 627411, 622941, 618184, 613293, 608557, 603903, 599402, 595756, 593622, 592809, 592754, 593443, 595218, 598028, 601751, 607139, 615403, 626663, 639473, 652033, 663309, 672900, 680623, 686589, 691150, 694447, 696413, 697362, 697979, 698440, 697997, 695698, 691007, 683456, 672405, 657803, 640892, 623568, 607067, 591645, 577404, 564987, 555341, 548878, 544908, 541969, 538959, 535995, 533945, 533197, 533313, 533943, 535421, 538097, 541525, 544810, 547568, 550199, 553376, 557597, 562995, 569233, 575753, 582440, 589940, 598989, 609552, 620958, 632740, 644928, 657489, 669793, 680769, 689438, 695346, 698641, 699801, 699181, 696820, 692563, 686209, 677523]
49883F77523j1021j2706j3216j2913j2717j2961j3063j2487j1433j0312r052p389
49871E38253n570m240l714l643l443k838k007j230l75J105L399N705O900O890
49857E35192O833P768R450J0947J1863J2508J3116J3478J3332J2636J1418R683
49845F68224P603N556L820K395J042n39k587n086p662r756j0942j1131j0561r677
49831F20699q894q275p518o392n118m183l794l597k973j553M82K569M285N666
$$ y = [677523, 666502, 653796, 640580, 627667, 614950, 601989, 588926, 576439, 565006, 554694, 545642, 538253, 532683, 528443, 524729, 521086, 517643, 514805, 512798, 511568, 511193, 512298, 515697, 521402, 528302, 535192, 542025, 549793, 559243, 570190, 582053, 594561, 607677, 621155, 634487, 647123, 658541, 668224, 675827, 681383, 685203, 687598, 688640, 688101, 685514, 680428, 672766, 663010, 652068, 640937, 630376, 620699, 611805, 603530, 596012, 589620, 584502, 580319, 576525, 572928, 569955, 568402, 568884, 571453, 575738, 581404]
$$ [...]
##END NTUPLES=NMR SPECTRUM
##END=
