##TITLE=AC1601_NICAH13331_8315839_jAzB6LRIxf
##JCAMPDX= 6.0         $$ Bruker NMR JCAMP-DX V2.0
##DATA TYPE= NMR SPECTRUM
##DATA CLASS= NTUPLES
##ORIGIN= BRUKER
##OWNER= Administrator
$$ 1.72 TOPSPIN		Version 2.1
$$ 2013-11-09 18:46:05.237 -0800  Administrator@X
$$ Compression mode = diff/dup
##.OBSERVE FREQUENCY= 400.02188249412
##.OBSERVE NUCLEUS= ^1H
##.ACQUISITION MODE= SIMULTANEOUS (DQD)
##.ACQUISITION SCHEME= undefined
##.AVERAGES= 64
##.DIGITISER RES= 22
##SPECTROMETER/DATA SYSTEM= spect
##.PULSE SEQUENCE= noesygpps1d.comp
##.SOLVENT NAME= COFFEE_meoh
##.SHIFT REFERENCE= INTERNAL, COFFEE_meoh, 1, 14.96093
##AUDIT TRAIL= $$ (NUMBER, WHEN, WHO, WHERE, PROCESS, VERSION, WHAT)
$$ ##TITLE= Audit trail, TOPSPIN		Version 2.1
$$ ##JCAMPDX= 5.01
$$ ##ORIGIN= Bruker BioSpin GmbH
$$ ##OWNER= Administrator
$$ $$ E:\/data/COFFEE/nmr/AC1601_NICAH13331_8315839_jAzB6LRIxf/12/pdata/1/auditp.txt
$$ ##AUDIT TRAIL=  $$ (NUMBER, WHEN, WHO, WHERE, PROCESS, VERSION, WHAT)
(   1,<2013-11-09 18:45:59.936 -0800>,<Administrator>,<X>,<go>,<TOPSPIN 2.1>,
      <created by zg
	started at 2013-11-09 18:34:29.760 -0800,
	POWCHK enabled, PULCHK disabled,
       configuration hash MD5:
       C8 4E 4E 5D D3 5C D8 9E 9F 52 82 E0 59 8A DE 15
       data hash MD5: 64K
       7B B1 FF 74 B1 A7 BB 71 5B A4 BE B7 1B 0E 59 8E>)
(   2,<2013-11-09 18:46:03.054 -0800>,<Administrator>,<X>,<proc1d>,<TOPSPIN 2.1>,
      <Start of raw data processing
       efp LB = 0.3 FT_mod = 6 PKNL = 1 PHC0 = 0 PHC1 = 0 SI = 128K 
       data hash MD5: 128K
       7F 3D C4 96 A4 DF 54 02 E1 90 4D 58 C6 C9 61 B9>)
(   3,<2013-11-09 18:46:04.120 -0800>,<Administrator>,<X>,<proc1d>,<TOPSPIN 2.1>,
      <pk PHC0 = -84.52332 PHC1 = 0 
       data hash MD5: 128K
       5A 40 20 92 E2 5D 60 99 AD 0D 99 15 F9 24 E9 23>)
(   4,<2013-11-09 18:46:04.601 -0800>,<Administrator>,<X>,<proc1d>,<TOPSPIN 2.1>,
      <abs ABSG = 1 
       data hash MD5: 128K
       8B F0 B6 4A 3C 36 7F FA 76 5F 9F 69 C2 6F F2 92>)
(   5,<2013-11-09 18:46:04.704 -0800>,<Administrator>,<X>,<proc1d>,<TOPSPIN 2.1>,
      <abs ABSG = 2 
       data hash MD5: 128K
       2E 0B CA 89 CE 4C A1 59 AB 0B 42 3D FC ED D4 50>)
(   6,<2013-11-09 18:46:04.808 -0800>,<Administrator>,<X>,<proc1d>,<TOPSPIN 2.1>,
      <abs ABSG = 3 
       data hash MD5: 128K
       B0 FC 4B F2 AC A5 A6 ED 33 A4 34 AA 43 40 EC EA>)
(   7,<2013-11-09 18:46:04.911 -0800>,<Administrator>,<X>,<proc1d>,<TOPSPIN 2.1>,
      <abs ABSG = 4 
       data hash MD5: 128K
       72 7B 12 5F 2F 06 25 55 78 EB DB 88 12 F7 D6 25>)
(   8,<2013-11-09 18:46:05.014 -0800>,<Administrator>,<X>,<proc1d>,<TOPSPIN 2.1>,
      <abs ABSG = 5 
       data hash MD5: 128K
       FC 89 D6 7C 70 B1 80 9F A7 6D 6E 47 00 8C 04 28>)
$$ ##END=
$$ 
$$ $$ hash MD5
$$ $$ A8 57 06 3C BC 22 F0 7B 8E CA FA EE ED 29 07 0D
##$RELAX= 
##$RELAX= 
##$RELAX= 
##$RELAX= 
##$RELAX= 
##$RELAX= 
##$RELAX= 
##$RELAX= 
$$ Bruker specific parameters
$$ --------------------------
##$DU= <E:\>
##$EXPNO= 12
$$ [...]
##$TP07= 0
##$TPNAME0= <>
##$TPNAME1= <>
##$TPNAME2= <>
##$TPNAME3= <>
##$TPNAME4= <>
##$TPNAME5= <>
##$TPNAME6= <>
##$TPNAME7= <>
##$TPOAL= (0..7)
0.5 0.5 0.5 0.5 0.5 0.5 0.5 0.5
##$TPOFFS= (0..7)
0 0 0 0 0 0 0 0
##$TUNHIN= 0
##$TUNHOUT= 0
##$TUNXOUT= 0
##$USERA1= <user>
##$USERA2= <user>
##$USERA3= <user>
##$USERA4= <user>
##$USERA5= <user>
##$V9= 5
##$VALIST= <valist>
##$VCLIST= <CCCCCCCCCCCCCCC>
##$VD= 0
##$VDLIST= <DDDDDDDDDDDDDDD>
##$VPLIST= <PPPPPPPPPPPPPPP>
##$VTLIST= <TTTTTTTTTTTTTTT>
##$WBST= 1024
##$WBSW= 4
##$XGAIN= (0..3)
0 0 0 0
##$XL= 0
##$YL= 0
##$YMAX_a= 5904842
##$YMIN_a= -11424511
##$ZGOPTNS= <>
##$ZL1= 120
##$ZL2= 120
##$ZL3= 120
##$ZL4= 120
##$ABSF1= 14.96093
##$ABSF2= -5.597252
##$ABSG= 5
##$ABSL= 3
##$ALPHA= 0
##$AQORDER= 0
##$ASSFAC= 0
##$ASSFACI= 0
##$ASSFACX= 0
##$ASSWID= 0
##$AUNMP= <proc_prof1d_extract.lims>
##$AXLEFT= 0
##$AXNAME= <>
##$AXNUC= <1H>
##$AXRIGHT= 0
##$AXTYPE= 0
##$AXUNIT= <>
##$AZFE= 0.1
##$AZFW= 0.1
##$BCFW= 0
##$BC_mod= 0
##$BYTORDP= 0
##$COROFFS= 0
##$CY= 15
##$DATMOD= 1
##$DC= 0
##$DFILT= <>
##$DTYPP= 0
##$F1P= 0
##$F2P= 0
##$FCOR= 0.5
##$FTSIZE= 131072
##$FT_mod= 6
##$GAMMA= 0
##$GB= 0
##$INTBC= 1
##$INTSCL= 1
##$ISEN= 128
##$LB= 0.3
##$LEV0= 0
##$LPBIN= 0
##$MAXI= 10000
##$MC2= 0
##$MEAN= 0
##$ME_mod= 0
##$MI= 0
##$NCOEF= 0
##$NC_proc= -2
##$NLEV= 6
##$NOISF1= 0
##$NOISF2= 0
##$NSP= 0
##$NTH_PI= 0
##$NZP= 0
##$OFFSET= 14.96093
##$PC= 1
##$PHC0= -84.52332
##$PHC1= 0
##$PH_mod= 1
##$PKNL= yes
##$PPARMOD= 0
##$PPDIAG= 0
##$PPIPTYP= 0
##$PPMPNUM= 2147483647
##$PPRESOL= 1
##$PSCAL= 4
##$PSIGN= 0
##$PYNMP= <proc.py>
##$REVERSE= no
##$SF= 400.020009665164
##$SI= 131072
##$SIGF1= 0
##$SIGF2= 0
##$SINO= 400
##$SIOLD= 131072
##$SPECTYP= <>
##$SREGLST= <1H.CDCl3>
##$SSB= 0
##$STSI= 131072
##$STSR= 0
##$SW_p= 8223.68421052631
##$SYMM= 0
##$S_DEV= 0
##$TDeff= 65536
##$TDoff= 0
##$TI= <>
##$TILT= no
##$TM1= 0
##$TM2= 0
##$TOPLEV= 0
##$USERP1= <user>
##$USERP2= <user>
##$USERP3= <user>
##$USERP4= <user>
##$USERP5= <user>
##$WDW= 1
##$XDIM= 131072
##$YMAX_p= 415148123
##$YMIN_p= -11524
##$CURPLOT= <Network HP LaserJet P1505>
##$CURPRIN= <$Network HP LaserJet P1505>
##$DFORMAT= <normdp>
##$LAYOUT= <+/1D_H.xwp>
##$LFORMAT= <normlp>
##$PFORMAT= <normpl>
##$SURQMSG= 1
$$ End of Bruker specific parameters
$$ ---------------------------------
##NTUPLES= NMR SPECTRUM
##VAR_NAME=  FREQUENCY,     SPECTRUM/REAL,   SPECTRUM/IMAG
##SYMBOL=    X,             R,               I
##VAR_TYPE=  INDEPENDENT,   DEPENDENT,       DEPENDENT
##VAR_FORM=  AFFN,          ASDF,            ASDF
##VAR_DIM=   131072,        131072,          131072
##UNITS=     HZ,            ARBITRARY UNITS, ARBITRARY UNITS
##FACTOR=    0.0627417313425164, 1,          1
##FIRST=     8223.62146879497, -146,         -58088
##LAST=      0,             2969,            -58451
##MIN=       0,             -11524,          0
##MAX=       8223.62146879497, 415148123,    0
$$ Real data points
##PAGE= N=1
##DATA TABLE= (X++(R..R)), XYDATA
$$ [...]
65290 135108 136932 139171 141725 144256 146423 148102 149292 149940 149973 149376 148117 146112 143506 140890 138913
65275 138913 137621 136484 135160 133903 133077 132595 132137 131656 131301 131037 130744 130562 130695 130941 130855 130394 129892 129397
65257 129397 128566 127459 126853 127394 128802 130322 131618 132822 133959 134857 135446 135765 135739 135280 134489 133446 132004
65240 132004 130135 128308 127068 126378 125780 125083 124371 123556 122535 121749 121891 122951 124137 124863 125229 125410 125288
65223 125288 125033 125302 126346 127408 127518 126522 124879 122966 121125 119988 120000 120778 121585 122265 123119 124000 124293
65206 124293 123868 123375 123409 123890 124407 124726 124767 124520 124151 123867 123554 122958 122261 121951 121960 121552 120413 119326 119232 120066
65186 120066 121138 122327 124103 126431 128465 129602 130343 131651 133768 136016 137581 138200 138177 138072 138393 139300
65170 139300 140466 141347 141716 141862 142221 142933 143849 144893 146230 148067 150408 153088 155953 159044 162605 166845
65154 166845 171476 175598 178406 180201 182413 186350 192072 198727 205788 213601 222922 234344 248196 264464
65140 264464 282671 302140 322484 343493 364510 384417 402508 418981 434274 448342 460964
65129 460964 472321 482615 491326 497518 500839 501592 499814 494998 487051 476959 466010 454628 442304
65116 442304 428405 412669 395159 376255 356711 337375 318759 301042 284410 269102 255191
65105 255191 242625 231459 221711 212970 204544 196199 188412 181686 175891 170578 165702 161606 158426 155932
65091 155932 154002 152857 152605 152842 152937 152647 152259 152217 152685 153407 153906 153874 153488 153227 153350 153637 153736 153527 153026
65072 153026 152129 150793 149374 148460 148268 148494 148819 149289 149983 150569 150495 149581 148152 146603 145060 143608 142643
65055 142643 142768 144240 146626 149050 150833 151893 152581 153192 153724 154028 154066 153905 153509 152663 151187 149163 146901
65038 146901 144665 142588 140859 139832 139710 140102 140186 139427 137999 136414 134917 133477 132154 131080 130124 128974
65022 128974 127729 127059 127520 128798 129933 130243 129896 129546 129614 130008 130469 130996 131769 132731 133514 133937 134383 135383
65004 135383 136967 138780 140770 143272 146306 149228 151382 152772 153828 154794 155674 156491 157210 157615 157667 157878
64988 157878 158814 160296 161499 161883 161688 161548 162060 163730 166786 170763 174627 177592 179625 181072 182110
64973 182110 182688 182644 181633 179301 175792 171823 168025 164504 161245 158455 156103 153585 150545 147745 146315
64958 146315 146211 146193 145459 144470 143833 143207 142018 140714 140378 141192 142095 142117 141387 140545 139695 138467 136881 135564
64940 135564 135082 135379 135998 136618 137172 137613 137841 137951 138397 139665 141675 143566 144312 143642 142236 140895 139720
64923 139720 138310 136632 135211 134372 133725 132772 131756 131427 132100 133384 134895 136642 138535 140000 140574 140583
64907 140583 140727 141122 141286 141100 141271 142563 144931 147738 150614 153766 157514 161871 166647 171716 177008
64892 177008 182380 187609 192535 197130 201447 205561 209542 213374 216864 219707 221735 223151 224403 225778
64878 225778 227112 227914 227711 226290 223734 220376 216710 213162 209880 206774 203788 201033 198630 196529 194610
64863 194610 192927 191660 190781 189937 188852 187744 187085 186846 186234 184421 181418 177941 174450 170707 166404
64848 166404 161863 157783 154522 151970 150027 148770 148171 148042 148373 149369 150937 152464 153380 153742 153928 153937 153386
64831 153386 152185 150833 149916 149551 149451 149326 149035 148547 147962 147551 147583 148092 148907 149924 151221 152946 155234
64814 155234 158241 162067 166502 170918 174693 177908 181608 187123 194907 204008 212786 220280 226804 233145
64800 233145 239372 244673 248299 250275 251011 250539 248510 244821 239866 234107 227751 220956 214062 207381 200980
64785 200980 194933 189650 185640 182985 181266 180004 178960 178052 177280 176879 177314 178888 181399 184261 186947
64770 186947 189297 191519 193994 196995 200513 204435 208935 214491 221301 228800 236027 242500 248483 254346
64756 254346 260007 265213 270017 274538 278380 280863 281931 282352 282746 282863 282255 281313 280950 281301 281397 280272
64740 280272 277832 274352 269711 263630 256372 248650 240966 233467 226339 219864 214051 208603 203435 198960
64726 198960 195740 193969 193286 192967 192429 191794 191797 192816 194101 194406 193432 192167 191743 192397 193737 195513 197766
64709 197766 200524 203755 207451 211383 214862 217059 217583 216644 214722 212223 209361 206190 202784 199376 196170
64694 196170 193010 189545 185843 182555 180263 178943 178301 178265 178795 179484 179885 180157 180910 182420 184374 186397
64678 186397 188398 190330 192047 193596 195331 197555 200288 203587 207815 213272 219716 226556 233515 240807
64664 240807 248548 256154 262491 266647 268465 268339 266625 263362 258535 252420 245599 238700 232150 226052
64650 226052 220264 214759 209936 206415 204388 203329 202484 201562 200886 201092 202772 206129 210727 215783 221017
64635 221017 227013 234418 242982 251867 260850 270706 282204 295076 308132 320142 330383 338566 344495
64622 344495 347884 348412 345919 340511 332500 322432 311248 300127 289890 280634 272155 264506 257868
64609 257868 252121 247017 242618 239098 236249 233742 231856 231219 231715 232334 232458 232660 233713 235288 236228 235887
64593 235887 234649 233250 232075 231092 230062 228746 227138 225461 223815 221976 219774 217505 215667 214421
64579 214421 213637 213400 214099 215959 218752 222030 225507 229163 233060 236995 240355 242512 243511 244067 244596 244529
64563 244529 242984 239902 236030 231891 227396 222534 217810 213580 209437 204758 199685 195101 191634 189023
64549 189023 186533 183713 180633 177647 175173 173632 173261 173836 174706 175303 175666 176367 177861 179983 182085 183588
64533 183588 184381 184752 185005 185079 184540 182996 180568 177936 175914 174988 175108 175801 176479 176825 176906 176922 176943 177057 177526
64514 177526 178503 179691 180691 181612 182928 184697 186462 188060 189935 192379 194995 197343 199669 202507 205971
64499 205971 209984 214870 221034 228197 235585 242840 250150 257474 264246 269935 274372 277397 278710 278286
64485 278286 276546 273928 270567 266534 262047 257314 252506 247964 244059 240736 237590 234502 231768 229491
64471 229491 227337 225102 222972 220917 218364 215014 211616 209373 208726 209150 209929 210661 211213 211762 212871 214999
64455 214999 217888 220779 223258 225457 227392 228656 229023 228976 229268 230208 231673 233591 236015 238784 241522
64440 241522 244138 247069 250812 255319 260114 265008 270525 277490 286304 296730 308293 320758 334317
64427 334317 349579 367479 388958 414582 444460 478644 517518 561780 612193 669558 734801
64416 734801 808755 891473 981561 1076122 1171481 1264251 1352063 1433552 1507796 1573667 1629496
64405 1629496 1673159 1702589 1716453 1714466 1697200 1665793 1621961 1567925 1505709 1436299 1359756
64394 1359756 1276358 1187642 1096385 1005810 918788 837300 762248 693755 631825 576695 528527
64383 528527 486968 451146 420093 393152 370148 351199 336259 324789 316001 309283 304097 299566
64371 299566 294666 288987 282899 276727 270241 263252 256218 249768 243958 238502 233444 228949 224639 219856
64357 219856 214648 209826 205981 203052 201067 200633 202234 205456 209392 213519 217882 222717 228361 235226
64343 235226 243261 251454 258374 263299 266453 268115 268049 266083 262802 259166 255605 251953 248228 244994 242838
64328 242838 241855 241865 242774 244438 246471 248543 250664 252709 253895 253306 251047 248264 245909 243978 242134
64313 242134 240381 238721 236771 234403 232377 231563 231682 231536 230434 228746 226997 225132 222904 220382 217726
64298 217726 214886 211808 208621 205397 202050 198745 196099 194613 194088 193842 193387 192742 192341 192765 194372 197018
64282 197018 200349 204404 209528 215518 221343 226075 229837 233495 237693 242559 248047 254043 260254 266436
64268 266436 272633 278846 284561 289003 291770 292888 292389 290362 287388 284397 281968 280128 278913 278684 279654
64253 279654 281396 283003 283565 282463 279566 275274 270179 264474 257910 250396 242452 234984 228761 224095
64239 224095 220719 217953 215319 213057 211708 211145 210484 209206 207918 207629 208571 210142 211722 213057 213940
64224 213940 214111 213619 212948 212542 212414 212340 212311 212567 213163 213636 213236 211561 208897 205871 202867 199912 197015
64207 197015 194403 192477 191736 192584 194781 197158 198447 198575 198668 199567 200894 201913 202689 203791 205286 206838
64191 206838 208609 211291 215173 219821 224886 230819 238581 248917 261832 276375 290921 304110 315586
64178 315586 325525 333566 338704 340179 337874 331876 322408 310491 297919 286065 275097 264680 254922
64165 254922 246152 238243 230788 223740 217385 211933 207568 204664 203337 202894 202256 200969 199478 198451 198171
64150 198171 198498 199079 199632 200254 201357 203050 204869 206503 208478 211551 215554 219518 222884 225918 228848
64135 228848 231350 233187 234675 236036 236786 236292 234645 232530 230462 228602 227175 226526 226732 227501 228547
64120 228547 229864 231614 234003 237272 241570 246719 252280 258000 264139 271218 279429 288336 297240 305831
64106 305831 314344 323015 331535 339290 346032 351921 356830 360041 361040 360502 360152 361585 365411 371456 379327
64091 379327 388465 397852 406141 412313 416074 417562 416880 414136 409729 404167 397547 389590 380351 370519
64077 370519 360720 350829 340426 329739 319647 310813 303228 296635 290942 286139 282202 279263 277485
64064 277485 276644 276180 275882 276140 277230 278667 279632 279849 279715 279704 280011 280676 281741 283240 285270 288120 292098
64047 292098 297200 303087 309463 316433 324466 334031 345204 357616 370831 384709 399229 414027 428395
64034 428395 441767 453954 464789 473893 480927 485692 487737 486294 481106 473113 463843 454265 444691
64021 444691 435649 428099 422561 418537 415175 412127 409363 406391 402235 396283 388831 380605 372019 363168
64007 363168 354388 346374 339548 333645 328241 323578 320407 318997 318712 318739 318849 319151 319364 318829 317242 315103
63991 315103 313397 312967 314097 316497 319643 323257 327407 332108 337025 341833 346695 352113 358323 365091
63977 365091 372037 378921 385734 392813 400872 410518 421598 433236 444673 455969 467797 480782 495161
63964 495161 510918 528017 546438 566126 587095 609626 634302 661624 691625 724148 759656
63953 759656 799542 845449 898520 959604 1029988 1111509 1206014 1315048 1439980 1581962 1741616
63942 1741616 1918925 2113382 2323850 2548252 2783807 3027678 3277041 3528270 3776326
63933 3776326 4015164 4238537 4440399 4615118 4758085 4866320 4938290 4973063 4969764 4927881
63923 4927881 4847981 4732065 4583336 4405747 4203860 3983059 3749542 3509650 3268919 3031566
63913 3031566 2800711 2578864 2368326 2171387 1990176 1826095 1679293 1548806 1433261
63904 1433261 1331334 1241694 1162908 1093634 1032772 979378 932615 891875 856727 826600 800627
63893 800627 777855 757405 738371 719901 701606 683700 666498 649906 633601 617509 601832
63882 601832 586803 572788 560598 551176 544723 540425 537301 535224 534855 536732 540758 546587 554123 563367
63868 563367 574020 585632 598079 611549 626001 640950 655914 670715 685121 698500 710219
63857 710219 720213 728727 735586 740156 742165 742108 740653 737837 733119 726073 716859 706062 694220 681491
63843 681491 667732 652823 636833 619876 601968 583197 563932 544634 525450 506140 486456
63832 486456 466477 446659 427650 409951 393523 377812 362378 347482 333892 322232 312635 304764
63820 304764 297777 290512 282351 274005 266945 261902 258246 254949 251644 248560 245889 243664 241986 240932
63806 240932 240296 239668 238790 237737 236871 236548 236652 236445 235227 233222 231407 230312 229418 227971 225945 223840
63790 223840 221862 219779 217366 214628 211688 208840 206567 205150 204274 203328 202044 200643 199505 198960 199253
63775 199253 200320 201584 202287 202154 201515 200796 200121 199406 198642 197951 197457 197190 197106 197160 197361 197720 198212 198845 199607
63756 199607 200140 199716 198000 195793 194487 194585 195241 195429 195050 194542 194021 193415 193083 193574 194918 196701 198744
63739 198744 201131 203624 205690 207271 209044 211638 214886 218035 220518 222382 224077 225909 227695 229085
63725 229085 230218 231730 233922 236441 239168 242910 248362 254677 260031 263776 267144 271435 276222 279906
63711 279906 281486 281195 279746 277677 275369 273138 271100 269202 267437 265835 264275 262539 260638 258968
63697 258968 258038 258082 258874 259925 260922 262049 263788 266390 269608 272996 276315 279513 282422 284730 286309
63682 286309 287440 288543 289738 290723 291117 290818 289999 288945 288017 287605 287818 288284 288571 288805 289547 290974 292620
63665 292620 294054 295360 296647 297547 297667 297152 296253 294630 291768 287958 284153 280744 277178 272986 268622
63650 268622 264898 261985 259361 256507 253384 250390 248053 246683 246145 246059 246229 246740 247704 249175 251346 254404
63634 254404 258062 261494 264022 265706 267157 268978 271502 274835 278940 283707 288984 294492 299864 305041
63620 305041 310523 316864 323933 331165 338592 347127 357570 369759 383019 397069 412104 428286 445629
63607 445629 464304 484677 506998 531208 556895 583248 609138 633428 655171 673452 687320
63596 687320 696158 700095 699932 696764 691759 686026 680368 675040 669823 664200 657478 648929 637983 624283
63582 624283 607717 588693 568352 548015 528258 508898 490022 472483 457044 443529 431380
63571 431380 420721 412275 406437 403006 401797 402872 405991 410295 414756 418803 422505 426423 431233 437096
63557 437096 443348 449110 454282 459674 466111 473808 482769 493404 506412 522212 540732 561708 585103
63544 585103 611273 640755 673628 708770 743733 775459 801290 819574 829769 832348 828658 820726
63532 820726 810927 801486 793890 788530 784858 781895 778564 773768 766449 755662 740561 720504 695581
63519 695581 667069 636956 606733 576858 547514 519385 493252 469159 446684 425951 407697
63508 407697 392138 378465 365955 355013 346444 339943 334082 327847 321529 315968 311502 307964 305204
63495 305204 303149 301661 300741 300667 301528 302799 303711 303895 303372 302231 300804 299947 300462 302164 303980 305173
63479 305173 306076 307557 310128 313674 317638 321302 324251 326768 329492 332487 334944 335919 335136 332977 330109
63464 330109 327311 325236 323876 322418 319940 316185 311600 306943 303066 300654 299681 299263 298536 297664 297663 299147
63448 299147 301520 303533 304519 305039 306347 309284 313722 319078 325164 332276 340623 350124 360827 373131
63434 373131 387379 403599 421861 442496 465617 490493 515538 538768 558310 573046 583155
63423 583155 589794 594117 596940 599452 603506 610646 621286 635361 653268 675414 701236 729537 759567
63410 759567 790777 821460 848755 870513 886500 897337 902966 902953 897984 890233 882054 874696 868241
63397 868241 862214 855761 847508 835884 819991 800000 776577 750176 721223 690763 660277 630741
63385 630741 602368 575372 550378 527746 507118 488209 471604 458151 447820 439803 433596 429397
63373 429397 427493 427788 429870 433160 437084 441516 446852 453267 460267 467563 476001 486734 499695 513868
63359 513868 529021 546114 565771 587446 610596 635710 663493 693635 725012 756499 786940
63348 786940 814819 838752 858058 872323 880794 882993 879801 873291 865444 857419 849812 842813 835861
63335 835861 827735 817399 804597 789432 771583 750319 725426 697977 669956 642974 617450 593137
63323 593137 570171 549257 531011 515734 503845 495874 491658 489901 488786 486639 481942 473463 461095
63310 461095 446246 430824 415877 401488 387625 374576 362765 352725 345010 339614 335552 331633
63298 331633 327642 324230 321686 319447 316987 314578 312825 311820 311089 310083 308467 306158 303418 300786
63284 300786 298634 296816 294897 292678 290319 288012 285741 283488 281529 280357 280254 281000 282085 283163 284221
63269 284221 285368 286589 287686 288395 288637 288818 289706 291623 293843 295304 296023 297252 299909 303434 306707
63254 306707 309713 313520 318678 324350 329214 332806 335781 339192 343698 349196 355029 360668 366341 372917
63240 372917 381188 391334 402940 415362 428155 441448 455902 472059 489786 508545 528029 548171
63228 548171 568649 588922 608837 628768 648934 669032 688792 708534 728851 749931 771507
63217 771507 793292 815156 836914 858205 878580 897506 914287 928164 938515 944945 947145 944768
63205 944768 937485 925295 908839 889256 867549 844157 819435 794420 770693 749348 730468 713849
63193 713849 699836 689126 682014 678293 677742 680285 685686 693637 704251 718050 735144 754684 775533
63180 775533 797405 821018 846970 874689 902713 930007 956769 983843 1011461 1038814 1064879
63169 1064879 1089354 1112518 1134247 1153514 1168954 1179732 1185624 1186372 1181251 1169490 1150949 1126235
63157 1126235 1096176 1061437 1022732 981182 938196 895017 852549 811577 772803 736536 702611
63146 702611 670952 642114 616960 595743 577793 562275 549070 538604 530845 524789 519132 513296
63134 513296 507605 502484 497833 493363 489315 486498 485488 486006 487242 488638 490141 491785 493460 495291
63120 495291 497942 502035 507291 512615 517225 521388 525777 530374 534414 537327 539282 540757 541956 542873
63106 542873 543570 544174 544756 545385 546160 546978 547491 547492 547177 546808 546331 545561 544562 543538 542542 541645 541215 541570 542390
63087 542390 542968 543023 542789 542288 541174 539611 538698 539489 541816 544572 546985 549265 552119 556030 560983 566596
63071 566596 572457 578505 585017 592135 599631 607466 616255 626750 638965 652301 666521 682084 699504
63058 699504 718909 740408 764342 790846 819618 850518 884062 920888 960968 1003748 1048859
63047 1048859 1096147 1145153 1195077 1245307 1295560 1345516 1394861 1443847 1493319 1543849 1595207
63036 1595207 1646910 1698964 1751528 1804090 1855438 1904468 1950601 1993255 2031149 2062268 2084370
63025 2084370 2095522 2094530 2081206 2056269 2020837 1975959 1922721 1862792 1798740 1733561 1669724 1608584
63013 1608584 1550740 1496933 1448480 1406823 1372773 1346377 1327507 1316376 1313427 1318717 1331592 1350976
63001 1350976 1376000 1406245 1441418 1480942 1524004 1569777 1617355 1665586 1713520 1761206 1809578
62990 1809578 1859171 1909139 1958009 2005178 2051114 2095942 2138331 2175972 2206786 2229356 2242504
62979 2242504 2244952 2235540 2213601 2179118 2132656 2075210 2008090 1932947 1851836 1767090 1680999 1595633
62967 1595633 1512873 1434291 1360788 1292497 1229252 1171094 1118210 1070539 1027659 989036 954148
62956 954148 922322 892703 864543 837550 811966 788290 766758 746870 727496 707763 687958
62945 687958 669260 652393 636766 621265 605739 591277 578942 568593 559154 549761 540379 531531
62933 531531 523822 517656 513030 509443 506282 503377 500947 499007 497169 495252 493717 493171 493545 494057 493885
62918 493885 492700 490663 488158 485419 482177 477787 471951 465274 458893 453624 449583 446377 443326 439772
62904 439772 435686 431928 429393 427878 426258 423778 420699 417650 414971 412853 411451 410482 409219 407372
62890 407372 405586 404619 404327 404009 403430 402951 402764 402649 402534 402782 403722 405160 406546 407432 407764 407895 408312 409179
62872 409179 410091 410462 410095 409210 407986 406385 404488 402741 401650 401296 401239 400953 400331 399755 399662 400058 400553 400775
62854 400775 400649 400303 399977 399964 400393 401013 401507 402034 403043 404372 405040 404321 402628 400936 399595 398246 396692
62837 396692 395254 394289 393802 393601 393425 392921 391829 390326 388909 387901 387287 387049 387428 388796 391339 394710
62821 394710 397896 399796 400329 400738 402345 405152 408090 410458 412511 414849 417921 422135 427636 433691 438987
62806 438987 442947 446284 450022 454457 459423 464911 470922 477137 483387 490199 498293 507697 517899 528748
62792 528748 540613 553633 567404 581657 596935 614361 634932 659173 687286 719465 756042
62781 756042 797341 843403 893955 948892 1008696 1074096 1145161 1220895 1299838 1380832 1462938
62770 1462938 1544617 1623342 1696169 1760576 1814644 1856736 1885479 1900118 1900528 1886792 1859170 1818753
62758 1818753 1767690 1708298 1642135 1570396 1494936 1418179 1341984 1267262 1194857 1126023 1061559
62747 1061559 1001027 943523 889085 838789 793551 753321 717482 685601 657616 633507 612958
62736 612958 595218 579269 564331 550330 537803 527223 518412 510671 503516 497259 492764 490542 490122
62723 490122 490491 491150 492571 495523 500086 505552 511283 517542 525387 535690 548277 562163 576691 592294
62709 592294 610019 630514 653788 679839 709056 741952 778919 820449 867296 920091 978987
62698 978987 1043923 1115032 1192457 1275770 1363919 1455828 1550846 1648423 1747384 1845567 1940115
62687 1940115 2027960 2106035 2171336 2221268 2254141 2269080 2265385 2242406 2200478 2141754 2069543
62676 2069543 1986800 1895650 1798251 1697409 1596024 1496302 1399769 1307663 1221012 1140534 1066686
62665 1066686 999620 938942 883768 833249 786959 744784 706766 673082 643677 617715 593938
62654 593938 571865 552203 535584 521318 507905 494532 481509 469440 458588 448992 440615 433252
62642 433252 426650 420784 415667 410907 405937 400828 396496 393835 392849 392820 393152 393771 394684 395354 394732 392105
62626 392105 387943 383787 381147 380426 380775 380743 379222 376289 373357 372162 373253 375626 378037 380332 383184
62611 383184 386928 391251 395853 400819 406275 412196 418665 425944 434112 442942 452281 462395 473885 487411
62597 487411 503471 522215 543492 567263 593939 624058 657618 693947 732130 771303 810550
62586 810550 848837 885112 918287 947168 970674 988098 998917 1002457 998226 986615 968907 946371
62574 946371 919609 888897 854907 818912 782456 746859 712843 680474 649610 620416 593318
62563 593318 568530 545875 525075 505930 488284 472230 458389 447499 439457 433120 427325 421857
62551 421857 417178 413535 410731 408522 406781 405282 403787 402445 401832 402408 404054 406195 408265 409980 411387
62536 411387 412810 414654 417047 419652 422029 424235 426869 430457 434968 440143 446055 453005 461041 470104
62522 470104 480685 493734 509674 528017 548383 571442 598295 629251 663853 701911 743810
62511 743810 789788 839588 892918 949479 1008170 1066766 1122897 1175162 1222947 1265380 1300818
62500 1300818 1327332 1343587 1349405 1345613 1333256 1312945 1285236 1251654 1214867 1177524 1141234 1106929
62488 1106929 1075819 1049399 1028567 1013322 1003504 999487 1001949 1011178 1026826 1048215 1074612 1105241
62476 1105241 1139300 1176129 1215060 1254707 1292364 1324570 1348694 1364010 1371105 1370483 1362003 1345349
62464 1345349 1320441 1287291 1246053 1197598 1143855 1087220 1029697 972691 917333 864607 815107
62453 815107 768954 726142 687015 652331 622825 598651 579301 564082 552498 544065 537980 533408
62441 533408 530161 528750 529501 531763 534284 536451 538955 542997 548743 554725 559023 560936 561126 560148 557459
62426 557459 552166 544203 534209 522692 510120 497548 486220 476347 467083 457957 449645 442915 437439
62413 437439 432154 426427 420368 414303 408437 402960 398074 393897 390401 387345 384281 380976 377893 375779
62399 375779 374616 373512 371965 370747 370975 372652 374688 376133 376889 377374 378016 379051 380378 381601 382562
62384 382562 383719 385659 388373 391439 394805 398855 403649 408617 413254 417742 422687 428474 435085 442366
62370 442366 450236 458655 467541 476819 486623 497424 509720 523516 538410 554494 572866 594800
62358 594800 620462 648946 679665 713256 750883 792923 838539 886270 934633 982213 1027499
62347 1027499 1068902 1104930 1134336 1156296 1170707 1178335 1180308 1177147 1168386 1153493 1132962 1108077
62335 1108077 1079642 1047707 1012771 976607 941348 908151 877277 849059 824007 802079 782619
62324 782619 765161 749738 736248 723934 711708 698733 684617 669377 653331 636790 619821
62313 619821 602503 585244 568457 551995 535471 519216 504349 491684 481015 471714 463575 456661
62301 456661 450741 445401 440591 436626 433666 431506 429911 428851 428353 428247 428195 428010 427944 428531 429978 431775
62285 431775 433284 434670 436825 440137 443778 446638 448682 450899 454050 458025 462444 467325 472837 478740
62271 478740 484517 490010 495671 502197 510104 519590 530525 542531 555377 569562 586305 606651 630582
62258 630582 657331 686601 719153 756118 798011 844634 895526 950004 1006862 1064516 1121443
62247 1121443 1176097 1226348 1269603 1303917 1328887 1345285 1353950 1355151 1348661 1334026 1310867 1279291
62235 1279291 1240177 1194936 1144977 1091534 1035980 980031 925473 873719 825628 781588 741690
62224 741690 705898 674216 646682 623110 602867 585117 569390 555827 544684 535685 528025 521073
62212 521073 514818 509518 505059 500876 496546 492314 488973 487154 486628 486370 485491 484162 483431 484104 486042
62197 486042 488635 491610 495075 499109 503744 509151 515421 522219 529090 536089 543686 552071 560964 570146
62183 570146 579683 589474 599105 608363 617448 626374 634558 641338 646540 650246 652476 653687 655249 658752
62169 658752 664900 673611 685035 699758 718023 739542 764306 792816 825078 859933 895920 932266
62157 932266 968312 1002325 1031832 1055230 1072494 1084250 1090902 1092837 1090682 1084665 1074112 1058220
62145 1058220 1037210 1012319 984867 955854 926339 897443 869779 843362 818443 796125 777778
62134 777778 763939 753974 746716 741234 737069 733945 731431 729000 726473 724223 722695 721788 721024 720324 720266
62119 720266 721534 724441 729080 735495 743438 752217 760958 768736 774349 776568 775132 771187 766304 761287
62105 761287 756291 751629 747709 744232 740150 734513 726881 717008 704879 691397 678433 667735 659935
62092 659935 654803 652030 651383 652346 654121 656074 658039 660242 663067 666861 671781 677781 684755 692718 701917
62077 701917 712786 725665 740360 756048 771806 787278 802785 818894 835981 853901 871817
62066 871817 888580 903833 918736 935182 954189 975323 997568 1020263 1043047 1065415 1086606
62055 1086606 1105713 1121732 1133789 1141446 1144650 1143487 1138380 1130299 1120027 1107014 1089683 1067246
62043 1067246 1040689 1011628 980850 948537 915252 881787 848357 814831 781759 750389 721509
62032 721509 694900 670064 646936 625652 606163 588442 572756 559364 548082 538326 529433 520842
62020 520842 512184 503432 494825 486514 478409 470480 462987 456196 449961 443860 437706 431770 426473 422068
62006 422068 418633 416176 414638 413929 414108 415433 418073 421888 426669 432457 439187 446026 451604 455260 457675
61991 457675 459903 462076 463587 464205 464227 463536 461343 457199 451658 445573 439166 432217 424773 417289 410308
61976 410308 404333 399642 395873 392115 387807 383249 378877 374459 369617 364857 361287 359307 358177 356954
61962 356954 355404 353850 352596 351700 351018 350358 349707 349349 349531 350147 350948 351913 353113 354424 355821 357754
61946 357754 360694 364450 368575 373362 379710 387869 397028 406394 415982 426067 436602 447715 460073
61933 460073 474001 488576 502352 514824 526508 537767 548263 557661 566071 573445 578992 581721
61921 581721 581446 578956 575175 570399 564429 557364 550045 543664 539049 536428 535738 536744 538915 541721 545378
61906 545378 550981 559436 570390 582565 594935 607191 619111 630065 639269 646135 650253 651373 649727
61893 649727 646037 640926 634415 626230 616519 606096 596036 587186 579898 573959 568776 563775 558664 553249
61879 553249 547091 539650 530780 520902 510633 500397 490460 481079 472398 464284 456560 449426 443473 439197
61865 439197 436520 434837 433502 432348 431799 432481 434655 438075 442444 447917 454967 463821 474302 486236
61851 486236 499765 515104 532177 550675 570310 590831 611927 633274 654590 675428 694997
61840 694997 712354 726786 737932 745696 750201 751616 749811 744396 735522 724563 713543 703846 695884
61827 695884 690033 687219 688146 692391 698794 706576 715568 725480 735510 744815 752881 759098 762326 761304
61813 761304 755564 745732 732952 718153 701844 684361 666140 647819 630165 613846 599125 585753
61801 585753 573281 561443 550159 539233 528394 517784 508127 500058 493351 487134 480870 474827 469592
61788 469592 465404 462065 459100 455856 451836 447351 443604 441605 441043 440596 439372 437628 436021 434672 433298
61773 433298 431915 430860 430250 429874 429704 430067 431082 432317 433388 434729 437259 441205 445619 449315 452051
61758 452051 454579 457658 461350 465216 468898 472354 475737 479215 482860 486572 490053 492834 494309 493887
61744 493887 491379 487287 482548 477777 472851 467352 461392 455804 451493 448643 446603 444495 441973 439431
61730 439431 437573 436745 436711 437009 437462 438251 439545 441170 442724 443972 445057 446278 447740 449316 450948 452836
61714 452836 455241 458127 461074 463540 465174 465952 466091 465797 465046 463636 461556 459167 456855 454564 451860
61699 451860 448499 444689 440797 436993 433294 429730 426290 422893 419621 416842 414792 413090 410886 407535
61685 407535 402981 397552 391704 386017 381142 377444 374775 372745 371152 369963 369021 368074 367125 366470 366211
61670 366211 365913 364981 363349 361574 360295 359723 359658 359762 359732 359410 358875 358329 357822 357277 356858 357076 358303 360354
61652 360354 362802 365578 368941 372857 376771 380059 382489 384184 385378 386285 386992 387417 387584 387962 389171
61637 389171 391235 393413 394973 395821 396186 396035 395230 394039 393017 392420 392055 391696 391338 391032 390715 390138 388765
61620 388765 385911 381451 376348 372009 368970 366590 364134 361692 359776 358466 357353 356053 354302 351717
61606 351717 347972 343236 338097 332954 327781 322551 317594 313356 309931 307001 304148 301145 298035 295048
61592 295048 292457 290485 289239 288611 288135 287147 285312 282993 280856 279109 277351 275281 273271 271937 271318
61577 271318 270815 269985 269055 268469 268177 267670 266673 265507 264714 264573 265089 266176 267557 268658 269028 268891 268900 269278
61559 269278 269599 269646 270056 271608 274125 276609 278435 279850 281209 282310 282846 283102 283691 284751 285882 286861
61543 286861 288024 289776 291914 293614 294090 293328 292203 291787 292411 293442 294052 294061 293938 294205 295107 296676 298717
61526 298717 300685 301950 302304 302005 301310 300256 298940 297559 296042 294058 291720 289857 289127 289138 288976 288431
61510 288431 288105 288326 288726 289077 289888 291643 293906 295765 296875 297478 297592 296955 295826 295139 295536 296730 298072
61493 298072 299278 300241 300658 300486 300386 301061 302290 303293 303955 304921 306367 307517 307741 307447 307383 307581 307681
61476 307681 307953 309253 311999 315713 319558 322866 325180 326287 326377 325816 324755 323238 321631 320473 319845
61461 319845 319263 318308 317018 315623 314324 313438 313273 313656 313992 314089 314566 316068 318370 320620 322314 323693
61445 323693 325247 327170 329275 331231 332862 334308 335856 337559 339200 340698 342349 344460 346871 349022
61431 349022 350434 351082 351362 351736 352278 352613 352451 352001 351499 350510 348401 345628 343819 344133 346048 348239 350115
61414 350115 351878 353494 354499 354805 354999 355703 356939 358123 358332 356739 353256 348764 344400 340747 337977
61399 337977 336379 336021 336116 335569 334275 333213 333101 333590 334004 334231 334597 335317 336373 337511 338183 337963 337206
61382 337206 336780 336964 337264 337647 339163 342660 347427 351876 355239 357905 360354 362632 364818 367153 369508
61367 369508 371380 372680 373978 375687 377477 378895 380179 381921 384134 386169 387656 389115 391400 394775
61353 394775 398771 402850 406971 411462 416592 422353 428455 434316 439197 442686 445118 447331 449871 452525
61339 452525 454677 456026 457008 458604 461668 466152 470962 474798 477209 478682 479748 480349 480149 479076 477299
61324 477299 474937 472032 468669 464909 460820 456791 453664 452239 452651 454380 456748 459372 462351 466266
61310 466266 471769 478884 486875 495132 504004 514365 526336 538921 550971 562106 572441 581765 589412
61297 589412 594829 597908 598750 597441 594279 589942 585086 579767 573632 566746 559893 553746 547956 541524
61283 541524 534031 526099 518586 511835 505898 501085 497779 495885 494875 494404 494603 495721 497734 500340 503170
61268 503170 505891 508210 509921 511089 512245 514284 517860 522787 528177 533292 538074 542769 547326 551464
61254 551464 555149 558635 562001 564886 566787 567550 567599 567761 568729 570542 572573 574108 574910 575148 574995 574437
61238 574437 573373 571700 569391 566708 564201 562254 560649 558861 556818 555121 554441 554904 556218 558244 561181
61223 561181 565167 569874 574674 579219 583749 588736 594319 600218 606181 612277 618716 625496 632292 638574
61209 638574 643764 647440 649510 650163 649763 648939 648610 649521 651646 654383 657475 661438 666921 674015 682456
61194 682456 692157 703131 715051 727314 739503 751429 762702 772520 780025 784817 787109 787465 786396
61181 786396 784232 781445 778818 776850 774988 772000 767345 761744 756154 750700 744996 739035 733114 727236
61167 727236 721221 715192 709269 702916 695285 686222 676315 665973 655069 643610 632088 620940 610199
61154 610199 599964 590800 583373 577969 574457 572470 571524 571291 571747 572628 572808 570884 566544 560727 554230
61139 554230 546906 538644 530330 523117 517271 512548 509274 508056 508518 509317 509701 510369 512474 516332 521520
61124 521520 527797 535339 544235 554220 565022 576791 590037 605210 622299 640851 660419 680960
61112 680960 702646 725305 748265 770933 793354 815951 838749 861091 882202 901761 919716
61101 919716 935680 948873 958761 965499 969502 970694 968450 962368 952888 941048 927654 912800 896178
61088 896178 877773 858172 838196 818365 798856 779873 761764 744672 728394 712792 698117
61077 698117 684637 672143 660236 649040 639184 631005 624220 618521 614068 611088 609358 608482 608431 609393
61063 609393 611206 613430 616036 619575 624503 630594 637225 644012 650974 658300 666266 675319 685937 698320
61049 698320 712321 727703 744314 761999 780514 799714 819798 841284 864690 890159 917341
61038 917341 945712 975101 1005822 1038155 1071843 1106417 1142002 1179421 1219377 1261861 1306465
61027 1306465 1352897 1400982 1450537 1501577 1554233 1608168 1662541 1717093 1773026 1832447 1897416
61016 1897416 1970076 2052894 2147527 2253573 2369646 2495801 2634248 2788293 2962360 3163458
61006 3163458 3401337 3687313 4035117 4463997 4999323 5669169 6501794 7526526 8772483
60997 8772483 10261172 11998283 13967717 16117321 18330170 20407333 22105530 23234074
60989 23234074 23749723 23775135 23531229 23244359 23086620 23148215 23410591 23724602 23838277 23493886
60979 23493886 22544452 21011035 19050788 16876057 14683979 12621987 10779833 9194430
60971 9194430 7863058 6761029 5856056 5115499 4509477 4012705 3604354 3266322 2982911
60962 2982911 2742270 2536275 2357980 2200353 2058142 1929361 1813611 1709749 1616173 1532288
60952 1532288 1458184 1393191 1335824 1284875 1239520 1198434 1159646 1121397 1082833 1044102 1006159
60941 1006159 970162 936535 904831 874710 846540 820617 796368 772878 749839 727490 706163
60930 706163 686377 668802 653365 638842 624085 609359 595889 584368 574596 566177 558840 552271
60918 552271 546249 540765 535581 530080 524192 518981 515507 513502 511990 510780 510390 510771 511261 511756 512874
60903 512874 514782 516799 518338 519485 520436 521162 521776 522497 523027 522660 521243 519329 517189 514448 510977 507385
60887 507385 504201 501220 498072 494837 491594 487883 483219 477759 471976 465931 459354 452265 445076 438189
60873 438189 431723 425543 419356 413025 406967 401994 398516 396100 394044 392203 391038 391056 392421 394948 398225
60858 398225 401805 405394 408834 411971 414762 417448 420275 422979 424926 425928 426608 427758 429607 431885
60844 431885 434232 436288 437665 438317 438727 439369 439957 439631 437949 435394 432689 429889 426506 422476 418580
60829 418580 415581 413268 410862 408315 406553 406151 406336 405853 404428 402778 401414 400163 398810 397511 396344
60814 396344 395037 393352 391332 388973 386054 382520 378693 374871 371020 367060 363104 359188 355094 350766
60800 350766 346657 343364 341031 339299 337686 335774 333225 330006 326616 323810 321943 320683 319467 318245
60786 318245 317642 318302 320072 321999 323163 323379 323082 322780 322723 322840 322758 322168 321392 321311 322419 324259 326117 327926
60768 327926 330012 332294 334422 336559 339272 342610 345934 348731 351100 353300 355347 357186 358800 360044
60754 360044 360765 361142 361465 361588 361082 359871 358163 355869 352859 349854 348183 348346 349531 350838 352155 353392
60738 353392 353708 352232 349081 345003 340371 335121 329389 323682 318576 314551 311784 309809 307782 305430
60724 305430 303342 301978 300928 299593 298059 296715 295493 294158 292957 292253 291793 291106 290400 290379 291241 292500
60708 292500 293712 294745 295456 295782 296156 297188 298870 300642 302252 303976 305954 307914 309722 311649 313914
60693 313914 316430 319144 322142 325204 327754 329548 331049 332865 335134 337761 340871 344533 348196 350901
60679 350901 352239 352850 353744 355210 356643 357460 357896 358566 359465 359927 359620 359009 358514 357715 355929 353211 350212
60662 350212 347185 343762 339704 335370 331341 327961 325368 323605 322548 321963 321715 321878 322631 324163 326505
60647 326505 329319 332089 334715 337533 340409 342277 342207 340614 338641 336560 333705 330012 326557 324173 322365
60632 322365 320223 317777 315799 314650 314006 313530 313208 313081 313131 313455 314182 315161 315990 316404 316422 316144 315620 314981
60614 314981 314593 314898 316035 317558 318641 318773 318268 317895 318054 318553 319140 319789 320380 320622 320655 321291 323118 325565
60596 325565 327431 328293 328873 329919 331281 332392 333273 334624 336974 340034 342879 344546 344502 342818 340123
60581 340123 337342 335317 334517 334981 336367 338085 339555 340577 341482 342876 345272 348991 354245 361057 369074
60566 369074 377699 386539 395607 405052 414855 424786 434396 442912 449418 453425 455075 454578 451748 446510
60552 446510 439699 432811 426914 422216 418734 416761 416336 416758 417268 418109 420420 425058 431880 440302 450123
60537 450123 461580 474840 489782 506149 523586 541486 559065 575615 590445 602515 610536 613797
60525 613797 612777 608738 602755 595330 586675 576958 566349 555294 544812 535999 529067 523225 517766
60512 517766 512904 509273 507009 505740 505208 505457 506569 508682 512262 517975 526200 536835 549566 564184
60498 564184 580884 600475 624108 652394 684853 720493 758675 798952 840285 881048 919927
60487 919927 956239 989216 1017448 1039346 1053811 1060281 1058444 1048241 1029957 1004106 971308 932396
60475 932396 888522 841172 792306 744394 699742 659426 623078 589987 560173 534204 512228
60464 512228 493622 477578 463689 451914 442089 433620 425707 417971 410809 404890 400245 396083 391599
60451 391599 386725 381940 377627 373900 370795 368275 366085 364013 362266 361268 360953 360526 359147 356750 354026
60436 354026 351721 350109 349108 348656 348774 349337 350009 350493 350705 350648 350257 349509 348615 347876 347445 347371 347754 348543
60418 348543 349265 349432 349355 350073 352099 354555 356052 356353 356631 358001 360234 362195 363186 363523 363947 364889 366340
60401 366340 368092 369901 371627 373339 375138 376813 377932 378512 379344 381284 384290 387559 390533 393363 396365
60386 396365 399555 402899 406528 410350 413861 416781 419498 422384 424951 426366 426707 427047 428210 430092 432318
60371 432318 434898 437834 440614 442698 444232 445785 447442 448683 449139 449079 449014 449166 449508 450175 451532 453850
60355 453850 457025 460684 464578 468876 474118 480821 489013 498085 507089 515300 522513 528823 534134 537957
60341 537957 539681 538957 535882 530942 524798 517985 510746 503186 495536 488109 481117 474746 469333 465091
60327 465091 461586 457885 453417 448395 443279 438244 433404 429070 425397 422151 419303 417443 417095 417951 419376
60312 419376 421417 424620 429093 434578 441340 450172 461380 474488 489031 504898 521706 538599 554941
60299 554941 570431 584165 594375 599695 600174 596490 588821 577168 562369 545974 529297 513161
60287 513161 498320 485443 474724 466051 459475 454998 451991 449435 446831 444462 442704 441528 440724 440089
60273 440089 439173 437277 434050 429948 425846 422258 419025 415663 411875 407785 403784 400246 397388 395306
60259 395306 393873 392600 390901 388731 386758 385654 385411 385538 385743 386069 386539 387102 387923 389290 391153 393046
60243 393046 394561 395684 396616 397544 398678 400207 402031 403724 404889 405430 405430 405022 404509 404328 404665 405282 406005
60226 406005 407163 409224 412085 415159 418149 421235 424369 426977 428876 431047 434802 440223 446117 451598
60212 451598 457027 463068 469554 475907 482166 488873 496187 503848 511856 520358 528831 536259 542474 548610
60198 548610 555747 563537 570685 576380 580797 584449 587612 590360 592743 594836 596723 598364 599343 598943 596721
60183 596721 593005 588708 584705 581319 578096 574019 568293 561217 554081 548063 543424 539805 536852 534259
60169 534259 531630 528736 525752 522918 520159 517258 514148 510766 507012 503190 500136 498397 497557 496865 496277
60154 496277 496285 496909 497561 497902 498210 498779 499496 500163 500793 501382 501768 501926 502131 502688 503690 505114 506889 508852
60136 508852 510922 513328 516391 520098 524210 528714 533666 538556 542383 544671 546021 547419 549325 551661
60122 551661 554232 556784 558963 560793 563054 566728 571916 577663 582880 587291 591400 595755 600370 604736
60108 604736 608260 610676 612100 612789 612902 612466 611449 609819 607599 604877 601681 597823 593034 587448 581817
60093 581817 577029 573346 570273 567243 564233 561585 559418 557559 555972 554771 553673 551854 548778 544927
60079 544927 541305 538423 536164 534389 532975 531317 528630 525095 521941 519932 518308 515741 511844 507097
60065 507097 501821 496072 490360 485490 481610 478035 474227 470352 466722 463259 459773 456348 453216 450559
60051 450559 448553 447257 446403 445720 445624 447034 450218 454280 458158 461775 465795 470552 475752 481053 486432
60036 486432 491935 497394 502508 506978 510557 513183 515034 516269 516756 516312 515156 513858 512646 510998 508111
60021 508111 503698 498205 492278 486206 479876 473114 465929 458487 450969 443512 436223 429258 422864 417313
60007 417313 412700 408845 405436 402249 399204 396372 394101 392959 393211 394358 395463 395938 395756 395013 393813
59992 393813 392675 392459 393542 395480 397769 400526 404008 407956 412002 416316 421169 426051 429954 432559
59978 432559 434451 436116 437296 437465 436411 434186 430983 427276 423643 420238 416774 413160 409743 406750
59964 406750 403972 401255 398949 397544 397167 397684 398960 400671 402140 402765 402549 401930 401245 400657 400410 400720
59948 400720 401368 401788 401782 401976 403299 405976 409221 412021 414072 415739 417242 418308 418740 418861 419001 418858 417864
59931 417864 416060 414160 412851 412445 413142 415049 417877 421115 424717 429223 435053 442043 449788 457981 466127
59916 466127 473301 478624 481906 483646 484491 484786 484551 483736 482503 481232 480194 479406 478934 479012 479580 480030 479962
59899 479962 479925 480784 482516 484404 486349 489056 492700 496363 499278 501898 505141 509182 513671 518623 524304
59884 524304 530405 536026 540558 544209 547657 551438 555560 559536 562900 565783 568692 571707 574222 575565
59870 575565 575436 573651 570147 565534 560893 556556 551732 545916 540044 535508 532524 530347 528644 527687 527351
59855 527351 527022 526687 527286 529710 534019 539814 546837 554966 564038 573953 584675 595938 607032 616852
59841 616852 624081 627665 627535 624798 620979 617296 614839 614703 616981 619841 620546 617552 611131 602276 591974
59826 591974 581533 572377 564923 558404 552252 546973 543146 540256 537256 533809 530308 526964 523592 520195
59812 520195 517076 514324 511624 508706 505759 503307 501744 500928 500191 498912 497155 495550 494480 493781 493356
59797 493356 493597 494750 496212 497031 496999 496841 497276 498249 499054 498931 497531 495151 492571 490451 488793 487135
59781 487135 485208 483161 481194 479250 477171 474972 472831 470905 469202 467565 465834 464096 462752 462207
59767 462207 462583 463826 465959 468953 472398 475673 478533 481300 484339 487621 491013 494803 499574 505535
59753 505535 512201 518852 525231 531753 539045 547260 555807 563778 570740 577055 583363 589768 595727 600703
59739 600703 604749 608304 611536 614066 615358 615305 614419 613447 612770 612118 610901 608901 606579 604707 603703 603331
59723 603331 602946 602021 600564 599100 598109 597450 596531 595109 593614 592376 590910 588471 585291 582593 581259
59708 581259 580980 580989 581207 582162 584079 586535 588970 591111 592955 594743 597064 600600 605411 610635 615191 618860
59692 618860 622432 626665 631228 634950 637067 637886 638072 637742 636725 635445 634735 634669 634249 632632 630161 627690
59676 627690 625271 622112 617667 612174 606116 599685 592966 586246 579910 574181 569098 564617 560660 557217
59662 557217 554434 552477 551251 550436 549928 550115 551591 554575 558677 563278 568088 573265 578959 584891 590531
59647 590531 595518 599620 602397 603367 602601 600704 597972 593937 588061 580580 572372 564250 556678 549834 543574
59632 543574 537563 531890 527257 524059 521568 518639 515086 511662 508748 505808 502276 498269 494135 489897
59618 489897 485456 480882 476161 471140 466057 461649 458309 455536 452659 449777 447444 445831 444795 444546
59604 444546 445448 447180 448889 450344 452211 454809 457239 458361 458259 458059 458436 458991 459157 459074 459228 459703 460244
59587 460244 460789 461483 462247 462745 462760 462271 461165 459266 456763 454264 452198 450407 448429 446001 443131 439963
59571 439963 436779 433983 431832 430298 429273 428718 428471 428155 427555 426940 426700 426783 426684 425956 424583 422962 421728
59554 421728 421450 422221 423578 424979 426356 428074 430438 433360 436411 439181 441765 444922 449419 455158 461454
59539 461454 468412 477454 489952 505814 524007 543930 565105 585490 601272 609121 608492 601645 591912
59526 591912 582128 573967 567879 563519 560470 558639 558026 558406 559382 560541 561430 561559 560612 558507 555144 550281
59510 550281 543824 536104 527730 519212 510766 502388 494069 486021 478687 472452 467333 463006 459027 454997
59496 454997 450762 446705 443650 442141 441883 442145 442551 443144 443863 444473 445026 445899 447317 449211 451546 454354
59480 454354 457341 459979 462225 464739 468149 472422 477113 481925 486789 491649 496406 500828 504418 506609
59466 506609 507337 507218 506976 506837 506548 505772 504439 502987 502342 503311 505889 509420 513559 518701 525297 533102
59450 533102 541426 549827 558272 566701 574726 581730 587215 591053 593338 593888 592119 587747 581471 574505
59436 574505 567515 560507 553661 547590 542569 538175 533965 530055 526804 524467 523393 523937 525810 528132
59422 528132 530561 533868 538924 545740 554024 564078 576383 590802 607041 625511 646764 670294
59410 670294 694787 719352 743214 764005 777632 780881 773875 759688 742210 724864 710561 701435
59398 701435 698211 700301 706689 716076 725825 731517 728906 716874 698132 676728 655299 635000 617140
59385 617140 603373 594036 587556 582263 578161 576151 576164 577036 578085 579831 583006 587550 592805 598200 603493
59370 603493 608727 614131 619748 625071 629352 632414 634774 636882 638587 639565 639943 640259 641031 642625 645313
59355 645313 649152 653798 658697 663547 668582 674429 681729 690809 701579 713694 726708 740116 753441
59342 753441 766522 779658 793190 806810 819385 829630 836998 841941 845309 847446 847851 845738 840896
59329 840896 833880 825442 816053 806075 796022 786320 776957 767641 758259 748938 739800 730930 722506 714653
59315 714653 707190 699834 692633 685897 679670 673602 667398 661095 654739 648107 641048 633926 627498 622515
59301 622515 619636 619555 622818 629381 638562 649474 661248 672654 681685 685946 683705 674724 660239 642339
59287 642339 623266 604872 588291 573992 562134 552855 546158 541711 538902 537145 536151 536145 537840 541929
59273 541929 548327 556172 564867 574859 586909 600701 614755 627793 639718 651056 661871 671521
59261 671521 679207 684454 687145 687342 685075 680382 673628 665580 656906 647763 638285 629309 621966 616462
59247 616462 611859 607273 602782 598959 596179 594778 595216 597439 600508 603506 606652 610904 616580 622909
59233 622909 628990 634683 640424 646386 652016 656355 658874 659979 660469 660513 659555 657271 654063 650298 645617
59218 645617 639591 632686 625938 619840 614173 608832 604167 600354 596946 593309 589249 585077 581216 577833
59204 577833 574753 571650 568350 564933 561609 558658 556390 554845 553561 552061 550646 550235 551227 553015 554827
59189 554827 556512 558277 560277 562912 566824 572011 577456 582342 587140 592777 599183 605487 611284 616740
59175 616740 621689 625641 628756 631939 635777 640139 644910 650389 656697 663434 670106 676372 681777 685878
59161 685878 688865 691461 693951 695724 695973 694411 691092 685974 678954 670094 659673 648268 636705 625536
59147 625536 614594 603479 592419 582148 572975 564539 556517 548926 541701 534622 527825 521725 516252
59134 516252 510882 505672 501536 499010 497374 495563 493422 491480 489922 488537 487477 487349 488515 490811
59120 490811 494063 498463 504231 511140 518620 526311 534420 543426 553396 563694 573503 582522 590953 598897
59106 598897 606086 612256 617527 622235 626518 630193 633051 635290 637575 640378 643161 644611 643985 641949
59092 641949 639766 638026 636593 635385 634486 633710 632782 631930 631606 631604 631173 630017 628416 626165 622257 616112
59076 616112 608551 601083 594506 588566 582697 576726 570974 565860 561339 556882 552209 547798 544186 540924
59062 540924 536912 531745 526057 520511 515240 510427 506579 503805 501488 499154 497095 495715 494762 493656
59048 493656 492199 490544 488831 487186 485767 484544 483484 483092 484163 486577 488940 489975 489824 489491 489460
59033 489460 489504 489505 489686 490119 490640 491362 492851 495668 499919 505269 511301 517941 525572 534562 544658 555112
59017 555112 565459 575795 586172 596138 605009 612205 617190 619595 619724 618513 616681 614320 611595 609324
59003 609324 608393 608923 610437 612573 615240 618339 621801 625722 630133 634726 639064 642893 646075 648385 649638
58988 649638 649812 648955 647134 644545 641434 637865 633925 630085 626906 624408 622307 620937 621219 623491 627109
58973 627109 631517 637031 644151 652808 662782 674244 687274 701327 715772 730483 745284 759227
58961 759227 771145 780710 788406 794624 799250 801946 802456 800787 797318 792415 785818 776853 765496 752626
58947 752626 738949 724385 708974 693637 679393 666390 654362 643433 633787 625100 617125 610350
58935 610350 605239 601281 597682 594638 592969 592703 592892 592764 592240 591474 590631 590059 589994 590156 590221 590459 591189 591877
58917 591877 591675 590782 590351 590909 591648 591491 590305 588875 588196 588919 591124 594462 598678 603878 610164 617482
58901 617482 626091 636598 648889 661590 673416 684637 696342 708664 720750 732247 743681 755411
58889 755411 767318 779706 793462 809010 825880 843547 861910 880629 898642 914658 927700
58878 927700 937133 942829 945480 946129 945129 942018 936477 928852 919715 909563 899013 888594 878185
58865 878185 867312 856166 845712 836615 828656 821308 814181 806710 798228 788745 779057 769681 760180
58852 760180 749903 738879 727657 716706 706330 696730 687757 678939 670062 661491 653700 646720 640204
58839 640204 633717 626879 619521 611859 604242 596763 589463 582808 577398 573132 569201 565079 561072 557760
58825 557760 555392 554053 553931 555185 557778 561565 566216 571061 575464 579441 583532 588055 592887 597954
58811 597954 603314 608672 613356 617007 619886 622403 624676 626591 627814 627733 625917 622672 618677 614131 608793
58796 608793 602869 597100 591883 586941 581960 576875 571481 565601 559856 555426 552651 550615 548534 546819
58782 546819 546281 547040 548900 552185 557332 563922 570814 577234 583218 589050 594587 599059 601332 600562 596900
58767 596900 591395 585002 577884 569833 561086 552396 544430 537391 531140 525556 520747 516918 514015 511624
58753 511624 509405 507472 506137 505429 505171 505314 505832 506529 507385 508906 511584 515132 518773 522183 525665 529578
58737 529578 534166 539723 546213 552911 559141 565228 571872 578690 584366 588359 591515 594762 598106 601237
58723 601237 604281 607435 610439 612817 614329 615196 616355 619273 624690 631555 638091 643892 649965 656732
58709 656732 663226 668549 672833 676231 678099 677876 675865 672446 667301 660030 650732 639467 626035 610902
58695 610902 595467 580695 566292 551904 538298 526495 516479 507638 499893 493501 488266 483745
58683 483745 479833 476468 473238 469884 466701 463850 460896 457690 454985 453445 452638 451816 451127 451164 451938 453201
58667 453201 455422 459405 465217 472326 480502 489828 499983 510227 519824 527880 533181 535045 534130 531689
58653 531689 528249 523602 517789 511366 504902 498831 493580 489220 485206 480990 476667 472588 468781 465291
58639 465291 462612 461113 460468 460278 460790 462311 464385 466353 468335 470833 473718 476410 478723 480711 482006
58624 482006 482184 481604 481052 480679 480089 479299 478849 479023 479667 480737 482492 485207 489091 494190 499939 505247
58608 505247 509576 513473 517471 521083 523637 525446 527232 528961 530243 531423 533022 534470 534617 533378
58594 533378 531725 530126 528169 525750 523462 521674 520286 519677 520900 524568 530263 537276 545240 553900
58580 553900 562960 572405 582358 592476 602025 610600 618270 625120 631220 636988 642882 648881 654939 661830
58566 661830 670737 682056 695418 710820 728787 749388 772042 796493 822981 851019 878742 903944
58554 903944 925308 942380 954910 962615 965305 963131 957052 949072 941429 935297 930422 925906 920940
58541 920940 914933 907557 898766 888407 875878 860535 842385 822025 800154 777567 755351 734473
58529 734473 715313 698035 683157 671238 662242 655669 650920 647082 642985 638255 633877 630812 628536
58516 628536 625848 622674 619901 617739 615476 612786 610148 607879 605834 604140 603253 603146 603282 603443 603701
58501 603701 603659 602753 601385 600670 600890 601157 600807 600146 599657 599413 599623 600778 602915 605469 608249 611802 616550
58484 616550 622322 629074 637390 647842 660367 674543 690006 706361 723097 739830 756297 772135
58472 772135 786931 800235 811102 818041 820103 817802 812270 803912 792855 780360 768672 759393 752819
58459 752819 748788 747255 748054 750995 756191 763585 772330 781523 791289 802182 813665 824194 832597 838325
58445 838325 840547 838285 831593 821643 809697 796814 784236 772833 762378 752564 744445 739495 737477
58432 737477 736758 736651 737822 740357 743197 745873 749269 754229 760748 768855 778840 790093 801014 810524
58418 810524 818525 824702 828262 829175 828216 825435 820045 812215 803513 795058 786647 778153 770233 763088 755999
58403 755999 748817 742563 737887 734282 731432 729950 730075 730991 732247 734551 738455 743413 748801 754566 760257
58388 760257 764758 767742 770184 772740 774868 776184 777360 778963 780691 782477 785098 788986 793679 798943
58374 798943 805111 811796 817825 823046 828633 834978 841037 846538 852946 861235 870480 879812 890030 901982
58360 901982 914988 928161 941792 956114 970135 983037 995305 1007167 1017339 1024720 1029948 1033913
58348 1033913 1036234 1036738 1037071 1039113 1042821 1047112 1051749 1056951 1062302 1067645 1074051 1082440 1092183 1102361
58334 1102361 1113393 1126105 1140222 1155118 1170970 1187822 1204581 1220280 1235374 1250509 1264989
58323 1264989 1277708 1288503 1297468 1304135 1308657 1312638 1317488 1322941 1328206 1333393 1338753 1343954 1349264
58310 1349264 1355995 1364652 1374145 1383982 1395518 1409688 1425274 1440877 1456897 1474096 1491985 1510191
58298 1510191 1529583 1550357 1570861 1590005 1609032 1629161 1649464 1668899 1688425 1709110 1730161
58287 1730161 1750906 1772684 1796632 1821652 1846820 1873645 1903495 1934942 1966280 1998617 2033736
58276 2033736 2070933 2108830 2148345 2190848 2235157 2279323 2323613 2368811 2413555 2456577 2499813
58265 2499813 2546112 2595589 2647373 2702955 2764307 2830422 2899191 2971033 3047162 3126082 3205359
58254 3205359 3285205 3366730 3448570 3529067 3609973 3694100 3781058 3869258 3960280 4057159 4160165
58243 4160165 4268400 4383545 4507723 4639669 4777553 4923468 5080505 5247686 5422810
58234 5422810 5608006 5807057 6019489 6243004 6479596 6733392 7004477 7291035 7595651
58225 7595651 7923194 8274420 8648179 9048084 9480456 9947785 10451011 10995879 11589850
58216 11589850 12235305 12933516 13692627 14523865 15433410 16427145 17520122 18731731 20075600
58207 20075600 21565584 23228360 25098992 27209334 29595448 32313453 35435125 39035943
58199 39035943 43209522 48096340 53890208 60838103 69274089 79658442 92552663 108543470
58191 108543470 128192326 152002180 180310859 213108753 249869366 289364568 329342875
58184 329342875 366235225 395448312 412595621 415148123 403398966 380095059 349134556
58177 349134556 314270795 278426098 243595059 211028958 181458365 155250971 132495331
58170 132495331 113057814 96656442 82938832 71529325 62051788 54157691 47554047
58163 47554047 42004910 37313849 33317574 29891125 26941641 24391711 22173877 20236011
58155 20236011 18538397 17043209 15714130 14524825 13458463 12498444 11626934 10831920
58147 10831920 10107788 9448385 8845874 8295989 7797621 7346854 6937009 6564243 6227415
58138 6227415 5922649 5643340 5385092 5145502 4919806 4702195 4491323 4289723 4098349
58129 4098349 3916313 3744985 3586903 3440869 3302995 3172346 3050837 2937912 2830253
58120 2830253 2726745 2629142 2537820 2451290 2369885 2295460 2227275 2162340 2099967 2041889 1987870
58109 1987870 1935448 1884262 1836429 1792140 1748814 1705214 1662663 1621563 1580226 1537810 1495137
58098 1495137 1452237 1408426 1365348 1326568 1293468 1264355 1237934 1214511 1193482 1172816 1151789
58087 1151789 1131461 1112075 1092687 1073578 1056115 1039958 1023152 1005184 987176 969092 949816
58076 949816 930026 911771 894963 877567 859515 843013 828451 813551 797423 782034 768538
58065 768538 755439 741782 729168 719090 710824 703292 696545 690135 682499 673278 664018 655396 645996
58052 645996 634957 623537 612868 602460 592175 583432 577041 571799 566573 561873 558155 554498 550219
58039 550219 545986 542127 537637 532093 526727 522312 517677 511608 504690 498028 491585 484818 477550 469320
58025 469320 459449 448658 438959 431039 423471 415447 408276 402966 398257 392627 386605 381521 377395 373648
58011 373648 370619 368739 367229 365081 362547 360478 359020 357936 357303 356974 356343 355422 355017 355101 354382 352416
57995 352416 350733 350686 351495 351672 351167 350847 350906 351080 351462 351929 351689 350507 349454 349308 349202 347973 345868 343719
57977 343719 341335 338079 334291 330884 328066 325516 323274 321478 319765 317879 316364 315870 316315 317317 318770
57962 318770 320352 321321 321478 321575 322097 322564 322598 322598 322639 321815 319585 316766 314294 311981 309371 306761 304480 302217
57944 302217 300042 299012 299701 301203 302622 304495 307610 311569 315824 321052 328042 336111 344099 352081
57930 352081 360593 368880 375474 380007 382970 384183 383012 379756 375409 370223 363743 355993 347503 338448
57916 338448 328915 319708 311802 305295 299935 296202 294610 294322 293784 292682 292117 292905 294782 297222 300020
57901 300020 302980 305791 308229 309991 310688 310561 310658 311597 312749 313453 314294 316119 318535 320632 322561 324978
57885 324978 327335 328318 327910 327611 328470 329978 330961 330580 328484 324958 320945 317102 313068 308480 304204 301372
57869 301372 299508 297026 293524 290209 287965 286307 284555 282878 281763 281390 281894 283463 285928 288946 292732
57854 292732 297860 304268 311220 318259 325380 332245 338162 342988 347240 351099 354087 355889 356739 356841 356095
57839 356095 354583 352658 350375 347392 343503 338803 333444 327830 322822 318968 315660 311938 308021 305085
57825 305085 303505 302327 300635 298536 296565 294960 293840 293341 293276 293301 293603 294830 297147 299914 302302 303622
57809 303622 303125 300358 295847 290639 284984 278172 269838 260697 251808 243898 237487 232818 229333 226015
57795 226015 222656 220181 219423 220176 221709 223559 225506 227387 229309 231620 234389 237322 240291 243464 246893
57780 246893 250597 255050 260807 267487 273938 279679 285384 291593 297738 302967 307280 311224 314963 318156
57766 318156 320408 321393 320913 319266 317280 315533 313756 311219 307520 302870 297919 293463 289988 287256 284581
57751 284581 281574 278412 275471 273108 271730 271528 272057 272572 272889 273377 274119 274670 274810 274875 275119 275304 275207 275013
57733 275013 274911 274785 274636 274906 276069 278197 281053 284255 287211 289385 290867 292351 294358 296818 299467
57718 299467 302148 304549 306135 306634 306272 305394 304193 302864 301546 299975 297636 294390 290548 286257 281315
57703 281315 275731 269963 264488 259561 255486 252519 250387 248376 246110 243764 241521 239368 237495 236167
57689 236167 235005 233120 230268 227266 224969 223478 222694 222919 224377 226716 229581 233295 238379 244700 251755
57674 251755 259745 270061 284632 304909 331323 363650 401941 446815 498240 553844 608570 655918
57662 655918 689422 703902 697054 670705 630063 581257 529517 479061 433235 393950 361447 335016
57650 335016 313671 296237 281683 269758 260697 254123 248999 244861 242120 240717 239511 237692 235922
57637 235922 235252 235620 236285 237121 238474 240140 241467 242323 243158 244165 244992 245208 244623 243343 241923 241107 240905
57620 240905 240212 237984 234526 231014 228011 225183 222364 220115 219001 218832 218867 218554 217904 217325 217150 217307
57604 217307 217447 217312 216788 215737 214193 212679 211747 211116 209841 207563 204967 202727 200572 197822 194327
57589 194327 190477 186772 183764 181935 181181 180836 180544 180534 180744 180398 179055 177388 176200 175291 174098 172868
57573 172868 172217 171880 170917 169037 166843 164839 163011 161393 160239 159446 158457 156944 155164 153554 152347
57558 152347 151647 151531 151990 152997 154595 156704 159017 161315 163683 166170 168493 170382 171873 172975 173435
57543 173435 173260 173062 173319 173619 173252 172326 171697 171930 172869 174133 175504 176863 178163 179476 180714 181450 181273
57526 181273 180247 178800 177454 176789 177180 178198 178776 178444 177946 178132 178839 179472 180144 181326 182773 183785
57510 183785 184358 185156 186374 187486 188174 188741 189457 190113 190402 190232 189611 188683 187896 187670 187841 187786 187040 185482
57492 185482 183142 180280 177460 175078 173054 171411 170722 171312 172267 172143 170606 168746 167767 167978 168919 169804
57476 169804 169886 169044 168083 167878 168271 168293 167333 165532 163283 161039 159405 158628 158028 156691 154677 152877 151766
57459 151766 151107 150754 150888 151389 151887 152508 153757 155535 157101 158101 158815 159218 158774 157436 156033 155211 154768
57442 154768 154366 154148 154220 154265 154233 154818 156638 159289 161780 163605 164996 166274 167429 168296 168967 169868 171260
57425 171260 172671 173267 173039 173046 173991 175147 175554 175648 176590 178329 179695 180325 181021 182021 182437 181891 181379 181813
57407 181813 182889 184134 185921 188470 190817 191897 191980 191988 191906 190904 188738 186125 183952 182829 183166 184923
57391 184923 187377 189680 191554 193145 194559 196003 198005 200896 204331 207744 210966 213915 216165 217446
57377 217446 218258 219376 220907 222346 223319 223728 223445 222377 220777 219049 217429 216183 215735 216131 216656 216560
57361 216560 215967 215589 215789 216468 217642 219516 222049 224937 227971 230976 233585 235540 237125 238826 240740
57346 240740 242816 245463 249166 253443 256874 258487 258731 258825 259531 260839 262572 264812 267648 270730 273365
57331 273365 275125 276248 277293 278562 280119 282186 285005 288260 291188 293553 296031 299256 302825 305727
57317 305727 307583 309079 311260 314691 319168 323972 328414 332306 335874 339245 342294 345054 347927 351257
57303 351257 355021 359196 364086 369970 376619 383428 389879 395731 401076 406465 412666 419951 427787 435515
57289 435515 443133 451142 459783 468764 477714 486731 496430 507431 519669 532348 544736 556848 569065
57276 569065 581406 593793 606802 621258 637080 653392 670003 687814 707382 728028 748966
57265 748966 770459 793003 816018 838279 859268 879296 898588 917030 934726 952087 969366
57254 969366 986538 1003564 1020441 1037169 1053949 1071106 1088539 1105715 1122568 1139803 1157777
57243 1157777 1175679 1192560 1208691 1225106 1242203 1259682 1277562 1296271 1315847 1335946 1356638
57232 1356638 1378344 1400949 1423856 1447064 1471410 1497507 1525090 1553683 1583257 1613914 1645377
57221 1645377 1677202 1709139 1741046 1772789 1804506 1836728 1869932 1904096 1938889 1974242 2010633
57210 2010633 2048847 2089421 2132238 2176624 2221859 2267542 2313602 2360279 2408078 2457329 2507537
57199 2507537 2557481 2606157 2653378 2699374 2744281 2788259 2831622 2874434 2916333 2957045 2996743
57188 2996743 3035685 3073911 3111545 3148887 3185915 3222318 3258359 3294984 3332514 3369986 3406450
57177 3406450 3442200 3477891 3513126 3546935 3579146 3610142 3639530 3666152 3689334 3709117 3725421
57166 3725421 3738101 3747973 3756673 3765104 3772787 3779147 3784746 3790808 3797822 3804986 3810928 3814971 3817724 3820303
57152 3820303 3822950 3824933 3826047 3827449 3830502 3835472 3842185 3851310 3864006 3880730 3901366 3925995 3954366
57139 3954366 3984900 4015536 4045486 4075111 4104302 4132446 4160189 4189982 4224541 4265634 4314344
57128 4314344 4370981 4433957 4499473 4562847 4619838 4667056 4702639 4727307 4744146 4756939 4769152
57117 4769152 4784207 4805246 4833855 4869682 4911686 4959143 5011361 5067490 5127286 5191523 5261483
57106 5261483 5338890 5426700 5529141 5650616 5795269 5968156 6176604 6430756 6744048 7133794
57096 7133794 7620998 8229732 8987066 9922481 11064877 12438145 14057672 15927070 18033757
57087 18033757 20346696 22820512 25402733 28037726 30669705 33251275 35749048 38125619
57079 38125619 40298003 42110425 43361477 43877933 43581940 42506637 40763254 38495349
57071 38495349 35848326 32957868 29947596 26927634 23991331 21211455 18638541 16302498
57063 16302498 14215930 12377513 10775412 9391086 8202666 7187122 6321606 5584514
57055 5584514 4956071 4418456 3956020 3555721 3207135 2901982 2633681 2397087 2188011
57046 2188011 2002776 1838338 1692489 1563336 1448590 1345896 1253744 1171418 1098068 1032555
57036 1032555 974278 923365 879716 842533 811234 786217 768252 757652 754705 760548 776782 804002
57024 804002 840878 884153 928556 966474 988805 987803 960321 908959 840447 762952 684106 609951
57012 609951 544134 487542 439087 397416 361964 332535 308334 287864 269739 253297 238340
57001 238340 224573 211542 199131 187817 178049 169392 160671 151194 141531 132785 125499 119770 116045
56988 116045 114977 116521 119964 125022 132194 141762 153026 164693 175292 182863 185202 181308 172369
56975 172369 160789 148440 136197 124553 113954 104650 96904 91307 88525 88687 91312 95743 101532
56962 101532 108655 117618 129134 143458 160206 178884 199064 219742 238868 253897 262659 263745
56950 263745 256954 243917 227722 211133 195254 180173 166314 154489 145034 137730 132479 129497
56938 129497 128936 130920 135926 144684 157699 175108 196725 221807 248819 275691 300032 318970
56926 318970 329499 329792 320118 302160 277858 249403 219698 191750 167394 146993 130148 116194
56914 116194 104326 94020 85315 78249 72225 66502 61038 56253 52232 48865 46514 45664 45922 46165
56900 46165 45793 45217 45105 45870 47941 51825 57560 64622 72630 81897 93230 107457 124968 145308
56886 145308 167332 190149 213520 236671 257044 271240 277389 276070 269102 258367 245832 233545
56874 233545 222898 214281 207762 203631 202153 203380 207581 215395 227366 243796 265251 292647 326454
56861 326454 366213 410982 459655 510232 558974 600670 629884 642459 636890 615112 581830 542608
56849 542608 502220 464243 431270 404905 385688 373426 367721 368318 375332 389322 411119 441619
56837 441619 481884 533085 595671 668309 747811 829847 908961 977781 1027289 1049447 1040660 1003320
56825 1003320 944336 872180 794631 718138 647838 587038 536568 495450 462782 438767 423872
56814 423872 417796 420005 430761 450761 480054 518062 564335 618086 676626 734777 785867 823028
56802 823028 840311 834371 806031 759858 701899 637973 573483 513199 460185 415275 378006 347740
56790 347740 323901 306014 294073 288473 289266 295927 308056 325705 348653 375876 405904 436879
56778 436879 465712 487840 498784 496143 480113 452796 417518 378203 338353 300297 265474 234980
56766 234980 209349 188074 169946 154021 140053 128145 118310 110330 103754 98048 92896 88335 84502
56753 84502 81340 78585 75982 73472 71225 69429 67954 66434 64852 63757 63542 63779 63759 63469 63394 63535
56737 63535 63382 62851 62471 62504 62640 62746 63147 63889 64488 64835 65571 67080 68755 69889 70780 72272 74520 76841
56719 76841 78560 79537 80027 80442 81090 81821 82136 81899 81695 82183 83357 84707 85823 86613 87249 88128 89509
56702 89509 90933 91485 90987 90396 90543 90950 90512 89029 87372 86296 85824 85795 86346 87587 89190 90635 91734
56685 91734 92772 94140 95893 97716 99372 101019 102812 104306 104786 104313 103920 104427 105440 105982 105831 105740
56669 105740 106388 107522 108273 108118 107376 106765 106604 106613 106566 106787 107689 109053 110261 111156 112124 113395 114811 116345
56651 116345 118221 120346 122192 123428 124190 124529 124194 123246 122310 121841 121602 121187 120614 120100 119654 119275 119148
56634 119148 119284 119318 118927 118112 116900 115269 113599 112601 112403 112241 111502 110579 110216 110476 110837 110911 110547 109627
56616 109627 108308 107230 106917 107164 107360 107166 106539 105530 104507 104165 104755 105563 105686 105107 104521 104341 104435 104643
56598 104643 105001 105402 105553 105413 105477 106494 108743 111401 112815 111968 109729 108068 107979 108842 109900 111286 113144
56581 113144 114768 115526 115891 116628 117505 117827 117794 118274 119477 120859 122213 123840 125686 127348 129007 131449
56565 131449 134864 138510 141934 145835 151178 157985 165516 173367 181836 191185 200797 209157 214659 216531
56551 216531 215122 211481 206813 202161 198128 194660 191357 188196 185685 184181 183382 182701 181770 180322 178067
56536 178067 175087 172037 169503 167353 165101 162695 160546 158981 157985 157328 156675 155745 154592 153558 152908
56521 152908 152770 153448 155185 157465 159181 159803 159739 159225 157685 154804 151551 149303 148333 147832 147042 145770
56505 145770 144136 142572 141719 141732 141969 141879 141832 142422 143367 143848 143653 143280 143143 143303 143712 144115 143972 143135 142312
56486 142312 142290 143025 144033 145187 146404 147060 146614 145474 144374 143300 141950 140872 140964 142022 142928 143311
56470 143311 143896 145147 146609 147872 149264 151227 153714 156421 158921 160429 160163 158286 155930 154135 153219
56455 153219 153163 153835 154660 154852 154340 153933 154298 155173 155885 156180 156281 156431 156654 156822 156868 156950 157337 158003 158584 158883
56435 158883 159018 158928 158290 157347 157102 158027 159187 159479 159206 159415 160066 160041 158884 157446 156663 156646 157113 157876 158683
56416 158683 159252 159638 160085 160570 161064 162014 163771 165717 166848 167169 167631 168669 169707 170219 170384 170525 170736
56399 170736 171263 172497 174286 175952 177198 178396 179853 181400 182844 184196 185300 185830 185842 185818 186083 186595
56383 186595 187271 187969 188301 188067 187746 187900 188238 188011 187241 186813 187405 188949 191008 192926 193874 193686 193525 194742
56365 194742 197118 199129 199913 200037 200377 201270 202809 204978 207291 209111 210420 211546 212340 212540 212702 213589
56349 213589 214732 214849 213755 212619 212263 212445 212975 214167 215862 217329 218565 220514 223583 227080 230487
56334 230487 234097 237913 241195 243663 246089 249063 252182 254936 257427 259749 261757 263899 267083 271074
56320 271074 274195 275390 275528 275929 276647 277056 277135 277274 277515 277841 278497 279384 279898 280019 280749 282773 285440 287817
56302 287817 289999 292623 295804 299313 303209 307539 311963 316303 320928 326025 331043 335365 338957 341977
56288 341977 344473 346912 350263 355022 360815 367342 374878 383396 392050 400154 407913 415750 423752 432239
56274 432239 441891 452713 463823 474881 486914 501025 517162 534662 553129 572163 591316 611058
56262 611058 632835 657411 684153 712675 744135 779989 820520 865686 916412 973870 1038272
56251 1038272 1109644 1189184 1278641 1378658 1488666 1608040 1736448 1873347 2017773 2168264
56241 2168264 2322493 2477437 2630238 2778114 2917087 3041994 3148521 3234230 3296948 3333635
56231 3333635 3342305 3324128 3282227 3219005 3136021 3035852 2922458 2799645 2670226 2536627
56221 2536627 2401358 2266795 2135021 2007784 1886171 1770659 1661824 1560460 1466620 1379257
56211 1379257 1297442 1221293 1151174 1086737 1027372 972970 923566 878805 838279 801711 768429
56200 768429 737414 708387 682033 658740 638022 619526 603454 589552 576938 565491 556042 548510
56188 548510 541356 533777 526950 522032 518371 514882 511729 509259 506697 503475 500728 499843 500420 501136 501655
56173 501655 502284 502707 502639 502909 504373 506502 508445 510647 513999 518155 522211 526335 531286 537003 542986
56158 542986 549391 556390 563310 569730 576736 585690 596534 608551 621864 636911 653485 671874 693923
56145 693923 721368 754058 791419 834741 886273 946831 1015848 1092710 1176156 1263097 1349824
56134 1349824 1433765 1512594 1582915 1642058 1690640 1731601 1767367 1799458 1829391 1857387 1880729
56123 1880729 1895737 1901229 1898514 1888919 1873411 1853782 1831655 1806379 1775619 1737490 1690493 1632655
56111 1632655 1563399 1485903 1405409 1325670 1248954 1178331 1116913 1065076 1021044 984026 954359
56100 954359 930914 911154 893988 880238 870139 862625 857121 853848 852291 851387 851214 852522 854821
56087 854821 857010 859538 863699 869100 874230 879275 885922 894483 903705 913245 923804 934838 944837 954042
56073 954042 964331 976183 988124 999505 1011390 1024360 1037663 1050932 1064738 1079236 1094189
56062 1094189 1110262 1128278 1147373 1165963 1184241 1203536 1223622 1243034 1261701 1280754 1300094
56051 1300094 1318617 1336464 1354515 1372234 1388751 1405476 1424638 1445733 1466545 1487236 1510121
56040 1510121 1535713 1562470 1590302 1620805 1653894 1687598 1721434 1756788 1793885 1831451 1869287
56029 1869287 1907921 1946067 1981933 2016852 2054090 2094286 2135735 2178636 2224954 2274387 2324899
56018 2324899 2377248 2434582 2497411 2563247 2631249 2702769 2777306 2852732 2929759 3011362 3097523
56007 3097523 3185439 3275217 3370226 3471461 3576777 3686128 3802172 3925241 4053284 4187299
55997 4187299 4331061 4484894 4645682 4813688 4993147 5185452 5388226 5601931 5830716
55988 5830716 6075878 6335413 6610899 6907475 7226095 7563733 7922439 8310067 8730729
55979 8730729 9183153 9670011 10199780 10777612 11403920 12084089 12829779 13648576 14543010
55970 14543010 15522311 16604323 17803954 19132299 20610305 22270794 24145092 26263182
55962 26263182 28671668 31437956 34636521 38353096 42711984 47887970 54100631 61636708
55954 61636708 70895153 82382130 96640880 114193740 135519272 160974376 190622901
55947 190622901 224060326 260254041 297268923 331938212 359976097 376990290 380070477
55940 380070477 368922738 345798373 314444918 278893365 242637038 208240287 177241346
55933 177241346 150284146 127397407 108268487 92420524 79324343 68486249 59491859
55926 59491859 51997043 45710929 40399980 35888177 32036086 28724507 25858682 23370116
55918 23370116 21202355 19301959 17626283 16147464 14841344 13680601 12642802 11715401
55910 11715401 10887261 10143056 9470126 8862713 8314834 7816064 7358154 6938822 6555215
55901 6555215 6200208 5868674 5561154 5277888 5015125 4770336 4545034 4339122 4147897
55892 4147897 3967672 3799209 3642970 3496273 3357860 3230025 3113340 3004195 2900342
55883 2900342 2804160 2717595 2638352 2563802 2494223 2429290 2365354 2299116 2230679 2160897 2089422
55872 2089422 2017435 1948487 1884256 1822772 1762650 1705503 1652451 1602024 1553529 1508745 1468197
55861 1468197 1429306 1390362 1352930 1318363 1285413 1253356 1224035 1198543 1175049 1151990 1130197
55850 1130197 1109808 1088360 1064293 1039374 1015418 991520 966720 942503 920237 898760 876818
55839 876818 855443 835738 816754 797650 779578 763388 747835 732087 717630 705655 694898
55828 694898 684114 674394 666895 660447 653456 646064 638477 629423 618398 607308 597690 588294 577560
55815 577560 566434 556505 547227 537426 527885 520118 513978 508668 504671 502577 501316 499690 498530 499379
55801 499379 502077 505380 508902 512751 516338 519120 521545 523865 525128 524577 522804 520346 516606 511410
55787 511410 505987 501039 495538 488984 483068 479258 476252 471670 464897 456483 446256 434141 421705
55774 421705 410863 401918 394556 389756 388948 392115 398238 406575 415880 423407 426515 424617 418444 408548
55760 408548 395998 383190 372081 362433 353331 345264 339023 333667 327589 320848 314647 309261 304235
55747 304235 299877 296670 293724 289589 284258 278882 274004 269536 265931 263780 262559 261172 259365 257473
55733 257473 255316 252607 249823 247462 245068 242196 239578 237946 236449 233704 229774 225642 221428 216719
55719 216719 212128 208816 206748 204934 203154 202124 202172 203078 204987 208243 212440 216720 220826 224963 228937
55704 228937 232256 234672 235837 235073 232291 228405 224036 218799 212749 207239 203063 199002 193840 188626
55690 188626 185101 182937 180593 178178 177162 177660 178259 178508 179532 182030 185473 189468 194175 199115 203164
55675 203164 206070 208619 211040 212592 212968 212784 212379 211314 209384 207142 205159 203600 202590 202118 201700
55660 201700 201033 200733 201482 202774 203676 204407 205816 207603 208573 208487 208180 207932 207298 206513 206358 206443 205296 202559
55642 202559 199506 196880 193818 189617 185052 180972 176807 171564 165474 159642 154673 150450 146856 144020
55628 144020 142059 140976 140549 140251 139714 139294 139548 140166 140144 139136 137855 136996 136560 136403 136566 136675 135775 133281
55610 133281 129623 125686 122090 119200 117149 115535 113590 111003 108297 106234 105180 105039 105367 105561 105353
55595 105353 105050 104904 104424 102943 100623 98261 96307 94837 94253 94972 96390 97113 96501 95289 94568 94804
55579 94804 95874 97269 98186 98198 98011 98807 100757 102977 104981 107204 109866 112329 114077 115468 116944 118190
55563 118190 118718 118771 118976 119369 119254 117957 115418 112192 109017 106308 104057 102241 101081 100639 100557 100643 101366
55546 101366 103086 105128 106388 106688 106721 106763 106417 105738 105635 106801 108918 111165 112967 114099 114727 115523 117080
55529 117080 119017 120304 120607 120595 120676 120248 118633 116138 113618 111444 109370 107154 104892 102845 101163 99700
55513 99700 98053 95906 93265 90239 86885 83584 81157 80048 79640 79085 78572 78971 80364 81805 82526 82565
55497 82565 82116 81123 79699 78184 76556 74517 72380 71094 71076 71645 71946 71867 71730 71727 72010 72861 74405 76439
55479 76439 78652 80614 81588 81027 79426 78088 77772 78098 78441 78743 79170 79541 79470 78735 77304 75439 73864
55462 73864 73291 73577 73778 73251 72263 71451 71186 71580 72531 73586 74227 74450 74636 74860 74903 74916 75360 76169 76663
55443 76663 76475 75861 74968 73562 71755 70243 69462 69107 68763 68373 67870 67071 66242 66019 66386 66511 66030 65731
55425 65731 66321 67285 67762 68025 69129 71314 73579 74895 75282 75523 76178 77069 77619 77583 77238 76775 75838 74147
55407 74147 72325 71419 71593 71963 71803 71215 70471 69438 68011 66462 65033 63691 62608 62267 62746 63410 63692
55390 63692 63724 63891 64275 64890 65946 67467 69046 70278 71051 71238 70658 69640 69015 69162 69569 69695 69722 70029
55372 70029 70436 70517 70246 69844 69318 68607 67934 67646 67969 69082 71014 73182 74533 74537 73676 72648 71559 70233
55354 70233 68830 67630 66597 65587 64710 64077 63502 62837 62323 62260 62578 63048 63583 64053 64136 63711 63144 62895
55336 62895 63057 63454 63910 64253 64426 64740 65614 66914 68040 68828 69754 70971 71734 71307 70017 68904 68610
55319 68610 68979 69491 69790 69898 70101 70496 70743 70537 70139 69876 69394 68215 66862 66403 66776 66752 65902 65358 66022
55300 66022 67128 67513 67360 67625 68351 68627 67948 66750 65774 65509 66013 66832 67390 67800 68862 70898 73164
55283 73164 74811 75704 75867 75008 73350 72056 71890 72076 71486 70381 69898 70282 70722 70738 70567 70284 69569 68498
55265 68498 67727 67702 68250 69001 69685 70055 70003 69756 69623 69728 70253 71510 73305 74737 75239 75373 75909 76560 76438
55246 76438 75457 74416 73899 73813 73854 73698 72930 71527 70267 70008 70697 71690 72793 74231 75832 77042 77617
55229 77617 77655 77037 75584 73631 71837 70527 69771 69733 70256 70484 69796 68809 68563 69001 69269 69285 69858 71207
55211 71207 72508 73108 73169 72887 72028 70669 69586 69422 69967 70524 70544 69825 68633 67756 67919 69042 70482 71893
55193 71893 73249 74265 74583 74476 74535 74723 74600 74470 75220 76845 78172 78425 78162 78207 78481 78435 77915 77014 75658
55174 75658 73945 72444 71621 71263 70880 70372 69985 69911 70276 71224 72696 74336 75769 76842 77479 77519 76783 75205
55156 75205 72986 70845 69773 70109 71131 72054 73107 74880 76925 78051 77977 77713 78053 78610 78643 78075 77328
55139 77328 76781 76752 77422 78449 79133 79158 78670 77658 76041 74426 73883 74571 75382 75351 74658 73907 73189 72449 72050
55120 72050 72333 73057 73820 74571 75322 75879 76267 76882 77744 78140 77562 76521 75955 76215 77083 78300 79596 80591
55102 80591 81202 81747 82348 82685 82741 83151 84316 85715 86719 87485 88348 88875 88416 87270 86385 86052 85753 85216
55084 85216 84842 84979 85465 86026 86584 87016 87073 86714 86185 85656 85103 84636 84652 85494 87094 88966 90457 91110 91021
55065 91021 90792 90925 91291 91283 90492 89090 87638 86678 86450 86891 87813 88954 89845 89927 89137 88232 88030 88396 88437
55046 88437 87714 86747 86243 86403 87099 88114 88926 88844 87755 86284 84965 83762 82696 82311 82937 84008 84671
55029 84671 84743 84574 84353 84095 83984 84122 84163 83696 82882 82193 81744 81345 81037 81138 81846 83176 85070 87181 88764
55010 88764 89311 89161 89053 89225 89405 89532 89919 90689 91495 91916 91854 91508 91171 91048 91078 91010 90758 90498 90366 90293
54990 90293 90314 90695 91530 92482 93135 93285 92752 91464 90010 89506 90367 91719 92566 93068 93972 95272 96292 96834
54972 96834 97308 97756 97665 96866 95875 95119 94430 93558 92684 92144 92011 92134 92330 92398 92249 92085 92224 92704 93338 94110
54952 94110 95182 96473 97533 97943 97674 97070 96616 96609 96874 96964 96784 96714 96934 97002 96509 95726 95100 94495 93643 93008
54932 93008 93326 94337 94852 94251 93212 92749 93136 93995 94868 95441 95724 96364 98339 101985 106606 111330 116085
54915 116085 121463 127838 134826 141487 146919 150743 153045 153811 152625 149223 144175 138555 133018 127620
54901 127620 122481 118047 114588 111864 109483 107198 104847 102432 100374 99207 98880 98756 98471 98359 98828
54886 98828 99791 100930 102146 103440 104678 105762 106794 107915 109293 111329 114467 118556 122876 127023 131369
54871 131369 136282 141305 145595 148852 151275 152728 152515 150135 145984 141160 136639 132655 128861 125074
54857 125074 121726 119356 117818 116390 114691 112970 111365 109430 106763 103699 100915 98593 96439 94302
54843 94302 92369 90773 89413 88182 87120 86296 85746 85444 85242 84896 84322 83675 83058 82392 81760 81657 82485
54826 82485 83927 85143 85605 85502 85378 85629 86327 87241 87989 88404 88835 89925 91913 94210 95700 95498 93630
54809 93630 91102 89246 88801 89525 90655 91588 92027 91772 90757 89344 88290 88188 88929 89811 90249 90386 90911
54792 90911 92195 93743 94788 95284 95905 96987 98002 98407 98548 99221 100559 101958 102988 103845 104850 106040
54776 106040 107376 108889 110396 111478 111997 112330 112832 113453 114154 115331 117393 120148 123139 126451 130626
54761 130626 135792 141379 146807 151855 156142 158855 159592 159110 158555 158002 156340 152684 147396 141549 135892
54746 135892 130678 126049 122024 118318 114722 111656 109864 109399 109358 108855 107989 107519 107799 108394 108669 108410 107756
54729 107756 106888 105999 105393 105340 105823 106637 107734 109340 111775 115322 120204 126319 132870 138634 142973 146395
54713 146395 149743 152936 154908 154780 152622 148980 144234 138813 133591 129454 126443 123781 120821 117768
54699 117768 115365 114057 113494 112774 111199 108912 106770 105473 104890 104402 103770 103393 103694 104523 105291 105551 105356
54682 105356 105091 105046 105111 104806 103622 101410 98550 95845 94158 93883 94683 95827 96849 97703 98377 98721 98807
54665 98807 99058 99699 100353 100524 100271 100029 99972 99993 100138 100489 100635 99897 98249 96566 95753 95996 97017 98545
54647 98545 100188 101261 101323 100784 100549 101024 101808 102320 102373 102071 101484 100687 99959 99646 99809 100211 100710 101487 102701
54628 102701 104012 104726 104445 103422 102202 101076 99997 98846 97628 96534 95894 95912 96365 96802 97186 97979
54612 97979 99327 100550 100939 100766 100875 101377 101484 100748 99792 99488 99987 100905 102013 103235 104275 104796 104913
54595 104913 105056 105350 105450 105023 104192 103435 103212 103659 104471 105086 105055 104286 102962 101438 100263 100011 100748 101798
54577 101798 102324 102141 101740 101577 101622 101655 101709 101997 102537 103005 103001 102405 101548 101017 101196 101950 102806 103469 104000 104473
54557 104473 104735 104671 104564 104837 105490 106173 106851 107932 109485 110807 111319 111573 112625 114434 115670 115410 114368
54540 114368 113957 114637 115771 116793 117773 118878 119851 120278 120055 119443 118783 118108 117003 115144 113125 112293 113263
54523 113263 114904 115458 114493 113141 112480 112433 112339 111884 111197 110603 110578 111474 112931 113961 113921 113083 112074 111164
54505 111164 110346 109620 108847 107746 106416 105454 105179 105112 104703 104152 103928 103776 102945 101415 100208 100277 101463 102774
54487 102774 103436 103476 103447 103790 104542 105594 107022 108877 110726 111872 112198 112370 112877 113341 113245 112954 113326 114428
54469 114428 115360 115472 115168 115300 116222 117716 119495 121404 123289 124975 126392 127581 128593 129406 129924 130052
54453 130052 129848 129499 129014 128072 126400 124237 122161 120501 119277 118667 119004 120091 120969 120835 119996 119472 119781
54436 119781 120529 121192 121732 122208 122294 121672 120698 120124 120200 120497 120727 121175 122042 122849 123027 122859 123235 124459 125872
54417 125872 126755 127082 127153 126975 126485 126072 126327 127302 128401 129081 129327 129369 129287 129114 129109 129543 130257 130797 131097 131708
54397 131708 133044 134589 135345 135054 134521 134548 135034 135459 135787 136312 136883 136933 136278 135366 134639 134098 133545 132838 131889
54378 131889 130827 130187 130433 131236 131756 131775 131963 132857 134186 135461 136588 137512 137926 137891 138218 139547 141398
54361 141398 142832 143789 145111 147422 150544 153915 156984 159322 160881 162119 163348 164038 163340 161217 158478
54346 158478 155730 152970 150250 147974 146172 144119 141186 137768 134948 133463 133202 133471 133419 132437 130580
54331 130580 128629 127484 127433 128033 128667 129061 129325 129630 129972 130292 130690 131302 131927 132065 131573 131020 131015 131328 131135
54312 131135 130144 128995 128363 128130 127761 127227 127069 127576 128333 128730 128686 128566 128512 128217 127528 126920 126950 127321 127024
54293 127024 125547 123558 122160 121854 122517 123915 125630 126787 126645 125584 124915 125440 126621 127438 127668 127904
54277 127904 128550 129285 129573 129371 129097 129093 129367 129852 130631 131668 132566 132940 132990 133306 134078 134956 135740 136678 137812
54258 137812 138606 138705 138636 139155 140203 141108 141608 141979 142325 142477 142592 143059 143614 143282 141570 139193 137260 136197
54240 136197 135764 135664 135650 135424 134961 134817 135634 137285 138821 139332 138723 137650 136856 136605 136649 136704 136818 137259 138171
54221 138171 139495 141053 142480 143185 142771 141471 139853 138150 136316 134678 133901 134014 134015 132946 131115 129763
54205 129763 129626 130203 130448 129841 128718 127778 127462 127737 128288 128759 128813 128247 127307 126706 126983 127858 128547 128744 128887
54186 128887 129423 130200 130821 131190 131436 131575 131616 131866 132742 134279 136025 137429 138225 138511 138563 138590 138625 138688 138934
54167 138934 139452 139947 139975 139575 139338 139631 140046 139911 139112 138079 137120 136154 135105 134165 133525 133063 132473 131673
54149 131673 130931 130622 130880 131470 131975 132067 131677 130993 130399 130329 131026 132372 133919 135084 135397 134788 133701 132832
54131 132832 132520 132513 132405 132183 132183 132663 133660 135114 136826 138385 139411 139912 140211 140541 140908 141199 141224 140822 140238
54112 140238 140231 141392 143415 145392 146732 147434 147602 147234 146503 145732 145015 144306 143929 144417 145759 147296 148497
54095 148497 149378 150057 150505 150973 152051 153980 156423 159171 162507 166510 170611 174307 177745 180997 183253
54080 183253 183497 181749 179010 176171 173505 170992 168450 165444 161828 158443 156689 157165 159052 160940 161928
54065 161928 161969 161606 161573 162303 163563 164710 165389 165840 166485 167368 168051 167983 166990 165591 164805 165430 167461 170176
54047 170176 172759 174878 176879 179576 183690 189268 195665 202117 208191 213753 218878 223954 229451 235304
54033 235304 240814 245470 249589 253804 258214 262440 266228 269536 272218 274177 275773 277527 279420 280937
54019 280937 281879 282614 283375 283718 283001 281147 278654 275910 272736 268648 263564 258128 253181 248816 244222
54004 244222 238673 232528 226956 222734 219575 216674 213613 210593 207976 205790 203776 201832 200190 199019
53990 199019 198017 196701 195014 193236 191291 188686 185316 181887 179223 177506 176464 175903 175683 175531 175274
53975 175274 175001 174703 174128 173364 173132 173958 175396 176624 177451 178108 178467 178286 178045 178679 180387 182358 183761
53958 183761 184434 184659 184940 186064 188680 192588 196951 201350 206101 211520 217539 224211 231949 240966 250921
53943 250921 261285 271416 280056 285479 286744 284539 280535 276274 272836 270905 270520 270971 271403 271433 271059
53928 271059 270396 269807 269931 271107 273075 275537 278705 282857 287657 292483 297371 303055 309980 317647 325125
53913 325125 332017 338761 346008 353834 361686 369065 376025 382675 388379 391987 393012 392183 390623 388807
53899 388807 386573 383801 380700 377592 374716 372139 369601 366491 362107 355951 347847 338084 327524 317262
53885 317262 307947 299613 292196 285769 280105 274477 268358 262051 256254 251220 246769 242886 239773 237297
53871 237297 234842 231840 228198 224192 220216 216663 213787 211508 209457 207272 204769 201902 198737 195493
53857 195493 192454 189809 187632 186056 185323 185584 186637 187885 188602 188287 186865 184677 182404 180917 180788
53842 180788 181736 182717 182875 182243 181368 180526 179748 179352 179720 180548 180948 180540 179868 179545 179497 179438 179534 180119 181075 181951
53822 181951 182517 182826 182966 183117 183652 184798 186366 188104 190090 192429 194802 196755 198327 199981 202037
53807 202037 204505 207351 210588 214164 218117 222717 228084 233727 238902 243454 247957 252952 258371 263726
53793 263726 268523 272402 275195 277102 278723 280733 283413 286396 288896 290386 291095 291611 291895 291080 288465
53778 288465 284387 279738 274981 270103 265247 260702 256303 251438 245797 239724 233819 228585 224478 221726
53764 221726 219915 218176 216012 213586 211139 208560 205783 203185 201191 199685 198155 196329 194432 192961
53750 192961 192308 192423 192682 192313 191204 190158 190037 190748 191297 190838 189460 187929 186888 186378 186028 185608 185327
53733 185327 185573 186336 186997 186841 185822 184777 184721 185912 187642 189028 189914 190852 192262 193961 195588 197146
53717 197146 198789 200335 201441 202212 203160 204486 205748 206436 206620 206807 207426 208631 210443 212747 215153 217123
53701 217123 218427 219434 220865 223111 225864 228556 231171 234316 238299 242467 245896 248521 250988 253509
53687 253509 255567 256913 258077 259378 260111 259507 258127 257335 257450 257318 255952 253761 251691 249911 248094
53672 248094 246528 245962 246337 246562 245804 244416 243237 242525 242032 241671 241485 241226 240597 239943 240054 241169 242632
53655 242632 243712 244298 244592 244576 244191 243676 243348 243195 243082 243176 243785 244858 245994 246980 247980 249241 250843
53638 250843 252738 254767 256712 258587 260799 263574 266244 267663 267578 267172 267844 269731 271809 273329 274629
53623 274629 276473 279047 281938 284943 288512 293162 298583 303641 307463 310382 313487 317214 320763 323178
53609 323178 324688 326518 329418 332886 336023 338690 341410 344389 347202 349500 351539 353767 356168 358297
53595 358297 359778 360514 360518 359858 358779 357628 356643 355872 355286 354805 354291 353664 352977 352214 351094 349390 347391
53578 347391 345775 344896 344395 343564 342007 339967 338139 337164 337092 337418 337715 338033 338466 338621 338029 336867 335690
53561 335690 334560 333123 331555 330537 330033 329038 327098 325350 325249 326693 328239 328882 328858 328860 329238 330069 331409
53544 331409 333202 335266 337425 339513 341419 343381 345990 349489 353354 357029 360808 365391 370741 376092
53530 376092 381068 386153 392019 398970 407118 416470 426695 437354 448547 460809 474200 487995 501462
53517 501462 514478 527207 539788 552704 566951 583249 601271 620038 639002 658448 678979
53506 678979 700803 723498 746371 769047 791671 814459 837211 859493 881087 901896 921525
53495 921525 939483 955786 970990 985696 1000412 1015722 1031884 1048273 1063965 1078933 1094025
53484 1094025 1109658 1125402 1141053 1157133 1173838 1190363 1206004 1221170 1236505 1251517 1264925
53473 1264925 1276020 1284869 1291493 1295667 1297400 1296860 1293906 1288345 1280518 1271036 1260058 1247557 1234176
53460 1234176 1221014 1208500 1196151 1183579 1171008 1158604 1145925 1132346 1117476 1100971 1082595
53449 1082595 1062899 1043368 1025294 1008681 992582 976328 960076 944397 929740 916339 904374
53438 904374 894133 886031 880268 876364 873274 870227 867358 865232 863931 862960 862114 862055 863721 867315 872178
53423 872178 877614 883575 890436 898464 907775 918587 931060 944917 959686 975476 993085 1013060
53411 1013060 1034966 1057952 1081806 1107095 1134394 1163755 1194889 1227500 1261334 1296154 1331797
53400 1331797 1368206 1405511 1444133 1484605 1527058 1571028 1615983 1661869 1708844 1756701 1805008
53389 1805008 1853729 1903234 1953544 2003905 2053199 2100514 2145346 2187663 2228002 2267191 2305618
53378 2305618 2342688 2377037 2407287 2432790 2453921 2471625 2486495 2498249 2506160 2509684 2508296 2500998
53366 2500998 2486736 2465443 2438171 2405985 2369299 2328632 2285397 2241274 2196949 2152067 2106363
53355 2106363 2060378 2014992 1970765 1927995 1887024 1848119 1811071 1775230 1740025 1705256 1670785
53344 1670785 1636145 1600766 1564622 1528374 1492692 1457706 1423387 1390265 1359365 1331409 1306393
53333 1306393 1283964 1263790 1245522 1228770 1213410 1199554 1186952 1174681 1161750 1147809 1132975
53322 1132975 1117277 1100789 1084218 1068781 1055299 1043684 1033355 1023808 1014742 1006130 998413 992266
53310 992266 987880 984754 982503 981494 982274 984649 987945 991990 997204 1003729 1011282 1020063 1030981 1044474
53296 1044474 1059767 1075988 1093491 1113213 1135005 1157598 1180207 1203209 1227022 1251175 1274900
53285 1274900 1297920 1320095 1340883 1359843 1377266 1393650 1408776 1421816 1432203 1439775 1444229 1445095
53273 1445095 1442390 1436864 1429445 1420650 1410523 1398805 1385114 1369220 1351215 1331379 1310012 1287572
53261 1287572 1264671 1241561 1217871 1193280 1168250 1143597 1119440 1095246 1070929 1047301 1025161
53250 1025161 1004387 984190 963984 943714 923532 903320 882455 860178 836458 812404 789447
53239 789447 768109 747880 728206 709052 690516 672561 655391 639636 625830 614015 603940
53228 603940 595212 587082 578681 569827 561172 553179 545341 536759 527065 516352 504660 492104 479225
53215 479225 466586 454157 441636 429227 417578 407004 397332 388505 380784 374153 368052 361931 355806
53202 355806 349977 344424 338780 332844 326869 321233 315843 310065 303401 296181 289326 283369 278004 272741
53188 272741 267685 263334 259895 257195 255160 253911 253290 252609 251105 248590 245666 243280 241953 241283 240365
53173 240365 238805 237110 235956 235349 234794 234026 233112 232029 230635 229081 227767 226859 226133 225432 224890 224601
53157 224601 224313 223629 222395 220853 219559 219032 219232 219472 219112 218267 217491 216898 216148 215300 214988 215508 216297 216719
53139 216719 216908 217373 218048 218358 218095 217742 217856 218516 219466 220483 221446 222259 222910 223584 224597 226122 227891
53122 227891 229264 229760 229597 229538 230098 231096 232121 233160 234489 236105 237589 238517 238724 238213 237104 235733
53106 235733 234531 233591 232488 230627 227745 224139 220530 217673 215836 214627 213508 212495 212081 212365 212677
53091 212677 212361 211687 211530 212225 213200 213778 213935 213999 213959 213502 212587 211606 210937 210684 210884 211664 212946 214292 215344
53072 215344 216241 217231 217906 217336 215171 212335 210240 209435 209315 209090 208636 208322 208369 208630 208858 208943 208935 208935 208919 208673
53052 208673 208096 207646 208088 209494 210808 210945 210188 209910 210835 212200 212892 212830 212714 212843 212843 212451 211961 211772 211886
53033 211886 211988 211775 211120 210105 208963 207882 206948 206404 206723 208039 209649 210496 210223 209424 208881 208925 209490
53016 209490 210291 210853 210846 210579 210757 211543 212343 212732 213151 214257 215967 217592 218661 219217 219468 219543 219535 219408 219023
52997 219023 218480 218259 218715 219600 220418 221037 221619 222094 222169 221788 221235 220829 220804 221334 222319 223318 224083 224993 226485
52978 226485 228230 229477 230213 231303 233358 236035 238625 240771 242345 243197 243430 243501 243617 243352 242323 240985
52962 240985 240293 240720 241985 243635 245383 246843 247429 246752 245031 242946 241132 239832 238899 237983 236697 234741
52946 234741 232112 229295 227086 225970 225670 225477 224980 224278 223565 222885 222356 222281 222758 223390 223632 223338 222833 222487
52928 222487 222330 222059 221450 220784 220741 221607 222743 223193 222784 222188 221875 221569 220963 220402 220365 220629 220486 219713 218844
52909 218844 218517 218870 219560 220111 220221 219927 219505 219083 218491 217638 216912 216960 218085 219893 221496 222039 221310 219939
52891 219939 218780 218054 217399 216787 216771 217533 218363 218628 218791 219683 221072 221812 221361 220406 219912 220179 220917 221656
52873 221656 221979 221967 222454 224208 226768 228811 229822 230631 232009 233625 234916 236140 237811 239706 241251
52858 241251 242472 243644 244372 243935 242457 240835 239486 237969 235867 233252 230110 226123 221375 216601 212440
52843 212440 209015 206449 205014 204314 203120 200810 198370 197127 196937 196593 195797 195592 196714 198533 200069
52828 200069 201180 202156 202811 202718 202001 201143 200215 198975 197637 196873 196887 197079 196858 196369 196098 196166 196430 197013 198256
52809 198256 200148 202214 204055 205698 207277 208624 209439 209708 209721 209635 209250 208279 206735 204926 203154 201531
52793 201531 200044 198652 197380 196461 196358 197371 199129 200701 201389 201254 200757 200143 199497 199160 199599 200846
52777 200846 202466 204172 206069 208111 209714 210265 209845 209153 208776 208687 208369 207326 205622 204034 203421 203800
52761 203800 204300 204206 203705 203274 202798 201901 200930 200788 201668 202649 202861 202520 202453 203008 203930 205037 206455 208277
52743 208277 210407 212761 215285 217726 219675 220989 222010 223299 225214 227698 230267 232210 233033 232881 232463
52728 232463 232442 232940 233652 234365 235198 236290 237330 237592 236586 234599 232439 230673 229361 228521 228418 229109 229997
52711 229997 230294 229900 229381 229067 228559 227346 225549 223729 222195 220882 219856 219513 220079 221164 222057 222409
52695 222409 222421 222385 222281 221955 221549 221449 221815 222421 223032 223663 224274 224483 223960 222996 222238 221862 221456 220850 220513
52676 220513 220772 221060 220438 218655 216193 213506 210857 208899 208577 210036 212123 213441 213657 213417 213265 213156
52660 213156 212899 212604 212622 213317 214898 217162 219475 221347 223029 225207 228117 231246 233919 235784 236706 236657
52644 236657 235928 235065 234320 233473 232400 231459 230964 230560 229553 227728 225539 223626 222474 222409 223483 225345
52628 225345 227508 229749 232033 234147 235725 236580 236748 236228 235029 233385 231633 229872 228081 226487 225434
52613 225434 224870 224427 224015 223915 224208 224626 225119 226034 227461 228907 230029 231210 232905 234725 235790 235811 235339
52596 235339 234960 234696 234215 233262 231864 230410 229543 229706 230772 232252 233660 234452 234026 232384 230709 230579
52580 230579 232431 235212 237640 239282 240261 240546 240026 238966 237958 237505 237821 238760 239747 240081 239647 239036 238645
52563 238645 238025 236593 234666 233141 232191 231008 229011 226705 225015 224195 223771 223298 222715 222132 221688 221617 222125
52546 222125 223103 224165 225045 225813 226647 227586 228517 229299 229792 229930 229878 230027 230695 231859 233252 234630 235819
52529 235819 236633 236957 236932 236851 236770 236423 235661 234778 234180 233863 233502 233076 233053 233846 235285 236813 238072 239115 240174
52510 240174 241501 243377 245995 249184 252411 255222 257626 259927 262206 264071 264927 264438 262743 260306 257598
52495 257598 254906 252358 250068 248148 246529 244871 242854 240645 238919 238220 238294 238281 237656 236788 236372 236484
52479 236484 236509 236036 235441 235405 236068 236974 237753 238526 239517 240552 241164 241219 241263 242168 244407 247675 251178 254249
52461 254249 256699 258660 260275 261640 262850 263900 264493 264165 262715 260427 257814 255219 252704 250216 247726
52446 247726 245243 242813 240584 238810 237747 237467 237683 237776 237178 235865 234437 233616 233695 234532 235919 237708
52430 237708 239605 241120 241934 242168 242157 242047 241798 241505 241479 241858 242327 242403 242021 241633 241679 242099 242562 243123 244348
52411 244348 246635 249643 252656 255457 258556 262516 267381 272914 279089 286027 293598 301399 308986 315694
52397 315694 320280 321345 318588 313377 307607 302077 296399 290388 284925 281089 278923 277539 276256 275058
52383 275058 273994 272782 271280 269907 269226 269387 270341 272280 275378 279229 283079 286658 290294 294183 298086
52368 298086 301897 305942 310389 314815 318760 322298 325573 328097 329154 328740 327547 326079 324380 322611
52354 322611 321233 320454 320046 319999 320798 322725 325227 327383 328800 329790 330982 332956 335928 339379 342331 344421
52338 344421 346511 349788 354482 359947 365767 372157 379228 386629 394230 402664 412783 424821 438403
52325 438403 453147 468887 485451 502637 520470 539191 558764 578519 597449 614961 631314
52314 631314 647325 663645 680335 697061 713515 729616 745464 761244 777074 792826 808150
52303 808150 822803 836832 850322 863089 874891 885798 896074 905723 914403 921777 927629 931560
52291 931560 932932 931328 926974 920599 913005 904796 896324 887721 879111 870807 863196 856446 850581 845915
52277 845915 843149 842874 845080 849232 854668 860931 867988 876208 885896 896748 908084 919715 932157
52264 932157 945719 959763 973297 986037 998422 1010796 1023137 1035481 1048037 1060767 1073377
52253 1073377 1085887 1098734 1111973 1124723 1135771 1144559 1151261 1156089 1158914 1159587 1158255 1155238 1150819
52240 1150819 1145239 1138738 1131418 1123194 1114071 1104443 1094953 1086050 1077779 1070025 1062754 1055962 1049625 1043902
52226 1043902 1039206 1035726 1032921 1029857 1026193 1022586 1019983 1018746 1018635 1019370 1020890 1023154 1026091 1029784
52212 1029784 1034471 1040217 1046742 1053607 1060516 1067373 1074203 1081079 1088063 1095130 1102083 1108523 1113954 1118120
52198 1118120 1121352 1124456 1128082 1132248 1136584 1140964 1145668 1150979 1156843 1162991 1169224 1175447 1181540 1187258
52184 1187258 1192180 1195694 1197119 1196040 1192583 1187373 1181099 1174003 1165802 1156182 1145410 1134332 1123722
52171 1123722 1113791 1104442 1095812 1088375 1082520 1078249 1075263 1073243 1072067 1071863 1072844 1074976 1077833 1080881
52157 1080881 1083859 1086788 1089647 1092107 1093543 1093303 1091180 1087778 1084319 1081853 1080694 1080586 1081123 1081819 1082133
52142 1082133 1081906 1081654 1082024 1082924 1083566 1083330 1082214 1080458 1078220 1075811 1073901 1073234 1074317 1077465 1082874 1090521
52126 1090521 1100256 1112158 1126599 1143839 1163766 1186081 1210445 1236345 1263115 1290321 1317872
52115 1317872 1345648 1373256 1400253 1426250 1450642 1472655 1491956 1508845 1523496 1535388 1543949
52104 1543949 1549571 1553479 1556776 1560011 1563450 1567159 1570793 1573836 1576122 1577650 1577854 1575660 1570598 1563390
52090 1563390 1555039 1545605 1534287 1520514 1504599 1487404 1469828 1452682 1436718 1422476 1410126 1399594
52078 1399594 1390799 1383785 1378750 1375989 1375787 1378216 1383018 1389717 1397883 1407332 1418133 1430449 1444269
52065 1444269 1459169 1474376 1489238 1503658 1517915 1532040 1545591 1558168 1569857 1580887 1591055
52054 1591055 1599797 1606708 1611640 1614445 1615111 1614106 1611998 1608560 1602722 1593661 1581511 1566793 1549674
52041 1549674 1530260 1509164 1487222 1464809 1442019 1419365 1397720 1377529 1358601 1340730 1324103
52030 1324103 1308959 1295233 1282749 1271474 1261445 1252610 1244815 1237772 1230974 1223907 1216382 1208463 1200009
52017 1200009 1190595 1180047 1168826 1157681 1146989 1136527 1125830 1114772 1103806 1093523 1083809 1073497
52005 1073497 1061094 1045864 1028109 1008579 987843 966155 943572 920194 896548 873640 852342
51994 852342 832745 814510 797721 782870 769981 758332 747242 736545 726091 715363 704031
51983 704031 692367 680631 668452 655401 641812 628377 615152 601667 587891 574389 561473
51972 561473 548948 536916 526151 517247 509916 503619 498549 495420 494508 495472 498104 502650 509110 516621
51958 516621 523922 530353 536091 541408 545920 548748 549218 547222 542962 536760 529302 521840 515643 511182
51944 511182 508074 506016 505502 507473 512451 520321 530701 543116 556796 570805 584649 598487 612452
51931 612452 626042 638440 649216 658268 665219 669418 670712 669811 667628 664516 660314 654785 647576 637946
51917 637946 625025 608588 589459 569078 548641 528638 509143 490546 473802 459729 448210
51906 448210 438580 430862 426027 424652 425861 428158 430960 434672 439481 444794 449839 454097 457051 458128
51892 458128 457115 454148 449180 441991 432901 422923 412933 403306 394563 387718 383392 381075 379843 379400
51878 379400 379940 381418 383701 387169 392386 399171 406620 414058 421394 428478 434725 439506 442519 443635
51864 443635 442906 440915 438593 436326 433500 429293 423776 418064 413553 411180 411125 412878 415599 418639 421796
51849 421796 425096 428398 431311 433312 433873 432602 429426 424659 418848 412543 406207 400219 394851 390152
51835 390152 385843 381432 376642 371839 367916 365643 365242 366576 369358 372917 376137 378217 379331 380068 380289
51820 380289 379217 376711 373706 371107 368885 366716 364879 363835 363351 362935 362951 364381 367264 370142 371455
51805 371455 371007 369757 368648 368140 368395 369211 369886 369746 368907 368087 367629 367171 366342 365283 364220 362943 361091
51788 361091 358641 355816 352783 349853 347749 347103 347688 348601 349218 349576 349797 349680 349074 348214 347469 347111 347545
51771 347545 349325 352571 356698 361180 366359 373061 381524 391128 401060 410788 419895 427911 434443 439215
51757 439215 441900 442230 440326 436679 431712 425537 418126 409527 399956 389972 380511 372380 365630 359767
51743 359767 354592 350457 347616 345802 344731 344649 346054 349153 353901 360242 367882 376024 383796 390883 397341
51728 397341 402837 406621 408366 408627 408309 408028 408206 409335 411586 414193 415696 414959 411826 406878 400968
51713 400968 395173 390760 388554 388206 388311 387421 384913 381024 376420 371883 368088 365350 363609 362814 363178
51698 363178 364834 367350 369889 371799 372904 373250 372877 371938 370839 370143 370348 371647 373675 375453 375854 374312
51682 374312 371080 366884 362466 358427 355161 352768 351117 350109 349824 350390 351729 353457 355033 356122 357001
51667 357001 358528 361572 366461 373079 381253 390729 400869 410737 419507 426494 430874 431865 429392 424239
51653 424239 417464 410038 403146 398191 395987 396146 397651 399832 402380 404610 405297 403394 398761 392195 384890
51638 384890 377792 371215 365019 359198 354094 349950 346569 343775 341958 341668 342715 344201 345567 347175
51624 347175 349606 352739 355847 358394 360302 361513 361679 360493 358108 355019 351594 347972 344382 341228
51610 341228 338616 336063 333026 329692 326897 325196 324328 323680 322998 322466 322416 323191 325032 327841 331297 335449
51594 335449 340879 347940 356095 364555 373300 382739 392276 399873 403439 402398 397730 390919 383203 375496
51580 375496 368467 362629 358540 356895 358221 362453 368993 377151 386494 396767 407720 419109 430887
51567 430887 443330 456905 471867 487938 504453 520907 537391 554543 573130 593719 616609
51556 616609 641964 669854 700015 731440 762242 790076 812747 828546 836266 835323 826014 809549
51544 809549 787613 761737 732946 701856 669162 636107 604382 575393 549540 526363 505356
51533 505356 486593 470626 457986 448744 442347 437815 434267 431377 429282 428103 427732 427946 428473 428865
51519 428865 428660 427646 425748 422581 417609 410954 403685 396942 391010 385519 380254 375290 370582 366031
51505 366031 361912 358663 356132 353590 350712 348036 346098 344588 342864 341010 339702 339063 338321 336833 335038
51490 335038 334044 334503 336131 338153 339876 340966 341514 341901 342416 342941 343131 342872 342388 341937 341558 341100 340257
51473 340257 338561 335748 332274 329162 326967 325085 322440 318774 314907 311745 309451 307710 306400 305631
51459 305631 305275 304885 304217 303629 303754 304728 305840 306127 305356 304336 304117 304980 306435 308080 310175 313320 317902
51442 317902 323997 331585 340578 350780 361913 373521 384709 394209 400959 404525 404913 402492 398465
51429 398465 394885 393282 393150 392457 389848 385847 381839 378566 376052 374275 373158 372196 370750 368694 366323
51414 366323 363849 361409 359376 358036 357033 355790 354499 354053 354851 356195 357054 356898 355631 353356 350637
51399 350637 348532 347850 348618 350463 353110 356199 359148 361715 364427 367991 372566 378012 384424 391890 400142
51384 400142 409131 419702 433002 449403 468759 491555 518874 551171 587864 628248 671997 718476
51372 718476 766272 813628 858556 898213 929056 948423 955678 951563 937100 913604 883022 847274
51360 847274 807527 764776 720861 678095 637875 600280 565013 532186 502196 475397 452050
51349 452050 432229 415616 401624 389706 379409 370285 362110 355027 349117 343956 338995 334247 330133
51336 330133 326724 323694 320980 318872 317289 315569 313357 311324 310474 310945 311845 312312 312358 312524 312983 313346
51320 313346 313383 313524 314303 315556 316699 317674 318928 320347 321042 320703 320399 321219 322679 323388 323000 322425 322216
51303 322216 321879 321038 320175 319680 318971 317351 315219 313694 313298 313575 313784 313377 311921 309232 305770 302544
51287 302544 300408 299619 300074 301657 304126 306889 309334 311507 314212 318119 322842 327274 330837 333961 337143
51272 337143 340066 342076 343114 343589 343636 343215 342829 343316 344840 346757 348657 350851 353523 356014 357421 357473
51256 357473 356494 354867 352883 350716 348197 344894 340792 336566 332859 329582 326289 322966 320001 317622
51242 317622 315805 314598 314067 313863 313231 311578 308987 306198 304149 303356 303602 304255 304923 305658 306566 307533 308426
51225 308426 309263 310068 310855 311897 313644 316132 318737 320730 321894 322520 323119 324228 326098 328308 330018
51210 330018 330748 330623 329802 328309 326702 326231 327736 330685 333856 336633 339213 341822 344266 346161 347246
51195 347246 347565 347531 347513 347248 346135 344356 343005 342623 342286 340890 338745 337030 336097 335371 334685 334612 335362 336267
51177 336267 336604 336301 335640 334845 334054 333184 331805 329727 327690 326777 327072 327541 327340 326610 325981 326042 327461 330790
51159 330790 335782 341462 347125 352592 357317 360104 360294 358599 356193 353466 350210 346536 343001 340081
51145 340081 337952 336521 335247 333345 330623 327811 325586 323688 321531 319346 317998 317847 318479 319479 320849
51130 320849 322572 324358 326040 327769 329653 331562 333499 335842 338968 342778 346796 350579 353876 356466
51116 356466 358124 358912 359340 360020 360999 361629 361329 360401 359790 360077 361051 362314 363852 365802 367993 370104 371995
51099 371995 373571 374513 374600 374189 373967 374159 374277 373793 372839 372104 372104 372629 372917 372414 371356 370561 370644 371543 372732
51080 372732 373628 373739 372862 371496 370836 371900 374540 377530 379697 380818 381463 382238 383333 384700 386435 388860
51064 388860 392261 396739 402420 409650 418677 429237 440806 453355 467414 483024 498935 513286
51052 513286 525143 535128 544602 554555 565331 577024 589668 602830 615218 625012 630845 632466 630337
51039 630337 624810 616029 604642 592117 580060 569393 560360 552990 547093 541924 536257 528997 519723
51026 519723 508787 497215 486405 477525 470902 466069 462448 459888 458563 458559 459800 462233 465853 470464
51012 470464 475612 480950 486586 492900 500050 507837 516117 525068 534929 545652 556979 568638 580256
50999 580256 591260 601187 610005 617826 624401 629233 632139 633410 633486 632791 631793 630766 629514 627819 626212
50984 626212 625832 627321 630340 634400 639805 647515 658372 672600 689655 708168 726315 742734 757198
50971 757198 770506 783960 798979 816747 837938 862842 891743 924913 962353 1004021 1050283
50960 1050283 1101462 1156869 1214983 1274802 1336204 1398650 1460502 1520314 1577937 1633374 1685157
50949 1685157 1731092 1770445 1804423 1834498 1861239 1884834 1905891 1925337 1944107 1963139 1983191
50938 1983191 2004386 2026204 2047872 2068422 2086506 2100823 2110826 2116604 2118104 2114939 2106845 2093641
50926 2093641 2074644 2048818 2015751 1975925 1929841 1877446 1818749 1754594 1686483 1616012 1544733
50915 1544733 1474239 1405995 1341130 1280364 1223914 1171609 1123462 1080069 1041891 1008249 977678
50904 977678 949395 923731 900925 880352 861342 844044 828811 815170 802066 788938 776121
50893 776121 764451 754805 747663 742592 738453 734557 731400 729732 729198 728576 727299 726076 725866 726745 728061
50878 728061 729449 731373 734678 739728 746062 753008 760547 769291 779605 791127 803374 816398 830535
50865 830535 845783 861897 878930 897334 917619 940260 965766 994426 1026059 1060369 1097519
50854 1097519 1138064 1182461 1231110 1284853 1345001 1412747 1488801 1573518 1666922 1768523 1877522
50843 1877522 1993378 2115904 2244629 2378371 2515587 2654819 2794389 2931730 3063350
50834 3063350 3185629 3295717 3391779 3472655 3537598 3586621 3621076 3643549 3656875 3663352 3665109
50823 3665109 3664974 3666455 3672703 3685829 3707243 3737978 3777955 3824812 3873858 3919489 3956669 3981199
50811 3981199 3989117 3976639 3941102 3881845 3799857 3696629 3573689 3433206 3278493 3113558
50801 3113558 2942379 2768873 2597228 2431587 2275222 2130109 1997221 1877001 1769666
50792 1769666 1675322 1593716 1523700 1463320 1411049 1366868 1331561 1304824 1284636 1268633 1255468
50781 1255468 1244490 1234799 1225397 1216021 1207137 1199059 1191486 1183876 1175839 1167137 1157662 1147468 1136488
50768 1136488 1124228 1110141 1094411 1077966 1061556 1045133 1028370 1011440 994984 979493 965039
50757 965039 951539 939027 927690 917857 909910 904006 899869 897044 895392 895301 897385 902036 909218 918690
50743 918690 930527 945458 964452 987925 1015597 1047248 1083188 1123602 1167816 1214864 1264744
50732 1264744 1318390 1376228 1437317 1500232 1564389 1630059 1697366 1765658 1833741 1900493 1965400
50721 1965400 2028705 2090815 2151246 2208247 2259671 2303968 2340090 2366806 2382783 2387424 2381350 2366207
50709 2366207 2344419 2319057 2293380 2270211 2251868 2240486 2237843 2244649 2260274 2283237 2311664 2343151
50697 2343151 2374681 2402973 2424817 2437017 2436430 2420516 2387907 2338529 2273470 2194923 2106024 2010443
50685 2010443 1911920 1813904 1719118 1629343 1545824 1469957 1403190 1346141 1298291 1258835 1227516
50674 1227516 1204353 1188894 1180265 1177786 1181093 1189654 1202485 1218430 1236521 1256022 1276240 1296232
50662 1296232 1314677 1330286 1342583 1352229 1360409 1367983 1375286 1382500 1389939 1398083 1407504 1418541 1430847
50649 1430847 1443532 1456107 1469209 1484128 1501789 1522446 1546089 1572637 1601811 1633379 1667527
50638 1667527 1704552 1744036 1784751 1825520 1865815 1905384 1943720 1980309 2015158 2048809 2081874
50627 2081874 2114726 2147531 2180360 2213148 2245238 2274475 2296646 2306557 2300615 2278941 2245184 2204546
50615 2204546 2162074 2122144 2088345 2062888 2046063 2036593 2032804 2033480 2037709 2044135 2050540 2054157 2052398
50602 2052398 2043461 2026495 2001308 1967912 1926364 1877019 1820865 1759459 1694637 1628330 1562488
50591 1562488 1498797 1438327 1381624 1329101 1281079 1237336 1196990 1159126 1123461 1090291 1059988
50580 1059988 1032741 1008530 987078 967935 950877 936115 923958 914500 907862 904381 904146 906505
50568 906505 910603 916314 924139 934201 945868 958451 971803 986054 1001310 1017886 1036364 1057010
50556 1057010 1079423 1103122 1128231 1155166 1183731 1212847 1241136 1267584 1291801 1313993 1334700
50545 1334700 1354410 1373434 1392161 1411242 1431281 1452560 1475325 1500228 1528229 1560149 1596597
50534 1596597 1638252 1685818 1739616 1799447 1864831 1935233 2010118 2089198 2172714 2261191 2354727
50523 2354727 2452689 2554087 2657864 2762609 2866316 2966780 3062049 3150253 3229233 3296751
50513 3296751 3351058 3390880 3414935 3421990 3411574 3384313 3341354 3283845 3213287 3132055 3043145
50502 3043145 2949588 2854542 2761837 2675759 2599957 2536780 2487771 2454331 2437437 2436869 2451056 2477651
50490 2477651 2513962 2556845 2602574 2646992 2685634 2713709 2726364 2719543 2690903 2640088 2568413
50479 2568413 2478644 2374974 2262608 2146622 2030896 1918102 1810464 1710021 1617984 1534271
50469 1534271 1458191 1389528 1328669 1275824 1230547 1192046 1159524 1132022 1108216 1086660 1066284
50458 1066284 1046733 1028487 1012597 999924 990547 984123 980751 980894 984398 990209 997440 1006225 1017146
50445 1017146 1030393 1046000 1064322 1085373 1107967 1130488 1152529 1174828 1197328 1218141 1234996
50434 1234996 1247182 1255545 1261050 1264084 1265133 1265421 1266438 1268849 1272044 1274912 1277121 1279567 1283464 1289164
50420 1289164 1296115 1303832 1312516 1322797 1335372 1351054 1370715 1394841 1423369 1456163 1493363 1535007
50408 1535007 1580524 1628873 1679060 1730271 1781694 1832472 1881753 1928573 1971824 2010518 2043935
50397 2043935 2071330 2091648 2103810 2107060 2100713 2083824 2055732 2017079 1969827 1916003 1856825 1793355
50385 1793355 1727712 1663062 1602429 1547842 1500538 1461347 1430609 1408186 1394097 1388883 1392761 1404486
50373 1404486 1421605 1441822 1463488 1484602 1502219 1513500 1516936 1511939 1497777 1473842 1440892 1401113
50361 1401113 1356709 1309009 1259117 1208737 1159893 1114100 1072039 1033732 998862 967235 939135
50350 939135 914945 894395 876654 861351 849090 840729 836587 836470 839822 845284 850562 853397 852681
50337 852681 848444 841245 832102 822703 814857 809570 806875 806389 807584 809700 812072 814804 818773 824745
50323 824745 832609 841547 850741 859919 869379 879467 889933 899893 908564 915865 922062 927062 930509 932539
50309 932539 933939 935339 936501 936728 935949 935310 936544 940597 946841 953827 960754 967911 975742 984193 993435
50294 993435 1004623 1019128 1037202 1058147 1081781 1108974 1140601 1176773 1217478 1263159 1313610
50283 1313610 1365943 1413915 1449566 1466110 1460508 1434602 1394400 1347771 1301631 1260059 1224301
50272 1224301 1194243 1169793 1150834 1136301 1124180 1112903 1102401 1093312 1085516 1078107 1070643 1063702
50260 1063702 1058123 1054352 1052677 1053486 1056917 1062756 1071007 1082194 1096642 1113792 1132592 1152413 1173207
50247 1173207 1194893 1216968 1238714 1259604 1279594 1299199 1319210 1340032 1361240 1381715 1400105
50236 1400105 1415098 1425530 1430476 1429263 1421422 1406901 1386441 1361572 1334043 1305361 1276874 1249892
50224 1249892 1225382 1203597 1184125 1166036 1147813 1127505 1103503 1075344 1043698 1009763 974892
50213 974892 940641 908597 879817 854431 831971 812125 795187 781667 771385 763144 755581 748306
50201 748306 741859 736594 732136 728061 724483 721515 718646 715298 711701 708531 705840 703012 699737 696295
50187 696295 692758 688666 683830 678764 673830 668476 661994 654731 647880 642125 637111 632313 627834 624043
50173 624043 620842 617648 613983 609868 605787 602495 600684 600478 601230 602075 602758 603816 605883 609018 612793
50158 612793 616876 621285 626216 631880 638470 646020 654185 662444 670695 679514 689585 700901 712659
50145 712659 723997 734710 745371 756898 770029 785030 801911 820998 843256 869858 901380
50134 901380 937557 977792 1021584 1068231 1116324 1164034 1210056 1254158 1296709 1337876 1377465
50123 1377465 1415402 1451938 1487082 1519824 1548033 1569112 1580793 1581600 1571088 1549958 1519787 1482351
50111 1482351 1439220 1392137 1343508 1295875 1250647 1207787 1167138 1129687 1096890 1068875 1044091
50100 1044091 1020971 999364 979842 962156 945093 927773 910351 893401 877277 862398 849648
50089 849648 839971 833689 830544 830252 832707 837703 844767 853277 862665 872534 882690 892913 902579 910797
50075 910797 917169 922207 926684 930773 934247 937274 940351 943332 945187 945089 943382 941069 938604 935544 931248
50060 931248 925533 918719 911357 903981 896901 890112 883468 876933 870689 865119 860735 857941 856712 856671 857696
50045 857696 860300 865125 872103 880440 889435 899052 909643 921347 933921 946946 960025 972894 985475
50032 985475 997695 1009237 1019670 1029002 1037833 1046582 1054665 1060967 1065301 1068993 1073621 1079399 1085232
50019 1085232 1090381 1095651 1102766 1112862 1125834 1140852 1157066 1173723 1189935 1204665 1217019 1226570
50007 1226570 1233442 1238186 1241665 1244994 1249274 1255007 1261638 1267821 1272205 1273781 1271469 1263854 1249792 1229227
49993 1229227 1203165 1172981 1140054 1105829 1071654 1038356 1006351 976241 948896 924670 902848
49982 902848 882214 861941 841688 821119 799888 778218 757107 737685 720443 705147 691354
49971 691354 678774 667147 656086 645384 635515 627475 621834 617968 614423 610040 604645 598875 593651
49958 593651 589722 587297 585970 585264 585230 586200 588078 590421 593391 597990 604929 613713 623283 633141 643216
49943 643216 652930 661193 667437 672105 675996 679541 682741 685290 686595 686064 683595 679394 673201 664181
49929 664181 651969 637527 622531 608080 594340 581316 569458 559418 551478 545430 540895 537642
49917 537642 535612 534737 534835 535795 537751 540805 544539 548043 550641 552427 553938 555547 557465 560176 564404
49902 564404 570515 578146 586611 595521 604937 614992 625515 636010 645964 655146 663501 670752 676220
49889 676220 679208 679538 677589 673953 669137 663483 656976 649134 639419 627928 615518 603159 591328
49876 591328 580094 569511 559700 550714 542522 535076 528335 522425 517807 515003 513936 513829 513996 514479
49862 514479 515707 517869 521024 525413 531055 537290 543480 550049 558079 567796 578265 588830 599954
49849 599954 612094 624411 635309 643883 650235 654770 657882 660097 661751 662542 661909 659769 656341 651326
49835 651326 643986 634256 623305 612723 603403 595345 588182 581734 576162 571727 568403 565941 564429 564404
49821 564404 566008 568391 570557 572614 575556 579940 585562 592409 601024 611585 623273 634958 645994
49808 645994 656116 665149 673209 680658 687438 692945 696880 699671 701587 702052 700462 697217 693283 689008
49794 689008 684069 678258 671568 663664 654074 643020 631444 620082 609036 598351 588503 580062 573161
49781 573161 567505 562698 558456 554660 551327 548459 545976 543894 542445 541853 542128 543227 545252 548307 552344
49766 552344 557315 563176 569550 575753 581475 587109 593040 598974 604439 609517 614428 618659 621317 622230
49752 622230 621922 620439 616989 611002 602969 593943 584731 575830 567744 560977 555875 552528 550575 549150
49738 549150 547459 545504 543884 542932 542556 542870 544358 547172 550848 554930 559359 563977 568210 571685 574729
49723 574729 577883 581261 584821 589024 594788 602907 613627 626543 640744 655361 670097 684806 698398
49710 698398 708742 714110 714391 710625 703928 695395 686418 678189 670898 664101 657892 653196 650870 651010
49696 651010 653096 656249 659148 660183 658159 653014 645934 638810 633211 629533 627180 625801 626105 629126
49682 629126 634905 642455 650916 660262 670877 682985 696664 711965 728868 747431 767961 790375
49670 790375 813045 832730 846210 852070 850956 844673 835484 825820 817786 812555 810403 811390 815798 823754
49656 823754 834447 845638 853885 855602 848564 832837 810425 784065 756361 729583 705573 685387
49644 685387 669155 656503 646966 639935 634585 630259 626913 624847 624066 624244 625219 626998 629104 630420
49630 630420 630067 628098 625030 621037 616078 610525 604976 599471 593485 586902 580481 575078 570775 567043
49616 567043 563509 560269 557660 555985 555365 555630 556405 557457 558876 560807 563114 565408 567352 568872 570175
49601 570175 571597 573280 575038 576729 578664 581225 584024 585962 586461 586290 586730 588133 589703 590579 590685
49586 590685 590564 590821 591838 593693 596089 598508 600556 602197 603632 605062 606576 608159 609788 611537 613589
49571 613589 616089 619106 622820 627653 634055 642110 651477 661718 672637 684150 695824 706654 715576
49558 715576 722296 727338 731005 732553 730903 726142 719788 713445 707666 702328 697567 693807 691161 689334
49544 689334 688021 687094 686546 686583 687583 689517 691525 692555 692467 692144 692496 693739 695756 698716 703066 709144
49528 709144 717083 726995 739029 753246 769608 788071 808497 830278 851971 871511 887034 897694
49516 897694 903711 905817 904911 902224 899364 897801 898322 901095 906134 913390 922411 932096 940965 947649 951085
49501 951085 950240 943918 931313 913026 891209 868304 845731 824090 804176 786980 772711 760661
49489 760661 750287 741717 734937 729266 724115 719684 716384 714123 712666 712106 712362 712796 713010 713486 714694
49474 714694 716120 717047 717843 719413 721619 723380 724272 724953 726014 727439 729322 732025 735384 738709 741948
49459 741948 745926 751008 756340 760823 764070 765980 766262 764993 762941 760643 757740 753861 749525 745389
49445 745389 741111 735817 729488 723156 717896 714250 712385 712120 712866 714220 716633 720969 727380 735149 743662
49430 743662 752972 763256 774262 785645 797563 810665 825620 842796 862297 884084 908083 934363
49418 934363 963227 994693 1027218 1056599 1076826 1083121 1074819 1055424 1030180 1003912 980481 962635
49406 962635 951346 945795 944744 947765 954894 965632 978957 993965 1009823 1025362 1039522 1052197
49394 1052197 1064085 1075653 1086726 1097067 1106697 1115429 1122591 1127511 1130008 1130173 1127861 1122728 1114719
49381 1114719 1104364 1092509 1079833 1066719 1053662 1041566 1031322 1023098 1016426 1010998 1007022 1004689
49369 1004689 1003829 1004294 1006234 1009620 1013908 1018476 1022950 1026710 1028647 1028078 1025578 1022249 1018380 1013439 1007136
49354 1007136 999812 991910 983725 975658 968106 961177 955053 950481 948175 947773 948163 948822 950009 951544 952433
49339 952433 952081 951004 949734 947729 944134 939150 933895 929121 924716 920412 916435 913387 911828 911975 913589
49324 913589 916146 919248 922800 926700 930688 934738 939383 945392 953262 963257 975627 990385 1006946
49311 1006946 1024288 1041243 1056314 1067437 1072725 1071744 1065714 1056235 1044135 1029892 1014739 1000539
49299 1000539 988313 977431 966691 956015 946589 939470 934641 931539 929887 929560 930058 930729 931355 932048
49285 932048 932637 932639 931799 930177 927720 924294 920214 916210 912612 909021 905109 901439 899207 899353 902046 906702
49269 906702 912150 917035 920477 922455 923444 923798 923487 922237 919712 915662 910101 903380 896251 889954 886004
49254 886004 885516 888743 895573 906227 920809 938198 956207 973221 988944 1003002 1013501 1017928
49242 1017928 1015371 1007113 995125 980760 965052 949516 935888 925138 917072 910968 906449 903681
49230 903681 902844 903698 905782 908834 912720 917041 921243 925150 929066 933242 937651 942352 947549 953059 958285
49215 958285 963117 968415 975076 982985 991395 999948 1008662 1017212 1025069 1032382 1040045 1048737 1058475 1069236
49201 1069236 1081421 1095424 1111091 1127835 1144983 1161896 1178165 1193865 1209323 1224518 1238994
49190 1238994 1252463 1265082 1276999 1288083 1298404 1308544 1319030 1329639 1339670 1348867 1357848 1367701
49178 1367701 1379375 1393379 1409877 1429003 1451094 1476530 1505426 1537740 1573727 1613912 1658287
49167 1658287 1705640 1753655 1799280 1838818 1868342 1885168 1889528 1884593 1874598 1862871 1851425 1841688
49155 1841688 1834849 1831411 1830831 1831904 1833409 1834425 1834532 1834131 1834380 1836270 1839715 1843966 1848900 1855337 1863936
49140 1863936 1874445 1886370 1899668 1914171 1928978 1943415 1958329 1975360 1994888 2015616 2036307
49129 2036307 2056982 2078105 2099607 2121333 2143616 2166568 2189326 2210880 2231457 2252347 2274498
49118 2274498 2297875 2322028 2346685 2371849 2397950 2426026 2457353 2492926 2533778 2581764 2639579
49107 2639579 2709968 2795290 2897535 3017505 3152859 3296882 3439999 3573980 3696269 3810715
49097 3810715 3922384 4029115 4117216 4167168 4166112 4116547 4033614 3934183 3827536 3714193 3591236
49086 3591236 3458217 3319336 3181756 3052625 2937131 2838068 2755957 2689318 2635471 2591751
49076 2591751 2556116 2526817 2502098 2480627 2461899 2445754 2431633 2418606 2405977 2393545 2381460
49065 2381460 2370122 2360067 2351501 2343994 2336936 2330199 2324007 2318302 2312760 2307434 2302837 2299282 2296533
49052 2296533 2294259 2292355 2290656 2288841 2287003 2285931 2286422 2288535 2291849 2296193 2301725 2308495 2316385 2325245
49038 2325245 2334613 2343314 2349952 2353906 2355491 2355096 2352717 2348568 2343602 2338944 2334981 2331393 2327847 2324237
49024 2324237 2320326 2315643 2309886 2303234 2296212 2289454 2283547 2278800 2275035 2271924 2269608 2268722 2269599 2271710
49010 2271710 2274176 2276676 2279548 2283114 2287347 2292210 2297908 2304553 2311853 2319426 2327265 2335545 2343946 2351456
48996 2351456 2357061 2360527 2362397 2363265 2363203 2361829 2358794 2354118 2348193 2341585 2334826 2328261 2322038 2316306 2311396
48981 2311396 2307624 2304848 2302458 2300076 2298108 2297332 2297937 2299346 2301013 2302952 2305216 2307336 2308736 2309445 2309795
48966 2309795 2309526 2307889 2304821 2301432 2298952 2297675 2297329 2298032 2300183 2303608 2307501 2311413 2315760 2321209 2327985
48951 2327985 2336012 2345295 2355822 2367435 2380229 2394873 2412051 2431613 2452645 2474332 2496432 2518966
48939 2518966 2541992 2565888 2591448 2619349 2649716 2682469 2717855 2756255 2797654 2841738 2888479
48928 2888479 2938165 2990698 3045305 3101200 3158224 3216504 3275770 3335484 3395568 3456572 3518942
48917 3518942 3582401 3646139 3709308 3771189 3831075 3888272 3942217 3992577 4039362 4082969 4123889
48906 4123889 4162289 4198030 4231160 4262084 4291100 4318119 4343071 4366248 4387841 4407536 4425136
48895 4425136 4441338 4457067 4471966 4484311 4492756 4497513 4499444 4498597 4494306 4486412 4475671 4463036 4449037
48882 4449037 4433791 4417118 4398548 4377643 4354374 4328923 4301205 4270970 4238382 4204050 4168292
48871 4168292 4130651 4090229 4046315 3998821 3948510 3896800 3844868 3792837 3740241 3687330 3635299
48860 3635299 3585010 3536158 3488210 3441654 3397665 3356815 3318794 3283351 3250814 3221528 3195240
48849 3195240 3171320 3149358 3129432 3111960 3097356 3085638 3076346 3068981 3063629 3060981 3061740 3065986 3073070
48836 3073070 3082044 3092367 3104316 3118537 3135006 3152651 3170254 3187508 3204928 3223012 3241889
48825 3241889 3261524 3281638 3301477 3320259 3337964 3355257 3372653 3390260 3408269 3426895 3445583
48814 3445583 3463063 3478627 3492827 3506443 3519416 3531413 3542966 3555191 3568559 3582711 3597440
48803 3597440 3613095 3629871 3647371 3665245 3683844 3703839 3725327 3747592 3769731 3791283 3812228
48792 3812228 3832409 3851118 3867478 3881260 3893074 3903686 3913458 3922573 3931267 3939274 3945421 3948443
48780 3948443 3948198 3945396 3940053 3930808 3916056 3895360 3869550 3839815 3806966 3771295 3732861 3692022
48768 3692022 3649731 3607030 3564165 3520614 3476103 3431241 3386896 3343346 3300394 3258044 3216692
48757 3216692 3176851 3139003 3103515 3070348 3039070 3009516 2982266 2958080 2937030 2918616 2902522
48746 2902522 2888691 2876752 2866142 2856993 2850294 2846768 2846046 2847322 2850399 2855498 2862230 2869379 2875808
48733 2875808 2881132 2885442 2888798 2891246 2893054 2894648 2896398 2898564 2901283 2904436 2907641 2910542 2912960 2914630
48719 2914630 2915113 2914253 2912531 2910541 2908203 2905004 2901014 2897099 2893920 2891212 2888408 2885572 2883244 2881711
48705 2881711 2880964 2881121 2882233 2883706 2884601 2884671 2884574 2884851 2885262 2885428 2885691 2886795 2888966 2891730 2894532 2897135 2899463
48688 2899463 2901379 2902704 2903249 2902813 2901329 2899083 2896626 2894469 2892873 2891855 2891246 2890840 2890634 2890874 2891714 2892816
48672 2892816 2893524 2893505 2893163 2893380 2894911 2897935 2901943 2905844 2908185 2907457 2902300 2891518 2874058 2849268 2817413
48657 2817413 2779867 2738493 2694678 2649079 2602275 2555334 2509452 2465269 2422975 2383066 2346611
48646 2346611 2314672 2287608 2264883 2245258 2227231 2209678 2192250 2175037 2157944 2140721 2123471
48635 2123471 2106598 2090156 2073745 2057243 2041142 2025782 2010643 1994756 1977589 1959249 1940094
48624 1940094 1920546 1901041 1881850 1863067 1845008 1828380 1813772 1801209 1790443 1781415 1774138 1768450
48612 1768450 1764302 1761985 1761652 1762813 1764717 1766971 1769336 1771255 1772205 1772322 1772035 1771233 1769557 1767443 1766060
48597 1766060 1766063 1767105 1768750 1771106 1774143 1777056 1778861 1779256 1778422 1776328 1772674 1767264 1760022 1750874 1739984
48582 1739984 1727909 1715167 1701826 1687884 1673864 1660561 1648281 1636784 1626001 1616443 1608750 1603153
48570 1603153 1599535 1597808 1597925 1599600 1602274 1605561 1609638 1614920 1621193 1627244 1631572 1633460 1633048 1630380
48556 1630380 1624787 1615547 1602958 1588533 1574129 1561022 1549601 1539615 1530574 1522048 1513738 1505322 1496325
48543 1496325 1486232 1474737 1461893 1448107 1433977 1420030 1406509 1393423 1380803 1368852 1357826
48532 1357826 1347853 1338956 1331241 1325025 1320751 1318777 1319229 1322083 1327422 1335490 1346355 1359412 1373071
48519 1373071 1384845 1391897 1391954 1384193 1369466 1349796 1327699 1305686 1285735 1268780 1254831 1243890
48507 1243890 1236518 1233286 1233948 1237695 1244161 1253681 1266463 1281929 1299080 1317219 1336009 1354748 1371543
48494 1371543 1383272 1386842 1381130 1367855 1350267 1330917 1310833 1290505 1270844 1252813 1236608 1221653
48482 1221653 1207335 1193510 1180497 1168779 1158640 1149889 1142029 1134772 1128287 1122772 1117932 1113110 1107989
48469 1107989 1103028 1099075 1096533 1094992 1093796 1092787 1092241 1092195 1092390 1093070 1095251 1099677 1105802 1112318 1118469
48454 1118469 1124291 1129705 1134043 1136593 1137161 1135968 1133345 1129610 1125004 1119724 1114189 1109041 1104503 1099977
48440 1099977 1094728 1088807 1082762 1076633 1069893 1062254 1053877 1044857 1035303 1025995 1018079 1011881 1006638 1001559
48426 1001559 996513 991540 986515 981616 977397 973982 970788 967358 963777 959950 955285 949598 943649 938152
48412 938152 932833 927095 921049 915184 909534 903986 899057 895506 893259 891404 889232 886735 884138 881481
48398 881481 878767 876072 873317 870170 866256 861448 856014 850512 845371 840534 835690 830806 826146 821836
48384 821836 817872 814544 812304 811111 810406 809862 809623 809675 809659 809520 809715 810427 811093 811064 810215 808634 806331 803603
48366 803603 801159 799460 798353 797633 797517 798325 800141 802995 806908 811638 816890 822825 829762 837540 845934
48351 845934 855608 867597 881853 897348 913537 930328 946487 959687 968641 973890 976235 976021 974450
48338 974450 973769 975235 978401 983169 990873 1002365 1016769 1033236 1052344 1074631 1099458 1126547 1156996
48325 1156996 1191561 1229682 1271396 1318272 1371179 1429290 1492686 1563571 1643397 1731556 1828868
48314 1828868 1939644 2068320 2217447 2391697 2600736 2856129 3170780 3566203 4076299
48305 4076299 4739161 5589116 6660159 7987665 9594846 11478926 13611265 15924628
48297 15924628 18260072 20320760 21725426 22170372 21580046 20123131 18102873 15830847
48289 15830847 13559322 11462461 9634378 8100223 6842659 5827747 5016356 4367979
48281 4367979 3846838 3426065 3084851 2804994 2572513 2378950 2217829 2081841 1965186
48272 1965186 1865636 1781820 1710698 1649543 1597801 1554733 1517383 1483079 1452111 1425833 1403779
48261 1403779 1384549 1367916 1354037 1341875 1330309 1319716 1310817 1302943 1294997 1287169 1280266 1274236
48249 1274236 1268738 1264334 1261896 1261551 1263245 1267472 1274256 1282186 1289391 1294676 1296882 1294306 1286080 1273469
48235 1273469 1258739 1243366 1228130 1213959 1201458 1190264 1179866 1170420 1161872 1153094 1143045 1132190
48223 1132190 1121710 1111770 1101496 1090177 1077660 1064075 1050064 1036744 1024510 1012217 998316
48212 998316 982376 964926 946472 927471 908604 890134 871464 852194 833187 815702 799903
48201 799903 785104 771037 757959 745803 734150 722920 712360 702469 693050 684099 675577 667156
48189 667156 658747 650945 644370 638919 634171 630013 626263 622259 617675 613316 610222 608250 606394 604269
48175 604269 602398 601109 599980 598401 596169 593503 590933 589043 587914 587010 585996 585294 585403 586057 586634
48160 586634 587008 587402 587752 587900 588060 588425 588653 588501 588607 589752 591535 592684 592703 592343 592440 593079 594067 595529
48142 595529 597686 600461 603503 606325 608423 609620 610352 611295 612726 614525 616609 618960 621311 623270 624762
48127 624762 626058 627389 628813 630414 632366 634853 637975 641561 645033 647897 650534 654008 658764 664081
48113 664081 669178 674301 680166 686883 694079 701597 709308 716661 723285 729815 737308 745977 755241 764829
48099 764829 775014 785827 796879 808008 819384 830882 842110 853185 864792 877228 889907
48088 889907 902075 913535 924521 935200 945576 955576 965131 974284 983136 991447 998534 1003992 1008362
48075 1008362 1012614 1017091 1021438 1025481 1029559 1033914 1038253 1042140 1045511 1048743 1052438 1057091 1062701 1068766
48061 1068766 1074812 1080747 1086445 1091319 1094760 1096746 1097632 1097538 1096395 1094247 1091015 1086169 1079195 1070239 1059811
48046 1059811 1048177 1035588 1022812 1010625 998874 986677 973456 959197 943989 928058 912156
48035 912156 897015 882368 867249 851321 835187 819372 803842 788649 774241 760830 748097
48024 748097 735838 724326 713788 703974 694503 685224 676113 667216 658756 650850 643164 635386 627989
48011 627989 621866 617155 613084 609007 604899 600823 596795 593394 591615 591629 592342 592616 592376 592154 592151 592171 592021
47994 592021 591515 590489 589224 588405 588312 588347 587672 586065 583969 582116 581234 581590 582529 582859 581922 579920 577213
47977 577213 573964 570644 568077 566468 565050 563164 561159 559707 558786 557915 556972 556140 555383 554536 553685 552987
47961 552987 552411 552077 552461 553701 555005 555406 554984 554784 555666 557754 560889 564966 569672 574401 578699 582588
47945 582588 586376 590344 594709 599683 605461 612116 619494 627238 635118 643319 652193 661605 670789 678953
47931 678953 685855 691688 696683 700993 704739 707933 710429 712069 712792 712577 711392 709196 705835 701045 694832
47916 694832 687785 680683 673835 667063 660161 652997 645361 637286 629410 622413 616186 610208 604667 600377
47902 600377 597511 595359 593574 592703 593063 593980 594746 595631 597332 600009 603519 608053 613752 620144 626602
47887 626602 633099 639988 647419 655396 663957 672736 680849 687802 694073 700141 705474 709270 711891 714574
47873 714574 717873 721122 723417 724366 723879 721885 718489 713944 708366 701725 694044 685350 675601 664979
47859 664979 654073 643402 632985 622694 612745 603508 595174 587887 581739 576198 570151 563239 556715
47846 556715 552211 549977 549000 548394 547776 546677 544770 542750 542003 543134 545521 548359 551445 554846 558497
47831 558497 562312 566161 569691 572676 575465 578459 581282 583253 584663 586674 589788 593231 596133 598549
47817 598549 601016 603779 606909 610696 615528 621653 629210 638140 648031 658591 670232 683718 699249
47804 699249 716467 735236 755637 777217 799128 821054 842985 863893 881785 895596 906057
47793 906057 914143 919670 922195 922298 920932 918079 913142 906284 898382 889885 880647 870858 861287 852548
47779 852548 844662 837402 830593 824042 817644 811543 805912 800753 796213 792788 790721 789387 787757 785237
47765 785237 781581 776394 769491 761609 753893 746578 738904 730535 722301 715229 709408 704225 699249 694443
47751 694443 689822 685459 681706 679020 677543 677130 677731 679492 682459 686377 690859 695663 700799 706554 713464
47736 713464 722071 732464 744014 755785 767332 778981 791230 804015 816800 829228 841278 852758
47724 852758 863020 871442 877965 882900 886318 887881 887197 884179 879044 872116 863649 853875 843097 831576
47710 831576 819214 805650 791037 776430 762918 750443 738198 726199 715577 706954 699393 691704
47698 691704 684201 678255 674454 672189 670970 671135 673050 676438 680915 686576 693614 701790 710741 720512
47684 720512 731326 743056 755217 767436 779669 792052 804664 817311 829465 840588 850641
47673 850641 860019 868883 876860 883514 888746 892444 894188 893763 891689 888646 884474 878365 870063 860303
47659 860303 849893 838910 827140 814821 802427 789985 777205 764324 752324 742081 733502 725753
47647 725753 718270 711376 705821 701902 699165 697103 695886 696094 697785 700247 702921 706112 710384 715481
47633 715481 720410 724616 728594 733237 739054 746278 755285 766476 779824 794895 811275 828908 848027
47620 848027 868875 891304 914533 937407 959032 979029 997142 1012821 1025353 1034168 1038772 1038566
47608 1038566 1033070 1022268 1006635 986930 963987 938485 910708 880810 849548 818392 788578
47597 788578 760316 733336 707904 684742 664074 645370 628073 612088 597534 584534 573370
47586 573370 564349 557303 551617 546872 543028 539853 536674 533047 529344 526336 524370 523180 522239 521020
47572 521020 519112 516480 513638 511409 510408 510658 511511 511967 511319 509609 507305 504663 501628 498298 495034
47557 495034 492027 489195 486597 484518 482960 481466 479647 477520 475118 472238 468913 465706 463113 460970
47543 460970 458869 456877 455345 454215 453011 451504 450019 449062 448887 449324 449834 449872 449403 448940 448891 449084 449123
47526 449123 448909 448576 448239 448112 448493 449201 449445 448795 448022 448311 449840 451768 453498 455198 457091 459017 460866
47509 460866 462727 464324 464943 464383 463524 463463 464358 465485 466153 466209 465838 465299 464886 464871 465403 466416 467569 468366
47491 468366 468643 468931 469994 471908 473933 475422 476432 477226 477691 477721 477808 478695 480573 483135 486321 490453
47475 490453 495564 501072 506303 510979 515009 518213 520650 522983 526052 530000 534043 537238 539328 540792
47461 540792 542157 543407 544104 543979 543236 542247 541104 539735 538394 537685 537918 538715 539587 540812 543327 547687
47445 547687 553517 560168 567500 575691 584587 593835 603661 614995 628661 644764 663041 683460 706109
47432 706109 730671 756314 782071 807187 831211 853985 875475 895413 913087 927679 938748
47421 938748 946311 950493 951315 948867 943548 936079 927218 917314 906067 892868 877592 860999 844256
47408 844256 828060 812328 796651 780902 765414 750721 737152 724644 712984 702197 692528 684051
47396 684051 676632 670374 665736 662896 661298 660243 659755 660384 662325 665272 669183 674576 681783 690317 699352
47381 699352 708544 718134 728387 739233 750343 761340 771897 781760 790664 798275 804326 808729 811351
47368 811351 811709 809247 804115 797355 790014 782143 772899 761526 748095 733358 718107 702693 686998
47355 686998 670876 654577 638673 623540 609147 595477 582881 571672 561470 551373 540945
47344 540945 530821 522169 515644 510966 507372 504205 501093 497875 494658 491883 490065 489341 489491 490477 492711
47329 492711 496458 501177 505828 509859 513535 517245 520948 524522 528228 532357 536614 540320 543141 545143
47315 545143 546125 545480 543041 539740 536933 535126 533692 531861 529628 527493 525551 523262 520252 517131 515192
47300 515192 515184 516501 517716 517865 517183 516756 517681 520470 524867 530016 535051 539788 544816 550765 557606 564881
47284 564881 572408 580363 588752 597302 605992 615213 625115 635227 645106 654997 665342 675872 685856
47271 685856 695264 705036 716034 728180 740835 753572 766256 778706 790555 801094 808942 812253
47259 812253 809789 801794 789588 774478 757388 739285 721397 704808 690065 677203 666021 656360
47247 656360 648298 642014 637393 633932 631208 629223 628014 627255 626660 626604 627828 630544 634303 638745 644007
47232 644007 650265 657426 665439 674524 684784 695900 707535 719752 732783 746568 760828 775439
47220 775439 790396 805396 819718 832640 843879 853548 861672 867899 871867 873848 874669 874648 872877 868041
47206 868041 859953 849832 839018 827904 816290 804272 792368 781012 770331 760377 751372 743771
47194 743771 738098 734485 732280 730489 728811 727982 728915 731833 736471 742708 750569 759862 770367 782309
47180 782309 796152 811979 829423 848181 868163 889096 910350 931324 951723 971413 990272
47169 990272 1008283 1025447 1041431 1055562 1067389 1077091 1085123 1091493 1095572 1096594 1094282 1089007 1081476
47156 1081476 1072339 1062089 1051125 1039656 1027460 1014036 999311 984118 969715 956755 944905
47145 944905 933435 921981 910730 900139 890646 882536 875962 871080 868088 867035 867619 869346 871934
47132 871934 875386 879700 884729 890328 896296 902028 906593 909446 910912 911635 911643 910273 906981 901850 895263
47117 895263 887494 878855 869909 861112 852326 843055 833203 823259 813660 804216 794394 783988 773264 762545
47103 762545 751896 741228 730565 720178 710517 701882 694029 686254 678219 670628 664692 660784 657961
47090 657961 655051 651923 649363 647932 647446 647498 648009 649059 650531 652320 654774 658476 663463 668893 673804
47075 673804 678118 682616 687782 692958 696899 699078 700134 700984 701826 702188 701740 700783 699958 699614 699438 698646
47059 698646 696688 694004 691973 691905 693998 697344 700860 704038 706927 709831 713240 717802 723882 731032 738124
47044 738124 744273 749627 755064 761078 767211 772740 777687 782754 788373 794303 800296 806684 813915 821825
47030 821825 829839 837712 845640 853708 861704 869469 876895 883506 888596 892136 895101 898448 901972 904574
47016 904574 905442 904574 902287 898780 894294 889228 883816 877925 871434 864739 858674 853939 850588 848022 845489
47001 845489 842809 840618 839714 840155 841259 842517 844111 846325 848853 851196 853520 856634 861088 866658 872725
46986 872725 878783 884608 890384 896779 904443 913219 922233 930973 939920 949821 960716 972033 983352
46973 983352 994606 1005747 1016706 1027609 1038532 1049002 1058141 1065501 1071550 1077212 1083051 1088863 1093908
46960 1093908 1097576 1099964 1101680 1102983 1103469 1102851 1101706 1100952 1100848 1101111 1101816 1103411 1105791 1108146 1110040
46945 1110040 1112086 1115239 1119879 1125796 1132534 1139404 1145742 1151555 1157569 1164318 1171595 1179123 1187191 1196075
46931 1196075 1205369 1214552 1223824 1233581 1243295 1251757 1258410 1263675 1267886 1270584 1271095 1269205 1264955 1258278
46917 1258278 1249205 1238138 1225609 1211932 1197314 1182139 1166965 1152314 1138521 1125663 1113648
46906 1113648 1102521 1092689 1084680 1078708 1074715 1072782 1073263 1076531 1082854 1092385 1104935 1119772 1136083
46893 1136083 1153697 1172980 1194002 1216259 1239301 1263095 1287490 1311770 1335083 1356966 1377177
46882 1377177 1395314 1411076 1424664 1436523 1446817 1455488 1462667 1468623 1473382 1476816 1479049 1480450 1481294
46869 1481294 1481883 1482995 1485705 1490550 1497247 1505440 1515328 1527201 1540713 1555143 1570220 1586100 1602496
46856 1602496 1618481 1633603 1648637 1664568 1680876 1695494 1706703 1714644 1720657 1725586 1729228 1731239
46844 1731239 1731816 1731232 1729159 1724998 1718841 1711724 1704812 1698514 1692529 1686566 1680777 1675520 1671053 1667607
46830 1667607 1665562 1665262 1666787 1670127 1675431 1682758 1691664 1701583 1712615 1725408 1740010 1755356 1770279
46817 1770279 1784536 1798300 1811074 1821872 1830367 1837154 1842775 1847100 1849801 1850882 1850430 1848254 1844130
46804 1844130 1838257 1831286 1824012 1817000 1810187 1802915 1794740 1786269 1778715 1772571 1767242 1762153 1757599 1754155
46790 1754155 1751849 1750478 1750269 1751538 1753939 1756694 1759560 1763034 1767628 1773475 1780529 1788610 1797114 1805267
46776 1805267 1812852 1820264 1827637 1834445 1840342 1845998 1852532 1860232 1868380 1876376 1884570 1893767 1904231 1915584
46762 1915584 1927550 1940384 1954448 1969782 1986378 2004622 2024848 2046429 2067908 2088430 2108666
46751 2108666 2129820 2151906 2173620 2193855 2212675 2230463 2246752 2260548 2271593 2280671 2288534 2295032
46739 2295032 2299582 2302112 2303144 2303090 2301886 2299462 2296301 2293296 2291138 2289967 2289611 2289998 2291257 2293529 2296838
46724 2296838 2301148 2306437 2312570 2319158 2325689 2331877 2337774 2343478 2348807 2353305 2356457 2357820 2357073 2354082
46710 2354082 2348752 2340700 2329276 2314281 2296501 2277066 2256260 2233477 2208428 2181779 2154225 2125519
46698 2125519 2094993 2062723 2029521 1995987 1962301 1928966 1897047 1867330 1839712 1813677 1789005
46687 1789005 1765725 1743729 1722838 1703090 1684591 1667131 1650226 1633635 1617672 1602900 1589501
46676 1589501 1577020 1564818 1552832 1541720 1532120 1523945 1516647 1510039 1504524 1500527 1498030 1496703 1496203
46663 1496203 1496382 1497463 1500010 1504410 1510348 1517152 1524554 1532613 1540837 1548000 1553121 1556249 1558077 1559227
46649 1559227 1560142 1561059 1561578 1560640 1557538 1552849 1547991 1544001 1541070 1539029 1537872 1537893 1539690 1543928 1550889
46634 1550889 1560427 1572539 1587570 1605441 1625132 1645530 1666505 1688487 1711184 1733511 1754715
46623 1754715 1774710 1793103 1808706 1820450 1828203 1832248 1832443 1828433 1820456 1809454 1796419 1781859
46611 1781859 1765748 1747813 1728022 1706977 1685646 1664653 1644153 1624469 1606302 1589950 1574788
46600 1574788 1560134 1546352 1534412 1524391 1515150 1505701 1496313 1487951 1481068 1475297 1469938 1464259 1457649
46587 1457649 1450093 1442504 1435998 1430648 1425354 1419118 1412041 1404821 1397802 1391045 1385009 1380405 1377267 1374728
46573 1374728 1372029 1369440 1367942 1368215 1370116 1372904 1375792 1378498 1381418 1385129 1389619 1394203 1398249 1401591
46559 1401591 1404132 1405616 1406272 1407276 1409892 1414277 1419697 1425721 1432559 1440229 1448205 1456199 1464678 1474182
46545 1474182 1484544 1495270 1506374 1518318 1531277 1544960 1559128 1573888 1589415 1605756 1622990
46534 1622990 1641285 1660677 1681035 1702491 1725640 1751052 1778633 1807780 1838182 1870194 1904231
46523 1904231 1940021 1976677 2013438 2050068 2086488 2122274 2156648 2188864 2218529 2245623 2270289
46512 2270289 2292501 2311892 2327995 2340678 2350222 2357016 2361359 2363591 2364138 2363218 2360726 2356594 2351108
46499 2351108 2344728 2337790 2330578 2323412 2316318 2308771 2300185 2290638 2280747 2270796 2260275 2248356 2234534
46486 2234534 2218738 2201043 2181402 2159561 2135172 2108094 2078547 2046829 2012912 1976535 1937702
46475 1937702 1896963 1855211 1813411 1772483 1733127 1695618 1659921 1626126 1594725 1566402 1541659
46464 1541659 1520666 1503399 1489904 1480445 1475304 1474417 1477335 1483636 1493172 1505721 1520603 1537013 1554641
46451 1554641 1573707 1594324 1616068 1638087 1659392 1679097 1696657 1711993 1725302 1736778 1746532
46440 1746532 1754518 1760322 1763327 1763354 1760900 1756372 1749498 1740094 1729127 1718208 1708040 1698058 1687674
46427 1687674 1677183 1667295 1658517 1651312 1646235 1643472 1642697 1643661 1646513 1651366 1658212 1667578 1680579 1697774
46413 1697774 1718454 1741570 1766854 1794449 1824004 1854886 1886999 1920554 1955181 1990029 2024660
46402 2024660 2059127 2093107 2125624 2155792 2183383 2208468 2230925 2250399 2266432 2278503 2286243
46391 2286243 2289622 2288704 2283317 2273339 2259236 2241864 2221788 2199292 2175094 2150505 2126635 2103805
46379 2103805 2081917 2061034 2041421 2023392 2007395 1994005 1983595 1976201 1971882 1971022 1974049 1981096
$$ [...]
##END NTUPLES=NMR SPECTRUM
##END=
