##TITLE=AC1603_NICAH13333_8315939_2GmalF7wNk
##JCAMPDX= 6.0         $$ Bruker NMR JCAMP-DX V2.0
##DATA TYPE= NMR SPECTRUM
##DATA CLASS= NTUPLES
##ORIGIN= BRUKER
##OWNER= Administrator
$$ 1.72 TOPSPIN		Version 2.1
$$ 2013-11-09 19:46:45.297 -0800  Administrator@X
$$ Compression mode = diff/dup
##.OBSERVE FREQUENCY= 400.02188249412
##.OBSERVE NUCLEUS= ^1H
##.ACQUISITION MODE= SIMULTANEOUS (DQD)
##.ACQUISITION SCHEME= undefined
##.AVERAGES= 8
##.DIGITISER RES= 22
##SPECTROMETER/DATA SYSTEM= spect
##.PULSE SEQUENCE= zg30
##.SOLVENT NAME= COFFEE_meoh
##.SHIFT REFERENCE= INTERNAL, COFFEE_meoh, 1, 14.98509
##AUDIT TRAIL= $$ (NUMBER, WHEN, WHO, WHERE, PROCESS, VERSION, WHAT)
$$ ##TITLE= Audit trail, TOPSPIN		Version 2.1
$$ ##JCAMPDX= 5.01
$$ ##ORIGIN= Bruker BioSpin GmbH
$$ ##OWNER= Administrator
$$ $$ E:\/data/COFFEE/nmr/AC1603_NICAH13333_8315939_2GmalF7wNk/10/pdata/1/auditp.txt
$$ ##AUDIT TRAIL=  $$ (NUMBER, WHEN, WHO, WHERE, PROCESS, VERSION, WHAT)
(   1,<2013-11-09 19:46:38.390 -0800>,<Administrator>,<X>,<go>,<TOPSPIN 2.1>,
      <created by zg
	started at 2013-11-09 19:45:31.718 -0800,
	POWCHK enabled, PULCHK disabled,
       configuration hash MD5:
       C8 4E 4E 5D D3 5C D8 9E 9F 52 82 E0 59 8A DE 15
       data hash MD5: 64K
       A1 46 C6 D2 A8 15 B0 97 EE E2 20 DB A2 58 85 F2>)
(   2,<2013-11-09 19:46:41.312 -0800>,<Administrator>,<X>,<proc1d>,<TOPSPIN 2.1>,
      <Start of raw data processing
       efp LB = 0 FT_mod = 6 PKNL = 1 PHC0 = 0 PHC1 = 0 SI = 32K 
       data hash MD5: 32K
       ED 27 7A 47 AC ED D5 C3 05 53 41 EF 57 3D 2D 80>)
(   3,<2013-11-09 19:46:41.672 -0800>,<Administrator>,<X>,<proc1d>,<TOPSPIN 2.1>,
      <pk PHC0 = 92.75757 PHC1 = 0 
       data hash MD5: 32K
       14 9C 94 02 C1 21 72 C2 22 72 09 FE 84 E0 50 8C>)
(   4,<2013-11-09 19:46:41.781 -0800>,<Administrator>,<X>,<proc1d>,<TOPSPIN 2.1>,
      <abs ABSG = 1 
       data hash MD5: 32K
       11 E3 CC DF DD 0B 45 FA 0A DD 9C EA 08 9A 16 BD>)
(   5,<2013-11-09 19:46:41.859 -0800>,<Administrator>,<X>,<proc1d>,<TOPSPIN 2.1>,
      <abs ABSG = 2 
       data hash MD5: 32K
       17 ED EC A5 04 44 60 E3 DD E9 1F 5F 6E 51 54 FC>)
(   6,<2013-11-09 19:46:41.937 -0800>,<Administrator>,<X>,<proc1d>,<TOPSPIN 2.1>,
      <abs ABSG = 3 
       data hash MD5: 32K
       C8 04 C2 44 13 4D A1 2A CC 11 2D 44 F5 8A D0 E6>)
(   7,<2013-11-09 19:46:42.000 -0800>,<Administrator>,<X>,<proc1d>,<TOPSPIN 2.1>,
      <abs ABSG = 4 
       data hash MD5: 32K
       2E 28 47 27 EB 4C 8D 6F 2F BF 52 28 3C BE 8F 20>)
(   8,<2013-11-09 19:46:42.078 -0800>,<Administrator>,<X>,<proc1d>,<TOPSPIN 2.1>,
      <abs ABSG = 5 
       data hash MD5: 32K
       7F 16 C0 9C B7 C0 A7 7B E1 56 7B 0B 77 9A DF A2>)
$$ ##END=
$$ 
$$ $$ hash MD5
$$ $$ FB 27 28 EB 74 5E C8 18 A8 73 63 AF 94 4F D3 96
##$RELAX= 
##$RELAX= 
##$RELAX= 
##$RELAX= 
##$RELAX= 
##$RELAX= 
##$RELAX= 
$$ Bruker specific parameters
$$ --------------------------
##$DU= <E:\>
##$EXPNO= 10
##$NAME= <AC1603_NICAH13333_8315939_2GmalF7wNk>
$$ [...]
##$TP= (0..7)
150 150 150 150 150 150 150 150
##$TP07= 0
##$TPNAME0= <>
##$TPNAME1= <>
##$TPNAME2= <>
##$TPNAME3= <>
##$TPNAME4= <>
##$TPNAME5= <>
##$TPNAME6= <>
##$TPNAME7= <>
##$TPOAL= (0..7)
0.5 0.5 0.5 0.5 0.5 0.5 0.5 0.5
##$TPOFFS= (0..7)
0 0 0 0 0 0 0 0
##$TUNHIN= 0
##$TUNHOUT= 0
##$TUNXOUT= 0
##$USERA1= <user>
##$USERA2= <user>
##$USERA3= <user>
##$USERA4= <user>
##$USERA5= <user>
##$V9= 5
##$VALIST= <valist>
##$VCLIST= <CCCCCCCCCCCCCCC>
##$VD= 0
##$VDLIST= <DDDDDDDDDDDDDDD>
##$VPLIST= <PPPPPPPPPPPPPPP>
##$VTLIST= <TTTTTTTTTTTTTTT>
##$WBST= 1024
##$WBSW= 4
##$XGAIN= (0..3)
0 0 0 0
##$XL= 0
##$YL= 0
##$YMAX_a= 640026
##$YMIN_a= -544952
##$ZGOPTNS= <>
##$ZL1= 120
##$ZL2= 120
##$ZL3= 120
##$ZL4= 120
##$ABSF1= 14.98509
##$ABSF2= -5.573092
##$ABSG= 5
##$ABSL= 3
##$ALPHA= 0
##$AQORDER= 0
##$ASSFAC= 0
##$ASSFACI= 0
##$ASSFACX= 0
##$ASSWID= 0
##$AUNMP= <proc_prof1d_extract_pilot.lims>
##$AXLEFT= 0
##$AXNAME= <>
##$AXNUC= <1H>
##$AXRIGHT= 0
##$AXTYPE= 0
##$AXUNIT= <>
##$AZFE= 0.1
##$AZFW= 0.1
##$BCFW= 0
##$BC_mod= 0
##$BYTORDP= 0
##$COROFFS= 0
##$CY= 15
##$DATMOD= 1
##$DC= 0
##$DFILT= <>
##$DTYPP= 0
##$F1P= 0
##$F2P= 0
##$FCOR= 0.5
##$FTSIZE= 32768
##$FT_mod= 6
##$GAMMA= 0
##$GB= 0
##$INTBC= 1
##$INTSCL= 1
##$ISEN= 128
##$LB= 0
##$LEV0= 0
##$LPBIN= 0
##$MAXI= 10000
##$MC2= 0
##$MEAN= 0
##$ME_mod= 0
##$MI= 0
##$NCOEF= 0
##$NC_proc= -8
##$NLEV= 6
##$NOISF1= 0
##$NOISF2= 0
##$NSP= 0
##$NTH_PI= 0
##$NZP= 0
##$OFFSET= 14.98509
##$PC= 1
##$PHC0= 92.75757
##$PHC1= 0
##$PH_mod= 1
##$PKNL= yes
##$PPARMOD= 0
##$PPDIAG= 0
##$PPIPTYP= 0
##$PPMPNUM= 2147483647
##$PPRESOL= 1
##$PSCAL= 4
##$PSIGN= 0
##$PYNMP= <proc.py>
##$REVERSE= no
##$SF= 400.02
##$SI= 32768
##$SIGF1= 0
##$SIGF2= 0
##$SINO= 400
##$SIOLD= 32768
##$SPECTYP= <>
##$SREGLST= <1H.CDCl3>
##$SSB= 0
##$STSI= 32768
##$STSR= 0
##$SW_p= 8223.68421052631
##$SYMM= 0
##$S_DEV= 0
##$TDeff= 65536
##$TDoff= 0
##$TI= <>
##$TILT= no
##$TM1= 0
##$TM2= 0
##$TOPLEV= 0
##$USERP1= <user>
##$USERP2= <user>
##$USERP3= <user>
##$USERP4= <user>
##$USERP5= <user>
##$WDW= 1
##$XDIM= 32768
##$YMAX_p= 465946185
##$YMIN_p= -686725
##$CURPLOT= <Network HP LaserJet P1505>
##$CURPRIN= <$Network HP LaserJet P1505>
##$DFORMAT= <normdp>
##$LAYOUT= <+/1D_H.xwp>
##$LFORMAT= <normlp>
##$PFORMAT= <normpl>
##$SURQMSG= 1
$$ End of Bruker specific parameters
$$ ---------------------------------
##NTUPLES= NMR SPECTRUM
##VAR_NAME=  FREQUENCY,     SPECTRUM/REAL,   SPECTRUM/IMAG
##SYMBOL=    X,             R,               I
##VAR_TYPE=  INDEPENDENT,   DEPENDENT,       DEPENDENT
##VAR_FORM=  AFFN,          ASDF,            ASDF
##VAR_DIM=   32768,         32768,           32768
##UNITS=     HZ,            ARBITRARY UNITS, ARBITRARY UNITS
##FACTOR=    0.250966925370066, 1,           1
##FIRST=     8223.43324360094, -75619,       -65118
##LAST=      0,             -55258,          -78848
##MIN=       0,             -686725,         0
##MAX=       8223.43324360094, 465946185,    0
$$ Real data points
##PAGE= N=1
##DATA TABLE= (X++(R..R)), XYDATA
$$ [...]
19544a66550Q1347K9079j24263A3620d3086C8366b27043H7565a35553j66780j74937
19533d77270C27510M5836a93550e4636j9060j54068A44514k8689b25936B4789
19522f86725D601b24463b7790A9588L1836J87565B7019b8666A49844E83J63871
19511A64454h5807A97608G1130J05340a29633M8292J5582L1300m06479A47742
19500e8712P363r5436B01230k0503c863m040k4915A75130i745p013B4615J12194
19488A36809e1509j00932R403e6099j37032j18412h4411j8424A36660a31342H5714
19476A0706a52124f424A74237A4322c49327a51312H5432a69159A83387a24574
19465f6417j49853p7603C4021g3722B85931b79494k1701I7780K6188b5950A93657
$$ y = [-166550, -85203, -56124, -180387, 13620, -43086, 38366, -227043, 87565, -135553, -302333, -477270, 327510, 373346, -193550, -54636, -73696, -227764, 144514, 115825, -225936, 24789, -686725, 4601, -224463, -27790, 19588, 51424, 238989, 27019, -28666, 149844, 583, 164454, -85807, 197608, 71130, 176470, -129633, -81341, -65759, -34459, -440938, 147742, -58712, -51349, -146785, 201230, 180727, -3863, -7903, -32818, 175130, -9745, -16758, 24615, 136809, -51509, -152441, -143038, -56099, -193131, -311543, -84411, -102835, 136660, -131342, 85714, 10706, -152124, -6424, 174237, 14322, -349327, -151312, 85432, -169159, 183387, -124574, -66417, -216270, -293873, 34021, -73722, 285931, -279494, -301195, 97780, 123968, -25950, 193657]
19453b53084E2728b03092A39601g3375D4360b54065b362B54152f5082A52317a78522
19441c40273A50593a13679H5555a04154k873j67468D3744c9545j60215A27381
19430a58872j04591i7736A3918a7012A16752J21787c15114N6106C03548b78208
19419c27499C3340c06153i3062A91383b5236l4943F5787L185a8146m06947Q0468
19408c44625f9813A37458a20477C3465f2073b3657A94974B6934J32793a26858
19397b4652l8489j03391J6945j21637A64659b72251C8858d54467d1186k67638
19387c08824a39185q5870g1024k93098a18327D9007F350K4353d60977i6615B17498
19375F5023f2811E3716e9338C21988a18037p2165b3972B22297b34096E1451e5299
$$ y = [-253084, 52728, -203092, 139601, -73375, 44360, -254065, -2362, 254152, -65082, 152317, -178522, -340273, 150593, -113679, 85555, -104154, -107027, -274495, 43744, -39545, -199760, 127381, -158872, -263463, -97736, 13918, -17012, 116752, 238539, -315114, -259008, 303548, -278208, -327499, 33340, -306153, -93062, 191383, -25236, -60179, 65787, 68972, -18146, -425093, -344625, -69813, 137458, -120477, 33465, -62073, -23657, 194974, 26934, 159727, -126858, -24652, -63141, -166532, -149587, -271224, 164659, -272251, 38858, -454467, -41186, -308824, -139185, -225055, -71024, -364122, -118327, 49007, 6350, 30703, -460977, -96615, 217498, 65023, -62811, 53716, -59338, 321988, -118037, -190202, -23972, 222297, -234096, 51451, -55299]
19363A59700b29554o311Q6651F864a9449A86446g8596j44518A59681c24453b5752
19351a57553l1279A23542b58724A4601b32387j39682a58814m5003B1688c37878
19340C8940h0008j20902b9630d193B31872c35933A70614g4190D13017a18997j9110
19329a38107d4002l14397J24730C9688L47692A80739a17256j0877N1528n616n626
19318h7847j12746G3823J26861j3205b08539H5059b97101A54414C4144a00137
19307a92269B40761J06198b01905l3527I4432K45221b7135A34857b70532A73068
19296E16840k47042a45329a9636f181m7814r1519j05696L8103p8896A41224j6257
19285A24967B7077J05582i6636j34429F5141a14937l397B8649j674O743h9935
$$ y = [159700, -229554, -235865, -149214, 6864, -19449, 186446, -78596, -223114, 159681, -324453, -25752, -157553, -188832, 123542, -258724, 14601, -232387, -372069, -158814, -203817, 21688, -337878, 38940, -80008, -200910, -29630, -4193, 231872, -335933, 170614, -74190, 413017, -118997, -138107, -44002, -358399, -233669, 39688, 387380, 180739, -117256, -128133, -76605, -82221, -87847, -200593, 73823, 200684, 187479, -208539, 85059, -297101, 154414, 34144, -100137, -192269, 240761, 346959, -201905, -235432, 94432, 339653, -27135, 134857, -270532, 173068, 516840, 269798, -145329, -19636, -6181, -53995, -145514, -251210, -213107, -292003, 141224, 124967, 27077, 132659, -96636, -231065, 65141, -114937, -118334, 28649, 26975, 33718, -89935]
19273e5958J0996l62618b4934j87729J06275G1047i6918G8793c36365D0406d1813
19261c17530i2111k42411B0157M9053a25203n8091F2823H510a88520D7977a32132
19249B7292a75359L410B7932a0360A34903a20450K9847e386B90902a0520B42908
19237E7999a01251K1723j53760c1715l347k26361l62693C6216c07196h3329j74646
19226b57975c4323l60012a16081G3614a43226H6324a04745B64477b46743a12736
19215a15043o7410m8844f401A17809c9443k11009d8768A84798c4354j97597d1813
19203D1790a75488c1834n13986g2053j5258A9292b47540Q0471J3922L569B02390
19191B27984A4155b63821B5344a5711B48657a49449B7319f2387k82791R4899j4389
$$ y = [-55958, -44962, -407580, -24934, -212663, -106388, 71047, -96918, 78793, -336365, 40406, -41813, -317530, -92111, -334522, 20157, 69210, -125203, -183294, 62823, 8510, -188520, 47977, -132132, 27292, -175359, -171949, 27932, -10360, 134903, -120450, -90603, -5386, 290902, -10520, 242908, 57999, -101251, -79528, -233288, -31715, -35062, -261423, -624116, 36216, -307196, -83329, -257975, -34323, -394335, -116081, 73614, -143226, 86324, -104745, 264477, -246743, -112736, -115043, -182453, -231297, -6401, 117809, -39443, -250452, -48768, 184798, -34354, -231951, -41813, 41790, -175488, -31834, -545820, -72053, -87311, 19292, -247540, -167069, -153147, -149578, 202390, 227984, 14155, -263821, 25344, -15711, 248657, -149449, 27319, -62387, -345178, -250279, -264668]
19180b64668a03956a0984A13259f7882o4889A2277b62365k30714A28664a04624
19169d38095J14868e0937k3735A23528a6056m0123j4527A01789L5428G27c9895
19157G0416a46386e0915k1564B02214q1114c53955B28005b27757p0141a31188
19146b6061B01944E5318b43297P1674l6487e7488A17578g9558K987A52407e4080
19134d29684i8683b8840b25j05543B31396c76256C18117q8585a3508I8397h9712
19122H46J49105l6956H749c28233F5832J11665D1892c8089q0561A06193c09969
19110g5036j80740c4044k32791c2284k29913B01136a15056B65404a15958E3732
19099b73273a3660B40052b39316a02248A30449b40358b1467E323c25033K3377
$$ y = [-264668, -103956, -10984, 113259, -67882, -132771, 12277, -262365, -493079, 128664, -104624, -438095, -323227, -50937, -74672, 123528, -16056, -56179, -70706, 101789, 137217, 727, -39895, 70416, -146386, -50915, -72479, 202214, 121100, -353955, 228005, -227757, -297898, -131188, -26061, 201944, 55318, -243297, -171623, -208110, -57488, 117578, -79558, -76571, 152407, -54080, -429684, -98683, -28840, -225, -105768, 231396, -376256, 318117, 229532, -13508, 98397, -89712, 846, 149951, 112995, 8749, -328233, 65832, 177497, 41892, -38089, -118650, 106193, -309969, -75036, -255776, -34044, -266835, -32284, -262197, 201136, -115056, 265404, -115958, 53732, -273273, -13660, 240052, -239316, -102248, 130449, -240358, -21467, 5323, -325033, -301656]
19089c01656F3408O5117a89064Q244B54904p1840B7146J19855K6874F6943a55580
19077A09596J06207i389C32044I3307N397a28041m9119O5409l13902d3693C4363
19065b64564A35589a22046A75633p2010a78248d5681p2012E0656a45962o0995
19055b06957g9057b4967a80E5026J24789e63798A37293a58896a3243k87373A3822
19043c78074f352j30146p4653A2160c3725A97523a60289e9623H1586b6058A8566
19031C7811g8827G026b00665B0925J87979b40002H8748e3347d018A03446a81476
19019a49646b3559A38857B0037J26375e6271l17643B08517b31124q306F3993L51842
19008D15835H6340g4421j71071C59251b70215P9748B6431b96451d5890J1662p6282
$$ y = [-301656, 63408, 128525, -189064, -180820, 254904, 183064, 27146, 147001, 173875, 66943, -155580, 109596, 215803, -9389, 332044, 93307, 98704, -128041, -177160, -111751, -425653, -43693, 34363, -264564, 135589, -122046, 175633, 103623, -178248, -45681, -117693, 50656, -145962, -206957, -79057, -24967, -180, 55026, 179815, -563798, 137293, -158896, -13243, -300616, 13822, -378074, -6352, -136498, -211151, 12160, -33725, 197523, -160289, -59623, 81586, -26058, 18566, 37811, -78827, 7026, -200665, 20925, 208904, -240002, 88748, -53347, -4018, 103446, -181476, -149646, -23559, 138857, 20037, 146412, -56271, -373914, 208517, -231124, -239430, 63993, 415835, 86340, -74421, -245492, 359251, -270215, -190467, 26431, -296451, -45890, -34228, -110510]
18997a10510j91803a1579k28627J16978B92433A43993e5708i278E7106J73514
18987B30620b66725H5883k6138a8312m202j35909B84249A05475c44744c3385A20375
18975b34433B91616g179A16064O4022J02957j19071B8210P5663C6838c43342c3128
18963A92858I4866J3392h4285D3272M6330P6500a45912l4136b0359j70415l868
18952a94642L2234Q1003o3467E8815b71533j81765K24360a14147c263A10215a00554
18940H3043j4086a42350j81684a44034K919q4745A0913b6445l17691B212a07934
18928H3879c02232A17655b77027a27564j78139a42740f55m66242i6816j18268
18918b15084P9313A94554a22532B1058a45971j92861a39345N6593A60776j1187
$$ y = [-110510, -302313, -11579, -240206, -123228, 292433, 143993, -55708, -9278, 57106, 230620, -266725, 85883, 59745, -18312, -22514, -158423, 284249, 105475, -344744, -33385, 120375, -234433, 291616, -7179, 116064, 180086, 283043, 163972, 28210, 103873, 36838, -343342, -33128, 192858, 94866, 108258, -84285, 43272, 89602, 166102, -145912, -180048, -20359, -190774, -194642, -162408, -81405, -144872, 58815, -271533, -453298, -228938, -114147, -3263, 110215, -100554, 83043, 68957, -142350, -324034, -144034, -141115, -225860, 10913, -26445, -344136, 2212, -107934, 83879, -302232, 117655, -277027, -127564, -305703, -142740, -655, -466897, -96816, -215084, -135771, 194554, -122532, 21058, -145971, -338832, -139345, -82752, 160776, 149589]
18908A49589F7507i0988r1847N1530K314A21755k7341j7384a3561k02033f8779
18896a3158A26190J9219b49938A08530O2694o0682N1131b21265E240a04081L3501
18885g0580N422r407j74829O7458l4856f2642J3298R580A12488J69996H6569C2071
18872a75806C00342a4103B7263b21492G8011b74252R9457B56066a09805A62001
18861b83133o197q0420J21984b215H2010K76687a57757p4437F1454K6038Di87
18848a22065A57756g4755j1423I0387a00038j82675P0598j41471J34701A9236
18837d03350R2784A53454R0987f07144a65437j08837R8250A63591a3225j39309
18827a52534C08515A13579e193D6034d9731J2999B03061G0485a25393D8700K1563
$$ y = [149589, 67507, -90988, -182835, -131305, -128991, 121755, 94414, 77030, -13561, -215594, -68779, -13158, 126190, 145409, -249938, 108530, 171224, 110542, 161673, -221265, 5240, -104081, -70580, -65158, -74565, -249394, -181936, -216792, -62642, -49344, -39764, 112488, 282484, 86569, 32071, -175806, 300342, -14103, 27263, -221492, 78011, -274252, -174795, 256066, -109805, 162001, -283133, -289330, -369750, -247766, -2215, 82010, 358697, -157757, -232194, 61454, 87492, 4, -987, -122065, 157756, -74755, -86178, 90387, -100038, -282713, -212115, -353586, -218885, 19236, -403350, -310566, 153454, 244441, -607144, -165437, -274274, -176024, 163591, -13225, -152534, 308515, 113579, -5193, 46034, -49731, -36732, 203061, 70485, -125393, 48700, 70263]
18816G0263b6790k58511c2710B58827m4463n9626d1072C41695A35826Q9566k4828
18805B00564J40997A6366J87431l350C3440K20771b75630I2627a8172l32829d9209
18793A82342b06348H5326a73150p33O0169j84618a28424I6293e7978k66741G580
18781h4823G3629L7195C1425k520b68282A74028p8382b37700I9246e8549j98010
18770b56559a9575j30936N9637k10920A75876q7887b36540c5711j96876B01841
18759d33494B0691c05512J16128I580R5793e2187A78319D8152a97750I1611f4596
18747a29702A24300a79543n4689E3736g4381j33413e5247k32724a40686j13948
18737b54634A14770e3426I2953a44630D18571f3930K3723m6571j29695C69170
$$ y = [70263, -26790, -285301, -32710, 258827, 214364, 154738, -41072, 341695, 135826, 225392, 200564, 341561, 16366, 203797, 200447, 33440, 254211, -275630, 92627, -18172, -351001, -49209, 182342, -206348, 85326, -173150, -173883, -113714, -298332, -128424, 96293, -57978, -324719, 7580, -84823, 73629, 110824, 31425, 28905, -268282, 174028, 95646, -237700, 99246, -58549, -256559, -19575, -150511, -90874, -301794, 175876, 87989, -236540, -35711, -232587, 201841, -433494, 20691, -305512, -189384, 9580, 105373, -52187, 178319, 48152, -197750, 91611, -64596, -129702, 124300, -179543, -234232, 53736, -74381, -207794, -55247, -287971, -140686, -254634, 114770, -53426, 92953, -144630, 418571, -63930, -40207, -86778, -216473, 369170]
18726b6993l0818B09493b40289A84548N2624e4684a0914r6840j54705D4853b14930
18714a09268o5927d5795D5134i5881I4682C6013a16395j80818R3891k9182B1530
18702C0697a9565B95874I7353b89974A25196b62863I3874b47454N133B12705R214
18691B21919c18980h7199j01844A35010n3324C1258b09077C7700d49252G8392
18680B99613F8578b62800C139a57587M9846J3446j24201m0174M2055B2011a68317
18668a19338k91247e6341k55516C31153d80068h233l8556D0705b04170b8173A11099
18656G7408b9065C8497J41811a4976D73758A05363D994a94819G8889A6735c71051
18644C49839h785l1028I4357a21681m3615e7222k1766G452a46070A30347a53984
$$ y = [-26993, -57811, 209493, -240289, 184548, 237172, -54684, -10914, -107754, -262459, 44853, -214930, -109268, -175195, -45795, 45134, -95881, 94682, 36013, -116395, -297213, -203322, -232504, 21530, 30697, -19565, 295874, 97353, -289974, 125196, -262863, 93874, -247454, -242321, 212705, 221919, -318980, -87199, -189043, 135010, 81686, 31258, -209077, 37700, -449252, 78392, 299613, 68578, -262800, 3139, -157587, -107741, -94295, -218496, -258670, -216615, 22011, -168317, -119338, -410585, -56341, -311857, 331153, -480068, -8233, -46789, 40705, -204170, -28173, 111099, 77408, -29065, 38497, 180308, -14976, 473758, 105363, 4994, -194819, 78889, 16735, -371051, 349839, -8785, -39813, 94357, -121681, -165296, -57222, -78988, 7452, -146070, 130347, -153984]
18632a11298E9045h8915L9011D8735J03027c7470r8928j20353g650j22765M2467
18621h7948C2151a07955N0405D3518a94142A52599c03570B86717c03672i1183
18610c05456C54b85888A93917b78581Q0186Q8900l9472A69132p3995K78772a33043
18598b00794c713B27909a91909b6529A40610a97703H3581a38413I3417a70393
18587A13756c13673M9199A7816b44806c2534k77322g4848E8932i8132p9133H4181
18575g3240r4443g2456r6026p3733A78249d0219H6163j180c6216l97177B1476
18563A99219e1775A78708a76201d0462l1772C05688D7516a85253M4662A06602
18552c1843k5373Q633A67376f13105C4460a93610g8541n9159k62815f6076G6830
$$ y = [-111298, 59045, -88915, -49904, 48735, 151762, -37470, -136398, -256751, -7650, -130415, -87948, 32151, -107955, -57550, 43518, -194142, 152599, -303570, 286717, -303672, -91183, -305456, 354, -285888, 193917, -278581, -198395, -109495, -148967, 169132, 95137, 373909, -133043, -200794, -3713, 227909, -191909, -26529, 140610, -197703, 83581, -138413, 93417, -170393, 113756, -313673, -264474, 17816, -244806, -32534, -309856, -74848, 58932, -98132, -177265, 84181, -73240, -167683, -72456, -168482, -242215, 178249, -40219, 86163, 84983, -36216, -433393, 21476, 199219, -51775, 178708, -176201, -40462, -72234, 305688, 47516, -185253, -140591, 106602, -31843, -57216, -48583, 167376, -613105, 34460, -193610, -78541, -137700, -400515, -66076, 76830]
18540F9047g4088o2651A38079a18400j06300A60077C9196L99767G988h6266k5474
18529a11740b615n2068C9297a16389B59211F1413A4456K97676A7281b76627J04533
18518a72094H0210a18028K5296D6200b82092K2362i2875A72070e17298J53067
18508c64231A5811b70449l992B7095b36698j27012B13947c17896D2922N2384J51630
18497B46936N0773e59928d9830k81199A33964f9850B4361b25534m4198G5433A1354
18485b19406F2868d62578a49657J9758F4431a89172G8940N8693g1051o5671f7390
18473B4799b4871j84947B88285i4023j13339j56312A47631L33040c27777D0479
18462f1603I2594b84613B11486o6405h7961j85352A2469c9893B18292g2595p7923
$$ y = [69047, -74088, -136739, 138079, -118400, -224700, 160077, 39196, 438963, 7988, -86266, -111740, -2615, -54683, 39297, -116389, 259211, 61413, 14456, 312132, 17281, -276627, -172094, 80210, -118028, -92732, 46200, -282092, -259730, -92875, 172070, -517298, -364231, 15811, -270449, -274441, 27095, -236698, -363710, 213947, -317896, 42922, 95306, 246936, 297709, -559928, -49830, -331029, 133964, -69850, 24361, -225534, -269732, 75433, 11354, -219406, 62868, -462578, -149657, -129899, 64431, -189172, 78940, 137633, -71051, -136722, -67390, 24799, -24871, -209818, 288285, -94023, -207362, -363674, 147631, 480671, -327777, 40479, -61603, 92594, -284613, 211486, 145081, -87961, -273313, 12469, -39893, 218292, -72595, -150518]
18451a50518j8771j03826H299J16720J02454c78271d6183k06446I1142a28756
18440f7080j39723j3953n9526J02982i03p5777G9406c6020D2282J4729e010k26072
18428b31082D5065b08391O1485J2520l9673k8305L4448q1464D5780j8291b2602
18416a87089f0647C11550f4125J9230m84405g4574B02488F3533e8645B02904i0168
18404B96142A47553b0178h273k60966e1343j6826k34598q411f4330r1450A31835
18392h9719A39715e6649f834B2760b40095J00723r0384b4700A44151a32906N9911
18381g2995P977D4882e2651l04875I4961a00421K7973o6901A50137c0301j35608
18370a65909J5538g1402B03411d95363b340I9138l6889a40896l1660B25147B3309
$$ y = [-150518, -169289, -273115, 8299, 125019, 227473, -378271, -46183, -252629, 91142, -128756, -67080, -206803, -220756, -280282, -177300, -903, -76680, 79406, -36020, 42282, 57011, -5010, -231082, 45065, -208391, -146906, -134386, -174059, -202364, -167916, -249380, 45780, 27489, -22602, -187089, -60647, 311550, -64125, -44895, -529300, -74574, 202488, 63533, -58645, 202904, -90168, 296142, 147553, -20178, -8273, -269239, -51343, -68169, -302767, -311178, -64330, -155780, 131835, -89719, 139715, -56649, -6834, 22760, -240095, -139372, -229756, -24700, 144151, -132906, -72995, -65018, 44882, -52651, -357526, 94961, -100421, -72448, -139349, 150137, -30301, -165909, -150371, -71402, 203411, -495363, -2340, 99138, 62249, -140896, -172556, 225147, 23309]
18358A17979m683a64660O0514A60198n2607c0980G7384i0367A73731C0191a72767
18346d5207A55903h1460B31565A7691f0353A52173l8266m0968a77620Q5321C07495
18334A27384J7099G0433b42807d8919q8577f4079k46283A30557a70194Q0541G4223
18322b29703D3711a89223H299b7666n2976A85062c42526A52259D286N0336M4179
18311I8801B7868a5625j04964n9844A17628A7473b4217j86372e3750J8312o9499
18300a04937j22608k8680A47616J07622C1603M9432a58920o3611c531j25718A38270
18288A91949a22406A81887K2883a51549C49713H2347L8973c024k97982J48031
18278a52975B6697b5653j92727b322k60504C5232j4031b47101C3207b65739A2034
$$ y = [117979, 113296, -164660, -104146, 160198, 107591, -30980, 77384, -90367, 173731, 30191, -172767, -45207, 155903, -81460, 231565, 17691, -60353, 152173, 113907, 72939, -177620, -92299, 307495, 127384, 144483, 70433, -242807, -48919, -137496, -64079, -310362, 130557, -170194, -89653, 74223, -229703, 43711, -189223, 8299, -27666, -80642, 185062, -342526, 152259, 4286, 54622, 98801, 27868, -15625, -120589, -180433, 117628, 17473, -24217, -210589, -53750, -35438, -104937, -227545, -256225, 147616, 255238, 31603, 81035, -158920, -222531, -3531, -129249, 138270, 191949, -122406, 181887, 204770, -151549, 349713, 82347, 121320, -3024, -301006, -152975, 26697, -25653, -218380, -2322, -262826, 35232, 21201, -247101, 33207, -265739, 12034]
18266d5540l26314B9343J21102A2038b7437k10587j19723e0188k51035a14573
18255A90155B5847I725a1424j37485r8966a08453j93620E7002e06655A70313b79705
18243A63769d68385B66475c86014a79012H637e8303j07002a7827j5035b874k1915
18232b4789q6086C5783a94669A29244a93270j5279H8083E196b5304C4765J81110
18221B15875r3139F955i7135d3450B42493a18428C3412b29917Q2817A93897a94873
18209B01162i885F134b78356g0161a0798I0003a34532e3170B1277J70064I3260
18197a17887f454A45302j6873o1320b0684k38589A02388J29700a75579B48264
18186i2444k238H3102C7976e4664A02629m9416b54445q8969O81M9886c7285n41538
$$ y = [-45540, -371854, 29343, 150445, 12038, -27437, -238024, -357747, -50188, -301223, -114573, 190155, 25847, 9725, -11424, -148909, -247875, -108453, -302073, 57002, -506655, 170313, -279705, 163769, -468385, 266475, -386014, -179012, 8637, -58303, -165305, -17827, -32862, -2874, -24789, -110875, 35783, -194669, 129244, -193270, -208549, 88083, 5196, -25304, 34765, 215875, 122736, 6955, -97135, -43450, 242493, -118428, 33412, -229917, -147100, 193897, -194873, 201162, -9885, 6134, -278356, -70161, -10798, 90003, -134532, -53170, 21277, 191341, 93260, -117887, -6454, 145302, 128429, 67109, -20684, -259273, 102388, 232088, -175579, 248264, -92444, -94682, 83102, 37976, -54664, 102629, 53213, -254445, -343414, -342733, -292847, -37285, -578823]
18174e78823a68935F9586J5336G13b40477B87661A5635b54155M7373j18418C981
18162A85649a77645O5530C8060a05171r5125l9534J5823i2219K8176q464m23j45468
18150b18398O6623A23780a09964B2918i4181I3976N0971b00545h7358m2983K2214
18139a08127A12923E1516a878A91112E3979a41852B26414f2220B37699a65317
18128C794J82905F1271L54207b67045a13248m7530C5369L97a36644M8494K6574
18117f1576q4502e8401j8208B89111j20106h5459b8254E9182K8352r837a89634
18105A55422a14139D1694b10367f5730A2579a01296B5805a69361E6134a17313
18094H2555c0086j95000i1772k1096E8810a28493j66245n4435H0612a46479a3491
$$ y = [-578823, -168935, 69586, 84922, 713, -240477, 287661, 15635, -254155, -206782, -325200, 3981, 185649, -177645, -112115, 38060, -105171, -200296, -239830, -224007, -92219, -64043, -72507, -72930, -218398, -151775, 123780, -109964, 22918, -94181, 93976, 144947, -200545, -87358, -130341, -108127, 112923, 51516, -1878, 191112, 53979, -141852, 226414, -62220, 237699, -165317, 3794, 186699, 61271, 415478, -267045, -113248, -160778, 35369, 35766, -136644, -88150, -61576, -146078, -58401, -76609, 289111, 169005, -85459, -28254, 59182, 87534, 77697, -189634, 155422, -114139, 41694, -210367, -65730, 12579, -101296, 25805, -169361, 56134, -117313, 82555, -30086, -225086, -91772, -112868, 58810, -128493, -294738, -349173, 80612, -146479, -13491]
18082A01885b45126f4242p4899B13544b74351A57839b59862I8501P3092c07775
18071a31915M3616F4517R2272C6605J96372i7230l1889F2740P5560D7018a8351
18059B4260L7667L70709A03310J24015b03414P173C3639c7287m0830j18432r99
18048a97548l811Q4009j36846r5077A12408K8418b25562I559a60966d9412A54601
18036A15677C8178a15790j53002g1669G0530g1873j21922m429e425j69963N6274
18025a19114M886e5446j24159A53211o9227a53040j20876i136r6711j02998h8772
18013d5523j51179A18012a26397I677b18493O103F6269K99208j59615A7373e29196
18001A47708c17160j03667a51909K3224L2140C4509a63098j89352B88018b07167
$$ y = [101885, -245126, -64242, -139141, 213544, -274351, 157839, -259862, 98501, 171593, -307775, -131915, -88299, 64517, 156789, 36605, 232977, -97230, -129119, 62740, 138300, 47018, -18351, 24260, 61927, 432636, 103310, 227325, -203414, -196241, 33639, -37287, -78117, -196549, -197548, -201359, -117350, -254196, -349273, 112408, 140826, -225562, 9559, -160966, -49412, 154601, 115677, 38178, -115790, -268792, -71669, 70530, -71873, -193795, -198224, -5425, -175388, -119114, -114228, -55446, -179605, 153211, 83984, -153040, -273916, -9136, -105847, -208845, -88772, -45523, -196702, 118012, -126397, 9677, -218493, -212390, 66269, 365477, 205862, 17373, -529196, 147708, -317160, -420827, -151909, -128685, -96545, 34509, -163098, -352450, 288018, -207167]
17990b09794N9258q6037N8067E8002J8153D713b2879j56224G022e1275A02974
17978B11366b24531R2808r8329A0046J00420a19323e7825B49205g5231G489i3154
17966g5693I2318d6026B4346d2199B66306C1407P0507D2664d52912A9209a21349
17954C8106J46299a50804k13643b4617A51477d4272g367A46603J14276a89377
17943g8155D04O39P9618c57782J49254Q5279F40O873b60025A6243M34628d3685
17930h7883A72989b8922C71459g2441H3443g2975m9412C31842c30761e9345l2678
17919i2023B52577G9404J42775b17072o9017C47875a08162C577a13467E000a5338
17907E8228g2718a7389o2900B92727b93570o6829B58384A26882E9802A0235b01478
$$ y = [-209794, -150536, -236573, -178506, 58002, 76155, 4713, -22879, -179103, 7022, -51275, 102974, 211366, -224531, -131723, -230052, 10046, 110466, -119323, -57825, 249205, -75231, 7489, -93154, -75693, 92318, -46026, 24346, -42199, 266306, 31407, 101914, 42664, -452912, 19209, -121349, 38106, 184405, -150804, -364447, -24617, 151477, -44272, -7367, 146603, 260879, -189377, -78155, 404, 1043, 80661, -357782, -208528, -123249, 640, 7513, -260025, 16243, 450871, -43685, -87883, 172989, -28922, 371459, -72441, 83443, -72975, -122387, 331842, -330761, -59345, -92023, 252577, 79404, 222179, -217072, -286089, 347875, -108162, 3577, -113467, 5000, -15338, 58228, -72718, -17389, -80289, 292727, -293570, -360399, 258384, 126882, 59802, 10235, -201478]
17895e6463k37040A43830b6255j1394k60631A12144M5414D2458e7328k6831A27879
17883d4171B58424e3412A91263p6878J61864a10244k76341A59469p4701J59144
17873B43912E9353M6553j7127h3311c160D09225A30881b8535G1889J84020J84461
17862D40370j50412D433h8007A28040h132A76356Q1197b53659O9325A79679a08580
17850C08715a08470r0230B9544a84672Q5310j64536G166J84753l6471a95633M8979
17839a46654B0795J37602a25831j78880A9374K877c49089N7825H8605g8378r1072
17828a69450a0554C3663b00255j11404B02493A4490c8823A03410a99103L4067
17818a65036H927J8585b44310A00820a76531N9528j15548A99896E8090J08445
$$ y = [-56463, -293503, 143830, -26255, -37649, -298280, 112144, 157558, 42458, -57328, -84159, 127879, -44171, 258424, -53412, 191263, 114385, 276249, -110244, -386585, 159469, 84768, 243912, 59353, 105906, 88779, -83311, -3160, 409225, 130881, -28535, 71889, 255909, 440370, 289958, 4433, -88007, 128040, -8132, 176356, 257553, -253659, -184334, 179679, -108580, 308715, -108470, -198700, 29544, -184672, -99362, -263898, 7166, 191919, 155448, -195633, -146654, 20795, 158397, -125831, -304711, 19374, 22251, -349089, -291264, 88605, -78378, -169450, -10554, 33663, -200255, -311659, 202493, 14490, -38823, 103410, -199103, -165036, 8927, 27512, -244310, 100820, -176531, -117003, -232551, 199896, 58090, 166535]
17808A66535c8693j90328B63760H1052c668j67840A55627f938B79058A0893J83683
17797A94576N2707F2628r285B1968R9109J8647J01000J5107j16992a17245j41445
17786b58690J19082H2975e6886A01251a30121B94585a89546E9972i039F3040L06453
17775C69493A0896a2646j91469d6646j21849h294k26898C51746b3650A0638a40144
17763a23091A33224M5576a2191q2463D0482a27383A42165K73013e4933i381l3235
17752d2616k5676a5680n7307m39696e4945L558k14884B12861a58058J6212q2763
17741b24609A19495J18299A3600J15502J05032e03386B95626a67134P6992k20804
17731c10946B32542c1265A75783N9618H667b45782g5801c3359j49846l1942j44445
$$ y = [166535, -38693, -229021, 263760, 81052, -3668, -171508, 155627, -6938, 279058, 10893, 194576, 247283, 62628, 53343, 21968, 121077, 139724, 240724, 255831, 138839, -117245, -258690, -139608, 82975, -56886, 101251, -130121, 294585, -189546, 59972, -9039, 63040, 369493, 10896, -12646, -204115, -46646, -168495, -8294, -235192, 351746, -23650, 10638, -140144, -123091, 133224, 178800, -12191, -94654, 40482, -127383, 142165, 415178, -54933, -9381, -42616, -68292, -15680, -72987, -512683, -54945, -51387, -266271, 212861, -158058, -141846, -224609, 119495, 237794, 13600, 129102, 234134, -503386, 295626, -167134, -90142, -310946, 232542, -31265, 175783, 235401, 8667, -245782, -75801, -33359, -183205, -215147, -359592]
17720c59592a01946b7574A39482c12608B7206P9772h1653C51339f0901J3180j73277
17709b20998J06150m4391C5852a2319B52426j08771P1494a16605C64755C5281
17698C7688b70251C06214c53025h9761D589J69983C3021K79734h0601F5207P765
17687G2972O2793d37202B4336M7188A1314J76086I1747b9062j80745A31602R696
17676A41298l1493J85996m4989d5972I167J72940I031a54852b9999A0192J75709
17665A85901r2000J52179a03812j01751I1408J35327h4117B13407K12221a11128
17654d40086I5651b22562p0826c7261r7805G7846h8702A30018e5935n1225j11558
17643b18718i6403G3510a56287F4071K81671E7331b34329B10837a41061A70196
$$ y = [-359592, -101946, -27574, 139482, -312608, 27206, 106978, -81653, 351339, -60901, -47721, -220998, -114848, -159239, 35852, -12319, 252426, 143655, 215149, -116605, 364755, 35281, 37688, -270251, 306214, -353025, -89761, 4589, 174572, 33021, 312755, -80601, 65207, 72972, 135765, -437202, 24336, 71524, 11314, 187400, 91747, -29062, -209807, 131602, 141298, 109805, 295801, 250812, -45972, 9167, 182107, 9031, -154852, -29999, 10192, 185901, 93901, 246080, -103812, -205563, 91408, 226735, -84117, 213407, 425628, -111128, -440086, 95651, -222562, -293388, -37261, -135066, 77846, -88702, 130018, -55935, -107160, -218718, -96403, 73510, -156287, 64071, 345742, 57331, -234329, 210837, -141061, 170196]
17632D5159a2808B04387b48522R9344g1163n2394j6247C5210b16631B8326Q3620
17621A11946c5576A26867K09359c2383A53525M5432K9244k0296a4141j80319a0693
17609f904A59453E0921J98598b0966C66927h572k83246E7777B607J8389a62256
17597f1869L0714B16655C8281a45493d9084l21898A02229l6910c7935k20321a5465
17585C97773H9901K03984k8676j25544a12200M1889B28228I608K7971b7559j76932
17574b04491g0757E3816f4245b6160A0994R5080M3536g9769A42411a83997L7596
17563a46401A87545b01663R1156n9219A899K69203F1038K258b32869B22560a23114
17551a00340J8570b8417l0346B74414A18493m3191J09530j9575h9145K2270A80347
$$ y = [45159, -12808, 204387, -248522, -149178, -71163, -123557, -139804, 35210, -216631, 28326, 111946, -35576, 126867, 336226, -32383, 153525, 198957, 228201, 207905, -14141, -194460, -10693, -6904, 159453, 50921, 249519, -20966, 366927, -8572, -291818, 57777, 2607, 20996, -162256, -61869, -31155, 216655, 38281, -145493, -49084, -370982, 102229, 65319, -37935, -258256, -15465, 397773, 89901, 293885, 265209, 139665, -112200, -70311, 228228, 9608, 37579, -27559, -204491, -70757, 53816, -64245, -26160, 10994, 106074, 149610, -79769, 142411, -183997, -146401, 187545, -201663, -110507, -169726, 1899, 271102, 61038, 63296, -232869, 222560, -123114, -100340, -81770, -28417, -58763, 274414, 118493, 75302, 184832, 165257, -89145, -66875, 180347]
17539A9828L92144j7668B3552g7013B63302B8943N3382M1727a520j05329F2804
17527C09778G0167k9825L05301a83108C275J67085J12582J69215a47416B6511
17516B91852J53866F2846a87644K3419O4492d7585A65244c520j42439d363k13548
17505b17911M8899O0118A25620a89717F7518L3693A6658J34399E2486b41436B87698
17493A49956k8329O78b34302d3709B6048e0887G6144R0279e1011A10408g3979
17481A42761J74883E8638J09718j2688Q2114n1019B582a14637I216i403A26968
17469B71295b70632E06278B36545p3883O937h9072G4356P9217m8676K34295b43759
17457A84300B4558a9027A33485B1044J73668J74652j60374K49443c2332A32933
$$ y = [19828, 411972, 394304, 23552, -77013, 263302, 28943, 82325, 124052, -1520, -106849, 62804, 309778, 70167, 40342, 345643, -183108, 3275, 170360, 282942, 452157, -147416, 26511, 291852, 445718, 62846, -187644, -164225, -99733, -47585, 165244, -3520, -145959, -4363, -217911, -169012, -108894, 125620, -189717, 67518, 101211, 16658, 151057, 52486, -241436, 287698, 149956, 121627, 122305, -234302, -43709, 26048, -50887, 76144, 166423, -51011, 110408, -73979, 142761, 317644, 58638, 168356, 155668, 237782, 186763, 2582, -114637, 9216, -9403, 126968, 271295, -270632, 506278, 236545, 162662, 169599, -89072, 74356, 153573, 104897, 339192, -243759, 184300, 24558, -19027, 133485, 21044, 194712, 369364, 208990, 458433, -32332, 132933]
17446B61029r3248c3661B53698b50893B34067k4928l4358R9101j7242R0426I4430
17434B96457I5952J60000G7802K0622L67513G207K29167J10877j69042K71357
17424D49566H8745L71621G4740B9664J82067R143J10074J30838q8748H0717K76142
17413C56859A03309a8691A15358c9255C60273K2592e5209p865C18667j35511k4308
17402A58848c9119A8868L05714E7631J073K75349I5638J96979N5877e3142A77805
17390H2191f8749C39026j34013K6009a555A75523J74559m7918e7696C90744D0159
17378A90197E1847J54670A5398M24768E3774J56859g6784B5855I043R8313p216
17367A00140A2141L32055K8112j54339o5605f3956B42164d9571A49586o7295b0055
$$ y = [261029, 167781, -33661, 253698, -250893, 234067, 209139, 174781, 273882, 256640, 347066, 94430, 296457, 95952, 255952, 77802, 98424, 465937, 7207, 236374, 347251, 178209, 449566, 88745, 460366, 74740, 29664, 211731, 220874, 330948, 461786, 373038, 80717, 356859, 103309, -18691, 115358, -39255, 360273, 382865, -55209, -63074, 318667, 183156, 158848, -39119, 18868, 324582, 57631, 58704, 334053, 95638, 292617, 348494, -53142, 177805, 82191, -68749, 339026, 205013, 231022, -1555, 175523, 350082, 302164, -57696, 390744, 40159, 190197, 51847, 206517, 15398, 440166, 53774, 210633, -76784, 25855, 9043, 107356, 100140, 12141, 344196, 372308, 217969, 152364, -63956, 242164, -49571, 149586, 82291, -20055]
17355A47065J69765A26702a13405A18599Q014f1845B31142k5672B0345K47506
17345B67851q0025N0498N012n0947k0098K73031A18411a81886C21660a37731g800
17333B22653k3315J60919j75024Q1644a09133B0703J91399C5717J62967m4326
17323A54358B4049J57950G0114F166J38826J09757q6564J39392a2806A62029J5367
17312A77396L34139B28530G9355a24214B77451E5064j0342L0467L30423a97315
17301B04475l9106J59266a2857C2945a78689D9447J10935k1264J14221A4124J22228
17290A36352a6785n4601E10581J40059F1005M04353j56050O838F7045J21580F6990
17278A18882J22161J25047B7898J07517a9403E7837J13937g5909D25275f1589
$$ y = [147065, 316830, 126702, -113405, 118599, 126613, -61845, 231142, 205470, 20345, 267851, 187826, 238324, 243336, 192389, 172291, 445322, 118411, -181886, 321660, -137731, -7800, 222653, 199338, 360257, 185233, 266877, -109133, 20703, 212102, 35717, 198684, 154358, 24049, 181999, 70114, 6166, 144992, 254749, 168185, 307577, -12806, 162029, 177396, 511535, 228530, 79355, -124214, 277451, 55064, 44722, 75189, 405612, -197315, 204475, 165369, 324635, -12857, 32945, -178689, 49447, 160382, 139118, 253339, 14124, 136352, -16785, -71386, 510581, 650640, 61005, 465358, 309308, 316146, 67045, 188625, 66990, 118882, 241043, 366090, 27898, 135415, -19403, 57837, 171774, -75909, 425275, -61589]
17267C1327K74445j09624m9376K69901j1764I0202M5587L3604l8074l236m761
17256A23322a18460D0027J77707h3747a2589B42923a52865K9371C27955A05334
17245b4499A34233n0011i1280A24672E4506N41088f8597D99372j87635r8915I1316
17233a01279F75250g8411c7739A91596J08978j35468Q1353J7585j05135J62007
17223C20916R5854k02552O8579d5177C41391j29602r2123L78909j86942j05159
17213B06474L11428k49771j33503J27372O1007A58362o1395n862J159d2513B19568
17201B37487L27919B16349J74484O0811r0443j26612m5850O4399L84870j29098
17191E08910f8432G930J72589F9839N76697A75176j7863K97295p6683j8339j64499
$$ y = [31327, 305772, 196148, 146772, 416673, 404909, 90202, 135789, 169393, 131319, 128083, 123322, -118460, 40027, 217734, -83747, -12589, 242923, -152865, -123494, 327955, 105334, -24499, 134233, 84222, -91280, 124672, 54506, 595594, -68597, 499372, 311737, 212822, 91316, -101279, 675250, -78411, -37739, 191596, 300574, 165106, 246459, 264044, 158909, 320916, 416770, 214218, 282797, -45177, 341391, 211789, 119666, 498575, 311633, 206474, 517902, 268131, 134628, 262000, 323007, 158362, 96967, 91105, 92264, -42513, 219568, 237487, 565406, 216349, 390833, 451644, 361201, 234589, 188739, 253138, 638008, 508910, -68432, 7930, 180519, 69839, 646536, 175176, 157313, 454608, 377925, 359586, 195087]
17180A95087H0810J94240Q873j03671O8937a00556C90618i6117A99856D4141J22343
17169A66484L89111B51454K16944I121P3895K23410p7985M161d1563C61810A33856
17157B61633j6576d2952D11915j73913M7605n4715o672J16932j01226k6717C7158
17145E25707A27063L37736j13735J122q422G2816L81875c600C30958O350L3334
17134C70642N998A62494J18935J53965A81740J98559j30555d5631B20666N4744
17124B75410l1913J62594J4331a36061B19678L41082k22610O4801p6600H4732
17113B33919r5468R4264K91194r5312A03041M03704B48399A6584L55952j00566
17103B71970K45520o8206A96441m6325M06562B58978A21781K04675A01892J22022
$$ y = [195087, 80810, 275050, 283923, 180252, 249189, -100556, 390618, -96117, 199856, 44141, 166484, 555595, 251454, 468398, 9121, 83016, 306426, 228441, 232602, -41563, 361810, 133856, 261633, 245057, -42952, 411915, 238002, 285607, 230892, 224220, 341152, 239926, 213209, 37158, 525707, 127063, 464799, 351064, 352186, 343764, 72816, 454691, -3600, 330958, 337308, 370642, 376640, 162494, 281429, 435394, 181740, 380299, 249744, -45631, 220666, 275410, 243497, 406091, 420422, -136061, 219678, 560760, 338150, 402951, 326351, 84732, 233919, 138451, 232715, 523909, 428597, 103041, 506745, 248399, 16584, 372536, 271970, 517490, 449284, 196441, 150116, 556678, 258978, 121781, 326456, 101892, 223914]
17093B23914K48787I2435L2760J63087q9826J57471K02117K30857k71248B38886
17082B31535M19670j63577A76488J29417J20372M7149N1880A87153K56298K304
17072D45755E1730K19518p3162K84064H3737M83225j65452j6054J24519A84351
17061E01355B39886K52373j28846O8362j23880N67373C58200J78633k08364L72410
17051G00879I0138K67791j48609L74774J7170j08650A48326O42035B63474J0354
17041B73828K98692j88902L18988J65744l42957j38265J96687J34964j15266k69363
17031C34150L51884B66204K92412L7963Q1151k37754J07012N1536K227j23673
17021D77078M02046l21973L93469l44878L94782l71140l2436k40608K92686J92116
$$ y = [223914, 472701, 92435, 125195, 288282, 198456, 355927, 558044, 788901, 517653, 238886, 231535, 651205, 487628, 176488, 305905, 426277, 473426, 525306, 187153, 443451, 445755, 51730, 271248, 198086, 482150, 83737, 566962, 401510, 385456, 509975, 184351, 501355, 239886, 492259, 363413, 431775, 307895, 875268, 358200, 536833, 328469, 700879, 90138, 357929, 209320, 584094, 601264, 492614, 148326, 790361, 263474, 273828, 572520, 383618, 702606, 868350, 525393, 387128, 583815, 718779, 603513, 334150, 686034, 266204, 558616, 596579, 677730, 439976, 546988, 598524, 600751, 477078, 879124, 557151, 950620, 605742, 1000524, 629384, 596948, 356340, 649026, 841142]
17011H41142j90097C05650K96316L4347j35272J10215M9158k96399K52614J31414
17001G48043j33977R3076J10250j45864j17225J38928j76043o4505K09831l7813
16991F24701k3011L30718m3734j63808p0467J90230L3690M2347l32018M85281
16981A073929k51308k40122J85686j30177K59281j38537P1900j47388K42275k15692
16971G09847q777M6114J78041k33284J56281k08075L24954l5745k012k36441K49225
16960I40128J52253l35483j74909L59945P1608J44220j87346j27363j88727N22537
16950A176863k21972J80624k61314J19040j45580K19672J9108r1077K27521r1499
16940A131386n4985L67400m57039N94992k87751k11709J71750k53215J05518J68492
$$ y = [841142, 651045, 305650, 601966, 636313, 501041, 611256, 660414, 364015, 616629, 748043, 614066, 707142, 817392, 671528, 554303, 693231, 517188, 452683, 662514, 624701, 601690, 932408, 888674, 724866, 654399, 844629, 878319, 920666, 588648, 1073929, 822621, 582499, 768185, 638008, 897289, 758752, 830652, 683264, 925539, 709847, 701070, 747184, 925225, 691941, 848222, 640147, 965101, 929356, 927344, 690903, 940128, 1092381, 756898, 581989, 941934, 1013542, 1157762, 970416, 843053, 654326, 1176863, 954891, 1135515, 874201, 993241, 847661, 1067333, 1086441, 995364, 1222885, 1131386, 1076401, 1443801, 986762, 1581754, 1294003, 1082294, 1254044, 1000829, 1106347, 1274839]
16930A274839L0243k16372L67132N3227j21387k8293N3021j8296j66534J27374
16920A354954J76976k45048j37478K65468k62522J61547N7278r1021M09510m29584
16910A260080K4526J20208J8731l25577P13275m06107J60968N295j40734K36622
16900A667287k47957L09107k86402j27772J86579J90663J10951k54012J08964
16891A657408J23713O3073P4284O7060k98837N4125p2080L51720O6008m7019l69257
16880A670198N68745j58181k02535K60977l09496J97005j87786M15127J18754
16871B372808k82323J67287Q2569l36119M61272o75982N01029Q2325J72990Q783
16861B554639o9902j02831m8903r8352N95169j94983N2043L91528l46475J30977
$$ y = [1274839, 1305082, 1088710, 1455842, 1509069, 1387682, 1359389, 1412410, 1394114, 1227580, 1354954, 1531930, 1286882, 1149404, 1414872, 1152350, 1313897, 1371175, 1280154, 1689664, 1260080, 1284606, 1404814, 1423545, 1097968, 1811243, 1405136, 1566104, 1571399, 1430665, 1667287, 1419330, 1728437, 1442035, 1314263, 1500842, 1691505, 1802456, 1548444, 1657408, 1781121, 1844194, 1918478, 1985538, 1686701, 1740826, 1668746, 2020466, 2086474, 2039455, 1670198, 2238943, 2080762, 1878227, 2139204, 1829708, 2026713, 1838927, 2254054, 2372808, 2090485, 2257772, 2340341, 2004222, 2465494, 1789512, 2290541, 2372866, 2545856, 2554639, 2484737, 2381906, 2333003, 2234651, 2829820, 2634837, 2686880, 3078408, 2731933, 2862910]
16851B862910N26653n61835J64555r0601l8462L08317J36990k59265K83071L61333
16841C693666r6896n25403K78585L07970l11142K15428K33678J7140k0867l37799
16831C454360O22752j82466K83964j91475K91201L4019K99924m90411J93497M42027
16821D757392n091k79732N64839j28323O7388M16415j87589P8197j584K4808J05551
16810E412271M25134k45500j5114O94943J06765l03121K53589N73821j4786k0195
16800F867807J08060K2996P22455l34110R4007L91325J68669j17904N05998L47099
16790H776402J41360L46348P7047J51170J19579K14659O81817j2201L28500K12193
16780A1036874L85681O29383J18805L53682M21717K76286N41396N21273K80549
$$ y = [2862910, 3389563, 2827728, 2992283, 2901682, 2863220, 3171537, 3308527, 3049262, 3332333, 3693666, 3596770, 3071367, 3349952, 3657922, 3346780, 3562208, 3795886, 3813026, 3792159, 3454360, 4077112, 3894646, 4178610, 3987135, 4278336, 4312355, 4612279, 4121868, 4315365, 4757392, 4752301, 4472569, 5037408, 4909085, 4976473, 5392888, 5205299, 5283496, 5281912, 5306720, 5412271, 5837405, 5591905, 5576791, 6271734, 6378499, 6075378, 6328967, 6902788, 6888002, 6867807, 6975867, 6998863, 7721318, 7387208, 7481215, 7872540, 8041209, 7923305, 8429303, 8776402, 8917762, 9264110, 9341157, 9492327, 9611906, 9826565, 10508382, 10496181, 10824681, 11036874, 11422555, 12051938, 12170743, 12524425, 12946142, 13222428, 13763824, 14285097, 14565646]
16771A4565646L96121Q08087L96522O44478O03385L53762P30048N71093O73911
16762A9743053R56367L46149J116813N62817R12273J111586J152253J103979R87606
16753B7992896J110484J076307J820102J388808J286070J963464J552041K110896
16745D0301068J843923K489656K145708K371157K732089K821104K952707L788526
16737F1445938K893366M005785M080388M621583M241795N329803N451366N512775
16729I7582799O461854O438337O881226P212933P622031P550874Q233388P685305
16721A55668747P981788P245030P347895O604885N837577M435106L498483K033984
16713B00653495M86804j048580k139977l751681m566799o076758o400305p103173
$$ y = [14565646, 14961767, 15769854, 16166376, 16810854, 17414239, 17768001, 18498049, 19069142, 19743053, 20699420, 21045569, 22162382, 22725199, 23637472, 24749058, 25901311, 27005290, 27992896, 29103380, 30179687, 31999789, 33388597, 34674667, 36638131, 38190172, 40301068, 42144991, 44634647, 46780355, 49151512, 51883601, 54704705, 57657412, 61445938, 64339304, 68345089, 72425477, 77047060, 81288855, 86618658, 92070024, 97582799, 104044653, 110482990, 117364216, 124577149, 132199180, 139750054, 147983442, 155668747, 163650535, 170895565, 178243460, 184848345, 190685922, 195121028, 198619511, 200653495, 201140299, 200091719, 197951742, 194200061, 189633262, 183556504, 177156199, 170053026]
16705A70053026p879531p961012q021518p817648p829045p543214p391050o983737
16697A08626271o427364o494971n447847n716837m950098m907362m393864m021862
16689F6266066l518564l456214l478979l170576k369616l119426k442190k058669
16681D2651832k476442j743672j881671j933753j632078j541790j299873j356799
16673B8785754j048699j400135r97034q65851j077916q68691j181845n98480q89980
16664A9857123r89778l06389q44406l24518p43474q14552o32356j93049l93963
16655A4614638p59564o73142L2565n04374o83211m17083o3765k51991p76694j37587
16645A0379792j81733l26827k84631N2770l27718p3563n94713k69072k84771M5441
$$ y = [170053026, 162173495, 154212483, 146190965, 138373317, 130544272, 123001058, 115610008, 108626271, 102198907, 95703936, 90256089, 84539252, 79589154, 74681792, 70287928, 66266066, 62747502, 59291288, 55812309, 52641733, 50272117, 47152691, 44710501, 42651832, 40175390, 38431718, 36550047, 34616294, 32984216, 31442426, 30142553, 28785754, 27737055, 26336920, 25339886, 24474035, 23396119, 22527428, 21345583, 20747103, 19857123, 18867345, 18560956, 17716550, 17392032, 16648558, 15834006, 15201650, 15008601, 14614638, 13855074, 13181932, 13214497, 12710123, 12026912, 11609829, 11546064, 11294073, 10517379, 10379792, 10198059, 9871232, 9586601, 9639371, 9311653, 9238090, 8643377, 8374305, 8089534, 8134975]
16635H134975m63297l48937J16967n54061Q0306l1423o5300k27406l38675M738
16625F307887O6461n37725M0327L02166q04285O2625n33607J48164J40702j88855
16615E003860m1515o9145k39825K5565l28001l6018p5946J51998k68757O1221
16605D183437p5623j63138j20387K43461n19425L7448q7775k28030K05844P4930
16595C550742l49302K42745k91629K58025k4858j31503l79774N0406n7752J73991
16585C041091l6882l77858K3991q1273N50209m61040j48440L6514l4862J92794
16575B704244m21727j5082J67853l59530Q295k47466M40650j91132J58191m25425
16565A818871M58408P4570k68989j69299k24646J22901j55518K71518m6162P3514
$$ y = [8134975, 7671678, 7322741, 7439708, 6885647, 6965953, 6934530, 6869230, 6641824, 6303149, 6307887, 6374348, 5836623, 5876950, 6179116, 5374831, 5437456, 4903849, 5052013, 5192715, 5003860, 4962345, 4893200, 4653375, 4678940, 4350939, 4314921, 4238975, 4390973, 4122216, 4183437, 4107814, 3944676, 3824289, 4067750, 3548325, 3585773, 3497998, 3269968, 3475812, 3550742, 3201440, 3444185, 3152556, 3410581, 3385723, 3254220, 2874446, 2924852, 2867100, 3041091, 3004209, 2626351, 2650342, 2569069, 3119278, 2658238, 2509798, 2546312, 2511450, 2704244, 2282517, 2267435, 2435288, 2075758, 2084053, 1836587, 2277237, 2086105, 2244296, 1818871, 2277279, 2351849, 2082860, 1913561, 1688915, 1811816, 1656298, 1927816, 1881654, 1955168]
16555A955168K1802k68216J64420n4626l06350J89184k62500M02482J1285m53801
16545A398848M2796L34212K8328l66538r3316j02357K42996j73318J31356n0843
16535A392164N218K42982l75781J672K1979N4478J08634l49549J87177r147l5353
16524A244474J00265j01950k02561J72381L28819n38920j9910J02696J5231k51786
16514H48739L84370j19923J73052l43515k22330L27645m6929J69461m76628K06916
16504I00858l52176M25722K54344k18861l31132K5904M47558l20801l4168K29348
16494A026596l54962J81521K29403j05365j59370O5770j40209J02433l73326L08758
16484G81249J7370k75421K43551n8368J3412M8590J10759k49998j0020p116J29135
$$ y = [1955168, 1976970, 1708754, 1873174, 1818548, 1512198, 1701382, 1438882, 1841364, 1852649, 1398848, 1441644, 1775856, 1804184, 1437646, 1344330, 1241973, 1484969, 1311651, 1443007, 1392164, 1397382, 1640364, 1264583, 1266255, 1288234, 1342712, 1451346, 1101797, 1288974, 1279827, 1244474, 1344739, 1242789, 1040228, 1212609, 1541428, 1002508, 982598, 1085294, 1100525, 848739, 1233109, 1113186, 1286238, 942723, 720393, 1048038, 1001109, 1170570, 693942, 900858, 548682, 974404, 1228748, 1009887, 678755, 704659, 1152217, 831416, 797248, 1026596, 671634, 853155, 1082558, 977193, 817823, 883593, 743384, 845817, 472491, 781249, 798619, 523198, 766749, 708381, 721793, 770383, 881142, 631144, 621124, 614008, 743143]
16473G43143K26209J5251k95757J99531C19868K88518L78166D92267N77916C12048
16462F19317p4739J03436N7819j75955Q2015J14123k84739M69076l34355j43026
16452D32972J50224K9363J96531j88993E7305J044897E08376m6275r0882J276
16442C72495j07094J75868L3443j65754N08280C75331K52827n6875l0779J3727
16432E54231K09253k6938l06049K02528A41450L27347k08707L76501C13198J85662
16422D98860j36026N0782A11172O7116L46193N9920o3580A65405N26395j19435
16412E72365N5911L441N1284C40354B1808J51014J91443j66582i3395C09306K52814
16401E62120p6138j76006J67375E3258M23152J22859B94365p4605N0417M8959
$$ y = [743143, 969352, 984603, 688846, 888377, 319868, 608386, 986552, 492267, 1070183, 312048, 619317, 544578, 648014, 705833, 529878, 611893, 726016, 441277, 910353, 575998, 432972, 583196, 612559, 809090, 620097, 57305, 1102202, 508376, 462101, 371219, 372495, 265401, 441269, 474712, 308958, 817238, 375331, 628158, 571283, 540504, 554231, 763484, 736546, 430497, 633025, 141450, 468797, 260090, 636591, 313198, 498860, 362834, 413616, 111172, 178288, 524481, 584401, 520821, 165405, 691800, 572365, 628276, 631717, 683001, 340354, 21808, 172822, 364265, 197683, -93395, 309306, 562120, 485982, 309976, 477351, 53258, 476410, 599269, 294365, 219760, 270177, 319136]
16391C19136J01047J07151B34639N8859L35714B67265J23143j61620J39712r7983
16381B70517I0972J12760J25428j49948K10702j18879J18836L2518A59966Q2173
16371B42139O7863K999J17199d6170C39815o4650K77492k23198c2826B6440J11029
16360A37469L3361A0958K82063n9719k3303L18406n3843C8448J75937D6289L78159
16349D24448m3803q1945N9465G1597f900I5987J32139j8010K27995j22552b1344
16337A44541K45345A39034J41950K22872j20625A37935J29967A5833K02426p6536
16327A41723P9474o7636J38512A04142K32896r3417A04905f3284D78511b04839
16316B01601D9908N45158b5723A92355M7516J30285A44646Q3957r4976f2195G4207
$$ y = [319136, 420183, 527334, 234639, 293498, 629212, 267265, 390408, 228788, 368500, 270517, 90972, 203732, 329160, 179212, 389914, 271035, 389871, 422389, 159966, 242139, 310002, 313001, 430200, -46170, 339815, 275165, 552657, 329459, -32826, 26440, 137469, 170830, 10958, 293021, 233302, 209999, 528405, 474562, 38448, 214385, 46289, 424448, 380645, 298700, 358165, 71597, -6900, 95987, 228126, 210116, 438111, 315559, -21344, 144541, 389886, 139034, 280984, 503856, 383231, 137935, 267902, 15833, 218259, 141723, 221197, 153561, 292073, 104142, 337038, 243621, 104905, -63284, 478511, -204839, 201601, 49908, 595066, -25723, 192355, 239871, 370156, 144646, 228603, 133627, -62195, 74207]
16304A91311F4135K71660j50249o1411R0765k9987B7453p000a77924D65769a27291
16292G0699A6464b64477A61794J2651A7685M96133A35712J51053j22814M6085
16282B10036C6671a32758F1713M8894D790c98166D8005P4385a81277D6037J00935
16271A46972l3312a53546D30393L1897b12800B94113b80741B42466b1807G0137
16260F9964a56176A53072a30192A49179K0764r373i964B21931g3584D09871j65446
16249B44425j01493l7419a60426D00800c7688A17966M56117d7143B08151C7138
16238B41035j04751F7813O0994N5681f206j1849D8963R4863d3730C05K39826b31946
16225I190g2639j65814A08849m54P5712M4054q5168A1516N8638J35182k8901n5502
$$ y = [191311, 64135, 335795, 185546, 124135, 214900, 184913, 27453, 20453, -177924, 465769, -127291, 70699, 16464, -264477, 161794, 174445, 17685, 513818, 135712, 286765, 163951, 210036, 36671, -132758, 61713, 110607, 4790, -398166, 48005, 122390, -181277, 46037, 146972, 113660, -153546, 430393, 462290, -212800, 294113, -280741, 242466, -21807, 70137, 69964, -156176, 153072, -130192, 149179, 169943, 160570, -9964, 221931, -73584, 409871, 244425, 142932, 105513, -160426, 400800, -37688, 117966, 574083, -47143, 208151, 37138, 241035, 136284, 67813, 128807, 184488, -6206, -18055, 48963, 143826, -43730, 305, 240131, -231946, 9190, -72639, -238453, 108849, 108395, 184107, 228161, 142993, 11516, 70154, 205336, 176435, 120933]
16213A20933n6538i5291C62650A71861K6433b39713B02109Q0827I7978b11753
16202f0143F3085J05323b02305A32236a24197A33670D3741h6043A10065k6386
16192H3679B380J01599i9488A05695l039a96685D9992P5154R4969J5311a6954
16180A556J92110F9034K42629a15604E5864D525c4093j30670e0372A37471k5661
16169A11810a42114A01819Q1809e19A14375k7814B671N8206a77668j66353E0199
16157D4485f2906A01247A3235K52900A14543A2831J24550j4251O6289E1644J00883
16146A52527J47487d9125q0999B13313a12050j52636a27522j06636Q7682B32220
16135B75920p9642b6946D03802b61564f9102k56910o4990b1860B26804g7669o883
$$ y = [120933, 64395, -95291, 362650, 171861, 198294, -239713, 202109, 282936, 97978, -211753, -60143, 63085, 168408, -202305, 132236, -124197, 133670, 43741, -86043, 110065, 83679, 2380, 103979, -99488, 105695, 102656, -196685, 49992, 125146, 220115, 235426, -16954, 1556, 193666, 69034, 311663, -115604, 55864, 4525, -34093, -164763, -50372, 137471, 111810, -142114, 101819, 183628, -519, 114375, 86561, 2671, 60877, -177668, -344021, 50199, 44485, -62906, 101247, 13235, 266135, 114543, 12831, 137381, 123130, 189419, 51644, 152527, 300014, -49125, -130124, 213313, -112050, -264686, -127522, -234158, -146476, 232220, 275920, 196278, -26946, 403802, -261564, -69102, -326012, -391002, -21860, 226804, -77669, -84552]
16124h4552j30393l14453h3813k7464p5784b3705j12075j22416B998f35F6435
16112B22599j9373G5292Q057K8666i2565d4284H1625D860a62751A75198b13667
16100A50582g361B16989O4286e5897k30287C5174N725h4761b4391F7346J63895
16089B31241n8441a26000A26956g2693k45820F0945c9223A37038c79512a3865
16078A25051a55138H3212J68K90454i4349C0260K57264a41914j43361c8826n3933
16067i2759j82846A66524G7490a61110b2492A85945a22052G7730a45136C6185
16056a40585B27025N2516i6721p4538G0063P4421a12132A25611k0116j0202J60336
16045B55629D1770j2314M8773L9349m3006b34003a08243j30553A85632a02509
$$ y = [-84552, -214945, -529398, -83813, -111277, -187061, -23705, -135780, -258196, 2998, -635, 66435, 222599, 203226, 75292, 83349, 112015, -92565, -44284, 81625, 4860, -162751, 175198, -213667, 150582, -7361, 216989, 281275, -55897, -286184, 35174, 40899, -84761, -24391, 67346, 231241, 172800, -126000, 126956, -72693, -318513, 60945, -39223, 137038, -379512, -13865, 125051, -155138, 83212, 83380, 373834, -94349, 30260, 287524, -141914, -285275, -38826, -92759, -275605, 166524, 77490, -161110, -22492, 185945, -122052, 77730, -145136, 36185, -140585, 227025, 279541, -96721, -171259, 70063, 144484, -112132, 125611, 105495, 95293, 255629, 41770, 29456, 78229, 117578, 74572, -234003, -108243, -238796, 185632, -102509]
16034b30322L6036B05729G3223c98813A04993a55539B8870O0941J27762g0741
16023a41307j94769f4666k88366A83249d0759r5625A00146J44944a51913k25828
16013c77741B23639C644b03075k5958I4777M5484L6685a10464D25381d34314J32554
16002c01760B80746A6216b27649o273R3989O4838c1773I0695a01521j59119A09135
15990a66639H3157b35037i4223f349A51842b6694B17934K54291j92743K14764
15980D94246o0995j61568j27238b5233B68824F5509d6404k32995B51150a39809
15969b78671A03911J02201b38753h4247p6719j28422B43869a26472B90349E6909
15958F1108k9918d7814j50875B63758o2584b96789K5300a32725A93076a70981
$$ y = [-230322, -194286, 205729, 73223, -398813, 104993, -155539, 28870, 89811, 217573, -70741, -141307, -336076, -64666, -353032, 183249, -40759, -136384, 100146, 245090, -151913, -377741, 223639, 3644, -203075, -229033, 94777, 140261, 176946, -110464, 425381, -434314, -301760, 280746, 16216, -227649, -233922, -139933, -75095, -31773, 90695, -101521, -260640, 109135, -166639, 83157, -235037, -94223, -6349, 151842, -26694, 217934, 472225, 279482, 494246, 433251, 271683, 144445, -25233, 268824, 65509, -46404, -279399, 251150, -139809, -278671, 103911, 206112, -238753, -84247, -160966, -289388, 243869, -126472, 290349, 56909, 61108, 31190, -47814, -198689, 263758, 201174, -296789, -271489, -132725, 193076, -170981]
15947b23666j23197E8006b26040P9692C6520f6664b7912B21453B1179n49J65426
15936A86056a86698j32461O8087a12445q2416o3562a10155K6559M1683K649K909
15925c6355B4352a97601B36750c70433h4081H8175a12933e1265j38255G9664b27269
15913i0400l4871K6216C4629a87150A16657l8330e6170F9276M3893f8735A83344
15901A78526b37204C3281J94100a60396g6459L2907M359B3085a38956B01719H3768
15889B05112f0584a3757C9726c66514B35210n3594h614k2974A06943K0260D1777
15877b85382i393H5187d5540j74859A16603h639B47751a31904I0832a89398p6732
15866b66130B18229b71863J35335n9071A2706J3747a33991A96541b79365a18925
$$ y = [-223666, -346863, 58006, -226040, -146348, 36520, -66664, -27912, 221453, 21179, 20630, 186056, -186698, -319159, -251072, -112445, -194861, -258423, -110155, -83596, -41913, -39264, -36355, 24352, -197601, 236750, -370433, -84081, 88175, -112933, -51265, -189520, 79664, -227269, -90400, -125271, -99055, 34629, -187150, 116657, 78327, -56170, 69276, 113169, -68735, 183344, 178526, -237204, 33281, 227381, -160396, -76459, -43552, -39193, 23085, -138956, 201719, 83768, 205112, -60584, -13757, 39726, -366514, 235210, 181616, -8614, -31588, 106943, 127203, 41777, -285382, -9393, 85187, -45540, -220399, 116603, -8639, 247751, -131904, 90832, -189398, -266130, 218229, -271863, -136528, -195599, 12706, 26453, -133991, 196541, -279365, -118925]
15855b14355h5263a8549A00577r971L0883l8925h8248j96699E5641a50007A1075
15843b95352a09969C04529A00311c05902G9988c7605n0435k706H4409A6614J18292
15832A34906C9632R9750J29832b07606R1764b1231G709a64252q3043A39294b16106
15820E01101A24498A0478b70732a16064K4203k98718B07924m8245b83782C59470
15809g9383L5585j46285b1753a0264m67307f5867a6934A74054k9487c2658j74434
15798b07092I1244c63527d9741B67882a86307F9068a04193j33100g0680b0652
15787i4842k0616B6128b67688C0985a01057A09097d16531C6101K2512d7765k44019
15776b91784A28989h5909L3625j75363A68120a84602B06469c18052i7171B18421
$$ y = [-214355, -85263, -18549, 100577, 90606, 121489, 82564, -88248, -284947, 55641, -150007, 11075, -295352, -109969, 304529, 100311, -305902, 79988, -37605, -88040, -90746, 84409, 16614, 134906, 39632, 139382, 269214, -207606, -115842, -21231, 7709, -164252, -247295, 139294, -216106, 501101, 124498, 10478, -270732, -116064, -91861, -390579, 207924, 159679, -283782, 359470, -79383, -43798, -190083, -21753, -10264, -477571, -65867, -16934, 174054, 144567, -32658, -207092, 91244, -363527, -49741, 267882, -186307, 69068, -104193, -237293, -70680, -20652, -94842, -115458, 26128, -267688, 30985, -101057, 109097, -416531, 36101, 58613, -47765, -291784, 128989, -85909, -52284, -227647, 168120, -184602, 206469, -318052, -97171, 218421]
15765A98190d64693D48765a54796H4283J31258c13000g2536I0359j8284O8565
15755A40640h5049A92473H3354J6420b61073C11275b8248A5620L5736K1082J05186
15744A77624a36052C8547K08645a23008A8314l105a43756j22935E8937g71k73856
15733b74627g2666j13106p7077o6671A15174a25547N2295j02723N9099r0665q726
15722b16267G8867R0575a64544C6570M0461h3518j3490j81381J08181c8970G5881
15710a29220n312a1018k30620a09652D9163h4637A13748h9246c0758Q774A53904
15698A62202a33731C04993b33930o0604Q4106F2268b16915b3519B8713b65543
15687C7805g2861j09803D3178A6296K27638a76840k3732k7408c4131f869A00506
$$ y = [198190, -464693, 448765, -154796, 84283, 215541, -313000, -72536, 90359, 72075, 140640, -85049, 192473, 83354, 99774, -261073, 311275, -28248, 15620, 51356, 72438, 177624, -136052, 38547, 247192, -123008, 18314, 15209, -143756, -266691, 58937, -771, -274627, -72666, -185772, -262849, -329520, 115174, -125547, -73252, -175975, -116876, -207541, -216267, 78867, 169442, -164544, 36570, 77031, -83518, -97008, -278389, -170208, -38970, 75881, -129220, -134532, -11018, -241638, -109652, 49163, -84637, 113748, -89246, -30758, -21984, 153904, 162202, -133731, 304993, -233930, -294534, -210428, 62268, -216915, -23519, 28713, -265543, 37805, -72861, -182664, 43178, 16296, 243934, -176840, -200572, -227980, -34131, -6869, 100506]
15675b51493K8349N3326B10531b6404A67148B0599h0647A73990O8381b55923I002
15663C79413b60992d9316k15949a20729K0617K4942k32299Q3622a03689E1911
15652a12870M009L8039l07681D2257M01915a05600A6456a56599h684B6207L821
15641C0028a56393j46445A18888A6242J92263b8514E1485d303o6439a5554l3771
15630d9325r9119L3512a6419D3205K349L4362a70468A81384J15344j30839F3386
15618c44699B0435a11723A79029k8323N918o4884K58089a68328B57943a61404
15607c6079C7037J6666a99422Q2220C21661c67357A62128a40888b289j7784r542
15596b9615h330j10378a178F4487J16451D3202b8886A30462J76730A36615m299
$$ y = [-251493, -223144, -169818, 210531, -26404, 167148, 20599, -80647, 173990, 242371, -255923, 9002, 379413, -260992, -49316, -265265, -120729, -100112, -75170, -307469, -223847, -103689, 51911, -112870, -108861, -70822, -378503, 42257, 444172, -105600, 16456, -156599, -8684, 26207, 30028, -156393, -302838, 118888, 16242, 208505, -28514, 51485, -4303, -70742, -15554, -49325, -148444, -114932, -16419, 43205, 45554, 79916, -170468, 181384, 296728, 165889, 63386, -344699, 20435, -111723, 179029, 150706, 156624, 91740, 349829, -168328, 257943, -161404, -36079, 37037, 53703, -199422, -117202, 321661, -367357, 162128, -140888, -2289, -20073, -29615, -8330, -118708, -1178, 64487, 180938, 43202, -28886, 130462, 307192, 136615, 132316]
15585A32316F2032M63117e5743A75177a64548e7917j99395B42528a61885N6173
15575a05712K5841o1242c2068j26520D3017b8949B37839j07402n1634o845b95366
15563B1082L45195a72331A51395e60804h7983m19414F1145c72884c978A7203J30474
15552A47677b63117A39995e02093a73613c4268A59873k8256a59147j65929L3532
15542b91544G5727b32078A61423n127d19308B25245a69248g1532E1347Q8686h2675
15530a28946B12579a28143I6009L7661J65138b01959K3428A21363b46214N8823
15520a87391B823a81517b5971C92458A76587j4317J38272i0604c9242A29697c4819
15508B63123P5974b38354A71579M2954l2744a84595M5081B56510I764a40255O1186
$$ y = [132316, 62032, 525149, -55743, 175177, -164548, -57917, -257312, 242528, -161885, -105712, -79871, -141113, -32068, -158588, 43017, -28949, 237839, 130437, 78803, 71958, -295366, 21082, 366277, -172331, 151395, -560804, -87983, -507397, 61145, -372884, -3978, 17203, 147677, -263117, 139995, -502093, -173613, -34268, 159873, 131617, -159147, -325076, -291544, 75727, -232078, 161423, 156296, -419308, 225245, -169248, -71532, 51347, 140033, -82675, -128946, 212579, -128143, 96009, 133670, 298808, -201959, -178531, 121363, -246214, -187391, 2823, -181517, -25971, 392458, 176587, 162270, 300542, -90604, -39242, 129697, -34819, 263123, 339097, -238354, 171579, 214533, 181789, -184595, -139514, 256510, 9764, -140255, -79069]
15497g9069k13134A86083E9279H111c13741E3409a88507R1938c6936A00844i167
15485A62814M9412j03478b74445b1620q9130l74710f4025A14708g1309l7208o112
15474a14629B72308K686F8623Q4173C4209f0104k54451a50336p4533B58437E9082
15462d4575B9944k372P4018K876J54686M5075b23395G5857k5894c64240J2577
15451c51663a04637k03498o6333c5165G9617e5361c918j5365I2420a06527L7128
15440f9399j2426l1488B43152b75251A8328N5215b78354P3959B7152M9278a34650
15428B69884L8006f6063G7783P8396D4469O3889D7540b7857p4027A47665h8158
15416F5390d8884B01087c6072B4136a3203C3211P6099a53207D9329J06701b39567
$$ y = [-79069, -292203, 186083, 59279, 8111, -313741, 53409, -188507, -96569, -36936, 100844, -9167, 162814, 212226, 108748, -274445, -21620, -110750, -485460, -64025, 114708, -71309, -108517, -114629, 272308, 274994, 68623, 152796, 34209, -60104, -314555, -150336, -224869, 258437, 59082, -44575, 29944, 27572, 101590, 104466, 259152, 304227, -223395, 75857, 49963, -364240, -351663, -104637, -308135, -374468, -35165, 79617, -55361, -3918, -19283, 92420, -106527, -69399, -81825, -113313, 243152, -275251, 18328, 73543, -278354, -204395, 27152, 76430, -134650, 269884, 307890, -66063, 77783, 156179, 44469, 108358, 47540, -27857, -101884, 147665, -88158, 65390, -48884, 201087, -36072, 24136, -13203, 33211, 109310, -153207, 49329, 156030, -239567]
15404A2542J63651J1749a60577O3682B8755a89811A39643f6884B74146a18236
15393b31059B29862d551j43233j4806D9249M03847a95564A86363g0189B0750L5739
15382E6489c7280j0436b2544l0917C01613A31364K7729c46920a57623I1428D56
15370E5872K71335A37278d8337D29342a37997I406f0964k04806C1625b02686d4181
15358A13827c76745A12773l3898b72j28976A59592D7216c42962I9149b0275R182
15347a1093j20717G5919J96848a04825o5728h1903I9931a42196A7891J17273Q7609
15336B22773G3958b7260A91595c0236j16898A03682k9269a06822m051b917k11333
15325b14250J7999B07202p0422b21433N4655D2530a79571P4835B67931j20313
$$ y = [12542, 176193, 187942, -160577, -96895, 28755, -189811, 139643, -66884, 274146, -118236, -231059, 229862, -4551, -147784, -162590, 49249, 453096, -195564, 186363, -70189, 20750, 56489, -37280, -47716, -22544, -53461, 301613, 131364, 159093, -346920, -157623, 91428, 456, 55872, 327207, 137278, -48337, 429342, -137997, 9406, -60964, -265770, 31625, -202686, -44181, 113827, -376745, 112773, 78875, -272, -129248, 159592, 47216, -342962, 99149, -20275, -11093, -131810, 75919, 272767, -104825, -170553, -81903, 99931, -142196, 17891, 135164, 222773, 73958, -27260, 191595, -30236, -147134, 103682, 74413, -106822, -110873, -2917, -214250, -196251, 207202, 136780, -221433, -166778, 42530, -179571, -104736, 267931, 147618]
15315A47618f1042o3490A01165J21821c6870A88644a68972c2760j0355A32089
15304A24692n8418N00573A13432j3675J10553R553M7673a73671A23673O4939J49467
15293C38079e1317B12391a55630A8707a75875B6450J03721a0911j22479k77378
15283d10768B01779E7433M3259N4451g3495F995J7048N1307a13692A58416K57860
15272D16276E5487I584b4679D0321Q1278C1315K74081A06213a27435J5906B65411
15260A39718h7660F1953c5345A28816l9753e5943H3974i3485A27861K9141G5014
15248H21029O63627k12562j28991J19025F13737A97066m1889K8584J24492j18089
15238A90164F9497e4322p4766A9372e8257M389j79223B89078G8326c83809B32419
$$ y = [147618, -61042, -124532, 101165, 222986, -36870, 188644, -168972, -32760, -43115, 132089, 124692, 66274, 566847, 113432, 99757, 210310, 219863, 267536, -173671, 123673, 188612, 338079, -51317, 212391, -155630, 18707, -175875, 26450, 130171, -10911, -133390, -410768, 201779, 57433, 100692, 155143, -73495, 6995, 24043, 75350, -113692, 158416, 416276, 55487, 9584, -24679, 40321, 121599, 31315, 305396, 106213, -127435, -111529, 265411, 139718, -87660, 61953, -35345, 128816, 89063, -55943, 83974, -93485, 127861, 157002, 75014, 821029, 1484656, 1272094, 1143103, 1262128, 613737, 197066, 155177, 183761, 308253, 190164, 69497, -54322, -129088, 19372, -58257, -53868, -233091, 289078, 78326, -383809, 232419]
15226A22955J36831b10060j17360B60038A05271k7555B2837b3096a1323A47944
15215C86719G0875a49438A37450A0695a08387J4365A15599b2349j46300C06804
15204A92474a801j43319A15697c7920D04043E2617Q5058a95013B54717J17831
15194C72548A52173B2467R0328e3421B85963j42780R9103a7859k8542H2971f277
15182c6630I9117J3299E5887J06723a91213A16657J17893j09577J06693b28929
15171A32209K99479d700B35349e6704B8650a3223j1996C69459A39863i0326D41302
15159A68347Q6157o0138a3053A56454c5840A97118D4743K3389J05970b1744j7999
15148c9743C46174a44441C655J9264R873K13621D4134J52048J11012A21890h6594
$$ y = [122955, 259786, -210060, -327420, 260038, 105271, 77716, 22837, -23096, -11323, 147944, 386719, 70875, -149438, 137450, 10695, -108387, -94022, 115599, -22349, -168649, 306804, 192474, -1801, -145120, 115697, -37920, 404043, 52617, 137675, -195013, 254717, 372548, 152173, 22467, 112795, -53421, 285963, 143183, 242286, -17859, -46401, 82971, -6277, -36630, 99117, 112416, 55887, 162610, -191213, 116657, 234550, 124973, 231666, -228929, 132209, 431688, -4700, 235349, -56704, 28650, -13223, -25219, 369459, 139863, -90326, 441302, 168347, 254504, 194366, -13053, 156454, -35840, 197118, 44743, 68132, 174102, -21744, -39743, 346174, -144441, 3655, 22919, 32792, 246413, 44134, 196182, 307194, 121890, -86594]
15136C03126h163E4765O6751c5459F9601a16729i19k4402B880a3636C8902M32078
15124D70980H1245M098R8118H9570f1484e413j72939A5618J77289c73527a20335
15112A10514L02969A48297E8636J86275j14516J54312j24280c52584a8363B99224
15101b30711m3112D99490a9511D04327J5463q7111A30017a67347A03313K12231
15091C15544I8566a30982e0047C09129b12882e740D03273j47115A25004B3339
15080A93908d0714A9773M66819b23088A9329J74136c8269A24166K05106j59824
15070A69448O9861d5397B26595N2388C0281l38a13859C0326J28842J11836p7172
15059A93832K81492d8675A5472K46287a73305A34464m74d748F8167L55152B10852
$$ y = [303126, -8163, 54765, 121516, -35459, 69601, -116729, -919, -25321, 2880, -13636, 38902, 470980, 81245, 85343, 183461, 89570, -61484, -5413, -178352, 15618, 192907, -373527, -120335, 110514, 413483, 148297, 58636, 244911, 130395, 284707, 160427, -352584, -18363, 299224, -230711, -273823, 499490, -19511, 404327, 419790, 332679, 130017, -167347, 103313, 315544, 98566, -130982, -50047, 309129, -212882, -5740, 403273, 256158, 125004, 23339, 193908, -40714, 19773, 486592, -223088, 19329, 193465, -38269, 124166, 329272, 169448, 239309, -45397, 226595, 278983, 30281, 29943, -113859, 30326, 159168, 271004, 193832, 475324, -48675, 15472, 261759, -173305, 134464, 133990, -4748, 68167, 423319, 210852]
15047A96430R4940Q3528j45435r1161J10421c2773A07659C1994K02297Q6954c7064
15035G8742K86432A55075M3278p2028m3324K05104J45778k14210I3004K46563
15025C39567j24252H5788J6488N660M06703B42556C707N41205k53808g4927A77981
15013D64033j7994j70702a06795B39326N9158l8888I094i5450B9521c8285A67387
15001a12620B03954J50370A57885J41921a23805A89698I4729M2254a3512A05370
14990A32816K54392j72821J68255j48376b7748I2542K48325j47599A361i560B72192
14978d1576H9214L32602j6862J16480b08870C4093M40978n8792M8545e9265B83854
14966B02398M4292O786D452M79531D4920K30730n9161M5326k5375o4410h974C62934
$$ y = [196430, 291370, 374898, 229463, 138302, 248723, -32773, 107659, 31994, 234291, 321245, -37064, 78742, 365174, 155075, 198353, 126325, 83001, 288105, 433883, 219673, 93004, 339567, 215315, 85788, 102276, 107936, 514639, 242556, 3707, 544912, 291104, -74927, 177981, 464033, 446039, 275337, -106795, 239326, 298484, 259596, 9094, -95450, 29521, -38285, 167387, -112620, 203954, 354324, 157885, 299806, -123805, 189698, 94729, 136983, -13512, 105370, 132816, 387208, 214387, 382642, 234266, -27748, 92542, 340867, 193268, 1361, -9560, 272192, -41576, 89214, 421816, 404954, 521434, -208870, 34093, 475071, 416279, 464824, -59265, 283854, 202398, 246690, 253476, 4452, 483983, 44920, 275650, 216489, 261815, 236440, 172030, -8974, 362934]
14953i4089A27711M1758M9302J20537A22593K14958j40204j1492l167K6682o8406
14942A40964J19772j25397K07232j65778e9373H7946L29529a1286A81226k7690
14932A53536M34766A10654J36526r3077N4929F2424K03266J57730A83467Q5189
14922B68656l1278J02895k9197J71795k37861L3597G2279K08367l6093J6073j7121
14911B43505o8771P0314P0997J49568q2728J96702j47677B038M54662j0307B18542
14899D56539j03817K60680I0096K26401N8043J56966K78261l49271j55703J49207
14889D54000k2204k06550J88916H3681J50852J65931j10007j16179r990J55674
14879C19962H5261L1604L15476j25681L2929j38123K09134N4062I8820M02644
$$ y = [-94089, 127711, 169469, 218771, 339308, 122593, 337551, 197347, 185855, 182688, 209370, 140964, 260736, 135339, 342571, 176793, -59373, 87946, 417475, -11286, 181226, 153536, 588302, 110654, 247180, 154103, 209032, 62424, 265690, 423420, 183467, 268656, 237378, 340273, 311076, 482871, 245010, 278607, 72279, 280646, 244553, 260626, 243505, 174734, 245048, 316045, 465613, 382885, 579587, 431910, 2038, 456700, 446393, 218542, 456539, 352722, 613402, 90096, 316497, 374540, 531506, 809767, 460496, 304793, 454000, 431796, 225246, 414162, 83681, 234533, 400464, 290457, 174278, 164288, 319962, 85261, 116865, 432341, 306660, 339589, 201466, 410600, 464662, 98820, 501464]
14869E01464A80389M29259n8732j43577J32862j68857J19295k05764K62341j9613
14859E27603k58442J69580q4260m0340L21068j85932o6653A1371N50665k29870
14849C32166J27353J9231K8358J32708A97438J00836R5654K1505A97772j8261
14839A79511J25118J06224j4559J57258B62148O2266K47529M6405K0798j84329
14829D54817K1131Q5052k68595M08237B96410I4592O66274j30015k95531K59204
14819E94524J99502l42929N9847A45362M70601K77979l95481J82481A25583N23747
14809F49330P4163k90335j14166K94605p8075n7223O7128J09688j28110J15650
14799F42655N975l2794j03999k35515M27084N2701C44522M27570k26429j67306
$$ y = [501464, 180389, 609648, 550916, 407339, 540201, 371344, 490639, 284875, 547216, 527603, 269161, 438741, 354481, 314141, 635209, 449277, 382624, 11371, 562036, 332166, 459519, 478750, 507108, 639816, 197438, 298274, 393928, 415433, 197772, 179511, 304629, 410853, 396294, 553552, 262148, 324414, 571943, 618348, 639146, 454817, 475948, 561000, 292405, 700642, 296410, 94592, 760866, 630851, 335320, 594524, 794026, 451097, 510944, 145362, 615963, 893942, 498461, 680942, 125583, 649330, 723493, 433158, 318992, 613597, 535522, 478299, 545427, 655115, 527005, 642655, 648630, 615836, 511837, 276322, 703406, 756107, 344522, 772092, 545663, 378357]
14789C78357K70973k49258J71932O95J11660C09235J76921R8206A98639L98398
14779E97037j1780Q4834K43355j54861n0841l34134P0355P2023J12236M2686B91323
14767D94662K23134J2086l04158J0200P601A82617M96616o4242J3066K42308j07945
14756G62420k03858J30929B99530K28981R043L19710Q9348j44500C97914L51339
14746G49253o1571l0395K99328l00l21708K19440C37210J80095K01820j26329
14736E92796K78768K3547m1449j03596K47355m21883m7177K40333j27583N2293
14726F93404K90631k68413L33362o2194r6704j25475j00873j36970K68315j8292
14716G76791j04579r0976L36904p8270J38008k75452m5351J20691N2758j63265
$$ y = [378357, 649330, 400072, 572004, 572699, 684359, 309235, 486156, 584362, 198639, 597037, 585257, 670091, 913446, 758585, 707744, 373610, 443965, 515988, 628224, 670910, 291323, 494662, 717796, 729882, 425724, 435924, 443525, 182617, 679233, 614991, 628057, 870365, 762420, 558562, 689491, 299530, 528511, 537554, 857264, 946612, 802112, 397914, 749253, 687682, 657287, 956615, 956315, 634607, 854047, 337210, 517305, 719125, 592796, 871564, 895111, 853662, 750066, 997421, 575538, 528361, 768694, 641111, 693404, 984035, 715622, 1048984, 986790, 890086, 764611, 663738, 526768, 795083, 776791, 672212, 581236, 918140, 839870, 977878, 702426, 657075, 777766, 830524, 667259]
14706F67259P2779K3745K82581L9313D62999K31305K42376j82606p5672L29652
14696A008054j93013j8455j82972P2002L00543O5787l23672K50648j95573J41648
14686I24997l29327L10887j46034K51031j5465j82432K25031J31998m9162l48257
14676G73267L52402j53213K25168p0543k22495m623O8391J40607l51113p4576
14666F83272J12747Q5207j21000K54487J04574j82027M64089n44562K33783O9337
14656A159907m75953N15241J10323l14453K23584l10310M07004k46667M6635q7709
14646A027602l5075L24152k78794N8308K6672p7148O93040l09712k11800o8205
14636A149040L47523m32976L02996k14437J31550k54720L53245l0805q945r0805
$$ y = [667259, 740038, 763783, 1046364, 1085677, 462999, 694304, 936680, 754074, 678402, 1008054, 815041, 796586, 613614, 685616, 986159, 1051946, 728274, 978922, 783349, 924997, 595670, 906557, 760523, 1011554, 996089, 813657, 1038688, 1170686, 1121524, 773267, 1125669, 972456, 1197624, 1127081, 904586, 899963, 968354, 1108961, 757848, 683272, 796019, 881226, 760226, 1014713, 1119287, 937260, 1401349, 856787, 1090570, 1159907, 683954, 1199195, 1309518, 995065, 1218649, 908339, 1315343, 1068676, 1115311, 1027602, 992527, 1316679, 1037885, 1096193, 1122865, 1045717, 1738757, 1429045, 1217245, 1149040, 1496563, 1063587, 1366583, 1152146, 1283696, 1028976, 1382221, 1351416, 1342471, 1251666]
14626A251666J95569k32169J61218l3783M10131j99162l65707J63171J08090j03223
14616A355801K88000j38144K79925n11413J84200O7681K75873o12685K83835j63273
14606A309800K99709M48205l85909j28678k48387J04441K32848j08428K33989
14597A757590k13656j31696J80746l17660Q9324K00578J90409j47906o6527K53342
14587A794544j120K03257l31779J70427m2087M8988j0639l03256K48314M6306
14577A822955q665L08796k65608P9591N7373k82729M03527Q292j63834R1170L58850
14566B409718O8055J01067k58378L05901j49045J3862J32037j59339K90547q374
14556B746051L43209J28132L68392K36625K37842Q09620R29613K203691N672369
$$ y = [1251666, 1447235, 1215066, 1376284, 1342501, 1752632, 1553470, 1187763, 1350934, 1459024, 1355801, 1643801, 1505657, 1785582, 1274169, 1458369, 1526050, 1801923, 1189238, 1473073, 1309800, 1609509, 2057714, 1671805, 1543127, 1294740, 1399181, 1632029, 1523601, 1757590, 1543934, 1412238, 1592984, 1275324, 1364648, 1565226, 1755635, 1607729, 1541202, 1794544, 1793424, 1996681, 1664902, 1835329, 1793242, 1842230, 1831591, 1528335, 1776649, 1822955, 1814290, 2123086, 1857478, 1937069, 1994442, 1711713, 2115240, 2123532, 1959698, 2050868, 2409718, 2477773, 2578840, 2320462, 2626363, 2477318, 2491180, 2623217, 2463878, 2754425, 2746051, 3089260, 3217392, 3585784, 3822409, 4060251, 4869871, 5799484, 8003175, 13675544]
14547A3675544J0077555J5403030k21428j5644032A0319161D928596j361179j170205
14539B397212j21556l9447j51503l16772N61500l18474N8981J11746p1152J64773
14529B275308J4929Q9024J19062m3503j70078o4170M83980m11800J00012L35219
14519B727983j80295j7802j43778K51455l02160K82984O1760R019J91661k86173
14509B594654K69061O8237J73808k32538o2562Q4512r8087L08884q3364J74044
14499C196649k09114L95639l08099J66692n1941o5457L33007M997J68802j92910
14489C438265p3964L59634j06120m7723P2900J80742J44028k50356r4055M93320
14479D116671j3245k45146l6786J34204J74445J07011j29325J28125l54762O01679
$$ y = [13675544, 23753099, 39156129, 38934701, 23290669, 10319161, 4928596, 3567417, 2397212, 2275656, 2236209, 2084706, 1767934, 2329434, 2010960, 2069941, 2181687, 2110535, 2275308, 2290237, 2379261, 2498323, 2454820, 2284742, 2220572, 2704552, 2292752, 2392764, 2727983, 2547688, 2529886, 2386108, 2637563, 2335403, 2618387, 2680147, 2689166, 2880827, 2594654, 2863715, 2931952, 3105760, 2873222, 2810660, 2895172, 2797085, 3105969, 3022605, 3196649, 2987535, 3383174, 3075075, 3241767, 3189826, 3124369, 3457376, 3462373, 3631175, 3438265, 3364301, 3723935, 3617815, 3570092, 3642992, 3823734, 3967762, 3717406, 3623351, 4116671, 4103426, 3858280, 3821494, 3955698, 4130143, 4237154, 4107829, 4235954, 3881192, 4482871]
14469D482871l17071L80130r6062R9545K0011j05289k8007K78195J58740L08645
14459E181708q36200J41536M24213J99258j28121J75731Q3979m02399M39385j16559
14449E162531L38127j54257q5591K49348p0959J83239L99571j72249J52037n9951
14439E941846K68396J03657J63301k50502M26962k70986K18471L97508m19369
14430F579284J83313o712J99735J82632l2064n0852N1583N25309O3481q6111K24121
14419G833719n3556L45496K13926j1842J25377J39393j16980N53090l1163k41598
14409H755862M88194p761J95223J97644k28460M81269P7799M52039j10724J61412
14399A0462497N29506M16785l8765j46900M51541l79450N08583J44634Q2219K06458
$$ y = [4482871, 4165800, 4545930, 4449868, 4549413, 4569424, 4464135, 4436128, 4714323, 4873063, 5181708, 4345508, 4487044, 4911257, 5110515, 4982394, 5158125, 5242104, 4839705, 5279090, 5162531, 5500658, 5346401, 5260810, 5510158, 5439199, 5622438, 6022009, 5849760, 6001797, 5941846, 6210242, 6313899, 6477200, 6226698, 6653660, 6382674, 6601145, 6998653, 6579284, 6762597, 6755885, 6955620, 7138252, 7106188, 7055336, 7106919, 7632228, 7695709, 7609598, 7833719, 7780163, 8125659, 8339585, 8327743, 8453120, 8592513, 8475533, 9028623, 8997460, 8755862, 9244056, 9236295, 9431518, 9629162, 9400702, 9881971, 9959770, 10411809, 10301085, 10462497, 10992003, 11408788, 11370023, 11223123, 11674664, 11295214, 11803797, 11948431, 12030650, 12237108]
14389A2237108O28669n229J72002J43574L39694J42708N39652J77737J28590J31945
14379A4636450L46985R9138O41084M11692N4260M24898K46579L83589L90948O22675
14369A8258298K71628M11326K9014Q21081M07476j1009O23109L64977K34441P88553
14359B2198894L44952O59983O69409L14996N43200P70907K02346O48582M61615
14350B6814884Q05461Q23934Q68849J00612J367538R56547O83127N38934J304576
14341C4264462P97530J090093J029921O28163J081126J218524J339965R79913
14333D2429697J377597J323791J420924J324050J449624J985678J201250K122813
14325E4635424J613378K193756J447812K645177J662711K840987K101017K237129
$$ y = [12237108, 12865777, 12860548, 13032550, 13176124, 13515818, 13658526, 14198178, 14375915, 14504505, 14636450, 14983435, 15082573, 15723657, 16135349, 16189609, 16614507, 16861086, 17244675, 17635623, 18258298, 18529926, 18941252, 18970266, 19791347, 20198823, 20187814, 20810923, 21175900, 21410341, 22198894, 22543846, 23203829, 23873238, 24188234, 24731434, 25502341, 25704687, 26353269, 26814884, 27620345, 28444279, 29313128, 29413740, 30781278, 31737825, 32420952, 32959886, 34264462, 35061992, 36152085, 37182006, 37810169, 38891295, 40109819, 41449784, 42429697, 43807294, 45131085, 46552009, 47876059, 49325683, 51311361, 52512611, 54635424, 56248802, 58442558, 59890370, 62535547, 64198258, 67039245, 69140262, 71377391]
14317G1377391K919126L054618K805212L209626L048564L610305L611021L697598
14309I7333461M671179L886815M655509N014601N286469N741918N372330O401638
14301A38363920O429039P038681P310018P956212Q455867Q797801R305580R962446
14293B03619564J0171575J1246327J1914433J2409126J2908437J3405306J4184369
14286B89859137J4453442J5079306J5478703J5287988J5324192J5335457J4521184
14279C95339409J4115512J3242322J2010359J0898432R283256P134257L922638
14272D65946185j816861l828361j603255l918494l118217m513477p709547r472221
14264D29965752r987373j1977095j3508289j4213708j5280312j5870839j5886615
$$ y = [71377391, 74296517, 77351135, 80156347, 83365973, 86414537, 90024842, 93635863, 97333461, 102004640, 105891455, 110546964, 115561565, 120848034, 126589952, 131962282, 138363920, 144792959, 151831640, 159141658, 167097870, 175553737, 184351538, 193657118, 203619564, 213791139, 225037466, 236951899, 249361025, 262269462, 275674768, 289859137, 304312579, 319391885, 334870588, 350158576, 365482768, 380818225, 395339409, 409454921, 422697243, 434707602, 445606034, 454889290, 462023547, 465946185, 464129324, 460300963, 458697708, 454779214, 451660997, 447147520, 439437973, 429965752, 419978379, 408001284, 394492995, 380279287, 364998975, 349128136, 333241521]
14257C33241521j5615488j4880115j4394896j3878693j3625288j2862947j2268659
14250B35715435j1874673j1005140j0597828r722684r469813q863730p971712
14243A66209855p923789p432799p065881o432531o170218n386733n193496n436608
14235A15167800n036206m560061m410737l834215l458939m161224l419756l372366
14227H2914296l194448k947536l087121k312860k837281k249666k461499j639947
14219F2183938k335108j961907j670060k048947j921449j049251j499726j725078
14211D7972412j377163j836439j047840j066112n55556j563063j073786j144007
14203C8308446j093980j057581p60360r35495q13302q96725r39805q48578p75337
$$ y = [333241521, 317626033, 302745918, 288351022, 274472329, 260847041, 247984094, 235715435, 223840762, 212835622, 202237794, 192515110, 183045297, 174181567, 166209855, 158286066, 150853267, 143787386, 137354855, 131184637, 125797904, 120604408, 115167800, 110131594, 105571533, 101160796, 97326581, 93867642, 89706418, 86286662, 82914296, 79719848, 76772312, 73685191, 71372331, 68535050, 66285384, 63823885, 62183938, 59848830, 57886923, 56216863, 54167916, 52246467, 51197216, 49697490, 47972412, 46595249, 44758810, 43710970, 42644858, 42089302, 40526239, 39452453, 38308446, 37214466, 36156885, 35396525, 34461030, 33647728, 32751003, 31811198, 30962620, 30187283]
14194C0187283r07361m15903q75410q79918o28630o36635j03547j015925o17994
14185B4105960j22076q03923m93203m49737k38354r05490m69124j65540l44203
14176B0114310m71272l44455m90278k89564j06935o98018n08546k89699k07418
14167A6708125k88181P7523n54932j68198l39043k21747m23544o37627M10663
14158A4563039m99093k97265n8156m61893j55164l57674k62891K15073l17218
14149A2368758o34222J16426l58249Q1013k27306n99152J78693J20978m30238
14140A0616701K0022n19230J916j61490J13683m97177J07101j85829l28825O832
14130I173704R7518r0054j97139m58686J68733m16610P6109J31471m21006j52286
$$ y = [30187283, 29279922, 28864019, 27988609, 27108691, 26480061, 25843426, 25739879, 24723954, 24105960, 23983884, 23179961, 22686758, 22237021, 21998667, 21093177, 20624053, 20458513, 20114310, 19643038, 19298583, 18808305, 18518741, 18411806, 17713788, 17205242, 16915543, 16708125, 16419944, 16497467, 15942535, 15774337, 15435294, 15213547, 14790003, 14152376, 14563039, 14063946, 13766681, 13708525, 13246632, 13091468, 12733794, 12470903, 12685976, 12368758, 11734536, 11850962, 11492713, 11573726, 11346420, 10747268, 10925961, 11046939, 10616701, 10636723, 10117493, 10119409, 9957919, 10071602, 9574425, 9681526, 9495697, 9166872, 9173704, 9271222, 9181168, 8984029, 8525343, 8694076, 8277466, 8353575, 8485046, 8064040, 7911754]
14120G911754j01896j0797Q1845p1847k33879r4447k26346j00339k02373J53044
14110G104719j41729l43482M7158Q2584J92421m01683m8722m8267j33495R974
14100F319478n50899L16443Q0574J0603l41700n0496m1329j18371M11203n20596
14090E514910L03949k69575l661J22131k27712m09702J82586p8541K68583l74244
14080E028724J01737j16190k2130j68614J53739k48362j49264k999o2738k34495
14070D279408p5029l7418K61598r0887M20462n11408R7624j05042m5775N7485
14060D251018j58651l9496O7032L64858l15729q9718j67137r6435K8656k11309
14050C633089J47176l86787K24672M2756n9211k5846j45821j52470J23995k82644
$$ y = [7911754, 7809858, 7799061, 7880906, 7809059, 7575180, 7480733, 7254387, 7154048, 6951675, 7104719, 6962990, 6619508, 6666666, 6749250, 6941671, 6539988, 6491266, 6442999, 6309504, 6319478, 5768579, 6085022, 6165596, 6176199, 5834499, 5784003, 5742674, 5624303, 6035506, 5514910, 5818859, 5549284, 5545623, 5667754, 5440042, 5030340, 5212926, 5134385, 5402968, 5028724, 5130461, 5014271, 4992141, 4823527, 4977266, 4728904, 4579640, 4576641, 4513903, 4279408, 4204379, 4166961, 4428559, 4337672, 4758134, 4246726, 4344350, 4239308, 4193533, 4251018, 4092367, 4052871, 4119903, 4484761, 4169032, 4079314, 3912177, 3815742, 3844398, 3633089, 3780265, 3393478, 3618150, 3660906, 3601695, 3575849, 3430028, 3277558, 3401553, 3118909]
14040C118909M49218k65208K56934k96967j92227K83293k60605K046o4834j3886
14030C016673L35277l83424l995J48375k11447J95021j3046l62400K71370o59116
14020B333288M49920k78660Q3272P5761M0311K9417l29415j02124L34133j52181
14010B483722J923p395k18526J45449K8717m2371O2211j85324p5855L0733k23495
13999A999789K32164k47767J81118m0959Q2032L67876r2350n22512O96982K28976
13989B885349R40101M014306Q999061J5907606O927652j3065998j2311572n561297
13981H735208k328844r32415j169737r24263O2902l17720p6370N2420n0951m16353
13971B633877J02010k10438N1502l0904M2292p0093m09946L17724j85774p9682
$$ y = [3118909, 3568127, 3302919, 3559853, 3262886, 3070659, 3353952, 3093347, 3095393, 3030559, 3016673, 3351950, 2968526, 2964531, 3112906, 2901459, 3096480, 3083434, 2721034, 2992404, 2333288, 2783208, 2504548, 2587820, 2663581, 2703892, 2733309, 2403894, 2301770, 2635903, 2483722, 2485645, 2478250, 2259724, 2405173, 2433890, 2391519, 2453730, 2268406, 2192551, 2223284, 1999789, 2231953, 1984186, 2165304, 2124345, 2206377, 2574253, 2481903, 1959391, 2656373, 2885349, 3825450, 7839756, 16838817, 32746423, 39674075, 26608077, 14296505, 8735208, 6406364, 5473949, 4304212, 3379949, 3442851, 3125131, 3048761, 3101181, 3050230, 2633877, 2735887, 2525449, 2576951, 2546047, 2588339, 2518246, 2108300, 2426024, 2240250, 2160568]
13961B160568j56014M19206l7139k28779q0423j50808M14898m12437M5318J19432
13951B093822k30269j42941O81300l78986R3172j02257R4318l66146j30900J67537
13941A778650J01513n01175O53821l22080P0531K7841k44334q8303P3848L4578
13931A584890K81487l1419R778j04693k86368K38310O8462m6168k17928K05591
13921A701942k89348K13613k14866L67383k17675j01875k392K71212m44311K39355
13911A523038j44901j60940N4440N8111p3881N0771P7489L7875k92219M10346
13901A540129l42046O009J27071J58978m2288k19255J99332l9699m218k65711
13891A118302j20090J22205K58830j18919n590Q2146o4769L1752K23558l50933
$$ y = [2160568, 2004554, 2423760, 2386621, 2157842, 2077419, 1926611, 2341509, 1929072, 1974390, 2093822, 1863553, 1720612, 2401912, 2022926, 2116098, 2013841, 2108159, 1742013, 1611113, 1778650, 1880163, 1378988, 2032809, 1710729, 1781260, 1809101, 1564767, 1476464, 1550312, 1584890, 1866377, 1834958, 1844736, 1740043, 1453675, 1691985, 1760447, 1714279, 1496351, 1701942, 1412594, 1626207, 1411341, 1778724, 1561049, 1459174, 1456782, 1727994, 1283683, 1523038, 1378137, 1217197, 1271637, 1329748, 1255867, 1306638, 1384127, 1422002, 1129783, 1540129, 1198083, 1204092, 1331163, 1490141, 1447853, 1228598, 1427930, 1388231, 1384013, 1118302, 998212, 1120417, 1379247, 1260328, 1254738, 1336884, 1272115, 1303867, 1527425, 1176492]
13881A176492J51886N2537O0210j364m44887N98975k24964k11983R773J59041
13871A325716n1520p6625J15700j35536J34892m7809k34137p7622M7453J60682
13861A161194k18343j4835K55709K614p6394j44134M44251j20013J11915k0262
13851A381702m19929L1683J81982J11323m43804J72975o7609l3718J38344K00460
13841A253409k41875p2041L68962k48793o2325L0312P5037R2732k0721n00245
13831F74452M04039k54880J34861L15169k9055n29370K86667J9842n5927J57686
13821A123484L99j69323J92991k70481m2928j20735K66309m82808K35608K33184
13811I65700L8428j49563j98547j8875K61346k48846K80027j86723N03402k53595
$$ y = [1176492, 1328378, 1380915, 1441125, 1439761, 994874, 1593849, 1368885, 1156902, 1166675, 1325716, 1274196, 1197571, 1313271, 1177735, 1312627, 1264818, 1030681, 953059, 1000512, 1161194, 942851, 928016, 1183725, 1186339, 1109945, 965811, 1410062, 1290049, 1401964, 1381702, 961773, 993456, 1175438, 1286761, 842957, 1015932, 948323, 914605, 1052949, 1253409, 1011534, 939493, 1308455, 1059662, 997337, 1027649, 1102686, 1195418, 1174697, 674452, 1078491, 823611, 958472, 1273641, 1244586, 715216, 1001883, 1021725, 965798, 1123484, 1123883, 954560, 1147551, 877070, 834142, 713407, 979716, 496908, 732516, 965700, 1004128, 854565, 656018, 637143, 898489, 649643, 929670, 742947, 1246349, 992754]
13801I92754j27674q1437K5670Q8469q480m8004K75054k07899m40103K36437O0803
13790G65590J48440m8187j67299O808K46313k94227K64926m26430r2519N10101
13780I13516k23726r5142L99639m25391K6151J47650R1560l61596k10J92657O9086
13769G34194K0558k87499J37661K81512j5053l7758k5117O4828j42499j83599
13759E47228Q1159j98688J01643J51408P533Q7215k80363J97560J80663l42934
13749E32424L34601l41212J571J28320j06590L97332l36734M5292j53222j1034
13739D90748L11450C53673M1512J3468K20788O7363J86155m04622L7819L35743
13729H51899k87497j0143Q5977M3075J6238j40402L22591k91816K18884l47810
$$ y = [992754, 865080, 783643, 809313, 897782, 889302, 841298, 1116352, 908453, 468350, 704787, 765590, 914030, 865843, 698544, 705352, 951665, 657438, 922364, 495934, 403415, 913516, 689790, 594648, 994287, 568896, 595047, 742697, 834257, 472661, 472451, 665108, 734194, 754752, 467253, 604914, 886426, 871373, 833615, 808498, 873326, 730827, 547228, 628387, 429699, 531342, 682750, 690283, 777498, 497135, 694695, 875358, 532424, 867025, 525813, 527384, 655704, 549114, 946446, 609712, 655004, 501782, 490748, 802198, 353673, 395185, 408653, 629441, 696804, 882959, 478337, 516156, 851899, 564402, 554259, 640236, 683311, 699549, 559147, 881738, 589922, 808806, 460996]
13719D60996l9484r6622N51039k88102J42522K28285l52193j11715j67609N3945
13709C81062K39394O4225q6504J2604j17191d5525G18539q6752M7094k70543j68063
13698B40275Q6624K50026j43816M44072m14158K72585j55258J60131r4186J1238
13688F57533N0714k45959J94742l08232L58231j14215B55393M65833C29090J62538
13678D91628j91572L10290A48484M21305B27695L79318j41566J8707m1578Q6254
13668E28830R818J6877K45734C88265L16228k72591j56945K41330A11989M28393
13658E40382K33389B72759K99773N7772B43762L18512A77784K19073J60735k46271
13648C11321j24898C9497N16117j37460K28011j48282q0403j56036K56426j16148
$$ y = [460996, 421512, 324890, 875929, 587827, 730349, 958634, 606441, 494726, 327117, 381062, 620456, 684681, 598177, 610781, 493590, -45525, 718539, 631787, 678881, 408338, 240275, 326899, 576925, 433109, 877181, 463023, 735608, 580350, 740481, 646295, 657533, 708247, 462288, 657030, 348798, 707029, 592814, 255393, 721226, 329090, 491628, 300056, 610346, 148484, 569789, 227695, 607013, 465447, 484154, 442576, 528830, 538648, 555525, 801259, 388265, 704493, 431902, 274957, 516287, 111989, 540382, 773771, 272759, 572532, 630304, 243762, 562274, 177784, 396857, 557592, 311321, 186423, 39497, 555614, 418154, 646165, 497883, 417480, 261444, 517870, 401722]
13638D01722K06977n1283N4436j69682K07852j93336B17824L15776O9916j04154
13628D99362L5935B62826J55042o3714j09607J39798J758F5059N98883k38400
13618D25542A20137K41222F7265L38220K87787B47478m525k5460p0891K89579
13608D36181j18096j2176k3468K48956A07394M71847j29697j78667O9418J14719
13598D55014j98334N5775L21697K920m2893A84175K44788O0639B17881K44461
13588D62342A68059O5955M9302A12596L54227j3193B02546L18882A79301K77445
13578D56746j72879K17573O7902A95309O5172j05222L15748j20957K2589d7362
13567D10056A45204R7423l958L50680A68608L02328L2023j21097j90071N09720
$$ y = [401722, 608699, 557416, 611852, 442170, 650022, 456686, 217824, 533600, 603516, 499362, 535297, 262826, 417868, 354154, 244547, 384345, 386103, 65059, 663942, 425542, 120137, 361359, 67265, 405485, 693272, 247478, 242953, 217493, 146602, 436181, 318085, 305909, 282441, 531397, 107394, 579241, 449544, 270877, 340295, 455014, 256680, 312455, 634152, 637072, 594179, 184175, 428963, 489602, 217881, 462342, 168059, 234014, 283316, 112596, 466823, 453630, 202546, 521428, 179301, 456746, 283867, 501440, 569342, 195309, 260481, 155259, 471007, 350050, 372639, -47362, 410056, 145204, 242627, 238669, 589349, 168608, 470936, 502959, 381862, 191791, 701511]
13557G01511B02569M44951B57446K08303n2087N1296k28747A13732L72309B00934
13546C60657q3693J56384j66700F1132L26795q4557J86047A06213J47891J9966
13536B74070j11955J42000j17849J86262J8463j1705p2718L9585j18624J54513
13526C82042A69226K46360j49684A21959N7063R0191Q5719A05026M28500j66876
13516C66650J91925A83420H47L29512A42024N21166k01003a57164F2522J31470
13506A93992p7381K27640L0716J14403A80680n8100K66147B3700J7411M01528
13496D42639j90933F6622K11569H3663L4660b0641C30322A10486R0995J80902
13486C82383J21013A80704J08145K54174E878J31116L78903E8357J26104K15930
$$ y = [701511, 202569, 647520, 257446, 465749, 413662, 464958, 236211, 113732, 486041, 200934, 360657, 276964, 433348, 266648, 61132, 387927, 303370, 489417, 106213, 254104, 274070, 162115, 304115, 186266, 372528, 390991, 379286, 306568, 346153, 227529, 382042, 169226, 415586, 265902, 121959, 179022, 269213, 354932, 105026, 533526, 366650, 558575, 183420, 847, 330359, 142024, 663190, 462187, -157164, 62522, 193992, 116611, 344251, 374967, 489370, 180680, 122580, 388727, 23700, 41111, 442639, 251706, 66622, 278191, 83663, 118323, -20641, 330322, 110486, 201481, 382383, 503396, 180704, 288849, 543023, 5878, 136994, 515897, 58357, 184461, 400391]
13476D00391P0201k24643K22643K08263j62769j39744A36580N8890K21330j56976
13466B59824A14846D1493J93377K64468h9487B74062C5793L63599o8763q2989
13456B47640h1080D43344j91221j17622P9733m9242J81080j72343E7563K22443
13446B80006J07041q4166M87077k97385k27638J66920A07430L85780j25242A46427
13435A80733R6789j9625J2147o7821K5330f9290C1945J48873J05662J14989o9598
13424C31871A5778b45440B81589D6310L77859J46297j97011r7812J75002A66529
13413G3229Q6129p6298N2103k4619O0948A4782J01759M40116j8651B51635d9296
13401B0055L49389D8770d8145A31149J28746a939B66789K091F9197M34322j35831
$$ y = [400391, 470592, 245949, 468592, 676855, 514086, 374342, 136580, 195470, 416800, 259824, 114846, 41493, 234870, 499338, -89487, 274062, 35793, 399392, 330629, 247640, -81080, 443344, 252123, 134501, 214234, 164992, 346072, 173729, 57563, 280006, 387047, 302881, 789958, 492573, 264935, 431855, 107430, 493210, 367968, 146427, 180733, 277522, 257897, 270044, 202223, 227553, -69290, 31945, 180818, 286480, 401469, 331871, 15778, -245440, 281589, 46310, 424169, 570466, 373455, 275643, 450645, 166529, 73229, 159358, 83060, 135163, 110544, 171492, 14782, 116541, 556657, 538006, 251635, -49296, 20055, 369444, 48770, -48145, 131149, 259895, -1939, 266789, 268880, 69197, 503519, 367688]
13390C67688j18312A12199k2482i8328A1388a07145E406L54312a1245A04642K95111
13379C99753j91152J13930g753q6748B61312J52569A52144M7170k5921L10301
13369D83694C9343L18290m5788L5442A34961E1739b15842B40414J0776P8682J9522
13358C49394A0368K65616R5966c6452A28341k9802J29262p0938J90798A59362
13347A92595k1484Q8145L45403j61822l8186d7920C87468A78306p877L46799d4700
13335A52918L20544p1251j21365A27106P1211j0907E6211M10978k14319A04753
13324A96770R3818r2800g2020a5140F00581f4497B99109j6147J78511j45625m8880
13313B66968K89233G8937K95626p3619j01677E2289L5794N5537L6817l3973J51060
$$ y = [367688, 249376, 112199, 89717, -98328, 11388, -107145, 5406, 359718, -11245, 104642, 399753, 208601, 322531, -7753, -94501, 261312, 413881, 152144, 199314, 173393, 483694, 39343, 357633, 311845, 347287, 134961, 51739, -215842, 240414, 251190, 329872, 349394, 10368, 275984, 371950, -36452, 128341, 98539, 227801, 156863, 347661, 159362, 192595, 171111, 259256, 604659, 442837, 404651, -47920, 387468, 178306, 170429, 517228, -44700, 152918, 473462, 402211, 280846, 127106, 198317, 187410, 56211, 467189, 252870, 104753, 196770, 290588, 197788, -72020, -15140, 600581, -64497, 299109, 282962, 461473, 315848, 266968, 556201, 78937, 374563, 300944, 199267, 52289, 88083, 143620, 180437, 146464, 297524]
13302B97524q5080n0989F9364a04636A61402n6367L18319A75766G5303J93660
13292B68963A1713Q3141a49873H4792L93125C1354g5608A13145J83712J5312A01325
13280c8040D20944p4673j6079q5842l9960a8637B11440K63670A90322p0155J85438
13269C05605p6454H0709K15677j43114d7638B81940j34005d2576k5209B55578
13258c8677C04271A33000l0698b04741B33966k6246q1715B2728M66747j91355
13248B98120c2108C84292A52457b04995I1681R0810e3096C5880K44113d3141n6127
13237i9268G4854K72708A17610j8941J82703c03638A53938A3746K8205K09628
13227B51579A24234L4597o5954l3272K59955f3421A50858j0320n8930k8435J37502
$$ y = [297524, 212444, 161455, 69364, -104636, 161402, 105035, 423354, 175766, 75303, 268963, 11713, 94854, -149873, 84792, 477917, 31354, -75608, 113145, 296857, 312169, 101325, -38040, 420944, 346271, 330192, 244350, 204390, -18637, 211440, 475110, 190322, 120167, 305605, 229151, 80709, 296386, 153272, -47638, 281940, 147935, -42576, -67785, 255578, -38677, 304271, 133000, 102302, -204741, 233966, 207720, 126005, 22728, 489475, 298120, -32108, 384292, 152457, -204995, 91681, 182491, -53096, 35880, 279993, -43141, -99268, 74854, 347562, 117610, 98669, 281372, -303638, 153938, 13746, 41951, 251579, 124234, 158831, 92877, 59605, 319560, -63421, 150858, 140538, 81608, 53173, 190675]
13216A90675M7956J97245f8858B1358K09494K67094e0649L347A06070k9382j6584
13205F0104L94254j68801r4194b060A70210J1783K38885A3659J76278H0016K93626
13194C73642j9396a42767a7078A03672a16412H1106a7212E5172f7307E1746n83
13183E1163J64117j5787h5412I1580l6608a51029I9a28474F2297e8197B99646
13171A70654J77911C2315g8207r579E1284a46051A71293o8114J73158C7539O1590
13160I9129a43140A34250b24877D8232L8841h2600E93629A31566J63644J0498
13150C05708a97736B1820K15928j14893K60989a79814B85054p9773a62438H2566
13139B56460B7633J40253B3950L57622q1714G0725K0673Q458J83411p7306N255
$$ y = [190675, 238631, 435876, -68858, 21358, 230852, 497946, -50649, -47302, 106070, 76688, 60104, 454358, 285557, 191363, -2060, 170210, 181993, 420878, 13659, 189937, 80016, 373642, 354246, -142767, -17078, 103672, -116412, 81106, -17212, 55172, -67307, 51746, 51163, 215280, 199493, -85412, 91580, 54972, -151029, 99, -128474, 62297, -58197, 299646, 170654, 348565, 32315, -78207, -87786, 51284, -146051, 171293, 103179, 276337, 37539, 99129, -143140, 134250, -224877, 48232, 87073, -82600, 593629, 131566, 295210, 305708, -197736, 21820, 237748, 122855, 383844, -179814, 285054, 205281, -162438, 82566, 256460, 27633, 167886, 23950, 381572, 299858, 70725, 91398, 99856, 283267, 205961, 211216]
13128B11216G049R5563B3565J13503a48501I4118a26291d6783D7252J58858B093
13116A35790a88603A1511L23653C8986L16487A9564M2556P7975L09760A52974
13105A3613K60532b5601F8403b3265G9312a87262P3163F41078B295M27902g0989
13093a52064A98062j0095b2535H8898N9404a37926A83867b14556H7252c15408
13082b50114F9615J65008K8920J54022A3370Q5585h1408C0872J18452m5281P0515
13071A74558n6184Q7833b71490B84320B2535J18853J34711J20488j28334A7391
13060A98152M1672q8003a0326A56255K41556j75541r9141K13775a74429A7574
13049B02023q0837M8863j5281J15404h9015B60597q0013B057K05463q9773a10629
$$ y = [211216, 7049, 102612, 23565, 137068, -148501, 94118, -126291, -46783, 47252, 206110, 2093, 135790, -188603, 11511, 335164, 38986, 355473, 19564, 62120, 140095, 449855, 152974, 13613, 274145, -25601, 68403, -23265, 79312, -187262, -114099, 641078, 2295, 430197, -70989, -152064, 198062, 187967, -22535, 88898, 148302, -137926, 183867, -214556, 87252, -315408, -250114, 69615, 234623, 263543, 417565, 13370, 98955, -81408, 30872, 149324, 104043, 174558, 118374, 206207, -271490, 284320, 22535, 141388, 276099, 396587, 268253, 17391, 198152, 239824, 151821, -10326, 156255, 397811, 222270, 123129, 336904, -174429, 17574, 202023, 121186, 170049, 154768, 270172, -89015, 260597, 180584, 2057, 207520, 117747, -110629]
13037F076M1169M24161A36484a30397D05L44751A40527a64525h0100A73274E9174
13025a56783b8032A40247J36434A2394a42459e6685j6446i779B98535j39135L5981
13014A95381N9007M6389A20927N3447p5152J08859K14040A90088A3944L70945
13004C84889l7858F4641J10515a94176B54334a36889L1142A06071L9971i1811
12993A37505K4190b3110C4408b6883A78565E1980P1496J59969a52479d6058j05007
12982a51065B05562J24825r9895C1047C244K29N1102b09299f761F3424a38632
12970a61491A01006K104C0878i6942C25708j9333c77248A51231E9739Q6861a22614
12958a13536I5443M917A6880e5603C5216a17188c3402k15440g3528C26271D6261
$$ y = [6076, 47245, 471406, 136484, -130397, 405, 345156, 140527, -164525, -80100, 173274, 59174, -156783, -28032, 140247, 276681, 12394, -142459, -56685, -73131, -9779, 298535, 159400, 195381, 254388, 300777, 120927, 174374, 99222, 208081, 422121, 190088, 13944, 384889, 347031, 64641, 175156, -194176, 254334, -136889, -105747, 106071, 146042, -91811, 137505, 161695, -23110, 34408, -26883, 178565, 51980, 123476, 283445, -152479, -46058, -151065, 205562, 330387, 230492, 31047, 3244, 3473, 54575, -209299, -6761, 63424, -138632, -161491, 101006, 103110, 30878, -96942, 325708, 306375, -377248, 151231, 59739, 146600, -122614, -113536, 95443, 100360, 16880, -55603, 35216, -117188, -33402, -248842, -73528, 326271, 46261]
12946A58790G8977g8944A894K25092C4460K16300a5466n4914l02737a74865a8462
12934C85756j25801b55212A98036N498G6511h4704M723A25454i7711c720H8142
12922C14938m3656d580k67158O0921L1668A56315n5838J02717a03254F7065b21766
12910A21676P9253O9690E3765a98251A60620E711L50253j41814a45393j32307
12900b77700N4560p3796A76762a52760g3242l5666o1353D03167F0467a00879M0540
12889f0339o9248A6231L22217I4447K4165o854K4720K8b9578C85556H1363h3199
12876A87497D8491M23740B12386c9640B0399J48149K29138c0502j84289A79350
12865A56535J41270k3072H7562P0739n3645b0463d832o898C2025N9182a73715
$$ y = [158790, 78977, -78944, 1894, 226986, 34460, 250760, -15466, -70380, -373117, -174865, -18462, 385756, 259955, -255212, 198036, 203534, 76511, -84704, -79981, 125454, -97711, -3720, 88142, 314938, 271282, -4580, -271738, -210817, -179149, 156315, 100477, 203194, -103254, 67065, -221766, 121676, 200929, 270619, 53765, -198251, 160620, 5711, 355964, 214150, -145393, -277700, -223140, -296936, 176762, -152760, -73242, -108908, -170261, 403167, 60467, -100879, -60339, -129587, 16231, 338448, 94447, 118612, 111758, 136478, 136506, -29578, 385556, 81363, -83199, 187497, 48491, 472231, 212386, -39640, 20399, 168548, 397686, -30502, -214791, 179350, 156535, 297805, 274733, 87562, 158301, 104656, -20463, -4832, -11730, 32025, 91207, -173715]
12853H2391b20074B93575a66279Q3030F0343c08970G151a07207A40442d1724j66938
12842b08662j86633D27260c0027A43229k7584c9633A17729R1584A7231c42632
12831a28278A86183E2304J21668c1192k43146j67367L3303A66828R912K44437
12821D21177H3847b30647A51665J01534f3801b3945l77115H9648J18891c17168
12810B73894a15462k5931q014B29881J299H9068h7152k22657b7581j7256F2158
12798C07961b0502A59869c0148C7167d9577B86743c9936A53389c07613J51875
12788a55738N2651E918J8114K11305j17212J2959a68913C08435p6676e9363A2452
12776a50591A290Q9735D4872N5640J24637P3781O7690f35591a38214G0813M9125
$$ y = [82391, -220074, 293575, -166279, -83249, 60343, -308970, 7151, -107207, 140442, -41724, -208662, -395295, 427260, -30027, 143229, 115645, -39633, 117729, 209313, 17231, -342632, -128278, 186183, 52304, 173972, -31192, -274338, -441705, -408402, 166828, 176740, 421177, 83847, -230647, 151665, 253199, -63801, -23945, -401060, 89648, 208539, -317168, 273894, -115462, -141393, -149407, 229881, 231180, 89068, -87152, -309809, -27581, -44837, 62158, 307961, -20502, 159869, -30148, 37167, -49577, 286743, -39936, 153389, -307613, -155738, -103087, 5918, 24032, 235337, 118125, 131084, -168913, 308435, 231759, -59363, 12452, -150591, 1290, 91025, 44872, 100512, 225149, 298930, 366620, -635591, -138214, 70813, 119938]
12765A19938g6564o8403C4831q062b771B61530J3122d8765r7837K9645K7790E8355
12752e8755K0415C20489e8783n110B45877a62061a37B23036k4624c57559B88776
12740b01723A86836L4170l3634p698a0164r5181A08330M1631L57264B3049J02487
12729A25536e7712B07237F7033l2920e6021G5215e2631B71260d7979A64957a28246
12717G7758G8a69819A11858D3908e2630H8758d0859I6054J26851K21363j22531
12706C21737n3382O0624j43840R5608H5332M27578j50938I4896c16799C1466L59971
12695C91437A7836b25723a1060A21558J56050N9812g4292C18178p0941C0592K20690
12684B51282j10597j2614L8833A0271L06052J5684A37001i4939M2117I1100c7831
$$ y = [119938, -76564, -144967, 34831, 26769, -2771, 261530, 274652, -48765, -146602, -116957, -89167, 58355, -58755, -38340, 320489, -58783, -63893, 245877, -162061, -137, 223036, 198412, -357559, 288776, -201723, 186836, 221006, 187372, 179674, -10164, -105345, 108330, 149961, 507225, 23049, 125536, -57712, 207237, 67033, 34113, -56021, 75215, -52631, 271260, -47979, 164957, -128246, 77758, 78, -169819, 111858, 43908, -52630, 88758, -40859, 96054, 222905, 444268, 321737, 268355, 328979, 185139, 280747, 85332, 512910, 361972, 94896, -316799, 31466, 391437, 17836, -225723, -11060, 121558, 277608, 337420, -74292, 318178, 247237, 30592, 251282, 140685, 128071, 166904, 10271, 316323, 332007, 137001, -94939, -52822, 91100, -37831]
12672A02516j5466Q7188g7405F7755M8606f6097B41350E1307c18302e055A49593
12660c47305C35231g0277G081a55610A69232n8320A0989R4698J40001R1580I7079
12648A58240a91517A32818K4801c46048J21630B49829J8648j00297F1216Q4874
12638A46090h4818B38041i3887B64769O142a79157Q933A32333R7379j13932R4893
12627B10673R9457O9481E2691R21L78377p4151h0532E5655a96982E1984i1074
12615a4334B10238H4139a07094J8757I0383e6230n8928A30877c59105F8534L14160
12604C82694b13289J03504a5858A15555J53369K7894a8360D9755a06811B0677
12593B27729R5817P9954I5698k714b1780k40487f4549A55090b3137A74562f5598
$$ y = [102516, 87050, 174238, -77405, 67755, 116361, -66097, 241350, 51307, -318302, -5055, 149593, -347305, 335231, -70277, 7081, -155610, 169232, 110912, 10989, 105687, 245688, 337268, 97079, 158240, -191517, 132818, 157619, -346048, -224418, 249829, 268477, 168180, 61216, 146090, -84818, 238041, -93887, 264769, 270911, -179157, -170224, 132333, 229712, 115780, 210673, 310130, 379611, 52691, 53612, 431989, 357838, -80532, 55655, -196982, 51984, -91074, -14334, 210238, 84139, -107094, -88337, 90383, -56230, -115158, 130877, -359105, 68534, 382694, -213289, -109785, -15858, 115555, 268924, 296818, -18360, 49755, -106811, 20677, 227729, 323546, 403500, 95698, 92984, -21780, -262267, -64549, 155090, -23137, 174562, -65598]
12581B78839c3511k7061B915c86935J36038C49065F6646N3740J46942j15688a31917
12569b7330Q246B4459J9566J11368P9874J12707A25974L482K1258b865I6166c26103
12556b73764B18558q1903L9007b6143j44666D813J041J24131a27776E1511a69996
12544a20706A91630k2465h0165r5022B96697b53912I1805b10857j98632A41319
12533A39487M8180K45224i0764c2929j02332D58191f7062B45587m2071A7716d9124
12521b22977b3291A19605B0839b81690B01803a19940k60081c4993A521K5138J18512
12510A45171a36715B72896a4442F0101P4986a30837K9720B50493F667R1839M7227
12499A45733a68601B30834b9128k69432J44199C07042E2515Q891K37598C2437
$$ y = [278839, -33511, -60572, 2915, -386935, -250897, 349065, 66646, 120386, 267328, 151640, -131917, -27330, -19084, 24459, 44025, 155393, 235267, 347974, 125974, 129456, 150714, -2865, 96166, -326103, -273764, 218558, 136655, 175662, -26143, -170809, 4813, 5854, 129985, -127776, 51511, -169996, -120706, 191630, 169165, -80165, -175187, 296697, -253912, 91805, -210857, -409489, 141319, 139487, 187667, 432891, -90764, -32929, -135261, 458191, -67062, 245587, 203516, 17716, -49124, -222977, -23291, 119605, 20839, -281690, 201803, -119940, -380021, -34993, 1521, 26659, 145171, -136715, 272896, -14442, 60101, 135087, -130837, -101117, 250493, 6667, 98506, 145733, -168601, 230834, -29128, -298560, -154361, 307042, 52515, 61406, 299004, 32437]
12488a77798g1167B21045D771e1976H11a50635b0563C23860j3843a5440j7527
12477c2967E5476Q3225d0197F4156a97889B25332p4306e97854f7282A06953c0750
12465C3722a50781F3807a48593g2201H1607a21243A92802C6200J4161a85693C22057
12453a13886j55127B7982a38187G8659c29393E5876L6671C0221J88547b6895j23311
12442a50206j48844E1400L8873i3070B18008F661J68643i0249A11654a56978j73993
12431c30971M480h5516B13615c25228f2219A32894H565M1159J5010f0203H4611
12419a7747B95089C6214a6459p4788L900k02516B08286B0685K58284c9649A61297
12407D6742b13522C3279b23255A34208h0769j62353R8691B73097a67855o4524
$$ y = [-177798, -71167, 221045, 4771, -51976, 811, -150635, -20563, 323860, 310017, -15440, -32967, 55476, 138701, -40197, 64156, -197889, 225332, 151026, -597854, -67282, 106953, -30750, 33722, -150781, 63807, -148593, -72201, 81607, -121243, 192802, 36200, 50361, -185693, 322057, -113886, -269013, 27982, -138187, 78659, -329393, 55876, 92547, 30221, 218768, -26895, -150206, -299050, 51400, 90273, -93070, 218008, 6661, 175304, -90249, 111654, -156978, -330971, -326491, -85516, 213615, -325228, -62219, 132894, 8565, 49724, 64734, -60203, 84611, -17747, 295089, 36214, -16459, -91247, -87347, -289863, 208286, 20685, 278969, -39649, 161297, 46742, -213522, 33279, -223255, 134208, -80769, -243122, -144431, 273097, -167855, -232379]
12397b32379F7804b51192I8965f5658j58068n6738I4089h7617j05134A04766a51489
12385g4452A78530a89006B89652g2619p1186j4558B36487b2295J333F3072A8694
12373G819a74667B11872g196B3854a81187H4509b1758A68410O1428a27153A46122
12361F6615g4254B3802b32857a00277j85691a10202j33077E5361g0135f810B3213
12349C6681b82297n6841d0093q3376A19281E2241J86085i2064M2495B07800i1901
12337g2755b1549A53988L230b19091B0289N7105i619j90112c251A51332h0169
12325e4718A0397e6159C7803h8235j25076m9483B30805i5307p5084A3916P1277
12314H5193b4693A11763f2227p8881B21591a3917j05800A54242O5831a93751C9532
$$ y = [-232379, 67804, -251192, 98965, -65658, -223726, -280464, 94089, -87617, -192751, 104766, -151489, -74452, 178530, -189006, 289652, -72619, -143805, -158363, 236487, -22295, -20962, 63072, 18694, 7819, -174667, 211872, -7196, 23854, -181187, 84509, -21758, 168410, 229838, -127153, 146122, 66615, -74254, 23802, -232857, -100277, -285968, -110202, -243279, 55361, -70135, -6810, 23213, 36681, -282297, -339138, -40093, -123469, 119281, 52241, 238326, -92064, -49569, 207800, -91901, -72755, -21549, 153988, 157218, -219091, 20289, 77394, -9619, -199731, -3251, 151332, -80169, -54718, 10397, -56159, 37803, -88235, -213311, -262794, 230805, -95307, -170391, 13916, 85193, -24693, 111763, -62227, -141108, 221591, -13917, -119717, 154242, 220073, -193751, 39532]
12302D34224A29097K0136j7904l4118b22973A7495K33474i7695C14117p0629D6241
12290B81506A8861J94463a4224B17535b61000I3114J6120c4865o320D6205K19851
12279B66056q1908J92687j02996J13746d9816A02748A1431a62300B48477I328
12268g0641C4323R9679b01201h4653L5964j88290B20812B3291K57480d2233A81881
12256a55812C73109F4712O1619a61565A41974i4045P106A80681l2818J06492B4151
12244b5748m1674H6780R5316l8176c5382I1143D4618f8571B35244K86843B18799
12232c6472A25532M8110E9250L38062j55341L36611A11249L46151k27481l4681
12222A95238D5522L74415j31810J30494j17591J55217j86754G0538K2092k0926
$$ y = [434224, 129097, 149233, 131329, 97211, -222973, 17495, 250969, -97695, 314117, 243488, 46241, 281506, 18861, 213324, -14224, 217535, -261000, 93114, 109234, -34865, -41185, 46205, 266056, 184148, 376835, 273839, 387585, -49816, 102748, 11431, -162300, 248477, 9328, -70641, 34323, 134002, -201201, -84653, -48689, -236979, 220812, 23291, 280771, -42233, 181881, -155812, 373109, 64712, 126331, -161565, 141974, -94045, -86939, 180681, 147863, 254355, 24151, -25748, -67422, 86780, 182096, 143920, -35382, 91143, 44618, -68571, 235244, 522087, 218799, -36472, 125532, 173642, 59250, 397312, 241971, 578582, 111249, 457400, 229919, 195238, 45522, 419937, 288127, 418621, 301030, 456247, 269493, 70538, 92630, 71704]
12212G1704m077K82877j25841o4370J62637A27356K43110E4074J63933n5423L0512
12201A93096J8165K62584G2923b2224D54351Q9670k12486A47946j9738J77432
12191C05640A16133J18771A00239c03681D02614b42744A3655J56057J1345g3930
12180B56200G7684M35699H5265f9561A35919h116l7721A21976P1232o2580a09635
12168A47110P252K53727j28011J22375C3553J01974k100b2297G5485K09101G9185
12156A87225d2761Q194B8598K78050k9143j22799j9439K24243j17822c41109B03494
12144a12406C80593D0477b0839A64486c7585B666M61970b7090k51926D8244O4473
12133A12717N072c33225D6847b45041D32890I8408g2606C33903D2611a49894p0474
$$ y = [71704, 67627, 350504, 224663, 160293, 322930, 127356, 370466, 54074, 218007, 162584, 193096, 211261, 473845, 72923, -22224, 454351, 544021, 331535, 147946, 128208, 305640, 116133, 234904, 100239, -303681, 402614, -242744, 13655, 169712, 181057, -73930, 256200, 77684, 513383, 85265, -69561, 135919, -8116, -45837, 121976, 193208, 130628, -109635, 147110, 154362, 408089, 280078, 402453, 33553, 135527, 133427, -22297, 75485, 284586, 79185, 187225, -42761, -34567, 28598, 306648, 277505, 154706, 135267, 359510, 241688, -341109, 203494, -112406, 380593, 40477, -20839, 164486, -37585, 2666, 464636, -27090, -279016, 48244, 112717, 117789, -333225, 46847, -245041, 432890, 98408, -72606, 333903, 42611, -149894, -220368]
12122b20368g0607j28230D072a53840N6383E3948J77264a79192B07104h712j00142
12111a08854o3586k61790c5264j46655j0630A22645J35128c38888a53443D943
12100H4364P1083a10145D4241d62418i4296l3609c9163B21584l7872A9223a81762
12088A58941a76813B5711c284A79160Q9927c26994A34244l3768b13383A13033
12077B16258n6321F7366N96088K40170O80916F33861k43101m7657b02872I4428
12066g326B40971I5144b84823a09013o3673n806A293K86968k5594j09627k3017
12055A30023B3065L87077E9944a49161A24575m0375J4867c7537j09892E5940P3135
12044A29075i2458n48116G3842b48990J16526e6403j199k4936l7688B5762k188
$$ y = [-220368, -70607, -198837, 4072, -153840, -97457, 53948, 231212, -179192, 207104, -8712, -108854, -172440, -434230, -35264, -181919, -192549, 122645, 257773, -338888, -153443, 4943, 84364, 155447, -110145, 44241, -462418, -94296, -127905, -39163, 221584, 183712, 19223, -181762, 158941, -176813, 25711, -3284, 179160, 269087, -326994, 134244, 100476, -213383, 113033, 216258, 159937, 67366, 663454, 903624, 1584540, 633861, 390760, 343103, -202872, 94428, -7326, 240971, 95144, -284823, -109013, -172686, -178492, 1293, 288261, 262667, 153040, 130023, 23065, 410142, 59944, -149161, 124575, 84200, 99067, -37537, -147429, 55940, 129075, -92458, -640574, 73842, -248990, -132464, -56403, -57602, -82538, -120226, 25762, 23574]
12033B3574J7401o07d0129G2678c0218G9855h6051A09807b50451B03900a8656
12021G5262J374B4514a75027A01092J40299H370L74084C1060g6000N081B17164
12009A8249A437e3862A07034b79983f2812i294A37914b7326A42029a0781I9129
11997f9412b4665E7866d8369B65695f5433C49253f3737F1757b99381A23042b23894
11985a70162K2773o9172j05003f5808K8113I2327c1125k7863D5444f0503A18290
11973A59239a89117J7485J5503j09882C6247M583J89561f0103N333j71708A20435
11961a28029o8440A16093i5362A78970B9150J97312J3912D2124b6502k9297o499
11950f2298j38398J8519Q3456H6081a33297F8802D438b57483g826I0712K13549
$$ y = [23574, 40975, 40368, -40129, 72678, -30218, 79855, -86051, 109807, -250451, 203900, -18656, 75262, 76636, 24514, -175027, 101092, 241391, 8370, 382454, 31060, -76000, -70919, 217164, 18249, 1437, -53862, 107034, -279983, -62812, -9294, 137914, -27326, 142029, -10781, 99129, -69412, -24665, 57866, -48369, 265695, -65433, 349253, -63737, 61757, -299381, 123042, -223894, -170162, -147389, -216561, -321564, -65808, -37695, 92327, -31125, -58988, 45444, -60503, 118290, 159239, -189117, -171632, -156129, -266011, 36247, 40830, 230391, -60103, -54770, -226478, 120435, -128029, -196469, 116093, -95362, 178970, 29150, 226462, 240374, 42124, -26502, -55799, -62298, -200696, -182177, -98721, 86081, -133297, 68802, 4438, -257483, -7826, 90712, 304261]
11939C04261b5747G326e7080A17849c59850f9275B0404K46784B9029j2943d1971
11927E321K3300J05793E6887a83620C91420A64018o4450C9966b1955I078b59604
11915D104b03523G204K9749J30492b7935A0301a56997A67642E434a70813j65239
11904c36052a221C33662a68355f0329A74609f8489l6137J763A56790E4106e3492
11892c53378C0863a2217A04578C256P1525b14836e7081G6926a82709A87599d21129
11880A39442b43674c8366a7264C11883a79560A56144B4865k017K77021b34374
11869a79171L9760G2187a11344C21939a22081l506C4689K0200c24845e9743r9465
11858a59208c3247o8460G676J39087P809g0454l40934i7092q5603c2687M251j14962
$$ y = [304261, -25747, 7326, -57080, 117849, -359850, -69275, 20404, 267188, 29029, 16086, -41971, 5321, 28621, 134414, 56887, -183620, 391420, 164018, 99568, 39966, -21955, 9078, -259604, 4104, -203523, 7204, 36953, 167445, -27935, 10301, -156997, 167642, 5434, -170813, -336052, -1221, 333662, -168355, -60329, 174609, -68489, -104626, -102863, 156790, 54106, -53492, -353378, 30863, -12217, 104578, 3256, 74781, -214836, -57081, 76926, -182709, 187599, -421129, 139442, -243674, -38366, -17264, 311883, -179560, 156144, 24865, 22848, 299869, -234374, -179171, -139411, 72187, -111344, 321939, -122081, -125587, 34689, 54889, -324845, -59743, -159208, -33247, -101707, 7676, 146763, 154572, -70454, -411388, -97092, -182695, -32687, -28436, -143398]
11846a43398A74581a66253C14391C9300K09848g888D0241c2944J3977A23055K1583
11835A44638C5921J80351i4923l20267I1255b50020A1749O1697f6784k1174H9085
11823a71684g6423a879j39059j67787c9109A7234e0836n9858B66c6498I704a0670
11810a56051N2058c921A40007J83760E3269Q9071o4338I730O7348C6000b42247
11798c22838a30039A93626f9352K8230j92007M8055Q9335A30956B7861J97399
11788B25260H3863a51426m3778G4710J35718d3077j12224j28648a31826A75310
11777a94514a7467B1937K51680E6339c5941r0459A68169d03671a52061A59329
11766b7441r4301B2776a72238m486A5963O6770d30722B35679j11708g4598M73
$$ y = [-143398, 174581, -166253, 314391, 39300, 249148, -7888, 40241, -32944, -18967, 123055, 144638, 35921, 216272, -94923, -415190, 91255, -250020, 11749, 73446, -66784, -87958, 89085, -171684, -76423, -1879, -140938, -308725, -39109, 17234, -50836, -110694, 266, -36498, 9704, -10670, -156051, -103993, -3921, 140007, 323767, 53269, 142340, 78002, 9730, 77078, 36000, -242247, -322838, -130039, 193626, -69352, -41122, -233129, -185074, -95739, 130956, 27861, 225260, 83863, -151426, -195204, 74710, 210428, -43077, -155301, -283949, -131826, 175310, -194514, -17467, 21937, 273617, 56339, -35941, -126400, 168169, -403671, -152061, 159329, -27441, -121742, 22776, -172238, -176724, 15963, 82733, -430722, 235679, 123971, -74598, -74125]
11755g4125A80714a13950k380C2592h9861G051g9286H7619i0815K1317j18201
11744a87699d0885o5563b6864a89A12996a21317B49034m4660h8204J6756r5052
11733a66500k26520B67748k3922b8028C52295c1320l1937H975K18368a25287k25280
11722c50567B99056j40843M6959q1075J57897E0699M9235d145G0407b4804A27456
11710A5669J37116k3724J24798r965d5390j56916n1008F3671K88335a24620I2460
11698B49494e3732D0477a85933B64937e4208A63194a98465A87292a42773R686
11688a33087C51882b07634D29957h782I4223L67172a03057j98684A1268J07006
11678A18274A1716b0204C2194L5506a47635D8865b5007j0815A15879e380B1890
$$ y = [-74125, 180714, -113950, -116330, 32592, -89861, 7051, -79286, 87619, -90815, -69498, -187699, -40885, -106448, -26864, -189, 112996, -121317, 249034, 204374, -88204, -71448, -166500, -393020, 267748, 243826, -28028, 352295, -31320, -63257, 8975, 227343, -125287, -350567, 299056, 158213, 205172, 124097, 281994, 50699, 99934, -4145, 70407, -24804, 127456, 15669, 152785, 129061, 253859, 243894, -45390, -202306, -253314, 63671, 352006, -124620, 92460, 249494, -53732, 40477, -185933, 264937, -54208, 163194, -198465, 187292, -142773, -133087, 351882, -207634, 429957, -8782, 94223, 461395, -103057, -301741, 11268, 118274, 11716, -20204, 32194, 67700, -147635, 48865, -25007, -35822, 115879, -5380, 21890]
11666b78666B0657J39440O3222D0307a01382j40457p0911B59725E7952J45522
11656B03474K5194K4859a1100j32044c2994H9726b4997F379a09658B53469f9265
11644I6296a43264H4457h4618A89261d4627A21766A390b05692C20695r3267c8944
11632D0440a60234C57340a62981B4339O09191B06385p8549J97775a4470A04435
11621C42335f0885D281K29096B1343J03138K0661a77102A35797E0961O482k6199
11610C1244b56988A51040B070J04687b1745p8064E6931A9542J2251c6165j34656
11599a70821I80a52258D5948Q8965d1007k21503A21700a15192B03008G071K07741
11588B14812E462J19971P070n6817L90979A24093b96544h3934k12702A60868a37301
$$ y = [-278666, 20657, 160097, 223319, 40307, -101382, -241839, -312750, 259725, 57952, 203474, 228668, 253527, -11100, -143144, -32994, 89726, -24997, 6379, -109658, 253469, -69265, 96296, -143264, 84457, -84618, 189261, -44627, 121766, 1390, -205692, 320695, 227428, -38944, 40440, -160234, 357340, -162981, 24339, 633530, 206385, 127836, 325611, -14470, 104435, 342335, -60885, 4281, 233377, 21343, 124481, 145142, -177102, 135797, 50961, 57443, 31244, -256988, 151040, 2070, 106757, -21745, -99809, 56931, 19542, 31793, -36165, -170821, 980, -152258, 45948, 134913, -41007, -262510, 121700, -115192, 203008, 7071, 214812, 5462, 125433, 132503, 75686, 466665, 124093, -296544, -83934, -296636, 160868, -137301]
11576A47662H857a21017A04249J46859j15011Q0645C659K12071K6045i036F8645
11564C54930F8681K62411b81853G4239o032J65748b3243C36888e326j34784N6039
11553h4071J4791A9442L62707d4306A13499J46473m7663a541H6650C0288a22294
11541H8738L46628b13987k85236I717L67425k0395A58287N7609J69535l3833k71
11530C51327b68403g9684a0049q7491E1172K0077C2082c9314C46496E6855K41339
11519B98194E2423a21049F8433K7138J07226A01367K13690j48913e0037G5055
11508I3370J32256J16648C0643k344a18851C39695r3411b5934B61864A7947K11818
11497B29765O9858A20560R95J03393o206i7179A51725C8872R2156K0561D1562
$$ y = [147662, 8857, -121017, 104249, 251108, 136097, 216742, 3659, 215730, 241775, -9036, 68645, 354930, 68681, 331092, -281853, 74239, 68207, 233955, -23243, 336888, -5326, -140110, -84071, -69280, 19442, 382149, -44306, 113499, 259972, 212309, -1541, 86650, 30288, -122294, 88738, 435366, -213987, -499223, 9717, 377142, 356747, 158287, 215896, 385431, 351598, 351327, -268403, -79684, -10049, -97540, 51172, 71249, 32082, -39314, 346496, 56855, 298194, 52423, -121049, 68433, 95571, 202797, 101367, 315057, 166144, -50037, 75055, 93370, 225626, 342274, 30643, 28299, -118851, 339695, 246284, -25934, 261864, 17947, 229765, 299623, 120560, 121555, 224948, 218742, -97179, 151725, 38872, 131028, 151589, 41562]
11485d3240j41799A00812l3515L32184a54351B65876f1231F0234J70580G5891
11474c2962B42742m8061J92964L2218I7978K94218B2042L972J55958N3663j06069
11463A29566f8808o4259e6856A47766E1847a51192k1960A45920J33407a54583
11452C01801A06495Q161h6502C9125K33854J99985I1815A1640a07228e762A16522
11440a00819D5813O477k0314b72214e2251A50434b85599I7712c97840A52301h3187
11428c3560o2736E6917a27325K8491A49629a74973B9649N0465I538b48146A76175
11416d3233l8255A78684k3030n4927b47710R3121a9488j7658j30024A26778P8597
11405B05375i7499J9638B17227f830j65401d9399D03697A62885J36826B1806J40688
$$ y = [-43240, -185039, 100812, 67297, 399481, -154351, 265876, -61231, 60234, 230814, 75891, -32962, 242742, 194681, 387645, 419863, 97978, 392196, 22042, 26014, 181972, 235635, 129566, -68808, -133067, -56856, 147766, 51847, -151192, -173152, 145920, 279327, -154583, 301801, 106495, 114656, -86502, 39125, 272979, 472964, 91815, 11640, -107228, -5762, 116522, -100819, 45813, 52290, 31976, -272214, -52251, 150434, -285599, 97712, -397840, 152301, -83187, -33560, -96296, 56917, -127325, -98834, 149629, -174973, 29649, 80114, 9538, -248146, 176175, -43233, -81488, 178684, 155654, 100727, -247710, -154589, -19488, -37146, -167170, 126778, 205375, -97499, -77861, 217227, -6830, -172231, -49399, 403697, 162885, 299711, 21806, 162494]
11394A62494p8289a40875C2477O9854K5464f5102j94547a26956B2659J28217I830
11382e01174a42357d5049k31980E183b27909R2314C29145a23920C17786A53211
11371C87118b11443j01250A40971d4716k58058A06856K9351J62301e3627o3805
11361a17432J5151d5551B36140L384I0810D4929i9133A63292o2861a08319N1123
11350e7196B85160b6231J1275o8973A45128a50915B14739f0140F5937R6686J64830
11339C27453a94634n4489C1421J33304h539p2164G747i4164E3886a99393b9712
11327g5030D81284a35409M6653L735J9091a9580k10094f9405j69658f9185J3751
11316e5434k4360D868c70730B43142f0750B0209b39130D63900H2103K01164l6395
$$ y = [162494, 84205, -140875, 32477, 102331, 127795, -65102, -259649, -126956, 22659, 150876, 9830, -501174, -142357, -45049, -277029, 5183, -227909, -135595, 329145, -123920, 317786, 153211, 387118, -211443, -312693, 140971, -44716, -302774, 106856, 136207, 298508, -53627, -117432, -102281, -45551, 236140, 239524, 90810, 44929, -99133, 163292, 100431, -108319, -57196, 285160, -26231, -14956, -83929, 145128, -150915, 214739, -60140, 65937, 162623, 327453, -194634, -249123, 31421, 164725, -8539, -80703, 7747, -94164, 53886, -199393, -29712, -75030, 481284, -135409, -88756, -85021, -65930, -19580, -229674, -69405, -239063, -69185, -55434, -79794, 4868, -370730, 243142, -60750, 20209, -239130, 463900, 82103, 283267, 246872]
11305B46872f1971l78721G1673a47298d7516n16617H0894a19214c8658P831k9481
11294f0308k8002d3983j10701E8017h1628A53670c23655A81789F0272L84693f5417
11282B33944j14595c32460F9881d17898a73123B68616a74443C6886f6934j04634
11272a71568B03757C4838a4244G0164d5121q7029c2073k8746q780H2783L3578
11261A16361j3719B2610b22274b4867j01881H0674M9321d0868o419G8715J70417
11250B49132E2090c45716A06627r539b43437H6020k0727P8285a46340K5971h37
11238A49922j5572h8020j94915a06716k5465N3456j34476M0154k7947Q8699j92174
11227c04469D0974a82675O8218B65546a9031q5842B6046a3177r1614C1686c76674
$$ y = [246872, -61971, -440692, 71673, -147298, -47516, -564133, 80894, -119214, -38658, -30827, -60308, -88310, -43983, -154684, 58017, -81628, 153670, -323655, 181789, 60272, 444965, -65417, 233944, 119349, -332460, 69881, -417898, -173123, 268616, -174443, 36886, -66934, -171568, 203757, 34838, -14244, 70164, -45121, -132150, -32073, -60819, -69599, 82783, 116361, 102642, 22610, -222274, -24867, -126748, 80674, 129995, -40868, -47287, 78715, 249132, 52090, -345716, 106627, 97088, -243437, 86020, 65293, 143578, -146340, -120369, -837, 149922, 134350, -88020, -282935, -106716, -132181, -78725, -213201, -173047, -200994, -112295, -304469, 40974, -182675, -114457, 265546, -19031, -104873, 26046, -13177, -104791, 31686, -376674]
11215b89737J28352E1584b51981h3371A33103d4752H8905a23186j66186f0626
11204d5162C56059a09497k44527B19418r0016a89441N964L5565N7814A8402a51441
11192a4085D1485h7116B34674I4690a20176e5740j95894a9231k25082A164K001
11181C165a2307A36206P20R2743B5446J50017p3940a82899B12562j5960N2157
11170B48759m1281o1961e8979A96358a76543B30595a9478C8643J56295q8700a4973
11158A9880a94633B64146m1776d0176j56334P1927b0799G743c7414A71392c71086
11146b33733A66705e79907a31328c64q8572D3577b2165m1517A67600G4910A7371
11134A49510c21474A17424M9790f6109A84640b26858a10755G4265J69926o8662
$$ y = [-289737, -161385, 51584, -251981, -83371, 133103, -44752, 88905, -123186, -289372, -60626, -45162, 356059, -109497, -354024, 219418, 129402, -189441, -183477, -147912, -90098, 18402, -151441, -14085, 41485, -87116, 234674, 94690, -120176, -55740, -251634, -19231, -244313, 1164, 3165, -12307, 136206, 136926, 229669, 25446, 175463, 101523, -182899, 212562, 196602, 248759, 207478, 145517, -58979, 196358, -176543, 230595, -19478, 38643, 194938, 106238, -14973, 19880, -194633, 264146, 222370, -40176, -196510, -124583, -20799, 7743, -37414, 171392, -371086, -233733, 166705, -579907, -131328, -364, -88936, 43577, -22165, -63682, 167600, 74910, 17371, 149510, -321474, 117424, 167214, -66109, 184640, -226858, -110755, 74265, 244191, 175529]
11124A75529n3446J53822j05806R1224j28604J12942i6971n6862g2816A0523J09804
11113A20327D2661b8065A15599g9259B88945O0569A22699J0805A9396a53462E62483
11101B43805B9770J33660J50090A56071J92077j37079b3371B00843I0048O771
11091I6819d968F6553a73858A63577J8205L23710a26874B53173j03542c5897B2506
11079a6523F31521A30219J5046k3788J03661E7629Q267J47846r144K0684J7320
11068B42602G9143L19531j55550L35506j43380J09097L71214B34303q0692K44149
11058C97760K44082B44233L84625l9414K28080k71960L42968l01473J70962n759
11048G52262l11666J92095Q1303L07166j74329n8100J15549n8389l46323K07036
$$ y = [175529, 122083, 275905, 170099, 261323, 132719, 245661, -96971, -153833, -72816, 10523, 120327, 42661, -28065, 115599, -79259, 288945, 349514, 122699, 133504, 19396, -153462, 562483, 243805, 29770, 163430, 313520, 156071, 348148, 211069, -23371, 200843, 90048, 96819, -4968, 66553, -173858, 163577, 181782, 505492, -126874, 253173, 149631, -35897, 22506, -16523, 631521, 130219, 145265, 121477, 225138, 57629, 65896, 213742, 204598, 225282, 242602, 79143, 398674, 243124, 578630, 435250, 544347, 915561, 234303, 153611, 397760, 641842, 244233, 628858, 589444, 817524, 545564, 888532, 587059, 758021, 752262, 440596, 632691, 713994, 1021160, 846831, 788731, 904280, 845891, 499568, 706604]
11038G06604j63883J99277k53945J56849j57402J98363O1625k35762J6139J49182
11028F77047K0162l12627M43955j20623k25392K33356C2969O93075j005L7719
11018G62758k4474n7092o9466k03063o9692P9527k3729J02341k4337m4560K77291
11007G05504j35825j4799L0926k18398L87941C06131J79431L23420C79779J38801
10997E18580K22134j02667j7110j99965M41873L7835k49629Q7774K23279p4668
10987H87436K5388L07802j30329j55745l40279M98516k30127L85884o355q8049
10977A154142P73235o273O2926L38530J41174K00417l11548M71343n93340k38353
10967A992253J09833l47269R6811k4624K4841j23872R0150K29425j60197R3597
$$ y = [706604, 542721, 741998, 488053, 644902, 487500, 685863, 747488, 511726, 527865, 677047, 697209, 384582, 828537, 707914, 482522, 715878, 32969, 726044, 725039, 762758, 738284, 681192, 611726, 408663, 338971, 418498, 394769, 497110, 472773, 428213, 705504, 569679, 554880, 585806, 367408, 755349, 306131, 485562, 808982, 379779, 518580, 740714, 638047, 620937, 420972, 862845, 900680, 651051, 738825, 962104, 887436, 912824, 1220626, 1090297, 934552, 594273, 1092789, 862662, 1248546, 1242191, 1154142, 1927377, 1921104, 1984030, 2322560, 2463734, 2664151, 2352603, 2823946, 2230606, 1992253, 2102086, 1754817, 1851628, 1827004, 1851845, 1727973, 1818123, 2047548, 1887351, 1980948]
10957A980948K03540j70604j62911l07262k76030L4740o6541k67356k86252j86950
10947D95322L6466k22056L79126j75646A92569K81576k26768C5924h8248G7773
10936G7279i0853n8886C17932p9884A00595a41390B11338l4846A4093J48192D3109
10924B55935b59319D23911a09408p850K3588E4916b83037a30754k58789E0992
10913e7251A73065m5119k4045l0736J36487d64369a70664j43924E2699J33742
10903A86441C3186a43088A74141G0513K36481P2314h8895D6290M3425b8931A97569
10891c8929j5483k1992B50492a2201j37928O1494a6354J340b701G9146J28381
10880B07527a8271I4045L03617a28938A49529h896H7390a67341m614k38554A67673
$$ y = [1980948, 2184488, 2013884, 1850973, 1543711, 1267681, 1302421, 1235880, 968524, 682272, 495322, 531788, 309732, 688858, 513212, 192569, 474145, 247377, 35924, -88248, 77773, 77279, -90853, -149739, 317932, 238048, 100595, -141390, 211338, 176492, 14093, 162285, 43109, 255935, -259319, 423911, -109408, -117258, -93670, 54916, -283037, -130754, -389543, 50992, -57251, 173065, 127946, 103901, 73165, 209652, -464369, -170664, -314588, 52699, 186441, 33186, -143088, 174141, 70513, 306994, 379308, -88895, 46290, 89715, -28931, 197569, -38929, -54412, -76404, 250492, -12201, -150129, -88635, -16354, -15014, -2701, 79146, 207527, -18271, 94045, 397662, -128938, 149529, -8896, 87390, -167341, -171955, -410509, 167673]
10868B26058J00028h8072E7980M3980b18573F4151c4691I6970M6227d7538k6222
10857g3760q0788M3535C89418g9965A03569a58644A98336b28212n6942i6015j3951
10846a09966A07830c2182C09630b05125Q4557J6186B21513a29946I4413L18097
10836D12510E5225Q642A36a20296k56372a29393k96147A2012g8166j33608c9720
10824B78401b63338n1680B8594J55307m9555A9134R9476L1619D3345R7444F035
10812D3756N2174b25058A54080a65835B41347g3555B7381O801f3638F2008B7312
10800D5788L6191g1404j61216C7828c8547B8185a42504A09055b38391m3849R4655
10789a87585B60050a2730j40337E4957k0350c54669D5661J187Q9783a86714o4180
$$ y = [226058, 326086, -88072, 57980, 101960, -218573, 64151, -34691, 96970, 143197, -47538, -73760, -154548, -111013, 389418, -79965, 103569, -158644, 198336, -228212, -285154, -96015, -109966, 107830, -32182, 309630, -205125, -120568, -104382, 221513, -129946, 94413, 412510, 55225, 63867, 136, -120296, -376668, -129393, -425540, 12012, -78166, -211774, -39720, 278401, -263338, -315018, 28594, 183901, 134346, 19134, 118610, 150229, 43345, 140789, 6035, 43756, 95930, -225058, 154080, -165835, 241347, -73555, 27381, 34182, -63638, 62008, 27312, 45788, 81979, -71404, -232620, 37828, -38547, 28185, -142504, 109055, -238391, -282240, -187585, 260050, -12730, -153067, 54957, 34607, -354669, 45661, 46848, 136631, -186714, -250894]
10778b50894A10179e9712K5155n60142a47459q8786i3177M4245k8080G4065g0522
10766G9871c8579A08674A3577P3498Q3292D4381J20257a2812A93338c79384g4283
10754A73546J535g5581b9475I79g9655j42729a7401m0978k05472C0668L9656B1933
10741C6842Q7912e6061F7448J7711Q0137a58392B40058i8076j48023b1299B28078
10729a68734B06604e5930J2656j64981b5651n0687h046k58194j93617B70563C7139
10717b30170A66934b92566K89L9241j48397A49631c13662J00841b0092B73302
10706g8068k01868d0729m777p7963I546b13710B3398e5225C25004q9186a92821
10694b42915a00973l02067R0654J42241j75044E3594d6792B78366a63083O51c6563
$$ y = [-250894, 110179, -59712, -34557, -594699, -147459, -236245, -93177, -48932, -77012, 74065, -70522, 79871, -38579, 108674, 13577, 87075, 170367, 44381, 164638, -12812, 193338, -379384, -74283, 173546, 175081, -75581, -29475, 979, -79655, -222384, -17401, -58379, -263851, 30668, 70324, 21933, 36842, 124754, -56061, 67448, 85159, 165296, -158392, 240058, -98076, -246099, -21299, 228078, -168734, 206604, -55930, -43274, -208255, -25651, -76338, -8046, -266240, -459857, 270563, 37139, -230170, 166934, -292566, -292277, -253036, -401433, 149631, -313662, -212821, -20092, 273302, -78068, -279936, -40729, -45506, -123469, 9546, -213710, 23398, -55225, 325004, 235818, -192821, -242915, -100973, -403040, -312386, -170145, -345189, 53594, -46792, 278366, -163083, -162432, -36563]
10682f1224A52805e0985j12243B87886a9196k13972B28443A2944c8413j05930
10672a44343A31453C0323J25522a66006m25678A08283k0551O2741a36558A20168
10661b75974B61517K03065B14417a754q577j42741B43908b15128k10184A7770
10650d3272j60800A63528o3080A2611c7676A43790b03036A4736L31910e4074B59329
10638b39888a8364j04476A9438B950Q3786a85706j90595c8283D76519B16186b34800
10626a72340A56471b01644r2449A39567j5001Q9087a20938k32304J11604F046
10615a06879k75393f0726I788a87239k513a5075l8369k35469J16740l3188C942
10603a76324H2510a09140m9719C7109F02g7729k22884e0145k25612d7711o9799
$$ y = [-61224, 152805, -50985, -163228, 287886, -19196, -233168, 228443, 12944, -38413, -144343, 131453, 30323, 155845, -166006, -591684, 108283, 87732, 150473, -136558, 120168, -275974, 261517, 464582, 214417, -1754, -10331, -153072, 243908, -215128, -425312, 17770, -43272, -204072, 163528, 100448, 12611, -37676, 143790, -203036, 14736, 346646, -54074, 259329, -239888, -18364, -122840, 19438, 2950, 86736, -185706, -376301, -38283, 476519, 216186, -234800, -172340, 156471, -201644, -294093, 139567, 124566, 213653, -120938, -353242, -241638, 6046, -106879, -382272, -60726, 9788, -187239, -189752, -15075, -53444, -288913, -172173, -205361, 3942, -176324, 82510, -109140, -158859, 37109, 602, -77729, -300613, -50145, -275757, -47711, -117510]
10592a17510K4956A08870L2660a81270A65241M5265c8484I02K6606g0961A44337
10580c39038H3214d55727F0390j1252L2536b82160i6482j94710A99010B3028a85958
10568c4478q9280C8462c5113E4059a73832B00517b43856c2239B61493b25655A13954
10556A51566B1729N5515b62501A03004b21233O0661A06381a9852n1935k5305c3203
10544a30258H5856j6843K29014I0501b36163O2171A79546D779J42086B9595a33592
10532a09410j27691R9743A39127e9501k3731O133j64045A16662e9371K1068D6902
10520B71197e2886K328A15988d96677F4660j8877a89556D9369a67957j9379A81690
10508C03792a55973D0489J71181a01770H3182f3381j70697A69627a95719a8906
$$ y = [-117510, -92554, 108870, 141530, -181270, 165241, 210506, -38484, 902, 27508, -70961, 144337, -339038, 83214, -455727, 60390, 49138, 81674, -282160, -96482, -291192, 199010, 23028, -185958, -34478, -123758, 38462, -35113, 54059, -173832, 200517, -243856, -32239, 261493, -225655, 113954, 151566, 21729, 77244, -262501, 103004, -221233, -160572, 106381, -19852, -71787, -97092, -33203, -130258, 85856, 69013, 298027, 90501, -236163, -173992, 179546, 4779, 146865, 29595, -133592, -109410, -237101, -137358, 139127, -59501, -83232, -77099, -241144, 116662, -59371, -38303, 46902, 271197, -52886, -50558, 115988, -496677, 64660, 45783, -189556, 49369, -167957, -187336, 181690, 303792, -155973, 40489, 211670, -101770, 83182, -63381, -234078, 169627, -195719, -18906]
10497a29395N1116J849b4275G108J07944a26081d0839A45958h8118E3115b0391
10485a83277d0080A41997d3177D24234j71711J15333C6991J83253K05809a04976
10474I8604j6314J96270e7934B06776l2650n6781J96975d7422A07880d329j13200
10463a17529j64036a07137l2392M1609o356B8477d8975j59821h9170B158N455
10452G613J19986a88135k81985a25B22098f2897k54737a066A0515J95749b40620
10440g7847H9098b87257d6963B95297c46655i9318a6849j35111N4327c1357A9093
10428e2472q8447B13340d989k30352B69797B2877d18323c8116I7042e4516l4997
10417h9513q0205h4242j58935F1689b0337B3181b75005Q9852A877i5750A55871
$$ y = [-129395, -78279, -76430, -24275, 7108, 115052, -126081, -40839, 145958, -88118, 53115, -20391, -183277, -40080, 141997, -43177, 424234, 252523, 367856, 36991, 220244, 426053, -104976, 98604, 82290, 278560, -57934, 206776, 174126, 117345, 314320, -47422, 107880, -4329, -117529, -281565, -107137, -139529, -97920, -104276, 28477, -48975, -208796, -89170, 2158, 7613, 127599, -188135, -470120, -125, 222098, -62897, -317634, -1066, 10515, 206264, -240620, -77847, 89098, -287257, -46963, 295297, -346655, -99318, -16849, -151960, -97633, -31357, 19093, -52472, -140919, 213340, -4989, -235341, 269797, 22877, -418323, -38116, 97042, -54516, -89513, -169718, -84242, -243177, 61689, -20337, 23181, -275005, -185153, 1877, -95750, 155871]
10405b80045H2778i6943a9687k41367J08604K6586e5131k46723I0133j6065K41672
10394C15740P927j43731j0951K0329I1175R7033N6225G8666i2467D85239c94982
10382e6871j0542D48270A24703j1081J01376a80285E0372J47499J26713A37884
10371A34189a04370D48225j81000o1565O5581A7985R7314M3917J40728J25443
10361D25387K05172c6688B61456K07596A70116q0703d6843A33158P1047M23100
10351F27305j03034j10672L2871m4103r6161j27934J00732J70120r1284e6220
10340C20648c32909B84748H4637J15213a2559K816A72394K66653c8075A73641
10329a09479B2728K24477Q5986a748p4333A80586k0337N2524G863L23412j45046
$$ y = [-280045, 82778, -96943, -19687, -261054, -152450, -125864, -55131, -301854, 90133, 74068, 315740, 323667, 179936, 168985, 189314, 91175, 188208, 244433, 78666, -92467, 485239, -394982, -56871, -67413, 448270, 124703, 113622, 214998, -180285, 50372, 197871, 324584, 137884, 134189, -104370, 448225, 267225, 205660, 271241, 17985, 115299, 159216, 299944, 425387, 630559, -36688, 261456, 469052, 170116, 89413, -46843, 133158, 204205, 627305, 524271, 413599, 446470, 402367, 306206, 178272, 279004, 449124, 357840, -56220, 320648, -332909, 284748, 84637, 199850, -12559, -9743, 172394, 439047, -38075, 173641, -109479, 22728, 247205, 333191, -1748, -76081, 180586, 160249, 212773, 7863, 331275, 186229]
10318A86229g8654A93641C8893K17051I5562K2462P4199J44948A40523c3623j02938
10307a36561b3812k71631B08613K4843G3477J41750C3177K59255C8168g62H3900
10295a02594B19211I8389a08953N0065r0517B9505a62569L3379n9104f4323G8953
10283C9268M0486D116a4968A4474d6849k01517A7938i2955k91203H026a4578q2544
10271i7122A38482K6907a40615A25462k3425k3400k7404b81322e7969B38142F0849
10259E79487A82783N5864M24997A57354L7424j4047A1424a4443l3193B04475L678
10248B08153a4913q9994j419A39493i358D9402b88215L0596a3900l03775a31659
10236a56133A26627c61377F7008I703c3838q2498D21203A72224D3175K02353a69445
$$ y = [186229, -78654, 193641, 38893, 255944, 95562, 118024, 192223, 337171, 140523, -33623, -136561, -23812, -295443, 208613, 233456, 73477, 215227, 33177, 292432, 38168, -762, 83900, -102594, 219211, 98389, -108953, -58888, -149405, 29505, -162569, -129190, -188294, -64323, 78953, 39268, 79754, 4116, -14968, 14474, -46849, -248366, 17938, -92955, -384158, 8026, -14578, -97122, 138482, 165389, -140615, 125462, 102037, 78637, 51233, -281322, -57969, 238142, 60849, 579487, 182783, 238647, 663644, 157354, 194778, 180731, 11424, -14443, -47636, 204475, 208153, -14913, -104907, -106326, 139493, -9358, 49402, -288215, -257619, -13900, -317675, -131659, -156133, 126627, -361377, 67008, 9703, -33838, -116336, 421203, 172224, 43175, 245528, -169445]
10224a358D6246K23440a68729O4833F9799a21564b9541A53342a94975e5853N964
10213d9889A61606a49468k8891e789k07962A14619c3058E10487c4654j01862A08277
10201a87376B15235H5740a04593a2905j27234c0684q6630k44473A81264d6470
10190b46199B75426b72184i9956L5055j53235R2938A39674k1688a2065l8077A00241
10178A86526R077g5972A51969k8923c7064I1215k8043b12482g7249L7592H518
10166C878b38649i2891j01720n2505c183F7437A8683A094b37975I1741I892K84841
10154B94733a71502m1774a7117q8706C4345e9490B48248f7552l0063n3887L1803
10143a19699p7676A04288J0744a18198q1973E926P1968f6005k2565D3383b6533
$$ y = [-1358, 46246, 269686, -168729, -103896, 69799, -121564, -29541, 153342, -194975, -55853, -49889, 161606, -149468, -178359, -5789, -213751, 114619, -33058, 510487, -34654, -136516, 108277, -187376, 215235, 85740, -104593, -12905, -140139, -30684, -117314, -361787, 181264, -46470, -246199, 275426, -272184, -99956, -64901, -218136, -125198, 139674, 117986, -12065, -50142, 100241, 186526, 195603, -75972, 151969, 123046, -37064, 91215, 63172, -212482, -77249, -39657, 8518, 3878, -238649, -92891, -194611, -247116, -3183, 67437, 18683, 1094, -237975, 91741, 9892, 294733, -171502, -213276, -17117, -105823, 34345, -59490, 248248, -67552, -97615, -151502, -119699, -197375, 104288, 115032, -118198, -200171, 5926, 77894, -66005, -88570, 43383, -26533]
10131D1473h0876j00562P1527M6188j89769k6045D18139c04325K4071E9523d9441
10119c20743H6827J70573a65728E5535j4651L7666c2488A28621c29572j74730
10109e04302a66004f9006A04355L64673A4939J65192e6728j60879L8643D66827
10098b13140A3234a53868m6629I2311A1132b42596a07042j63137a32728A19626
10087a98462a8965k8174A37939c4953H0104J45923A11496M3854h131k9088j09955
10076a47174B77807b58159G126Q409b58860c1008j75317o6255a06256A07590D0174
10064c3076A22334e5812D91573c34105d1276l81968b5919o3191d4255l5459a2164
10052B51900i8212p2973j59643c6267A47955a79771e5884E7732b51848k97009
$$ y = [41473, -80876, -181438, -109911, -63723, -253492, -279537, 418139, -304325, -280254, 59523, -49441, -320743, 86827, 257400, -165728, 55535, 40884, 78550, -32488, 128621, -329572, -504302, -166004, -69006, 104355, 469028, 14939, 180131, -56728, -217607, -178964, 466827, -213140, 13234, -153868, -200497, 92311, 11132, -242596, -107042, -270179, -132728, 119626, -198462, -18965, -47139, 137939, -34953, 80104, 226027, 111496, 155350, -8131, -37219, -147174, 277807, -258159, 7126, 15535, -258860, -31008, -206325, -272580, -106256, 107590, 40174, -33076, 122334, -55812, 491573, -334105, -41276, -423244, -25919, -89110, -44255, -79714, -12164, 251900, -98212, -171185, -330828, -36267, 147955, -179771, -55884, 57732, -251848, -548857]
10042e48857J68560f9303k03506A0614R5919J3362b01147q2655F2767Q8876c14601
10030A00633a99714M1105p2073e0621p5420A6888a45646N5080M5031D8605c09806
10018c3559C2468p050e849l7063q3611A57254K33022b15350C00813c68669A8601
10006e0311A38550J17027b10782B0934H119h3882d0873A23249B3321b63622F057
9994d5993K2147F5729k6851a9559A38713c50142K095F4994a13472j28922o0189
9983c02583a49268d3511k82208C25103f6460j56906J5742A36172d5706A18779
9972B09370H2741a60070O8052m8377C11566c92747C8740l40a33740G1135l566
9961F7569i5493k5478j30525J02878O0325j42674r1920a20641E9755d6374B15506
$$ y = [-548857, -380297, -69303, -272809, 10614, 106533, 119895, -201147, -283802, 62767, 151643, -314601, 100633, -199714, -158609, -230682, -50621, -126041, 16888, -145646, -90566, -45535, 48605, -309806, -33559, 32468, 25418, -5849, -42912, -126523, 157254, 390276, -215350, 300813, -368669, 18601, -50311, 138550, 255577, -210782, 20934, 8119, -83882, -40873, 123249, 23321, -263622, 6057, -45993, -23846, 65729, 38878, -19559, 138713, -350142, -348047, 64994, -113472, -242394, -302583, -149268, -43511, -325719, 325103, -66460, -223366, -207624, 136172, -45706, 118779, 209370, 82741, -160070, -92018, -140395, 311566, -392747, 38740, 38400, -133740, 71135, 67569, -95493, -120971, -251496, -148618, -88293, -230967, -322887, -120641, 59755, -46374, 215506]
9949b15712M7635C19021h6184j78722a02393J0361n1353A52801a91809o3632J17017
9938a38424J3337j30228M8792A12245l5738d7544q5772j49501g7301J2025j47467
9927b12743i088n9671j39093C21599b94412i9236k79896i1529A03491a09306j319
9916a10625j6010a8585A97808A6764a85658A2318a96256o1433H1556d20801B50336
9904E686R8511g272j34678K3205n9590b4862k16017e040k9423A6831J23826a1056
9891H6799k3932a69762A04449a76672f7605q768B12004F2204h9346j3479j28774
9880b31599A42585D3440b18696g3120f914I7358a74337B32588G8904f0909j09394
9869a70303G6942b89609l1958g8516l28064E5144d2849F5250J30408i0211L9897
$$ y = [-215712, -168077, 319021, -86184, -264906, -102393, -92032, -143385, 152801, -191809, -255441, -138424, -125087, -255315, -206523, 112245, 76507, -47544, -133316, -282817, -77301, -65276, -212743, -9088, -68759, -207852, 321599, -294412, -99236, -379132, -91529, 103491, -109306, -110625, -126635, -18585, 197808, 16764, -185658, 12318, -196256, -257689, 81556, -420801, 250336, 5686, 104197, -7272, -141950, -118745, -178335, -24862, -240879, -5040, -34463, 16831, 140657, -11056, 86799, 62867, -169762, 104449, -176672, -67605, -76373, 212004, 62204, -89346, -102825, -231599, 142585, 43440, -218696, -73120, -6914, 97358, -174337, 232588, 78904, -60909, -170303, 76942, -289609, -321567, -78516, -406580, 55144, -42849, 65250, 195658, -90211, -50314]
9858e0314D4077d6964j50024m9906F0163a59084q8281m4654R0091m7091g4139
9846I7964M3732m8315a87824B65225B1797b90940A95742a86962c8464j47497C8373
9834a4542j08992m36132A75765g3526m9071j20574A80455a44549m548A23816a88939
9822a22025j24488E8448M3279b16112m9748J22358m5716m7858l622A96544E862
9810a08386C13822h5801j42524Q5801E34549k33680a39762f3059A38941a47641
9799b890o324A36414c10551e7035k0649e048A65562M800h7530H1670c9649E3932
9786a53454H7113b85623E3349P148J9194i2512B06375B073d3929k47017a11531
9774A61173b5745a1501l11387A48989a83992d3335j98405J10447c2205r8914F7098
$$ y = [-50314, 44077, -46964, -196988, -246894, 60163, -159084, -247365, -292019, -201928, -249019, -74139, 97964, 141696, 93381, -187824, 265225, 21797, -290940, 195742, -186962, -38464, -185961, 38373, -14542, -123534, -559666, 175765, -73526, -122597, -243171, 180455, -144549, -149097, 123816, -188939, -122025, -246513, 58448, 101727, -216112, -265860, -143502, -189218, -237076, -240698, 196544, 5862, -108386, 313822, -85801, -228325, -142524, 534549, 300869, -139762, -63059, 138941, -147641, -2890, -9214, 136414, -310551, -57035, -77684, -5048, 165562, 170362, -87530, 81670, -39649, 53932, -153454, 87113, -285623, 53349, 60497, 79691, -92512, 206375, 2073, -43929, -290946, -111531, 161173, -25745, -11501, -322888, 148989, -183992, -43335, -241740, -131293, -32205, -131119, 67098]
9762b42676j29965a65204A51351b62612G0839b03449M4195J7703q0354h5228H5570
9750A36899c47984g3854c4902I6562b24832j33083i5647A11567b5493l08367d4882
9738a39585A07098h8287A01436a82926r0940a00364j44183A0365J8162a75497
9727c76709a67561a2171L521k53271a02205j51953n1307A4022L6582Q4178J31184
9716B65966A31543b52261m4647c5605q2169j650j64050J34768e3942A8235a43996
9704E0679d12496B1269J1811a81169O5289e296A83435O5831C1640a94668Q7892
9693a06776A49935m6838b25943a03540p0003r2387G3595c10875a034k02067k61947
9682d65048H9475b46388o3435J9700A74387a14156E2304O4532b96707f7053C2897
$$ y = [-242676, -372641, -165204, 151351, -262612, 70839, -203449, -159254, -141551, -221905, -85228, 85570, 136899, -347984, -73854, -34902, 96562, -224832, -357915, -95647, 111567, -25493, -333860, -44882, -139585, 107098, -88287, 101436, -182926, -273866, -100364, -244547, 10365, 28527, -175497, -376709, -167561, -12171, -8650, -261921, -102205, -254158, -305465, 14022, 50604, 134782, 265966, 131543, -252261, -296908, -35605, -117774, -119424, -283474, -148706, -53942, 18235, -143996, 50679, -412496, 21269, 33080, -181169, -115880, -5296, 183435, 249266, 31640, -194668, -106776, 149935, 103097, -225943, -103540, -173543, -265930, 73595, -310875, -1034, -203101, -465048, 89475, -246388, -309823, -290123, 174387, -114156, 52304, 116836, -296707, -67053, 32897]
9670b49253B4518e5856A42653h2450p2408G7272a52421B68448c44094A08813B7029
9658F6544J74758j19927c0260n1612r9004M0495K5121r1637m31643a28939K9291
9647i9648m0163c371l33352p6451a20137a4303n1936C39324G4189b59760h3016
9635b40511D1298R6858a24638k7428c7089A37488h5722k3625j65032R2072j02354
9624b84661g7651A01614P3862E8853g6263m8194A06537a21141a6723A27537j8414
9613A09123f8301j24711A30464a58596j65183a9507D5283b24661h1616b6474j02361
9602a28835j16071R1972G6797e6413A13576c0662N268j87745F0161b53363A78872
9590h1575r3352G7059a79660K0576f5908F5666b56784A82508a0328A45546b9908
$$ y = [-249253, 24518, -55856, 142653, -82450, -154858, 77272, -152421, 268448, -344094, 108813, 27029, 66544, 241302, 121375, -30260, -81872, -180876, -140381, -115260, -206897, -638540, -128939, -99648, -139811, -3371, -336723, -413174, -120137, -14303, -66239, 339324, 74189, -259760, -83016, -240511, 41298, 138156, -124638, -152066, -37089, 137488, -85722, -109347, -274379, -182307, -284661, -77651, 101614, 175476, 58853, -76263, -124457, 106537, -121141, -16723, 127537, 109123, -68301, -193012, 130464, -158596, -323779, -19507, 45283, -224661, -81616, -26474, -128835, -244906, -152934, 76797, -56413, 113576, -30662, -25394, -213139, 60161, -253363, 178872, -81575, -174927, 77059, -179660, -159084, -65908, 65666, -256784, 182508, -10328, 145546, -29908]
9578a0367j7210k9072k74732a48700j17520b0509A51539b75586B23070b65715
9567a43086M6989D7614J1724J0486i4062F5699K0910a96820l6271b7511B0906
9555b34095a13928K6498l57656a52208m0604L1272A76890N0277c3044k37106C7959
9543E2479i2002c535C08688A32034q369a81209J2202b7566n4899r0133B57367
9531d19586a59346c1656A25919f847j00790j37392C4219a52928A04977c65680
9520i950k5912j710B28429b5197l17516Q3205a16506a8398I4278e9222I0384g9056
9507e3396K1918A84801m5946a90144A07002p709i4006D1846A0273R3936R0095
9496A94304C041h2076B22990b00774A81085A2453a85880d0279k49732i4300j04106
$$ y = [-10367, -27577, -56649, -331381, -148700, -266220, -20509, 151539, -275586, 223070, -265715, -143086, -96097, 47614, 59338, 69824, -94062, 65699, 86609, -196820, -233091, -27511, 20906, -234095, -113928, -87430, -445086, -152208, -192812, -161540, 176890, 227167, -33044, -270150, 37959, 52479, -92002, -3535, 308688, 132034, 123665, -181209, -169007, -27566, -82465, -172598, 257367, -419586, -159346, -31656, 125919, -6847, -107637, -245029, 34219, -152928, 104977, -365680, -9950, -35862, -37572, 228429, -25197, -342713, -259508, -116506, -18398, 94278, -59222, 90384, -79056, -53396, -31478, 184801, 138855, -190144, 107002, 99293, -94006, 41846, 10273, 104209, 194304, 3041, -82076, 222990, -200774, 181085, 12453, -185880, -40279, -290011, -94300, -198406]
9485a98406j42168K9977a07325A68400a28218g817B41869h6550l9965M6928A55638
9473C1025b89246q5935J81932r1686A4740I4a99878G3230c1115B47028n5512r
9461A91507E4804b988A93466i0471D14498G6780a88637M5606c2553r7025B24268
9449i0477F9525L4222a92268B0986b2009b565j1316G6880a66769D519M339b46192
9436b9417j15050A36647f6572m3013M4109j09623k77796J76740N7927F3146K0608
9425H3754J6655n101J26241e2039E1253K16776F6859c82478a58317H9787a01568
9413A70340i0832d578q5710k6143G1274a26225A0853J26721a61461B5567a12900
9401a13764A35924H063J58070a67013g4993k23754B33654a03095q0098B07749
$$ y = [-198406, -340574, -310597, -107325, 168400, -128218, -7817, 241869, -86550, -126515, -79587, 155638, 31025, -289246, -375181, -193249, -284935, 14740, 94, -199878, 73230, -31115, 247028, 191516, 191507, 54804, -2988, 193466, -90471, 414498, 76780, -188637, -143031, -32553, -129578, 224268, -90477, 69525, 103747, -192268, 20986, -22009, -2565, -13881, 76880, -166769, 4519, 8858, -246192, -29417, -144467, 136647, -66572, -109585, -65476, -175099, -452895, -276155, -218228, 63146, 83754, 100409, 95308, 221549, -52039, 51253, 268029, 66859, -382478, -158317, 89787, -101568, 170340, -90832, -4578, -90288, -116431, 71274, -126225, 10853, 137574, -161461, 25567, -112900, -113764, 135924, 8063, 166133, -167013, -74993, -298747, 233654, -103095, -183193, 207749]
9390B17934a44289K2725A5111b30757F911e7128k2070B73637c21981a38769c6351
9378a15837n3703O5796j2511A53509D9911b3216k17069A35599n4570b49994n5562
9367c05556N7346j3625f8707r8484n6950D713K80634a18834Q803n546j93212J03283
9355b05506R6196A581b11352A75749i3088A0614a70594A89335a90410Q2630A6901
9343G0745J32726a00786A66572c25712B5394e7416g079n5078A86570c2406o4986
9332i7392k99268a19465B1187b23730P0764j4711A20931C1116J5368c7371j78623
9321b15994a1103p480k16502m3255n99J19415M0754n5263N5066G4816a94288C4420
9308h0526c5262j50570L392O2188m90094b97256k33103f6769n5761E3220g0615
$$ y = [217934, -144289, -121564, 15111, -230757, 6911, -57128, -79198, 273637, -321981, -138769, -36351, -115837, -169540, -103744, -116255, 153509, 49911, -23216, -240285, 135599, 81029, -249994, -305556, -248210, -261835, -68707, -167191, -224141, 4713, 285347, -118834, -110031, -115577, -308789, -205506, -109310, 1581, -211352, 175749, -93088, 10614, -170594, 189335, -190410, -107780, 16901, 70745, 203471, -100786, 166572, -325712, 25394, -57416, -7079, -62157, 186570, -32406, -97392, -396660, -119465, 21187, -223730, -152966, -167677, 120931, 31116, 46484, -37371, -215994, -11103, -18583, -235085, -278340, -278939, -159524, -118770, -174033, -118967, 74816, -194288, 34420, -80526, -35262, -185832, -182440, -120252, -610346, -297256, -530359, -66769, -122530, 53220, -70615]
9296c11807R1992B2308a15835J1054C24768E6692e5204r6335j1126F7030a87186
9284i5643D6735a35356L745A41048a6267G8131a98889n5327J12468A33906b21077
9272G3449a82106B7791f4890B39247a71355l2112B14507c6885q0111j09581e6535
9260G669a74172N5135k412q9816b5466C3438J56881a27553D8357g1589B44454
9248A80462q9881A376a64412m4085G5675K02625a23908b6508E0186M8443R8769
9237A97398n8812b06475a1756p786k65529h0645F8952a58101M6376D3907b10656
9225e051j61505c6228k89734F8937a63308o5421b478A05391a06255R955r6446
9214a92746a563j71836d2862H3516i7146D694M7695c14437B13670f9706j23829
$$ y = [-311807, -219815, 22308, -115835, -104781, 324768, 56692, -55204, -151539, -162665, 67030, -187186, -95643, 46735, -135356, -131611, 141048, -16267, 78131, -198889, -254216, -141748, 133906, -221077, 73449, -182106, 27791, -64890, 239247, -171355, -203467, 214507, -36885, -116996, -226577, -56535, 7669, -174172, -119037, -121449, -211265, -25466, 33438, 190319, -127553, 48357, -71589, 244454, 180462, 90581, 1376, -164412, -208497, 75675, 278300, -123908, -26508, 50186, 98629, 197398, 138586, -206475, -11756, -19542, -285071, -80645, 68952, -158101, -111725, 43907, -210656, -5051, -166556, -36228, -325962, 68937, -163308, -228729, -2478, 105391, -106255, -96300, -192746, -1563, -173399, -42862, 83516, -97146, 4694, 52389, -314437, 213670, -69706, -193535]
9203a93535K0874b5195A8481R4783b11583A70959l8423b6304N98m73366E30531
9191a53128M4696e1480r2807M3604k11958O4668R5138r1092B712J88956a5346
9179B11786d46387M5113J95657B07262a18242j74048d5355B8741J96731b96969
9168B10676b61176K8126p50M2131N3066B81345b05740h0904l739A3430O4323K89917
9156C67670j56884j03527a55500A29099M9680a49352f6744n8756j41152C3570
9145E8801K83400a38543A75472a58462C4800J32728B633M09072a41342N441f1654
9133e6939K5592k7359J3827b0818A34986b3903p6004B8613p687K35254b57178
9121B08396i74l2396l7572B05647b31074h5708c650k2374j55827h4819A25896
$$ y = [-193535, -172661, -25195, 18481, 113264, -211583, 170959, 132536, -26304, -25706, -499072, 530531, -153128, -108432, -51480, -144287, -100683, -312641, -247973, -152835, -243927, 2712, 191668, -15346, 211786, -446387, -401274, -205617, 207262, -118242, -292290, -45355, 28741, 225472, -296969, 210676, -261176, -233050, -233800, -191669, -138603, 281345, -205740, -80904, -84643, 13430, 77753, 367670, 210786, 107259, -155500, 129099, 178779, -149352, -66744, -125500, -266652, 33570, 58801, 342201, -138543, 175472, -158462, 34800, 167528, 2633, 411705, -141342, -135901, -61654, -56939, -31347, -58706, -44879, -20818, 134986, -23903, -99907, 28613, 20926, 256180, -257178, 208396, -974, -33370, -70942, 205647, -231074, -85708, -3650, -26024, -181851, -84819, 125896]
9109I074J1520K56167a71851O2907l44003f9080A36426K03596g378l240E5473
9097F6787a79429F9370a33837O4834A16276c5735k71347b6534k50829b2649D7577
9085e8931j05726f3760l36945J84814k60453c1354B3185R6730a38297A19948f7011
9073H0081a39977A75508d41852a54259D6347a29025b113D4868O0076b55364J0104
9062b45260A0764L872b2782H4197B4695c73552a494A10940O6226a96632k18081
9051d14713B48935p901d2325E9000a04534K9217l4774A97721E8021L941a00036
9039f705l32004B38076b00054G6827c10871J16896L6269O8600j63434A04921b74415
9027G2958J1213b02357D5320R2360n060b6065k12173B05388j6865C8457h5590
$$ y = [9074, 20594, 276761, -171851, -108944, -452947, -69080, 136426, 340022, -7378, -10618, 55473, 66787, -179429, 69370, -133837, -69003, 116276, -35735, -307082, -26534, -277363, -22649, 47577, -58931, -164657, -63760, -400705, -215891, -476344, -31354, 23185, 119915, -138297, 119948, -67011, 80081, -139977, 175508, -441852, -154259, 46347, -129025, -2113, 44868, 104944, -255364, -245260, 10764, 14636, -22782, 84197, 24695, -373552, -1494, 110940, 177166, -196632, -414713, 248935, 241034, -42325, 59000, -104534, -75317, -110091, 197721, 58021, 61962, -100036, -6705, -338709, 238076, -200054, 76827, -310871, -193975, -157706, -89106, -252540, 104921, -274415, 72958, 84171, -202357, 45320, 137680, 132620, -26065, -238238, 205388, 188523, 38457, -85590]
9015a10138A01879J02990f3818l7966j97088J19165P201p364P0106d6767k84676
9004c31443a0663A20485c34556K1656I6093A5863M38803E4601e941m2146l87527
8993d35614A07476c3257j94124j21470J25027A5873k26O1410N4460O892h1633
8981d0994G8599N4545j3974a62394d3435b499j3102j31840b2232C7561b3617E7695
8968a85909B7384b6074C12634a72251A23880e1108j51695r9546A39834P6591C5761
8956i1572H6570c29987a23100A27081a42023M1726p6877B70132a22602r9963c0298
8944A78324G3499b20143C53476a20311G238e0957a8369B29586k1057J09040l8353
8933B79216I3862b26502A23121b77065B380b16135A6034R7353P35961J149555
$$ y = [-110138, 101879, 204869, -63818, -101784, -298872, -179707, -172506, -179870, -109764, -46767, -331443, -10663, 120485, -334556, -312900, 96093, 15863, 454666, 54601, -5941, -48087, -435614, 107476, -33257, -227381, -348851, -223824, 15873, 15647, 77057, 131517, 138409, -81633, -40994, 78599, 133144, 119170, -162394, -43435, -2499, -15601, -147441, -22232, 37561, -23617, 57695, -185909, 27384, -26074, 312634, -172251, 123880, -51108, -202803, -302349, 139834, 216425, 35761, -91572, 86570, -329987, -123100, 127081, -142023, -100297, -177174, 270132, -122602, -222565, -30298, 178324, 73499, -220143, 353476, -120311, 7238, -50957, -18369, 229586, 208529, 317569, 279216, 93862, -226502, 123121, -277065, 2380, -216135, 16034, 113387, 849348, 1998903]
8923A998903K305548O390005k386714C931316A074912m58192a744A01274K19205
8914C20479A22714a29597F9586K32605a33353A69709j7449N805R3074a1343k9434
8903d0777p6756r3857g2248j97800D8229J56441E6993i0117q4940H2640h5569
8891a81947k9196P2098m7295m6968J2381F1674J37507c842j04372L7963o1171
8880a31422I0315b581A64509G4306l2541b14018M3490k92882A04841n1148b8604
8868B67177i6119k19231B501O9441M0806a80048Q7706H0967R465B5393b6240C8504
$$ y = [1998903, 4304451, 10694456, 8307742, 3931316, 1074912, 616720, -1744, 101274, 320479, 122714, -129597, 69586, 302191, -133353, 169709, 152260, 158065, 251139, -11343, -40777, -117533, -211390, -72248, -270048, 48229, 204670, 56993, -90117, -175057, 82640, -85569, -181947, -211143, -139045, -186340, -233308, -220927, 61674, 199181, -3842, -108214, -70251, -131422, 90315, -2581, 164509, 74306, 41765, -214018, -170528, -463410, 104841, 53693, -28604, 267177, -96119, -315350, 2501, 71942, 112748, -180048, -92342, 80967, 90432, 25393, -26240, 38504]
$$ [...]
##END NTUPLES=NMR SPECTRUM
##END=
