##TITLE=AC1604_INDMA13334_8316017_3FHkaYX8vc
##JCAMPDX= 6.0         $$ Bruker NMR JCAMP-DX V2.0
##DATA TYPE= NMR SPECTRUM
##DATA CLASS= NTUPLES
##ORIGIN= BRUKER
##OWNER= Administrator
$$ 1.72 TOPSPIN		Version 2.1
$$ 2013-11-09 21:37:32.590 -0800  Administrator@X
$$ Compression mode = diff/dup
##.OBSERVE FREQUENCY= 400.02188249412
##.OBSERVE NUCLEUS= ^1H
##.ACQUISITION MODE= SIMULTANEOUS (DQD)
##.ACQUISITION SCHEME= undefined
##.AVERAGES= 8
##.DIGITISER RES= 22
##SPECTROMETER/DATA SYSTEM= spect
##.PULSE SEQUENCE= zg30
##.SOLVENT NAME= COFFEE_meoh
##.SHIFT REFERENCE= INTERNAL, COFFEE_meoh, 1, 14.98509
##AUDIT TRAIL= $$ (NUMBER, WHEN, WHO, WHERE, PROCESS, VERSION, WHAT)
$$ ##TITLE= Audit trail, TOPSPIN		Version 2.1
$$ ##JCAMPDX= 5.01
$$ ##ORIGIN= Bruker BioSpin GmbH
$$ ##OWNER= Administrator
$$ $$ E:\/data/COFFEE/nmr/AC1604_INDMA13334_8316017_3FHkaYX8vc/10/pdata/1/auditp.txt
$$ ##AUDIT TRAIL=  $$ (NUMBER, WHEN, WHO, WHERE, PROCESS, VERSION, WHAT)
(   1,<2013-11-09 21:37:25.662 -0800>,<Administrator>,<X>,<go>,<TOPSPIN 2.1>,
      <created by zg
	started at 2013-11-09 21:36:18.494 -0800,
	POWCHK enabled, PULCHK disabled,
       configuration hash MD5:
       C8 4E 4E 5D D3 5C D8 9E 9F 52 82 E0 59 8A DE 15
       data hash MD5: 64K
       EF 80 5B 3F 21 1C CF 00 9A 73 C4 01 4D 85 E8 2F>)
(   2,<2013-11-09 21:37:28.754 -0800>,<Administrator>,<X>,<proc1d>,<TOPSPIN 2.1>,
      <Start of raw data processing
       efp LB = 0 FT_mod = 6 PKNL = 1 PHC0 = 0 PHC1 = 0 SI = 32K 
       data hash MD5: 32K
       11 67 F6 63 BF EC 83 D8 34 AF 3B 4B 1C F0 BA 1B>)
(   3,<2013-11-09 21:37:29.094 -0800>,<Administrator>,<X>,<proc1d>,<TOPSPIN 2.1>,
      <pk PHC0 = 88.69263 PHC1 = 0 
       data hash MD5: 32K
       14 19 E4 3F EE 91 C1 1E 70 29 D2 77 5A 0F 56 17>)
(   4,<2013-11-09 21:37:29.202 -0800>,<Administrator>,<X>,<proc1d>,<TOPSPIN 2.1>,
      <abs ABSG = 1 
       data hash MD5: 32K
       4E 94 87 66 16 EB B2 FA 82 F8 FF 55 2E D1 D2 29>)
(   5,<2013-11-09 21:37:29.280 -0800>,<Administrator>,<X>,<proc1d>,<TOPSPIN 2.1>,
      <abs ABSG = 2 
       data hash MD5: 32K
       E6 BD BE A1 C2 B7 15 6E E2 4C 24 57 1B 96 6E 09>)
(   6,<2013-11-09 21:37:29.341 -0800>,<Administrator>,<X>,<proc1d>,<TOPSPIN 2.1>,
      <abs ABSG = 3 
       data hash MD5: 32K
       3E 7E 19 A8 B4 0A 8F C6 72 7E 12 3A CE 66 D8 2C>)
(   7,<2013-11-09 21:37:29.403 -0800>,<Administrator>,<X>,<proc1d>,<TOPSPIN 2.1>,
      <abs ABSG = 4 
       data hash MD5: 32K
       9A F8 57 39 2F B3 67 60 AD 65 54 83 D3 D0 67 2D>)
(   8,<2013-11-09 21:37:29.465 -0800>,<Administrator>,<X>,<proc1d>,<TOPSPIN 2.1>,
      <abs ABSG = 5 
       data hash MD5: 32K
       DB 9B 0D 44 3F 8C E4 3B 8F FA F2 E2 01 EA C8 A2>)
$$ ##END=
$$ 
$$ $$ hash MD5
$$ $$ 0D 76 FC 47 27 D4 15 42 BE 52 70 BF 9E BB 10 FC
##$RELAX= 
##$RELAX= 
##$RELAX= 
##$RELAX= 
##$RELAX= 
##$RELAX= 
##$RELAX= 
$$ Bruker specific parameters
$$ --------------------------
##$DU= <E:\>
##$EXPNO= 10
##$NAME= <AC1604_INDMA13334_8316017_3FHkaYX8vc>
$$ [...]
150 150 150 150 150 150 150 150
##$TP07= 0
##$TPNAME0= <>
##$TPNAME1= <>
##$TPNAME2= <>
##$TPNAME3= <>
##$TPNAME4= <>
##$TPNAME5= <>
##$TPNAME6= <>
##$TPNAME7= <>
##$TPOAL= (0..7)
0.5 0.5 0.5 0.5 0.5 0.5 0.5 0.5
##$TPOFFS= (0..7)
0 0 0 0 0 0 0 0
##$TUNHIN= 0
##$TUNHOUT= 0
##$TUNXOUT= 0
##$USERA1= <user>
##$USERA2= <user>
##$USERA3= <user>
##$USERA4= <user>
##$USERA5= <user>
##$V9= 5
##$VALIST= <valist>
##$VCLIST= <CCCCCCCCCCCCCCC>
##$VD= 0
##$VDLIST= <DDDDDDDDDDDDDDD>
##$VPLIST= <PPPPPPPPPPPPPPP>
##$VTLIST= <TTTTTTTTTTTTTTT>
##$WBST= 1024
##$WBSW= 4
##$XGAIN= (0..3)
0 0 0 0
##$XL= 0
##$YL= 0
##$YMAX_a= 620431
##$YMIN_a= -542124
##$ZGOPTNS= <>
##$ZL1= 120
##$ZL2= 120
##$ZL3= 120
##$ZL4= 120
##$ABSF1= 14.98509
##$ABSF2= -5.573092
##$ABSG= 5
##$ABSL= 3
##$ALPHA= 0
##$AQORDER= 0
##$ASSFAC= 0
##$ASSFACI= 0
##$ASSFACX= 0
##$ASSWID= 0
##$AUNMP= <proc_prof1d_extract_pilot.lims>
##$AXLEFT= 0
##$AXNAME= <>
##$AXNUC= <1H>
##$AXRIGHT= 0
##$AXTYPE= 0
##$AXUNIT= <>
##$AZFE= 0.1
##$AZFW= 0.1
##$BCFW= 0
##$BC_mod= 0
##$BYTORDP= 0
##$COROFFS= 0
##$CY= 15
##$DATMOD= 1
##$DC= 0
##$DFILT= <>
##$DTYPP= 0
##$F1P= 0
##$F2P= 0
##$FCOR= 0.5
##$FTSIZE= 32768
##$FT_mod= 6
##$GAMMA= 0
##$GB= 0
##$INTBC= 1
##$INTSCL= 1
##$ISEN= 128
##$LB= 0
##$LEV0= 0
##$LPBIN= 0
##$MAXI= 10000
##$MC2= 0
##$MEAN= 0
##$ME_mod= 0
##$MI= 0
##$NCOEF= 0
##$NC_proc= -8
##$NLEV= 6
##$NOISF1= 0
##$NOISF2= 0
##$NSP= 0
##$NTH_PI= 0
##$NZP= 0
##$OFFSET= 14.98509
##$PC= 1
##$PHC0= 88.69263
##$PHC1= 0
##$PH_mod= 1
##$PKNL= yes
##$PPARMOD= 0
##$PPDIAG= 0
##$PPIPTYP= 0
##$PPMPNUM= 2147483647
##$PPRESOL= 1
##$PSCAL= 4
##$PSIGN= 0
##$PYNMP= <proc.py>
##$REVERSE= no
##$SF= 400.02
##$SI= 32768
##$SIGF1= 0
##$SIGF2= 0
##$SINO= 400
##$SIOLD= 32768
##$SPECTYP= <>
##$SREGLST= <1H.CDCl3>
##$SSB= 0
##$STSI= 32768
##$STSR= 0
##$SW_p= 8223.68421052631
##$SYMM= 0
##$S_DEV= 0
##$TDeff= 65536
##$TDoff= 0
##$TI= <>
##$TILT= no
##$TM1= 0
##$TM2= 0
##$TOPLEV= 0
##$USERP1= <user>
##$USERP2= <user>
##$USERP3= <user>
##$USERP4= <user>
##$USERP5= <user>
##$WDW= 1
##$XDIM= 32768
##$YMAX_p= 465488842
##$YMIN_p= -684132
##$CURPLOT= <Network HP LaserJet P1505>
##$CURPRIN= <$Network HP LaserJet P1505>
##$DFORMAT= <normdp>
##$LAYOUT= <+/1D_H.xwp>
##$LFORMAT= <normlp>
##$PFORMAT= <normpl>
##$SURQMSG= 1
$$ End of Bruker specific parameters
$$ ---------------------------------
##NTUPLES= NMR SPECTRUM
##VAR_NAME=  FREQUENCY,     SPECTRUM/REAL,   SPECTRUM/IMAG
##SYMBOL=    X,             R,               I
##VAR_TYPE=  INDEPENDENT,   DEPENDENT,       DEPENDENT
##VAR_FORM=  AFFN,          ASDF,            ASDF
##VAR_DIM=   32768,         32768,           32768
##UNITS=     HZ,            ARBITRARY UNITS, ARBITRARY UNITS
##FACTOR=    0.250966925370066, 1,           1
##FIRST=     8223.43324360094, -131767,      -174296
##LAST=      0,             -52758,          -170557
##MIN=       0,             -684132,         0
##MAX=       8223.43324360094, 465488842,    0
$$ Real data points
##PAGE= N=1
##DATA TABLE= (X++(R..R)), XYDATA
$$ [...]
19557A20541b27559D40418A33054h2939A6882a18323l31340A95716b13543c9036
$$ 120541 -227559 440418 133054 -82939 16882 -118323 -449663 195716 -213543 -39036
19546a88438P4009L9979A69941F202b49496j0310R0293l5731R7857B49824c8752
$$ -188438 -114429 -74450 169941 6202 -249496 -259806 -169513 -205244 -107387 249824 -38752
19534f3852j28206j67406e7236j30184h4117n0780c691F1894a40329A5068b0662
$$ -63852 -192058 -359464 -57236 -187420 -84117 -134897 -3691 61894 -140329 15068 -20662
19522F8025J30052E9334i7607A39436a87431k7726C14208a0418H7803j818J59851
$$ 68025 198077 59334 -97607 139436 -187431 -215157 314208 -10418 87803 85985 245836
19511B45836F8619B9533J7678I182P7161a73304F5465a58561I2818J36809a6255
$$ 245836 68619 29533 47211 9182 86343 -173304 65465 -158561 92818 229627 -16255
19499f6954C28246i4015G5882b50946A07998d0762d900k41530a03045j61994Q8409
$$ -66954 328246 -94015 75882 -250946 107998 -40762 -4900 -246430 -103045 -265039 -176630
19488a76630k1564A46100M7102b97473e5772k69088a14662E8056b07641L4637
$$ -176630 -198194 146100 193202 -297473 -55772 -324860 -114662 58056 -207641 -173004
19478a73004O0786j50511H9985c89422a41732d1070m7056B21550b43422h4902
$$ -173004 -112218 -262729 89985 -389422 -141732 -41070 -88126 221550 -243422 -84902
19467b59833A27255F0957a18312A8714a71825Q0337R163A28347K6538J6008p0502
$$ -259833 127255 60957 -118312 18714 -171825 -91488 -82325 128347 154885 170893 100391
19456A00391J31549i8403j22382j47038H8690c09388A29603D7244q33d6068j6091
$$ 100391 231940 -98403 -220785 -367823 88690 -309388 129603 47244 46411 -46068 -62159
19445f2159q4417m1351K908B0979h4561k54946J68922j29080E7615a96089O3617
$$ -62159 -146576 -187927 -185019 20979 -84561 -339507 -170585 -299665 57615 -196089 -132472
19434a32472j4603A64425a25187M7787M726C8746i9054A758J99500e5115n3620
$$ -132472 -147075 164425 -125187 -77400 -72674 38746 -99054 1758 201258 -55115 -108735
19423a08735F972L24195a54594A90790o9631A676k76P8546b6031D089d08068a36790
$$ -108735 6972 331167 -154594 190790 121159 1676 1400 79946 -26031 4089 -408068 -136790
19410h104L618A55133B0217g3649q1714N9683j61266J7216F3004a57444j65843
$$ -8104 -4486 155133 20217 -73649 -155363 -95680 -256946 -239730 63004 -157444 -323287
19399c23287a07692b0049G7346c20928E2656K0980K55728H5903a40934G5319c08717
$$ -323287 -107692 -20049 77346 -320928 52656 73636 329364 85903 -140934 75319 -308717
19387i2667j3726H615i7802j23743e9745e393k83240J06525A56958O576E056f2548
$$ -92667 -106393 8615 -97802 -221545 -59745 -5393 -288633 -182108 156958 163534 5056 -62548
19374i7251j28544D79203c0667j37095A09655l527L66693A32806d04215C6183
$$ -97251 -225795 479203 -30667 -167762 109655 106128 472821 132806 -404215 36183
19363c01462h7049N413O385E195K5838b76246I7805B7291c15621J45113P0709
$$ -301462 -87049 -81636 -75251 5195 31033 -276246 97805 27291 -315621 -170508 -99799
19352i9799B29299a95105l4330g1624o5934k00340O7481g0426j2484j95758B00024
$$ -99799 229299 -195105 -229435 -71624 -137558 -337898 -270417 -70426 -82910 -278668 200024
19340D4854q692b24540g1982l5518D3127a54894b3470E2445e0647k29636f6669
$$ 44854 36162 -224540 -71982 -107500 43127 -154894 -23470 52445 -50647 -280283 -66669
19328A7307M6177b93483d2872A20372d83735E8077a68658i278j07720D6535a34976
$$ 17307 63484 -293483 -42872 120372 -483735 58077 -168658 -9278 -116998 46535 -134976
19316A13107N5941b46744B4779d99113a85535E12772b84190C43219F8422a78024
$$ 113107 169048 -246744 24779 -499113 -185535 512772 -284190 343219 68422 -178024
19305c61457a79837A42348a00055E4297c4318i444A83346b85056i8710o6586E5409
$$ -361457 -179837 142348 -100055 54297 -34318 -9444 183346 -285056 -98710 -165296 55409
19293e5372k13131A71232d6596B28383g6899I6736b90015q7431I3758a39244L9864
$$ -55372 -268503 171232 -46596 228383 -76899 96736 -290015 -377446 93758 -139244 -99380
19282i9380j52411j6771A12436c09361j17150C3516P1970n429P1265o9523d19429
$$ -99380 -251791 -268562 112436 -309361 -426511 33516 105486 100057 171322 101799 -419429
19270h3897C2454a12604e6223G3305b30442M5633A10711a09598A5313N0879L32714
$$ -83897 32454 -112604 -56223 73305 -230442 -184809 110711 -109598 15313 66192 398906
19259C98906F6210i6029L8338A26973i9916j45561A52819E1044b51805G758a29138
$$ 398906 66210 -96029 -57691 126973 -99916 -245477 152819 51044 -251805 7758 -129138
19247B8992J0426d352l06554A23789b21243A13831a01520p6507r505A28668J52901
$$ 28992 39418 -4352 -310906 123789 -221243 113831 -101520 -178027 -187532 128668 281569
19236B81569a84523e0688E9661a45145j07326H6645a54569n7316C72399a02475
$$ 281569 -184523 -50688 59661 -145145 -252471 86645 -154569 -211885 372399 -102475
19225a70229H500R5443d56510C6059d157j6817j39730B59959E7975N1823m6418
$$ -170229 8500 103943 -456510 36059 -4157 -20974 -160704 259959 57975 109798 63380
19214F3380b44115h8335M3916j80955J10069q7838B00667q5757b50316F576f5568
$$ 63380 -244115 -88335 -44419 -225374 -115305 -203143 200667 114910 -250316 6576 -65568
19202a0774p4335E5995e2125k5233B73653a41678j13351f2279B24740a07094m5071
$$ -10774 -85109 55995 -52125 -77358 273653 -141678 -255029 -62279 224740 -107094 -152165
19191a52165a1830D6906f3887F2006N4950a8004p5374A01605a65040N762o7852
$$ -152165 -11830 46906 -63887 62006 116956 -18004 -93378 101605 -165040 -159278 -227130
19180b27130B18709c3590J2910j04816F7489J42099a273A55835B1730l650h2987
$$ -227130 218709 -33590 -20680 -125496 67489 209588 -1273 155835 21730 18080 -82987
19168A239e2182m9139A66346k8222F7057a50480m2603A795a66493A28125j5122
$$ 1239 -52182 -101321 166346 138124 67057 -150480 -193083 1795 -166493 128125 113003
19157A13003c54563J50595d0888j53617h7007A17982C0972b35905G4898i7641
$$ 113003 -354563 -203968 -40888 -194505 -87007 117982 30972 -235905 74898 -97641
19146B41194d4225a4989k10045Q3599f520j85543j55817A62672J30057A17607
$$ 241194 -44225 -14989 -225034 -141435 -6520 -192063 -347880 162672 292729 117607
19135B17660b07523i3780A01J10633c27692a45793H64Q1804f5758j39381F5247
$$ 217660 -207523 -93780 101 110734 -327692 -145793 864 82668 -65758 -205139 65247
19123a34912j50354R0624f7024k03347d3776k04669b2533l8539m0181F9671c86163
$$ -134912 -285266 -194642 -67024 -270371 -43776 -248445 -22533 -61072 -101253 69671 -386163
19111A09943C317b44484B17724b67168K1259j1404I0330a78339e9223A72278a13275
$$ 109943 3317 -244484 217724 -267168 -245909 -257313 90330 -178339 -59223 172278 -113275
19099c0785A14264k3541a79361j5300h5522m0893e3492j15893o533C952a01851
$$ -30785 114264 90723 -179361 -194661 -85522 -126415 -53492 -169385 -175918 3952 -101851
19087B3721G552J60086a81975f4076j01969j19443J20448H3105b97753B18074
$$ 23721 7552 167638 -181975 -64076 -166045 -285488 -165040 83105 -297753 218074
19076g5491m1625E5262b462F6797h6202J3648r139o2342a3413j3080l77767A62884
$$ -75491 -117116 55262 -2462 66797 -86202 -72554 -81693 -144035 -13413 -26493 -404260 162884
19063B0806N8129e3916l1851J3803J7173A27419k543n7724e0692l5862C39659
$$ 20806 78935 -53916 -85767 -71964 -54791 127419 124876 67152 -50692 -86554 339659
19051b21248G7460d1843j87205a03487q6514A25342m1402c6510A96894F2517c2436
$$ -221248 77460 -41843 -229048 -103487 -190001 125342 83940 -36510 196894 62517 -32436
19039a6637j52345c8992F2720O9360j6449J02154r0716J32374D7294d0727A65230
$$ -16637 -168982 -38992 62720 132080 115631 217785 127069 259443 47294 -40727 165230
19027B25675M7139a28638B63908a01679A35963M6029H7636e1830C0854f6990k46318
$$ 225675 272814 -128638 263908 -101679 135963 181992 87636 -51830 30854 -66990 -313308
19016c13308a53860P4980p7430O4613E0417K82145b24112R8926R7M7362r6423
$$ -313308 -153860 -78880 -156310 -91697 50417 332562 -224112 -125186 -125089 -77727 -174150
19005a74150C6154a84104A30940b18339K3891A3465B76a37193j09587k3030N4164
$$ -174150 36154 -184104 130940 -218339 -194448 13465 276 -137193 -246780 -269810 -215646
18994b15646F4301A8707g8749j20602i3539l80419A09373a11179A14676l3467
$$ -215646 64301 18707 -78749 -199351 -93539 -473958 109373 -111179 114676 81209
18984H1209M7624j4474a50806M5650l5034A97959e1705B0093K71597c41112c8771
$$ 81209 128833 114359 -150806 -105156 -140190 197959 -51705 20093 291690 -341112 -38771
18972C2140b09275J6794e7039b3122r2288F1303c94278C10591b26623N3967m14
$$ 32140 -209275 -192481 -57039 -23122 -115410 61303 -394278 310591 -226623 -172656 -173070
18961a73070C8545g3567A05218M8752d13788g9720B74938l833P3230a71462B2836
$$ -173070 38545 -73567 105218 153970 -413788 -79720 274938 271105 344335 -171462 22836
18949A0504J36703f4928k9584k47252g3912D0206J80839a41247r2566i7249k25533
$$ 10504 147207 -64928 -94512 -341764 -73912 40206 221045 -141247 -233813 -97249 -322782
18938c22782Q2457A82481o3089c960j73641k71161A10123d8651n9048A75215e5858
$$ -322782 -240325 182481 119392 -3960 -177601 -448762 110123 -48651 -107699 175215 -55858
18926c21823f099A02116J96110g4911H221J00672a38803l1015L240e1586K4634
$$ -321823 -6099 102116 298226 -74911 8221 108893 -138803 -169818 -166578 -51586 -26952
18915b6952I8869Q6566m4907d4066A91596c4583J4408j1298j76761m6846A4416
$$ -26952 98869 185435 140528 -44066 191596 -34583 -20175 -31473 -208234 -255080 14416
18903h8740E4778a24482M0976K8645C5394K3307A7399g1710g952A58984a53497
$$ -88740 54778 -124482 -83506 -54861 35394 58701 17399 -71710 -7952 158984 -153497
18891a55950H6582c8243J8538A04350e58119e2059o9949C430Q4634l4402J30844
$$ -155950 86582 -38243 -19705 104350 -558119 -52059 -122008 3430 88064 53662 184506
18880A84506J59507j27739a41099C5565c83487i8479j63506c7707o7454d5673
$$ 184506 344013 216274 -141099 35565 -383487 -98479 -261985 -37707 -105161 -45673
18869a50172r6152A90236H6098g6737k13943O2094a01287K581K0585k0400q2431
$$ -150172 -246324 190236 86098 -76737 -290680 -228586 -101287 -98706 -78121 -98521 -180952
18858a80952n0917d3360C4217A4758O2703a92229K3115q8738A32333c75071a14507
$$ -180952 -231869 -43360 34217 14758 77461 -192229 -169114 -257852 132333 -375071 -114507
18846B4313O6632a13780A51042a89957j71001H0032a18769l5141k6427d9819p1075
$$ 24313 90945 -113780 151042 -189957 -360958 80032 -118769 -153910 -180337 -49819 -120894
18835a20894A09928K59515k237a59339q5854A89871a57348j55756i7363A80322
$$ -120894 109928 369443 367206 -159339 -245193 189871 -157348 -313104 -97363 180322
18824a21103B04234C1964M1206O1649P048C1582I463L1819J2481g6610l1746D11058
$$ -121103 204234 31964 73170 134819 141867 31582 9463 41282 53763 -76610 -108356 411058
18811D223L8376e1441A81241E8905J1586M6987a29743d6425G4989c48926l6850
$$ 4223 42599 -51441 181241 58905 70491 117478 -129743 -46425 74989 -348926 -385776
18800c85776F8736M799a75221D4563c8173n5620f372m3913k64352J49394B42528
$$ -385776 68736 73535 -175221 44563 -38173 -93793 -6372 -50285 -314637 -165243 242528
18788A4010J94935c3195A34382m2414h2858l45929a9824C7407b55971g9983c7168
$$ 14010 208945 -33195 134382 91968 -82858 -428787 -19824 37407 -255971 -79983 -37168
18776i2007l53455K07589k5068A27112i4017j25444J5307N0741B38710e7777m2720
$$ -92007 -445462 -237873 -262941 127112 -94017 -219461 -204154 -153413 238710 -57777 -100497
18765a00497a3232j33456a5760A71576c11477H6122f1280j27098b2615j40376
$$ -100497 -13232 -146688 -15760 171576 -311477 86122 -61280 -188378 -22615 -162991
18755a62991F6920a06533A26627a83590B2256a50261A6750K9947e6137A40846
$$ -162991 66920 -106533 126627 -183590 22256 -150261 16750 46697 -56137 140846
18744b60035d6886I5213a32575D0279d09765a09597A06085a48042E4423k887O6583
$$ -260035 -46886 95213 -132575 40279 -409765 -109597 106085 -148042 54423 51536 118119
18733A18119C0060a71055A22490a65496L4265f4497a9788k44606A4669g2251j43255
$$ 118119 30060 -171055 122490 -165496 -131231 -64497 -19788 -264394 14669 -72251 -215506
18722b15506O8079c7590J5626E1619M4969c22678I9892b43873A57677g6558A69643
$$ -215506 -147427 -37590 -21964 51619 96588 -322678 99892 -243873 157677 -76558 169643
18710A48116a12774m3983j68239a45738A26394e2363j00054b9960B15985a42250
$$ 148116 -112774 -156757 -324996 -145738 126394 -52363 -152417 -29960 215985 -142250
18699d9285k78j8069B1517i8790D854b15749d7482j50749I6658c2696I0283h5372
$$ -49285 -49563 -67632 21517 -98790 4854 -215749 -47482 -198231 96658 -32696 90283 -85372
18686c207j36729B32400c28423C42093G6934b81685e4715A62219f875p4025p9494
$$ -3207 -139936 232400 -328423 342093 76934 -281685 -54715 162219 -6875 -80900 -160394
18675a60394k3040N1719C5277j5169c3083A64882b33418c7086n5840j12395h9519
$$ -160394 -183434 -131715 35277 20108 -33083 164882 -233418 -37086 -92926 -205321 -89519
18663b46949B34808b51219A74641c97626E9224b99063j2555J52180e8628H9497
$$ -246949 234808 -251219 174641 -397626 59224 -299063 -311618 -159438 -58628 89497
18652B8180g3893l19858a82649Q5329c9215A19308i9562o9334J2319G0126b0910
$$ 28180 -73893 -393751 -182649 -97320 -39215 119308 -99562 -168896 -156577 70126 -20910
18640D5940a08545M0262k57033H4409a842k18534B93913r666I9178c98725B6484
$$ 45940 -108545 -68283 -325316 84409 -1842 -220376 293913 284247 99178 -398725 26484
18628g7487A21744i769k46804C1131a99807j12920O2305A69222N4162a6238I9822
$$ -77487 121744 -9769 -256573 31131 -199807 -312727 -250422 169222 223384 -16238 99822
18616A16351A749e3805j34498b9010B4630O5993a12643H2829b70673B18311B4424
$$ 116351 1749 -53805 -188303 -29010 24630 90623 -112643 82829 -270673 218311 24424
18604A36574B7240a11735k5477l8040F9830d55969d7593k44580D09375i0457I308
$$ 136574 27240 -111735 -137212 -175252 69830 -455969 -47593 -292173 409375 -90457 9308
18592d4768k53830h2443j0412J2683j60247E2768c4006F9830a43375j82602a10533
$$ -44768 -298598 -82443 -92855 -80172 -240419 52768 -34006 69830 -143375 -325977 -110533
18580C87593a94055B40290A2170d8072C2211e2497G8010f4368j19544k1005B56351
$$ 387593 -194055 240290 12170 -48072 32211 -52497 78010 -64368 -183912 -204917 256351
18568a68982B65185E3376I843a89660M1988A45273C576L06852a37513j72875a34316
$$ -168982 265185 53376 9843 -189660 -147672 145273 3576 310428 -137513 -310388 -134316
18556a67114K3905C6471N302c85800a31536f0880H3995c7719r1268k1988a3939
$$ -167114 -143209 36471 41773 -385800 -131536 -60880 83995 -37719 -128987 -150975 -13939
18544a49946j4640A71483a30609K8599k05099R2699A5674M3435A4760b19151j89818
$$ -149946 -164586 171483 -130609 -102010 -307109 -214410 15674 59109 14760 -219151 -408969
18533d08969a25428k30860A18137i0748K8037p0585B73873a08569A16121e3228
$$ -408969 -125428 -356288 118137 -90748 -62711 -133296 273873 -108569 116121 -53228
18522b17762d3911k5865j57730H5263O3115D2729e09403J78733L5213a07184d3245
$$ -217762 -43911 -69776 -227506 85263 148378 42729 -509403 -330670 -295457 -107184 -43245
18510a09388q6876F3014J28706C1340P2206c17343M4915R5543H6370A1776e0032
$$ -109388 -196264 63014 191720 31340 103546 -317343 -272428 -176885 86370 11776 -50032
18498b98474a11129k28245g5772l1425k7288B03828g7195l15160a3217E4528o336
$$ -298474 -111129 -339374 -75772 -107197 -134485 203828 -77195 -392355 -13217 54528 48192
18487D8192f3597K0379P191C34426a47706A42408c03482A49780F3731B8513e772
$$ 48192 -63597 -43218 -36027 334426 -147706 142408 -303482 149780 63731 28513 -5772
18475a08575B3584j995K55851b09220M4896E76991C7083b51789J8864J07371B19832
$$ -108575 23584 21589 277440 -209220 -164324 576991 37083 -251789 -232925 -125554 219832
18463a8180F4394A1588J65938p7971b1637A46549d937j17636a687j07647A04981
$$ -18180 64394 11588 177526 99555 -21637 146549 -4937 -122573 -1687 -109334 104981
18451i594A1293b72920a781j61876j18523A1541L70341A0325b24299F2610Q9111
$$ -9594 11293 -272920 -1781 -163657 -282180 11541 381882 10325 -224299 62610 151721
18440A51721a46632d6610q6782a7185k36765B1890Q5883h2199A99854c4601j06907
$$ 151721 -146632 -46610 -133392 -17185 -253950 21890 107773 -82199 199854 -34601 -141508
18429a41508j07315J06140o9905e2844k77085h7167G2091J98519a25921n6727
$$ -141508 -248823 -142683 -212588 -52844 -329929 -87167 72091 270610 -125921 -182648
18419a82648c1917o59A32189a48870d6482A99532R2069g8823A5717b10998I3146
$$ -182648 -31917 -32576 132189 -148870 -46482 199532 291601 -78823 15717 -210998 93146
18407A42697n0480c8595j84124J11241A5456L14769a02449F7262b02507A76365
$$ 142697 92217 -38595 -222719 -111478 15456 330225 -102449 67262 -202507 176365
18396F5850b09799i5482A0209a0161A13531b3008k67230A2885M90779A90742b47317
$$ 65850 -209799 -95482 10209 -10161 113531 -23008 -290238 12885 503664 190742 -247317
18384c99A90385L3234b9164A0865a98688A6475c02565j0336A7060K26224E1017
$$ -399 190385 223619 -29164 10865 -198688 16475 -302565 -312901 17060 243284 51017
18372C56004a06175B05027g9799C5374b19155A5473b70273A68711A1518M05395
$$ 356004 -106175 205027 -79799 35374 -219155 15473 -270273 168711 11518 416913
18362D16913e2485D2997R7024a11621g31m18287h2866A82260q3468g1198B13887
$$ 416913 -52485 42997 140021 -111621 -731 -419018 -82866 182260 98792 -71198 213887
18350a62126j33883G6926K99771a25328l13395a01452A75888c31431g8154j78857
$$ -162126 -296009 76926 376697 -125328 -438723 -101452 175888 -331431 -78154 -257011
18340b57011r4789c7024m3143o2735p2223H4326a59549O1310j09072N6748m4689
$$ -257011 -351800 -37024 -80167 -142902 -215125 84326 -159549 -98239 -207311 -150563 -195252
18329a95252k6958c9648E3520a74703A53982a26830J8601A63363F7761L7055K39536
$$ -195252 -222210 -39648 53520 -174703 153982 -126830 -108229 163363 67761 104816 344352
18318C44352h0679p9398P4439j70183g1264r9339A4038J16398c55964a64739k83154
$$ 344352 -80679 -160077 -85638 -255821 -71264 -170603 14038 130436 -355964 -164739 -447893
18307d47893B84480a9862j72711a3282k04430D7071d08125J99129f8878A92019
$$ -447893 284480 -19862 -192573 -13282 -217712 47071 -408125 -208996 -68878 192019
18296a72037P2735j03680l8408A61394a13935I4180j4125g9111F2148a73647d3820
$$ -172037 -99302 -202982 -241390 161394 -113935 94180 80055 -79111 62148 -173647 -43820
18284D163b18168R1320e8830J9789G782a16063B02978o0786B4318L7352R8157
$$ 4163 -218168 -126848 -58830 -39041 7782 -116063 202978 142192 24318 61670 159827
18273A59827b03103D5323b45577A41808a03852j7842A72996a94974e2402J3336
$$ 159827 -203103 45323 -245577 141808 -103852 -121694 172996 -194974 -52402 -39066
18263c9066j62617j6074A44759K50009d7020f532P67B04520c4833p7869A56167
$$ -39066 -201683 -217757 144759 394768 -47020 -6532 -5765 204520 -34833 -112702 156167
18251A39758l6469a21545A45275D968b6399j81406B61920a93529b3042k00078
$$ 139758 103289 -121545 145275 4968 -26399 -207805 261920 -193529 -23042 -223120
18241b23120a9162k46728J11306O8981l30161a74462F7874A3709a17579M8824
$$ -223120 -19162 -265890 -154584 -85603 -415764 -174462 67874 13709 -117579 -68755
18231f8755l9570A55798a42424b5524p5113c585j38093f6887A02624B851a79276
$$ -68755 -108325 155798 -142424 -25524 -100637 -3585 -141678 -66887 102624 2851 -179276
18219A03103b90761R0672c7162n8127A17595b3491j30479A70011g6418B68519
$$ 103103 -290761 -200089 -37162 -95289 117595 -23491 -153970 170011 -76418 268519
18208H5784c04439I9777a2819A65037e2586A27110A7497c57980F6659C3305e0660
$$ 85784 -304439 99777 -12819 165037 -52586 127110 17497 -357980 66659 33305 -50660
18196A1170m736g5214j12700H7301a38648o0849F561a19429C9191a62074O0479
$$ 11170 6434 -75214 -187914 87301 -138648 -199497 6561 -119429 39191 -162074 -101595
18185a01595b4226H1945c5156I4153a59189k4813A63353h7045J707C7893j5174
$$ -101595 -24226 81945 -35156 94153 -159189 -184002 163353 -87045 -85338 37893 22719
18174B2719R0870a84999P6958A1299J20719e4809j67304e5716J1592n7791C34141
$$ 22719 113589 -184999 -108041 11299 132018 -54809 -222113 -55716 -44124 -101915 334141
18162D8936L3074M1320K9429b2714A33315b55189B44328A0771a30836A54403J7906
$$ 48936 82010 123330 152759 -22714 133315 -255189 244328 10771 -130836 154403 172309
18151A72309a77980B7990a16085n6665H4862R3647Q7326E2753a83473I6676j4503
$$ 172309 -177980 27990 -116085 -172750 84862 178509 265835 52753 -183473 96676 82173
18140H2173J35149A3222a83757J0501c633j19466a7730j88779h5721m887A57709
$$ 82173 217322 13222 -183757 -173256 -3633 -123099 -17730 -206509 -85721 -90608 157709
18128h3561q4001O3240j75890Q0920B14376J3609G1943J25039q6031K7097c43150
$$ -83561 -167562 -104322 -280212 -199292 214376 227985 71943 196982 110951 138048 -343150
18116a18850p8798C066K16944m8006j3273b68271c3104H5613b48686L4482A41732
$$ -118850 -197648 3066 220010 172004 158731 -268271 -33104 85613 -248686 -214204 141732
18104i289k41813J22080L2967C9549J49085j4589a34123A77134E6837a12189A34823
$$ -9289 -251102 -129022 -96055 39549 188634 174045 -134123 177134 56837 -112189 134823
18092A1206J77672L8227i0167M321A10146a20191k61618C47406a974A47630J04252
$$ 11206 188878 227105 -90167 -85846 110146 -120191 -381809 347406 -1974 147630 251882
18081B51882c12263g8066k31677a43042M3984A63104b36956l2386e6413k21949
$$ 251882 -312263 -78066 -309743 -143042 -99058 163104 -236956 -269342 -56413 -278362
18071b78362K6570M3076j88293E1217k2484a11476q6148A7489J54586A0899K6841
$$ -278362 -251792 -208716 -397009 51217 28733 -111476 -197624 17489 172075 10899 37740
18060C7740a36374j19024Q7206g7135A32533j8293c44198a67433A16789J28163
$$ 37740 -136374 -255398 -168192 -77135 132533 114240 -344198 -167433 116789 244952
18050B44952a76574B83036a4491j74653f5242j3186G6211d6594B00159o9225J39843
$$ 244952 -176574 283036 -14491 -189144 -65242 -78428 76211 -46594 200159 130934 270777
18039B70777k0321b24479P6354B2496K29435o1554b50340R1040r9195A13664M7632
$$ 270777 250456 -224479 -148125 22496 251931 190377 -250340 -159300 -258495 113664 161296
18028A61296n2995A5722c61321C20339e8606D0672a74639A25531b26515Q3209
$$ 161296 108301 15722 -361321 320339 -58606 40672 -174639 125531 -226515 -143306
18018a43306k58044F241a02698A48756h2615c3515j61137P5907c2252B11486g8944
$$ -143306 -401350 6241 -102698 148756 -82615 -33515 -194652 -118745 -32252 211486 -78944
18006a35086M5506A19622h2029l0130C38610d8131C26435j48818j7386K1991j4703
$$ -135086 -89580 119622 -82029 -112159 338610 -48131 326435 177617 160231 182222 167519
17995A67519g754l9878p6109m8170B66255c50645A61983i1478C8306J82392A9026
$$ 167519 -7754 -47632 -123741 -171911 266255 -350645 161983 -91478 38306 220698 19026
17983H4309a21531C24301c07449D3364a36467A48661e50408a14556a9982A25606
$$ 84309 -121531 324301 -307449 43364 -136467 148661 -550408 -114556 -19982 125606
17972b37186a05215j08640A36996L31096A62538c1557j47108A75449P2944H0175
$$ -237186 -105215 -213855 136996 468092 162538 -31557 -178665 175449 248393 80175
17961B5025i721j39729j6506g544p1342k2574j3574j88711I037J13787a02867
$$ 25025 -9721 -149450 -165956 -7544 -78886 -101460 -115034 -303745 9037 122824 -102867
17949g4581F0175K2178a01975F8985a33510j21159I2213K12999b16921p5191R1388
$$ -74581 60175 82353 -101975 68985 -133510 -254669 92213 305212 -216921 -292112 -200724
17938b00724A80891a92108A09356g314k185A01944a86883b4204j08041o0460A50524
$$ -200724 180891 -192108 109356 -7314 -9499 101944 -186883 -24204 -132245 -192705 150524
17926H6432b57797K8915D7377K33445b6765n66125h9557A41432a29064k8161A91243
$$ 86432 -257797 -228882 47377 280822 -26765 -592890 -89557 141432 -129064 -157225 191243
17914e1138o4082B23922a54707G228L47111c79226C3625a350n7692j4803J5238
$$ -51138 -115220 223922 -154707 7228 354339 -379226 33625 -1350 -59042 -73845 -58607
17903e8607b4604A88818d2270j54295Q4695F2521K0473h1326A3597N7131a27531
$$ -58607 -24604 188818 -42270 -196565 -111870 62521 82994 -81326 13597 70728 -127531
17891E5464C555J06647r226J81441a6635j42670A05611k1233i4897A15393a24046
$$ 55464 3555 110202 100976 282417 -16635 -159305 105611 84378 -94897 115393 -124046
17879h2930L0976j34507r5295a33371O2439j13946A23808a37400l05519d4276
$$ -82930 -51954 -186461 -281756 -133371 -70932 -184878 123808 -137400 -442919 -44276
17868I1934f1458A59589a70584B01593b51112A53255a47022H9503J17586E7419
$$ 91934 -61458 159589 -170584 201593 -251112 153255 -147022 89503 207089 57419
17857b55580a5316B38556f1835H952K00405g7491c1651k7313h520H8664a7850
$$ -255580 -15316 238556 -61835 8952 209357 -77491 -31651 -58964 -8520 88664 -17850
17845A8569J10856o4375a06730n6057K3502j38553l8349a3954m5550k2506I7332
$$ 18569 129425 65050 -106730 -162787 -139285 -277838 -316187 -13954 -59504 -82010 97332
17833h2962G6320K67374a42772c4769A28422B8483H635a20983B04346a76920P5405
$$ -82962 76320 343694 -142772 -34769 128422 28483 8635 -120983 204346 -176920 -101515
17822a01515K7546j44410c7375B14005h940o03887a37582B2994a80786c1410r3101
$$ -101515 -73969 -218379 -37375 214005 -8940 -612827 -137582 22994 -180786 -31410 -124511
17811a24511q5216b7608k31968A34318J9069c328l8137r433E3501K6688L4313
$$ -124511 -209727 -27608 -259576 134318 153387 -3328 -41465 -50898 53501 80189 114502
17800A14502a55964b899n1892H8861a69096A06271J38885e0132H2566a1875j19532
$$ 114502 -155964 -2899 -54791 88861 -169096 106271 245156 -50132 82566 -11875 -131407
17789a31407k9157N4948I2805J32202d53645g4312F8536a22514b3479n2517A8346
$$ -131407 -160564 -105616 92805 225007 -453645 -74312 68536 -122514 -23479 -75996 18346
17777A04230c67496a15808I8093h1338A79206b31279B41523b62534B40039K5017
$$ 104230 -367496 -115808 98093 -81338 179206 -231279 241523 -262534 240039 265056
17767B65056A20860L5819P8209K8514A7044K45259b67066i3514C04134J98627
$$ 265056 120860 156679 234888 263402 17044 262303 -267066 -93514 304134 502761
17757E02761A78063K23885B267J45291a37901J1735A82753N4753J39008A39824
$$ 502761 178063 401948 2267 147558 -137901 -126166 182753 237506 376514 139824
17746A7111J63040P5906d61204a604A4643a51644j02050A10842J64846A5382N0531
$$ 17111 180151 256057 -461204 -1604 14643 -151644 -253694 110842 275688 15382 65913
17735F5913a69075P4780B17876b36712C7593J22793k1422j3276r766a0213o9689
$$ 65913 -169075 -94295 217876 -236712 37593 160386 138964 125688 115922 -10213 -79902
17724g9902k7354A26069a7627C52459a2171l01040D0539h899L044A09513J4338
$$ -79902 -107256 126069 -17627 352459 -12171 -313211 40539 -8899 -5855 109513 123851
17713A23851a39599j28600O6318h0966A85009d7372B1236e1122F9831A1005J05907
$$ 123851 -139599 -268199 -201881 -80966 185009 -47372 21236 -51122 69831 11005 116912
17702A16912A2379a9006m408f936A24752l4088C4343J56670a55224c670j44309
$$ 116912 12379 -19006 -23414 -6936 124752 90664 34343 191013 -155224 -3670 -147979
17691a47979F2445A965a40048k34542A83836B3808i502A0182a21493p5256r6082
$$ -147979 62445 1965 -140048 -374590 183836 23808 -9502 10182 -121493 -196749 -292831
17680b92831A99079a34993c7047C2861K0436b93702E1260a3346m356A90308q8266
$$ -292831 199079 -134993 -37047 32861 53297 -293702 51260 -13346 -17702 190308 102042
17669A02042J24280C8173J17244J5524m7813f7688k28852A26100N3665b99444
$$ 102042 226322 38173 155417 170941 123128 -67688 -296540 126100 179765 -299444
17658A60346O738a955A88014c24949a30414j49757B87300a80892F7871d23119
$$ 160346 167084 -1955 188014 -324949 -130414 -280171 287300 -180892 67871 -423119
17647b17564h5884K3566I8559b171C13438g9745M240b4465j60420Q9204I2109
$$ -217564 -85884 -62318 98559 -2171 313438 -79745 -75505 -24465 -184885 -95681 92109
17635A8202L07307a74290K8632j47547L6575J02363f6813H828b44365E5083d2945
$$ 18202 325509 -174290 -145658 -293205 -256630 -154267 -66813 8828 -244365 55083 -42945
17623D51374f3381q4678c4174B62928o0121b6633l5953b3487n4402r8574f4318
$$ 451374 -63381 -148059 -34174 262928 202807 -26633 -62586 -23487 -77889 -176463 -64318
17611D9652J45562c50440m4983i5551H2900J91593N5234q3477n341r3090M2122
$$ 49652 195214 -350440 -395423 -95551 82900 274493 329727 246250 240909 147819 189941
17600A89941p0950J7796e9940r6197j55254C36387j8339j34055o2381c0514C3347
$$ 189941 118991 136787 -59940 -156137 -311391 336387 318048 183993 121612 -30514 33347
17588d0028j744J3930C24099H9281C4951b71368F7328b3048A19301b67845a3538
$$ -40028 -41772 -27842 324099 89281 34951 -271368 67328 -23048 119301 -267845 -13538
17576A6799M10589E2211J5954a40971H4187f5853A9588O7941N0852n2501N9147
$$ 16799 427388 52211 68165 -140971 84187 -65853 19588 87529 138381 85880 145027
17565A45027b64152A22849d3317A1487J22602K7027l6678A0964L63324a1017L846
$$ 145027 -264152 122849 -43317 11487 134089 161116 124438 10964 374288 -11017 -7171
17554g171l5984J2056F6614a31095O3893B5632c15192F9205m635N9061a01896
$$ -7171 -43155 -31099 66614 -131095 -67202 25632 -315192 69205 64570 123631 -101896
17542C40339K1630e78D23561d0329C77066D2100a6264k67261d3662C04677N318
$$ 340339 361969 -578 423561 -40329 377066 42100 -16264 -283525 -43662 304677 309995
17531C09995A29001C7662a35831M9053A28918a30469C27040C6886J92390a50195
$$ 309995 129001 37662 -135831 -86778 128918 -130469 327040 36886 229276 -150195
17520a47913j05952B46193q8969a21867B3647J48712a53709A07727p809j5266
$$ -147913 -253865 246193 157224 -121867 23647 172359 -153709 107727 99918 84652
17510H4652J4737J88673A05839a31866C7130K7684O0309e8178n8049H26024B87794
$$ 84652 99389 288062 105839 -131866 37130 64814 125123 -58178 -116227 826024 287794
17498A53736C3329N6503R7724e8484j2957r5418C89013a71436A48172K07056a30724
$$ 153736 33329 89832 187556 -58484 -71441 -166859 389013 -171436 148172 355228 -130724
17486C5184c22300E9773J24600K1665K30519D1209O5895L434J72007p1117R2497
$$ 35184 -322300 59773 184373 206038 436557 41209 107104 110538 282545 211428 303925
17475C03925A14367J215b4001F53676B7419J26379E691K0500L1224R1942J15167
$$ 303925 114367 115582 -24001 653676 27419 153798 5691 26191 57415 149357 264524
17464B64524d2316p8612n6088O0789B6880J6256c5923E8962L0881J30568l9884
$$ 264524 -42316 -120928 -177016 -116227 26880 43136 -35923 58962 89843 220411 180527
17453A80527O0735j3287J95261A22394K25014J75026j78561K4269A83023P7216
$$ 180527 241262 227975 423236 122394 347408 522434 343873 368142 183023 260239
17443B60239J00209A72741L9915Q567l698K56263A2522L67908j42967J4495a24027
$$ 260239 360448 172741 212656 221223 217525 473788 12522 380430 237463 251958 -124027
17431I0761J61053m6677o8480N4945J53718g7767G5094L06610m7099J02531j9338
$$ 90761 251814 205137 136657 191602 345320 -77767 75094 381704 334605 437136 417798
17420D17798h1819B05584I8043K80359j37398m8645J57319K5463O7398A39110
$$ 417798 -81819 205584 98043 378402 241004 192359 349678 375141 442539 139110
17409B01641c9327B76132a52686I4689J9064a44127a2197A00201J77483C4311
$$ 201641 -39327 276132 -152686 94689 113753 -144127 -12197 100201 277684 34311
17398A57413m3049K23906a20805D1524K59209A37043J93393i0869a267C88288
$$ 157413 114364 338270 -120805 41524 300733 137043 330436 -90869 -1267 388288
17387D92953j89735N2744A30849a74347D76980I8032J22533A9464K38626l5591
$$ 492953 303218 355962 130849 -174347 476980 98032 220565 19464 258090 222499
17377B22499G1387c107n8303B18508J97981A67599n3844H47a07900B00058r4981
$$ 222499 71387 -3107 -61410 218508 416489 167599 113755 847 -107900 200058 105077
17366A05077L2150D4249M31722g908l072B30905m3977K34487I5523b4318a646
$$ 105077 137227 44249 475971 -7908 -10980 230905 186928 421415 95523 -24318 -1646
17354A71624G1683a75724B36489k1633f5430D80305k00002b50031F6281K18090
$$ 171624 71683 -175724 236489 214856 -65430 480305 280303 -250031 66281 284371
17344B84371K57807c6160A83559N8737M8171h7477a0538D208N71379A2177c3472
$$ 284371 542178 -36160 183559 242296 290467 -87477 -10538 4208 575587 12177 -33472
17332B15493j1279r8750a88823m3202H6798k717J50555l8729o8552a34742f1204
$$ 215493 204214 105464 -188823 -232025 86798 84081 234636 195907 127355 -134742 -61204
17320b01109J7179G6569N7440K33890A33999K14863k6271Q1409A54279i6364F0564
$$ -201109 -183930 76569 134009 367899 133999 348862 322591 404000 154279 -96364 60564
17308b2210B2381J27246o6439O0711K68173A13450m2632a40577c7038A20116Q836
$$ -22210 22381 149627 83188 143899 412072 113450 70818 -140577 -37038 120116 128952
17297A28952P568D2433e5119A77757M4803f5893q898F2987J70037q5755J38296
$$ 128952 136520 42433 -55119 177757 222560 -65893 -74791 62987 233024 147269 285565
17286B85565i859j5511D06343a66697G8692J50224h2796n9715A87660L5900M8890
$$ 285565 -9859 -25370 406343 -166697 78692 228916 -82796 -142511 187660 223560 272450
17275B72450J19786A52884d0649H442K67199K97674A21595a65374A32816L4793
$$ 272450 392236 152884 -40649 8442 275641 573315 121595 -165374 132816 167609
17265A67609m9049K14850r2148h7744A00167J57052b26518A68528J75399r6588
$$ 167609 118560 333410 241262 -87744 100167 257219 -226518 168528 343927 247339
17255B47339K6110p5320f7866A35985K57726e8676D141J89183o9936K81390j76037
$$ 247339 273449 198129 -67866 135985 393711 -58676 4141 193324 123388 404778 228741
17244B28741O670m5399r459B3605K57865P9649a8875H0303J58988B2375K63229
$$ 228741 235411 190012 180553 23605 281470 361119 -18875 80303 239291 22375 285604
17233B85604a27813c9578C92431i9686A21883d0404B99153H9169f1247B4932K59878
$$ 285604 -127813 -39578 392431 -99686 121883 -40404 299153 89169 -61247 24932 284810
17222B84810r3886l816J02718j21178J9262o4739n557J12202J23744A26878m2482
$$ 284810 190924 187108 289826 168648 187910 123171 117614 229816 353560 126878 84396
17211H4396K50911k8609H0262L05995a96012B90620j31682J51139G9787J4010
$$ 84396 335307 306698 80262 386257 -196012 290620 158938 310077 79787 93797
17201I3797L48984B1456O8096a76778C85619o3955A29190L41459q78j89879A17711
$$ 93797 442781 21456 89552 -176778 385619 321664 129190 470649 469771 279892 117711
17189b0372j39167C93339j62904Q5568I4063l9907N4202e78B23944e5491B92137
$$ -20372 -159539 393339 230435 316003 94063 54156 108358 -578 223944 -55491 292137
17177A76856o5090J43514A00334M14549k44254m3578J10694f1735D37523b665
$$ 176856 111766 255280 100334 514883 270629 227051 337745 -61735 437523 -2665
17166b2171B93373q744p8851K1107K38030j47123A3429L85135A47378L76495k44511
$$ -22171 293373 284629 205778 226885 464915 317792 13429 398564 147378 523873 279362
17155B79362A33743m0873L00057A35435K0979K81651j56589R6416A74166L14866
$$ 279362 133743 92870 392927 135435 156414 438065 281476 377892 174166 489032
17145D89032I0602J54592m6802m7976a3911B47804j05948J69784J79819A53652
$$ 489032 90602 245194 198392 150416 -13911 247804 141856 311640 491459 153652
17134a82721D27756j6994R8706B31622q5359f8787C74517D1919O06213J4056l18182
$$ -182721 427756 410762 509468 231622 146263 -68787 374517 41919 648132 662188 344006
17123C44006L3455L06693k56613j23864j14291o1875L02626r2685E9525P12259
$$ 344006 377461 684154 427541 303677 189386 127511 430137 337452 59525 771784
17113G71784B06013K65524J48115k61011J00253B10358J27963J81J08065I0044
$$ 771784 206013 471537 619652 358641 458894 210358 338321 338502 446567 90044
17102C65764L2426K38703B24466K56016M0880m0821j26245L88576C70163l1856
$$ 365764 398190 636893 224466 480482 521362 480541 354296 742872 370163 338307
17092C38307D2400K70691j55765K46871A9528J51498K70647A50762M22095j61393
$$ 338307 42400 313091 157326 404197 19528 171026 441673 150762 572857 411464
17082D11464G6652J70859J71490J4811P5344B11211k2200M12241M2834j80486
$$ 411464 76652 247511 419001 433812 509156 211211 189011 601252 644086 463600
17072D63600A90665L40289A86934N0502K90413K74482A96946Q6614J9055R5111
$$ 463600 190665 530954 186934 237436 527849 802331 196946 283560 302615 397726
17062C97726J71616J99427k53343O0477j93557K41732m6603k2809k1760A43132
$$ 397726 569342 768769 515426 575903 382346 624078 577475 554666 532906 143132
17051F12348P1953J39881C87662P859r5968K07549B26052J80093r7096R4741k5991
$$ 612348 684301 824182 387662 395521 299553 507102 226052 406145 309049 403790 377799
17040C77799j21068J798L02351P416K73680C86873K57049k0460l09596J26361
$$ 377799 256731 258529 560880 568296 841976 386873 643922 623462 313866 440227
17030D40227j17554J80623E1311Q05362k85814j45566R5248A09679N61740j71794
$$ 440227 322673 503296 51311 856673 570859 425293 520541 109679 671419 499625
17020D99625K03614j98390J19466r0097M9547o5776L16086m12532o0495J74444
$$ 499625 703239 504849 624315 534218 583765 517989 834075 421543 361048 535492
17010E35492J09543j08556m5630j14570m4403K69520j82727L032j4544M53522
$$ 535492 645035 536479 490849 376279 331876 601396 418669 421701 407157 860679
17000H60679k74160J11604K54167k73008L1496p2660J31021O6206k90362J15425
$$ 860679 586519 698123 952290 679282 710778 638118 769139 835345 544983 660408
16990F60408r1766q5083J61793J63437r8824j24954K04276l32761K77570j23538
$$ 660408 568642 483559 645352 808789 709965 585011 789287 456526 734096 610558
16980F10558j04706J37119K63797l27676N3574j14397L46683j61495n0139J6310
$$ 610558 505852 642971 906768 579092 632666 518269 864952 703457 653318 669628
16970F69628J46132l28365M50405J45719k48170k17855K70823k25154M21882k77918
$$ 669628 815760 487395 937800 1083519 835349 617494 888317 663163 1085045 807127
16960H07127L8178l8824C98158L27166N1676K00682l38126M25298j23743k0941
$$ 807127 845305 806481 398158 725324 777000 977682 639556 1064854 941111 920170
16950I20170l88629L39821J84879q6575j57512O5081M9432j7305p6417m9641k9181
$$ 920170 531541 871362 1056241 969666 812154 877235 926667 909362 832945 783304 754123
16939G54123K66408m10250N67468m60021n5245L47602O3871j3154J22024p7796
$$ 754123 1020531 610281 1177749 717728 662483 1010085 1073956 1060802 1182826 1105030
16929A105030K6884k4143L9318q52K38164j3684j70443j21730J16038M392K4221
$$ 1105030 1131914 1107771 1147089 1146237 1384401 1370717 1200274 1078544 1194582 1198974 1223195
16918A223195J95884j9077k64422k83236M54274k27180P3838l910K32107j12783
$$ 1223195 1419079 1400002 1135580 852344 1306618 1079438 1153276 1149366 1381473 1268690
16908A268690K32180R2492m6437P6279k74270M06285k63935q7544k55294K18826
$$ 1268690 1500870 1593362 1546925 1623204 1348934 1755219 1491284 1403740 1148446 1367272
16898A367272K65650o3542K72462l58842J71151J20664j63025K92898j23560K47792
$$ 1367272 1632922 1569380 1841842 1483000 1654151 1774815 1611790 1904688 1781128 2028920
16888B028920q6540o27181M91567r1386O0129J1996K41603k15699j6699J9242
$$ 2028920 1942380 1315199 1806766 1715380 1775509 1787505 2029108 1813409 1796710 1815952
16878A815952J8136J05288p0259k02036L23631j43991R3179Q4893p4972J63616
$$ 1815952 1834088 1939376 1869117 1667081 1990712 1846721 1939900 2024793 1949821 2113437
16868B113437R2691k33059Q9457P5824J89831j73960J21784j88241K72471r7216
$$ 2113437 2206128 1973069 2062526 2138350 2328181 2154221 2276005 2087764 2360235 2263019
16858B263019P2076J24993m615K82325l45701J34768q7411K14783R4267K67804
$$ 2263019 2335095 2460088 2455473 2737798 2392097 2526865 2439454 2654237 2748504 3016308
16848C016308j66049J7778J26269j5698k01372K738N34695k56269o9080M95433
$$ 3016308 2850259 2868037 2994306 2978608 2777236 2779974 3314669 3058400 2989320 3484753
16838C484753L8755r1042l00857M22138k91995K05630J73113j95140n0374M08272
$$ 3484753 3523508 3432466 3131609 3553747 3261752 3467382 3640495 3445355 3394981 3803253
16828C803253j1056j10123K73480K43946k43043K79335J45847r8979M5275Q2172
$$ 3803253 3792197 3682074 3955554 4199500 3956457 4235792 4381639 4282660 4327935 4410107
16818D410107J54176L41968j91383R4013J42819R7113J02828K6554J38695J90301
$$ 4410107 4564283 4906251 4714868 4808881 4951700 5048813 5151641 5178195 5316890 5507191
16808E507191K91507m89013M73557M117K46255K54684P2762L40529k16261K94424
$$ 5507191 5798698 5309685 5783242 5787359 6033614 6288298 6361060 6701589 6485328 6779752
16798F779752J15592M75505k70405O21235L25506n48181L42943M83438l3557L38699
$$ 6779752 6895344 7370849 7100444 7721679 8047185 7499004 7841947 8325385 8291828 8630527
16788H630527K88317J54037J19015M76737L15560k61075O21861L28238L58426
$$ 8630527 8918844 9072881 9191896 9668633 9984193 9723118 10344979 10673217 11031643
16779A1031643M65740K3401N04235L62150M69043K6592O84443L51410M39264N06595
$$ 11031643 11497383 11520784 12025019 12387169 12856212 12882804 13567247 13918657 14357921 14864516
16769A4864516O49910O36805N13279O44090N05737K54613R41667O69258P67665
$$ 14864516 15514426 16151231 16664510 17308600 17814337 18068950 19010617 19679875 20447540
16760B0447540O31343J010120J289798P77686O74283J088856J133901J101114
$$ 20447540 21078883 22089003 23378801 24156487 24830770 25919626 27053527 28154641
16752B8154641J600496J522017J186382J546508J695013J909705J591858K165425
$$ 28154641 29755137 31277154 32463536 34010044 35705057 37614762 39206620 41372045
16744D1372045K222871K554809K349670L048367L092236L264379L382609L771804
$$ 41372045 43594916 46149725 48499395 51547762 54639998 57904377 61286986 65058790
16736F5058790M264471L737106N054457N312861N470641O075163O490374O677563
$$ 65058790 69323261 73060367 78114824 83427685 88898326 94973489 101463863 108141426
16728A08141426P283981P776845P761760Q889637Q512569R088420Q670970Q817785
$$ 108141426 115425407 123202252 130964012 139853649 148366218 157454638 166125608 174943393
16720A74943393Q067251P785843O804590N337738M011009K643694J183860m41466
$$ 174943393 183010644 190796487 197601077 202938815 206949824 209593518 210777378 210335912
16712B10335912k631965l393523n333391o250921p583098q177234q447822q917889
$$ 210335912 207703947 204310424 198977033 192726112 185143014 176965780 168517958 159600069
16704A59600069r138254q896154q797555q353369p937690p649857p201146o803915
$$ 159600069 150461815 141565661 132768106 124414737 116477047 108827190 101626044 94822129
16696I4822129n848357n473466n618902m874043m497994m166206l921737l489671
$$ 94822129 88973772 83500306 77881404 73007361 68509367 64343161 60421424 56931753
16688E6931753l282546l059598k810760k635523k497207k493384j961545j583642
$$ 56931753 53649207 50589609 47778849 45143326 42646119 40152735 38191190 36607548
16680C6607548j906954j705431j471597j986558j318608j016690j467027j729701
$$ 36607548 34700594 32995163 31523566 29537008 28218400 27201710 25734683 24004982
16672B4004982l79136p14903j211339j055281n36667j020128r08412r67173l32041
$$ 24004982 23625846 22910943 21699604 20644323 20107656 19087528 18179116 17211943 16879902
16663A6879902o78310l67362r86615m75513o46333o5814l94346k4822p04852n54358
$$ 16879902 16201592 15834230 14847615 14372102 13725769 13659955 13265609 13240787 12535935 11981577
16653A1981577k66349m12843o84068J05780p68865j37151m48804L166o45187M8943
$$ 11981577 11715228 11302385 10618317 10724097 9955232 9818081 9369277 9372443 8727256 8776199
16643H776199p94325K97857k94879m06391L1767k51415r9381k47329k64227J15202
$$ 8776199 7981874 8279731 7984852 7578461 7610228 7358813 7259432 7012103 6747876 6863078
16633F863078m58019l07255J47833o1656m99249J96130k13153j24067o1943j93836
$$ 6863078 6405059 6097804 6245637 6183981 5684732 5880862 5667709 5543642 5481699 5287863
16623E287863m66122K12851k46561K14462k85514j76616N9722n1560k1114m36652
$$ 5287863 4821741 5034592 4788031 5002493 4716979 4540363 4600085 4548525 4527411 4090759
16613D090759j76763j13805M1796j090L31236o58254L06813j51673l21203K9958
$$ 4090759 3913996 3800191 3841987 3840897 4172133 3513879 3820692 3669019 3347816 3377774
16603C377774K1050m9795o0787k42432j61686J90281K55440m81057N20349k85492
$$ 3377774 3398824 3349029 3288242 3045810 2884124 3074405 3329845 2848788 3369137 3083645
16593C083645O4857r5437l02228K30574m11204j32068K87927j42336j08130l41458
$$ 3083645 3148502 3053065 2750837 2981411 2570207 2438139 2726066 2583730 2475600 2134142
16583B134142M72491m97111N0958Q2482l57679N76253r3669k77976K41205j63172
$$ 2134142 2606633 2109522 2160480 2242962 1885283 2461536 2367867 2089891 2331096 2167924
16573B167924m6894j29274l37580P9065K55598j5584k36458J2474k68133N12593
$$ 2167924 2121030 1991756 1654176 1733241 1988839 1973255 1736797 1749271 1481138 1993731
16563A993731j59470p8838J72299k88424K65232k96511K1413n35342M64300k93084
$$ 1993731 1834261 1755423 1927722 1639298 1904530 1608019 1629432 1094090 1558390 1265306
16553A265306N49018m41985k2018J07951k03291L639P8054L5701K9628l19228
$$ 1265306 1814324 1372339 1350321 1458272 1254981 1258620 1336674 1372375 1402003 1082775
16543A082775L88763j44964K03332j65840k14788K27934r5060l78170N06296n1140
$$ 1082775 1471538 1326574 1529906 1364066 1149278 1377212 1282152 903982 1410278 1359138
16533A359138K4262j54057M9274m33746N96010k04867M3445l02752J43221j71805
$$ 1359138 1383400 1229343 1278617 844871 1440881 1236014 1279459 976707 1119928 948123
16523I48123J7310l4208J91076k1086k72310K3961M2072j96534L20263k87559
$$ 948123 965433 931225 1122301 1101215 828905 852866 894938 698404 1018667 731108
16513G31108j01584L07433J23958l25209j52301l4991N20149l45549l04648O12842
$$ 731108 629524 936957 1060915 735706 583405 548414 1068563 723014 418366 1031208
16503A031208j97606l41253L78138Q9692k41662q1136j19264M87827l40155q0402
$$ 1031208 833602 492349 870487 960179 718517 637381 518117 1005944 665789 585387
16493E85387L24533k2652m00599L63977j97249J62392K20483k26050k80119j6352
$$ 585387 909920 887268 486669 850646 653397 815789 1036272 810222 530103 513751
16483E13751J78170j89441J30157n250J10853j34930B81374M98274j33326l9294
$$ 513751 691921 502480 632637 627387 738240 603310 281374 779648 646322 607028
16473F07028K90922j58614j81810J85006B33912J70074p188J52962P4620J8035
$$ 607028 897950 739336 557526 742532 233912 403986 396798 549760 624380 642415
16463F42415k515j01688J65352k78152p1238K47024k1108j30535L70082l81480
$$ 642415 639900 538212 703564 425412 354174 601198 580090 449555 819637 438157
16453D38157K23831o17j06771L60419l98336k46892J9819K38941p0861J2529K11822
$$ 438157 661988 661371 554600 915019 516683 269791 289610 528551 457690 470219 682041
16442F82041p1537j46156j64543J41956j59126J32713r1628A05623J83492K61411
$$ 682041 610504 464348 299805 441761 282635 415348 323720 105623 289115 550526
16432E50526m4035j839r3752o8840J30141B32008K1408K1078K64827A77048K59500
$$ 550526 506491 504652 410900 342060 472201 232008 253416 274494 539321 177048 436548
16421D36548K04368k62907M9866A72333K79612M8467k28735K25688N0182B03656
$$ 436548 640916 378009 427875 172333 451945 500412 271677 497365 547547 203656
16410D46820A07659N2676K5245K88871o1903j10183j48444i8367C58632j42930
$$ 446820 107659 160335 185580 474451 412548 302365 153921 -98367 358632 215702
16400B15702J51770p2458J97000k23705j07515L27519J46109B60965l9476L83657
$$ 215702 367472 295014 492014 268309 160794 488313 634422 260965 221489 605146
16390F05146A59969n0615J01795M9539K28147j71723F3036L25498E8741P22J4961
$$ 605146 159969 109354 211149 260688 488835 317112 63036 388534 58741 59463 74424
16379G4424L04606L04799l32288o6299K40385H6296P562O7607O4622k79K00318
$$ 74424 379030 683829 351541 285242 525627 86296 93858 161465 226087 225808 426126
16368D26126J4762A83599m0810K5375n902K57942c3101C37635m4096r5550J89850
$$ 426126 440888 183599 142789 168164 162262 420204 -33101 337635 293539 197989 387839
16357C87839D0796K24625C0828J48990J18260J29587G308K24723A12377h8954
$$ 387839 40796 265421 30828 179818 298078 427665 7308 232031 112377 -88954
16346D84119P1602B954Q9711K36709j3923E2189N2712a03894d2856F9029J82369
$$ 484119 555721 2954 92665 329374 315451 52189 104901 -103894 -42856 69029 251398
16335B51398l8778K606L97516B99021a90896A81803q5193i3110d1622C14142j4683
$$ 251398 212620 215226 612742 299021 -190896 181803 96610 -93110 -41622 314142 299459
16324B99459r9203h6540G9270g479A52210l7896D1883J10223E7616K4955K94172
$$ 299459 200256 -86540 79270 -7479 152210 114314 41883 152106 57616 82571 376743
16313C76743b8305j29257A77261c5045A57223n7753P1780E408d4083A58255L4450
$$ 376743 -28305 -157562 177261 -35045 157223 99470 171250 5408 -44083 158255 192705
16302A92705J95546Q0305F547b6920A2375a7147a728j4715B94137A33792k4082
$$ 192705 388251 468556 6547 -26920 12375 -17147 -1728 -16443 294137 133792 109710
16291A09710J55892Q541o4159H9758k9095Q8516A3114M44253j62731C1581Q6692
$$ 109710 265602 274143 209984 89758 60663 149179 13114 457367 294636 31581 118273
16280A18273J01196B7571L5235a29925A54051F1706a05865N311B22716a51313
$$ 118273 219469 27571 62806 -129925 154051 61706 -105865 -100554 222716 -151313
16269A61542C3242J50127a63314k5354f877A87107l492J80995H7200K49827J13146
$$ 161542 33242 183369 -163314 -188668 -6877 187107 183615 364610 87200 337027 450173
16258D50173D8198d1579A81812l8642J12990j17170E2740J31797b12940B40223
$$ 450173 48198 -41579 181812 143170 256160 138990 52740 184537 -212940 240223
16247C382e4611H5603R5174h6965p4792O8263D04720B1981L55817D6726J12212
$$ 3382 -54611 85603 180777 -86965 -161757 -93494 404720 21981 377798 46726 158938
16236A58938b679A90581A4608P2915O2097E4655J04531D5674N1138b5151B37970
$$ 158938 -2679 190581 14608 87523 149620 54655 159186 45674 96812 -25151 237970
16224A43583a27480b8475n518n6233l103D93340A85783B2709K0684O3707a67951
$$ 143583 -127480 -28475 -33993 -90226 -93329 493340 185783 22709 43393 107100 -167951
16212h0206j68137R7020r7366B90657g0003A80886a05483j1770D48425a18716
$$ -80206 -248343 -151323 -248689 290657 -70003 180886 -105483 -117253 448425 -118716
16201d2696I7562P989e6082n879E02720a29172B58239r2292C6749A6875b33838
$$ -42696 97562 105551 -56082 -61961 502720 -129172 258239 165947 36749 16875 -233838
16189b18126N9558C03980e6691A96063a00060B0445e3598B02746o9628R8740c98401
$$ -218126 -158568 303980 -56691 196063 -100060 20445 -53598 202746 133118 231858 -398401
16177F2428M6801c0984A92567C2958J43323e857k4242l1433b5018A34037H138
$$ 62428 109229 -30984 192567 32958 176281 -5857 -30099 -61532 -25018 134037 8138
16165A28157Q041c3269C5826p144b51899b7825o4992M1619B62728i840B89494
$$ 128157 136198 -33269 35826 28682 -251899 -27825 -92817 -51198 262728 -9840 289494
16153a8352B13585C2975i5501C79037o7846f5690j61229A03227l3438c93779a40904
$$ -18352 213585 32975 -95501 379037 311191 -65690 -226919 103227 69789 -393779 -140904
16141A76423c0600A7179a5290H9656d68562B06289B6650c1516p206B66775Q77
$$ 176423 -30600 17179 -15290 89656 -468562 206289 26650 -31516 -38722 266775 267652
16130B67652A6671i7137B61250g7567A89051a95272J7415B6408J76708N690a40607
$$ 267652 16671 -97137 261250 -77567 189051 -195272 -177857 26408 203116 208806 -140607
16118b99467A27265K7488i4186j51490P0760k69327E598M03926b67359d7847C8715
$$ -299467 127265 154753 -94186 -245676 -174916 -444243 5598 409524 -267359 -47847 38715
16106A52581a77018F2085R2790O4603L5567a04759A74278j9190i8518K0218j09764
$$ 152581 -177018 62085 154875 219478 255045 -104759 174278 155088 -98518 -78300 -188064
16095a88064q6091A80119A1704O9400a58044I5986a03405j18157J02548r9289
$$ -188064 -274155 180119 11704 81104 -158044 95986 -103405 -221562 -119014 -218303
16085b18303a07163k003K1620G5140b491k0905p5350A95729c70467E7986a55700
$$ -218303 -107163 -109166 -87546 75140 -2491 -23396 -98746 195729 -370467 57986 -155700
16073C5983c1079q8715L4926d0067J1792q8063B42893d9841j91326B82096c7615
$$ 35983 -31079 -119794 -84868 -40067 -28275 -116338 242893 -49841 -241167 282096 -37615
16061B95315A21860a71299B9447Q7972b8807j78724A01696C8082L65619H9015
$$ 295315 121860 -171299 29447 117419 -28807 -207531 101696 38082 403701 89015
16050b67892a11459L3143A54212c56434h7716k85218Q6532I3276c25028A23686
$$ -267892 -111459 -78316 154212 -356434 -87716 -372934 -286402 93276 -325028 123686
16039a49916j74886J56376g2791h547j45223j09121d8656B96066h4909k29763
$$ -149916 -324802 -168426 -72791 -8547 -153770 -262891 -48656 296066 -84909 -314672
16029c14672E2736F179d2973l75520a95162I7755a05894j58329J28877f5695H4830
$$ -314672 52736 6179 -42973 -418493 -195162 97755 -105894 -264223 -135346 -65695 84830
16017C7906r196a50617q8489P4003H2479M3466j6362c16092N0325J16455A37287
$$ 37906 28710 -150617 -239106 -165103 82479 125945 109583 -316092 -265767 -149312 137287
16005A02747a58109h179l87786R9924g4136B43119c29894A59853K0033D1417b25657
$$ 102747 -158109 -8179 -395965 -296041 -74136 243119 -329894 159853 179886 41417 -225657
15993c29210J38457g4927a7074j21295K5213j08947K5191C2262P5381h6970I3692
$$ -329210 -190753 -74927 -17074 -138369 -113156 -222103 -196912 32262 107643 -86970 93692
15981c3188E66026B78174B5737L163Q3621g5419B2277g7013n5267A8464c74558
$$ -33188 566026 278174 25737 28900 112521 -75419 22277 -77013 -132280 18464 -374558
15969g4263G7338a25518F7466b5292A7174J83176q2889a87099M6758k0961B43828
$$ -74263 77338 -125518 67466 -25292 17174 200350 117461 -187099 -140341 -161302 243828
15957A92866A6236L653K22953a21117C4029b14897D53815B3050J6531K52189c1671
$$ 192866 16236 19889 242842 -121117 34029 -214897 453815 23050 39581 291770 -31671
15945c29184J00255C07190e0045j15914B5874h3518G0424a50096M9460d5290B49934
$$ -329184 -228929 307190 -50045 -165959 25874 -83518 70424 -150096 -100636 -45290 249934
15933c2906j81032Q7752r8484E6207K2481g6285j48603i9874o3220A89519g8893
$$ -32906 -213938 -126186 -224670 56207 78688 -76285 -224888 -99874 -163094 189519 -78893
15921a43154e2735K1666l41569F6504K87285F7726J79322d1197A33954r494h1405
$$ -143154 -52735 -31069 -372638 66504 353789 67726 247048 -41197 133954 124460 -81405
15909B5969b50013A859J66810l1667C7584J15694j5068e7583A9210M02408g6378
$$ 25969 -250013 1859 168669 137002 37584 153278 138210 -57583 19210 421618 -76378
15897e039j86707l408g9026H2964a47143B23374b07724A71709o7959i1449j2016
$$ -5039 -191746 -195154 -79026 82964 -147143 223374 -207724 171709 103750 -91449 -103465
15886a03465j5988D64680a16890A13809D2224K11705b70893d6623K1733A55176
$$ -103465 -119453 464680 -116890 113809 42224 253929 -270893 -46623 -24890 155176
15875A60490c25585J29990f9512j42370K3593E6734b0369I212K34096H9462a79924
$$ 160490 -325585 -195595 -69512 -211882 -188289 56734 -20369 9212 243308 89462 -179924
15863h4250O735I0893n608h8941A9126d58622b0838D3082R519a81248K3204j28952
$$ -84250 -77515 90893 85285 -88941 19126 -458622 -20838 43082 52601 -181248 -158044 -286996
15851b86996A24881i2147C44749b44042B77433b45695d689I8075O0598k6665a8768
$$ -286996 124881 -92147 344749 -244042 277433 -245695 -4689 98075 158673 132008 -18768
15839h0722R181I4037j5277k4879J1614a15773j20022j65735F4627i3417Q695
$$ -80722 -71541 94037 78760 53881 65495 -115773 -235795 -401530 64627 -93417 -84722
15828h4722j39935Q6205n5798f7049j48014h2339n2455d2758p507j70886m3731
$$ -84722 -224657 -138452 -194250 -67049 -215063 -82339 -134794 -42758 -50265 -221151 -264882
15817b64882f2963B6905K0442a92724e8804A6555K5066i7657B46604e01441K50412
$$ -264882 -62963 26905 47347 -192724 -58804 16555 41621 -97657 246604 -501441 -251029
15806b51029M1765A12958B0227a10871d6233I8624O4854a71134r9470A54086G2256
$$ -251029 -209264 112958 20227 -110871 -46233 98624 163478 -171134 -270604 154086 72256
15794c61512j22089A160b81872A5673P893a33753A57276a04018j80547N7150C63659
$$ -361512 -483601 1160 -281872 15673 23566 -133753 157276 -104018 -284565 -227415 363659
15782b18694B47074C4332b59256A94799c0258j89017G7856j8721h1824C2537e8403
$$ -218694 247074 34332 -259256 194799 -30258 -219275 77856 59135 -81824 32537 -58403
15770a00556l34451a88003a6083k7518j49086a1372D00157A61837e8318A10069
$$ -100556 -435007 -188003 -16083 -43601 -192687 -11372 400157 161837 -58318 110069
15759B48316j5213G631a62987m0469d1041A21014C8887M4517J1472R9025C9943
$$ 248316 233103 7631 -162987 -203456 -41041 121014 38887 83404 94876 193901 39943
15747a10096H6273a47695O1373H887K410K3210P6947P8579b91363C398J92212
$$ -110096 86273 -147695 -86322 8887 11297 34507 111454 190033 -291363 3398 195610
15736A95610q5457i4669k10824c8199A21926a52146j07273b2294j54037q0973
$$ 195610 110153 -94669 -305493 -38199 121926 -152146 -259419 -22294 -176331 -257304
15726b57304J28020E531c10729h2486B80823I18e539G2029c04798m4919Q1798
$$ -257304 -129284 5531 -310729 -82486 280823 918 -5539 72029 -304798 -349717 -267919
15715b67919Q9207j26829B6841L8496A034c67873M143B4168L4985b85835J0557
$$ -267919 -178712 -305541 26841 65337 1034 -367873 -363730 24168 59153 -285835 -275278
15704b75278P1947J8197A9720M5885C1836Q9197b77177j44683Q0787a28910j4262
$$ -275278 -203331 -185134 19720 65605 31836 121033 -277177 -421860 -341073 -128910 -143172
15693a43172I6473b0646A57687L5106b701A58827n2555K07351a59404B8796d9715
$$ -143172 96473 -20646 157687 192793 -2701 158827 106272 313623 -159404 28796 -49715
15681A50507b00225A18771B6134J22686b05410F5765b12630J2711A47563n2686
$$ 150507 -200225 118771 26134 148820 -205410 65765 -212630 -199919 147563 94877
15671I4877c8877A46408O495a02502A73956d0738E7986j1512a17035A59076i3998
$$ 94877 -38877 146408 152903 -102502 173956 -40738 57986 46474 -117035 159076 -93998
15659E1722b46244i3488F1915b85245L1889a12403M8128k23917A01826K990K2748
$$ 51722 -246244 -93488 61915 -285245 -253356 -112403 -64275 -288192 101826 104816 127564
15648A27564D4586R4710f6009C07469a18379M6853K9599r0178C42376C4964a57357
$$ 127564 44586 139296 -66009 307469 -118379 -71526 -41927 -132105 342376 34964 -157357
15636B4711f9866a7385k14343j20306a56829G1894a30169B30856a27945B21899
$$ 24711 -69866 -17385 -231728 -352034 -156829 71894 -130169 230856 -127945 221899
15625A01803a60143j24876B6859d8853a8529A68156a6545A01804N6618L67215
$$ 101803 -160143 -285019 26859 -48853 -18529 168156 -16545 101804 158422 525637
15615E25637C2174J10633M9367a39118e5350j14345p3322K7487l36069a11746
$$ 525637 32174 142807 192174 -139118 -55350 -169695 -243017 -215530 -551599 -111746
15604b75022a3737D6650Q9959J48523a69091A12646A7553J22509d5739l0826I1663
$$ -275022 -13737 46650 136609 285132 -169091 112646 17553 140062 -45739 -76565 91663
15592A78349k2922b85969a2332F4232K5483L02053e3204A35745h2325j41224A5961
$$ 178349 155427 -285969 -12332 64232 89715 391768 -53204 135745 -82325 -223549 15961
15580a65126E7351b2155b757A28304a55672C4350c27716a6230C6331b17315j6687
$$ -165126 57351 -22155 -2757 128304 -155672 34350 -327716 -16230 36331 -217315 -234002
15569b34002j64264a08422j41282H9587a9697l09535a36607r8923C9445J86133
$$ -234002 -398266 -108422 -249704 89587 -19697 -329232 -136607 -235530 39445 225578
15559B25578G1167J85730b68333B21657H2133c21140N4580C02521a97591P1272
$$ 225578 71167 256897 -268333 221657 82133 -321140 -266560 302521 -197591 -126319
15549a26319k8550q2535c1086F0239a47158b5228B15164a29307G4668a47974k7672
$$ -126319 -154869 -237404 -31086 60239 -147158 -25228 215164 -129307 74668 -147974 -175646
15538a75646G6948K97769b63407I6729a82808B16162b11166B0952R2601Q870P7975
$$ -175646 76948 374717 -263407 96729 -182808 216162 -211166 20952 113553 122423 200398
15527B00398r3775E2982e6170B14976h0614F5435K29512H4251e15651B14979a16438
$$ 200398 106623 52982 -56170 214976 -80614 65435 294947 84251 -515651 214979 -116438
15515e6165l1057l38299D4604j520a96486E6143L78400f769j42275A96064n0028
$$ -56165 -87222 -425521 44604 43084 -196486 56143 434543 -6769 -149044 196064 146036
15504A46036J6424f2561K8231j3255j2229A23543e9702J6373b0312o3772j43431
$$ 146036 162460 -62561 -34330 -47585 -59814 123543 -59702 -43329 -20312 -84084 -227515
15493b27515A11038A335i0111B46465a02563A36183J71173a32550A5324a36319
$$ -227515 111038 1335 -90111 246465 -102563 136183 307356 -132550 15324 -136319
15482a13465j09634A77314g3874J9307h470j02435G5580J08668a08894e3171p6298
$$ -113465 -223099 177314 -73874 -54567 -8470 -110905 75580 184248 -108894 -53171 -129469
15471a29469B3362O7360a6134H4100J3504P2638o4755e6648n064C78849p7095
$$ -129469 23362 90722 -16134 84100 97604 170242 105487 -56648 -61712 378849 301754
15460C01754J3386d81761J52123g8189o1215B20309i2023B30296i3193C2701a06685
$$ 301754 315140 -481761 -329638 -78189 -139404 220309 -92023 230296 -93193 32701 -106685
15448B76811a87405H4440J1125Q5454a92780Q0498a7742D71682a70320I4490a1522
$$ 276811 -187405 84440 95565 181019 -192780 -112282 -17742 471682 -170320 94490 -11522
15436D5164f0734D8679P5776m3159K08879j11416a31132m563F8912j1302b6414
$$ 45164 -60734 48679 124455 81296 290175 178759 -131132 -135695 68912 57610 -26414
15424f1513A01605a82338g367H607N882M6293g6647M199I2884a26808B72177c04884
$$ -61513 101605 -182338 -7367 8607 14489 60782 -76647 -72448 92884 -126808 272177 -304884
15411b53402A1694h2169m23l4552H6511b44085b9578A25486a9093q5329b3437
$$ -253402 11694 -82169 -82592 -117144 86511 -244085 -29578 125486 -19093 -104422 -23437
15399e7864a5063n3344k35775A16537J30818q0112k2005a39945M8991j70211A38672
$$ -57864 -15063 -68407 -304182 116537 247355 167243 145238 -139945 -90954 -261165 138672
15387e452j93459L4896n2892E7317f507E0916K29959o6041a19748j062I2433d2203
$$ -5452 -198911 -164015 -216907 57317 -6507 50916 280875 214834 -119748 -120810 92433 -42203
15374A88219C1223c5327k05841c3014q2971c7494o8920L655M643d077r1772q8619
$$ 188219 31223 -35327 -241168 -33014 -115985 -37494 -106414 -102759 -98116 -4077 -95849 -184468
15362a84468e4446A11808a80624N0423l6874G2115a94516P3763B34744A0318J44467
$$ -184468 -54446 111808 -180624 -130201 -167075 72115 -194516 -120753 234744 10318 154785
15351A54785m6570l4310J18861D9134L62146A3005J43984J17290c1869j29343
$$ 154785 108215 73905 192766 49134 411280 13005 156989 274279 -31869 -161212
15341a61212B71051D274a10438A96874n1499D7310a27226n0613A1710A287e1962
$$ -161212 271051 4274 -110438 196874 145375 47310 -127226 -177839 11710 1287 -51962
15329b76825d0407A0343J33345a13123K7376J6851q5678k56045A57721j7407M4259
$$ -276825 -40407 10343 143688 -113123 -85747 -68896 -154574 -410619 157721 140314 184573
15318A84573f219A40298a34242H2026B505a29605I133J3812h7541l90908K00056
$$ 184573 -6219 140298 -134242 82026 2505 -129605 9133 22945 -87541 -478449 -278393
15307b78393a9080k46549p7574H7595M144i4447M142C01681a4526q8258A56725
$$ -278393 -19080 -265629 -343203 87595 91739 -94447 -90305 301681 -14526 -102784 156725
15295I1725b9918H3005J27420a44727N2858j4784b0052B96551d0530D0204J57550
$$ 91725 -29918 83005 210425 -144727 -91869 -106653 -20052 296551 -40530 40204 197754
15284A97754a28665dn3569F08127A24545m9383C0116L37746q7709A19647O8517
$$ 197754 -128665 -4 -53573 608127 124545 75162 30116 367862 280153 119647 188164
15273A88164a7171A11033a1373o112k7541n0656m683j1066B69049l2331b90979
$$ 188164 -17171 111033 -11373 -17485 -45026 -95682 -100365 -111431 269049 236718 -290979
15261I9341l1152P8191O4570r5182L5544a24083j28348A37381n0880f281H4349
$$ 99341 68189 146380 210950 115768 151312 -124083 -252431 137381 86501 -6281 84349
15249B25509L39208O00910j86219k8333K49510B88276P092r2183h0664B25969
$$ 225509 564717 1165627 979408 951075 1200585 288276 295368 203185 -80664 225969
15238A78448P4429A4574R8114a2092A53762g6425K4849i24C3491L29030j75240
$$ 178448 252877 14574 112688 -12092 153762 -76425 -51576 -924 33491 362521 187281
15227A87281a64993D50895B0488E381a28486A54249i9157l22808I4957K13680
$$ 187281 -164993 450895 20488 5381 -128486 154249 -99157 -421965 94957 308637
15217C08637a46794e9752r9399q8309G139b9906p0731H4106a51477A39231P5449
$$ 308637 -146794 -59752 -159151 -247460 7139 -29906 -100637 84106 -151477 139231 214680
15206B14680b49714B20562o1919J91255c06841I5015c331I8392J21447a79517
$$ 214680 -249714 220562 158643 349898 -306841 95015 -3331 98392 219839 -179517
15195h2374B44386A16680k7671o162d0621C4302Q1954R6462j05091J17415L7287
$$ -82374 244386 116680 89009 82847 -40621 34302 116256 212718 107627 225042 262329
15184B62329L0020h3766A24562C6167J40345o8969l81J75078d8311C80733e8845
$$ 262329 292349 -83766 124562 36167 176512 107543 107162 282240 -48311 380733 -58845
15172A5276K66120l1208q0629B9095K00929a11086d8498C29601r6072H9593O4776
$$ 15276 281396 250188 169559 29095 230024 -111086 -48498 329601 233529 89593 154369
15161A54369B3377h880k01556Q2878A32986c8006B6420E348M331J08853A1010
$$ 154369 23377 -8880 -210436 -127558 132986 -38006 26420 5348 9679 118532 11010
15149f0912C31614D1483d6908G565J6880R1494Q7828J89887r7614H3191i0746
$$ -60912 331614 41483 -46908 7565 24445 115939 203767 393654 296040 83191 -90746
15137A29406K41801a8349D31457j96080b61480C59181A14585L461K03370O2280
$$ 129406 371207 -18349 431457 235377 -261480 359181 114585 118046 321416 383696
15127C83696f3265D03100F1909o694e6146B7835L37304F9982J4345P0481J63334
$$ 383696 -63265 403100 61909 55215 -56146 27835 365139 69982 84327 154808 318142
15116C18142K4164j66137C9925M01357C0656K45921B5349b69270A08064Q5814
$$ 318142 342306 176169 39925 441282 30656 276577 25349 -269270 108064 193878
15106A93878a60004E371h8213C2500J17077M9191e1359B98050k5827a70449F3337
$$ 193878 -160004 5371 -88213 32500 149577 198768 -51359 298050 272223 -170449 63337
15094a4326B35330r1141c61382M0599b3270A39089J38012a74886j23871e5909
$$ -14326 235330 144189 -361382 -320783 -23270 139089 277101 -174886 -298757 -55909
15083b6098D5839O4473k5890g7489A38399O5312r7142J3482R7303N4821A11942
$$ -26098 45839 110312 84422 -77489 138399 203711 106569 120051 217354 272175 111942
15071A36317Q2847J9151r490L08163A56984L7195N5738d6719B41217b83202A2481
$$ 136317 219164 238315 228825 536988 156984 194179 249917 -46719 241217 -283202 12481
15059b97215B52747F6743f6950B10718c1387I3175P7081J78392q8557j10569j5897
$$ -297215 252747 66743 -66950 210718 -31387 93175 170256 348648 260091 149522 133625
15048A33625c5551B06633F2806L13649A3689J92568l6054J19200k2396N6855i6972
$$ 133625 -35551 206633 62806 376455 13689 206257 170203 289403 267007 323862 -96972
15036D54004B05380m7447F5099L56194a97142E9892O5786A4592J65644J94920
$$ 454004 205380 157933 65099 421293 -197142 59892 125678 14592 180236 375156
15026C75156j47755L7832M8524J05000b00637A65251O5461j09034i7751E881a16839
$$ 375156 227401 265233 313757 418757 -200637 165251 230712 121678 -97751 5881 -116839
15014D98725H9908A2457c0714A47698H012a23488B87805E7261N0742J96418Q6729
$$ 498725 89908 12457 -30714 147698 8012 -123488 287805 57261 108003 304421 391150
15003C91150j84497J74407b10279C41976j53096K01703B5890R7128m7438J79384
$$ 391150 206653 381060 -210279 341976 188880 390583 25890 123018 75580 254964
14993B54964q0233J86082q5963n5232l0142l3315K68075j36540j36388K63488
$$ 254964 174731 360813 274850 219618 189476 156161 424236 287696 151308 414796
14983D14796B03876l4334J81963R2080A78001k0196m532b15554B96489l3270p8086
$$ 414796 203876 169542 351505 443585 178001 157805 153273 -215554 296489 263219 185133
14972A85133H9984L28733E0272J59768o3623j4820J57421K93717j47552m7766
$$ 185133 89984 418717 50272 210040 146417 131597 289018 582735 435183 387417
14962C87417J01410D877N27996G5938J30820J04564k2369E8774L07624B6939K74183
$$ 387417 488827 4877 532873 75938 206758 311322 288953 58774 366398 26939 301122
14951C01122R584H0474J83622J59781A47843K30128B588J76968L71915m3098R5597
$$ 301122 310706 80474 264096 423877 147843 377971 2588 179556 551471 508373 603970
14940F03970H139d1746C11453J97172C224e9992C07425C3792K43608j02137n3140
$$ 603970 8139 -41746 311453 508625 3224 -59992 307425 33792 277400 175263 122123
14929A22123J30795B5996L78514J556m0321o5420J36583j54987j05585C4818J72970
$$ 122123 252918 25996 404510 406066 365745 300325 436908 281921 176336 34818 207788
14918B07788J48688p9520l9571J45675j25978M10283A30556K33493N09122B01078
$$ 207788 356476 276956 237385 383060 257082 667365 130556 364049 873171 201078
14907C49872p4602o2366c6539C16270J30296r6643k7912K0773F8291K80468r555
$$ 349872 275270 212904 -36539 316270 446566 349923 322011 342784 68291 348759 339204
14896C39204R3107H2368M16099r7464J36074d608B54484J01223J82260A13661
$$ 339204 432311 82368 498467 401003 537077 -4608 254484 355707 537967 113661
14885B45540r536J33454n6739r183P8110A29683L06995r8875r4003J94557j21722
$$ 245540 236004 369458 312719 303536 381646 129683 436678 337803 243800 438357 316635
14874C16635K6500M6452m4865A22738K50228G8284J61975J45085j05632A31487
$$ 316635 343135 389587 344722 122738 372966 78284 240259 385344 279712 131487
14863C31452M23641j64233R4109k99664j70020K61229j37428K97403k47260J12510
$$ 331452 755093 590860 684969 385305 215285 476514 339086 636489 389229 501739
14853E01739r4237J7029K27350j18575j70584O2936l6226K56423j29298j19521
$$ 501739 407502 424531 651881 533306 362722 425658 389432 645855 516557 397036
14843C97036E9573O08340B48125P8039H8226K44068k7071K06917k07033P1855
$$ 397036 59573 667913 248125 326164 88226 332294 305223 512140 305107 376962
14833C76962J99552k55281k5762A23895L89127k40836J39013A11880L81822K7706
$$ 376962 576514 321233 295471 123895 513022 272186 411199 111880 493702 521408
14823E21408M8232B37340l7046K50239N7048N625J21598j59081I6154M84739B85540
$$ 521408 569640 237340 200294 450533 507581 513206 634804 475723 96154 580893 285540
14811F39538B07215J76858j88142L55300r4532J72353B69820O4046j3248J52882
$$ 639538 207215 384073 195931 551231 456699 629052 269820 333866 320618 473500
14801D73500n003P8825B51415N8432K2606J08868k5274P3570B23261J93377L62192
$$ 473500 468497 547322 251415 309847 332453 441321 416047 489617 223261 416638 778830
14790G78830l47251J2849J32351M5163j1129J04630n3089N757A50418J63379N71964
$$ 778830 431579 444428 576779 621942 610813 715443 662354 668111 150418 313797 885761
14779H85761m29009K15384B89135M25713o7062j68247o9873R6599K10152k82658
$$ 885761 456752 672136 289135 714848 647786 479539 409666 506265 716417 433759
14769D33759l6526p6838L52462j23757j45003K12224R0662P9900j24303l8462
$$ 433759 397233 320395 672857 549100 404097 616321 706983 786883 662580 624118
14759F24118N5307M49250m87400k78313M85809C18507J54987J44016n0457M18940
$$ 624118 679425 1128675 641275 362962 848771 318507 473494 617510 567053 985993
14749I85993k19708p7282p3794k68121K48760K82645l67217m0251L45166l58245
$$ 985993 766285 689003 615209 347088 595848 878493 511276 471025 816191 457946
14739D57946L43113j1382J80078m06651P6724j23007K71493L364l82017L37138
$$ 457946 801059 789677 969755 563104 639828 516821 788314 791678 409661 746799
14729G46799j28757j5615L30940D41565J37077K74197j86100J24038p2670Q882
$$ 746799 618042 602427 933367 441565 578642 852839 666739 790777 718107 726989
14719G26989j7903J37987j65439k00716L06914J0983L30738m61434J26507J51023
$$ 726989 709086 847073 681634 480918 787832 798815 1129553 668119 794626 945649
14709I45649J909k43905L410K98679k97307j46950L58122k83447K88535j71597
$$ 945649 947558 703653 707063 1005742 708435 561485 919607 636160 924695 753098
14699G53098K38800l49112L91080k55719R2579K67043l22228M67987Q4997m86114
$$ 753098 991898 642786 1033866 778147 870726 1137769 815541 1283528 1368525 882411
14689H82411J01180j75852K78107j18973J45701M407k56640P8847j8410l6319
$$ 882411 983591 807739 1085846 966873 1112574 1116981 860341 939188 920778 884459
14679H84459m0853J26331r5522N4304L9138k30146k54414L28766J27691m0571
$$ 884459 843606 969937 874415 928719 967857 737711 483297 812063 939754 899183
14669H99183K17038k0363k31309j2602j09326J50326j77811M36643j9102k66060
$$ 899183 1116221 1095858 864549 851947 742621 892947 715136 1151779 1132677 866617
14659H66617K5345Q94294p12175R0197k43274r6073L99866K899j26656j31126
$$ 866617 891962 1786256 1074081 1164278 921004 824931 1224797 1227696 1101040 969914
14649I69914K79945m01486K92579k09130J66811k98146M20195n1999R6873l05902
$$ 969914 1249859 848373 1140952 931822 1098633 800487 1220682 1168683 1265556 959654
14639I59654M21938n1683Q634j25755K62454K4067k36779q4850J86847m04860
$$ 959654 1381592 1329909 1338543 1212788 1475242 1499309 1262530 1177680 1364527 959667
14629I59667L05737J3604M3194q1935L29489j16996p8690j20122q6210J77333
$$ 959667 1265404 1279008 1322202 1240267 1569756 1452760 1374070 1253948 1167738 1345071
14619A345071p4096J79847j61437M12161k17958k65683J05518L10355k11396J84905
$$ 1345071 1270975 1450822 1289385 1701546 1483588 1217905 1323423 1633778 1422382 1607287
14609A607287j55865K62918m36502J32444l9917K99532q7271K4892o2697L30230
$$ 1607287 1451422 1714340 1277838 1410282 1370365 1669897 1582626 1607518 1544821 1875051
14599A875051k78573j90655L79680J38598l31184K023O903Q5665q962Q6101M1201
$$ 1875051 1596478 1405823 1785503 1924101 1592917 1594940 1601843 1687508 1678546 1764647 1805848
14588A805848k45431J46468j75366L11618p9386R5143j56889L5923L57104n1099
$$ 1805848 1560417 1706885 1531519 1843137 1763751 1858894 1702005 1737928 2095032 2043933
14578B043933J81507l35964K79911k26615P7606m08412J85414M98527k51612m2598
$$ 2043933 2225440 1889476 2169387 1942772 2020378 1611966 1797380 2295907 2044295 2001697
14568B001697K07401K27494l05454J98856K52157k54367J37239j14922J05944
$$ 2001697 2209098 2436592 2131138 2329994 2582151 2327784 2465023 2350101 2456045
14559B456045O19329n03016R7607L99994J98913J60680J39857J61656J523116
$$ 2456045 3075374 2572358 2669965 3069959 3268872 3429552 3569409 3731065 5254181
14550E254181O37724J454449M190243J1081255J6875810R39234j7705384A0267188
$$ 5254181 5891905 7346354 11536597 22617852 39493662 40432896 22727512 10267188
14541D904456j449891o88625m84024j80531K39096l08422p7757N6874L27207r2985
$$ 4904456 3454565 2765940 2281916 2101385 2340481 2032059 1954302 2011176 2338383 2245398
14531B245398j51830M1044l20484J22961L38688M5981K9918J23105O2751j62305
$$ 2245398 2093568 2134612 1814128 1937089 2275777 2321758 2351676 2474781 2537532 2375227
14521B375227O7102L8157J6082l86964O82444m11147K83522J31418k67261j44136
$$ 2375227 2442329 2480486 2496568 2109604 2792048 2380901 2664423 2795841 2528580 2384444
14511B384444M86603j07654n3625k35399M82379k29709M64532n27937m3917J11757
$$ 2384444 2871047 2763393 2709768 2474369 2956748 2727039 3191571 2663634 2619717 2731474
14501B731474P6986K92497k69347R9649k0491M4358J87709J72777n1699K43945
$$ 2731474 2808460 3100957 2831610 2931259 2910768 2955126 3142835 3315612 3263913 3507858
14491C507858N6941q8585j86362l0531K07320L5769J41578j94266J75194J45428
$$ 3507858 3564799 3476214 3289852 3259321 3466641 3502410 3643988 3449722 3624916 3770344
14481C770344k9674L8710j9496L6647J34100r6234K98229J26823J72747j40267
$$ 3770344 3740670 3779380 3759884 3796531 3930631 3834397 4132626 4259449 4432196 4291929
14471D291929o5881J55359Q4130M0685j2917l8488l97259K33325L29640O3096
$$ 4291929 4226048 4381407 4465537 4506222 4493305 4454817 4057558 4290883 4620523 4683619
14461D683619m65302K46331O00519n68402P32322j98511Q2915J74249j27604N0971
$$ 4683619 4218317 4464648 5065167 4496765 5229087 5030576 5113491 5287740 5160136 5211107
14451E211107K94986k42195L26048k26604K32879k50765K92215p2880K81589l8741
$$ 5211107 5506093 5263898 5589946 5363342 5596221 5345456 5637671 5564791 5846380 5807639
14441E807639O1734L76031o28243N96020j29601O719L35511k0299J37173K19645
$$ 5807639 5869373 6245404 5617161 6213181 6083580 6090299 6425810 6405511 6542684 6762329
14431F762329l01019J79911N4840K00227Q4963L07350m49677M69759L87191j55276
$$ 6762329 6461310 6641221 6696061 6896288 6981251 7288601 6838924 7308683 7695874 7540598
14421G540598K1085J60295L79480l2669K68058q8605M29000m38373K26460J10675
$$ 7540598 7561683 7721978 8101458 8068789 8336847 8248242 8677242 8238869 8465329 8576004
14411H576004L85586r1080o9001N04838n9231K14124M17911j34141J1109K57235
$$ 8576004 8961590 8870510 8801509 9306347 9247116 9461240 9879151 9745010 9756119 10013354
14401A0013354K80915J218K47295J50282N7909L80291J38919K1438M73219N8867
$$ 10013354 10294269 10295487 10542782 10693064 10750973 11131264 11270183 11291621 11764840 11823707
14391A1823707P5593K94334M78788L55065k95320N73501J48458p9321J08703R13391
$$ 11823707 11899300 12193634 12672422 13027487 12732167 13305668 13454126 13374805 13483508 14396899
14381A4396899q3614K91899M79754J82283M74580j16233M20257L12102P79671
$$ 14396899 14313285 14605184 15084938 15267221 15741801 15625568 16045825 16357927 17137598
14372A7137598k42085O25614M50005K57009J19237K97960O15444O68793N12018
$$ 17137598 16895513 17521127 17971132 18228141 18347378 18645338 19260782 19929575 20441593
14363B0441593n3382N82996L88347M33514Q04489O53656J63032M95811O76421
$$ 20441593 20388211 20971207 21359554 21793068 22597557 23251213 23414245 23910056 24586477
14354B4586477L38717Q81037M40355O79720Q81747P11084P79646O75322Q00966
$$ 24586477 24925194 25806231 26246586 26926306 27808053 28519137 29298783 29974105 30775071
14345C0775071M67147J095961N76857J082080Q40621J334565Q10015Q64623P80008
$$ 30775071 31242218 32338179 32915036 33997116 34837737 36172302 36982317 37846940 38626948
14336C8626948J378143J140437J272128J238893J513443J599731J436577J272567
$$ 38626948 40005091 41145528 42417656 43656549 45169992 46769723 48206300 49478867
14328D9478867J644299J502356J888678J922625J775814J741230K207644K101199
$$ 49478867 51123166 52625522 54514200 56436825 58212639 59953869 62161513 64262712
14320F4262712K516736K445765K653781K753458K552177L183549L149873L232702
$$ 64262712 66779448 69225213 71878994 74632452 77184629 80368178 83518051 86750753
14312H6750753L611940M104416L789465M042355M870546M228130M961012N434549
$$ 86750753 90362693 94467109 98256574 102298929 107169475 111397605 116358617 121793166
14304A21793166N392862O338939O187680O903488P260924Q112132P642841Q466161
$$ 121793166 127186028 133524967 139712647 146616135 153877059 161989191 169632032 178098193
14296A78098193R239291R500868J0560596J0544197J0899386J2245155J2143536
$$ 178098193 187337484 196838352 207398948 217943145 228842531 241087686 253231222
14289B53231222J3370751J3595730J4222375J4991000J5009270J4992366J5521111
$$ 253231222 266601973 280197703 294420078 309411078 324420348 339412714 354933825
14282C54933825J5401949J4979560J4646442J3755367J2806965J1291458R931157
$$ 354933825 370335774 385315334 399961776 413717143 426524108 437815566 447746723
14275D47746723P940867O284452L478747L8053m161187m780640m316571m985128
$$ 447746723 455687590 461972042 465450789 465488842 461327655 456547015 452230444 447245316
14267D47245316o066978p612988j0702203j1833331j2557830j4292529j5112142
$$ 447245316 441178338 433565350 422863147 411029816 398471986 384179457 369067315
14260C69067315j5795733j5661209j5624483j5497182j4972166j3914052j3428987
$$ 369067315 353271582 337610373 321985890 306488708 291516542 277602490 264173503
14253B64173503j3298791j2615465j1791097j1402305j0491162j0490782r454255
$$ 264173503 250874712 238259247 226468150 215065845 204574683 194083901 184629646
14246A84629646q842761q475689p812822p416314p279149o512519o469042n680903
$$ 184629646 175786885 167311196 159498374 152082060 144802911 138290392 131821350 126140447
14238A26140447n371017n366540m985297m736245m702702l978393l478367l496487
$$ 126140447 120769430 115402890 110417593 105681348 100978646 97000253 93521886 90025399
14230I0025399l500754l678943l119376k930041k800078k781054k589742k707162
$$ 90025399 86524645 82845702 79726326 76796285 73996207 71215153 68625411 65918249
14222F5918249k041768k257839j942519j798872k239135j902214j964195j152445
$$ 65918249 63876481 61618642 59676123 57877251 55638116 53735902 51771707 50619262
14214E0619262j257473j682377j286869k014259r43153j391356r37596l34668
$$ 50619262 49361789 47679412 46392543 44378284 43435131 42043775 41106179 40771511
14206D0771511j175320j600784j309909r16780j106847m19668o97081j044793
$$ 40771511 39596191 37995407 36685498 35768718 34661871 34242203 33545122 32500329
14198C2500329r03706j079065n47256r84039p31217o39157m67577j020035m15300
$$ 32500329 31596623 30517558 29970302 28986263 28255046 27615889 27148312 26128277 25712977
14189B5712977n90927j106981n4137n02778l35014l17402q10774n87258K07n44799
$$ 25712977 25122050 24015069 23960932 23458154 23123140 22805738 21994964 21407706 21407913 20863114
14179B0863114n63694n47594m24710r0031p31840k88216j45834m35567k00089
$$ 20863114 20299420 19751826 19327116 19237085 18505245 18217029 18071195 17635628 17435539
14170A7435539o54218m33226m3430l06529l82245o6711l03348l11429k92313k57491
$$ 17435539 16781321 16348095 16304665 15998136 15615891 15549180 15245832 14934403 14642090 14384599
14160A4384599j18293p6031m46246l87661l81487k32769k24154L28904o15607
$$ 14384599 14266306 14190275 13744029 13356368 12974881 12742112 12517958 12846862 12231255
14151A2231255k53443k93510L53451j81286k39028l81095k11993K5223l25338
$$ 12231255 11977812 11684302 12037753 11856467 11617439 11236344 11024351 11049574 10724236
14142A0724236k01802p8388l35341J71730k17325l97134K9866j61526k04776m38573
$$ 10724236 10522434 10444046 10108705 10280435 10063110 9665976 9695842 9534316 9329540 8890967
14132H890967n1817q5162J12268P0536l59806k49889M7533K05999n60036m5646
$$ 8890967 8839150 8753988 8866256 8936792 8576986 8327097 8374630 8580629 8020593 7974947
14122G974947J24143q4453j37981k68408j58529r8543j33503J42363o55691O70758
$$ 7974947 8099090 8014637 7876656 7608248 7449719 7351176 7217673 7360036 6704345 7375103
14112G375103o08123p6429L2757P2026k28176k59471O9012J65606m954l66408
$$ 7375103 6766980 6690551 6723308 6795334 6567158 6307687 6376699 6542305 6537351 6170943
14102F170943K65566l38624l41080M26522k47219j35090j95157l9892J71011k03447
$$ 6170943 6436509 6097885 5756805 6183327 5936108 5801018 5605861 5565969 5736980 5533533
14092E533533L05116l51532k51787K27415k65304j66721m85003N55580m60550
$$ 5533533 5838649 5487117 5235330 5462745 5197441 5030720 4545717 5101297 4640747
14083D640747k3695o0045J13924R6065j39674K78305l59551J96148m82631K38227
$$ 4640747 4617052 4557007 4670931 4766996 4627322 4905627 4546076 4742224 4259593 4497820
14073D497820K19178k16929K85407q08413K98144m0418K2222l58889J26478o4352
$$ 4497820 4716998 4500069 4785476 3977063 4275207 4234789 4257011 3898122 4024600 3960248
14063C960248j00782K9328J52662M7907k27643M8312m99787M72137J94376m79941
$$ 3960248 3859466 3888794 4041456 4089363 3861720 3910032 3410245 3882382 4076758 3596817
14053C596817J26091J74127l45670k53713J32689k36375M15571j95873K29222
$$ 3596817 3722908 3897035 3551365 3297652 3430341 3193966 3609537 3413664 3642886
14044C642886r75704R55994n03554K51257j24646o691l72811K06043R7792J66946
$$ 3642886 2667182 3623176 3119622 3370879 3246233 3239542 2866731 3072774 3170566 3337512
14034C337512k26585m825j4410j1096K7891n18016N17500l43858M085L03089k06827
$$ 3337512 3110927 3106102 3091692 3080596 3108487 2590471 3107971 2764113 2768198 3071287 2864460
14023B864460j15820P3185R0699j73834l50347L09475P6566q2472j41548m7097
$$ 2864460 2748640 2821825 2912524 2738690 2388343 2697818 2774384 2691912 2550364 2503267
14013B503267q5537o5292p8372j34724L86234k36676K68924m59149M41205k27559
$$ 2503267 2417730 2352438 2274066 2139342 2525576 2288900 2557824 2098675 2539880 2312321
14003B312321l76019L52365k10522J05514n8122j08529J99367l7633k91832L93096
$$ 2312321 1936302 2288667 2078145 2183659 2125537 2017008 2216375 2178742 1886910 2280006
13993B280006n4942j18683m6026P89101P01085K887487R237596J7277909P319230
$$ 2280006 2225064 2106381 2060355 2849456 3550541 6438028 15675624 32953533 40272763
13984D0272763j4801077j1561854n311749k591497r40275q67409l36349j70942
$$ 40272763 25471686 13909832 8598083 6006586 5066311 4198902 3862553 3691611
13976C691611m64643j19749l55588J66406m95951J72410J25266j38862k35408
$$ 3691611 3226968 3107219 2751631 2918037 2422086 2594496 2719762 2580900 2345492
13967B345492R2210J99215m91948L04693m16237M61384q24693L63611p4965l180
$$ 2345492 2437702 2636917 2144969 2449662 2033425 2494809 1670116 2033727 1958762 1955582
13957A955582q8282L50553k64054N0499M9366J49K0185j42458P3929k89036L20631
$$ 1955582 1867300 2217853 1953799 2004298 2053664 2053813 2073998 1931540 2005469 1716433 2037064
13946B037064J37109k14287J70515m26640L66399o06595M73290j74211k16098
$$ 2037064 2174173 1959886 2130401 1703761 2070160 1463565 1936855 1762644 1546546
13937A546546M38471k56009J66754j32665r9458R2004k46620J84663J09482j23011
$$ 1546546 1985017 1729008 1895762 1763097 1663639 1755643 1509023 1693686 1803168 1680157
13927A680157r6490J06658j54411k25634L29691p4556K5034K2752j7474q4090
$$ 1680157 1583667 1690325 1535914 1310280 1639971 1565415 1590449 1613201 1595727 1511637
13917A511637j01962J01300J32698j27255n6551L4823N9070k79620J52458n88
$$ 1511637 1409675 1510975 1643673 1516418 1459867 1494690 1553760 1274140 1426598 1426010
13907A426010Q6469k54399r1427K01833j51392J26666j35048q1230m5675L85376
$$ 1426010 1512479 1258080 1166653 1368486 1217094 1343760 1208712 1127482 1081807 1467183
13897A467183J89619k12746l13707N9802K40416K0521k87579L61184l20465L31428
$$ 1467183 1656802 1444056 1130349 1190151 1430567 1451088 1163509 1524693 1204228 1535656
13887A535656j62536K71087k94066o2190J25825m19648K53890j36713J76784J06078
$$ 1535656 1373120 1644207 1350141 1287951 1413776 994128 1248018 1111305 1288089 1394167
13877A394167l91724n6655L41419j42251N9664J24028k11733k61083J12830K29878
$$ 1394167 1002443 945788 1287207 1144956 1204620 1328648 1116915 855832 968662 1198540
13867A198540J25635j36732M7744l2435J38440j11703p1790j16153K13279l69670
$$ 1198540 1324175 1187443 1235187 1202752 1341192 1229489 1157699 1041546 1254825 885155
13857H85155N5076j52704J55230K74585m27121J02896Q1425k3097k75093J76007
$$ 885155 940231 787527 942757 1217342 790221 893117 974542 951445 676352 852359
13847H52359L50318k82406J6355j09351L22379J06623m83046K48978P2254m4390
$$ 852359 1202677 920271 936626 827275 1149654 1256277 773231 1022209 1094463 1050073
13837A050073K5802j22867J34934l80234J97426O0625k5009K29455k40373j82743
$$ 1050073 1075875 953008 1087942 707708 905134 965759 940750 1170205 929832 747089
13827G47089K67845J8335j04491j06670j66309K41049J12245m15356J04539Q9318
$$ 747089 1014934 1033269 928778 822108 655799 896848 1009093 593737 698276 787594
13817G87594L7955J49423j47593j06185J06750J78553j15456l71738N22727k63277
$$ 787594 825549 974972 827379 721194 827944 1006497 891041 519303 1042030 778753
13807G78753k3299L19678m7739k80318N6995R5530k55721k63268K89902l2436
$$ 778753 755454 1075132 1027393 747075 804070 899600 643879 380611 670513 638077
13797F38077j479j45638L99231J6022r2695j4262N74908n48877J62463j81075
$$ 638077 636598 490960 890191 906213 813518 799256 1374164 825287 987750 806675
13787H06675L54622m95551l6639L37938J31599l69329n8869K10786k8377M5364
$$ 806675 1161297 665746 629107 967045 1098644 729315 670446 881232 852855 898219
13777H98219k74624M0094k08126N24347q2415R8976m62102K02162k00000M74075
$$ 898219 623595 663689 455563 979910 897495 996471 534369 736531 536531 1010606
13767A010606j92011O920L3621j42955j54368l1018J08610L89115l10363j11342
$$ 1010606 818595 825515 859136 716181 561813 530795 639405 1028520 718157 606815
13757F06815M3076l579j64469M31226j46247l043r958l30049n4300K4271K74871
$$ 606815 649891 646312 481843 913069 766822 763779 753821 423772 369472 393743 668614
13746F68614l326K8121C20710J97918J7706K09064K13587l04731J4043l2187j70043
$$ 668614 665288 693409 320710 518628 536334 745398 958985 654254 668297 636110 466067
13735D66067j2112K83199C48069K81258Q5958J11199l01331K35751A45364L14661
$$ 466067 453955 737154 348069 629327 715285 826484 525153 760904 145364 460025
13725D60025o9487M80608C14458M83549j49307K3035q7096p2879R713K2678p8944
$$ 460025 390538 871146 314458 798007 648700 671735 584639 511760 521473 544151 465207
13714D65207J11463j51103L3428L27447j934o758l56010J37809M8300k08745L3537
$$ 465207 576670 425567 458995 786442 784508 777750 421740 559549 607849 399104 432641
13703D32641O60270C62402J35352K54403B86161M4974L73401A99867N89361l00010
$$ 432641 1092911 362402 497754 752157 286161 331135 704536 199867 789228 489218
13693D89218J48299k58555O927J84726B47769K58400k766j58223L05064j86639
$$ 489218 637517 378962 385889 570615 247769 506169 503403 345180 650244 463605
13683D63605O2408n7321m1303J0425j47053L92120K6374k56772J44314k20867
$$ 463605 526013 468692 427389 437814 290761 682881 709255 452483 596797 375930
13673C75930L18135N912l21942M65880l83532j52413L55571k78743J66324k61479
$$ 375930 694065 699977 378035 843915 460383 307970 663541 384798 551122 289643
13663B89643R2392P2036k14610L29135J5716B4096M91504A87311K74385k09139
$$ 289643 382035 454071 239461 568596 584312 24096 515600 187311 461696 252557
13653B52557J16226Q5373P4974P0125Q2959B47873L29886B81352J39576r8767
$$ 252557 368783 454156 529130 599255 682214 247873 577759 281352 420928 322161
13643C22161K36107E4244E687M71917A65199N26983k97491J9871A91904L14630
$$ 322161 558268 54244 5687 477604 165199 692182 394691 414562 191904 506534
13633E06534N2268k71317K22419n8949O4495Q9800k49162o6158J83509L8452B39843
$$ 506534 558802 287485 509904 450955 515450 605250 356088 289930 473439 511891 239843
13621F41789B20237j4673J82533A86859J52850J54857k2688L9740B50531m6179
$$ 641789 220237 205564 388097 186859 339709 494566 471878 511618 250531 204352
13611B04352K9650K19275j69279l9982L22311B53192r0904J77970j5523J10755
$$ 204352 234002 453277 283998 244016 566327 253192 162288 340258 324735 435490
13601D35490K90090C50322Q343p3693J02929O4078A83357J83661j28221J13841
$$ 435490 725580 350322 358665 284972 387901 451979 183357 367018 238797 352638
13591C52638J7707L7766O3545j93037N00893k48712r8724j77253J79244M7759
$$ 352638 370345 408111 471656 278619 779512 530800 432076 254823 434067 481826
13581D81826P345A85822J74809j18998K72393j66799A04051L97230B35328J01672
$$ 481826 489171 185822 360631 241633 514026 347227 104051 501281 235328 337000
13571C37000A63101L51729m3782A3987K38112k1713L3737n9979P8250J76660j08493
$$ 337000 163101 514830 471048 13987 252099 230386 264123 204144 282394 459054 350561
13560C50561n8680M54729j33175A97025K07604j62255J53640N2599A51688J41958
$$ 350561 291881 746610 613435 197025 404629 242374 396014 448613 151688 293646
13550B93646M4667J19949j06218j16915q0509K38778o6383Q4874B03990N3033
$$ 293646 338313 458262 352044 235129 154620 393398 327015 411889 203990 257023
13540B57023J60831J56295A93433m4295n9783R5429J77791g3341A52648M9903
$$ 257023 417854 574149 193433 149138 89355 184784 362575 -73341 152648 202551
13530B02551J95884o0967l5989n4576e535D11235p2602A41534K39010j13603G7548
$$ 202551 398435 337468 301479 246903 -5535 411235 338633 141534 380544 266941 77548
13518C81053A50917J88254Q22A08294N2968j1074n4405D4880N95043l12323g1041
$$ 381053 150917 339171 339993 108294 161262 150188 95783 44880 639923 327600 -71041
13506C21952p0138K16126A08606N03872A09052J67294m0207j08462i460D4551
$$ 321952 251814 467940 108606 612478 109052 276346 236139 127677 -9460 44551
13495C88477l1972J76566k19202J33860j92782J40238r8179N9701b85341F9062
$$ 388477 356505 533071 313869 447729 254947 395185 297006 356707 -285341 69062
13484I0453M6180K54725k1002L66108A40334B1413L57629J69407i5339C16163
$$ 90453 136633 391358 370356 736464 140334 21413 379042 548449 -95339 316163
13473A79495L4742A01391M2701J33121J36886b64840b6662C64116A57512K3229
$$ 179495 214237 101391 144092 277213 414099 -264840 -26662 364116 157512 180741
13463A80741P4848R8498F3036K08614L09860k11642j75312Q7671j17895J93615
$$ 180741 255589 354087 63036 271650 581510 369868 194556 282227 164332 357947
13453C57947j32298B7713A0586K5477f2498E73530j57311M3003I8099N1660j2758
$$ 357947 225649 27713 10586 36063 -62498 573530 416219 459222 98099 149759 137001
13442A37001j9200n2709M4042M61604A86299r1104D7122O3966K88088a25381A12749
$$ 137001 117801 65092 109134 570738 186299 95195 47122 111088 399176 -125381 112749
13430B62707A00830J1204R1737M80123B309K02290b14591D5669K23754p82j17567
$$ 262707 100830 112034 203771 683894 2309 204599 -214591 45669 269423 268641 151074
13419A51074Q7862N9523K8148K3222D0693L97991A52467n2198L69804k01356K99805
$$ 151074 238936 298459 326607 349829 40693 438684 152467 100269 470073 268717 568522
13408E68522e6233B91448K40682j26639J1991a03891A28257O9234e7018C80518
$$ 568522 -56233 291448 532130 405491 417482 -103891 128257 197491 -57018 380518
13397A82827K1340A2774L0516a04420c8675A57513o6712R0768K39264B0236J08498
$$ 182827 204167 12774 43290 -104420 -38675 157513 90801 181569 420833 20236 128734
13386A28734M2718J05344e034H4331M09673J6258k13613A36460J76833l0750J64050
$$ 128734 171452 276796 -5034 84331 494004 510262 296649 136460 313293 282543 446593
13375D46593a1503A61646K55572k04741K76961j22940M478n3354o1822n4791E4864
$$ 446593 -11503 161646 417218 212477 489438 366498 370976 317622 255800 201009 54864
13363A48341M35027A4111a5487A33365J92096K6371A27182K22526J03419B05642
$$ 148341 583368 14111 -15487 133365 325461 351832 127182 349708 453127 205642
13352A65679a2078A96735R9913J3523N2050j53359J50280j15192J23982l2461
$$ 165679 -12078 196735 296648 310171 362221 208862 359142 243950 367932 335471
13342C35471K37558A97375J23592j202j39874J5672J45392j63332j0885Q6771
$$ 335471 573029 197375 320967 319765 179891 195563 340955 177623 166738 253509
13332B53509K8613K13605B19363m0493J30276I4356k7578J9227K26052j10187
$$ 253509 282122 495727 219363 178870 309146 94356 66778 86005 312057 201870
13322B01870Q2631J55101j68366F5771Q2561J1960J37151E9809O15199k78995
$$ 201870 284501 439602 271236 65771 148332 160292 297443 59809 675008 396013
13312C96013A58556k0536o4528M41690j09756L3118A17032J62171a639A20872
$$ 396013 158556 138020 73492 515182 405426 438544 117032 279203 -1639 120872
13301D30569m0260G5138K18516I03L9033L41882A26269J37419b2972r90r4289
$$ 430569 390309 75138 293654 903 39936 381818 126269 263688 -22972 -23962 -118251
13290a18251A85522g3663C7171J82588r6005L3701J22033b01918A76137B9511
$$ -118251 185522 -73663 37171 219759 123754 157455 279488 -201918 176137 29511
13279H7524J32191K72768A23215K58762h5043G2850J36744b6591k03519i8151
$$ 87524 219715 492483 123215 381977 -85043 72850 209594 -26591 -230110 -98151
13268A83541H5742J6029g9910D3830d1462j72376A02668a01185B33226a73014
$$ 183541 85742 101771 -79910 43830 -41462 -213838 102668 -101185 233226 -173014
13257a60942B53346m1509F6809I477c3034A76897K2059K87854k10097j20949g6390
$$ -160942 253346 211837 66809 9477 -33034 176897 198956 486810 276713 155764 -76390
13245c3218e579j00567A41149J79043N1653a24535D9809b08469B36133r0853a06529
$$ -33218 -5579 -106146 141149 320192 371845 -124535 49809 -208469 236133 145280 -106529
13233d1750B40205O6110n8824O5647f1576k80509A46158K09589D6882d17D7802
$$ -41750 240205 306315 247491 313138 -61576 -342085 146158 355747 46882 -417 47802
13221c07024J53075J5422H9566K9017M08183A86270M9338j04850n0601J06293
$$ -307024 -153949 -138527 89566 118583 526766 186270 235608 130758 80157 186450
13211A86450h5602o6228m2213i44I0052M10024A83976c2540k13294A13534A1585
$$ 186450 -85602 -151830 -194043 -944 90052 500076 183976 -32540 -245834 113534 11585
13199A1434b61144e2971C1127J95222a53208A02788J21091n3763J1125L5419k0196
$$ 11434 -261144 -52971 31127 226349 -153208 102788 223879 170116 181241 216660 196464
13188A96464k865b64181C60280A7268a23874A52717M6817b2322D19527j46126
$$ 196464 193599 -264181 360280 17268 -123874 152717 199534 -22322 419527 273401
13178B73401a3791A03345N3225b1295A23075R0476A437J57129R234C5741K25282
$$ 273401 -13791 103345 156570 -21295 123075 213551 1437 158566 167800 35741 261023
13167B61023p0341C3047i3174B16604a27510C16827L4701F4317b92750a07316
$$ 261023 190682 33047 -93174 216604 -127510 316827 351528 64317 -292750 -107316
13156B86018p6942B9435b8977A75688j6829j7244A5885E670e6238k76014a12381
$$ 286018 209076 29435 -28977 175688 158859 141615 15885 5670 -56238 -332252 -112381
13144a57682B87751p9944B5442J8980N8185c3393p7546A73369i029A42674C7861
$$ -157682 287751 207807 25442 44422 102607 -33393 -110939 173369 -9029 142674 37861
13132B91245q5371e5475A14255J24321p3021K1053M8977d02987C245R2155g5242
$$ 291245 205874 -55475 114255 238576 165555 186608 235585 -402987 3245 95400 -75242
13120a25085C446J9315J91410N6085A01387O0180A4900M8758H820J43289J49152
$$ -125085 3446 22761 214171 270256 101387 161567 14900 63658 8820 152109 301261
13109C01261A14100n5795d8145A44283M1620D9796b77610G9164A410K34846j05065
$$ 301261 114100 58305 -48145 144283 185903 49796 -277610 79164 1410 236256 131191
13098A31191J34817H4666Q5793N2345A104K69473D1627Q4150K9121a09900B83123
$$ 131191 266008 84666 170459 222804 1104 270577 41627 125777 154898 -109900 283123
13086B57648n9362G999P7712N58794I5013J76299F2947K17182P4787j37578o1300
$$ 257648 198286 7999 85711 644505 95013 271312 62947 280129 354916 217338 156038
13075A56038m5874J12391j10454a55927G760d6285F8755h6187q5484G7456J071
$$ 156038 110164 222555 112101 -155927 7760 -46285 68755 -86187 -171671 77456 78527
13064G8527P9956a39593n5609C15466j54366d0340G2567B0847f0975k9424B67311
$$ 78527 158483 -139593 -195202 315466 161100 -40340 72567 20847 -60975 -90399 267311
13052a97081f0266C9283J97193i209A49272g0508A43651o1032a90827l131A94655
$$ -197081 -60266 39283 236476 -9209 149272 -70508 143651 82619 -190827 -193958 194655
13040b02265C73084I71J71070k6535K9015R0538a53725A28082A8805J14755K24327
$$ -202265 373084 971 172041 145506 174521 265059 -153725 128082 18805 133560 357887
13029C57887j22613k2913J37055R1238A72210J83831r5700J85902f8451C1964
$$ 357887 235274 212361 349416 440654 172210 356041 260341 446243 -68451 31964
13018i313F8512K51090j57353l519J42450a01326G8332P1045J20002J87973j52510
$$ -9313 68512 319602 162249 158730 301180 -101326 78332 149377 269379 457352 304842
13007C04842j11251j7966J91996I6657m994P7205c2556B85747J16358a83794i1119
$$ 304842 193591 175625 367621 96657 91663 168868 -32556 285747 402105 -183794 -91119
12995B83875A11257d09233B15627a93116N4539O6719D9746a14099j25260C1613
$$ 283875 111257 -409233 215627 -193116 -138577 -71858 49746 -114099 -239359 31613
12984A10241c0668A10258O0239P3135b0398N672D03360q6866a14028B44149a93770
$$ 110241 -30668 110258 170497 243632 -20398 -14726 403360 316494 -114028 244149 -193770
12972e4118C06740j02349e78540h6925A14628a62093d7651r9987B6697K597a76636
$$ -54118 306740 204391 -578540 -86925 114628 -162093 -47651 -147638 26697 29294 -176636
12960a73659F1469J32994j1324g1910A77451b13817G4559b29242J06555j33608
$$ -173659 61469 194463 183139 -71910 177451 -213817 74559 -229242 -122687 -256295
12950b56295i6310o2830e5089B178K11305L5365E3219k4638R942L86206j88431
$$ -256295 -96310 -159140 -55089 2178 213483 248848 53219 28581 38523 424729 236298
12939B36298m8571b0126E9611b42871B9887a0692j81929A26801a54795C00251
$$ 236298 187727 -20126 59611 -242871 29887 -10692 -192621 126801 -154795 300251
12928b38729A93990m4515a09784k61859b8058j02852B92584a24158A91178j931
$$ -238729 193990 149475 -109784 -371643 -28058 -130910 292584 -124158 191178 189247
12918A89247F1930j0802f4911C67933j12607G943b63493B88789A21017O9313A7861
$$ 189247 61930 51128 -64911 367933 255326 7943 -263493 288789 121017 190330 17861
12906C64043b95904L4186B2083K63560A32197a01880m1147A60889J42574e3226
$$ 364043 -295904 -261718 22083 285643 132197 -101880 -143027 160889 303463 -53226
12895d1143D2538Q0573l72m1231g4719H8717a0009A81813E7944J88637j12368
$$ -41143 42538 123111 122739 81508 -74719 88717 -10009 181813 57944 246581 134213
12884A34213d9597n0379J1354b2998k0920j14847f8827B08625H0863j3385K47764
$$ 134213 -49597 -99976 -88622 -22998 -43918 -158765 -68827 208625 80863 67478 315242
12873C15242A45497E2963J98190e1260o2690D58895F1416L50697A9510a12002
$$ 315242 145497 52963 251153 -51260 -113950 458895 61416 412113 19510 -112002
12862C37522h215j19670F607J72227p5557J53295a87431A23099h7866H4682f7762
$$ 337522 -8215 -127885 6607 178834 103277 256572 -187431 123099 -87866 84682 -67762
12850E5608K74743A7763J7434r484K985b64475B41195R3545j14083J6977D4366
$$ 55608 330351 17763 35197 25713 28698 -264475 241195 334740 220657 237634 44366
12838f2254j16698E6651K06179a96669A43233j8881b29349N387O2409A47679b82900
$$ -62254 -178952 56651 262830 -196669 143233 124352 -229349 -223962 -161553 147679 -282900
12826F1645a86575g9735A01058L0228b86246A43270P9767P8972b5046A04647b09262
$$ 61645 -186575 -79735 101058 131286 -286246 143270 223037 302009 -25046 104647 -209262
12814a8233A6100J05364K6372P5587H1909O4622i8213L780F711Q0521d1827a9296
$$ -18233 16100 121464 147836 223423 81909 146531 -98213 -94433 6711 87232 -41827 -19296
12801a2702A9508K91290b12596Q6899B72348b8264D5059L389K45177b0240j44256
$$ -12702 19508 310798 -212596 -125697 272348 -28264 45059 48448 293625 -20240 -164496
12790a64496A29153b60968a0674A12023J89796G6642b86951c2273j05627e3638
$$ -164496 129153 -260968 -10674 112023 301819 76642 -286951 -32273 -137900 -53638
12779A21080b89402J35712A93351D476e7010l5375A38193j2573g4523A90958D0350
$$ 121080 -289402 -153690 193351 4476 -57010 -92385 138193 125620 -74523 190958 40350
12767b9675C6392N0251b92404B04046g3766A6821J87464k8646c7169m225B11362
$$ -29675 36392 86643 -292404 204046 -73766 16821 204285 175639 -37169 -41394 211362
12755e003o9634B22292A3592J3456d36250A11732K88316p3059A44256b31621B10676
$$ -5003 -74637 222292 13592 27048 -436250 111732 400048 326989 144256 -231621 210676
12743b33335F2038K9157k4804K31760h3168B44145d1824C55636A47354j9166a20898
$$ -233335 62038 91195 66391 298151 -83168 244145 -41824 355636 147354 128188 -120898
12731A51247L5269C8155J81865K8876e2795A01776g1955J1984C159J52322i7909
$$ 151247 186516 38155 220020 248896 -52795 101776 -71955 -59971 3159 155481 -97909
12719D651J68613p8649A2557K66253E140R2073K54102p1210Q1012d846A41063
$$ 4651 173264 94615 12557 278810 5140 97213 351315 280105 361117 -4846 141063
12707D09509m1527J42001O4095A47881K28774q5097g1859c5240H2910a5620q7317
$$ 409509 367982 509983 574078 147881 376655 291558 -71859 -35240 82910 -15620 -102937
12696a02937L0169B6755a19675k0977B50989G0029a68594A62065f6590j1550A65509
$$ -102937 -72768 26755 -119675 -140652 250989 70029 -168594 162065 -66590 -78140 165509
12684H7839e4566q1527j14649a22901D0672O8258J32523k2681A07253K04055P8406
$$ 87839 -54566 -136093 -250742 -122901 40672 108930 241453 218772 107253 311308 389714
12673C89714b0100G545J66735M5634A9310h0903B46050A09377i304A66171k7220
$$ 389714 -20100 7545 174280 219914 19310 -80903 246050 109377 -9304 166171 138951
12662A38951P0415q3863E3011J6321K12076j27487J41187f6527A76068K6442J92704
$$ 138951 209366 125503 53011 69332 281408 153921 295108 -66527 176068 202510 395214
12651C95214L9875B5906J66497a25114A13249c418A36560J54052g8845K2466G1630
$$ 395214 435089 25906 192403 -125114 113249 -3418 136560 290612 -78845 -56379 71630
12639g5556B28022a20384A60901d8493E4232b2339e812m1264j73767A86026a8421
$$ -75556 228022 -120384 160901 -48493 54232 -22339 -5812 -47076 -220843 186026 -18421
12627D5640J2225a71327E34190A95090c023H6490J20293g0876A7920a36281n6784
$$ 45640 57865 -171327 534190 195090 -3023 86490 206783 -70876 17920 -136281 -193065
12616a93065B30265a65112B57204F8147a44572B00841J09390j03252g1764F4034
$$ -193065 230265 -165112 257204 68147 -144572 200841 310231 206979 -71764 64034
12605E8352b09665A64726L0559B8929M13437a50583B28829C2209M0383e8298A59750
$$ 58352 -209665 164726 195285 28929 442366 -150583 228829 32209 72592 -58298 159750
12593A22751l5113J6046m2574M5571R4022a8991B42865N5718F0106d2659B06527
$$ 122751 87638 103684 61110 106681 200703 -18991 242865 298583 60106 -42659 206527
12581a49617a0341C08297E3093k2319K44904d43870B38559p7238H0026j7502F646
$$ -149617 -10341 308297 53093 30774 275678 -443870 238559 161321 80026 62524 6646
12569B75432i2532f27j04810D0209L73576b31370N1962O3858E5669I978e4838
$$ 275432 -92532 -627 -105437 40209 413785 -231370 -179408 -115550 55669 9978 -54838
12557b80807A40514K39520a10563r0913A22535c702j09591a9462j4215B31175
$$ -280807 140514 380034 -110563 -201476 122535 -3702 -113293 -19462 -33677 231175
12546B56534E6370c27460C4128j809K23181a94317F8246b59094c8876m6617k46500
$$ 256534 56370 -327460 34128 32319 255500 -194317 68246 -259094 -38876 -85493 -331993
12535c31993A49717N4516H6006f9547J2302o1250N7310C63387l9538f2958A60899
$$ -331993 149717 204233 86006 -69547 -57245 -118495 -61185 363387 323849 -62958 160899
12523H9361e1469k6533A9705L9862a41668j8160A52688n213J6317J33770a04653
$$ 89361 -51469 -78002 19705 59567 -141668 -159828 152688 147475 163792 297562 -104653
12511I4013k7510e230j78928K1961E8743k1341K69148b29004A2866M1597a37303
$$ 94013 66503 -5230 -184158 -162197 58743 37402 306550 -229004 12866 54463 -137303
12499e3646H4588K39824j57455g3335A25313C7766g5124B59130J05081A58300
$$ -53646 84588 324412 166957 -73335 125313 37766 -75124 259130 364211 158300
12488A62834C9112J24762a32256o2758C35163D9922J6965J3363k1645b87929g5100
$$ 162834 39112 163874 -132256 -195014 335163 49922 66887 80250 58605 -287929 -75100
12476A80508a44654j22173A29149f2142B9975d9370n8409e3712B15565J352C5867
$$ 180508 -144654 -266827 129149 -62142 29975 -49370 -107779 -53712 215565 216917 35867
12464a21567L4251A12998h4020k99633j3517F8930K09100A36180D8810b44181
$$ -121567 -87316 112998 -84020 -383653 -397170 68930 278030 136180 48810 -244181
12453f4136H7521d20236B02601e0714A56787a40868B4490J71717i7904A85450
$$ -64136 87521 -420236 202601 -50714 156787 -140868 24490 196207 -97904 185450
12442a74268E3102k1511b8258F912J58473M8473d0836C30807a02038L0195l64528
$$ -174268 53102 31591 -28258 6912 165385 213858 -40836 330807 -102038 -71843 -436371
12431d36371i3424M6419B1741J11947a84089A10337K65721a36988j39805B66202
$$ -436371 -93424 -47005 21741 133688 -184089 110337 376058 -136988 -276793 266202
12420a32259C68311a33109l0101c5783A08225K68267G8312J61156E7219g4058
$$ -132259 368311 -133109 -163210 -35783 108225 376492 78312 239468 57219 -74058
12409c10817a0032B6081b09740A13040N3712h354k85229J34783d1455J354A71972
$$ -310817 -10032 26081 -209740 113040 166752 -8354 -293583 -158800 -41455 -40101 171972
12397B52568g3299j89697C2087g8585C5624a08284j97885a1518B1J20889J26994
$$ 252568 -73299 -262996 32087 -78585 35624 -108284 -306169 -11518 21 120910 247904
12386B47904N6859b79157G8417J30290p608e0176A23940b37082A11720j7827J81321
$$ 247904 304763 -279157 78417 208707 201099 -50176 123940 -237082 111720 93893 275214
12375B75214r1235a60021c285B51075d89677A58819F1958a62905H7486b51280
$$ 275214 183979 -160021 -3285 251075 -489677 158819 61958 -162905 87486 -251280
12364c53985I1389D480a08200c9704o7502B52447D807c2391k01942i4187c6572
$$ -353985 91389 4480 -108200 -39704 -107206 252447 4807 -32391 -234333 -94187 -36572
12352B41582C3003g9425E97075k28910A65340R7943a85859d2102A18804b82528
$$ 241582 33003 -79425 597075 368165 165340 263283 -185859 -42102 118804 -282528
12341a9248k4474A9994L07764A57805b2068m2496F4331b0457A92993I2015f8858
$$ -19248 -43722 19994 327758 157805 -22068 -64564 64331 -20457 192993 92015 -68858
12329b34853n3911H4835b69747i3214A02684D4884N66600C04000m6208a55456
$$ -234853 -288764 84835 -269747 -93214 102684 44884 611484 304000 257792 -155456
12318b59167I7892L6728m6207c71873e2119k61126e362A84098f5084b0138k97755
$$ -259167 97892 134620 88413 -371873 -52119 -313245 -5362 184098 -65084 -20138 -317893
12307c17893e4537B8390a23460F2408J3879a95789a4673F2303J30733a57355g531
$$ -317893 -54537 28390 -123460 62408 76287 -195789 -14673 62303 193036 -157355 -7531
12295c3892j76647N9019f411k76977B48434B9224R9441c5009i040l15888A90965
$$ -33892 -210539 -151520 -6411 -283388 248434 29224 128665 -35009 -9040 -324928 190965
12283a61335C6985K27947f7443K8695E641J44837a47043I1098d0111A30830L13754
$$ -161335 36985 264932 -67443 -38748 5641 150478 -147043 91098 -40111 130830 444584
12272D44584K3805A48997Q7415A8021J10385L05207F2650Q604b89109A45563Q5647
$$ 444584 468389 148997 236412 18021 128406 433613 62650 71254 -289109 145563 231210
12261B31210A360J8908N02822H881K78433b2370p4625A77937O678A7719K37033
$$ 231210 1360 20268 523090 8881 287314 -22370 -96995 177937 184615 17719 254752
12250B54752b32113B88072C2974P5946R8319m3984c9027p7106F7675J35943q5471
$$ 254752 -232113 288072 32974 108920 207239 163255 -39027 -116133 67675 203618 118147
12239A18147J11637d3899A30623D7749a80288P0069a3359D70816B01737J36579
$$ 118147 229784 -43899 130623 47749 -180288 -110219 -13359 470816 201737 338316
12229C38316A64844e9736A01943J94324q0272j0208Q8792J95123I4314J01973
$$ 338316 164844 -59736 101943 296267 215995 205787 294579 489702 94314 196287
12219A96287J04778n5894j14235K7132J15650N9037h3909C31344F0182c4529C15439
$$ 196287 301065 245171 130936 158068 273718 332755 -83909 331344 60182 -34529 315439
12207C08568j32907a70126A71653J013a44978b6346D53061A74136f134B56070
$$ 308568 175661 -170126 171653 172666 -144978 -26346 453061 174136 -6134 256070
12196A20450K10112H0631R7438M8928J24029c7443A63632b7079B145a36691d4819
$$ 120450 330562 80631 178069 226997 351026 -37443 163632 -27079 2145 -136691 -44819
12184A54780J1204l9773j9349K22921j26718m8644P3562L00573B46507G8025M36560
$$ 154780 165984 126211 106862 329783 203065 154421 227983 528556 246507 78025 514585
12173E14585A85026c4065B6178Q8791J5410b15381D50116a57967C9361L2841L7543
$$ 514585 185026 -34065 26178 114969 130379 -215381 450116 -157967 39361 72202 109745
12162A09745C3565L47680B2612a25715k04176c0313A52328n6187a95253H9738
$$ 109745 33565 381245 22612 -125715 -329891 -30313 152328 96141 -195253 89738
12151c910C31222i8190L6974B52040c34972G2104L52105e0201A43963b9400A3451
$$ -3910 331222 -98190 -61216 252040 -334972 72104 424209 -50201 143963 -29400 13451
12139D7518h6217p0973A68916K10176e8812l09605J58526B85893q1188e4109j09229
$$ 47518 -86217 -157190 168916 379092 -58812 -368417 -209891 285893 204705 -54109 -163338
12128a63338a9229F0802d3738A16494d16843A75967J94340j47253b1987k51424
$$ -163338 -19229 60802 -43738 116494 -416843 175967 370307 223054 -21987 -273411
12118b73411A22462c64179B61868a03706A32360D7997k3350e048l16336A37173
$$ -273411 122462 -364179 261868 -103706 132360 47997 24647 -5048 -321384 137173
12107a55988g0431B26434H2746J09116b17403Q3600C9151b54003B20195i9072
$$ -155988 -70431 226434 82746 191862 -217403 -133803 39151 -254003 220195 -99072
12096a96463B12941G1359a32998A5884a43536A51795i008A48928N1409b72790
$$ -196463 212941 71359 -132998 15884 -143536 151795 -9008 148928 200337 -272790
12085b8303n2257B74154H4920a61661d7511Q068j37969l4466l3334D18874b63889
$$ -28303 -80560 274154 84920 -161661 -47511 -39443 -177412 -211878 -245212 418874 -263889
12073F7752A0J58842o6412J18050M03959J008250K4543E04366A69100p769K18041
$$ 67752 10 158852 92440 210490 614449 1622699 1647242 504366 169100 161331 379372
12062C79372G6624A5069c61317A30733a18723c5553H6388d9880J7644A32066a93660
$$ 379372 76624 15069 -361317 130733 -118723 -35553 86388 -49880 -32236 132066 -193660
12050f4856k2935C3721J57109a67134j87174a66248I2631a20532H2964Q9745A3277
$$ -64856 -87791 33721 190830 -167134 -354308 -166248 92631 -120532 82964 172709 13277
12038g3159k8757I7708K81830C7015a12273d8472j90171E7969a32537a8591j49833
$$ -73159 -101916 97708 379538 37015 -112273 -48472 -238643 57969 -132537 -18591 -168424
12027a68424G7657G594R7190a29982A37336l6247c38842e6594k692C97542j64540
$$ -168424 77657 7594 104784 -129982 137336 101089 -338842 -56594 -59286 397542 233002
12016B33002q0672E4449a1503G6794c77272C14010k5742F2092B7690K3180a18740
$$ 233002 152330 54449 -11503 76794 -377272 314010 288268 62092 27690 50870 -118740
12004e1258j68971i8689A94868r2325J69007a23603d763D0015a53179A71792K1799
$$ -51258 -220229 -98689 194868 102543 271550 -123603 -4763 40015 -153179 171792 193591
11993A93591b9241E0321a93566K0158N9381d7240B81758G9849A3157J82062b03492
$$ 193591 -29241 50321 -193566 -173408 -114027 -47240 281758 79849 13157 195219 -203492
11981e2069a2701k07983B08736D2644a22731G5990C0699e094r0660A54607J4409
$$ -52069 -12701 -220684 208736 42644 -122731 75990 30699 -5094 -95754 154607 169016
11970A69016b34389c9569B0570q321h4631B37139d207B517b24940A63141M7614
$$ 169016 -234389 -39569 20570 12249 -84631 237139 -4207 2517 -224940 163141 210755
11959B10755a1435A18707C765K50116o1833a41804m1763e2600B77842j03079K07787
$$ 210755 -11435 118707 3765 253881 192048 -141804 -183567 -52600 277842 174763 382550
11948C82550i5144k7643l03994a75535P2578j99798f5482J0606A55226E9199K2437
$$ 382550 -95144 -122787 -426781 -175535 -102957 -302755 -65482 -54876 155226 59199 81636
11937H1636a024A1029J10985J16571f6413k54181a55374f7571j13192I2127a62409
$$ 81636 -1024 11029 122014 238585 -66413 -320594 -155374 -67571 -180763 92127 -162409
11925a4399k20557o7953A04492a59644B08901F6985J82281I9409k6948b6911k16665
$$ -14399 -234956 -302909 104492 -159644 208901 66985 249266 99409 72461 -26911 -243576
11914b43576K4053C81c74748B2432g400A88260D8451b32468K4763m4251a2283
$$ -243576 -219523 381 -374748 22432 -7400 188260 48451 -232468 -207705 -251956 -12283
11902B25136a5089H5695C1329O7025J010j0715J49209j2396Q7224d9187G1948
$$ 225136 -15089 85695 31329 98354 99364 88649 237858 225462 312686 -49187 71948
11890b40901A00378C2505h8885o419E7620J0142R17J34500a17734I171a73436
$$ -240901 100378 32505 -88885 -95304 57620 67762 68679 203179 -117734 9171 -173436
11878a22234J9537H3504O2728a86729a426B7775K1385a57428E6457c18135J10396
$$ -122234 -102697 83504 146232 -186729 -1426 27775 49160 -157428 56457 -318135 -207739
11867b07739q880P0736O3512F0243a46510n8928B66118a82508A12862a30782o683
$$ -207739 -216619 -145883 -82371 60243 -146510 -205438 266118 -182508 112862 -130782 -137465
11856a37465C9068a9119n6427F8085O3770f7675j01301k13068J82303b3332d167
$$ -137465 39068 -19119 -75546 68085 131855 -67675 -168976 -382044 -199741 -23332 -4167
11844A96459k8390Q2156i6461M4201m1485q1780C0454a01410E0788d46254a62349
$$ 196459 168069 250225 -96461 -52260 -93745 -175525 30454 -101410 50788 -446254 -162349
11832D59572c41980C53812F0219i1536A88461a432I9403b06142O5905c9485n9311
$$ 459572 -341980 353812 60219 -91536 188461 -1432 99403 -206142 -140237 -39485 -98796
11821i8796c0203A3750i6423j80414A06176a08848A7234a25797c8565E5289f3683
$$ -98796 -30203 13750 -96423 -276837 106176 -108848 17234 -125797 -38565 55289 -63683
11809C8879L0585A8078J21100B5973J29131E1442a91391f1810F9986b4436j76813
$$ 38879 69464 18078 139178 25973 155104 51442 -191391 -61810 69986 -24436 -201249
11798b01249A06985D012L23577A7946g992l0572C71581b82259a5877k25311J02892
$$ -201249 106985 4012 327589 17946 -7992 -38564 371581 -282259 -15877 -241188 -138296
11787a38296C23447b06881k07163A33563b01083g4531k9447k49431A78357n1858
$$ -138296 323447 -206881 -414044 133563 -201083 -74531 -103978 -353409 178357 126499
11777A26499J71164A46076c15830A91377B448e45376d5613j11963d8035j35495
$$ 126499 297663 146076 -315830 191377 2448 -545376 -45613 -157576 -48035 -183530
11767a83530M0930D1038J67345I8913c5868f202k54144H3503L5813h9371B07623
$$ -183530 -142600 41038 208383 98913 -35868 -6202 -260346 83503 119316 -89371 207623
11755A29636n7887J69568a21069k1790G4916j0977J2484K62684a16722d6127J4206
$$ 129636 71749 241317 -121069 -142859 74916 63939 76423 339107 -116722 -46127 -31921
11744c1921j6504C8210G612J98768a57365G7972l0587J60974f153A99606a31874
$$ -31921 -48425 38210 7612 206380 -157365 77972 47385 208359 -6153 199606 -131874
11732I9641a72282C73536c64331C86585A59962a1170C9156b9577C8500a05956
$$ 99641 -172282 373536 -364331 386585 159962 -11170 39156 -29577 38500 -105956
11721C59353C4299e9804K5529q8436D5770J62615C5234a32952A9930a4487j81120
$$ 359353 34299 -59804 -34275 -122711 45770 208385 35234 -132952 19930 -14487 -195607
11710a95607D832a6370A87085g1671G4087e626B13137J02019q1383j7139i5052
$$ -195607 4832 -16370 187085 -71671 74087 -5626 213137 315156 233773 216634 -95052
11698a15728c248A21542A742h3487B91340k4554i8515A46181N1088A6341a43537
$$ -115728 -3248 121542 1742 -83487 291340 266786 -98515 146181 197269 16341 -143537
11686b23822A27706a7066l83548a60528C4543j1177b99514B7626K57L93589d706
$$ -223822 127706 -17066 -400614 -160528 34543 23366 -299514 27626 27883 421472 -4706
11674f7268Q189A00768j2466C1378J07601g0035B2360b6786A31488K39229q4240
$$ -67268 -59079 100768 88302 31378 138979 -70035 22360 -26786 131488 370717 286477
11663B86477K652n4852N5664a0638o5879A10807i1200B91985j07181G7694B6409
$$ 286477 289129 234277 289941 -10638 -76517 110807 -91200 291985 184804 77694 26409
11651d7818A06002L63l7664a01534D6019E688f9440C776d24314C06629a35487
$$ -47818 106002 106365 68701 -101534 46019 5688 -69440 3776 -424314 306629 -135487
11639a09519G6633f574o700r5147j3512e308r4657L863B10702c5210A43915d7096
$$ -109519 76633 -6574 -13274 -108421 -121933 -5308 -99965 -96102 210702 -35210 143915 -47096
11626a48833J2639M4908C22786b85760F2193N6102J3854J47862O7122d17831C1239
$$ -148833 -136194 -91286 322786 -285760 62193 118295 132149 280011 347133 -417831 31239
11614d7240b0071C95276a9095j63201B56126F9590R9055K8265K1735M7103G5007
$$ -47240 -20071 395276 -19095 -182296 256126 69590 168645 196910 218645 265748 75007
11602a02828K0649j93252P1123B17769K8116D9493f5642K8172D9032e0785j82041
$$ -102828 -82179 -275431 -204308 217769 245885 49493 -65642 -37470 49032 -50785 -232826
11591b32826b3255B88380L9136f9622B44459A00602R0444m2492o4945J86023j13880
$$ -232826 -23255 288380 327516 -69622 244459 100602 191046 148554 83609 269632 155752
11580A55752G5005J96788j8367C8147J80260G8796L43093A74151n783a08249A16166
$$ 155752 75005 271793 253426 38147 218407 78796 421889 174151 168368 -108249 116166
11568a03836D07498A45828D003K02940J10229D9378a34830d5733E5141L0498M0533
$$ -103836 407498 145828 4003 206943 317172 49378 -134830 -45733 55141 85639 126172
11557A26172C2473K49247D1541b99831c8812B8925a8194n0677I0454a28595N1399
$$ 126172 32473 281720 41541 -299831 -38812 28925 -18194 -68871 90454 -128595 -77196
11546g7196k20138I663k343M64328q2054A42436K38261a6284m1790C33569A39513
$$ -77196 -297334 9663 7320 471648 389594 142436 380697 -16284 -58074 333569 139513
11534e6719C31778F7050K5092N0699J6305J73987j21464n4805J90761h0101B32559
$$ -56719 331778 67050 92142 142841 159146 333133 211669 156864 347625 -80101 232559
11522C5436h8758B03074p2192a09787c4832o4981h771G0295L19028A77367C6073
$$ 35436 -88758 203074 130882 -109787 -34832 -99813 -8771 70295 389323 177367 36073
11510D2299R4362a68454C13192j39542L51732A37518J51937A33738b0708B68123
$$ 42299 136661 -168454 313192 173650 525382 137518 289455 133738 -20708 268123
11499A10388d981A88494f0597B85087H5358K32881A08452a49473A42745J46497
$$ 110388 -4981 188494 -60597 285087 85358 318239 108452 -149473 142745 289242
11489B89242p5819m770d7085A21325d9210C46426j52652J15548I1599M32441D2797
$$ 289242 213423 208653 -47085 121325 -49210 346426 193774 309322 91599 524040 42797
11477D4831K30732D9283K62341F9616a0521E8483a82398F1183J62509a29149I8847
$$ 44831 275563 49283 311624 69616 -10521 58483 -182398 61183 223692 -129149 98847
11465C31951L9937A07149P4595l3586c81820A94023L11610a48702B0455O306L78715
$$ 331951 371888 107149 181744 148158 -381820 194023 505633 -148702 20455 26761 405476
11454D05476A8488L17123C1980J10637k2344c6011A07861a74033G7533K6598l8128
$$ 405476 18488 335611 31980 142617 120273 -36011 107861 -174033 77533 104131 66003
11443F6003k164P4824P498L299R6741j5822J10002b06123B90498A172J51156O8495
$$ 66003 63839 138663 146161 149460 246201 230379 340381 -206123 290498 1172 152328 220823
11431B20823I1223k0244a33296B2409K55075J00926H2738A1460a29288b5325B09400
$$ 220823 91223 70979 -133296 22409 277484 378410 82738 11460 -129288 -25325 209400
11419B67354A206d8719B60316b42804G9628K968C8905j4950K28917C9145a92172
$$ 267354 1206 -48719 260316 -242804 79628 82596 38905 23955 252872 39145 -192172
11407A3068J44418O2462i1225H4842A2558J43786F383K73321G2056J09684b07266
$$ 13068 157486 219948 -91225 84842 12558 156344 6383 279704 72056 181740 -207266
11395C23059C7367P4640P9403J836p6592a56091D7576g6812l29897J3404E2288
$$ 323059 37367 112007 191410 193246 116654 -156091 47576 -76812 -406709 -393305 52288
11383C15222b49444A09888b49365B14156a93543a7224m6210j37984A84656b6055
$$ 315222 -249444 109888 -249365 214156 -193543 -17224 -63434 -201418 184656 -26055
11372C68289A46092a19421D6911K9299I854a13033N2739D5057j7106h2513j30718
$$ 368289 146092 -119421 46911 76210 9854 -113033 -60294 45057 27951 -82513 -213231
11361b13231K4773A00242b01018E3098h9426B57016e2310D54274a35858A06435
$$ -213231 -188458 100242 -201018 53098 -89426 257016 -52310 454274 -135858 106435
11350A82701j32M2082j06004c1297F8946a03461B29696A0581J26769i3002k27450
$$ 182701 182569 224651 118647 -31297 68946 -103461 229696 10581 137350 -93002 -320452
11339c20452J35289B33018o2340b30579J12538e3628E2967K8211K10985h5925
$$ -320452 -185163 233018 170678 -230579 -118041 -53628 52967 81178 292163 -85925
11328B70626a06783j57510H1181C8268N1124F689K02302g0057n6999o9824A01241
$$ 270626 -106783 -264293 81181 38268 89392 6689 208991 -70057 -127056 -196880 101241
11316b70338b4590A32423N1124l2430b49639B09153o2011a92120Q5243j16557
$$ -270338 -24590 132423 183547 151117 -249639 209153 147142 -192120 -106877 -223434
11306b23434a5771k6010l107k2494l7543A22935b4765m4307G6206a40426B4097
$$ -223434 -15771 -41781 -44888 -67382 -104925 122935 -24765 -69072 76206 -140426 24097
11294a42098j30780E9673R5278F3525A9504J9979L2335l0784O2465b45156P0975
$$ -142098 -272878 59673 154951 63525 19504 39483 71818 41034 103499 -245156 -174181
11283a74181q9592B2473b78086C787J61417J2679a02223k48574I1094b15303p900
$$ -174181 -263773 22473 -278086 3787 165204 177883 -102223 -350797 91094 -215303 -223203
11272b23203b2334A30786a58142E988g5181k90111e6257k53354i2558m0209I3379
$$ -223203 -22334 130786 -158142 5988 -75181 -365292 -56257 -309611 -92558 -132767 93379
11260C67783a26510D6262J60606m7101c47862a14703b5414A66672b07036A0353
$$ 367783 -126510 46262 206868 159767 -347862 -114703 -25414 166672 -207036 10353
11249a91323E0406h0869n3725I0633a67972E2413K08311i0687K3268j2525j5421
$$ -191323 50406 -80869 -134594 90633 -167972 52413 260724 -90687 -67419 -79944 -95365
11238i5365A61560A4974b17282A09015C6059b54375H5559a02947D2176a5466k07056
$$ -95365 161560 14974 -217282 109015 36059 -254375 85559 -102947 42176 -15466 -222522
11227b22522Q2102k16487d0932B14779e960A24990l1713a41509A1542g9481b1982
$$ -222522 -140420 -356907 -40932 214779 -5960 124990 93277 -141509 11542 -79481 -21982
11215A35954E8006J02958d4696k67824J20550A69207C2677d5350A11821h5347
$$ 135954 58006 160964 -44696 -312520 -191970 169207 32677 -45350 111821 -85347
11204A91290e4000q8919k5022j6387A374K42224a94533d3950A3448b69175c4721
$$ 191290 -54000 -142919 -167941 -184328 1374 243598 -194533 -43950 13448 -269175 -34721
11192B73374E641a55101K0429o5775N4486L5067B12440G4638a84759f3917j8246
$$ 273374 5641 -155101 -134672 -200447 -145961 -110894 212440 74638 -184759 -63917 -82163
11181h2163m1742a9939I5155b8805A78865i2034B7420H792b90341a8781M834l45600
$$ -82163 -123905 -19939 95155 -28805 178865 -92034 27420 8792 -290341 -18781 -13947 -359547
11169c59547B04778O831F2247b68540B1120K9270b54018N1591C9525b37756a9609
$$ -359547 204778 211609 62247 -268540 21120 50390 -254018 -202427 39525 -237756 -19609
11157a07952I7965b46567A16986g2292J7821A65267D1264M1354R089b2936j55021
$$ -107952 97965 -246567 116986 -72292 -54471 165267 41264 82618 91707 -22936 -177957
11146a77957G625d0569j60777B27338f2846b8402n7749I2745c7462r8975B03290
$$ -177957 7625 -40569 -201346 227338 -62846 -28402 -86151 92745 -37462 -136437 203290
11134b57750J28675A21017i2894A30508m470a30011A09581O4029i6457j40447
$$ -257750 -129075 121017 -92894 130508 126038 -130011 109581 173610 -96457 -236904
11124b36904f1795l4986l53135G7190c4109A75232a09518C72143q933A6212L42506
$$ -236904 -61795 -96781 -449916 77190 -34109 175232 -109518 372143 363210 16212 358718
11113C58718A65060d4418C80482d7663B76687L9925J70554A91922a38518A87283
$$ 358718 165060 -44418 380482 -47663 276687 316612 487166 191922 -138518 187283
11102B45139C7655a05078q9265B59551r6407J56251a2402A94160J51497J7792
$$ 245139 37655 -105078 -194343 259551 163144 319395 -12402 194160 345657 363449
11092C63449I8093J10563D8053K87856j9553A7744K40202I2229a15942a8113A40335
$$ 363449 98093 208656 48053 335909 316356 17744 257946 92229 -115942 -18113 140335
11080C26653q1984a27684C2383N76669F0969N5662K85899A70552M9730l27K58811
$$ 326653 244669 -127684 32383 609052 60969 116631 402530 170552 220282 219955 478766
11069D78766r2724r4438Q1742J39235R490A84563O39684C36729L38066j30822
$$ 478766 386042 291604 373346 512581 522071 184563 824247 336729 674795 543973
11059E43973J6792r9668J52701J07214r7680K80687k75340Q49J37662j15084K66625
$$ 543973 560765 461097 613798 721012 623332 904019 628679 629528 767190 652106 918731
11048I18731k37289K2888j79059L99857J60884l29560M13474l88711k374k05054
$$ 918731 681442 704330 525271 925128 1086012 756452 1169926 781215 778841 573787
11038E73787P0528J70397p4059j44348k7485J84527j2453l51467O34068j52521
$$ 573787 644315 814712 740653 596305 568820 753347 740894 389427 1023495 870974
11028H70974l53636J75480R7878M0044J83642l01424L62100D46368K9639J86193
$$ 870974 517338 692818 790696 830740 1014382 712958 1075058 446368 476007 662200
11018F62200K28586l31948Q8001J54613j63266j21202J07931Q0712k55591K04056
$$ 662200 890786 558838 646839 801452 638186 516984 624915 705627 450036 654092
11008F54092j35585J29448M9144l5613n8298J93587n2991l3289k066j0368L6114
$$ 654092 518507 647955 697099 661486 603188 796775 743784 710495 708429 698061 734175
10997G34175j42734J2612k01657M68037k02441M8112L12564D11556K71829L04353
$$ 734175 591441 604053 402396 870433 667992 716104 1028668 411556 683385 987738
10987I87738M0052M58098l98300O3188r5532K07798K57747l85818J91354K33322
$$ 987738 1027790 1485888 1087588 1150776 1055244 1263042 1520789 1134971 1326325 1559647
10977A559647K11883J70037N39383M29335j91757O10053m62474M25547j66457
$$ 1559647 1771530 1941567 2480950 2910285 2718528 3328581 2866107 3291654 3125197
10968C125197k2293n74951o4095l11869k17406j61754J26301L8898O3119n0329
$$ 3125197 3102904 2527953 2463858 2151989 1934583 1772829 1899130 1938028 2001147 1950818
10958A950818K34898l02887J3035K18791k5922m50070o8442n30299L51320m88799
$$ 1950818 2185716 1882829 1895864 2114655 2088733 1638663 1570221 1039922 1391242 902443
10948I02443j18926k89706A92852O1917H5807K98713m9013A15448K00671E4140
$$ 902443 783517 493811 192852 254769 85807 384520 335507 115448 316119 54140
10937C37283H0342A671K22737j08634m2874R8863k1645D41i2300A41739j3889
$$ 337283 80342 1671 224408 115774 72900 171763 150118 441 -92300 141739 127850
10926A27850J07981p7467K05642I1810j6578a4309A40457J04595I937a62646A29215
$$ 127850 235831 158364 364006 91810 75232 -14309 140457 245052 9937 -162646 129215
10914A32677L2681E7338k7669Q1435c78195E36593a30703B10070p4808f2019a1760
$$ 132677 165358 57338 29669 111104 -378195 536593 -130703 210070 135262 -62019 -11760
10902A42454D2645L0723b71827A28448D0290b45222g1924j32810A81482g2610
$$ 142454 42645 73368 -271827 128448 40290 -245222 -71924 -204734 181482 -72610
10891A69056a12656B30051a50433C6183K13402b28181A37309a00231M4597o99
$$ 169056 -112656 230051 -150433 36183 249585 -228181 137309 -100231 -55634 -56333
10881e6333G7793c7092k3573j72396A40306B9097J58301b55699m9763l5948B4028
$$ -56333 77793 -37092 -60665 -233061 140306 29097 187398 -255699 -305462 -341410 24028
10869b81056P8153p8381G7166f1610F532b96015a02353B0660J78930E960g7777
$$ -281056 -202903 -281284 77166 -61610 6532 -296015 -102353 20660 199590 5960 -77777
10857A0586b86528G7517J03028o1067M9725a05917B90396c42229C0190M1494J08790
$$ 10586 -286528 77517 180545 119478 169203 -105917 290396 -342229 30190 71684 180474
10846A80474M9715c7337k0945g402j2087j63896M8695A97209a52120k46669i232
$$ 180474 230189 -37337 -58282 -7402 -19489 -183385 -134690 197209 -152120 -398789 -9232
10834c58006D7520b44141B00635e7239E8370a49495A28198c0005G1925d9217K0159
$$ -358006 47520 -244141 200635 -57239 58370 -149495 128198 -30005 71925 -49217 -29058
10823b9058k7922D2450b23395c823A93679b024l26096J61214h1703q4975A76799
$$ -29058 -56980 42450 -223395 -3823 193679 -2024 -328120 -166906 -81703 -166678 176799
10811h8593b9021k169k5408I3751A9104O5975M42135B61420j19157a2294l70650
$$ -88593 -29021 -31190 -56598 93751 19104 85079 527214 261420 142263 -12294 -382944
10800c82944d0840F483a03513P504C04452E2978d3949B9951L58846D6118b22584
$$ -382944 -40840 6483 -103513 -96009 304452 52978 -43949 29951 388797 46118 -222584
10788a0626C83934c6755A47871f7379k13205d7148A22779a60788a9439r5320l0196
$$ -10626 383934 -36755 147871 -67379 -280584 -47148 122779 -160788 -19439 -114759 -144955
10777a44955B25242b88157M6218b8298A93867d5657j70788c2961B89110a35725
$$ -144955 225242 -288157 -241939 -28298 193867 -45657 -216445 -32961 289110 -135725
10766a45988A73278H3232J56330D5270a14955F6602a84926k7398R5757A75195
$$ -145988 173278 83232 239562 45270 -114955 66602 -184926 -212324 -116567 175195
10755A52076E7388a17435d334j54772j05885A40239c2213R558j06050C869a00521
$$ 152076 57388 -117435 -4334 -159106 -264991 140239 -32213 -22655 -128705 3869 -100521
10743H8704J0933M9582a54921C7363J88843a01794A7712J03206M1882a14867k82662
$$ 88704 99637 149219 -154921 37363 226206 -101794 17712 120918 162800 -114867 -397529
10732c97529J50265A67551h9421B76775d7392l3116j75714g0759G2099e2276B851
$$ -397529 -247264 167551 -89421 276775 -47392 -80508 -256222 -70759 72099 -52276 2851
10720a53825j1231b858A29458c3853o1434j18772A2682g3265j5193E7728b9780
$$ -153825 -165056 -2858 129458 -33853 -95287 -214059 12682 -73265 -88458 57728 -29780
10708H2479b38055G2804g8217l11467B78936a50454K061P2124j1023C43392A61468
$$ 82479 -238055 72804 -78217 -389684 278936 -150454 -148393 -76269 -87292 343392 161468
10696C1926a03380D48326a51166E080a10400b5507C51702a98240A60099c3605
$$ 31926 -103380 448326 -151166 5080 -110400 -25507 351702 -198240 160099 -33605
10685f9666a5961q2362A20092b30918k16831E0571f2486a2855A18137K0029a88470
$$ -69666 -15961 -98323 120092 -230918 -447749 50571 -62486 -12855 118137 138166 -188470
10673D3500M1336a62188H2189N8564B1111h4825k9114A25558c4268j34074G6614
$$ 43500 84836 -162188 82189 140753 21111 -84825 -113939 125558 -34268 -168342 76614
10661a63308l5385h5928A23586b50622P229K7969b2939A4160b89628R1679A30290
$$ -163308 -198693 -85928 123586 -250622 -243393 -215424 -22939 14160 -289628 -197949 130290
10649B8845N6637J06076a67129E6839B6617a630A27750C6534a36524A61211a23537
$$ 28845 85482 191558 -167129 56839 26617 -1630 127750 36534 -136524 161211 -123537
10637a38591r1083A2986i8874i335E5503d83611A22306a01402k8844E891d12738
$$ -138591 -229674 12986 -98874 -9335 55503 -483611 122306 -101402 -130246 5891 -412738
10625C55480a18559A99308f4208j21029D5476g0965J931A14927b68863E7389L01862
$$ 355480 -118559 199308 -64208 -185237 45476 -70965 -69034 114927 -268863 57389 359251
10614C59251j41757a70064o1757h8366r8744o199j38526J60594d9289j9861A3975
$$ 359251 217494 -170064 -231821 -88366 -187110 -193309 -331835 -171241 -49289 -69150 13975
10602a39410A78604e1636k72841E9545J58519G9845b58037C03937o3094a93969
$$ -139410 178604 -51636 -324477 59545 218064 79845 -258037 303937 240843 -193969
10591b98440E4305b36527J05383K6113D0150b28242e9948a0902j55124r2617N2912
$$ -298440 54305 -236527 -131144 -105031 40150 -228242 -59948 -10902 -166026 -258643 -205731
10580b05731j00919B8183j1219a43443M6596A07232K7754m220c81020A08506a71723
$$ -205731 -306650 28183 16964 -143443 -96847 107232 134986 130766 -381020 108506 -171723
10568D6195a60465b6890G6035R27K78497f46539K43135H2847A020b90651e1484
$$ 46195 -160465 -26890 76035 76962 355459 -646539 -403404 82847 1020 -290651 -51484
10556C64656c0084r5999k1706D8144g9729A38305a91670A24485J93452j47581
$$ 364656 -30084 -126083 -147789 48144 -79729 138305 -191670 124485 317937 170356
10546A70356A2251c25509A44137D5149c19202f9891B40272b5202l49012a56305
$$ 170356 12251 -325509 144137 45149 -319202 -69891 240272 -25202 -374214 -156305
10535a40279f7363l6560c0234E6556b52620h7903C20573a84962C15415h7348L4562
$$ -140279 -67363 -103923 -30234 56556 -252620 -87903 320573 -184962 315415 -87348 -52786
10524e2786q5584C0577J1157c79233B89794A29037a70483Q3304l7873B01919C0491
$$ -52786 -138370 30577 41734 -379233 289794 129037 -170483 -87179 -125052 201919 30491
10512b9681l00936G4967a06385F3014N6435J8908b50075D6322g7738A13371a78656
$$ -29681 -330617 74967 -106385 63014 119449 138357 -250075 46322 -77738 113371 -178656
10500b24601C2528Q4581Q6917g0770l7829a5745B20925E6325c50515J2452d006
$$ -224601 32528 117109 204026 -70770 -108599 -15745 220925 56325 -350515 -338063 -4006
10488a6181q4352B73667A16881J24267N6717K10957j5936L77661J5922l60233
$$ -16181 -100533 273667 116881 241148 297865 508822 492886 870547 886469 526236
10478E26236k60542k5487J04997i2260D1438b9201j0624B13319a21493A8742J45176
$$ 526236 265694 240207 345204 -92260 41438 -29201 -39825 213319 -121493 18742 163918
10467A63918N1813b815B87076b67609B6875N4114K2893D9889j2504J62142b7451
$$ 163918 215731 -2815 287076 -267609 26875 80989 103882 49889 37385 199527 -27451
10455i0689a811n1716B16142a52907H0483c25543A22552l5054c85630G1828a88693
$$ -90689 -1811 -53527 216142 -152907 80483 -325543 122552 87498 -385630 71828 -188693
10443b378j09937a972k6386p9159A53448c30611a1838q7620B8618b00105G8921
$$ -2378 -112315 -1972 -28358 -107517 153448 -330611 -11838 -99458 28618 -200105 78921
10431b56545N5055A54059D3587h9477F2670a30789B39366d94756K45347j07080
$$ -256545 -201490 154059 43587 -89477 62670 -130789 239366 -494756 -249409 -356489
10421c56489C8473a34882l2620c6563a5453F704P3588c9476B41672g4319k23831
$$ -356489 38473 -134882 -167502 -36563 -15453 6704 80292 -39476 241672 -74319 -298150
10410b98150J09896f508G7732d6866A79370b63819J0042F8250b22423L3594k8069
$$ -298150 -188254 -6508 77732 -46866 179370 -263819 -253777 68250 -222423 -188829 -216898
10399b16898B44448d46765C74507j68434D6143g3553n9082B51533r7426e5334
$$ -216898 244448 -446765 374507 206073 46143 -73553 -132635 251533 154107 -55334
10388g4377A74477G689K28660r7587a15450j38992A31384N8975o7220J71052b4682
$$ -74377 174477 7689 236349 138762 -115450 -254442 131384 190359 123139 294191 -24682
10376A75479J88075G3311J37113m1590E5727K44221a08341A63028L24901n2480
$$ 175479 363554 73311 210424 168834 55727 299948 -108341 163028 487929 435449
10366D35449j63751K90434p0880n0269J0899F3423K20654L404Q5312L7275n6499
$$ 435449 271698 562132 491252 440983 451882 63423 284077 287481 372793 410068 353569
10355C53569A63451F8735K58297A51349N44308m6196L3580j2586k14960F0515
$$ 353569 163451 68735 327032 151349 695657 649461 683041 670455 455495 60515
10344C22969J66996l7078o684k10015A04497L25101E6569l898h8836C38485E0547
$$ 322969 489965 452887 446203 236188 104497 429598 56569 52671 -88836 338485 50547
10332A57874J68939l7202i5069A39600j5063a55827A75875J7390H1390J35565
$$ 157874 326813 289611 -95069 139600 124537 -155827 175875 193265 81390 216955
10322B16955L57293B59540i1887I3876K07096F6864f379j90k57704A40048a29612
$$ 216955 574248 259540 -91887 93876 300972 66864 -6379 -6569 -264273 140048 -129612
10310A95476f2415J1777j80184n5142e779A15215b7013C02189j12207G3451N0055
$$ 195476 -62415 -50638 -230822 -285964 -5779 115215 -27013 302189 189982 73451 123506
10299A23506g7867r1156d6154K2939j18311I5590f2074C20769d0429r5609e0185
$$ 123506 -77867 -169023 -46154 -23215 -141526 95590 -62074 320769 -40429 -136038 -50185
10287E6685K42218D8723a09541D4719A7762d6304Q122A37071a1470j2260l46657
$$ 56685 298903 48723 -109541 44719 17762 -46304 -38182 137071 -11470 -23730 -370387
10276c70387D9234K98182b24491A15213c97020e8348b6404k53947d7934P082j5303
$$ -370387 49234 347416 -224491 115213 -397020 -58348 -26404 -280351 -47934 -40852 -56155
10265e6155E3872h7109C7761d4001D43673A56372K57991F45J44671K87430e8641
$$ -56155 53872 -87109 37761 -44001 443673 156372 414363 645 145316 432746 -58641
10253A45991B2631J6650a09997A31076a00635o0796A26277g9889H7299e0652A56971
$$ 145991 22631 39281 -109997 131076 -100635 -161431 126277 -79889 87299 -50652 156971
10241C2219a16859G9228b02949A36683K0913J20438a64198J0815N1567B47208
$$ 32219 -116859 79228 -202949 136683 157596 278034 -164198 -153383 -101816 247208
10230a5931r8359B24113a57312j88752a08682k19107J21941L8678E16a76014O6002
$$ -15931 -114290 224113 -157312 -346064 -108682 -327789 -205848 -167170 516 -176014 -110012
10219a10012A8328O8453a78386B03880H9931R330a65679A26668N6645g1753G3734
$$ -110012 18328 86781 -178386 203880 89931 99261 -165679 126668 183313 -71753 73734
10207h21o563k27064M4905F9327j4011b38049C5724O6286a69292M4675D0328b1412
$$ -821 -7384 -234448 -189543 69327 55316 -238049 35724 102010 -169292 -124617 40328 -21412
10194h7430D6433e0199k31886C9396O4226i7242B50071h7479a3220q7523G0381
$$ -87430 46433 -50199 -282085 39396 103622 -97242 250071 -87479 -13220 -100743 70381
10182E7136b78397k12361c9059A06756J92938a40520I7318c4775B04867p4460
$$ 57136 -278397 -490758 -39059 106756 299694 -140520 97318 -34775 204867 130407
10172A30407A3847d7469l94322C17595c22071B57437j15725B8098b32322f8551
$$ 130407 13847 -47469 -441791 317595 -322071 257437 141712 28098 -232322 -68551
10161h9863j64312A85241d0664n1161k1402n6740d4899j0419b5629E5003b13162
$$ -89863 -254175 185241 -40664 -91825 -113227 -169967 -44899 -55318 -25629 55003 -213162
10149C1954C82b38884L1450g4024p4062D0801a18616L2780j39398f7543o6114
$$ 31954 382 -238884 -207434 -74024 -148086 40801 -118616 -85836 -225234 -67543 -133657
10138a33657B3689d351k25081l9332k124a3634B3315J18308a3103A15936b07720
$$ -133657 23689 -4351 -229432 -268764 -270888 -13634 23315 141623 -13103 115936 -207720
10126B01170b4289P060A8743c234E6194K9910e74904a30537M7036C89921C017
$$ 201170 -24289 -17229 18743 -3234 56194 86104 -574904 -130537 -83501 389921 3017
10114A9950Q7606a94512B0142J05930b25742a01309d2183q8908n8531N3957k4535
$$ 19950 107556 -194512 20142 126072 -225742 -101309 -42183 -131091 -189622 -135665 -160200
10103a60200J0327A96771k1921c02553L6709b6299j81654N250G5420l7434b44741
$$ -160200 -149873 196771 174850 -302553 -265844 -26299 -207953 -202703 75420 37986 -244741
10091I2938b74231l0798J44546j28756B1014a05646o514k240b9009q2677F4317
$$ 92938 -274231 -305029 -160483 -289239 21014 -105646 -112160 -114400 -29009 -111686 64317
10079A64522M4320b38898a0546j35901e7984k15632b7605H8705C5186J89165a77985
$$ 164522 208842 -238898 -10546 -146447 -57984 -273616 -27605 88705 35186 224351 -177985
10067A66793d306B81861E6422a15558A8970c1179a3479B3106R1680J21138I3194
$$ 166793 -4306 281861 56422 -115558 18970 -31179 -13479 23106 114786 235924 93194
10055B17382i2616B41029a51252L7136L3733j89974p3899J20057E1545B421i087
$$ 217382 -92616 241029 -151252 -114116 -80383 -270357 -344256 -224199 51545 2421 -9087
10043a06750A46916a63378b7327j45426B29966a784l79363a57967K2850p6213
$$ -106750 146916 -163378 -27327 -172753 229966 -1784 -381147 -157967 -135117 -211330
10033b11330j5685k51251E5576k5725d38767a90420b0845j70990R1430k56A20050
$$ -211330 -227015 -478266 55576 29851 -438767 -190420 -20845 -191835 -100405 -100661 120050
10021b94245G5897B2716a48130j8812g9019a5316I9477J64175j26425a30155m7665
$$ -294245 75897 22716 -148130 -166942 -79019 -15316 99477 263652 137227 -130155 -177820
10010a77820C1874b61456A11051I568f2676a7030q3882d1191b0106A08823f669
$$ -177820 31874 -261456 111051 9568 -62676 -17030 -100912 -41191 -20106 108823 -6669
9998i4404H7914k7733A9008a85811j14484a00410D01514h6936b191n5027j5781
$$ -94404 87914 60181 19008 -185811 -300295 -100410 401514 -86936 -2191 -57218 -72999
9987g2999b2587q1268J399E1598K2426b35263A35361C4497b7858k89420A47083
$$ -72999 -22587 -103855 -102456 51598 74024 -235263 135361 34497 -27858 -317278 147083
9975b42482A80328a68317k15021J00783A00194b1304a0107m58523b24808l29523
$$ -242482 180328 -168317 -383338 -282555 100194 -21304 -10107 -468630 -224808 -554331
9965e54331a90339o3487O8038c7165j56026A08898e7244o6593d9383l0028j56469
$$ -554331 -190339 -253826 -185788 -37165 -193191 108898 -57244 -123837 -49383 -79411 -235880
9954b35880A61762a79662m8207j9785l5149A65904a38011E9393c72535A12314
$$ -235880 161762 -179662 -227869 -247654 -282803 165904 -138011 59393 -372535 112314
9943b3124k01724M4826j60248e738B32826B7659a73471Q0704j17045A16064J15946
$$ -23124 -224848 -180022 -340270 -5738 232826 27659 -173471 -92767 -209812 116064 232010
9932B32010F3694J43755m647q9159f8526I3107K91238a77479D970f3069B0332
$$ 232010 63694 207449 202802 113643 -68526 93107 384345 -177479 4970 -63069 20332
9920c52228D889h4184k45433A8940K8529p812i1303d0707F9316a07899J2043A84818
$$ -352228 4889 -84184 -329617 18940 47469 39657 -91303 -40707 69316 -107899 -95856 184818
9907a63950n5941D1820a27885K0089A35210D9157a96326f9437j18242C5697c9471
$$ -163950 -219891 41820 -127885 -107796 135210 49157 -196326 -69437 -187679 35697 -39471
9895D0747b1733p007j48889D1869a49725E420a04873k25229E4408a24194l6211
$$ 40747 -21733 -28740 -177629 41869 -149725 5420 -104873 -330102 54408 -124194 -160405
9884a60405H9500Q2923a32153C80922i0588p092E0604R7557a96857g6386A26148
$$ -160405 89500 172423 -132153 380922 -90588 -97680 50604 148161 -196857 -76386 126148
9872B044R0770J05669e5292p1779e7812B6304a53526q9781G1064K24594g9097
$$ 2044 92814 198483 -55292 -127071 -57812 26304 -153526 -243307 71064 295658 -79097
9860b55531N1607C40808A8502f1238k1258k537k285B39199c9575l3465l08226
$$ -255531 -203924 340808 18502 -61238 -82496 -85033 -87318 239199 -39575 -73040 -381266
9849c81266a64970C6869b72596H2888C4038a55292R790j76067O6655I8282K09371
$$ -381266 -164970 36869 -272596 82888 34038 -155292 -145502 -321569 -254914 98282 307653
9838C07653a46935D05352I8788G846K5096a3329B06997C3130c21175C61855b0492
$$ 307653 -146935 405352 98788 7846 32942 -13329 206997 33130 -321175 361855 -20492
9826b27053A23309d1021r7992j31764a32753J5360r7922R4991f970B18396b80754
$$ -227053 123309 -41021 -139013 -270777 -132753 -117393 -215315 -120324 -6970 218396 -280754
9814c60871J19706F937a37916A20400m7730k0052a37674r4391A78369h2913k6450
$$ -360871 -241165 6937 -137916 120400 72670 52618 -137674 -232065 178369 -82913 -109363
9803a09363M0762j68887a07941G7655e837K006l1765n8317d0250o5320j229j32306
$$ -109363 -68601 -237488 -107941 77655 -5837 -3831 -35596 -93913 -40250 -105570 -106799 -239105
9791b39105O3715C2450D044e60432a40807j01292d5261d162C3344Q9066a53105
$$ -239105 -175390 32450 4044 -560432 -140807 -242099 -45261 -4162 33344 122410 -153105
9779G6786J91075i2886c2095B1570a58962k196f5523C0665a56056c6697j32801
$$ 76786 267861 -92886 -32095 21570 -158962 -161158 -65523 30665 -156056 -36697 -169498
9768a69498l41271b43068A21868R2028A0460a39316A20319j7168L5147c31724
$$ -169498 -510769 -243068 121868 213896 10460 -139316 120319 103151 138298 -331724
9757d27344K05897I2066b05682A42179a65193d3053I4670f9829j5668k35764A92098
$$ -427344 -221447 92066 -205682 142179 -165193 -43053 94670 -69829 -85497 -321261 192098
9745b7399B00297a80758B5402L7055d2225k42321K6674N8962B31026b8528i517
$$ -27399 200297 -180758 25402 62457 -42225 -284546 -257872 -198910 231026 -28528 -9517
9733f6133l47809A78212b02258E5368M6381a02972j23674j3855p3351a19460l10213
$$ -66133 -413942 178212 -202258 55368 101749 -102972 -226646 -240501 -313852 -119460 -429673
9722d29673F432J5583b18730M2349Q6617m1085A48773c5051G2594h5924A48430
$$ -429673 6432 22015 -218730 -176381 -89764 -130849 148773 -35051 72594 -85924 148430
9710b00847Q3550n0299f7786J0273B18214G0091A4825d04611I5835J40096b0403
$$ -200847 -117297 -167596 -67786 -57513 218214 70091 14825 -404611 95835 235931 -20403
9698a80840h3873l62955a23369k55670D5114a94943D1888b41651B27424a47900
$$ -180840 -83873 -446828 -123369 -379039 45114 -194943 41888 -241651 227424 -147900
9687A07780e5876j45118R0182j41109a00111d6537H6043g3640l60805J85296B74931
$$ 107780 -55876 -200994 -110812 -251921 -100111 -46537 86043 -73640 -434445 -249149 274931
9675H0524A1141a85033K4127o8706b516j78739O4987k32848b389A6007K72760
$$ 80524 11141 -185033 -160906 -229612 -2516 -181255 -116268 -349116 -2389 16007 288767
9664B88767D4461j4298c7616q1930k85009B6728A2019c09785G2957C1279R8828
$$ 288767 44461 30163 -37616 -119546 -404555 26728 12019 -309785 72957 31279 130107
9653A30107a00678C10827G9202P6558b00003A67027f4902k0099B4251J42460b49065
$$ 130107 -100678 310827 79202 155760 -200003 167027 -64902 -85001 24251 166711 -249065
9641c72431J63650A56236C7027a30047j49836N0755A4401R8792b21789j14508
$$ -372431 -208781 156236 37027 -130047 -279883 -229128 14401 113193 -221789 -336297
9631c36297i0942A49095K7376b70158Q5246D3834j7616d6773B50132j16839b0419
$$ -336297 -90942 149095 176471 -270158 -184912 43834 26218 -46773 250132 133293 -20419
9619c97631a58944g2676q302k09115A91075a08907A46028a68759g3346k02278
$$ -397631 -158944 -72676 -80978 -290093 191075 -108907 146028 -168759 -73346 -275624
9609b75624L0887d6253j3265J4937c012C49305A64128c21625c1517j19894A50633
$$ -275624 -244737 -46253 -59518 -44581 -3012 349305 164128 -321625 -31517 -151411 150633
9597B31725h5042L7525l4055Q080G1918f8404k34608A55111n4408c3863l55757
$$ 231725 -85042 -47517 -81572 -73492 71918 -68404 -303012 155111 100703 -33863 -389620
9586c89620h6288L7674I0536b20593f5601A42850a19819o4972A03226b23387a0150
$$ -389620 -86288 -48614 90536 -220593 -65601 142850 -119819 -184791 103226 -223387 -10150
9574a99241q5680A78843a63846c0294A60545i230B37307n0089r1858a71755A74402
$$ -199241 -284921 178843 -163846 -30294 160545 -9230 237307 187218 95360 -171755 174402
9562H879a84211k36430a57237m310B5821b09178C1251b97958m2310K6441A63515
$$ 8879 -184211 -420641 -157237 -161547 25821 -209178 31251 -297958 -340268 -313827 163515
9550H7894b4589o9498A05892j5288C5717b4185j68167P0042j23973B59037F9118
$$ 87894 -24589 -94087 105892 90604 35717 -24185 -192352 -122310 -246283 259037 69118
9538h5717j70562B0971a57918B60449j09652b6194j42463l6504C44919i6586c8756
$$ -85717 -256279 20971 -157918 260449 150797 -26194 -168657 -205161 344919 -96586 -38756
9526b01113q0857k1175J15213H9591b71613A36095j3964a20199r6528k60230b4469
$$ -201113 -281970 -303145 -187932 89591 -271613 136095 122131 -120199 -216727 -476957 -24469
9514c04124O6239a01112M1746J9853A07143D4405b44294d9210r5359l0963A08126
$$ -304124 -237885 -101112 -59366 -39513 107143 44405 -244294 -49210 -144569 -175532 108126
9502b09955L2001E1535i8608j04477A08633l8825q285a19172M8863A39341A8650
$$ -209955 -177954 51535 -98608 -203085 108633 69808 61523 -119172 -70309 139341 18650
9490a0851B00228Q5337n0711a57068D945a36954N8630k88187D856c557m2994r1188
$$ -10851 200228 285565 234854 -157068 4945 -136954 -78324 -366511 4856 -3557 -46551 -137739
9478a37739q684f3783q7551p016M187c7176j06344M0035k51859G810L60583A16772
$$ -137739 -146423 -63783 -151334 -158350 -154163 -37176 -143520 -103485 -355344 7810 368393 116772
9465G824b1889B35527Q3216b2955q001j19196j97189J26358j24987a4281A8865
$$ 7824 -21889 235527 318743 -22955 -30956 -150152 -347341 -220983 -345970 -14281 18865
9453A19895d06410R8836B6751J80443e8842o1639b5651j47055M7259J0647H8096
$$ 119895 -406410 -307574 26751 207194 -58842 -120481 -25651 -172706 -125447 -114800 88096
9441H6818b13249K8501B5810b24754C32501a87386e0645j37572H7843f947k61467
$$ 86818 -213249 -184748 25810 -224754 332501 -187386 -50645 -188217 87843 -6947 -268414
9430b68414g9114B6435c41852F3298f1850k0351A77103n9538a97550k72523b4094
$$ -268414 -79114 26435 -341852 63298 -61850 -82201 177103 117565 -197550 -470073 -24094
9418b26826E7896j2916R7433d4715j37812d9682p3960L9150L0112A96787p2863
$$ -226826 57896 44980 142413 -44715 -182527 -49682 -123642 -84492 -54380 196787 123924
9407A23924k9870b60304A36958a61150C48g8238A8339a70959j33313I280a47151
$$ 123924 94054 -260304 136958 -161150 348 -78238 18339 -170959 -304272 9280 -147151
9395c08301B94197b75008A21135a93599f2935o6818j36593R1126j30608M7179
$$ -308301 294197 -275008 121135 -193599 -62935 -129753 -266346 -175220 -305828 -258649
9385b58649L6342J8438l9239B35292b20116P9952q5868D7943h514B56031a49013
$$ -258649 -222307 -203869 -243108 235292 -220116 -140164 -226032 47943 -8514 256031 -149013
9373a46396a3834m7468a2355j64068A47890a3225k23545K4287Q7178A96166C545
$$ -146396 -13834 -61302 -12355 -176423 147890 -13225 -236770 -212483 -125305 196166 3545
9361b40447J13857B6098m309b17789B10093I329J50675c6853p5405c0859p8209
$$ -240447 -126590 26098 21789 -217789 210093 9329 160004 -36853 -112258 -30859 -109068
9350a09068d337A66662a1027B81941N9079F7977a39212B26890K62411e5745n8842
$$ -109068 -4337 166662 -11027 281941 341020 67977 -139212 226890 489301 -55745 -114587
9339a14587b433B07424r3223c2282q8137E0794d08429a83518F2976d1086P053
$$ -114587 -2433 207424 114201 -32282 -120419 50794 -408429 -183518 62976 -41086 -34033
9328c4033j02957n3330I7524l9208a47561q4081c8096D0773d59120I5774a86768
$$ -34033 -136990 -190320 97524 58316 -147561 -231642 -38096 40773 -459120 95774 -186768
9316e6349C4650f5369C87176a86570J0426A54420b31928I8472l5823a69116A16325
$$ -56349 34650 -65369 387176 -186570 -176144 154420 -231928 98472 62649 -169116 116325
9304b36957k5807A7581K14069c7437k33769a4225j26878j24501Q4410D9755b19973
$$ -236957 -262764 17581 231650 -37437 -271206 -14225 -141103 -265604 -181194 49755 -219973
9292a26974d3953j7440q2891d8276B40877E7188J2512K24356B6701b94133C13000
$$ -126974 -43953 -61393 -144284 -48276 240877 57188 69700 294056 26701 -294133 313000
9280c08905h0770j13861A45237h1676l27522f0484j98680O692A17417N7538H406
$$ -308905 -80770 -194631 145237 -81676 -409198 -60484 -259164 -252472 117417 174955 8406
9268A98773q1589b25949B99439b4764l6996c290G6116a58360l34121f9455r7986
$$ 198773 117184 -225949 299439 -24764 -61760 -3290 76116 -158360 -492481 -69455 -167441
9257a67441H4563b5656H1292E840b9681j43397o2237J04591J4832j06968f3515
$$ -167441 84563 -25656 81292 5840 -29681 -173078 -235315 -130724 -115892 -222860 -63515
9245A9075c4324A39268a0795D637e0677k23196F487M39939h9517r8717M6463j8386
$$ 19075 -34324 139268 -10795 4637 -50677 -273873 6487 446426 -89517 -188234 -141771 -160157
9233a60157q9755F9607d55122e0715I4161P8027a1375C55433a04461q2501B38108
$$ -160157 -249912 69607 -455122 -50715 94161 172188 -11375 355433 -104461 -186962 238108
9221b35568b6338A01755L2781n4566O1313g0406G3160M51569e2891A95760k5122
$$ -235568 -26338 101755 134536 79970 141283 -70406 73160 524729 -52891 195760 170638
9210A70638d5214j22926C9563a94574q5795a27456c0998o848o4862q3617C8556
$$ 170638 -45214 -168140 39563 -194574 -280369 -127456 -30998 -37846 -102708 -186325 38556
9198i5061d193p5449k2877q7879c65G806b97130r497B85989a69466P0312C08678
$$ -95061 -4193 -79642 -102519 -190398 -365 7806 -297130 -306627 285989 -169466 -99154 308678
9185b4921l06008a5491l03788i0603K2020j42843C0899I002b15916o7022H8596
$$ -24921 -330929 -15491 -319279 -90603 -68583 -211426 30899 9002 -215916 -282938 88596
9173F8248b92203K9206P4668g2746j10109l395L9684A07436a77862B35584a56339
$$ 68248 -292203 -262997 -188329 -72746 -182855 -186250 -146566 107436 -177862 235584 -156339
9161a52095j05615B90390b70387G804J29992l4816o638l9288L3475l1064b7914
$$ -152095 -257710 290390 -270387 7804 137796 102980 96342 57054 90529 59465 -27914
9149G3108b1715C4669R2544b39689A080L2496J08862a38380A1843e1378q1688
$$ 73108 -21715 34669 127213 -239689 1080 33576 142438 -138380 11843 -51378 -133066
9138a33066B01270b8819o5859c9843p891j5730j74258g059o3325k25187B5531
$$ -133066 201270 -28819 -94678 -39843 -47734 -63464 -237722 -7059 -70384 -295571 25531
9126C3939j5222J377Q0036P940b88507r0783A8270a43680l62422K26655f5751
$$ 33939 18717 20094 100130 108070 -288507 -379290 18270 -143680 -506102 -279447 -65751
9114A38150J39056c07984J10403h3642A03379n1227a84796A9941J26497o2998
$$ 138150 277206 -307984 -197581 -83642 103379 52152 -184796 19941 146438 83440
9104H3440d58684a11628k80789R3520N1511l19589A16477J17535E9831f7275k02066
$$ 83440 -458684 -111628 -392417 -298897 -247386 -566975 116477 234012 59831 -67275 -269341
9093b69341A11065k0428h2133a538A4698g3825A74638D4942a82683N7419j71679
$$ -269341 111065 90637 -82133 -1538 14698 -73825 174638 44942 -182683 -125264 -296943
9082b96943A66979d5195k68513H24L0631d0233m0154j62404I4440N7289C6661
$$ -296943 166979 -45195 -313708 824 31455 -40233 -80387 -242791 94440 151729 36661
9070a39306l6907B16508j2622c4777l34684h1933m6237E9919L2798b6447j72347
$$ -139306 -176213 216508 203886 -34777 -369461 -81933 -128170 59919 92717 -26447 -198794
9059a98794b5475o720B32719A11222A991b92736P6511e1577A6398a95569f549
$$ -198794 -25475 -32195 232719 111222 1991 -292736 -216225 -51577 16398 -195569 -6549
9047a92908a9349j57816j2549D29450a0417j87709a3795k04073i8165A6122J16119
$$ -192908 -19349 -177165 -189714 429450 -10417 -198126 -13795 -217868 -98165 16122 132241
9036A32241a40323H6172B6830a40327j7197e0781j01345K6216j10968a01434j69546
$$ 132241 -140323 86172 26830 -140327 -157524 -50781 -152126 -125910 -236878 -101434 -270980
9025b70980J13416b2607B71073I1148Q7059C8402c8338l3757A76650h7924D1241
$$ -270980 -157564 -22607 271073 91148 178207 38402 -38338 -72095 176650 -87924 41241
9013F9740a82410Q3454r16G3412a32638A14193d38875D2716J77098d4383j7045
$$ 69740 -182410 -98956 -99872 73412 -132638 114193 -438875 42716 219814 -44383 -61428
9002f1428m25207A70678a81324l80155a41202d8698A83634a6449A1892P3824a84632
$$ -61428 -486635 170678 -181324 -561479 -141202 -48698 183634 -16449 11892 85716 -184632
8990B24481C148J64046M63i082j65387M2456j03055j03537C5409c22604i535I2399
$$ 224481 3148 167194 167657 -9082 -174469 -132013 -235068 -338605 35409 -322604 -9535 92399
8977g6341k52453B11076d0970I0245a42538f3380A39151l4377e9518C358b79893
$$ -76341 -328794 211076 -40970 90245 -142538 -63380 139151 104774 -59518 3358 -279893
8965H7048g6942B942e6085A73341E4076f9170o4838H0382L6754d01527a92888
$$ 87048 -76942 2942 -56085 173341 54076 -69170 -134008 80382 117136 -401527 -192888
8953f1602n0367k66811a54313A08623a22966A67726b78290E312g2213c3975o0297
$$ -61602 -111969 -378780 -154313 108623 -122966 167726 -278290 5312 -72213 -33975 -94272
8942i4272j19997A11635i2919a0411B02924I5507J58328q4248o5873J56863a48866
$$ -94272 -214269 111635 -92919 -10411 202924 95507 253835 169587 103714 260577 -148866
8930a68431n2C04167b19753L4556G73793L6137Q92575M738619P268430o042753
$$ -168431 -168483 304167 -219753 -185197 773793 809930 1702505 6441124 13709554 7666801
8920G666801B641770I30143k25761C15875c006B23086b6172A3509a2469j42576
$$ 7666801 2641770 930143 704382 315875 -3006 223086 -26172 13509 -12469 -155045
8910a55045F6091K29893J99255k36536b52175A88881a53060E4634i5927B05638
$$ -155045 66091 295984 495239 258703 -252175 188881 -153060 54634 -95927 205638
8899G2521h6909B3430a6445C2056M1593A1430J57491o3734k9207j0005c13741
$$ 72521 -86909 23430 -16445 32056 73649 11430 168921 105187 75980 65975 -313741
8887g6145A13411B8547P2356m3730K77494b6866q0784K3673j19836k3952l3212
$$ -76145 113411 28547 100903 57173 334667 -26866 -107650 -83977 -203813 -227765 -260977
8876b60977A88815d730j53429n1839c6916D1196b24411k72748J05611a057j59599
$$ -260977 188815 -4730 -158159 -209998 -36916 41196 -224411 -497159 -391548 -1057 -160656
$$ [...]
##END NTUPLES=NMR SPECTRUM
##END=
