##TITLE=AC1604_INDMA13334_8316017_3FHkaYX8vc
##JCAMPDX= 6.0         $$ Bruker NMR JCAMP-DX V2.0
##DATA TYPE= NMR SPECTRUM
##DATA CLASS= NTUPLES
##ORIGIN= BRUKER
##OWNER= Administrator
$$ 1.72 TOPSPIN		Version 2.1
$$ 2013-11-09 21:50:31.229 -0800  Administrator@X
$$ Compression mode = diff/dup
##.OBSERVE FREQUENCY= 400.02188249412
##.OBSERVE NUCLEUS= ^1H
##.ACQUISITION MODE= SIMULTANEOUS (DQD)
##.ACQUISITION SCHEME= undefined
##.AVERAGES= 64
##.DIGITISER RES= 22
##SPECTROMETER/DATA SYSTEM= spect
##.PULSE SEQUENCE= noesygpps1d.comp
##.SOLVENT NAME= COFFEE_meoh
##.SHIFT REFERENCE= INTERNAL, COFFEE_meoh, 1, 14.96066
##AUDIT TRAIL= $$ (NUMBER, WHEN, WHO, WHERE, PROCESS, VERSION, WHAT)
$$ ##TITLE= Audit trail, TOPSPIN		Version 2.1
$$ ##JCAMPDX= 5.01
$$ ##ORIGIN= Bruker BioSpin GmbH
$$ ##OWNER= Administrator
$$ $$ E:\/data/COFFEE/nmr/AC1604_INDMA13334_8316017_3FHkaYX8vc/12/pdata/1/auditp.txt
$$ ##AUDIT TRAIL=  $$ (NUMBER, WHEN, WHO, WHERE, PROCESS, VERSION, WHAT)
(   1,<2013-11-09 21:50:25.576 -0800>,<Administrator>,<X>,<go>,<TOPSPIN 2.1>,
      <created by zg
	started at 2013-11-09 21:38:55.840 -0800,
	POWCHK enabled, PULCHK disabled,
       configuration hash MD5:
       C8 4E 4E 5D D3 5C D8 9E 9F 52 82 E0 59 8A DE 15
       data hash MD5: 64K
       58 26 B4 5F 68 4A 96 8A 64 C8 9D 7C AC 53 0C 12>)
(   2,<2013-11-09 21:50:28.874 -0800>,<Administrator>,<X>,<proc1d>,<TOPSPIN 2.1>,
      <Start of raw data processing
       efp LB = 0.3 FT_mod = 6 PKNL = 1 PHC0 = 0 PHC1 = 0 SI = 128K 
       data hash MD5: 128K
       D5 0B 88 EA 89 74 5F 50 4A 69 53 DB F8 10 FA B1>)
(   3,<2013-11-09 21:50:30.026 -0800>,<Administrator>,<X>,<proc1d>,<TOPSPIN 2.1>,
      <pk PHC0 = -88.27515 PHC1 = 0 
       data hash MD5: 128K
       6F 5B 4A 8E 8D 61 B2 78 C0 09 0F BB 64 60 B6 AC>)
(   4,<2013-11-09 21:50:30.524 -0800>,<Administrator>,<X>,<proc1d>,<TOPSPIN 2.1>,
      <abs ABSG = 1 
       data hash MD5: 128K
       9B 5B 69 9D 2B 1C 84 BF D1 47 86 B1 C6 CD 6E C0>)
(   5,<2013-11-09 21:50:30.662 -0800>,<Administrator>,<X>,<proc1d>,<TOPSPIN 2.1>,
      <abs ABSG = 2 
       data hash MD5: 128K
       5F 49 28 E2 2D CA 29 4B 27 18 26 AA D2 98 68 67>)
(   6,<2013-11-09 21:50:30.748 -0800>,<Administrator>,<X>,<proc1d>,<TOPSPIN 2.1>,
      <abs ABSG = 3 
       data hash MD5: 128K
       56 78 E4 9F 36 1D 8F 55 CB 18 76 D4 EC B7 C4 31>)
(   7,<2013-11-09 21:50:30.851 -0800>,<Administrator>,<X>,<proc1d>,<TOPSPIN 2.1>,
      <abs ABSG = 4 
       data hash MD5: 128K
       33 7B B2 F9 FA 0E BA E3 8B 01 63 EC 65 DF FA 8B>)
(   8,<2013-11-09 21:50:30.937 -0800>,<Administrator>,<X>,<proc1d>,<TOPSPIN 2.1>,
      <abs ABSG = 5 
       data hash MD5: 128K
       7A 5B 3B 2F 49 7E 9A C9 20 FF 90 E6 A6 58 46 49>)
$$ ##END=
$$ 
$$ $$ hash MD5
$$ $$ 94 24 EB EE 96 75 73 B8 07 1B 32 37 6E 6F C7 43
##$RELAX= 
##$RELAX= 
##$RELAX= 
##$RELAX= 
##$RELAX= 
##$RELAX= 
##$RELAX= 
##$RELAX= 
$$ Bruker specific parameters
$$ --------------------------
##$DU= <E:\>
##$EXPNO= 12
$$ [...]
##$TP07= 0
##$TPNAME0= <>
##$TPNAME1= <>
##$TPNAME2= <>
##$TPNAME3= <>
##$TPNAME4= <>
##$TPNAME5= <>
##$TPNAME6= <>
##$TPNAME7= <>
##$TPOAL= (0..7)
0.5 0.5 0.5 0.5 0.5 0.5 0.5 0.5
##$TPOFFS= (0..7)
0 0 0 0 0 0 0 0
##$TUNHIN= 0
##$TUNHOUT= 0
##$TUNXOUT= 0
##$USERA1= <user>
##$USERA2= <user>
##$USERA3= <user>
##$USERA4= <user>
##$USERA5= <user>
##$V9= 5
##$VALIST= <valist>
##$VCLIST= <CCCCCCCCCCCCCCC>
##$VD= 0
##$VDLIST= <DDDDDDDDDDDDDDD>
##$VPLIST= <PPPPPPPPPPPPPPP>
##$VTLIST= <TTTTTTTTTTTTTTT>
##$WBST= 1024
##$WBSW= 4
##$XGAIN= (0..3)
0 0 0 0
##$XL= 0
##$YL= 0
##$YMAX_a= 6433679
##$YMIN_a= -12351253
##$ZGOPTNS= <>
##$ZL1= 120
##$ZL2= 120
##$ZL3= 120
##$ZL4= 120
##$ABSF1= 14.96066
##$ABSF2= -5.597522
##$ABSG= 5
##$ABSL= 3
##$ALPHA= 0
##$AQORDER= 0
##$ASSFAC= 0
##$ASSFACI= 0
##$ASSFACX= 0
##$ASSWID= 0
##$AUNMP= <proc_prof1d_extract.lims>
##$AXLEFT= 0
##$AXNAME= <>
##$AXNUC= <1H>
##$AXRIGHT= 0
##$AXTYPE= 0
##$AXUNIT= <>
##$AZFE= 0.1
##$AZFW= 0.1
##$BCFW= 0
##$BC_mod= 0
##$BYTORDP= 0
##$COROFFS= 0
##$CY= 15
##$DATMOD= 1
##$DC= 0
##$DFILT= <>
##$DTYPP= 0
##$F1P= 0
##$F2P= 0
##$FCOR= 0.5
##$FTSIZE= 131072
##$FT_mod= 6
##$GAMMA= 0
##$GB= 0
##$INTBC= 1
##$INTSCL= 1
##$ISEN= 128
##$LB= 0.3
##$LEV0= 0
##$LPBIN= 0
##$MAXI= 10000
##$MC2= 0
##$MEAN= 0
##$ME_mod= 0
##$MI= 0
##$NCOEF= 0
##$NC_proc= -2
##$NLEV= 6
##$NOISF1= 0
##$NOISF2= 0
##$NSP= 0
##$NTH_PI= 0
##$NZP= 0
##$OFFSET= 14.96066
##$PC= 1
##$PHC0= -88.27515
##$PHC1= 0
##$PH_mod= 1
##$PKNL= yes
##$PPARMOD= 0
##$PPDIAG= 0
##$PPIPTYP= 0
##$PPMPNUM= 2147483647
##$PPRESOL= 1
##$PSCAL= 4
##$PSIGN= 0
##$PYNMP= <proc.py>
##$REVERSE= no
##$SF= 400.020009772021
##$SI= 131072
##$SIGF1= 0
##$SIGF2= 0
##$SINO= 400
##$SIOLD= 131072
##$SPECTYP= <>
##$SREGLST= <1H.CDCl3>
##$SSB= 0
##$STSI= 131072
##$STSR= 0
##$SW_p= 8223.68421052631
##$SYMM= 0
##$S_DEV= 0
##$TDeff= 65536
##$TDoff= 0
##$TI= <>
##$TILT= no
##$TM1= 0
##$TM2= 0
##$TOPLEV= 0
##$USERP1= <user>
##$USERP2= <user>
##$USERP3= <user>
##$USERP4= <user>
##$USERP5= <user>
##$WDW= 1
##$XDIM= 131072
##$YMAX_p= 393704907
##$YMIN_p= -11887
##$CURPLOT= <Network HP LaserJet P1505>
##$CURPRIN= <$Network HP LaserJet P1505>
##$DFORMAT= <normdp>
##$LAYOUT= <+/1D_H.xwp>
##$LFORMAT= <normlp>
##$PFORMAT= <normpl>
##$SURQMSG= 1
$$ End of Bruker specific parameters
$$ ---------------------------------
##NTUPLES= NMR SPECTRUM
##VAR_NAME=  FREQUENCY,     SPECTRUM/REAL,   SPECTRUM/IMAG
##SYMBOL=    X,             R,               I
##VAR_TYPE=  INDEPENDENT,   DEPENDENT,       DEPENDENT
##VAR_FORM=  AFFN,          ASDF,            ASDF
##VAR_DIM=   131072,        131072,          131072
##UNITS=     HZ,            ARBITRARY UNITS, ARBITRARY UNITS
##FACTOR=    0.0627417313425164, 1,          1
##FIRST=     8223.62146879497, 3049,         -67124
##LAST=      0,             5088,            -66413
##MIN=       0,             -11887,          0
##MAX=       8223.62146879497, 393704907,    0
$$ Real data points
##PAGE= N=1
##DATA TABLE= (X++(R..R)), XYDATA
$$ [...]
63912B582977j77614j73763j67788j59404j49134j38014j26599j14820j02778
63903A273063r1196q0866p1919o3873n6192m8736m1737l5578l0521k6526k3308
63892G02611k0576j8153j5890j3642j1468r639q330p301o104m563k853j108P73
63879E83757K788M533N585O126O865Q173R553J0296J0462J0887J2122J3817J5358
63866G00322J6739J8402K0391K2120K2979K2829K1893K0553J9233J8107J6791
63855I20359J4720J1946R070O240K806j593o170r829j2526j5063j7794k0304k2294
63842H59568k3974k5443k6464k7072k7714k8456k8734k8258k7541k7040k6348
63831E62524k4918k3071k1547k0360j8895j7065j5555j4840j4554j4079j3179
$$ plain form
63912 2582977 2405363 2231600 2063812 1904408 1755274 1617260 1490661 1375841 1273063
63903 1273063 1181867 1101001 1029082 965209 909017 860281 818544 782966 752445 725919 702611
63892 702611 682035 663882 647992 634350 622882 613243 604913 597612 591508 586945 584092 582984 583757
63879 583757 586545 591078 596663 602789 609654 617827 627380 637676 648138 659025 671147 684964 700322
63866 700322 717061 735463 755854 777974 800953 823782 845675 866228 885461 903568 920359
63855 920359 935079 947025 956095 962335 965141 963548 957378 947549 935023 919960 902166 881862 859568
63842 859568 835594 810151 783687 756615 728901 700445 671711 643453 615912 588872 562524
63831 562524 537606 514535 492988 472628 453733 436668 421113 406273 391719 377640 364461
63820C64461j1936j0534r339q738q622q351p470o238n212m590m198l895l731l768
63806B67839l908l893l411k410j309o63n15l91l9J43l39j314k084k171j720j189
63790B42626r40j034j326j696k238l044l778l742k666j253n74r06j452j238j78
63775B16561Q93J028R7j086j519r50mN73N68J40n77j449k119k202j656p74J16
63758B07640P07P26K96P3N02J092R80J87l65j78K20K67K28N06P59M38j07P0J176
63739B15217K374K852K683K412K317K277K034J486R23R79K000L501M597M900M660
63724B55212M189L741L843M860O157O494N716N123N627O302N676L800K034J158
63710C19932P29J88m54j191k248l439m081l926l561l496l492l134k518j961j507
$$ plain form
63820 364461 352525 341991 332652 323914 315292 306941 299471 293233 288021 283431 279233 275338 271607 267839
63806 267839 263931 260038 256627 254217 252908 252245 251730 251339 251300 251443 251104 249790 247706 245535 243815 242626
63790 242626 241686 240652 239326 237630 235392 232348 228570 224828 222162 220909 220335 219429 217977 216739 216561
63775 216561 217454 218482 218579 217493 215974 215024 215020 215593 216161 216301 215724 214275 212156 209954 208298 207524 207640
63758 207640 208347 209073 209369 209442 209944 211036 212016 212203 211838 211660 211880 212147 212375 212881 213640 214078 213971 214041 215217
63739 215217 217591 220443 223126 225538 227855 230132 232166 233652 234575 235554 237554 241055 245652 250552 255212
63724 255212 259401 263142 266985 271845 278002 284496 290212 295335 300962 307264 312940 316740 318774 319932
63710 319932 320661 320849 320395 319204 316956 313517 309436 305510 301949 298453 294961 291827 289309 287348 285841
63695B85841j152j053j125q82j08P66J369J983K870L517L294K533K130K258K262
63680C04503J717R23K76p7O3Q77J935K377J996J583J827K406K564K259K146K609
63664C29984L274L458K818J549J10j132k027k539k693k803l403m650n920o417
63650C09609o088n527n099m729m452m424m260l221j351K56Q25Q23J019J316J341
63635B76038J542K657M321N286N103M662M841N430N741N586N264N016M908M998
63621C41393N264N639O236P225Q374R169R590J0271J1598J3080J4072J4748J5801
63608D72460J7450J9306K1099K2935K4747K6013K6267K5564K4297K2675K0548
63597G23361J7582J3612Q954M354M26k833n672p843q702q237p559p966r737j2175
$$ plain form
63695 285841 284689 283636 282511 281629 281521 282287 283656 285639 288509 292026 295320 297853 299983 302241 304503
63680 304503 306220 307143 307419 307342 307405 308282 310217 312594 314590 316173 318000 320406 322970 325229 327375 329984
63664 329984 333258 336716 339534 341083 341193 340061 338034 335495 332802 329999 326596 321946 316026 309609
63650 309609 303521 297994 292895 288166 283714 279290 275030 271809 270458 270714 271539 272362 273381 274697 276038
63635 276038 277580 280237 284558 289844 294947 299609 304450 309880 315621 321207 326471 331487 336395 341393
63621 341393 346657 352296 358532 365757 374131 383300 392890 403161 414759 427839 441911 456659 472460
63608 472460 489910 509216 530315 553250 577997 604010 630277 655841 680138 702813 723361
63597 723361 740943 754555 763509 767863 768289 765456 759784 751941 743239 735002 727443 719477 709740 697565
63583F97565j4618j6947j9146k0890k1733k1511k0362j8614j6728j5109j3774
63572D98133j2388j0788r218p778n963l234l5K307K935K441K202K993M426N651
63558D71684O272O593P212Q367R660J0446J0645J1055J2637J5451J8593K1251
63546F09866K3646K6655L0595L4683L7793L9497M0042L9317L6354L0225K1316
63535I69989J1342K189m962r571j1587j1746j1410j1494j1698j1322j0660j0939
63523H78131j2893j6003j9297k2361k5311k8169l0633l2229l2475l1171k8815
63512E98774k6479k4906k3886k2739k1145j9214j7021j4580j2179j0237q738p222
63500C90428n577m413m358n116n600n056l854k961k765k677j966p21L45Q06Q53
$$ plain form
63583 697565 682947 666000 646854 625964 604231 582720 562358 543744 527016 511907 498133
63572 498133 485745 474957 465739 457961 451998 448764 448729 451036 453971 456412 458614 461607 466033 471684
63558 471684 477956 484549 491761 500128 509788 520234 530879 541934 554571 570022 588615 609866
63546 609866 633512 660167 690762 725445 763238 802735 842777 882094 918448 948673 969989
63535 969989 981331 983520 978558 968987 957400 945654 934244 922750 911052 899730 889070 878131
63523 878131 865238 849235 829938 807577 782266 754097 723464 691235 658760 627589 598774
63512 598774 572295 547389 523503 500764 479619 460405 443384 428804 416625 406388 397650 390428
63500 390428 384851 380438 376080 370964 365364 360308 356454 353493 350728 348051 346085 345364 345709 346515 347368
63485C47368P10L48n1J14J083K181K630K646L096M195N279N836O021N971N362
63470C92789M107K817K042J435K75j441l001l912m315m565m837n148n298m859
63456C66089l621k116j198j033r88o17k46k74l42K62J624L101M146M830N483O230
63440C81330P080Q147R553J1205J3014J5242J8266K1897K5329K8038L0426L3080
63428F02607L5420L5723L2734K6869J9599J2156N281j95l402m151l062q04K437
63415G61212O583J1252J5873J9977K3169K5083K5596K4830K2879J9770J5695J0994
63403I82913N833L57m747q453j0467j1628j2853j4142j5135j6126j7779k0114
63391H57659k2491k4569k6499k8179k9078k9041k8574k8019k6946k4880k2187
$$ plain form
63485 347368 348078 348426 348375 348489 349572 351753 354383 357029 360125 364320 369599 375435 381456 387427 392789
63470 392789 396896 399713 401755 403190 403465 402024 399023 395111 390796 386231 381394 376246 370948 366089
63456 366089 362468 360352 359154 358121 357133 356516 356270 355996 355654 355916 357540 360641 364787 369617 375100 381330
63440 381330 388410 396557 406110 417315 430329 445571 463837 485734 511063 539101 569527 602607
63428 602607 638027 673750 706484 733353 752952 765108 770389 770194 766792 762641 759579 758775 761212
63415 761212 767795 779047 794920 814897 838066 863149 888745 913575 936454 956224 971919 982913
63403 982913 988746 989103 984356 975903 965436 953808 940955 926813 911678 895552 877773 857659
63391 857659 835168 810599 784100 755921 726843 697802 669228 641209 614263 589383 567196
63380E67196j9737j7862j6066j3753j0948q216o056m414k800r11R99K491L618
63367D73541M957O932R327J1511J2946J3515J3735J4609J6825J9943K2778K4757
63355F45376K6442K8451L0449L1690L2131L2316L2290L1319K8832K5045K0482
63344I64823J5322R566L669j480n251p822r843j1639j2912j3389j3577j4467j6420
63331H86580j8775k0746k2320k3931k5555k6623k6700k5744k3794k0832j7100
63320F34460j3148r449o155l212n38J766L025K069j710p341j2900j7212k0350
63307E49305k2430k2908k1582j9455j7697j6183j4006j1185q796p436o510n427
63295C75690m562m412m538m132l257k704k768k940k865k804k960k998k667k318
$$ plain form
63380 567196 547459 529597 513531 499778 488830 480614 474558 470144 467344 466433 467432 469923 473541
63367 473541 478498 485430 494757 506268 519214 532729 546464 561073 577898 597841 620619 645376
63355 645376 671818 700269 730718 762408 794539 826855 859145 890464 919296 944341 964823
63344 964823 980145 989711 993380 991900 986649 978827 968984 957345 944433 931044 917467 903000 886580
63331 886580 867805 847059 824739 800808 775253 748630 721930 696186 672392 651560 634460
63320 634460 621312 611863 605708 602496 601958 603724 606749 608818 607108 599767 586867 569655 549305
63307 549305 526875 503967 482385 462930 445233 429050 415044 403859 395063 387627 381117 375690
63295 375690 371128 366716 362178 358046 354789 352085 349317 346377 343512 340708 337748 334750 332083 329765
63281C29765k330k399k001j285q69q56p01j43L92M88L58M52Q36J295J665J798
63265C26465J550J143J148J746K317K345K292K946M105M765M553M206M422N076
63251C69079N798O571P386P931Q231Q907J0290J1775J2742J3622J5197J7303J9154
63238E13986K0733K2739K5180K7138K8272K9419L1197L2896L3558L3482L3657
63227H32257L4222L4407L3878L3181L2818L2668L2533L2567L2898L3295L3496
63216A198220L3478L3132L2012K9692K6148K1566J5918Q970O72q572j7899k6368
63204A346969l3542l9672m5023m9115n1140n1106n0010m8696m7001m4355m0688
63193H46621l6365l1660k6745k1904j7306j2880q746n429l111j094J398M152O345
$$ plain form
63281 329765 327435 325036 323035 321750 320881 320025 319324 319181 319573 320061 320419 320871 321707 323002 324667 326465
63265 326465 328015 329158 330306 332052 334369 336714 339006 341952 346057 350822 355375 359581 364003 369079
63251 369079 374877 381448 388834 396765 404996 413903 424193 435968 448710 462332 477529 494832 513986
63238 513986 534719 557458 582638 609776 638048 667467 698664 731560 765118 798600 832257
63227 832257 866479 900886 934764 967945 1000763 1033431 1065964 1098531 1131429 1164724 1198220
63216 1198220 1231698 1264830 1296842 1326534 1352682 1374248 1390166 1399136 1399808 1391236 1373337 1346969
63204 1346969 1313427 1273755 1228732 1179617 1128477 1077371 1027361 978665 931664 887309 846621
63193 846621 810256 778596 751851 729947 712641 699761 691015 685586 682475 681381 682779 686931 693276
63180F93276P738Q748R540R904R976J0187J0456J0266R710R516R813R766Q859
63167H17755P574O298M469J673j308l573n608q607j2588j6350j9166k1361k3208
63154G26000k4334k4547k4250k3656k2438k0613j8963j7971j6965j5088j2596
63143E04579j0461q990p663o208n056m507m177l565k738k087j729j529j484j628
63129D42757j619r31L93J586K008J952K163K810L342L409L337L538L877M001L962
63114D76585M045M172L958L324K668K382K520K971L643M334M725M557L815K671
63100E26370J490P71Q29J478K189K608K747K752K774L013L588M297M745M738M332
63085E68721L586K592J727J491J918K514K894L159L504L803L896M078M918O569
$$ plain form
63180 693276 701014 709762 719302 729206 739182 749369 759825 770091 779801 789317 799130 808896 817755
63167 817755 825329 831627 836096 837769 836461 832888 827280 818673 806085 789735 770569 749208 726000
63154 726000 701666 677119 652869 629213 606775 586162 567199 549228 532263 517175 504579
63143 504579 494118 485128 477465 471257 466201 461694 457517 453952 451214 449127 447398 445869 444385 442757
63129 442757 441138 440207 440600 442186 444194 446146 448309 451119 454461 457870 461207 464745 468622 472623 476585
63114 476585 480630 484802 488760 492084 494752 497134 499654 502625 506268 510602 515327 519884 523699 526370
63100 526370 527860 528631 529460 530938 533127 535735 538482 541234 544008 547021 550609 554906 559651 564389 568721
63085 568721 572307 574899 576626 578117 580035 582549 585443 588602 592106 595909 599805 603883 608801 615370
63071F15370Q489R939J0758J1573J3098J5260J7241J8578J9859K2014K5102K8391
63059H15672L1408L4398L7706M1407M5639N0598N5927O0746O4678O8309P2133
63048A378621P5641P8058P9547Q0905Q2271Q2967Q2642Q1855Q1272Q0947Q0617
63037B265343Q0344Q0372Q0580Q0463P9560P7613P4230O8747O0563M9534L5891
63026C033240J9946K130j6719l5497n3393p0024q4878r7070j06088j12367j16516
63015B362764j18183j16468j11459j04584r7218q9561q1135p1841o2101n2455
63005A457759m3387l5189k7703k0538j3796q130l816k91L100O313Q905J0667J1640
62992A345534J2055J2583J3935J5748J6550J5439J3191J0997Q851O115K940j39
$$ plain form
63071 615370 623859 633798 644556 656129 669227 684487 701728 720306 740165 762179 787281 815672
63059 815672 847080 881478 919184 960591 1006230 1056828 1112755 1173501 1238179 1306488 1378621
63048 1378621 1454262 1532320 1611867 1692772 1775043 1858010 1940652 2022507 2103779 2184726 2265343
63037 2265343 2345687 2426059 2506639 2587102 2666662 2744275 2818505 2887252 2947815 2997349 3033240
63026 3033240 3053186 3055316 3038597 3003100 2949707 2879683 2794805 2697735 2591647 2479280 2362764
63015 2362764 2244581 2128113 2016654 1912070 1814852 1725291 1644156 1572315 1510214 1457759
63005 1457759 1414372 1379183 1351480 1330942 1317146 1309016 1305200 1304909 1308009 1314322 1323227 1333894 1345534
62992 1345534 1357589 1370172 1384107 1399855 1416405 1431844 1445035 1456032 1464883 1470998 1473938 1473799
62980A473799l612q597j5030k1485k6923l1543l5720l9197m1728m3561m4824m5148
62968A116431m4319m2652m0474l7841l5014l2476l0147k7376k4057k1033j8973
62957G62069j7606j6498j5778j5478j4967j3883j2957j2989j3416j2915j1247
62946F04335r600r071r548j0250j0644j0646j0349r878r379q964q640q260p500
62933D81606o220m898m311m542m749m237l368k895k815k469j592o27n3N3j85n70
62917D38128p97p18o38r40j407j461j053p94j029j323j138o38m13o81j126j436
62901D22536j678j992k232k096j585j126j058j135q16PQ52J271J243Q49Q3p60
62885D12363r67k44O88R17O03O68J360J818J304K57l15r0L22K68k25n44k18M92
$$ plain form
62980 1473799 1470187 1461590 1446560 1425075 1398152 1366609 1330889 1291692 1249964 1206403 1161579 1116431
62968 1116431 1072112 1029460 988986 951145 916131 883655 853508 826132 802075 781042 762069
62957 762069 744463 727965 712187 696709 681742 667859 654902 641913 628497 615582 604335
62946 604335 594735 585664 576116 565866 555222 544576 534227 524349 514970 506006 497366 489106 481606
62933 481606 475386 470488 466177 461635 456886 452649 449281 446386 443571 441102 439510 438883 438830 438883 438698 438128
62917 438128 437331 436613 435975 435035 433628 432167 431114 430320 429291 427968 426830 426192 425779 425098 423972 422536
62901 422536 420858 418866 416634 414538 412953 411827 410769 409634 408818 408825 409677 410948 412191 413040 413123 412363
62885 412363 411396 411152 411840 412757 413360 414028 415388 417206 418510 418767 418452 418362 418684 418952 418727 418183 417965 418457
62867D18457P68J62p86j093n31J17M3o61j292j394j004l19M61J040J183J014R45
62850D17110J150J370J330J156J152J281J209Q33M81M53O55Q29R46J014Q00J62
62834D31931m57l93L25R83J223J481K099K620K457J824J382J328J443J834K777
62819D52857L923M408M010L513L663M273M752N049N574O454P361P977Q298Q460
62805E30572Q553Q651Q890R434J0381J1709J3231J4681J5836J6637J7259J8147
62793F83981J9880K2707K6224K9650L2558L5264L8460M2633M7828N3870O0612
62782A093667O7951P5711Q3712R2024J00956J10443J19638J27496J33750J38711
62772B144059J41969J42113J38206J30852J20943J07974R0688O9305M5873K2199
$$ plain form
62867 418457 419225 419387 418601 417508 416977 417094 417137 416476 415184 413790 412786 412467 412928 413968 415151 416165 417110
62850 417110 418260 419630 420960 422116 423268 424549 425758 426591 427072 427525 428180 429009 429955 430969 431769 431931
62834 431931 431474 431081 431406 432389 433612 435093 437192 439812 442269 444093 445475 446803 448246 450080 452857
62819 452857 456780 461188 465198 468711 472374 476647 481399 486448 492022 498476 505837 513814 522112 530572
62805 530572 539125 547776 556666 566100 576481 588190 601421 616102 631938 648575 665834 683981
62793 683981 703861 726568 752792 782442 815000 850264 888724 931357 979185 1033055 1093667
62782 1093667 1161618 1237329 1321041 1413065 1514021 1624464 1744102 1871598 2005348 2144059
62772 2144059 2286028 2428141 2566347 2697199 2818142 2926116 3016804 3086109 3131982 3154181
62762C154181j531k5639m9380p1173q9847j05000j16588j24787j30049j32682
62752B307505j32587j29850j25333j20115j14510j08132j00920r3567q6784q0618
62742A215089p4598o8337o1774n5068m8507m2523l7554l3709l0524k7355k4141
62731G10999k1544k0004j8927j7281j4881j2495j0744r530q617p942p115n458
62719E56461l071j146n40o04j03J253K924M639O422P933Q783R423J0774J3017
62705F16165J5585J8205K1037K3878K6298K8656L1830L5673L8991M1397M3953
62694I41668M7226M9938N0653M9808M8747M7348M4198L8920L2845K7021K0801
62683A399173J2970L469o616j6200k4789l2247l8536m3624m7438m9969n1488n2329
$$ plain form
62762 3154181 3152650 3127011 3077631 3006458 2916611 2811611 2695023 2570236 2440187 2307505
62752 2307505 2174918 2045068 1919735 1799620 1685110 1576978 1476058 1382491 1295707 1215089
62742 1215089 1140491 1072154 1010380 955312 906805 864282 826728 793019 762495 735140 710999
62731 710999 689455 669451 650524 633243 618362 605867 595123 585593 576976 569034 561919 556461
62719 556461 553390 552244 551704 551100 550997 552250 555174 559813 566235 574168 582951 592374 603148 616165
62705 616165 631750 649955 670992 694870 721168 749824 781654 817327 856318 897715 941668
62694 941668 988894 1038832 1089485 1139293 1188040 1235388 1279586 1318506 1351351 1378372 1399173
62683 1399173 1412143 1415612 1408996 1392796 1368007 1335760 1297224 1253600 1206162 1156193 1104705 1052376
62671A052376n2434n1369m9020m5881m2531l9150l5813l2843l0443k8206k5497
62660F19189k2327j9446j7452j6105j4722j3031j1373j0107r067p860o494n460
62648D65745n078n052m979m934n219n587n275l993k445j593j607j845j616p45
62634D15777M56J504K105K339K471K436J853O77m03o16K0Q05J202J155P84K95
62618D32860J52Q16K160L534M525N271O006O758P688R071J0763J2124J2925J3770
62604E28423J5171J6750J7972J9293K1733K5476K9684L3698L7684M1958M6428
62593H34270N0932N5503N9956O3724O6466O8277O8929O7463O3119N6336M8156
62582A503131L8933K8228J5938K861r927k1713l2124m0932m8207n4298n9363o3061
$$ plain form
62671 1052376 999942 948573 899553 853672 811141 771991 736178 703335 672892 644686 619189
62660 619189 596862 577416 559964 543859 529137 516106 504733 494626 485559 477699 471205 465745
62648 465745 460667 455615 450636 445702 440483 434896 429621 425628 423183 421590 419983 418138 416522 415777
62634 415777 416233 417737 419842 422181 424652 427088 428941 429618 429215 428599 428619 429424 430626 431781 432565 432860
62618 432860 433012 433828 435988 439522 444047 449318 455324 462082 469770 478841 489604 501728 514653 528423
62604 528423 543594 560344 578316 597609 619342 644818 674502 708200 745884 787842 834270
62593 834270 885202 940705 1000661 1064385 1130851 1199128 1268057 1335520 1398639 1454975 1503131
62582 1503131 1542064 1570292 1586230 1589091 1579164 1557451 1525327 1484395 1436188 1381890 1322527 1259466
62570A259466o4878o4684o2909o0206n7005n3349m9200m4925m1197l8218l5314
62559F87581l1739k7687k4079k1313j8898j6358j3946j2197j1216j0765j0567
62548D88816j0195r110p364n883n448n596n165l792k241j242p27l64j38o9M0J92
62532D31714l4p75j319q33M95J610J865J669J819K645L977N623P572R863J2330
62517D78221J4570J6215J7400J8764K0767K3125K5227K6947K8608L0222L1245
62506G31311L1244L0272K8412K5421K1218J6368J1616P179K848j404n327q739
62494H90419j1560j3547j4421j4245j3360j1974j0101p842n362k571P42M436Q114
62481G98728J1786J5990K0977K6091L0272L3055L4814L6153L7239L7662L6792
$$ plain form
62570 1259466 1194588 1129904 1066995 1006789 949784 896435 847235 802310 761113 722895 687581
62559 687581 655842 628155 604076 582763 563865 547507 533561 521364 510148 499383 488816
62548 488816 478621 469511 462147 456264 450816 445220 440055 436263 434022 432780 432053 431689 431551 431482 431522 431714
62532 431714 431680 430905 429586 428753 429248 430858 432723 434392 436211 438856 442833 448456 456028 465891 478221
62517 478221 492791 509006 526406 545170 565937 589062 614289 641236 669844 700066 731311
62506 731311 762555 792827 821239 846660 867878 884246 895862 903041 905889 904485 899158 890419
62494 890419 878859 865312 850891 836646 823286 811312 801211 793369 788007 785436 786178 790614 798728
62481 798728 810514 826504 847481 873572 903844 936899 971713 1007866 1045105 1082767 1119559
62470A119559L4229L0040K4584J8198J1170L822l585j1061j8754k6561l4001m0491
62458A107149m5565m8982n0864n1619n1445m9995m7029m3208l9633l6564l3173
62447F09072k8846k4053j9708j6274j3778j2109j0805r056o607m178k547j632
62435D59479j038r04j424j957j666q05m57j031j979k916l999n038n354m922m686
62420D21303n229n925n961n460m948m425l692l081k995l104k782k120j718j673
62406C68190j532j225j232j708k085j821j071m05j88l83o37m78K51J146J663J811
62390C60296K079K616K961K739K161J696J499J484J635K023K581L160L702M253
62376C94885M859N577O457P415Q226Q743R038R320R765J0445J1214J1781J2089
$$ plain form
62470 1119559 1153788 1183828 1208412 1226610 1237780 1241602 1238017 1226956 1208202 1181641 1147640 1107149
62458 1107149 1061584 1012602 961738 910119 858674 808679 761650 718442 678809 642245 609072
62447 609072 580226 556173 536465 520191 506413 494304 483499 474443 467836 463658 461111 459479
62435 459479 458441 457537 456113 454156 452490 451685 451228 450197 448218 445302 441303 436265 430911 425989 421303
62420 421303 416074 410149 404188 398728 393780 389355 385663 382582 379587 376483 373701 371581 369863 368190
62406 368190 366658 365433 364201 362493 360408 358587 357516 357111 356923 356540 355903 355425 355676 356822 358485 360296
62390 360296 362375 364991 367952 370691 372852 374548 376047 377531 379166 381189 383770 386930 390632 394885
62376 394885 399744 405321 411778 419193 427419 436162 445200 454520 464285 474730 485944 497725 509814
62363E09814J2629J4077J6525J9360K2126K5057K8560L2438L6122L9484M2862
62352G99054M6198M8695M9588M8928M7206M4392L9898L3565K6209J8856J1727
62341A214316M401l126j0071j5712k0211k4347k8663l3074l7059l9886m0850l9796
62329I25922l7422l4724l2167k9593k6923k4470k2483k0773j9035j7259j5648
62318F45425j4400j3729j3817j4509j5194j5291j4759j4001j3355j2869j2345
62307D91156j1520j0311r011q035p322o357m944l654l086l003k663j872j146q66
62293D17366q02n94k72n6L6K09O61J475K483L235L362L050K869L046L248L260
62277D42576L424M061M832N154N084N237N809O257O150N966O550P973R400J0210
$$ plain form
62363 509814 522443 536520 553045 572405 594531 619588 648148 680586 716708 756192 799054
62352 799054 845252 893947 943535 992463 1039669 1084061 1123959 1157524 1183733 1202589 1214316
62341 1214316 1218717 1215591 1205520 1189808 1169597 1145250 1116587 1083513 1046454 1006568 965718 925922
62329 925922 888500 853776 821609 792016 765093 740623 718140 697367 678332 661073 645425
62318 645425 631025 617296 603479 588970 573776 558485 543726 529725 516370 503501 491156
62307 491156 479636 469325 460314 452279 444957 438600 433656 430002 426916 423913 421250 419378 418232 417366
62293 417366 416564 415970 415698 415642 415678 415887 416548 418023 420506 423741 427103 430153 433022 436068 439316 442576
62277 442576 446000 450061 454893 460047 465131 470368 476177 482434 488584 494550 501100 509073 518473 528683
62263E28683J0885J2441J5090J8005K0486K2962K6402L0981L5847M0196M4043
62252H06021M7712N1005N3246N3918N2882N0063M5365L8895L1129K2745J4287
62241A267268N968k237j0211j7460k3547k8753l3830l8923m3211m5970m7535m8612
62229I32947m8955m7579m4258m0049l6144l2854k9887k7059k4269k1337j8331
62218E62225j5714j3788j2247j0747r484q713q016o795n352m724n251n896n381
62205D50117l591j573l51n5k1N10J755L256M444N296O296P705R252J0652J2144
62190E05836J4067J6109J7458J7816J7839J8381J9498K0509K0857K0532J9647
62179G08549J8033J5532J2487R484O713L886R27j578k910k962k176q63J063L733
$$ plain form
62263 528683 539568 552009 567099 585104 605590 628552 654954 685935 721782 761978 806021
62252 806021 853733 904738 957984 1011902 1064784 1114847 1160212 1199107 1230236 1252981 1267268
62241 1267268 1273236 1270999 1260788 1243328 1219781 1191028 1157198 1118275 1075064 1029094 981559 932947
62229 932947 883992 836413 792155 752106 715962 683108 653221 626162 601893 580556 562225
62218 562225 546511 532723 520476 509729 500245 491532 483516 476721 471369 466645 461394 455498 450117
62205 450117 446526 444953 444602 444547 444526 445036 446791 450047 454491 459787 466083 473788 483040 493692 505836
62190 505836 519903 536012 553470 571286 589125 607506 627004 647513 668370 688902 708549
62179 708549 726582 742114 754601 764085 770798 774684 775611 774033 771123 768161 765985 765122 766185 769918
62165G69918P082J0958J5260J9803K4293K8454L1921L4024L4029L1837K8133K3614
62153A059326J8415J2528O446Q78m001q513j2748j6460j9743k3136k6760k9839
62141I56393l1500l1790l1355l0441k8689k5920k2514j8922j5257j1633q427n862
62129F94083l565r90J796M121N583O603P962R963J2276J4440J6267J7688J8450
62116H04677J8221J7009J5217J3153J0647P373L523j56k992m886o087o796p198
62103H61705p601q236q955r381r285q614p266n137k439L36K820M883O400P204
62089H16434P397P406P525P628P480P082O504N679M625L742L594M379N838P550
62075I02863R178J0480J1376J1992J2569J3281J4163J5017J5388J4932J4028J3688
$$ plain form
62165 769918 777000 787958 803218 823021 847314 875768 907689 941713 975742 1007579 1035712 1059326
62153 1059326 1077741 1090269 1096715 1097593 1093592 1085079 1072331 1055871 1036128 1012992 986232 956393
62141 956393 924893 893103 861748 831307 802618 776698 754184 735262 720005 708372 699945 694083
62129 694083 690518 689528 691324 695445 701028 707631 715593 725556 737832 752272 768539 786227 804677
62116 804677 822898 839907 855124 868277 878924 886297 889820 889664 886672 881786 875699 868903 861705
62103 861705 854104 845868 836913 827532 818247 809633 802367 797230 794791 795127 797947 802830 809230 816434
62089 816434 823831 831237 838762 846390 853870 860952 867456 873135 877760 881502 885096 889475 895313 902863
62075 902863 912041 922521 933897 945889 958458 971739 985902 1000919 1016307 1031239 1045267 1058955
62063A058955J4491J5918J7135J8181J9687K1462K2232K1100J8627J5966J3335
62052A257089J0031N740J113l088o885j0831j5194j9702k4010k7972l1403l3952
62040A100936l5445l6273l7037l7748l7694l6317l4008l1690k9765k7838k5464
62029G31657k2705j9873j7077j4337j1881j0071r061q744q930r402r920j0282
62017E79374j0405j0194r535q546p665p249p111o728n862m755l669k490r53Q47
62003D95059K452L564M384N317O403P249P514P245O646N684M193K244J34j968
61989E56120m119o233p922q863r182r286r386r381r158q914r002r451r678r007
61975D36538p497o034n299m943m156k879j888j687j921k042j974j805j376n60
$$ plain form
62063 1058955 1073446 1089364 1106499 1124680 1144367 1165829 1188061 1209161 1227788 1243754 1257089
62052 1257089 1267120 1272860 1273973 1270885 1264000 1253169 1237975 1218273 1194263 1166291 1134888 1100936
62040 1100936 1065491 1029218 992181 954433 916739 880422 846414 814724 784959 757121 731657
62029 731657 708952 689079 672002 657665 645784 635713 626652 617908 608978 599576 589656 579374
62017 579374 568969 558775 549240 540694 533029 525780 518669 511941 506079 501324 497655 495165 494212 495059
62003 495059 497511 501075 505459 510776 517179 524428 531942 539187 545833 551517 555710 557954 558088 556120
61989 556120 552001 545768 537846 528983 519801 510515 501129 491748 482590 473676 464674 455223 445545 436538
61975 436538 429041 423007 417708 412765 408609 405730 403842 402155 400234 398192 396218 394413 393037 392477
61961C92477L52J033J570K176K719K964L088L436M029M657N293N945O315O156
61947D42210N839O143P447R520J1962J4387J6293J7428J8250J9443K0950K2052
61935F11924K2495K2834K3462K3964K3841K3328K2941K2632K1831K0148J7647
61924H57047J4583J1238P847M407P12l165o623r013j0270j0682j0324r042o928
61911H29787m412j790J061M402Q192J1998J5238J7562J9018J9753J9616J8212
61899I58637J5427J1655P386K770k188p213j1856j5829j9041k1372k2690k3098
61887H72588k2963k2682k2519k2498k2300k1398j9638j7683j6580j6695j7248
61876F50384j7105j5947j4448j3284j2264j0798r027p854p617p330n853l378j040
$$ plain form
61961 392477 392829 393862 395432 397608 400327 403291 406379 409815 413844 418501 423794 429739 436054 442210
61947 442210 448049 454192 461639 471159 483121 497508 513801 531229 549479 568922 589872 611924
61935 611924 634419 657253 680715 704679 728520 751848 774789 797421 819252 839400 857047
61924 857047 871630 882868 890715 895122 895834 892669 886046 877033 866763 856081 845757 836715 829787
61911 829787 825375 823585 824646 829048 837240 849238 864476 882038 901056 920809 940425 958637
61899 958637 974064 985719 993105 995875 993687 986474 974618 958789 939748 918376 895686 872588
61887 872588 849625 826943 804424 781926 759626 738228 718590 700907 684327 667632 650384
61876 650384 633279 617332 602884 589600 577336 566538 557511 549657 542040 534710 528857 525479 524439
61863E24439O96K335M062N271N808O639Q647J1430J4098J6612J9487K2659K5677
61850F67860K8684L2124L5618L8108L9317M0051M0813M0988L9811L7311L3821
61839A074506K9230K3398J6906J0656M903p55o461j1556j5026j6350j5853j4263
61827A079335j1870q236l037L027Q572J2804J5962J8344J9507J8741J5852J1177
61815A180178N190j503q227j4701k1169k7637l3302l7176l9109l9785l9940l9893
61803H82926l9544l8368l5759l1970k8403k6251k5022k3135k0035j6883j4928
61792E82628j4020j3143j1841j0500r531q842q125p283o485n941n634n269m661
61779D71353m071l917m114m071l513k881k677k778k742k526k422k449k269j695
$$ plain form
61863 524439 525135 527470 531532 536803 542611 549250 557897 569327 583425 600037 619524 642183 667860
61850 667860 696544 728668 764286 802394 841711 881762 922575 963563 1003374 1040685 1074506
61839 1074506 1103736 1127134 1144040 1154696 1159599 1158844 1152383 1140827 1125801 1109451 1093598 1079335
61827 1079335 1067465 1059229 1056192 1059219 1067791 1080595 1096557 1114901 1134408 1153149 1169001 1180178
61815 1180178 1185368 1183865 1175638 1160937 1139768 1112131 1078829 1041653 1002544 962759 922819 882926
61803 882926 843382 805014 769255 737285 708882 682631 657609 634474 614439 597556 582628
61792 582628 568608 555465 543624 533124 523593 514751 506626 499343 492858 486917 481283 476014 471353
61779 471353 467282 463365 459251 455180 451667 448786 446109 443331 440589 438063 435641 433192 430923 429228
61765D29228r23k24K89N80O61O66P44Q51Q91R84J268J465J076J74m26m6J031J865
61747D40154J846J092J36m91n44j81J71K59J77%m22r92j094l62N24N46j33k05
61729D40481R67K377K744K220J976K506L212L577L873M503N264N619N371M773
61715D89463M227L966L878L535K636J398K47p59j803k668k864k519k527l432m642
61700D88136n240n160n004m993m730l982l105k595k596k924l259l240k727k027
61686D36554j669j759j844j513r55p80j276k036k284j665o32J2j6k87l47k87m13
61669D18803o97r14j125j458j556q41N19J524J483Q45N07O73Q53P34N28M01J57
61652D20436l11n65j26P59J212P87P9PP31J601K123K511L188M065M612M391L332
$$ plain form
61765 429228 428305 428081 428370 428950 429611 430277 431021 431872 432763 433747 435015 436480 437556 437730 437304 437258 438289 440154
61747 440154 442000 443092 443228 442737 442193 442012 442183 442442 442619 442619 442197 441205 440111 439749 440273 440819 440686 440481
61729 440481 441448 443825 446569 448789 450765 453271 456483 460060 463933 468436 473700 479319 484690 489463
61715 489463 493690 497656 501534 505069 507705 509103 509350 508591 506788 504120 501256 498737 496210 492778 488136
61700 488136 482896 477736 472732 467739 463009 459027 455922 453327 450731 447807 444548 441308 438581 436554
61686 436554 434885 433126 431282 429769 428814 428034 426758 424722 422438 420773 420141 420153 420137 419850 419503 419216 418803
61669 418803 418106 417192 416067 414609 413053 412212 412731 414255 415738 416583 417090 417763 418616 419350 419878 420279 420436
61652 420436 420125 419560 419434 420193 421405 422192 422271 422278 423009 424610 426733 429244 432432 436497 441109 445500 448832
61635D48832J741K43n09n13n84j471k924m038m378m331m373m433m134l225j773
61620D14130k22P26P03K47K67R50J599J677J340P86k76k013l911n339o272o906
61604C97486p037o451n660n450n770n783n098m238l771l572l249k831k665k869
61590C33042l196l305l048k607k373k558k944l185l278l428l556l400l055k888
61576B90221k843k380j451q40j133j737j584n44M79P57M08j30p13j260j442j004
61560B74804k39J79j33r15j490j307m03N31O96k7q34p48L82J754K486K448K128
61543B79312J843J426O80r8l80l8O00J311K239L393M228M083K966J557M67k17
61527C03372o78j033j336j693k110k458k732l100l554l699l158k080r28N4Q80
$$ plain form
61635 448832 450573 450816 450307 449794 449210 447739 444815 440777 436399 432068 427695 423262 419128 415903 414130
61620 414130 413908 414634 415337 415584 415851 416801 418400 420077 421417 422203 421927 419914 416003 410664 404392 397486
61604 397486 390449 383998 378338 372888 367118 361335 356237 351999 348228 344656 341407 338576 335911 333042
61590 333042 329846 326541 323493 320886 318513 315955 313011 309826 306548 303120 299564 296164 293109 290221
61576 290221 287378 284998 283547 282707 281574 279837 278253 277709 278188 278945 279353 279223 278510 277250 275808 274804
61560 274804 274565 274744 274611 273696 272206 270899 270496 271027 271723 271696 270862 270114 270496 272250 274736 277184 279312
61543 279312 281155 282581 283261 283163 282783 282745 283345 284656 286895 290288 294516 298599 301565 303122 303589 303372
61527 303372 302694 301661 300325 298632 296522 294064 291332 288232 284678 280979 277821 275741 274813 274867 275747
61512B75747J373J150K23p87j258j235j217j432j616j490j191j089j296j499j308
61497B63075p36j82kj44l32m40n53o76o33l03J51M07K14m37j177j395p89J82P53
61478B56983Q38J100J887K663K841K781L189L924M090L297K070R65jp80r37k95
61462B84615N51R02P65N16J97l14p49o89k82q5j88j01M28J027J300J338J370J330
61444B91931J094Q56Q84J064J074R73J255K216L524M480M671M250L656L177K767
61429C27872K263J654J111P77O45O34O96Q15R43J017R98R73J168J793K746L576
61413C49681L865L686L409L105K396J065m46j474j951k362k929l235k931k389
61399C49490k260k491k405j820j524k254l494l871k772j039Q1L30L98P15Q64L00
$$ plain form
61512 275747 277120 278270 278493 277706 276448 275213 273996 272564 270948 269458 268267 267178 265882 264383 263075
61497 263075 262339 262157 262155 262011 261679 261239 260686 260010 259377 259074 259225 259632 259846 259409 258232 256837 256048 256230 256983
61478 256983 257821 258921 260808 263471 266312 269093 272282 276206 280296 283593 285663 286628 286627 285847 284910 284615
61462 284615 285166 286068 286833 287349 287546 287232 286483 285794 285512 285427 285239 285138 285566 286593 287893 289231 290601 291931
61444 291931 293025 293881 294765 295829 296903 297876 299131 301347 304871 309351 314022 318272 321928 325105 327872
61429 327872 330135 331789 332900 333677 334322 334956 335652 336467 337410 338427 339425 340398 341566 343359 346105 349681
61413 349681 353546 357232 360641 363746 366142 367207 366761 365287 363336 360974 358045 354810 351879 349490
61399 349490 347230 344739 342334 340514 338990 336736 333242 329371 326599 325560 325641 325971 326369 327084 327948 328248
61383C28248p08j298j084n49j88K27J104K010K029J174O43J193J947J578K26p20
61367C35832n72k4K71P10J777K944L271K689J936J545J589K174L362M641N185
61352C67330M845M439M815O016P408Q353Q626Q433Q185Q069P922P592P249P035
61338D66317O646N735M662M239M641N118M950M233L487K926K367J578M10j126
61324E16183k672l680l986l998m109m184l925l399k868k309j550p55k80n9M58
61309D78867J643L242M729N847O681P337P761P862P643P231O692N888M586K797
61295E58806R19o41j915l249m698n826o254o222o249o405o283n782n366n316n090
61280D90429m031k496j580j599j567n64R20J680J468J294K055L507M777N393N491
$$ plain form
61383 328248 327540 326242 325158 324609 324421 324648 325752 327762 329791 330965 331608 332801 334748 336326 336552 335832
61367 335832 335260 335236 335507 336217 337994 340938 344209 346898 348834 350379 351968 354142 357504 362145 367330
61352 367330 372175 376614 381429 387445 394853 403206 411832 420265 428450 436519 444441 452033 459282 466317
61338 466317 472963 478698 483360 487599 492240 497358 502308 506541 510028 512954 515321 516899 517309 516183
61324 516183 513511 509831 505845 501847 497738 493554 489629 486230 483362 481053 479503 478748 478468 478409 478867
61309 478867 480510 483752 488481 494328 501009 508346 516107 523969 531612 538843 545535 551423 556009 558806
61295 558806 559725 559084 557169 553920 549222 543396 537142 530920 524671 518266 511983 506201 500835 495519 490429
61280 490429 486398 483902 482322 480723 479156 478592 479512 481192 482660 483954 486009 489516 494293 499686 505177
61265E05177N321M920M333L844L873M610N818P137Q467R845J0979J1281J0590
61252E96195R493Q622P984P287O579O039N446M474L318K388J486l1k177m102n134
61237F47867n529n958o679p410p720p363o583o018n941n731m634k913j560q62
61223E72966j43R11J698J826J919K608L508L906L837L731L521K922K242K011K084
61208F09547J907J498J322J333R29Op00n22M16J560K598L605M857O615Q779J0756
61192F54506J1968J2512J3066J4090J5328J6073J5705J4124J1877R850Q583P930
61180H05612P476P018O467N639M536L503K818K300J656Q90Q1r50k267l474m241
61165H37064m852n741o808p759q815j0329j2000j3179j3813j4338j4750j4556
$$ plain form
61265 505177 510498 515418 519751 523595 527468 532078 537896 545033 553500 563345 574324 585605 596195
61252 596195 605688 614310 622294 629581 636160 642199 647645 652119 655437 657825 659311 659280 657103 653001 647867
61237 647867 642338 636380 629701 622291 614571 607208 600625 594607 588666 582935 578301 575388 573828 572966
61223 572966 572823 573734 575432 577258 579177 581785 585293 589199 593036 596767 600288 603210 605452 607463 609547
61208 609547 611454 612952 614274 615607 616536 616542 615842 615320 615736 617296 619894 623499 628356 634971 643750 654506
61192 654506 666474 678986 692052 706142 721470 737543 753248 767372 779249 789099 797682 805612
61180 805612 813088 820106 826573 832212 836748 840251 843069 845369 847025 847915 847996 847046 844779 841305 837064
61165 837064 832212 826471 819663 811904 803089 792760 780760 767581 753768 739430 724680 710124
61153G10124j3612j2312j0904r363p905o866o047m930l693l132l514m282n103
61140F18461o323p989r280r509r077q802q763q360p207n516l785k423j437l16
61126E29674J432L550N261O380P609R431J1324J2538J3199J4133J5829J8034K0212
61113F68606K2027K3470K4718K5821K6582K6929K7251K7915K8550K8400K7334
61102I57603K5872K4120K1633J8463J5438J2861R868N677P98l675p332j0371j2866
61089A058089j4991j7404k0432k3184k4353k3870k2974k2726k3091k3423k3242
61078H18399k2496k1554k0906k0549j9843j8336j6454j4896j3671j2324j0751
61067F26619r153p471n556l765k628k033j425p04k02J67R47K250L597M709N755
$$ plain form
61153 710124 696512 684200 673296 663933 656028 649162 643115 638185 634492 631360 627846 623564 618461
61140 618461 612138 604149 594869 585360 576283 567481 558718 550358 543151 537635 533850 531427 529990 529674
61126 529674 531106 534656 539917 546297 553906 563337 574661 587199 600398 614531 630360 648394 668606
61113 668606 690633 714103 738821 764642 791224 818153 845404 873319 901869 930269 957603
61102 957603 983475 1007595 1029228 1047691 1063129 1075990 1085858 1091535 1092333 1088658 1081326 1070955 1058089
61089 1058089 1043098 1025694 1005262 982078 957725 933855 910881 888155 865064 841641 818399
61078 818399 795903 774349 753443 732894 713051 694715 678261 663365 649694 637370 626619
61067 626619 617466 609995 604439 600674 598046 596013 594588 593884 593682 593849 594796 597046 600643 605352 611107
61052F11107O725P269P429P833Q925J0523J2348J4368J6420J8062J9172K0167
61040G60348K1416K2821K4243K5857K7779K9802L1766L3778L5844L7748L9531
61029A090933M1569M3891M5906M7212M8124M9054M9937N0763N2193N4914N8761
61018A633257O3154O8114P4206Q1656R0287J00255J12144J26450J43786J65713
61008B659022J94741K33393K84079L49883M34385N39992O66981Q13952R77166
60999G153594J148297J315011J466133J593446J681918J697241J593330J346481
60991A8995451R88537O02066K75891O0554m0213m9738n087L7770N440j62375m71182
60980B0237114q60124j235518j520396j680976j720808j662389j534859j368480
$$ plain form
61052 611107 617832 625101 632530 640363 649288 659811 672159 686527 702947 721009 740181 760348
61040 760348 781764 804585 828828 854685 882464 912266 944032 977810 1013654 1051402 1090933
61029 1090933 1132502 1176393 1222299 1269511 1317635 1366689 1416626 1467389 1519582 1574496 1633257
61018 1633257 1696411 1764525 1838731 1920387 2010674 2110929 2223073 2349523 2493309 2659022
61008 2659022 2853763 3087156 3371235 3721118 4155503 4695495 5362476 6176428 7153594
60999 7153594 8301891 9616902 11083035 12676481 14358399 16055640 17648970 18995451
60991 18995451 19983988 20586054 20861945 20922499 20882286 20832548 20827461 20865231 20870671 20708296 20237114
60980 20237114 19376990 18141472 16621076 14940100 13219292 11556903 10022044 8653564
60972H653564j189309j014645q53532p10878n89513m89157m06506l38087k82340
60963B779597k38423k04234j76753j53728j34252j17968j04485r3260q3457p4196
60953A398841o5299n7421n0952m5268l9647l4415l0448k7880k6148k4994k4484
60942I71885k4171k3167k1316j9438j8201j7369j6450j5499j4939j4985j5455
60931G70895j5840j5490j4184j2566j1602j1465j1394j0726r574q397p436o830
60919F35391o748p055p174o598n387l977k809k179k132k284k075j336l97M09J019
60904E86668J394J486J536J995K960M052M975N767O426O762O783O791O913P034
60890F51542P318Q178R438J0097R505Q268P503P526P845Q096Q432R087J0033J1030
$$ plain form
60972 8653564 7464255 6449610 5596078 4885200 4295687 3806530 3400024 3061937 2779597
60963 2779597 2541174 2336940 2160187 2006459 1872207 1754239 1649754 1556494 1473037 1398841
60953 1398841 1333542 1276121 1225169 1179901 1140254 1105839 1075391 1047511 1021363 996369 971885
60942 971885 947714 924547 903231 883793 865592 848223 831773 816274 801335 786350 770895
60931 770895 755055 739565 725381 712815 701213 689748 678354 667628 658054 649657 642221 635391
60919 635391 628643 621588 614414 607816 602429 598452 595643 593464 591332 589048 586973 585637 585240 585649 586668
60904 586668 588062 589548 591084 593079 596039 600091 605066 610833 617259 624021 630804 637595 644508 651542
60890 651542 658860 667038 676476 686573 696078 704346 711849 719375 727220 735316 743748 752835 762868 773898
60876G73898J1700J1741J1383J1354J2066J3030J3488J3386J3270J3334J3194
60865I11844J2555J1638J0768R973R113Q183P200N966M142J623j250l863n795
60852I82097p105q140r140j0172j1354j2792j4297j5441j6018j6229j6376j6635
60840H28398j7090j7665j8021j7925j7750j8091j8777j8913j8138j7196j6789
60829F32043j6495j5452j3662j1922j0770j0143r860r767r477q652p534o681o125
60816D95503n373m313l510l418l761l943l739l310k755k050j329r72j236j782
60802D54012j777p82N49J029L69m55n29j57j99p06r67o84l24k64l36m03p11j360
60784D46305j931k041j852j712j568j211q77j170k323l823m832m848l956k636
$$ plain form
60876 773898 785598 797339 808722 820076 832142 845172 858660 872046 885316 898650 911844
60865 911844 924399 936037 946805 956778 965891 974074 981274 987240 991382 993005 991755 987892 982097
60852 982097 974992 966852 957712 947540 936186 923394 909097 893656 877638 861409 845033 828398
60840 828398 811308 793643 775622 757697 739947 721856 703079 684166 666028 648832 632043
60829 632043 615548 600096 586434 574512 563742 553599 543739 533972 524495 515843 508309 501628 495503
60816 495503 490130 485817 482307 478889 475128 471185 467446 464136 461381 459331 458002 457030 455794 454012
60802 454012 452235 451453 452002 453031 453400 452945 452416 452259 452060 451354 450387 449703 449379 449115 448779 448376 447665 446305
60784 446305 444374 442333 440481 438769 437201 435990 435113 433943 431620 427797 422965 418117 414161 411525
60770D11525j455q64r52j319j352r05n85r73j670j641o82R2l48j583k426k583
60754C92279k742l199l295k497j310o07n13m72q6M78R27J257J683K242K552K116
60738C88813R05m20j142j227j199j350j498j476j413j426j362j172j156j579k192
60723C71106k514k476k502k900l345l187k257j253j119k008l083l459l091k490
60709C35422j942j472j333j861k732k975k077o54K27Q7p77j759k232j769n50N56
60693C14159P53J51m43n01k36n7M7L83R80J458J519J384J524J995K319K190J974
60676C29599K186K681K833K498K226K466L008L438L634L571L118K455K200K521
60662C68434K567J528L3l83O92J882J772O10k18P7J086J993K352K157J710J465
$$ plain form
60770 411525 410070 409206 408254 406935 405583 404678 404093 403120 401450 399809 399127 399219 398871 397288 394862 392279
60754 392279 389537 386338 383043 380546 379236 378629 378116 377644 377558 378036 378963 380220 381903 384145 386697 388813
60738 388813 389718 389298 388156 386929 385730 384380 382882 381406 379993 378567 377205 376033 374877 373298 371106
60723 371106 368592 366116 363614 360714 357369 354182 351925 350672 349553 347545 344462 341003 337912 335422
60709 335422 333480 332008 330675 328814 326082 323107 321030 320376 320603 320690 319913 318154 315922 314153 313603 314159
60693 314159 314912 315063 314620 314119 313883 313826 313873 314256 315236 316694 318213 319597 321121 323116 325435 327625 329599
60676 329599 331785 334466 337299 339797 342023 344489 347497 350935 354569 358140 361258 363713 365913 368434
60662 368434 371001 372529 372562 372179 372871 374753 376525 377135 376917 376994 378080 380073 382425 384582 386292 387757
60646C87757J609J770J456P53J36l37j114k337l487m073m197m127l830l282k867
60631C63830k877l019k868k567k464k384j906j211q57q10n51j31k22q98j302q90
60615C38873j73K00L64N88N53J0m51j57N81J000J035J080J014M63k25l30Mol25
60596C44098k2J095J919J668J063J207K046K704K807K658K381J745P31k65r14
60581C64921j238j396j387r97J0J510K810L242L037L213M379O047P428Q399R300
60566D09278J0214J1013J1816J2675J3070J2276J0288P779N156K293p16l243m835
60553D97064n726o264o347n847n156m563l443r48K470N124O072O298P318R210
60539D95262J0869J1747J2316J2851J2868J2078J0958R816Q071N176J700j225
$$ plain form
60646 387757 389366 391136 392592 393345 393481 393144 392030 389693 386206 382133 377936 373809 369979 366697 363830
60631 363830 360953 357934 355066 352499 350035 347651 345745 344534 343677 342867 342316 342185 341963 341065 339763 338873
60615 338873 338700 338900 339264 339852 340405 340415 339964 339807 340388 341388 342423 343503 344517 344980 344755 344425 344429 344423 344098
60596 344098 344076 345171 347090 348758 349821 351028 353074 355778 358585 361243 363624 365369 366100 365835 364921
60581 364921 363683 362287 360900 359903 359913 361423 364233 367475 370512 373725 378104 384151 391579 399978 409278
60566 409278 419492 430505 442321 454996 468066 480342 490630 498409 503565 505858 505142 501899 497064
60553 497064 491338 485074 478727 472880 467724 463161 459718 458770 461240 466364 472436 478734 486052 495262
60539 495262 506131 517878 530194 543045 555913 567991 578949 588765 596836 602012 603712 602487
60527F02487l170m389n005n003m757m745m778m313l466k920k851k698k128j423
60513E50841q07j41N36Q67R20J348K522M045N471O957Q922J1585J5047J9245K3612
60498F50970K7456L0952L5056M0068M4959M8530N0549N1185N0098M6708M0815
60487A117346L2373K1338Q416m762j7006k8489l9436m8592n4158n5901n5153n2957
60475H23019m9453m5000m0601l6809l3195k9315k5407k1887j8867j6456j4766
60464D91263j3406j1673r610q132p710p652p112o159n339m737m164l776l870m271
60450C93652m489m320l857l155k275j504j090r19p63o38o61p55q44j097j574j902
60434C63809j720j229q21m82r5p9q98k024k267j307j87R8k35l94k03OJ68M15N50
$$ plain form
60527 602487 599317 594928 589923 584920 580163 575418 570640 566327 562861 559941 557090 554392 552264 550841
60513 550841 550034 549893 550429 551296 552216 553564 556086 560131 565602 572559 581481 593066 608113 627358 650970
60498 650970 678426 709378 744434 784502 829461 877991 928540 979725 1029823 1076531 1117346
60487 1117346 1149719 1171057 1179473 1174711 1157705 1129216 1089780 1041188 987030 931129 875976 823019
60475 823019 773566 728566 687965 651156 617961 588646 563239 541352 522485 506029 491263
60464 491263 477857 466184 456574 448442 440732 433080 425968 419809 414470 409733 405569 401793 397923 393652
60450 393652 389163 384843 380986 377831 375556 374052 372962 372043 371280 370642 369981 369226 368382 367285 365711 363809
60434 363809 362089 360860 360039 359557 359462 359383 358485 356461 354194 352887 352700 352798 352563 352169 351966 351972 352140 352555 353105
60415C53105L48K07P26J647K033J612J143J204J365J012L53nO8L73R79J906K588
60398C70664K437J811J588J802J612P31j5J29Q38J409J781K166K289J697O57L9
60382C91635L17J184K150L005L608L682L021J825O50M5J75P52J348J785K048J973
60366D19203J424P89P59J377J752J159Mp04o30k27J73P82J789K867L546L802M059
60349D41924M652N445O030O322O730P509Q084P509N651L421J641K73j050k301
60335E01840l346m325n221n480m774l741l272l390l529l550l628l422k415j044
60321D50703n13j193k137k415k097j580p79M36J637K292K499K805L550M776O463
60306D64447Q518J0713J2887J5005J6926J8404J9392J9864J9281J6816J2451P275
$$ plain form
60415 353105 353453 353660 354386 356033 358066 359678 360821 362025 363390 364402 364755 364750 364818 365191 366170 368076 370664
60398 370664 373101 374912 376500 378302 379914 380645 380630 380759 381597 383006 384787 386953 389242 390939 391596 391635
60382 391635 391952 393136 395286 398291 401899 405581 408602 410427 411077 411122 411297 412049 413397 415182 417230 419203
60366 419203 420627 421416 422175 423552 425304 426463 426467 425763 425133 424906 425079 425861 427650 430517 434063 437865 441924
60349 441924 446576 452021 458051 464373 471103 478612 486696 494205 499856 503277 504918 505191 504141 501840
60335 501840 498494 494169 488948 483468 478694 474953 471681 468291 464762 461212 457584 454162 451747 450703
60321 450703 450190 448997 446860 444445 442348 440768 439989 440425 442062 444354 446853 449658 453208 457984 464447
60306 464447 472965 483678 496565 511570 528496 546900 566292 586156 605437 622253 634704 641979
60294F41979K328k353p082j1530j4980j7218j8447j8592j7402j5228j2983j1200
60282D97292r577p622n337l164j612j008j386k343l258l758l862l739l477l205
60268D43944l124l240l176k563j605j054j412k318k935k907k641k587k581k209
60254D09592j498q64n01k98k64n34q66o48K81J267J512R22M0n52o10k32K34M44
60236D07425M37N50R04J209J250J220J358J562J624J611J717J970K317K795L296
60221D31245L418K883J909R69L40J70O60J727K729L041K826K787L251L941M598
60206D66494N269N952O397O491O402O238N914N536N459N756N974N739N243M763
60192E47627M042K714J196M68Q26J383J129J19q13j265j621k244k906l313l689
$$ plain form
60294 641979 644307 641954 634872 623342 608362 591144 572697 554105 536703 521475 508492 497292
60282 497292 487715 480093 474756 471592 469980 468972 467586 465243 461985 458227 454365 450626 447149 443944
60268 443944 440820 437580 434404 431841 430236 429182 427770 425452 422517 419610 416969 414382 411801 409592
60254 409592 408094 407230 406729 406431 406167 405633 404767 404119 404400 405667 407179 408101 408141 407589 406979 406747 406981 407425
60236 407425 407862 408412 409316 410525 411775 412995 414353 415915 417539 419150 420867 422837 425154 427949 431245
60221 431245 434663 437546 439455 440424 440764 440934 441594 443321 446050 449091 451917 454704 457955 461896 466494
60206 466494 471763 477715 484112 490603 497005 503243 509157 514693 520152 525908 531882 537621 542864 547627
60192 547627 551669 554383 555579 556047 556873 558256 559385 559504 558691 557426 555805 553561 550655 547342 543653
60177E43653m422n318n743n476m941m592m387m103l762l487l179k678k080j651
60163D87834j436j271j072r27q74p96n68j79L25R30J565K024K076J645J023P29
60147D91028J048J632J811J425J141J722L160M720N732O062N933N707N825O530
60133E43476P437P672O704M920L237K292K128K426K678K419J631Q90P11Q04M88
60118E89913j85l33M21J209J074M01L51J130J733J489R30P46O65J8j066j820j954
60101E94722j962k383l195m021m503m486m116l762l576l223k298r34K71Q72Q67
60086E58273N40L23N97J354K106K429K428K421K352J993J418Q57K29o25j442j821
60070E73432j909k158k620l078l800n222o905p742p435o894o829o828o360n818
$$ plain form
60177 543653 539231 533913 528170 522694 517753 513161 508774 504671 500909 497422 494243 491565 489485 487834
60163 487834 486398 485127 484055 483128 482254 481458 480890 480711 481036 481966 483531 485555 487631 489276 490299 491028
60147 491028 492076 493708 495519 496944 498085 499807 502967 507687 513419 519481 525414 531121 536946 543476
60133 543476 550913 558585 565289 570209 573446 575738 577866 580292 582970 585389 587020 587910 588621 589425 589913
60118 589913 589728 589395 589816 591025 592099 592500 592851 593981 595714 597203 598133 598879 599544 599562 598496 596676 594722
60101 594722 592760 590377 587182 583161 578658 574172 570056 566294 562718 559495 557197 556263 556534 557406 558273
60086 558273 558813 559136 559733 561087 563193 565622 568050 570471 572823 574816 576234 577091 577320 576695 575253 573432
60070 573432 571523 569365 566745 563667 559867 554645 547740 539998 532563 525669 518840 512012 505652 499834
60056D99834n844o213o149n368m231l125k290j922j882j557n50P16J542J908K368
60041D67237L219M223N090N710O009N939N604N144M596M098L896L939L659K595
60027E30958R50o38j743k291k498k930m165n940p139p170o854p260q120q310p569
60012D59281o714o199n544m428l425l164l410l494l188k741k383k132j905j523
59998D09031p60L63J506K278K454J993J173O54J011K027K859L001K783K782L112
59983D36267L510L791L909L767L277K477J498M65m25r58j160j316j635k004k189
59968D49274k114j805j309p62l88j96J58R00J619J581O59k94l29M76J112Q78K43
59951D49703J04N90R85P98M11M85J174K096K774K905K473J818J329R03L1j411
$$ plain form
60056 499834 493990 487777 481628 476260 472029 468904 466614 464692 462810 461253 460703 461419 462961 464869 467237
60041 467237 470456 474679 479769 485479 491488 497427 503031 508175 512771 516869 520765 524704 528363 530958
60027 530958 531908 531270 529527 527236 524738 521808 517643 511703 504564 497394 490540 483280 475160 466850 459281
60012 459281 452567 446368 440824 436396 432971 429807 426397 422903 419715 416974 414591 412459 410554 409031
59998 409031 408271 408634 410140 412418 414872 416865 418038 418692 419703 421730 424589 427590 430373 433155 436267
59983 436267 439777 443568 447477 451244 454521 456998 458496 458961 458536 457578 456418 455102 453467 451463 449274
59968 449274 447160 445355 444046 443284 442896 442700 442858 443758 445377 446958 447617 447323 446994 447470 448582 449460 449703
59951 449703 449807 450397 451382 452180 452591 453076 454250 456346 459120 462025 464498 466316 467645 468548 468579 467168
59935D67168k805l516l591l401l061k599k299k344k400k112j736j711j811j385
59921D32397l35P76J542K047K457K825L289L877M190L873L439L825N080O145O159
59906D81586N299M168L038K063J540J439J200M92k59o08q23j349j870j635o03
59891D93678M18Q14Q02R75J607K589L663M499M790M578M293M311M474M309L752
59876E39552L376L671M265M239L200J677L44p12j703k538k992l264l774m576n347
59861E35418n879o076n600m221k485j351r41l34J084K716L680M109M846O146P400
59846E38512Q074Q269Q180P538O037M039K435J714J447Q30l63j617k380k667k863
59831E77185l200l647m141m657n068n140m707l843k949k639l304m617n745o150
$$ plain form
59935 467168 464363 460847 457256 453855 450794 448195 445896 443552 441152 439040 437304 435593 433782 432397
59921 432397 432062 432838 434380 436427 438884 441709 444998 448875 453065 456938 460377 464202 469282 475427 481586
59906 481586 486885 491053 494091 496154 497694 499133 500333 500825 500566 499958 499135 497786 495916 494281 493678
59891 493678 494096 494910 495712 496687 498294 500883 504546 509045 513835 518413 522706 527017 531491 535800 539552
59876 539552 542928 546599 550864 555103 558303 559980 560324 559612 557909 555371 552379 549115 545341 540765 535418
59861 535418 529539 523463 517863 513642 511157 509806 508865 508531 509615 512331 516011 520120 524966 531112 538512
59846 538512 546586 554855 563035 570573 576610 580649 583084 584798 586245 587075 586712 585095 582715 580048 577185
59831 577185 573985 570338 566197 561540 556472 551332 546625 542782 539833 537194 533890 529273 523528 517378
59817E17378n970n484m620l312j967j150j014j360j923k329k144j387o71m18l72
59802D83257k99n57j275j666j150n74j141k420k847k032j235j344j877k283k801
59787D59756l366l061j592k44l12j321j827j435r52r45j109r78n01N4L44K21j
59770D42731J70P08J147J511K378L698M432L984L098K614K212J343O17R71J978
59755D73592K367J956J753K135K340J972J771K341L119L298L093L315M128M892
59741E12072N094M877M558M066L065J590K46m05m69m61m80k14K49K73k92o71k74
59724E32824L59L68j00k35J53M66L25p6m85p94p64k42L60M66J31j06o6N1L53J126
59704E34114K067K436K101J686J538J326R01P12J048J471J461J148R86J141J415
$$ plain form
59817 517378 511408 505924 501304 497992 496025 494875 493861 492501 490578 488249 486105 484718 484047 483629 483257
59802 483257 482958 482401 481126 479460 478310 477736 476595 474175 471328 469296 468061 466717 464840 462557 459756
59787 459756 456390 453329 451737 451493 451181 449860 448033 446598 445646 444701 443592 442614 442113 442167 442511 442732 442731
59770 442731 442901 443609 444756 446267 448645 452343 456775 460759 463857 466471 468683 470026 470643 471614 473592
59755 473592 475959 477915 479668 481803 484143 486115 487886 490227 493346 496644 499737 503052 507180 512072
59741 512072 517166 522043 526601 530667 533732 535322 535568 535163 534694 534233 533753 533539 533788 534061 533769 533098 532824
59724 532824 533183 533551 533451 533216 533369 533835 534160 534084 533599 532805 532041 531799 532159 532625 532756 532650 532584 532635 532988 534114
59704 534114 536181 538617 540718 542404 543942 545268 546169 546881 547929 549400 550861 552009 552995 554136 555551
59689E55551J476R83n3r81j085n81l87q01j125q44m25l96m59j67M5o12k035l269
59671E44835l736l753l839m109m434m739m931m875m605m327m123l828l336k853
59657D87347k664k659k327j289J69J330J824J950K150K412K467K301K071J627
59643D96709O17q98k299l027k995k446j664r56n24k84r3j08n83j232j326o00L47
59626D78638P77N78J60j18j25O7J70j46q54j542j957k225k456k492k194j715j255
59609D63311q71o36n67k85P19K144K890K419J570J414J779J713J034M99N31P49
59593D78413R14J421K402L081K685J595R50J255J934K186J808J095L96r5l81p42
59577D98917j577k884m114m732m813m784m714m294l547l093l348l844l725k817
$$ plain form
59689 555551 557027 558010 557957 556976 555891 555310 554923 554122 552997 552153 551728 551332 550873 550706 550751 550139 548104 544835
59671 544835 541099 537346 533507 529398 524964 520225 515294 510419 505814 501487 497364 493536 490200 487347
59657 487347 484683 482024 479697 478408 478577 479907 481731 483681 485831 488243 490710 493011 495082 496709
59643 496709 497326 496428 494129 491102 488107 485661 483997 483041 482517 482233 482140 482032 481449 480217 478891 478291 478638
59626 478638 479415 479993 480153 480035 479910 479977 480147 480001 479147 477605 475648 473423 470967 468475 466281 464566 463311
59609 463311 462440 461804 461237 460952 461671 463815 466705 469124 470694 472108 473887 475600 476634 477133 477664 478413
59593 478413 479327 480748 483150 486231 488916 490511 491461 492716 494650 496836 498644 499739 500135 500040 499659 498917
59577 498917 497340 494456 490342 485610 480797 476013 471299 467005 463458 460365 457017 453173 449448 446631
59563D46631j757j148r40p42l85o6o8l81n35R3J511K716K549J105j40J21J620
59546D50184K952L236K948L101M087N493O876Q288R939J1705J3257J4586J5912
59533E52564J6947J6664J4199R800M688J54k992m421m295l186j598L58K536M252
59519F05670M798M337L651L029K008L82j342k774m302o391q649j0142j0455j0065
59505E69755r774j0024j0587j0711r819q263p047o640o377n461m050k945k436
59492D75621k073j456p40k83k23m35o08l36N82J830K858L455L830M203M581N031
59476D95837N768O836P841Q175P553O304N143M553M309L725K445Q97j68m15o0
59461E58743N30J068J368J490J915L172N199P287Q862J0031J1178J2273J2883
$$ plain form
59563 446631 444874 443726 442786 442044 441659 441593 441525 441144 440609 440702 442213 444929 447478 448583 448443 448564 450184
59546 450184 453136 456372 459320 462421 466508 472001 478877 487165 497104 508809 522066 536652 552564
59533 552564 569511 586175 600374 610174 614862 615016 612024 607603 603308 600122 598524 598882 601418 605670
59519 605670 610468 614805 618456 621485 623493 623875 622533 619759 615457 609066 600417 590275 579820 569755
59505 569755 559981 549957 539370 528659 518840 510577 503530 496890 490513 485052 481002 478057 475621
59492 475621 473548 472092 471352 471069 470846 470411 469803 469467 470049 471879 474737 478192 482022 486225 490806 495837
59476 495837 501605 508441 516282 524457 532010 538314 543457 548010 552319 556044 558489 559386 559218 558803 558743
59461 558743 559273 560341 561709 563199 565114 568286 573485 580772 589634 599665 610843 623116 635999
59448F35999J2877J2657J2514J2036J0524P962N116K536j58l615p669j1324j3727
59435F75728j4760j4717j3879j2598j1308j0225r234q244p349o479n216l291j022
59422E57406J066K868M678O746R077J1616J4303J6969J9369K1270K2466K2919
59410G10753K2983K3050K2626K0114J4199N467l722j1036j5471j7104j6368j3909
59398G41582j0592p034l345J91K333J444k933r386j5722k0505k3335k4199k3151
59385F05348k0695j7768j4994j2275r481p124n867n438m745l162j251Q8O88J062
59371E04386J535J919J993J875J877K140K529K769K712K545K715L515M704N643
59357E42857N874N652N828P035Q977J0648J1453J1849J2676J4072J5460J6496
$$ plain form
59448 635999 648876 661533 674047 686083 696607 704569 709685 712221 712063 708448 700779 689455 675728
59435 675728 660968 646251 632372 619774 608466 598241 589007 580763 573414 566935 561719 558428 557406
59422 557406 558472 561340 566018 572764 581841 593457 607760 624729 644098 665368 687834 710753
59410 710753 733736 756786 779412 799526 813725 819192 815470 804434 788963 771859 755491 741582
59398 741582 730990 723956 720611 720802 723135 724579 721646 712260 696538 676033 652698 628499 605348
59385 605348 584653 566885 551891 539616 530135 523011 517144 511706 506961 503799 502548 502636 503324 504386
59371 504386 505921 507840 509833 511708 513585 515725 518254 521023 523735 526280 528995 532510 537214 542857
59357 542857 548731 554383 560211 567246 576223 586871 598324 610173 622849 636921 652381 668877
59345F68877J7463J8570J9437J9594J9126J8414J7439J5810J3453J0856Q532O360
59333H53931L708J67l816p243r556j1203j3012j5161j7044j8072j8188j7626j6635
59320G10250j5541j4576j3469j1727r558p996p655p795p204n688m154l313k966
59307E98608k492j529l9J872L922N783P419R142J1174J3161J4216J3470J0690
59294F85397O440J661k946o977r997j1487j1373j0281q992p812o657n481m350
59281F07145l253k135j009J60J486K833L746M066M381N428P167Q900J0177J1094
59267F60186J1723J1803J1164R986Q488O711M767K882R40j606m994q453j0775
59254G02822j1532j1499j1710j2367j2811j2397j1146r507p779o007m276k810
$$ plain form
59345 668877 686340 704910 724347 743941 763067 781481 798920 814730 828183 839039 847571 853931
59333 853931 857639 857806 853990 846747 837191 825988 812976 797815 780771 762699 744511 726885 710250
59320 710250 694709 680133 666664 654937 645379 637383 629728 621933 614729 609041 604887 601574 598608
59307 598608 596116 594587 594548 596420 600342 606125 613544 622686 633860 647021 661237 674707 685397
59294 685397 691837 693498 690552 683575 673578 662091 650718 640437 631445 623633 616976 611495 607145
59281 607145 603892 601757 600748 600908 602394 605227 608973 613039 617420 622848 630015 638915 649092 660186
59267 660186 671909 683712 694876 704862 713350 720061 724828 727710 728650 727044 722050 713597 702822
59254 702822 691290 679791 668081 655714 642903 630506 619360 609853 602074 596067 591791 588981
59242E88981j691p27K84J334K344L353M420N487O379O851O577N386L645K147J371
59227F36141R81K73r79k413l657m791o135p761r226r844r334q184p184o550n855
59212E55482m870m025l686l427k479p65J015K217K673K352J186m98j807j982j150
59197E40236j60L43M27N25P82R92J082J301J859K577L164L614M068M476M766N095
59181E75147N487N426M464L127K441K471K282J589J388K333L449L449K706K787
59167F18546M328O383P764Q125P757P210P189Q005Q854Q412O375L791J696j8k026
59152G02391m463o856q740r930j0410j0269r706q950q231p740p422o881n876m807
59138E92110m300m295m076l235k150j380j012q34p00m87q9L15L39k1j88L82J640
$$ plain form
59242 588981 587290 586563 586847 588181 590525 593878 598298 603785 610164 617015 623592 628978 632623 634770 636141
59227 636141 637122 637395 636416 634003 630346 625555 619420 611659 602433 592589 583255 575071 567887 561337 555482
59212 555482 550612 546587 542901 539474 536995 536230 537245 539462 542135 544487 545673 545175 543368 541386 540236
59197 540236 540076 540419 540846 541371 542153 543145 544227 545528 547387 549964 553128 556742 560810 565286 570052 575147
59181 575147 580634 586060 590524 593651 596092 598563 600845 602434 603822 606155 609604 613053 615759 618546
59167 618546 622874 629257 637021 645146 652903 660113 667302 675307 684161 692573 698948 702739 704435 704417 702391
59152 702391 697928 691072 682332 672402 661992 651723 642017 633067 624836 617096 609674 602793 596917 592110
59138 592110 587810 583515 579439 576204 574054 572674 571662 570828 570128 569641 569552 569867 570206 570185 569997 570379 572019
59121E72019L171M601N614N944N801N866O525P283P448P137P108P629Q164Q238
59107F62548Q057Q019P983P572O882O428O429O604O729O806O606N616L894K444
59093G52617K053K124J443j12j455j844j614j203n61J24L4j211k844m059n100
59078G38392o518p969q758r060r568j0238j0443j0142r890r777r327q492p734
59065F20476p116o283n419n192n541n493m563l508l234l674m182m395m337m190
59051E53349m253m571m471l179j162k9o07j911k483k156j824k048k489k472j653
59036E18041l28O59P85O58J381K978M233M435M299M660N230N528O199Q146J0873
59021E77777J2870J3610J4073J5175J6577J7227J6489J4509J1946R538P575N717
$$ plain form
59121 572019 575190 579791 585405 591349 597150 603016 609541 616824 624272 631409 638517 646146 654310 662548
59107 662548 670605 678624 686607 694179 701061 707489 713918 720522 727251 734057 740663 746279 750173 752617
59093 752617 754670 756794 758237 758125 756670 754826 753212 752009 751448 751572 751606 750395 747551 743492 738392
59078 738392 731874 723905 715147 706087 696519 686281 675838 665696 655806 646029 636702 628210 620476
59065 620476 613360 607077 601658 596466 590925 585432 580869 577361 574127 570453 566271 561876 557539 553349
59051 553349 549096 544525 540054 536875 535713 535684 535077 533166 530683 528527 526703 524655 522166 519694 518041
59036 518041 517713 518372 519157 519815 521196 524174 528407 532842 537141 541801 547031 552559 558758 566904 577777
59021 577777 590647 604257 618330 633505 650082 667309 683798 698307 710253 719791 727366 733083
59009G33083L543J233o02j613j973j990j840j538r27K21J845L505M826N798O423
58994G49994O450N772M742L697K530J121k23j298k533m384o487q087r010r594
58980G32690r850r552q982q764q840q323o633m079j338J122K963M039M750N745
58966F84948P086Q295R285J0488J1770J2106J0950R184P964P151N733L476J142
58953G89578q62l072n918q863j1056j2377j3319j4125j4542j4267j3244j1546
58941F66387r406p280n578m348l455l054l350l901l810k931k327k931m167m633
58927F05216l982l263l296l519k976j857j348k089l362l910l271k103j315j115
58913E67810r74n15l4J59N46J947M282O352P184P064O994P573Q793J0519J2519
$$ plain form
59009 733083 736626 737859 737257 735644 733671 731681 729841 728303 727376 727597 729442 732947 737773 743571 749994
58994 749994 756444 762216 766958 770655 773185 774306 774083 772785 770252 765868 759381 751294 742284 732690
58980 732690 722840 713288 704306 695542 686702 678379 671746 667667 666329 667451 670414 674453 679203 684948
58966 684948 692034 700329 709614 720102 731872 743978 754928 764112 772076 779227 784960 788436 789578
58953 789578 788716 785644 779726 770863 759807 747430 734111 719986 705444 691177 677933 666387
58941 666387 656981 649701 644123 639775 636320 633266 629916 626015 622205 619274 616947 614016 609849 605216
58927 605216 601234 597971 594675 591156 588180 586323 584975 582886 579524 575614 572343 570240 568925 567810
58913 567810 566836 566321 566287 566446 566992 568939 573221 579573 586757 593821 600815 608388 617181 627700 640219
58898F40219J4163J4675J3942J2744J2049J2142J2503J2553J2410J2832J4270
58887G84502J6194J7629J8262J8600J9053J9394J9194J8293J6579J3880J0380
58876I71960O752L429J07l618p479j0834j3479j5638j7389j8588j9198j9241j8492
58863H38292j6766j4474j2470j1234j0545r910r111q327q014q515r613j0573j0902
58850F97838j0871j0879j0639r551p851o655o634p215p340o673n678m927m725
58837E98200n166o063o794o723n896n080m835m865m544l896l556l753l788k900
58823E30341j279J54Q49J063J276J612J907K029J971J865J949K312K684K707K378
58808E53818J991J740J677J874K216K237J692J164J403K065J954O53q85j652j765
$$ plain form
58898 640219 654382 669057 682999 695743 707792 719934 732437 744990 757400 770232 784502
58887 784502 800696 818325 836587 855187 874240 893634 912828 931121 947700 961580 971960
58876 971960 978712 982141 982248 978630 971151 960317 946838 931200 913811 895223 876025 856784 838292
58863 838292 821526 807052 794582 783348 772803 762893 753782 745455 737441 728926 719313 708740 697838
58850 697838 686967 676088 665449 655898 648047 641392 634758 627543 620203 613530 607852 602925 598200
58837 598200 593034 586971 580177 573454 567558 562478 557643 552778 548234 544338 540782 537029 533241 530341
58823 530341 529062 529216 530065 531128 532404 534016 535923 537952 539923 541788 543737 546049 548733 551440 553818
58808 553818 555809 557549 559226 561100 563316 565553 567245 568409 569812 571877 573831 574484 573599 571947 570182
58793E70182j864k123k422k899l579l902l284j937o10K63P65J146J672K547L543
58778E57498M052L875L518L368L031K080R38K63j87j238k995m579n251n174m987
58763E54212n078n360n430m964m141l458k978k159p33P08J514J894K388K947L239
58748E32601L453L928M257L833L113L217M190M809M475M206N058O435O904O171
58734E96650N369N467O196O721O794O892P451Q244Q527P736O008M126K947K791
58720F81919L252L705L974M386N072N585N556N454O078P369Q311Q211P439O653
58706G62964N858M588K569j16l222o338r057j1328j3278j4667j5135j5085j5535
58693F72218j6721j7624j7361j6226j4871j3249j1172r175p931p272o652o045
$$ plain form
58793 570182 568318 566195 563773 560874 557295 553393 550109 548172 547562 547825 548590 549736 551408 553955 557498
58778 557498 561550 565425 568943 572311 575342 577422 578360 578623 578436 577198 574203 569624 564373 559199 554212
58763 554212 549134 543774 538344 533380 529239 525781 522803 520644 519911 520619 522133 524027 526415 529362 532601
58748 532601 536054 539982 544239 548072 551185 554402 558592 563401 567876 572082 577140 583575 590479 596650
58734 596650 602019 607486 613682 620403 627197 634089 641540 649784 658311 666047 672055 676181 679128 681919
58720 681919 685171 688876 692850 697236 702308 707893 713449 718903 724981 732350 740661 748872 756311 762964
58706 762964 768822 773410 775979 775863 772641 766303 757246 745918 732640 717973 702838 687753 672218
58693 672218 655497 637873 620512 604286 589415 576166 564994 555819 547888 540616 533964 527919
58681E27919n635n050l915k758k428k817l032k672k121j681j223n37N04J980L580
58666E00114M608M894N282O483P988Q824Q908Q700Q040O415M083J834j05j962
58652E74106l486m177m206m143m021l601l218l254l214k586k116k807l949l856
58638E25472k482j508j662j709o17R22J877K359K882L277L281L192L180K752J658
58623E42874N75K93P76J471J912J772J110Q00J830L871N543O281O869P666P698
58608E91341O237M178K871K436K123J554Q04j63j276k001j952j457j046q77j046
58593F01726j809l012l824l613k548j052O77K317L376L992N000O685Q250R040
58579F25205R368R590R284Q220P270P330P907P809O878O168O605Q149J0113J1818
$$ plain form
58681 527919 522284 517234 513319 510561 508133 505316 502284 499612 497491 495810 494587 494050 494554 496534 500114
58666 500114 504722 509616 514898 521381 529369 538193 547101 555801 563841 570256 574339 576173 576068 574106
58652 574106 570620 566443 562237 558094 554073 550472 547254 544000 540786 538200 536084 533277 529328 525472
58638 525472 522990 521482 519820 518111 517494 518416 520293 522652 525534 528811 532092 535284 538464 541216 542874
58623 542874 543449 543742 544518 545989 547901 549673 550783 551583 553413 557284 562827 569108 575977 583643 591341
58608 591341 597578 601756 604627 607063 609186 610740 611544 611381 610105 608104 606152 604695 603649 602772 601726
58593 601726 599917 596905 593081 589468 586920 585868 586545 588862 592238 596230 601230 607915 616165 625205
58579 625205 634573 644163 653447 661667 668937 676267 684174 691983 698861 705029 711634 719783 729896 741714
58565G41714J3127J4648J7070K0070K2474K3734K4482K5278K5719K5271K4117
58554I77704K2337J9283J4644R491N156J686j548m255n510n472n554o735q612
58541A012615j0330j1638j2784j3987j5428j7316j9620k1860k3318k3520k2481
58530H20333k0573j8142j5432j2827j0795r294p562n107k554q74m6O62J262J002
58516G20053j85j308j703j761j984k208k220k192k127j706j064r05j364j692j524
58501F96110j455j906k372k362k123j858j179q4N25J08n49m25M15J353K271L251
58485F89720L962M225M579N516O719P748Q828J0279J1819J3083J4163J5071J5266
58472H10978J4437J2989J1184Q575M944J045k345n234p640q936q845q221p925
$$ plain form
58565 741714 754841 769489 786559 806629 829103 852837 877319 902597 928316 953587 977704
58554 977704 1000041 1019324 1033968 1043459 1048615 1050301 1048753 1044498 1038988 1033516 1027962 1021227 1012615
58541 1012615 1002285 990647 977863 963876 948448 931132 911512 889652 866334 842814 820333
58530 820333 799760 781618 766186 753359 742564 733270 725708 720601 718047 717173 717127 717789 719051 720053
58516 720053 719868 718560 716857 715096 713112 710904 708684 706492 704365 702659 701595 700690 699326 697634 696110
58501 696110 694655 692749 690377 688015 685892 684034 682855 682771 683296 683404 682855 682430 682845 684198 686469 689720
58485 689720 693682 697907 702486 708002 714721 722469 731297 741576 753395 766478 780641 795712 810978
58472 810978 825415 838404 849588 858163 863107 864152 861807 856573 848933 839997 831152 822931 815006
58459H15006p618o517m604k290L84L293N749P375Q729J0222J1107J0467Q516O056
58445H65875L306J39l134n967q094r257r229q544q217q169p122m754k570j616
58431G92647p77J377M231O134O772P141P942R295J1258J3368J4408J3874J2845
58418I00515J2335J1679R766O817L659K89l427o650q588r753j0759j0958r816
58405H85109q498q331q582p700n878m543l978l335k411j568m46J405L178L812
58391H38234L812M310M953M519L075J652K82j673l749m795m825m587l845j959
58377H35404L24J648K250L400N074O189O692P408Q130P992P437P700Q608Q987
58363I17243R007R931J1698J2971J3464J4081J4787J4560J3439J2534J1981J0923
$$ plain form
58459 815006 807388 800871 796267 793977 794361 797654 803403 810778 819507 829729 840836 851303 859819 865875
58445 865875 869181 869320 866186 860219 852125 842868 833639 825095 816878 808709 801587 796833 794263 792647
58431 792647 791870 793247 797478 803612 810384 817525 825467 834762 846020 859388 873796 887670 900515
58418 900515 912850 924529 934295 941112 944771 945060 941633 934983 926395 916642 905883 894925 885109
58405 885109 876611 868280 859698 851998 846120 841577 837599 834264 831853 830285 829839 831244 834422 838234
58391 838234 842046 846356 851309 855828 858903 860555 860837 859164 855415 850620 845795 841208 837363 835404
58377 835404 835728 837376 839626 843026 848100 854289 860981 868389 876519 884511 891948 899648 908256 917243
58363 917243 926250 936181 947879 960850 974314 988395 1003182 1017742 1031181 1043715 1055696 1066619
58351A066619R401Q101O518L740Q86J67J491K603K767L555N632P485Q189Q861
58337A136015J0403J2037J3029J3880J4926J5566J5706J6124J6757J6432J4997
58326A295872J3867J3717J3408J1949R922Q263P035O083N431M751L651K714K907
58313A399570M018N159O510Q803J1356J2694J2940J3553J4860J5903J6534J7424
58301A539324J8186J7905J7343J8106J9716K0116J9094J8502J9019J9446J9364
58290A746121J9753K0636K0890K0694K1457K3090K4094K4549K6118K8826L0783
58279B007011L1429L2128L3301L4022L4618L6448L8794L9292L7915L7240L8362
58268B400560L9878M1278M3779M7304N0195N2429N5633N9566O2356O4364O7769
$$ plain form
58351 1066619 1076020 1084121 1090639 1094379 1095265 1095432 1096923 1099526 1102293 1105848 1111480 1118965 1127154 1136015
58337 1136015 1146418 1158455 1171484 1185364 1200290 1215856 1231562 1247686 1264443 1280875 1295872
58326 1295872 1309739 1323456 1336864 1348813 1358735 1366998 1374033 1380116 1385547 1390298 1393949 1396663 1399570
58313 1399570 1403588 1408747 1415257 1424060 1435416 1448110 1461050 1474603 1489463 1505366 1521900 1539324
58301 1539324 1557510 1575415 1592758 1610864 1630580 1650696 1669790 1688292 1707311 1726757 1746121
58290 1746121 1765874 1786510 1807400 1828094 1849551 1872641 1896735 1921284 1947402 1976228 2007011
58279 2007011 2038440 2070568 2103869 2137891 2172509 2208957 2247751 2287043 2324958 2362198 2400560
58268 2400560 2440438 2481716 2525495 2572799 2622994 2675423 2731056 2790622 2852978 2917342 2985111
58257B985111P2052P4298P4442P5471P7848P8685P7458P7392P9826Q2268Q3618
58246C838469Q6336R1617R7345J02576J09233J17599J25145J31521J39632J50020
58236D989493J59647J67879J77956J90620K02425K12599K25288K42340K60260
58227F828507K77134K96194L19411L44119L69215L98169M32493M68888N06243
58218A0240373N48637N98156O52050P10355P78526Q58904R47948J045851J160147
58209A7540947J295694J450481J625955J831765K075856K360805K695336L098706
58201C3975545L589804M186246M921422N850255P034453Q538948J0444893J2835433
58193I1376999J5741463J9098227K2740274K6403373K9734975L2357969L3931849
$$ plain form
58257 2985111 3057163 3131461 3205903 3281374 3359222 3437907 3515365 3592757 3672583 3754851 3838469
58246 3838469 3924805 4016422 4113767 4216343 4325576 4443175 4568320 4699841 4839473 4989493
58236 4989493 5149140 5317019 5494975 5685595 5888020 6100619 6325907 6568247 6828507
58227 6828507 7105641 7401835 7721246 8065365 8434580 8832749 9265242 9734130 10240373
58218 10240373 10789010 11387166 12039216 12749571 13528097 14387001 15334949 16380800 17540947
58209 17540947 18836641 20287122 21913077 23744842 25820698 28181503 30876839 33975545
58201 33975545 37565349 41751595 46673017 52523272 59557725 68096673 78541566 91376999
58193 91376999 107118462 126216689 148956963 175360336 205095311 237453280 271385129
58186B71385129L4066683L2147441K7421819J9541600R142235k201568j2719948
58179C78783391k1223333k7289138l0956038l2437087l2071945l0331636k7719516
58172A76754698k4657531k1465668j8386339j5579310j3113938j1000666r228219
58165F3323027p767549o568318n578134m760662m087446l526406l050562k647495
58157B5336455k309643k023832j778026j568771j393587j243884j112303r98980
58149A2907429r03860q20191p41982o70772o09133n54063n02400m56245m17478
58140G231305l82843l49729l21153k99910k82981k66439k50886k37680k24706
58131D614978k10338j96897j86005j75014j61977j49662j40742j33226j24576
$$ plain form
58186 271385129 305451812 337599253 365021072 384562672 393704907 391503339 378783391
58179 378783391 357560058 330270920 299314882 266877795 234805850 204474214 176754698
58172 176754698 152097167 130631499 112245160 96665850 83551912 72551246 63323027
58165 63323027 55555478 48987160 43409026 38648364 34560918 31034512 27983950 25336455
58157 25336455 23026812 21002980 19224954 17656183 16262596 15018712 13906409 12907429
58149 12907429 12003569 11183378 10441396 9770624 9161491 8607428 8105028 7648783 7231305
58140 7231305 6848462 6498733 6177580 5877670 5594689 5328250 5077364 4839684 4614978
58131 4614978 4404640 4207743 4021738 3846724 3684747 3535085 3394343 3261117 3136541
58122C136541j16170j09955j04581r8544r3316q9856q5780p9525p3626p0425o8074
58111B146689o4205o0003n7208n4537n0624m7273m6305m6065m4456m2535m1943
58100A591535m1623m0212l8964l9106l9015l7040l4570l3287l1989k9158k6096
58089A200475k4476k3205k0690j7922j6420j5463j4249j4267j6505j8769j8844
58078I99665j8125j8867k0054j9418j7633j6974j7365j7041j5916j5201j4794
58067H08277j3841j2794j2355j1689j0124r144j0044j1171j0263q162p367q139
58055F83184q927r487j0568j1388j0462q413p267p352p399p151p405p813p126
58042E72426n449m143l682l478l519m329n437n732n157m650m667m976n441n941
$$ plain form
58122 3136541 3020371 2910416 2805835 2707291 2613975 2524119 2438339 2358814 2285188 2214763 2146689
58111 2146689 2082484 2022481 1965273 1910736 1860112 1812839 1766534 1720469 1676013 1633478 1591535
58100 1591535 1549912 1509700 1470736 1431630 1392615 1355575 1321005 1287718 1255729 1226571 1200475
58089 1200475 1175999 1152794 1132104 1114182 1097762 1082299 1068050 1053783 1037278 1018509 999665
58078 999665 981540 962673 942619 923201 905568 888594 871229 854188 838272 823071 808277
58067 808277 794436 781642 769287 757598 747474 738330 728286 717115 706852 698690 691323 683184
58055 683184 674257 664770 654202 642814 632352 623939 616672 609320 601921 594770 587365 579552 572426
58042 572426 566977 562834 559152 555674 552155 547826 542389 536657 531500 526850 522183 517207 511766 505825
58028E05825o188o569q052j0256j1034r428p398p010p480p072o212o330o846o065
58014C99885m242l154l138l011k517k507k877k600j711j213j090l52R49J608J326
57999C75356J133J664K427K929L281L636M021M507M720L740J507n16j231j515
57985D05659k611l968m333m013m171m682m629m269m473m813m209l088k817l327
57971C50256l312k565k009j678p24N09O46k79n87M54J579J606R00K38k78o66p05
57954C43385o36j052j822k127j785j415j228p76rO00J062J823K732L239L632M799
57938C50422O559P609P414O997P528R038J0765J1891J1814J0555Q913P524N931
57925D62960L475P54j010j789k695m234n862p240q656j0013j0603j0206r395q675
$$ plain form
58028 505825 499637 493068 485016 474760 463726 454298 446900 439890 432410 425338 419126 412796 405950 399885
58014 399885 395643 392489 389351 386340 383823 381316 378439 375839 374128 372915 371825 371473 372422 374030 375356
57999 375356 376489 378153 380580 383509 386790 390426 394447 398954 403674 407414 408921 408405 407174 405659
57985 405659 403048 399080 394747 390734 386563 381881 377252 372983 368510 363697 359488 356400 353583 350256
57971 350256 346944 344379 342370 340692 339968 340477 341123 340844 340257 340711 342290 343896 344796 345034 344756 344090 343385
57954 343385 342749 341697 339875 337748 335963 334548 333320 332544 332535 333135 334197 336020 338752 341991 345623 350422
57938 350422 356981 364590 372004 379001 386529 395567 406332 418223 430037 440592 449505 457029 462960
57925 462960 466435 467189 466179 464390 461695 457461 451599 444359 435703 425690 415087 404881 395486 386811
57911C86811q082p650p419p049o246n329m649l883k788k075k263k386j350m9l53
57896C25240k217l646l481k481j476l44Q36J366J303J733L048M235M454M144L987
57881C36701L840L308K466J551O60Pl35q53j852k535k098j445k200m045m939m211
57865C24020l522m112m961m724l798l276l075k407j154K68J599K483K367J591
57851C01299J583L038M647M702L303J985J622J666J174j51j811k868k742j937
57837C15510j647k337l275l646l518l325l074k544j783j007l78q1j35l2Q11K112
57821B91651K998L256L532M054M230L742L140K866K637K207J856J613Q59o85k341
57806C25615l456m247n089n730n798n479n073m473l647l005k748k424j689r15
$$ plain form
57911 386811 378729 371079 363660 356611 350365 345036 340387 336504 333716 331641 329378 326992 325642 325593 325240
57896 325240 323023 319377 315896 313415 311939 311595 312431 313797 315100 316833 319881 324116 328570 332714 336701
57881 336701 340541 343849 346315 347866 348526 348533 348198 347345 345493 342958 340860 339415 337215 333170 328231 324020
57865 324020 320498 316386 311425 306701 302903 299627 296552 294145 292991 293259 294858 297341 299708 301299
57851 301299 302882 305920 310567 315269 318572 320557 322179 323845 325019 324868 323057 320189 317447 315510
57837 315510 313863 311526 308251 304605 301087 297762 294688 292144 290361 289354 288976 288895 288760 288728 289539 291651
57821 291651 294649 297905 301437 305491 309721 313463 316603 319469 322106 324313 326169 327782 328641 327956 325615
57806 325615 322159 317912 312823 307093 301295 295816 290743 286270 282623 279618 276870 274446 272757 271842
57792B71842n88o33q17j224j796k076j822j387r64k09J001K087K650L105L837
57777B73006M419M422M324M798N541N728N265M763M463L966K987J774O57l78j516
57762C24219k733l612l686l127k892l700n003n523m789l438k103q58J42N24M45
57747B83866N50P73K37j200k357k361j918k108k736k940k693k654k889k745j947
57732B56878j032p03j189k106k642k205j197o58q57q65M2J212J474O22o39j675
57716B44460k172j914j122o70j171k091k409j937j344j088j080j255j770k534
57702B21903l048k922k299j718j602j799j716j037k56k8k17j70J31L1o00j043
57686B03610q48m22j46J93P08J076J397K428M382O396P886R551J2352J6346K1255
$$ plain form
57792 271842 271254 270621 269804 268580 266784 264708 262886 261499 260535 260326 261327 263414 266064 269169 273006
57777 273006 277425 281847 286171 290969 296510 302238 307503 312266 316729 320695 323682 325456 326113 325735 324219
57762 324219 321486 317874 314188 311061 308169 304469 299466 293943 289154 285716 283613 282755 282897 283421 283866
57747 283866 284416 285189 285426 284226 281869 279508 277590 275482 272746 269806 267113 264459 261570 258825 256878
57732 256878 255846 255143 253954 251848 249206 247001 245804 245146 244289 243424 243466 244678 246152 246774 246135 244460
57716 244460 242288 240374 239252 238582 237411 235320 232911 230974 229630 228542 227462 226207 224437 221903
57702 221903 218855 215933 213634 211916 210314 208515 206799 205762 205506 205478 205261 205091 205222 205253 204653 203610
57686 203610 202762 202340 202194 202387 203095 204171 205568 207996 212378 218774 226660 236211 248563 264909 286164
57671B86164K7112L3407L8609M1722M3455M4602M3988L9432L0260J7608K872j2574
57659F36657k6496l6462m1762m3536m2877m0025l5419l0211k5222k0387j5673
57648B78587j1730r168p793o905n936m671l313k382k099k001j628j310j517j747
57634B16387j082K33Q42J12j038j465j097m97O6N58P60M76j43q06j436k109k898
57617B06863l781m446m267k947j195k41n32j252j272k06J342K235J616k19j820
57602A89878j994j071k95j36n1K00L7q43j800k212k359k740l080k785k042j752
57586A66955k382l445m106l964l136j975q75j45J34J46J08J0k98p91j142j093
57570A44001q19o97p62p22m87l08l37m05l61k66j59j0L3k08m09j8Q12J288J232
$$ plain form
57671 286164 313276 346683 385292 427014 470469 515071 559059 598491 628751 646359 649231 636657
57659 636657 610161 573699 531937 488401 445524 405499 370080 339869 314647 294260 278587
57648 278587 266857 257689 249896 242991 237055 232384 229071 226689 224590 222589 220961 219651 218134 216387
57634 216387 215305 215538 216380 216492 215454 213989 212892 212395 212461 213019 213779 214255 214112 213306 211870 209761 206863
57617 206863 203082 198636 194369 191422 190227 189986 189454 188202 186930 186724 188066 190301 191917 191698 189878
57602 189878 187884 186813 186518 186382 186331 186531 186568 185725 183925 181713 179354 176614 173534 170749 168707 166955
57586 166955 164573 161128 157022 153058 149922 147947 147072 146927 147061 147207 147315 147325 147027 146236 145094 144001
57570 144001 143182 142485 141723 141001 140514 140206 139869 139464 139103 138837 138678 138668 138701 138493 138084 138066 138878 140166 141398
57551A41398J406K133K512J788O99M26Q05P02j34q20p66l74j28K3K59N68R45J292
57533A52734J196L91n70r22p79q48j113p93K88J225J296Q56N86N43M30K78L32
57516A55130O13Q95R23N82Q8J9P21J667J887J100l4p70r55p95n32m19n95q43q99
57497A57783q65r39r11n41k37o60j694k528k742k545j999r75O9K64m05q98n87
57480A39590n0L4n8K03N39K21p96j760j955j309l95K1k61n67j81N47N97j61o96
57461A33563l52K49K43k62o49p27o06j44P57J701K158K009J376M46k67j31O44
57444A40008R38K46m84k70L57K60m36o17mN36N55N82Q81Q14k5r53j145p87n56
57425A39900m58k0O82R65O32L19N63R82Q26M1o76p58l03K58O91R41R52P07L45
$$ plain form
57551 141398 142804 144937 147449 149237 149936 150362 151167 151869 151735 150915 150149 149775 149647 149670 149929 150497 151442 152734
57533 152734 153930 154321 153751 152829 152050 151202 150089 149296 149584 150809 152105 152961 153547 154090 154520 154798 155130
57516 155130 155743 156638 157561 158143 158231 158250 158971 160638 162525 163625 163591 162821 161866 161071 160539 160120 159525 158682 157783
57497 157783 156918 155979 155068 154527 154290 153630 151936 149408 146666 144121 142122 141147 141216 141480 141075 140177 139590
57480 139590 139540 139574 139516 139719 140258 140479 139683 137923 135968 134659 134264 134285 134024 133457 133276 133823 134420 134259 133563
57461 133563 133211 133460 133703 133441 132792 132065 131459 131315 132072 133773 135931 137940 139316 139762 139495 139364 140008
57444 140008 140946 141192 140708 140438 140795 141055 140619 140002 139998 140534 141089 141671 142552 143366 143341 142388 141243 140456 139900
57425 139900 139442 139422 140104 141069 141701 142020 142583 143565 144391 144432 143756 142998 142695 142953 143644 144585 145537 146244 146589
57406A46589jl00m65k80K34O70P46P29R89J289J046L29k5N20J431J708J031P4
57388A56314k75K47J146J827K202K567K952L011K629K238K163K074J490N44k95
57373A80834r17j445j667j306p24o02r08q95k29N16O84K78l20q43j098q69j78
57356A70311O13J093J074O64K80L63P86Q96N01L09Q44J523J640J628K191K711
57340A87427K024N21j70L10O00N1j69Q35K103K346J769J197O07k87r21p08k27
57323A97308l53p93o58OM90P55J330K102K373J958J342Q34M35L18O47J047J057
57306B10198Q44Q14Q47P03P55J349J872J504O80O26J516K225J999J359J079J199
57290B29569J368J509J740K078K391K423J981J367J225J585J557O36l59m95k32
$$ plain form
57406 146589 146588 146288 145823 145543 145777 146447 147193 147922 148911 150200 151246 151575 151550 152070 153501 155209 156240 156314
57388 156314 156039 156286 157432 159259 161461 164028 166980 169991 172620 174858 177021 179095 180585 181129 180834
57373 180834 179917 178472 176805 175499 174775 174173 173265 172370 172141 172657 173341 173619 173299 172456 171358 170489 170311
57356 170311 170924 172017 173091 173755 174035 174398 175184 176080 176581 176890 177734 179257 180897 182525 184716 187427
57340 187427 189451 189972 189802 190112 190712 190763 190594 191429 193532 195878 197647 198844 199451 199164 198243 197535 197308
57323 197308 196955 196162 195504 195510 196000 196755 198085 200187 202560 204518 205860 206694 207129 207447 208094 209141 210198
57306 210198 211042 211856 212703 213406 214161 215510 217382 218886 219566 220192 221708 223933 225932 227291 228370 229569
57290 229569 230937 232446 234186 236264 238655 241078 243059 244426 245651 247236 248793 249429 249070 248575 248343
57275B48343n70j256j198l94J38K52Q58K062K774K641K754L693M384L890L029
57260B71400L055L725L980L736L678L774L344K405J802J961K479L011L670M439
57246C16459M848M584L903L258K874K762K841K982L167L639M531N472N826N384
57232C72530M596M075M148M809N809O723P150P014O615O377O586P320Q449R698
57218D61899J0761J1436J1711J1777J1862J1974J1908J1694J1808J2637J3770
57207E93237J4320J4066J3811J4407J5749J7100J8008J8510J8651J8344J7741
57196G73944J7341J7569J8416J9506K0400K0813K0742K0422J9998J9331J8370
57185I86852J7614J7830J9041K0132J9917J8546J7472J7894J9622K1610K3223
$$ plain form
57275 248343 247773 246517 245319 244925 245063 245315 246173 248235 251009 253650 256404 260097 264481 268371 271400
57260 271400 274455 278180 282160 285896 289574 293348 296692 299097 300899 302860 305339 308350 312020 316459
57246 316459 321307 325891 329794 333052 335926 338688 341529 344511 347678 351317 355848 361320 367146 372530
57232 372530 377126 381201 385349 390158 395967 402690 409840 416854 423469 429846 436432 443752 452201 461899
57218 461899 472660 484096 495807 507584 519446 531420 543328 555022 566830 579467 593237
57207 593237 607557 621623 635434 649841 665590 682690 700698 719208 737859 756203 773944
57196 773944 791285 808854 827270 846776 867176 887989 908731 929153 949151 968482 986852
57185 986852 1004466 1022296 1041337 1061469 1081386 1099932 1117404 1135298 1154920 1176530 1199753
57174A199753K4548K5711K6481K6617K6195K5410K4419K3456K2828K2556K2258
57163A470232K1560K0413J8928J7193J5469J4240J3892J4579J6467J9646K3619
57152A666238K7349L0279L2836L5505L7849L9022L9005L8686L8843L9552M0516
57141B065680M1445M2129M2618M3272M4264M5185M5560M5654M6220M7612M9624
57130B559263N2055N4852N7686O0069O2006O4029O6571O9737P3548P7829Q1856
57119C279501Q4820Q6841Q8957R1951R5735J00019J04934J10685J17175J24410
57109D285028J32974J43846J57940J75969J98458K25930K59355L00422L51068
57100F230990M13038M88674N82016O98374Q42774J019490J232630J485344J777248
$$ plain form
57174 1199753 1224301 1250012 1276493 1303110 1329305 1354715 1379134 1402590 1425418 1447974 1470232
57163 1470232 1491792 1512205 1531133 1548326 1563795 1578035 1591927 1606506 1622973 1642619 1666238
57152 1666238 1693587 1723866 1756702 1792207 1830056 1869078 1908083 1946769 1985612 2025164 2065680
57141 2065680 2107125 2149254 2191872 2235144 2279408 2324593 2370153 2415807 2462027 2509639 2559263
57130 2559263 2611318 2666170 2723856 2783925 2845931 2909960 2976531 3046268 3119816 3197645 3279501
57119 3279501 3364321 3451162 3540119 3632070 3727805 3827824 3932758 4043443 4160618 4285028
57109 4285028 4418002 4561848 4719788 4895757 5094215 5320145 5579500 5879922 6230990
57100 6230990 6644028 7132702 7714718 8413092 9255866 10275356 11507986 12993330 14770578
57091A4770578K102904K452733K814219L172058L509112L809230M059288M248794
57083D0938916M368906M411064M361260M190757L856086L319570K579830J684338
57075F9710727P09549k73636j218553k095860k878044l534390m037726m372246
57067E2009821m536210m541388m411370m177740l874127l531161l174266k823014
57059B0940545k490426k183190j903827j653336j432080j239177j072292r28476
57051H037741q04990o99481o09809n33897m69522m14305l66195l23884k86686
57042C528972k54103k25685k00968j79241j59617j41676j25678j11659r8609q5135
57032A946601p0635n5378l9795k4512j0595J432J2589K3718L2077L1205J5931
$$ plain form
57091 14770578 16873482 19326215 22140434 25312492 28821604 32630834 36690122 40938916
57083 40938916 45307822 49718886 54080146 58270903 62126989 65446559 68026389 69710727
57075 69710727 70420276 70146640 68928087 66832227 63954183 60419793 56382067 52009821
57067 52009821 47473611 42932223 38520853 34343113 30468986 26937825 23763559 20940545
57059 20940545 18450119 16266929 14363102 12709766 11277686 10038509 8966217 8037741
57051 8037741 7232751 6533270 5923461 5389564 4920042 4505737 4139542 3815658 3528972
57042 3528972 3274869 3049184 2848216 2668975 2509358 2367682 2242004 2130345 2031736 1946601
57032 1946601 1875966 1820588 1780793 1756281 1745686 1747118 1759707 1783425 1815502 1846707 1862638
57021A862638j2337m5928p6169r7978j10310j14167j11157j03246r2639q1295
57011A017412p0424o0527n1816m4462l8429l3351k8891k5199k2596k0862j9233
57000F01622j7297j5475j4304j3641j2888j1815j0665r541q123o131l783j551
56988D76408L87K210L958N320O147O856P743P905N706P52n217j0052j3346j6069
56974D78708j8511j9673j8802j6470j3780j1189q637o203m056k100LK595N951
56961C67836J0000J3994J6919J8498J9274J9480J8317J4815Q977J751n746j2501
56949D91614j7557k0383k1257k0881j9633j7472j4496j1151p904m864j786J541
56937C35771M986Q232J1312J4745J8774K2640K5055K5291K3357J9236J2710M130
$$ plain form
57021 1862638 1850301 1804373 1728204 1630226 1519916 1405749 1294592 1191346 1098707 1017412
57011 1017412 946988 886461 834645 790183 751754 718403 689512 664313 641717 620855 601622
57000 601622 584325 568850 554546 540905 528017 516202 505537 495996 487873 481742 477959 476408
56988 476408 476795 479005 482963 488283 494430 501286 509029 516934 522640 523392 518175 508123 494777 478708
56974 478708 460197 440524 421722 405252 391472 380283 371646 365443 361387 359287 359290 361885 367836
56961 367836 377836 391830 408749 427247 446521 466001 484318 499133 508110 509861 504115 491614
56949 491614 474057 453674 432417 411536 391903 374431 359935 348784 340880 336016 334230 335771
56937 335771 340757 348989 360301 375046 393820 416460 441515 466806 490163 509399 522109 526239
56925E26239n253j3996k1199k6405k9372l0161k9159k6819k3763k0862j8632j6570
56913B64048j3845j0711q328p134o409n636n164n066m507l062j594r62o96Q4J279
56898A92297K403L760N810P893Q998R469J0672J3037J5658J7785J9518K0908K1497
56885C49705K1050J9712J7185J2697O279p39o923j1773j5176j6731j6272j4476
56873C44538j2193r448n783j372K941O802J0951J6324K2867K9603L5721M1121
56861D82072M5846M9312N0478M8474M2748L2961J9535M306j0065k1691l0119l5443
56849F78414l7508l6345l2624k7163k0398j2730m779L239J1892K1768L2658M3923
56837F20347N5050O5309P3467P8526Q0211P7985P0202N5312L3824Q368j7832m1813
$$ plain form
56925 526239 520986 506990 485791 459386 430014 399853 370694 343875 320112 299250 280618 264048
56913 264048 250203 239492 231164 224030 217621 211985 206821 201755 197248 194186 192592 191630 190934 191018 192297
56898 192297 194700 198460 204270 212163 221161 230630 241302 254339 269997 287782 307300 328208 349705
56885 349705 370755 390467 407652 420349 426628 425889 418966 407193 392017 375286 359014 344538
56873 344538 332345 322897 317114 315742 318683 325485 336436 352760 375627 405230 440951 482072
56861 482072 527918 577230 627708 676182 718930 751891 771426 775732 765667 743976 713857 678414
56849 678414 640906 604561 571937 544774 524376 511646 506867 510106 521998 543766 576424 620347
56837 620347 675397 740706 814173 892699 972910 1050895 1121097 1176409 1210233 1218601 1200769 1158956
56825A158956o0850p3013p8127p7474p2501o4361n4393m3921l3424k2642j1571
56814E66679o88R757J9898K9551L8174M5611N2016N6709N7767N3168M2152K5575
56802I96369N510j5271l4021m8746n8406o2838o2753n9422n3874m6672l8695l1360
56790D89821k5264j9284j2092m092L275R634J5630K1144K5132K7331K8369K7797
56778E87401K3661J4945L204q975k0057k9369l6056l9489m0107l8911l6510l3242
56766C46495k9646k6083k2416j8693j5610j3629j2184j0480q603p157o191n249
56754A70554m226l477l200l178l107k816k331j963k006k183j944j413j408k129
56740A35173k581j945q58m92q98j091n68J51M15J98j59m08m71l86k55j21N0K64
$$ plain form
56825 1158956 1098106 1025093 946966 869492 796991 732630 678237 634316 600892 578250 566679
56814 566679 565991 575748 595646 625197 663371 708982 760998 817707 875474 928642 970794 996369
56802 996369 1001879 986608 952587 903841 845435 782597 719844 660422 606548 559876 521181 489821
56790 489821 464557 445273 433181 429089 432364 441998 457628 478772 503904 531235 559604 587401
56778 587401 611062 626007 629211 620236 600179 570810 534754 495265 455158 416247 379737 346495
56766 346495 316849 290766 268350 249657 234047 220418 208234 197754 189151 181994 175803 170554
56754 170554 166328 162851 159651 156473 153366 150550 148219 146256 144250 142067 140123 138710 137302 135173
56740 135173 132592 130647 129789 129297 128399 127308 126740 126891 127306 127504 127345 126937 126466 126080 125825 125704 125754 126018
56722A26018O04J351K538L457L244K105J118O64m5j329k085j323J34O66J20j88
56706A37049N89J921K874K978K162P28m76o99k24K9j94l38k31l88q72q83MR85
56688A45014J129O58L89M30L12R5L54J041J289O12l42p41o45n93n46o6O49P26
56670A49765r4r28r22l86j83m34n02j16L23M85O05J009J671K346K789K809K475
56653A60712K220K366K646K623K397K294K083J318M07K76Q57R71J11p19n19K55
56637A80298O20O05Q69J338J286N40k37m87k74N7J91j28q65j569j881j994k196
56620A76173k267j825j063n71n27o63q26j084j305j207q19m52k57j61k14n67j115
56603A61250j460j248l93Q41J775J637M31q09j065m66N8Ml03m00j81K32O80R77
$$ plain form
56722 126018 126622 127973 130511 133968 137212 139317 140435 141099 141054 139725 137640 136317 136451 137117 137237 137049
56706 137049 137638 139559 142433 145411 147573 148301 147825 147126 146902 146931 146737 146399 146168 145780 144908 144025 144029 145014
56688 145014 146143 146801 147190 147620 147932 148027 148381 149422 150711 151323 150981 150240 149595 149002 148456 148390 149039 149765
56670 149765 149671 148743 147821 147435 147252 146818 146316 146200 146523 147008 147613 148622 150293 152639 155428 158237 160712
56653 160712 162932 165298 167944 170567 172964 175258 177341 178659 179066 179342 180199 181170 181281 180562 180043 180298
56637 180298 180918 181523 182392 183730 185016 185556 185319 184832 184558 184615 184806 184678 183813 182244 180363 178369 176173
56620 176173 173906 172081 171018 170447 169920 169257 168431 167347 166042 164835 164016 163564 163307 163146 162932 162365 161250
56603 161250 159790 158542 158149 158990 160765 162402 162833 162024 160959 160493 160551 160555 160252 159852 159671 159903 160583 161560
56585A61560J127J398J840J953J316M26K30Q94J548J433P33P9k72m10k73L86J534
56568A75502K712L439L676L760L938M185M525N244O410P519Q069Q305Q707Q882
56554B54873P820N473L122J774J057K18o72j301k013l162m107l996l131k436j933
56539B51586r94L2r4j558k893k965k447k604l424l912l633k989k219j140M8N13
56523B21307j81j289j712j356j140j571k045j776j021p07j103j609j789j857k001
56508B00150j940j517j084r44r18r00j154j637j593n17R33J669J436P24j38j023
56492A91547j508j150k91K17Pn43r27r08m41K34O37O51P91J327J510N51r46j504
56474A89254o43O03J191J136R42P81O38O77R95J386J615J626J367Q10K45J17M86
$$ plain form
56585 161560 162687 164085 165925 167878 169194 169620 169850 170744 172292 173725 174458 174537 174265 173855 173582 173968 175502
56568 175502 178214 181653 185329 189089 193027 197212 201737 206981 213391 220910 228979 237284 245991 254873
56554 254873 262693 268166 271288 273062 274119 274337 273665 272364 270351 267189 263082 259086 255955 253519 251586
56539 251586 250592 250624 250530 248972 246079 243114 240667 238063 234639 230727 227094 224105 221886 220746 220794 221307
56523 221307 221126 219837 218125 216769 215629 214058 212013 210237 209216 208509 207406 205797 204008 202151 200150
56508 200150 198210 196693 195609 194665 193747 192847 191693 190056 188463 187946 188879 190548 191984 192708 192570 191547
56492 191547 190039 188889 188598 188815 188822 188279 187352 186444 186003 186237 186874 187525 188316 189643 191153 191704 190758 189254
56474 189254 188611 189214 190405 191541 192483 193264 193902 194579 195574 196960 198575 200201 201568 202378 202623 202740 203226
56457B03226Q94R54P26M35J42j79m56n08j76M51R96J130J037J154J379J102K67
56440B12574k73J8N25M54R3J85N92N38o1m83l19J47N78Q27O36k2m92j70M05J01
56420B15853j073j828j356l06L45N71R58J648K176K131J651J243J164J010K20
56405B24407r04j261l78P88J122P53M63L82J89R6M60Q23N59J17M20J249J515J015
56387B31815N56M21J56j08L53J317J554P83K41P70J630J883J674J454J083N31
56371B46113M35J074J672J535J097J083J349J336J033P27M18Q6L4L73O75O62O56
56354B60358R03J158J319J697K168J887O13m84k05J100K116K207J713J076N41
56339B78167L99P70J277J483J491J686K108K522K804K939K821K407J835J226O60
$$ plain form
56457 203226 204120 205074 205800 206235 206377 206198 205742 205234 205058 205509 206505 207635 208672 209826 211205 212307 212574
56440 212574 212301 212319 212844 213298 213391 213576 214168 214706 214645 214162 213843 213990 214568 215395 216031 216009 215517 215347 215752 215853
56420 215853 214780 212952 211596 211290 211635 212206 213164 214812 216988 219119 220770 222013 223177 224187 224407
56405 224407 223503 222242 221864 222652 223774 224527 224990 225372 225561 225657 226117 226940 227499 227616 228036 229285 230800 231815
56387 231815 232371 232792 232948 232840 233193 234510 236064 236847 237088 237858 239488 241371 243045 244499 245582 246113
56371 246113 246548 247622 249294 250829 251926 253009 254358 255694 256727 257454 257872 257958 257992 258365 259040 259702 260358
56354 260358 261261 262419 263738 265435 267603 269490 270103 269619 269414 270514 272630 274837 276550 277626 278167
56339 278167 278566 279336 280613 282096 283587 285273 287381 289903 292707 295646 298467 300874 302709 303935 304595
56324C04595M34Q49J659K210K246K058J753J097K12l48m74o29r10p79p1O01Q53
56307C15356J072J524J779J584J474J932K637L138L562M055M217L773L174K911
56293C52188K780K447K149K258K591K685K422K008J746K019K887L639L444K681
56279C87944K676L861N169N633N482N270N017M891N615P317Q954R627R696R887
56265D77039J0229J0628J1466J2813J3920J4416J5120J6783J8954K0993K3310
56254F45671K6531L0286L3911L7610M1890M6488N0923N5418O0271O4994O9038
56243A163031P2673P6193P8909Q0019P9623P7990P4615O9161O2330N4553M4816
56232A933913L2312J8418N287o904j9337l1658m1783m8723n3770n8399o2503o5308
$$ plain form
56324 304595 305029 305878 307537 309747 311993 314051 315804 316901 317113 316765 316291 315662 314752 313973 313902 314503 315356
56307 315356 316428 317952 319731 321315 322789 324721 327358 330496 334058 338113 342330 346103 349277 352188
56293 352188 354968 357415 359564 361822 364413 367098 369520 371528 373274 375293 378180 381819 385263 387944
56279 387944 390620 394481 399650 405283 410765 416035 421052 425943 431558 438875 447829 457456 467152 477039
56265 477039 487268 497896 509362 522175 536095 550511 565631 582414 601368 622361 645671
56254 645671 672202 702488 736399 774009 815899 862387 913310 968728 1028999 1093993 1163031
56243 1163031 1235704 1311897 1390806 1470825 1550448 1628438 1703053 1772214 1834544 1889097 1933913
56232 1933913 1966225 1984643 1989930 1983026 1963689 1932031 1890248 1841525 1787755 1729356 1666853 1601545
56220A601545o6774o7343o7031o5532o2831n9393n5890n2741m9742m6400m2747
56209I65121l9355l6371l3284l0018k7355k5582k3775k1240j8718j7101j5886
56198F76436j4178j2312j1109j0211q720o965o093o128o011n368m826m565l968
56185E75982k831j759j129p04l18j34o9J83N97R31J216J550J663J436J449K291
56169E80354L721N108O197O812O537N617N309O321P641Q006P781Q141R168J0146
56155F76859J1094J2469J3883J4662J5330J7035J9748K2475K5027K8261L2745
56144H89588L8448M5543N4193O3706P3108Q2319R1679J00591J07754J12413J14260
56133A773602J12559J06695R7363Q6153P4410O3338N4439M8340M3686L8407L1603
$$ plain form
56220 1601545 1534771 1467428 1400397 1334865 1272034 1212641 1156751 1104010 1054268 1007868 965121
56209 965121 925766 889395 856111 826093 798738 773156 749381 728141 709423 692322 676436
56198 676436 662258 649946 638837 628626 619906 612941 606848 600720 594709 589341 584515 579950 575982
56185 575982 573151 571392 570263 569559 569241 569107 569038 569221 569818 570749 571965 573515 575178 576614 578063 580354
56169 580354 584075 589183 595380 602192 608729 614346 619655 625976 633617 641623 649404 657545 666713 676859
56155 676859 687953 700422 714305 728967 744297 761332 781080 803555 828582 856843 889588
56144 889588 928036 973579 1027772 1091478 1164586 1246905 1338584 1439175 1546929 1659342 1773602
56133 1773602 1886161 1992856 2090219 2176372 2250782 2314120 2368559 2416899 2460585 2498992 2530595
56122B530595K3301J3405K339q225j6955k4505l2230m0300m8662n8570p0959q4111
56110B185123r5046j02482j06583j06794j02462r4873q6226p7017o6764n6506
56100A290370m7948m0723l3283k6119k1125j8023j4513j0159o969n710m636k663
56088A058499r32k53M65K095L757M561M983N629O216O503O775O986O849O872P755
56073A126760Q921R399R754J1161J2943J3454J3024J3438J4697J5118J4638J5009
56061A278316J6595J7813J8188J8967K0297K0718K0074K0039K1091K1732K1396
56050A495226K1349K1999K2156K1631K1822K2909K3336K2793K2876K4085K5008
56039A745190K5197K5996K7730K9075K9888L1618L4155L5474L5263L5698L7670
$$ plain form
56122 2530595 2553896 2567301 2569640 2561415 2544460 2519955 2487725 2447425 2398763 2340193 2269234 2185123
56110 2185123 2090077 1987595 1881012 1774218 1671756 1576883 1490657 1413640 1346876 1290370
56100 1290370 1242422 1201699 1168416 1142297 1121172 1103149 1088636 1078477 1071508 1065798 1061162 1058499
56088 1058499 1057567 1057314 1057779 1059874 1063631 1068192 1073175 1078804 1085020 1091523 1098298 1105284 1112133 1119005 1126760
56073 1126760 1135681 1145080 1154834 1165995 1178938 1192392 1205416 1218854 1233551 1248669 1263307 1278316
56061 1278316 1294911 1312724 1330912 1349879 1370176 1390894 1410968 1431007 1452098 1473830 1495226
56050 1495226 1516575 1538574 1560730 1582361 1604183 1627092 1650428 1673221 1696097 1720182 1745190
56039 1745190 1770387 1796383 1824113 1853188 1883076 1914694 1948849 1984323 2019586 2055284 2092954
56028B092954L9485M0290M1545M3995M6331M7918M9736N1837N2997N3671N5819
56017B616578N9206O1496O2632O5190O9665P3608P6290P9764Q4382Q7876R0083
56006C426770R3795R9596J04734J08575J13959J21515J28077J32746J38992J48469
55996D617228J58207J66465J75688J87056J97873K07327K19079K34910K51579
55987F415412K67230K85061L07238L31172L55410L83084M15853M50685M86446
55978I697591N27156N74950O26613O81211P43956Q18324R01863R94270J101641
55969A6667575J228238J372695J537442J732783J966600K240374K561449K949020
55961C2256176L423054M000690M711843N606800O743228Q181877J0000259J2282623
$$ plain form
56028 2092954 2132439 2172729 2214274 2258269 2304600 2352518 2402254 2454091 2507088 2560759 2616578
56017 2616578 2675784 2737280 2799912 2865102 2934767 3008375 3084665 3164429 3248811 3336687 3426770
56006 3426770 3520565 3620161 3724895 3833470 3947429 4068944 4197021 4329767 4468759 4617228
55996 4617228 4775435 4941900 5117588 5304644 5502517 5709844 5928923 6163833 6415412
55987 6415412 6682642 6967703 7274941 7606113 7961523 8344607 8760460 9211145 9697591
55978 9697591 10224747 10799697 11426310 12107521 12851477 13669801 14571664 15565934 16667575
55969 16667575 17895813 19268508 20805950 22538733 24505333 26745707 29307156 32256176
55961 32256176 35679230 39679920 44391763 49998563 56741791 64923668 74923927 87206550
55953H7206550J5067831J8301777K1827908K5389839K8642745L1216369L2785206
55946B60438225L2998894L1293077K6908475J9365960R088715k476585j3458171
55939C64158590k2370671k8507069l1821634l2659118l1577838k9223163k6184285
55932A61814812k2900549j9668242j6682076j4047236j1788340r886667q312820
55925E8528882p026428n972592n100410m377551l779373l277478k848685k483323
55917B3663042k174761j910087j678567j479075j310990j166227j037342r25072
55909A1980921q30838p49335o75186o09742n54975n07165m62699m23754l92399
55900F774828l64912l37523l12283k91833k73542k54168k35421k19798k05374
$$ plain form
55953 87206550 102274381 120576158 142404066 167793905 196436650 227653019 260438225
55946 260438225 293437119 324730196 351638671 371004631 380093346 377616761 364158590
55939 364158590 341787919 313280850 281459216 248800098 217222260 187999097 161814812
55932 161814812 138914263 119246021 102563945 88516709 76728369 66841702 58528882
55925 58528882 51502454 45529862 40429452 36051901 32272528 28995050 26146365 23663042
55917 23663042 21488281 19578194 17899627 16420552 15109562 13943335 12905993 11980921
55909 11980921 11150083 10400748 9725562 9115820 8560845 8053680 7590981 7167227 6774828
55900 6774828 6409916 6072393 5760110 5468277 5194735 4940567 4705146 4485348 4279974
55891D279974j89753j74817j62840j51839j39449j27624j18976j11983j04201
55882B998492r6969r2731r0593q8492q6931q6853q6512q4076q0830p8548p6181
55871B049776p2087o7126o2770n8609n4370n1611n0901n0043m7640m5439m4717
55860A444463m3544m0433l7454l6617l6126l3654l0465k8820k7829k5469k2581
55849A081471k1338k1509k1549k1729k2998k4261k3862k2425k1567k1083k0026
55838H39124j9046j9058j9016j7521j5379j4155j3563j2572j1607j1326j0722
55827F75159r007p802q808j0661j0712q970p645p714q383r231j0424j1383j1375
55814E53044j0918j0839j0602r299p491o357n814n085m231l669l038k009j115
$$ plain form
55891 4279974 4090221 3915404 3752564 3600725 3461276 3333652 3214676 3102693 2998492
55882 2998492 2901523 2808792 2718199 2629707 2542776 2455923 2369411 2285335 2204505 2125957 2049776
55871 2049776 1977689 1910563 1847793 1789184 1734814 1683203 1632302 1582259 1534619 1489180 1444463
55860 1444463 1400919 1360486 1323032 1286415 1250289 1216635 1186170 1157350 1129521 1104052 1081471
55849 1081471 1060133 1038624 1017075 995346 972348 948087 924225 901800 880233 859150 839124
55838 839124 820078 801020 782004 764483 749104 734949 721386 708814 697207 685881 675159
55827 675159 666152 658350 649542 638881 628169 619199 611554 603840 595457 586226 575802 564419 553044
55814 553044 542126 531287 520685 511386 503895 497538 491724 486639 482408 478739 475701 473692 472577
55801D72577n25P13K822M218L887L234L820M810M664L823L553L538K785J726J195
55786E16840M99j278l082l369k854l496n543p716r568j1485j2950j2999j1867
55773D31132j0302p948m341p10J334K221L423M656M271J945j103m187p295r556
55759D03540r687p979o003m552l489l134l906m977n256n402o912r420j0976j0946
55745C10901j0559j0537j0089q630o790n263m083l276k996k878k385j775j639
55732B40001j719j442j158j576k338k629k773l628m731m707l471k328j963j868
55718B03670j701j659j496o71M54R86J095J770L084M151M699N199N418M447K330
55703B31776K10j344k740m041m678m748n120n990o583o478n991n165l740k272
$$ plain form
55801 472577 472052 472765 475587 479805 483692 486926 490746 495556 500220 504043 507596 511134 513919 515645 516840
55786 516840 517339 516061 512979 509610 506756 503260 497717 490001 480433 468948 455998 442999 431132
55773 431132 420830 412882 408541 407831 409165 411386 414809 419465 423736 425681 424578 420391 413096 403540
55759 403540 393853 385874 379871 375319 371830 368696 364790 359813 354557 349155 342243 332823 321847 310901
55745 310901 300342 289805 279716 271086 264296 259033 254950 251674 248678 245800 243415 241640 240001
55732 240001 238282 236840 235682 234106 231768 229139 226366 222738 218007 213300 209829 207501 205538 203670
55718 203670 201969 200310 198814 198143 198597 199583 200678 202448 205532 209683 214382 219581 224999 229446 231776
55703 231776 231986 230642 227902 223861 219183 214435 209315 203325 196742 190264 184273 179108 175368 173096
55689A73096j812k244k317j599r72q48m00Q72K160K666K727K940L107K745J957
55674A82078J137M38o8k21n4J65K04j80j267k783l628l107k003j479j318n04Q64
55657A68274J649J530J353J550J636J429J425J692J659J247J072J302J445J436
55643A88699J688J948J411K02o33q73j518l038m612n516n986o187n672m562l964
55628A51387m424n015m693l645k589j718j009p78j134j580j688j613j598j683
55614A18220k131l156m078l768k368j291j211j246p44m09q29j266r80o04q62r82
55598I2295R4J659J921M88j232j952j671r67k68O7j49n02l25L41P44M90M1l6J54
55579I1192J60o7o9M87J322J812J683J308J175J320J503J691J991K207J954J243
$$ plain form
55689 173096 171284 169040 166723 165124 164152 163304 162904 163776 165936 168602 171329 174269 177376 180121 182078
55674 182078 183215 183653 183585 183364 183310 183475 183679 183499 182232 179449 175821 172714 170711 169232 167914 167410 168274
55657 168274 169923 171453 172806 174356 175992 177421 178846 180538 182197 183444 184516 185818 187263 188699
55643 188699 190387 192335 193746 193948 193315 192442 190924 187886 183274 177758 171772 165585 159913 155351 151387
55628 151387 146963 141948 137255 133610 131021 129303 128294 127516 126382 124802 123114 121501 119903 118220
55614 118220 116089 112933 108855 105087 102719 101428 100217 98971 98227 97818 96989 95723 94743 94139 93277 92295
55598 92295 92389 94048 95969 96457 95225 93273 91602 90635 90367 90434 90285 89783 89458 89799 90543 91033 91074 91038 91192
55579 91192 91352 91285 91216 91703 93025 94837 96520 97828 99003 100323 101826 103517 105508 107715 109669 110912
55563A10912N38K28K74L49qj121k616l369k684j295n71q45j298j375j320j318
55547I4481j105p20o99j126j293p56n0J85J34L89J063J782K175K009J259L31j42
55530I7917M0M78P65Q47P79O89R10J500J633L73j752k929k281j024q37j758k504
55513I2846k309j637j270j387j596j461r75n62n87q68r83q70p61o10k01J90j4
55496G6945p48j226r90l79J95P09J027P21j52q07p41m05m31o78o10j64K61M22
55478G2949L79K45J61L00O66J029J200J159R29N97M32N51O38L81K8r3l70j330
55460G9851k423k428j195L6L54J63J13P8j61k12K24O75O78N62P42Q11J84p90j221
55441G6041r16n26n16p00p29n67m55o05r42j048n58L21R49R39M39k56q78j051
$$ plain form
55563 110912 111450 111678 111952 112301 112293 111172 108556 105187 102503 101208 100637 99792 98494 97119 95799 94481
55547 94481 93376 92656 91957 90831 89538 88782 88732 88917 89051 89440 90503 92285 94460 96469 97728 98059 97917
55530 97917 97957 98435 99200 100047 100826 101515 102425 103925 105558 105931 104179 101250 98969 97945 97108 95350 92846
55513 92846 90537 88900 87630 86243 84647 83186 82211 81649 81062 80194 79211 78341 77580 76970 76769 76959 76945
55496 76945 76197 74971 73981 73602 73797 74506 75533 76254 76102 75295 74554 74149 73718 73040 72430 72266 72527 72949
55478 72949 73328 73573 73734 74034 74700 75729 76929 78088 79017 79614 80046 80597 81235 81616 81644 81551 81181 79851
55460 79851 77428 75000 73805 73841 74195 74358 74471 74549 74388 74176 74400 75075 75753 76315 77057 77868 78052 77262 76041
55441 76041 75125 74599 74083 73383 72654 72087 71632 71027 70085 69037 68479 68800 69749 70688 71127 70871 69993 68942
55423F8942n41K51N79K38k73n13m38k3P34J428J560J288J104Q28o2j110j078J41
55405G3055J128Q99J97R1L66K12l75q09r56j060j046o40J05Q81J392J300N17l07
55387G4950k87L74N33j13m48K93J280J410P76K5q04j778k283j851j065o45k88
55370G0079N00J223J142O64P16J195J187M57l78q96j082q58k91J7l00o40l55P1
55352G2451j17m78l5R33J158L70l46k72J22K64L06N26P73Q76Q74P37L96Q2K2j37
55332G8505q00j512j398n12K03L03L23O69R10N18l04q53o42J94R01O63l91j099
55314G5678o64K29M23p6m04l94o59j270j489r69j83M68R99J236Q53K10J29O91
55296G4808J097R58O79M65K5m36r2J063J757J147Q8j44M43Q95P51K70k87p56p90
$$ plain form
55423 68942 68401 68652 69231 69469 69196 68683 68245 68222 68956 70384 71944 73232 74336 75164 75102 73992 72914 73055
55405 73055 74183 75082 75279 75370 75736 75948 75573 74764 73808 72748 71702 71062 71167 72048 73440 74740 75257 74950
55387 74950 74663 75037 75570 75457 75009 75302 76582 77992 78768 78793 77989 76211 73928 72077 71012 70367 70079
55370 70079 70579 71802 72944 73608 74324 75519 76706 77163 76785 75889 74807 73949 73658 73675 73375 72735 72380 72451
55352 72451 72334 71856 71821 72754 73912 74282 73936 73664 73786 74050 74356 74882 75655 76531 77405 78142 78538 78620 78642 78505
55332 78505 77705 76193 74795 74283 74486 74789 75112 75781 76691 77209 76905 76052 75410 75604 76505 77168 76777 75678
55314 75678 75014 75243 75666 75590 75186 74792 74133 72863 71374 70405 70222 70690 71689 72925 73778 73988 74117 74808
55296 74808 75905 76863 77542 78007 78032 77596 77504 78567 80324 81471 81559 81415 81858 82753 83504 83774 83487 82731 81941
55277H1941k79K11Q5l57l38K23O17M07l5j69L8K79L75L11N7l40o36n57j34K53
55257H1952K83Q0L5K87O07P24N85K47j82m69m38l51o71j306j541j067m91m29o16
55238G7239m40Q2N39Q77J227J272O67j07k22K90N85K96o7j28k14o28j054j051
55220G9163o34j06L38N54M19O5j72j57n6J6Q4J36J47K63N66P33L90k57o47o39
55200H0206n75o11m80L4Q25J666K210J975Q00o83j593j756j625j436j088p42p28
55183G6399q07l34P05J478J382P31J43j69k44r6J67K86J62p4l65o96q27m97J22
55164G7466O02Q49R81Q57M11K21R08J938K055J006j1K4P90J407J518J180M03n82
55146I2023j198j196j044j184j301p71M52J726K265J719N33k66p5M83L61m10q46
$$ plain form
55277 81941 81662 81873 81958 81601 81263 81486 82103 82510 82475 82306 82344 82623 82998 83309 83366 83026 82390 81833 81699 81952
55257 81952 82235 82315 82350 82637 83244 83968 84553 84800 84618 84149 83711 83360 82689 81383 79842 78775 78284 77855 77239
55238 77239 76799 76881 77420 78297 79524 80796 81463 81356 81134 81424 82009 82305 82238 82110 81896 81268 80214 79163
55220 79163 78529 78423 78761 79315 79734 79799 79627 79470 79414 79430 79514 79650 79797 80060 80626 81359 81749 81492 80845 80206
55200 80206 79631 79020 78540 78574 79399 81065 83275 85250 86050 85367 83774 82018 80393 78957 77869 77127 76399
55183 76399 75592 75258 75963 77441 78823 79554 79697 79528 79284 79188 79355 79641 79803 79729 79364 78668 77841 77344 77466
55164 77466 78068 78917 79898 80755 81166 81387 82295 84233 86288 87294 87283 87307 88097 89504 91022 92202 92605 92023
55146 92023 90825 89629 88585 87401 86100 85329 85781 87507 89772 91491 92024 91758 91683 92166 92527 92117 91271
55129I1271o25n14q78r22n6Q91P52l13j167j214p41j13N32R31Q32M36K10K16J65
55110H9693J9O4L36M93L36J55L18Q02J203J165P12J81j06o0K01M69M67L3o22j018
55090I4841j001r08r17o63J01R21J251J267J425J570J222N50J35rl46q57j065
55073I7517r43q84q39m63n7k95r38j015m12q5m00n92k07J60J37L29J025J383P20
55054I4141l30q04o86m26p6K90K29j74K8J112J815J033m17r85n63j79j23J36N38
55035I4559L92l15q04p52o16o41n58k89r5J43Q49J869K373J870P33l19p24k21
55017I7454Q65J541J005k81j046o71K95R89J034M85k91o58k59L43J75q84j772
55000I8324j494k79P26P55J94J15J056K355K893K355J411O58Q0l09j16O89J318
$$ plain form
55129 91271 90646 90132 89254 88332 88276 89167 89919 89606 88439 87225 86484 86371 86903 87834 88666 89102 89312 89528 89693
55110 89693 89712 89776 90112 90605 90941 91096 91414 92216 93419 94584 95296 95477 95371 95311 95512 95981 96448 96481 95859 94841
55090 94841 93840 92932 92015 91352 91453 92374 93625 94892 96317 97887 99109 99659 99794 99785 99439 98582 97517
55073 97517 96574 95690 94851 94388 94331 94036 93098 92083 91671 91586 91186 90594 90387 90547 90684 91013 92038 93421 94141
55054 94141 93811 93007 92321 91895 91819 92109 92338 92164 92192 93304 95119 96152 95735 94750 94187 94008 93885 94021 94559
55035 94559 94951 94636 93832 93080 92464 91823 91265 90976 90881 91024 91873 93742 96115 97985 98718 98399 97675 97454
55017 97454 98319 99860 100865 100584 99538 98867 99162 100151 101185 101670 101379 100721 100462 100805 100980 100096 98324
55000 98324 96830 96551 97277 98032 98226 98341 99397 101752 104645 107000 108411 109069 109149 108840 108724 109413 110731
54983A10731J135M77l6m47j007j367j095n28k83k31J34O10N52N1j49J33K98L8
54965A09016k02p2J71J96J16J61K80K50n6n42q90p73l25p1k08l08m8K20J07j50
54945A06872k04k63n45o16p7O06P19L96J80Jm39o44J70J651K556K313J386K40
54927A14302r37j558r69M04J315J360J361J942K729L238L552L809L925M102M683
54912A43258N294N038L860K758K253J656L30j281k468l218l803m125m126m169
54898A41257m427m489m104l655l392k847j701o07l71p55q71m58n8j00l78m11Q6
54881A12719J045K029K459K146J500J141J409K258L343M181M530M701N133N635
54867A54229N483M341K642J045r6p42j212k129l748n310n792n258m762m794m697
$$ plain form
54983 110731 111866 112343 112307 111860 110853 109486 108391 107863 107580 107349 107483 108093 108645 108696 108547 108680 108978 109016
54965 109016 108814 108742 108913 109109 109225 109386 109666 109916 109860 109318 108428 107655 107330 107259 107051 106743 106695 106915 107022 106872
54945 106872 106668 106405 105860 105244 105167 105773 106492 106888 107068 107069 106630 105986 106156 107807 110363 112676 114062 114302
54927 114302 113365 111807 110838 111242 112557 113917 115278 117220 119949 123187 126739 130548 134473 138575 143258
54912 143258 148552 153590 157450 160208 162461 164117 164447 163166 160698 157480 153677 149552 145426 141257
54898 141257 136830 132341 128237 124582 121190 118343 116642 116035 115664 114909 114038 113580 113522 113422 113044 112633 112719
54881 112719 113764 115793 118252 120398 121898 123039 124448 126706 130049 134230 138760 143461 148594 154229
54867 154229 159712 164053 166695 167740 167644 166902 165690 163561 159813 154503 148711 143453 138691 133897 129200
54852A29200l829k497j412r26j086j777k422k264j343n43m12o12p72j074j526
54837A06705j586r99l22n7MJ34J15j11k0O03J113R29K92m09j264k079j976o60
54819A00412O98J001Q11J279K113K022Q39k36m32j88l9J15L54M00J76O6K55M07
54801A10053K01k43o05o34k31L70O47M55L56P69J182Q77J13k34mJ83R9J64M55
54782A13973M66M5k29O6O34J047J267J357J203Q67O89Q35J094J238J217J013Q26
54765A27608J287K823M763N878N850N508N460N349M775L985L201K063L76j236
54751A77690k124k566l204l994m402m361m290m246l831k931k074j802k035k225
54737A33605j972j454j211j473j700j205j96K74l25j205j278n34J83N39J053K105
$$ plain form
54852 129200 125371 122874 121462 120536 119450 117673 115251 112987 111644 111101 110689 110077 109305 108231 106705
54837 106705 105119 104120 103798 103741 103745 103879 103994 103883 103863 104466 105579 106508 106800 106391 105127 103048 101072 100412
54819 100412 101110 102111 102922 104201 106314 108336 109175 108939 108507 108319 108280 108395 108749 109149 109325 109391 109646 110053
54801 110053 110254 110011 109406 108772 108541 108911 109558 110013 110369 111138 112320 113197 113310 113076 113072 113255 113354 113518 113973
54782 113973 114439 114484 114255 114321 114955 116002 117269 118626 119829 120696 121385 122220 123314 124552 125769 126782 127608
54765 127608 128895 131718 136481 142359 148209 153717 159177 164526 169301 173286 176487 178550 178926 177690
54751 177690 175566 173000 169796 165802 161400 157039 152749 148503 144672 141741 139667 137865 135830 133605
54737 133605 131633 130179 128968 127495 125795 124590 124394 124668 124343 123138 121860 121326 121509 122048 123101 125206
54721A25206L263L824L631L132K916L290M076M669M532L686K575J457K89q27j521
54706A64198j708j914k695l931m968n402n294m768l778k462j395j116j489j766
54692A21512j416p02l31o14j123j237q31l25p4JJ61M39O84Q35R78J065R28N30
54674A20480M0m15q53j160j050m81J36L47J61j26l89o18o25k68Q7j40r19j484
54656A12723j221l78L33N07K89J11L76J060J553J212K75k52J24P23O92J82j22
54639A18187k04o08j245j235k21R10J120N30R8L00O63O06J73j52p1L04O48O76
54621A20479K83l09n55MJ204K122J816K57j508k299j844q61j99OK72R91J840K078
54603A23777J436M80n4r5j05k31j20L85P88N68j08o24o96n28l47j50J06L90O57
$$ plain form
54721 125206 128469 132293 135924 139056 141972 145262 149338 154007 158539 162225 164800 166257 166546 165719 164198
54706 164198 162490 160576 157881 153950 148982 143580 138286 133518 129740 127278 125883 124767 123278 121512
54692 121512 120096 119394 119063 118449 117326 116089 115258 114933 114859 114860 115021 115460 116144 116979 117957 119022 119950 120480
54674 120480 120520 120105 119252 118092 117042 116561 116697 117044 117205 117079 116690 116072 115447 115179 115266 115126 114207 112723
54656 112723 111502 111124 111457 111964 112253 112364 112740 113800 115353 116565 116840 116588 116712 117435 118127 118309 118187
54639 118187 117983 117375 116130 114895 114674 115584 116704 117234 117332 117632 118295 118901 119074 118922 118851 119155 119803 120479
54621 120479 120762 120453 119898 119902 121106 123228 125044 125301 123793 121494 119650 118789 118590 118596 118868 119859 121699 123777
54603 123777 125213 125693 125639 125544 125439 125208 125088 125473 126261 126829 126721 126097 125401 124873 124526 124376 124482 124872 125529
54584A25529Q12O16l5p64r13k50P21J215Q69o8r94j378j067l34L53O38M28j11
54566A25267o36q53p45m54P1R92J974K119R59p09j567j275o65m57m56k25N8k3
54548A23375l46m15j13K61N97J113J787K199K123J887J855J858J499Q54M32M78
54532A39444P23Q66Q78P25K21n47j024q49m67m99p57n12K25M62l94j545j791j003
54514A34156m8M76O94P90O35K62L9J00Q5k85p42r09q44q14q13p19o40p05p00l58
54494A29660J17L35L47M61N17L5p92j001j73Q51J099P29N33O52O54N89R35J537
54476A37085J593R30L55L71M06j08p10o54q8L58N84Q69J031P15K45L05P92R44
54458A45023O09M90Q90J115N54l47p11m27r3p0q1K25O84P22J20m92k56O57J017
$$ plain form
54584 125529 126341 126957 126922 126158 125245 124995 125716 126931 127800 127732 126738 125360 124293 123959 124312 124950 125378 125267
54566 125267 124631 123778 123033 122579 122650 123642 125616 127735 128694 127985 126418 125143 124478 124021 123565 123340 123398 123375
54548 123375 123029 122614 122501 122762 123359 124472 126259 128458 130581 132468 134323 136181 137680 138534 138966 139444
54532 139444 140167 141033 141911 142636 142857 142310 141286 140437 139970 139471 138714 138202 138427 138889 138495 136950 135159 134156
54514 134156 134108 134584 135278 136068 136703 136965 137004 137104 137189 136904 136162 135253 134409 133595 132782 132063 131423 130718 130018 129660
54494 129660 129777 130112 130459 130920 131437 131472 130680 129679 129506 130357 131456 132185 132718 133370 134024 134613 135548 137085
54476 137085 138678 139608 139963 140334 140740 140632 139922 139268 139180 139538 140122 140991 142022 142737 142982 143287 144079 145023
54458 145023 145632 146122 147012 148127 148681 148334 147623 147196 147103 147033 146952 147177 147861 148583 148703 148211 147955 148612 149629
54439A49629J53r77j091m02j67o68r73o73n21r59j251p47R2O17J038J689K082
54422A46871J614O44n6l93o78p97n33k42l18l44K77J140J292O67J06jr3m28n88
54403A48140k17M73J115J598J799J482O45k91p99n54L44J254J363N89j67j22M19
54386A57071P45Q59J102J078O5j581k475j889n31M93P12J90p94j577j424l65P40
54369A52419J207J153R38O81M98O17R67J161J140J303J760K035J743J114O14M28
54353A69778N31P34O00j88j173j446p62J81P13Q09O54K93jK12Q13J130R58Q23
54335A74659R24O57k95j284j753k101k718l028k392j405j124j438j397q58o00
54320A55847q53q77l02K02O2k73r5M29O01K83J3J65N10O57N19K10k52q58j312
$$ plain form
54439 149629 149782 148805 147714 147312 147145 146477 145504 144831 144310 143351 142100 141353 141445 142062 143100 144789 146871
54422 146871 148485 149129 149073 148680 148002 147205 146672 146430 146112 145768 146045 147185 148477 149144 149250 149249 149156 148728 148140
54403 148140 147923 148396 149511 151109 152908 154390 155035 154744 153945 153391 153735 154989 156352 156941 156774 156652 157071
54386 157071 157816 158675 159777 160855 160920 159339 156864 154975 154444 154937 155649 155839 155045 153468 152044 151679 152419
54369 152419 153626 154779 155717 156398 156896 157513 158480 159641 160781 162084 163844 165879 167622 168736 169350 169778
54353 169778 170309 171043 171643 171455 170282 168836 168074 168255 168968 169777 170431 170724 170723 170935 171748 172878 173836 174659
54335 174659 175583 176240 175945 174661 172908 170807 168089 165061 162669 161264 160140 158702 157305 156447 155847
54320 155847 154994 154117 153815 154017 154079 153806 153711 154140 154741 155024 155037 155202 155712 156369 156888 157098 156846 155988 154676
54301A54676j167m08L35M35L5j63J45N30M72k6o73j247j575j479j064p48p27p24
54283A46627n03k46n2M45J443K334K320J536Q50O43M72j4m61l98M6M04M93M69
54265A56408M03J99j56m88o20m75l5P00J521J918J465M25k67R5J127J773J520
54248A65513Q11K44k00q02j440j747j649j374j058p47o61r85j438j450r14l69
54232A51734l64p87j059p87j03N00N93J53m06n61j44N15R25R68J019J477K131
54215A55804K218J263k46j266j255n98l0P0k16n56n93k07K97M81L43L05N57P66
54197A57137O33L72L46M95M61J29k17k55J1K30Lo45j127r11k83p1o09j370j756
54178A52573j720j365n81M74J020M92n91j144p74j0N35P23O66N15M20L55O0n09
$$ plain form
54301 154676 153509 153101 153436 153871 153906 153743 153888 154418 154890 154864 154191 152944 151369 149890 148826 148078 147351 146627
54283 146627 146124 145878 145826 146271 147714 150048 152368 153904 154754 155397 155869 155855 155394 154996 155042 155446 155939 156408
54265 156408 156811 157010 156854 156366 155746 155271 155236 155936 157457 159375 160840 161265 160998 161093 162220 163993 165513
54248 165513 166324 166568 166368 165566 164126 162379 160730 159356 158298 157551 156890 155905 154467 153017 152103 151734
54232 151734 151370 150583 149524 148737 148634 149134 149727 149880 149474 148913 148769 149284 150209 151177 152196 153673 155804
54215 155804 158022 159285 159039 157773 156518 155920 155890 155960 155744 155188 154595 154388 154685 155166 155509 155814 156371 157137
54197 157137 157770 158142 158488 158983 159444 159573 159356 159101 159112 159342 159345 158700 157573 156662 156379 156308 155699 154329 152573
54178 152573 150853 149488 148907 149381 150401 150893 150302 149158 148384 148374 148909 149632 150298 150813 151233 151588 151648 151139
54160A51139q40m89J53K84j42l65L8N45N14M5k76j79O9M4m24j070j307p35L41
54141A47345J171J386J291J211R89L64l77o06r1P38J296J359J063N95Q3l17m20
54124A57080k07L4m7m35o98m83O7N53Q30J101J477J731J630J310J105J027P15
54107A66790j4p38q40l03J75K5n08p42m70j06m6k21l43k53K1L36M35J81j42l4
54087A63203O09J324J615J388Q21J07m83o66m56j53J06M55Q72J016P86O12Q85
54070A72041J371J553J245O12j51p47o86K21J421K079J911J311P71N16N52P54
54054A84774R10R35J014J415K249L460M842O003O647O991P584Q527R318R645R774
54039B64088R819R183P290M445J505q75k293k432j557p23p33j207j385j327j476
$$ plain form
54160 151139 150299 149810 149963 150247 150105 149740 149778 150323 150837 150882 150606 150427 150496 150540 150116 149046 147739 147004 147345
54141 147345 148516 149902 151193 152404 153393 153757 153380 152774 152683 153421 154717 156076 157139 157734 157817 157500 157080
54124 157080 156873 156907 156860 156425 155727 155244 155311 155864 156694 157795 159272 161003 162633 163943 165048 166075 166790
54107 166790 166776 166038 165198 164895 165070 165095 164587 163845 163375 163269 163223 163002 162659 162406 162427 162763 163198 163379 163237 163203
54087 163203 163812 165136 166751 168139 168960 169067 168584 167918 167462 167309 167415 167870 168742 169758 170544 171156 172041
54070 172041 173412 174965 176210 176822 176671 175924 175238 175459 176880 178959 180870 182181 182952 183468 184020 184774
54054 184774 185684 186619 187633 189048 191297 194757 199599 205602 212249 219240 226824 235351 244669 254314 264088
54039 264088 273907 283090 290380 294825 296330 295455 293162 290730 289173 288450 287717 286510 285125 283798 282322
54024B82322j483o50O27J101M95j26o3k9q70k220l114l288l182l109l068l075
54008B60268l154l162l078l231l820m370m196l365k774l079l834l926k875j429
53994B13975o88q06r29m64J94M18K34p9p17j877k897k776j576m62k22m91o07n28
53976A99702n71q17j152j482j631j417r62o23m99m25m04n39n22J05J098J593J292
53959A92746Q64Q59J008R70J015J360J527J088O35J122K475L595L697L069K465
53944B18495K248K321K552L043L937N045N844O023N954O200O680O802O452O211
53930B87807O429O713O653O470O511O636O581O446O301N776M662L574L324L788
53916C67671M073L686K986K522K464K654K843K757K286J624J012M42j99q36j356
$$ plain form
54024 282322 280839 280189 280816 281917 282412 282286 282223 282194 281324 279104 275990 272702 269520 266411 263343 260268
54008 260268 257114 253952 250874 247643 243823 239453 235257 231892 229118 226039 222205 218279 215404 213975
53994 213975 213287 212481 211552 211088 211282 211700 211934 211855 211138 209261 206364 203588 202012 201550 201328 200837 200230 199702
53976 199702 199131 198314 197162 195680 194049 192632 191670 191047 190548 190123 189719 189180 188658 188763 189861 191454 192746
53959 192746 193610 194469 195477 196447 197462 198822 200349 201437 202072 203194 205669 209264 212961 216030 218495
53944 218495 220743 223064 225616 228659 232596 237641 243485 249508 255462 261662 268342 275144 281596 287807
53930 287807 294236 300949 307602 314072 320583 327219 333800 340246 346547 352323 356985 360559 363883 367671
53916 367671 371744 375430 378416 380938 383402 386056 388899 391656 393942 395566 396578 397020 396821 395985 394629
53901C94629j790k100k001j399p65o83j064j240p68K02J255K045K402K406K314
53886C93443K084J076j329m877q499j1211j2649j2862j2095j0890r922r466r202
53873B93601q687p894p165o696o258n477m349l378l062l324l672l802l702l280
53859B22855k376j325r13j414k030j839r34k12k88j028j919k451k270j455o15
53844B01786k78l22l09k18l66p31q76o34l73m64p77q98n90PM79N13K76K87O98
53825A97210J003P82M33O68J448K026J948J464Q94L20M0O60K287L978M555L794
53809B23510K541J739J631J882K140K325K449K467K470K913M176N891P038P020
53795B70192O198N139L851K267J012Q31J451J872J771J724J950J762P50l60p27
$$ plain form
53901 394629 392839 390739 388738 387339 386574 385891 384827 383587 382819 383021 384276 386321 388723 391129 393443
53886 393443 395527 396603 395274 390397 381898 370687 358038 345176 333081 322191 312269 302803 293601
53873 293601 284914 277020 269855 263159 256901 251424 247075 243697 240635 237311 233639 229837 226135 222855
53859 222855 220479 219154 218241 216827 214797 212958 212024 211812 211524 210496 208577 206126 203856 202401 201786
53844 201786 201508 201186 200877 200659 200293 199562 198686 198052 197679 197215 196438 195540 194950 194957 195436 195949 196225 196512 197210
53825 197210 198213 198995 199428 200096 201544 203570 205518 206982 207876 208196 208236 208896 211183 215161 219716 223510
53809 223510 226051 227790 229421 231303 233443 235768 238217 240684 243154 246067 250243 256134 263172 270192
53795 270192 276390 281529 285380 287647 288659 289490 290941 292813 294584 296308 298258 300020 300770 300410 299683
53780B99683o50j073k199l369m141m721n273n455m985m264m061m665n513n704
53766B43610m868l497k373j775j408j083j034j375j700j626j472j795k389k394
53752B14821j550p52r19j778k215j657n57L56P69O81J82m07n77k18J60J18k5L18
53734B06750R88J181O13l8j04K14L56L86Q38J715K333K270J947K007K463K821
53718B26740K826K613K184J298P0p13k89J160K660L440L531L338L115K944K817
53703B57734K520J783Q02K50N04J185J808K429L192L732L695L440L452L414K751
53688B92691J848J566J699J134k18j026n87j2m88j451j535n74M75J025J167Q44
53672B96558j27j316j960j942j768j657j406j065r45j005r51p97p03l84N45J691
$$ plain form
53780 299683 299033 297960 295761 292392 288251 283530 278257 272802 267817 263553 259492 254827 249314 243610
53766 243610 238742 235245 232872 231097 229689 228606 227572 226197 224497 222871 221399 219604 217215 214821
53752 214821 213271 212519 211600 209822 207607 205950 205393 205749 206518 207199 207381 206974 206397 206179 206339 206457 206432 206750
53734 206750 207738 208919 209532 209494 209390 209604 209960 210346 211184 212899 215232 217502 219449 221456 223919 226740
53718 226740 229566 232179 234363 235661 235731 235018 234729 235889 238549 241989 245520 248858 251973 254917 257734
53703 257734 260254 262037 262839 263089 263593 264778 266586 269015 272207 275939 279634 283074 286526 289940 292691
53688 292691 294539 296105 297804 298938 298720 297694 297107 297095 296607 295156 293621 293047 293522 294547 295714 296558
53672 296558 296431 295115 293155 291213 289445 287788 286382 285317 284372 283367 282416 281619 280916 280532 281077 282768
53656B82768K149J657P88K6o06j038j087r08q41p23j46O38R30P29P52J211J559
53639B87858J609J841K273K135J243N78Q43J363J286R44J096J578J756J773K121
53624C10297K440J988J149J201K389L445L424K998L294M209M666M206L494L303
53610C52503L582L733L521L330L634M316M725M371L514K941L156L832M137L621
53596D04916K691K058J879J668J124O02N13O59O00M56O80J205J401J026N63M23
53580D22464L85M0o58j560k608l641m303m521m677n018n214m899m222l562k943
53565C75063k245j580j127p81l84m8J34L77P58Q35L31j44K63J340J938J497P05
53548C76932L96M76L86J13K56J212K738M255N256N490N099M651M773N600O650
$$ plain form
53656 282768 284917 286574 287362 287388 286782 285744 284657 283749 282908 282185 282039 282677 283607 284336 285088 286299 287858
53639 287858 289467 291308 293581 295716 296959 297537 298380 299743 301029 301973 303069 304647 306403 308176 310297
53624 310297 312737 314725 315874 317075 319464 322909 326333 329331 332625 336834 341500 345706 349200 352503
53610 352503 356085 359818 363339 366669 370303 374619 379344 383715 387229 390170 393326 397158 401295 404916
53596 404916 407607 409665 411544 413212 414336 414938 415451 416110 416710 417166 417846 419051 420452 421478 422041 422464
53580 422464 422849 422889 422231 420671 418063 414422 410119 405598 400921 395903 390689 385790 381568 378006 375063
53565 375063 372818 371238 370111 369330 368946 368898 369032 369409 370167 371002 371333 371189 371452 372792 374730 376227 376932
53548 376932 377328 377804 378190 378303 378559 379771 382509 386764 392020 397510 402609 407260 412033 417633 424283
53533D24283P401P802Q122Q424Q515Q406Q483R018R849J0760J1845J3151J4233
53520E50292J4631J4661J5142J6300J7514J8233J8589J8964J9537K0418K1674
53509G45955K2946K3584K3528K3456K3741K3873K3380K2653K2283K2110K1768
53498I99277K1640K2388K3630K4141K3350K1895K0610J9664J8854J8094J7324
53487A230867J6528J6020J6200J6853J7235J7045J6745J6652J6336J5362J4076
53476A409919J3102J2321J1036Q978O611M381K201j85k673m969p005q875j0447
53463A434395j1361j1537j1508j1983j3185j4798j6438j7912j9021j9564j9740
53452A267348k0149k1058k1884k1822k0865j9784j9145j8766j8183j7222j5931
$$ plain form
53533 424283 431684 439486 447608 456032 464547 472953 481436 490454 500303 511063 522908 536059 550292
53520 550292 564923 579584 594726 611026 628540 646773 665362 684326 703863 724281 745955
53509 745955 768901 792485 816013 839469 863210 887083 910463 933116 955399 977509 999277
53498 999277 1020917 1043305 1066935 1091076 1114426 1136321 1156931 1176595 1195449 1213543 1230867
53487 1230867 1247395 1263415 1279615 1296468 1313703 1330748 1347493 1364145 1380481 1395843 1409919
53476 1409919 1423021 1435342 1446378 1455356 1461967 1466348 1468549 1468364 1465691 1460722 1453717 1444842 1434395
53463 1434395 1423034 1411497 1399989 1388006 1374821 1360023 1343585 1325673 1306652 1287088 1267348
53452 1267348 1247199 1226141 1204257 1182435 1161570 1141786 1122641 1103875 1085692 1068470 1052539
53441A052539j4234j2032r543p315n788m806l724k102k79R88J488J857K752M090
53427A003891N439O729Q118R358R942R984J0382J1910J4402J6977J8763J9425
53415A145320J9306J9202J9757K0972K2452K4040K5887K8001L0129L2153L4169
53404A421388L6144L7969L9922M2547M5713M8355M9561M9690M9943N1026N2668
53393A924926N4245N5405N6017N5947N5145N3816N2343N1040M9930M8697M6885
53382B504396M4250M0983L7605L4597L2061K9681K7038K4114K1288J8628J5313
53371B829954J0235L259m463j1674j8165k4535l1132l7608m3365m7943n1062n2708
53359B520793n3324n3606n3876n3812n2942n1288m9379m7710m6381m5275m4348
$$ plain form
53441 1052539 1038305 1026273 1016730 1009415 1003627 998821 995097 992995 992716 993704 995192 997049 999801 1003891
53427 1003891 1009330 1016059 1024177 1033535 1043477 1053461 1063843 1075753 1090155 1107132 1125895 1145320
53415 1145320 1164626 1183828 1203585 1224557 1247009 1271049 1296936 1324937 1355066 1387219 1421388
53404 1421388 1457532 1495501 1535423 1577970 1623683 1672038 1721599 1771289 1821232 1872258 1924926
53393 1924926 1979171 2034576 2090593 2146540 2201685 2255501 2307844 2358884 2408814 2457511 2504396
53382 2504396 2548646 2589629 2627234 2661831 2693892 2723573 2750611 2774725 2796013 2814641 2829954
53371 2829954 2840189 2843448 2838985 2827311 2809146 2784611 2753479 2715871 2672506 2624563 2573501 2520793
53359 2520793 2467469 2413863 2359987 2306175 2253233 2201945 2152566 2104856 2058475 2013200 1968852
53348A968852m3651m3170m2742m2158m1212l9762l7885l5953l4236l2471l0102
53337A545510k7098k4201k2039k0345j8399j6053j3837j2186j1092j0531j0662
53326A359067j1424j2433j3409j4315j4935j4823j3982j3111j2772j2645j2068
53315A213150j0961r746q607p393o122n021m053k869j375J24J394K572L861N248
53301A170202O678Q267J0113J2106J4087J6062J8120K0269K2409K4335K5750K6443
53289A374841K6506K6227K5679K4595K2784K0575J8681J7577J7061J6353J4742
53278A605621J2202R321O563L750N00l006o126q625j0995j3766j6849j9763k2207
53265A536620k4146k5605k6682k7642k8654k9581l0179l0393l0286k9844k9099
$$ plain form
53348 1968852 1925201 1882031 1839289 1797131 1755919 1716157 1678272 1642319 1608083 1575612 1545510
53337 1545510 1518412 1494211 1472172 1451827 1433428 1417375 1403538 1391352 1380260 1369729 1359067
53326 1359067 1347643 1335210 1321801 1307486 1292551 1277728 1263746 1250635 1237863 1225218 1213150
53315 1213150 1202189 1192443 1183836 1176443 1170321 1165300 1161247 1158378 1157003 1157127 1158521 1161093 1164954 1170202
53301 1170202 1176880 1185147 1195260 1207366 1221453 1237515 1255635 1275904 1298313 1322648 1348398 1374841
53289 1374841 1401347 1427574 1453253 1477848 1500632 1521207 1539888 1557465 1574526 1590879 1605621
53278 1605621 1617823 1627144 1633707 1637457 1637957 1634951 1628825 1620200 1609205 1595439 1578590 1558827 1536620
53265 1536620 1512474 1486869 1460187 1432545 1403891 1374310 1344131 1313738 1283452 1253608 1224509
53254A224509k8265k7451k6454k5152k3910k3202k2962k2791k2673k2954k3523
53243I55172k3689k3078k2138k1425k0765j9607j7917j6233j4902j3708j2275
53232G49435j0562q913p757p351p698q594r750j0778j1250j0975j0369j0276j1250
53219F23912j3078j4945j6035j5944j4892j3595j2671j2083j1416j0667j0292
53208D78294j0331j0144r341q451q139q255q208p956p937q239q528q721q999r249
53194C55796r087q447p611o669n545m469l821l444k898k337k385k899k862j895
53180B91427j070j542k947l797l172j512K5N49O0n81m92J89M99k1p23r34q84j050
53162B74024j195q61l35l01p72j146j189j207j289j177r02r00j308j681j601j161
$$ plain form
53254 1224509 1196244 1168793 1142339 1117187 1093277 1070075 1047113 1024322 1001649 978695 955172
53243 955172 931483 908405 886267 864842 844077 824470 806553 790320 775418 761710 749435
53232 749435 738873 729960 722203 714852 707154 698560 688810 678032 666782 655807 645438 635162 623912
53219 623912 610834 595889 579854 563910 549018 535423 522752 510669 499253 488586 478294
53208 478294 467963 457819 448478 440027 431888 423633 415425 407469 399532 391293 382765 374044 365045 355796
53194 355796 346709 338262 330651 323982 318437 313968 310147 306703 303805 301468 299083 296184 293322 291427
53180 291427 290357 288815 285868 282071 278899 277387 277412 277961 278021 277440 276948 277137 277636 277615 276892 275958 275074 274024
53162 274024 272829 271968 271633 271332 270560 269414 268225 267018 265729 264552 263650 262750 261442 259761 258160 256999
53146B56999p17m99n56p92r78r95r58r19o18N3N68L11m27o79n8P66J025P82N76
53127B52884N90N65L02r2m05n32m76k39K15Q54J466J765J669J338R14M17n0l24
53109B60861n01q60j297j352j013r25j433j952j853j385j063o96O7O77K71q39
53093B46707j357p29K39O45M44j5n04o82k10O58J218J325J445J613J258L84o4
53076B52375M47J194J309Q89L79l46j372j955j433m37j50n92o55J58J043J099
53060B51953M62j45l82m58o26q62j018j052j042r24m34M68J188J036J78m62m32
53043B47448k85n70r27o94N2O63Q00N31j43j202k177k438j899r64L5R26J363J066
53025B41585L49j12j33j67n19q90q14k43M80R83J085Q76N96M19L26K77K96L30
$$ plain form
53146 256999 256282 255783 255227 254435 253457 252462 251504 250585 249967 250020 250588 250899 250472 249793 249735 250501 251526 252308 252884
53127 252884 253474 254039 254341 254249 253844 253312 252836 252597 252812 253666 255132 256897 258566 259904 260818 261235 261185 260861
53109 260861 260360 259500 258203 256851 255838 254913 253480 251528 249675 248290 247227 246531 246598 247275 247546 246707
53093 246707 245350 244621 244860 245505 245949 245934 245430 244748 244538 245196 246414 247739 249184 250797 252055 252439 252375
53076 252375 252822 254016 255325 256214 256593 256247 254875 252920 251487 251050 250900 250308 249653 249811 250854 251953
53060 251953 252415 252270 251888 251430 250804 249942 248924 247872 246830 245906 245472 245940 247128 248164 248342 247880 247448
53043 247448 247163 246593 245666 244972 245024 245687 246487 247018 246875 245673 243496 241058 239159 238195 238230 239156 240519 241585
53025 241585 241934 241822 241689 241522 241003 240113 239299 239056 239536 240519 241604 242480 243076 243495 243821 244098 244394 244724
53007B44724K44J14K20N71P91P08O72R50J175Q37K3p41j109r84l45M86Q16M24
52989B49576P1M97J269J429R91Q65J335J702J564J440J778K139J923J265P24N19
52973B69087N34O74Q27P86N74N40Q69J250J295J001N74J49q0J60P60J024M30n89
52955B79865j082p29k06k94r11j242p81m7q3j214k567k965k196j097n06n30q34
52938B62581j208j630j984j992j466n88R6J28l61p62p59o05n01j59N19Q02j03
52921B52008j759k808k509j340r9Q25J186Q15O0l66k54n7N6M56J094J131J15j184
52903B47370j743j490r50l22L74P97Q21J051J893K497J729l9j163q72p6J77J05
52886B50159M69J258J760J565Q98J25n77j071j162p02J43Q21O87k98j270j248
$$ plain form
53007 244724 244968 245082 245302 245873 246664 247372 248044 248994 250169 251006 251029 250288 249179 248195 247850 248336 249152 249576
52989 249576 249647 250144 251413 252842 253833 254698 256033 257735 259299 260739 262517 264656 266579 267844 268568 269087
52973 269087 269621 270295 271122 271908 272482 273022 273891 275141 276436 277437 278011 278160 278080 278240 279000 280024 280454 279865
52955 279865 278783 278054 277848 277554 276643 275401 274620 274573 274490 273276 270709 267744 265548 264451 263945 263415 262581
52938 262581 261373 259743 257759 255767 254301 253713 253809 253937 253576 252814 252055 251450 250949 250790 251309 252111 252008
52921 252008 250249 247441 244932 243592 243493 244318 245504 246319 246379 246013 245759 245702 245758 246214 247308 248439 248554 247370
52903 247370 245627 244137 243187 242865 243239 244036 244857 245908 247801 250298 252027 251988 250825 249953 249877 250054 250159
52886 250159 250628 251886 253646 255211 256109 256234 255657 254586 253424 252722 252865 253686 254373 254075 252805 251557
52870B51557k86O02P22M82O08J055J201Q86O60R03J235J087N77L40O00P96L71
52853B63396m39r75j063j079j143r29m26l03r92j888k116j771j699k166k497k164
52837B41746j530j229j346j517j476j127m26M54J077J211J110J062R24M14l61
52822B38986j055j581k013k176j757q69l9M00O04P72Q26O67M34K86J79N8R4M68
52804B34284J080J665K052K045J347q1j574k245j927j319j069j097j029q84q97
52789B30351r00m88K19N11j2r05j524j802k009j990j303j9J107J502J382J246
52773B25366J162R42P01P59R86R25N33L74O88Q32J09j107j728j374q26q74j241
52756B26227j064j64P48J056R91J157J626J840J407O77L31N60Q93Q70N97M26L86
$$ plain form
52870 251557 251271 251873 252595 253077 253685 254740 255941 256827 257487 258390 259625 260712 261289 261629 262229 263025 263396
52853 263396 262957 261982 260919 259840 258697 257768 257342 257039 256047 254159 252043 250272 248573 246407 243910 241746
52837 241746 240216 238987 237641 236124 234648 233521 233095 233549 234626 235837 236947 238009 238933 239347 238986
52822 238986 237931 236350 234337 232161 230404 229535 229496 229896 230500 231272 232098 232765 233199 233485 233664 233722 233816 234284
52804 234284 235364 237029 239081 241126 242473 242392 240818 238573 236646 235327 234258 233161 232132 231248 230351
52789 230351 229451 228963 229182 229693 229681 228776 227252 225450 223441 221451 220148 220129 221236 222738 224120 225366
52773 225366 226528 227470 228171 228930 229916 230841 231374 231748 232436 233268 233377 232270 230542 229168 228342 227468 226227
52756 226227 225163 224999 225747 226803 227794 228951 230577 232417 233824 234501 234832 235392 236285 237155 237752 238178 238564
52739B38564L03K89O67J337J724J483R60O99Q53J223J628J887J812J425J009O69
52723B56532J47o20j191j252j194j459j687j266n32n07j387k145j898r62j40L35
52707B40774O38O93L45j65m45n17o77r26r77p30k97K35P66R91P14K97L06P47J028
52688B42800Q06M57N13R18J158J028R50J389K098K202J178m53j634j879j581j298
52672B48652j169j090j000p87k47N30J075J164J120J207J111N25q6k0O25J056
52656B52666R43P38Q41J048J085J072J168J245J202J145R81K58j075k142j986
52641B59189q29P1j00q43j144o84K3M95P84J077J236J011O28O62J287K002K310
52624B67175K411K787L315L299K410J192M24K73L12Q0o23j768l038l827l607k487
$$ plain form
52739 238564 238867 239156 239823 241160 242884 244367 245327 246026 246879 248102 249730 251617 253429 254854 255863 256532
52723 256532 256679 256059 254868 253616 252422 250963 249276 248010 247478 246971 245584 243439 241541 240579 240439 240774
52707 240774 241412 242105 242450 242285 241840 241323 240646 239720 238743 238013 237716 237951 238717 239708 240422 240719 241025 241772 242800
52688 242800 243606 244063 244576 245494 246652 247680 248630 250019 252117 254319 255497 255044 253410 251531 249950 248652
52672 248652 247483 246393 245393 244606 244359 244889 245964 247128 248248 249455 250566 251091 251005 250985 251610 252666
52656 252666 253609 254347 255188 256236 257321 258393 259561 260806 262008 263153 264134 264392 263317 261175 259189
52641 259189 258360 258431 258331 257488 256344 255660 255683 256178 256962 258039 259275 260286 260914 261576 262863 264865 267175
52624 267175 269586 272373 275688 278987 281397 282589 283013 283286 283598 283678 283055 281287 278249 274422 270815 268328
52608B68328j175l42r3j05j11n8J06N04J038J234O41n68j620j857j270l29N00
52591B64823R43R11N56K24J37J47Kk94m74l47P7P09J421K026K351K270J644M65
52573B77591p52j133l81O05O17m46j452j408n19J99M5q20j630j715j085m18k89
52556B67009n56p02n50k62J33O76J032Q11K79R5K11j07r82j472r17L5L53J9k69
52537B64836k53k51l65l34j28j5l0M2K52M39N91Q27J133J475J933K338K117J045
52519B75652j47o04n39p67j211r13L68J566J770J362J200J398J625J993K784L556
52503B89093L348J914J32q93q53l15r5o43j833l152m065m259l662k491j232l42
52487B70652O6J37p5n25q72o57P1Q07J266J599J784J484P36K21L96Q11Q38O33
$$ plain form
52608 268328 267153 266811 266718 266613 266502 266444 266550 267054 268092 269326 269967 269399 267779 265922 264652 264323 264823
52591 264823 265766 266677 267233 267457 267594 267741 267743 267449 266975 266628 266705 267414 268835 270861 273212 275482 277126 277591
52573 277591 276839 275706 275325 275930 276547 276101 274649 273241 272722 272921 272966 272146 270516 268801 267716 267298 267009
52556 267009 266453 265751 265201 264939 265072 265748 266780 267591 267870 267965 268176 268069 267087 265615 264698 264733 265086 265105 264836
52537 264836 264583 264332 263967 263633 263505 263490 263460 263502 263754 264193 264784 265611 266744 268219 270152 272490 274607 275652
52519 275652 275505 274901 274362 273595 272384 271471 271839 273405 275175 276537 277737 279135 280760 282753 285537 289093
52503 289093 292441 294355 294487 293594 292741 292426 292331 291688 289855 286703 282638 278379 274717 272226 270994 270652
52487 270652 270718 270855 270780 270255 269383 268726 268797 269604 270870 272469 274253 275737 276473 276694 277090 277901 278739 279372
52469B79372P73J290J693J838K063K547L000L158L047K789K419J967J404N81n05
52454C07436j478j985k220k615l119l237k804k265k088k238k309j964j226n63
52440B77325n74j264j844j607q17k91k64k92j05R2J66J95N7m26q51n59K86P17
52422B69944M24K72R27J786J955J561J321J345J245J127J500K356L109L464L756
52407B96092M373N339O481P603Q565R513J0725J1837J1588R027M810N80k768n469
52393C78296p683q914q887q121p221o179m817l417k387j719j169p41n63n51m83
52378C15444k45J80P78J386J788K096K742L805M718M966M789M802N110N182M502
52363C62043L042J209l49j017o59J68P21Q25Q97J268J741J925J775J661J965K659
$$ plain form
52469 279372 280145 281435 283128 284966 287029 289576 292576 295734 298781 301570 303989 305956 307360 307941 307436
52454 307436 305958 303973 301753 299138 296019 292782 289978 287713 285625 283387 281078 279114 277888 277325
52440 277325 276751 275487 273643 272036 271219 270928 270664 270372 270267 270359 270525 270720 270777 270351 269500 268941 269227 269944
52422 269944 270368 270640 271567 273353 275308 276869 278190 279535 280780 281907 283407 285763 288872 292336 296092
52407 296092 300465 305804 312285 319888 328453 337966 348691 360528 372116 381143 385953 386533 383765 378296
52393 378296 370613 361699 352812 344691 337470 331291 326474 323057 320670 318951 317782 317041 316478 315927 315444
52378 315444 315199 315379 316157 317543 319331 321427 324169 327974 332692 337658 342447 347249 352359 357541 362043
52363 362043 365085 366294 365945 364928 364269 364437 365158 365983 366880 368148 369889 371814 373589 375250 377215 379874
52347C79874L305L493L316L333L960M991N843O220O407O865P617Q243Q503Q830
52333D60800R976J2044J4196J5566J6289J7251J8891K0715K2081K3006K3942K5077
52321F79834K6201K7104K7764K8170K8202K7732K6838K5839K5070K4528K3866
52310I71148K2924K2128K1921K1934K1181J9235J6705J4412J2581J1127J0132
52299A165428R508Q606O795M363K207P52m71k203m798q042j1174j3256j3991j4100
52285A129624j4405j4603j3595j1121q356o516n411l884j340J688M441O797R080
52272A072399J1354J3225J4391J5131J6060J7422J8859J9914K0521K0763K0403
52261A260442J9072J6921J4747J3315J2704J2377J1664J0187Q047N746L778K171
$$ plain form
52347 379874 383179 386672 389988 393321 397281 402272 408115 414335 420742 427607 435224 443467 451970 460800
52333 460800 470776 482820 497016 512582 528871 546122 565013 585728 607809 630815 654757 679834
52321 679834 706035 733139 760903 789073 817275 845007 871845 897684 922754 947282 971148
52310 971148 994072 1016200 1038121 1060055 1081236 1100471 1117176 1131588 1144169 1155296 1165428
52299 1165428 1174936 1183542 1190337 1194700 1196907 1197659 1197188 1194985 1190187 1182145 1170971 1157715 1143724 1129624
52285 1129624 1115219 1100616 1087021 1075900 1067544 1061028 1055617 1051733 1050393 1052081 1056522 1063319 1072399
52272 1072399 1083753 1096978 1111369 1126500 1142560 1159982 1178841 1198755 1219276 1240039 1260442
52261 1260442 1279514 1296435 1311182 1324497 1337201 1349578 1361242 1371429 1379476 1385222 1389000 1391171
52249A391171M72j770m568p557j0382j2996j5635j8487k1353k3738k5317k6125
52237A223715k6269k5767k4852k4024k3428k2525k0928j9252j8448j8371j7834
52226I82017j6158j3916j1857r985q184o938o641o638n875m297k826k007j440
52213H85255o08M71J608K779L813M277M116L935M250M754M791M268L576K837J851
52198I31973P95L37Q21J757K404K550K403K077J559R99O32M71M03N08R12J388
52182I51989J497J165N96l16j993m250o026o513o144n956o227o346n890n154m522
52167H95910l856k731r67J121K852L579L385L301M338O257P799Q154P635O837
52153I43614N814M514L388K974L187L530L745L887M011M253M869N741O166N809
$$ plain form
52249 1391171 1391643 1389873 1385305 1377748 1367366 1354370 1338735 1320248 1298895 1275157 1249840 1223715
52237 1223715 1197446 1171679 1146827 1122803 1099375 1076850 1055922 1036670 1018222 999851 982017
52226 982017 965859 951943 940086 930101 921917 914979 908338 901700 895825 891528 888702 886695 885255
52213 885255 884647 885118 886726 889505 893318 897595 901711 905646 909896 914650 919441 923709 927285 930122 931973
52198 931973 932768 933105 933926 935683 938087 940637 943040 945117 946676 947675 948307 948778 949181 949689 950601 951989
52182 951989 953486 954651 955247 954931 952938 948688 942662 936149 930005 924049 917822 911476 905586 900432 895910
52167 895910 892054 889323 888356 889477 892329 895908 899293 902594 906932 913189 920988 929142 936777 943614
52153 943614 949428 953942 957330 960304 963491 967021 970766 974653 978664 982917 987786 993527 999693 1005502
52139A005502N526O418Q185R308R078Q552R157J0960J2943J4495J6002J8135K1046
52126A155307K4287K7189K9395L1229L3427L6264L9082M0846M1098M0202L8823
52115A537149L7365L5750L3510L0284K6407K2754J9733J6736J2962Q592M461Q36
52103A786539k777o515r691j1759j3036j3958j4325j3993j3734j4369j5333j5262
52091A641787j4135j3651j5017j7294j8723j8915j8789j8795j8352j7030j5169
52080A455917j3080j0421o900k968O79L897O941R844J2463J4823J6970J8696J9828
52067A526689K0649K1593K2609K3295K3458K3095K1997J9951J7332J4857J2692
52056A748217J0409P931N767M129K471L04k142m557p172j0130j2846j4873j6884
$$ plain form
52139 1005502 1011028 1017446 1025631 1034939 1044017 1052569 1061726 1072686 1085629 1100124 1116126 1134261 1155307
52126 1155307 1179594 1206783 1236178 1267407 1300834 1337098 1376180 1417026 1458124 1498326 1537149
52115 1537149 1574514 1610264 1643774 1674058 1700465 1723219 1742952 1759688 1772650 1781242 1785703 1786539
52103 1786539 1783762 1777247 1767556 1755797 1742761 1728803 1714478 1700485 1686751 1672382 1657049 1641787
52091 1641787 1627652 1614001 1598984 1581690 1562967 1544052 1525263 1506468 1488116 1471086 1455917
52080 1455917 1442837 1432416 1425516 1422548 1423227 1427124 1434065 1443909 1456372 1471195 1488165 1506861 1526689
52067 1526689 1547338 1568931 1591540 1614835 1638293 1661388 1683385 1703336 1720668 1735525 1748217
52056 1748217 1758626 1766557 1772324 1776453 1778924 1779228 1777086 1772529 1765357 1755227 1742381 1727508 1710624
52043A710624j9806k3228k5808k7256k8668l0615l2101l2101l1177l0605l0502
52032A398757k9758k7641k4646k1814j9806j8542j7324j5428j3078j1523j1598
52021A187599j2502j2724j1933j1102j0831j0611r968r375r452r952j0152r847
$$ plain form
52043 1710624 1690818 1667590 1641782 1614526 1585858 1555243 1523142 1491041 1459864 1429259 1398757
52032 1398757 1368999 1341358 1316712 1294898 1275092 1256550 1239226 1223798 1210720 1199197 1187599
52021 1187599 1175097 1162373 1150440 1139338 1128507 1117896 1107928 1098553 1089101 1079149 1068997 1059150
$$ [...]
##END NTUPLES=NMR SPECTRUM
##END=
