##TITLE=AC1605_TANAH13335_8316771_wnv8Eb7zom
##JCAMPDX= 6.0         $$ Bruker NMR JCAMP-DX V2.0
##DATA TYPE= NMR SPECTRUM
##DATA CLASS= NTUPLES
##ORIGIN= BRUKER
##OWNER= Administrator
$$ 1.72 TOPSPIN		Version 2.1
$$ 2013-11-13 22:24:42.850 -0800  Administrator@X
$$ Compression mode = diff/dup
##.OBSERVE FREQUENCY= 400.02188249412
##.OBSERVE NUCLEUS= ^1H
##.ACQUISITION MODE= SIMULTANEOUS (DQD)
##.ACQUISITION SCHEME= undefined
##.AVERAGES= 8
##.DIGITISER RES= 22
##SPECTROMETER/DATA SYSTEM= spect
##.PULSE SEQUENCE= zg30
##.SOLVENT NAME= COFFEE_meoh
##.SHIFT REFERENCE= INTERNAL, COFFEE_meoh, 1, 14.98509
##AUDIT TRAIL= $$ (NUMBER, WHEN, WHO, WHERE, PROCESS, VERSION, WHAT)
$$ ##TITLE= Audit trail, TOPSPIN		Version 2.1
$$ ##JCAMPDX= 5.01
$$ ##ORIGIN= Bruker BioSpin GmbH
$$ ##OWNER= Administrator
$$ $$ E:\/data/COFFEE/nmr/AC1605_TANAH13335_8316771_wnv8Eb7zom/10/pdata/1/auditp.txt
$$ ##AUDIT TRAIL=  $$ (NUMBER, WHEN, WHO, WHERE, PROCESS, VERSION, WHAT)
(   1,<2013-11-13 22:24:35.678 -0800>,<Administrator>,<X>,<go>,<TOPSPIN 2.1>,
      <created by zg
	started at 2013-11-13 22:23:29.756 -0800,
	POWCHK enabled, PULCHK disabled,
       configuration hash MD5:
       C8 4E 4E 5D D3 5C D8 9E 9F 52 82 E0 59 8A DE 15
       data hash MD5: 64K
       AC CE 14 AA A3 BF 1F 02 6C DF 5C F0 47 0F 4D 6C>)
(   2,<2013-11-13 22:24:38.693 -0800>,<Administrator>,<X>,<proc1d>,<TOPSPIN 2.1>,
      <Start of raw data processing
       efp LB = 0 FT_mod = 6 PKNL = 1 PHC0 = 0 PHC1 = 0 SI = 32K 
       data hash MD5: 32K
       7B 72 EE CD D8 41 C7 14 CB A9 C6 2C FF E1 7F A6>)
(   3,<2013-11-13 22:24:39.037 -0800>,<Administrator>,<X>,<proc1d>,<TOPSPIN 2.1>,
      <pk PHC0 = 92.49939 PHC1 = 0 
       data hash MD5: 32K
       C2 EF D0 63 74 FD 44 7A 83 B3 FB FF 5C F5 77 73>)
(   4,<2013-11-13 22:24:39.350 -0800>,<Administrator>,<X>,<proc1d>,<TOPSPIN 2.1>,
      <abs ABSG = 1 
       data hash MD5: 32K
       EB B3 5F 89 F8 70 2A 06 09 A3 B1 98 B5 5F 46 25>)
(   5,<2013-11-13 22:24:39.506 -0800>,<Administrator>,<X>,<proc1d>,<TOPSPIN 2.1>,
      <abs ABSG = 2 
       data hash MD5: 32K
       1A 8F 3B 40 23 AB 00 73 BA A4 97 33 62 C7 7A FB>)
(   6,<2013-11-13 22:24:39.600 -0800>,<Administrator>,<X>,<proc1d>,<TOPSPIN 2.1>,
      <abs ABSG = 3 
       data hash MD5: 32K
       13 6C 62 D4 2D BE A1 73 43 75 2F EA 09 81 52 F0>)
(   7,<2013-11-13 22:24:39.693 -0800>,<Administrator>,<X>,<proc1d>,<TOPSPIN 2.1>,
      <abs ABSG = 4 
       data hash MD5: 32K
       10 A8 81 B9 8A E6 FF C7 D4 FB A1 EE 53 9E D1 81>)
(   8,<2013-11-13 22:24:39.787 -0800>,<Administrator>,<X>,<proc1d>,<TOPSPIN 2.1>,
      <abs ABSG = 5 
       data hash MD5: 32K
       13 10 FF C3 E4 EF 9D 53 43 81 E5 23 3D 55 87 36>)
$$ ##END=
$$ 
$$ $$ hash MD5
$$ $$ E5 06 96 60 04 70 62 6B D1 42 E8 D8 A3 7F 44 AF
##$RELAX= 
##$RELAX= 
##$RELAX= 
##$RELAX= 
##$RELAX= 
##$RELAX= 
##$RELAX= 
$$ Bruker specific parameters
$$ --------------------------
##$DU= <E:\>
##$EXPNO= 10
##$NAME= <AC1605_TANAH13335_8316771_wnv8Eb7zom>
$$ [...]
150 150 150 150 150 150 150 150
##$TP07= 0
##$TPNAME0= <>
##$TPNAME1= <>
##$TPNAME2= <>
##$TPNAME3= <>
##$TPNAME4= <>
##$TPNAME5= <>
##$TPNAME6= <>
##$TPNAME7= <>
##$TPOAL= (0..7)
0.5 0.5 0.5 0.5 0.5 0.5 0.5 0.5
##$TPOFFS= (0..7)
0 0 0 0 0 0 0 0
##$TUNHIN= 0
##$TUNHOUT= 0
##$TUNXOUT= 0
##$USERA1= <user>
##$USERA2= <user>
##$USERA3= <user>
##$USERA4= <user>
##$USERA5= <user>
##$V9= 5
##$VALIST= <valist>
##$VCLIST= <CCCCCCCCCCCCCCC>
##$VD= 0
##$VDLIST= <DDDDDDDDDDDDDDD>
##$VPLIST= <PPPPPPPPPPPPPPP>
##$VTLIST= <TTTTTTTTTTTTTTT>
##$WBST= 1024
##$WBSW= 4
##$XGAIN= (0..3)
0 0 0 0
##$XL= 0
##$YL= 0
##$YMAX_a= 639226
##$YMIN_a= -545015
##$ZGOPTNS= <>
##$ZL1= 120
##$ZL2= 120
##$ZL3= 120
##$ZL4= 120
##$ABSF1= 14.98509
##$ABSF2= -5.573092
##$ABSG= 5
##$ABSL= 3
##$ALPHA= 0
##$AQORDER= 0
##$ASSFAC= 0
##$ASSFACI= 0
##$ASSFACX= 0
##$ASSWID= 0
##$AUNMP= <proc_prof1d_extract_pilot.lims>
##$AXLEFT= 0
##$AXNAME= <>
##$AXNUC= <1H>
##$AXRIGHT= 0
##$AXTYPE= 0
##$AXUNIT= <>
##$AZFE= 0.1
##$AZFW= 0.1
##$BCFW= 0
##$BC_mod= 0
##$BYTORDP= 0
##$COROFFS= 0
##$CY= 15
##$DATMOD= 1
##$DC= 0
##$DFILT= <>
##$DTYPP= 0
##$F1P= 0
##$F2P= 0
##$FCOR= 0.5
##$FTSIZE= 32768
##$FT_mod= 6
##$GAMMA= 0
##$GB= 0
##$INTBC= 1
##$INTSCL= 1
##$ISEN= 128
##$LB= 0
##$LEV0= 0
##$LPBIN= 0
##$MAXI= 10000
##$MC2= 0
##$MEAN= 0
##$ME_mod= 0
##$MI= 0
##$NCOEF= 0
##$NC_proc= -8
##$NLEV= 6
##$NOISF1= 0
##$NOISF2= 0
##$NSP= 0
##$NTH_PI= 0
##$NZP= 0
##$OFFSET= 14.98509
##$PC= 1
##$PHC0= 92.49939
##$PHC1= 0
##$PH_mod= 1
##$PKNL= yes
##$PPARMOD= 0
##$PPDIAG= 0
##$PPIPTYP= 0
##$PPMPNUM= 2147483647
##$PPRESOL= 1
##$PSCAL= 4
##$PSIGN= 0
##$PYNMP= <proc.py>
##$REVERSE= no
##$SF= 400.02
##$SI= 32768
##$SIGF1= 0
##$SIGF2= 0
##$SINO= 400
##$SIOLD= 32768
##$SPECTYP= <>
##$SREGLST= <1H.CDCl3>
##$SSB= 0
##$STSI= 32768
##$STSR= 0
##$SW_p= 8223.68421052631
##$SYMM= 0
##$S_DEV= 0
##$TDeff= 65536
##$TDoff= 0
##$TI= <>
##$TILT= no
##$TM1= 0
##$TM2= 0
##$TOPLEV= 0
##$USERP1= <user>
##$USERP2= <user>
##$USERP3= <user>
##$USERP4= <user>
##$USERP5= <user>
##$WDW= 1
##$XDIM= 32768
##$YMAX_p= 463997018
##$YMIN_p= -720225
##$CURPLOT= <Network HP LaserJet P1505>
##$CURPRIN= <$Network HP LaserJet P1505>
##$DFORMAT= <normdp>
##$LAYOUT= <+/1D_H.xwp>
##$LFORMAT= <normlp>
##$PFORMAT= <normpl>
##$SURQMSG= 1
$$ End of Bruker specific parameters
$$ ---------------------------------
##NTUPLES= NMR SPECTRUM
##VAR_NAME=  FREQUENCY,     SPECTRUM/REAL,   SPECTRUM/IMAG
##SYMBOL=    X,             R,               I
##VAR_TYPE=  INDEPENDENT,   DEPENDENT,       DEPENDENT
##VAR_FORM=  AFFN,          ASDF,            ASDF
##VAR_DIM=   32768,         32768,           32768
##UNITS=     HZ,            ARBITRARY UNITS, ARBITRARY UNITS
##FACTOR=    0.250966925370066, 1,           1
##FIRST=     8223.43324360094, -88068,       -306479
##LAST=      0,             28128,           -70395
##MIN=       0,             -720225,         0
##MAX=       8223.43324360094, 463997018,    0
$$ Real data points
##PAGE= N=1
##DATA TABLE= (X++(R..R)), XYDATA
$$ [...]
19542A02080L98743a78841C6872c5865L201B58177c8032r7222j62836O5270a09193
19530A88830b0887B37218h6409j58120q8403B62171b0673o7046C5620J14852k3651
19519A26821b54392F2069J4052B6494a91489R5709q1906E2477b26267A05752A6553
19507C288f3576A11656a68507C9720a79435r8985d9834k64099B54580c66538g5962
19495A48409q733b98585B32702F0271a69178a5063m12804a68927B69703a10747
19484c7638q2342i563n1552A29633c18652i4702K0121A00863e3043C06155H546
19472a42410J1061A67455l5038M5391F7691K20544C822J55597C8714b21695B52397
19460B09309d970j28096k59553E3483a48371B8608J82884c9761I4297C3564b88023
$$ y = [102080, 500823, -178841, 36872, -35865, -32664, 258177, -38032, -135254, -298090, -232820, -109193, 188830, -20887, 237218, -86409, -244529, -332932, 262171, -20673, -87719, 35620, 150472, 126821, -254392, 62069, 76121, 26494, -191489, -95780, -177686, 52477, -226267, 105752, 16553, 3288, -63576, 111656, -168507, 39720, -179435, -278420, -49834, -313933, 254580, -366538, -75962, 148409, 139676, -298585, 232702, 60271, -169178, -15063, -427867, -168927, 269703, -110747, -37638, -119980, -9563, -61115, 129633, -318652, -94702, -74581, 100863, -53043, 306155, 8546, -142410, -131349, 167455, 132417, 177808, 67691, 288235, 3822, 159419, 38714, -221695, 252397, 209309, -4970, -133066, -392619, 53483, -148371, 28608, 211492, -39761, 94297, 33564, -288023]
19448h4768c2958G6384C4305a18131m7708A49264a9561j23639c4214A61409C0003
19436b91006j83586A51945e7209r9002A56514P9695a37242D6290h2563E9618b4355
19424d8882k34831Q2034A43430a75578b625m0360j82211B82683a47279A1067h3284
19412f7726l2420A18432b74110j19744a22870A40333b62433A39865F7328h5931
19401a21538M0435M0173j56786i8816l1255l693D22553a21419d391j47393f7623
19389C1735M681P82K23352b37706A76429D3517j3015Q1165Q7171d20659B11247
19377F3539a76725m7982O5391N5662L8923n7946B56206A05471b2950n4394j1589
19366h8933j8542A51371d2193C09727b64482B0373g0397F9373J79329j09626D372
$$ y = [-84768, -32958, 76384, 34305, -118131, -165839, 149264, -19561, -143200, -34214, 161409, 30003, -291006, -474592, 151945, -57209, -156211, 156514, 236209, -137242, 46290, -82563, 59618, -24355, -48882, -283713, -201679, 143430, -175578, -2625, -42985, -225196, 282683, -147279, 11067, -83284, -67726, -100146, 118432, -274110, -393854, -122870, 140333, -262433, 139865, 67328, -85931, -121538, -81103, -40930, -197716, -98816, -130071, -133764, 422553, -121419, -4391, -151784, -67623, 31735, 36416, 37198, 260550, -237706, 176429, 43517, 30502, 111667, 198838, -420659, 211247, 63539, -176725, -224707, -159316, -103654, -64731, -122677, 256206, 105471, -22950, -77344, -88933, -107475, 151371, -42193, 309727, -264482, 20373, -70397, 69373, 248702, 139076, 4372]
19354I4614h3842j11210m3032k24216a1605A19897a29286O643M0921j17213q1943
19343b80878D743J15486a773k20070I2118a13432m5479A34017a92142B2152O2751
19332H4903a1582A3416a18191E3546a63840N3015l7518F3094d34164J24461M7039
19321b62664O6555A72667c9877l42468f3727j91677J23834G02251A37618b72577
19310A3618J05015a8015B7375K5018N3945K8023n258a46416B35722b09293L4603
19299a74690I8749R8250o0445O6873F0802a64336j87140p9757A63228A6844b3860
19287d15559Q6803C9257c86429a14624A37486c28424A46283a12108J3223L9695
19277e9190A79741b30701O2500E6755h8346m10459I0896l2476d36014J49604J36165
$$ y = [94614, -83842, -195052, -238084, -462300, -11605, 119897, -129286, -122643, -81722, -198935, -280878, 4743, 120229, -1773, -221843, 92118, -113432, -158911, 134017, -192142, 22152, 84903, -11582, 13416, -118191, 53546, -163840, -110825, -148343, 63094, -434164, -309703, -262664, -196109, 172667, -39877, -382345, -63727, -255404, -131570, 702251, 137618, -272577, 13618, 118633, -18015, 27375, 52393, 106338, 134361, 129103, -146416, 235722, -209293, -174690, 98749, 196999, 136554, 203427, 60802, -164336, -351476, -431233, 163228, 16844, -23860, -415559, -328756, 39257, -386429, -114624, 137486, -328424, 146283, -112108, -98885, -59190, 179741, -230701, -168201, 56755, -88346, -498805, 90896, 58420, -436014, -286410, -150245]
19266a50245A89150A1508J93877J9925b74977H1123J35332d9870D2017a7902A99055
19254A73658m0051E7795b13470a2895j84898O253K3472N113H0959j0190a8613
19242a74773Q0031G0471n136c6770C65249a26866r3514l260a10379n9298A11306
19230h2619J9685B24110a3491j03106q4881e8663B025a86841C06897c38529B5302
19218e9005l7993G0284e6749j49964F7639J72631H8612O610b7473a2938j91268
19207b04206B23459a27656K9131j90190a32938A34102d1771m3429A09429f7560
19196A57296b2149j30945F2520P7916a4644H575a30624k56106J88924q6273A41383
19184d7792B71655l0218c3173A42283l6204r495P1412h021q6859c0401B1722c13073
$$ y = [-150245, 189150, 11508, 205385, 225310, -274977, 81123, 216455, -49870, 42017, -17902, 199055, 173658, 133607, 57795, -213470, -12895, -197793, -191540, -168068, -162955, 80959, 70769, -18613, -174773, -94742, 70471, 65335, -36770, 365249, -126866, -220380, -223640, -110379, -169677, 111306, -82619, -62934, 224110, -13491, -116597, -201478, -58663, 2025, -186841, 306897, -338529, 25302, -59005, -96998, 70284, -56749, -206713, 67639, 240270, 88612, 95222, -27473, -12938, -204206, 223459, -127656, -98525, -288715, -132938, 134102, -41771, -85200, 109429, -67560, 157296, -22149, -153094, 62520, 140436, -14644, 8575, -130624, -386730, -197806, -284079, 141383, -47792, 271655, 241437, -33173, 142283, 106079, 96584, 167996, -8021, -94880, -30401, 21722, -313073]
19171a49567A24579F1998P8452n8295a848l25944D3269a57174m4249h4537l86022
19160d70559b35137f9827q2185M4619I1549R3690a96935Q7139j00497d7855A38334
19148C5663a48530C64258j60520p4555d7936J9983D7578R0522f502o4181B32844
19136b33208b9733I3677d94798E5979a39383D8427L6733b05212i5884K3892q5455
19125a57447G2073b64335I1260c38372i7514A8107d58382f1031k82036D044b48364
19113a63878A1773a98659a3554A21208b27175E9131d9715k73138g558j55693d3896
19101c4523j88395A27458a83842j11039A46096h4471j99084A49478a00550K4497
19091g6053A25225g4594D4742K01690r5202K7958a34028b8102j89901l76346b19405
$$ y = [-149567, 124579, 61998, 140450, 82155, -1848, -327792, 43269, -157174, -201423, -84537, -470559, -235137, -69827, -152012, -107393, 91549, 185239, -196935, -109796, -210293, -47855, 138334, 35663, -148530, 364258, 203738, 129183, -47936, -27953, 47578, 138100, -6502, -70683, 232844, -233208, -29733, 93677, -494798, 55979, -139383, 48427, 85160, -205212, -95884, -71992, -157447, 72073, -264335, 91260, -338372, -97514, 18107, -458382, -61031, -343067, 4044, -248364, -163878, 11773, -198659, -13554, 121208, -227175, 59131, -49715, -322853, -7558, -163251, -43896, -34523, -222918, 127458, -183842, -294881, 146096, -84471, -283555, 149478, -100550, -76053, 125225, -74594, 44742, 246432, 151230, 179188, -134028, -28102, -218003, -594349, -219405]
19079C4772i7638o8855d1730I5479b867k751j94435H5109J0218e6906k30480A14841
19066b00044A99976N8103C1492a00523j80563a5557A64275e3755n6927A01534
19055a78696m62B59810f8498B56286a11312l3687H9243a51355f9292H1020Q9923
19044A70943a06169A2244J76993c590n02712a7032j22487n80706B9914b09071
19033a82540I8391k8700b5422B3125M2922L11895H011N4097L94093D7660K79576
19022C27236j51147p4955B3747J75292c9318j61619G7624a7809B5733a6401k25611
19011b42012A46454a60892m3947l7237P8156a6086j0457j01106B03259a58597
19000H0478a10727A65271f9084A79370b1807m9196k61558m823i5G634a65732F825
$$ y = [34772, -97638, -166493, -41730, 95479, -2867, -5618, -200053, 85109, 95327, -56906, -287386, 114841, -200044, 199976, 258079, 31492, -100523, -281086, -15557, 164275, -53755, -110682, 101534, -178696, -179158, 259810, -68498, 256286, -111312, -144999, 89243, -151355, -69292, 81020, 170943, -106169, 12244, 189237, -3590, -506302, -17032, -139519, -720225, 29914, -209071, -182540, 98391, 69691, -25422, 23125, 66047, 377942, 8011, 62108, 456201, 47660, 327236, 176089, 101134, 23747, 199039, -39318, -200937, 77624, -17809, 25733, -16401, -242012, 146454, -160892, -204839, -242076, -163920, -16086, -26543, -127649, 203259, -158597, 80478, -110727, 165271, -69084, 179370, -21807, -71003, -332561, -337384, -95, 7634, -165732, 6825]
18987D0467c04013D9319c01286A29234a11717E1500c01053a1664j52421f7797
18976a88253g4405D356a1703k55471A92001d13917C27295h334I7859P3360a62160
18964A48978k2263a19886c4558H1679K76308A01571g0415B54650d1079j22507
18954a63586j43033A3691J007a40110j16241A35907D3930f9471q7109A22901O2386
18943A85287a22148m2322c5672C72729D4084j8109e09665B03452K27648I0061
18932B36477F3794b21109D8085c20849A50635K21834j52347J30421b23992R9624
18922a24368E931c31017B19730D8624B3866b25623b773B94213B8758J14267c11808
18910e203B4585J1848b42203A0394b71798E5766a53872d3188k46673O9915D22428
$$ y = [40467, -304013, 49319, -301286, 129234, -111717, 51500, -301053, -11664, -164085, -67797, -188253, -74405, 4356, -11703, -267174, 192001, -413917, 327295, -8334, 97859, 171219, -162160, 148978, 126715, -119886, -34558, 81679, 357987, 101571, -70415, 254650, -41079, -163586, -306619, 13691, 14698, -140110, -256351, 135907, 43930, -69471, -156580, 122901, 185287, -122148, -164470, -35672, 372729, 44084, 25975, -509665, 203452, 431100, 90061, 236477, 63794, -221109, 48085, -320849, 150635, 372469, 220122, 350543, -223992, -124368, 5931, -331017, 219730, 48624, 23866, -225623, -2773, 294213, 28758, 143025, -311808, -5203, 24585, 36433, -242203, 10394, -271798, 55766, -153872, -43188, -289861, -219946, 422428]
18898B36265q2897a28212H0682j8572a5655k07378O5744K3071j28697f9334E2154
18886b4711B1329K17779a20915j48855d3579H9339b93329c1809j37796D2087J12443
18875A54530g5615A9214O4052j3031b27901A79386a62983I762J59216b45194L9113
18864b06081E4213q284J38450K12161H8052i3137k32026B08330b23820A3946a72637
18852D5312b35875a1790B25970b3713j39869B200c9781F2019i4361M2156r5705
18841a47910k06700a21394D1616g7915B15923d04044e2488a1704D9201a4087o8628
18830h2715r8888q5572M3772E0640a0608A13133K6018D9440K8159N1421P5486
18819B04506b32133h5933l41380J67673A22014R9488B8621K7311J11040p2825
$$ y = [236265, 153368, -128212, 80682, 62110, -15655, -223033, -157289, -134218, -262915, -69334, 52154, -24711, 21329, 239108, -120915, -269770, -43579, 89339, -293329, -31809, -169605, 42087, 154530, -75615, 19214, 83266, 70235, -227901, 179386, -162983, 9762, 168978, -245194, -206081, 54213, 45929, 184379, 396540, 88052, -93137, -325163, 208330, -223820, 13946, -172637, 45312, -235875, -11790, 225970, -23713, -163582, 2200, -39781, 62019, -94361, -52205, -147910, -354610, -121394, 41616, -77915, 215923, -404044, -52488, -11704, 49201, -14087, -82715, -181603, -267175, -223403, 50640, -10608, 113133, 139151, 49440, 77599, 129020, 204506, -232133, -85933, -427313, -259640, 122014, 221502, 28621, 55932, 166972, 94147]
18809I4147d5878B71827A02594c0459b149j71927k152Q3046k27612L5917R0142
18798a94735j506C7587g4585j7929A27033a48554D3277a94187k5382J7335Q0139
18787a22095B4077b6790k21700a15259p6309e9133A12945D6608J71040d3596I9681
18775i8888B10542c75152G8631O1495k066a50666O047c6096l48031i8828A01227
18763A28880n9543L30397b5612l7189j08946B62313c49928H2096J64478d1229
18752b46578D1574d87804D6945B2892M30810c0968C510b87125a11457o9065B4697
18740h4167A51868E2602K7657P061M4101m1002a71377A73573h106B9025L03245
18729C32270a902j32766d9754D1003K68775b91055A6256b34697j41317J32267
$$ y = [94147, -45878, 271827, 102594, -30459, -2149, -174076, -176228, -93182, -320794, -284877, -194735, -196241, 37587, -74585, -92514, 127033, -148554, 43277, -194187, -219569, -202234, -122095, 24077, -26790, -248490, -115259, -191568, -59133, 112945, 46608, 217648, -43596, 99681, -98888, 210542, -375152, 78631, 140126, 138060, -150666, -144619, -36096, -384127, -98828, 101227, 128880, 69337, 399734, -25612, -62801, -171747, 262313, -349928, 82096, 246574, -41229, -246578, 41574, -487804, 46945, 22892, 453702, -30968, 3510, -287125, -111457, -180522, 24697, -84167, 151868, 52602, 80259, 87320, 131421, 90419, -171377, 173573, -8106, 29025, 332270, -1902, -134668, -49754, 41003, 309778, -291055, 16256, -234697, -376014, -243747]
18719b43747a11588G2853h1866C8373J50619a2250G9627e947j86888r142q2056
18708b84033g592l51817a00993B0976a49102n6926A26795i0382A99237r797e03428
18696d7853j93848j14895D5322b079j96147A14688d62268C9812J3522O58J70933
18685B24925a57077A32367b6888A66469d50592I3302K42637j58784A5940b34390
18674C14697g0405l5569k4615k56838A14126b24329A67886a29709L4665A93663
18663c08165J09577c6328m2255L1986j85831j2096q1606I2971J47417e2442j77026
18652b29468L9658Q8108A83450f6010j57553B9288i6631k8776J4937e897I5290
18640e6920C1741R5082a73617a6128I5802O0400a36989j26534A46877b12705A71668
$$ y = [-243747, -111588, 72853, -81866, 38373, 188992, -12250, 79627, -5947, -192835, -201977, -284033, -7592, -359409, -100993, 20976, -149102, -206028, 126795, -90382, 199237, 189440, -503428, -47853, -241701, -356596, 45322, -2079, -198226, 114688, -462268, 39812, 53334, 53992, 224925, -157077, 132367, -26888, 166469, -450592, 93302, 335939, 177155, 15940, -234390, 314697, -70405, -105974, -130589, -387427, 114126, -224329, 167886, -129709, -95044, 193663, -308165, -198588, -36328, -78583, -46597, -232428, -244524, -326130, 92971, 240388, -52442, -229468, -189810, -101702, 183450, -66010, -223563, 29288, -96631, -125407, -110470, -5897, 95290, -56920, 31741, 126823, -173617, -16128, 95802, 156202, -136989, -263523, 146877, -212705, 171668]
18628b29214g4462j28196F7065a62363P8527l32164i9015G1963h1615A87333p0411
18617A16922k0347O5596c1292C1807g4959A20192b02563d2281k28116J09994A51712
18605a91480c8959A39772e5469F7209a57162A79500h8602j46735l7462e3149A18219
18593c25777h8771f383l20958J52581D6672h9441k1158l18389K13955A28787c82992
18581g1406K5626B83291h3892j09182j6991B49098F4248J45863b72915H0461J69259
18570B49720G6934Q1663c01562A99521c4031k68238a3687m0707q4299J4733j53558
18559b77518a22417d9001A30035N7798c64527a47783A3666b90331B8699c68808
18548F4895L24045E189P4254a25895c7712l06156J49075D3279A457J51322q795
$$ y = [-229214, -74462, -202658, 67065, -162363, -83836, -416000, -99015, 71963, -81615, 187333, 116922, 96575, 162171, -31292, 31807, -74959, 120192, -202563, -42281, -270397, -160403, 151712, -191480, -38959, 139772, -55469, 67209, -157162, 179500, -88602, -235337, -272799, -53149, 118219, -325777, -88771, -6383, -327341, -174760, 46672, -89441, -110599, -428988, -215033, 128787, -382992, -71406, -45780, 283291, -83892, -193074, -210065, 249098, 64248, 210111, -272915, 80461, 249720, 76934, 158597, -301562, 199521, -34031, -302269, -13687, -54394, -138693, -123960, -277518, -122417, -49001, 130035, 187833, -364527, -147783, 13666, -290331, 28699, -368808, 64895, 388940, 5189, 79443, -125895, -37712, -343868, -194793, 43279, 1457, 152779, 143984]
18537A43984d0287j56518Q9975A313a43157j31749a01925C6197b14497J06720
18527a07777D24061d6232a9688q5184F40J58982F1326c66597Q5605F9419J701
18516G1120n633c8108l7647k09294l36113A07638d7951A01914k6546M2024E7733
18504a4625j1777n3183b9653P101j22505J5702C1398P8773G115K2216c7066G9528
18491a82722q2068E7481J30526k9182b00477c2511k28124M3961e9995o3179G0804
18479F81a2426k8443j28231C43062G7111b9108A09907F675M8979c00555D3106
18467I3388e17205K46252R4376N1927A01967e6589m0011A17402c02418f6209l3047
18456i9256l19173b05507c671k7548j87490L7449b673n5775m1880l35029f7681
$$ y = [143984, -40287, -196805, -106830, 1313, -143157, -274906, -101925, 36197, -214497, -107777, 424061, -46232, -19688, -104872, 640, 159622, 61326, -366597, -280992, 69419, 71120, 65487, -38108, -75755, -285049, -621162, 107638, -47951, 101914, 75368, 117392, 57733, -14625, -26402, -79585, -29653, -22552, -145057, -129355, 31398, 110171, 7115, 29331, -37066, 79528, -182722, -264790, 57481, 188007, 158825, -200477, -32511, -260635, -216674, -59995, -123174, 70804, 681, -12426, -40869, -169100, 343062, 77111, -29108, 109907, 6675, 55654, -300555, 43106, 93388, -517205, -270953, -176577, -124650, 101967, -56589, -96600, 117402, -302418, -66209, -99256, -418429, -205507, -3671, -31219, -218709, -181260, -2673, -58448, -100328, -435357, -67681]
18444a99965R1025K5618I613c97292a00361K4407k1233B96502G3386B0506b49094
18432e8938B41403b92691e9241j82718R5481M9280J3114k77969B25226a41065
18421A95824A9623a08631A22871B8520d8714H754K52969b4488B24919B2716L5245
18410E7961R5981a76153D949N3190a59310B25268a7874B39833a66933F5424J83010
18399B48434G029P4792K44584G3267M9904a17269k99925H4326J9791L3666J58169
18388B95952a89411J6281L6382C8835a83483A52004c10346K4226A1228J80951
18378A92179d0099A70008O6080F8728c7554k7925H7533c1601H1296O3728o6551
18367G8473J19086d2433B30992a74238d9953k64599A67817a73893A6192a96022
$$ y = [-199965, -108940, -83322, 9613, -397292, -100361, -75954, -97187, 296502, 73386, 20506, -249094, -58938, 241403, -292691, -59241, -241959, -146478, -97198, -84084, -362053, 225226, -141065, 195824, 19623, -108631, 122871, 28520, -48714, 8754, 261723, -24488, 224919, 22716, 57961, 153942, -176153, 4949, 58139, -159310, 225268, -17874, 239833, -166933, 65424, 248434, 7029, 81821, 326405, 73267, 123171, -117269, -417194, 84326, 104117, 137783, 295952, -189411, -173130, -136748, 38835, -183483, 152004, -310346, -286120, 11228, 192179, -40099, 170008, 236088, 68728, -37554, -65479, 87533, -31601, 81296, 145024, 78473, 197559, -42433, 230992, -174238, -49953, -314552, 167817, -173893, 16192, -196022]
18356A26567a33794C85a03978k03893p0099N7229a19476D1196d15053J8825J80968
18345b15260e2852A95132a34976a9438B17455a17853a4058m9443G8143J19537
18335A97680l8920Q4137N1174I5594K9761Q1220a68619I6113a22535A6533J79789
18324A96322c6745B36571a28737f20j9376E8913b9561k4920F1646P7966k4048
18313A15564e4733H5975f5920A12266D758L2132N9392a43664E9502K40394a5802
18301g3145G683a7752k49546b6028o5799E2850K2375K08591f7103P362A4869f8883
18288B25104j4418n8080I254J32801C7452e0949n9568E1092E425a10404m5378
18277a55782j32276K9539e3679D8540b16654A0293J34620I263c00806B01333E928
$$ y = [126567, -133794, 385, -103978, -307871, -377970, -320741, -119476, 41196, -415053, -396228, -215260, -52852, 195132, -134976, -19438, 217455, -117853, -14058, -63501, 78143, 197680, 158760, 242897, 294071, 95594, 125355, 206575, -168619, 96113, -122535, 16533, 196322, -36745, 236571, -128737, -620, -19996, 58913, -29561, -54481, 61646, 139612, 115564, -54733, 85975, -65920, 112266, 4758, 36890, 96282, -143664, 59502, 299896, -15802, -73145, 7683, -17752, -267298, -26028, -91827, 52850, 75225, 283816, -67103, -59741, 14869, -68883, 225104, 210686, 152606, 9254, 142055, 37452, -50949, -110517, 51092, 5425, -110404, -155782, -288058, -258519, -53679, 48540, -216654, 10293, 144913, 9263, -300806, 201333, 5928]
18265B89783K7373h1166E731a51068E2731a7859A50611F2557c2166A48993m44
18254A48549E6264b49444l3703r8924G7140i9565A81193e40629a72964j0746d2841
18242b15191N917j0491l270B46534j04424c33417q7693a18274c1264j2466k42019
18231b85749a4625m84157b08488k37789h466j23154A02283k3564c8449l61882
18221d00331A99225R6804f2168C38822A08521b95667r2566D9742a83212C0602
18210A9544K8777a73347k5289j12443A02051a80886e0905C242L20317e1489j19661
18199a71150j1057a0366A04242a04476A95326k5354F9454a28536L7649A0173R4533
18188A04706f9596j78944F5302c10946K0629k60259B03030F9706b74271E8378
$$ y = [289783, 317156, -81166, 5731, -151068, 52731, -17859, 150611, 62557, -32166, 148993, 148549, 56264, -249444, -283147, -382071, 77140, -99565, 181193, -540629, -172964, -183710, -42841, -215191, -209274, -219765, -223035, 246534, 142110, -333417, -421110, -118274, -31264, -43730, -285749, -14625, -498782, -208488, -446277, -8466, -131620, 102283, 78719, -38449, -400331, 199225, 296029, -62168, 338822, 108521, -295667, -388233, 49742, -183212, 30602, 19544, 48321, -173347, -198636, -311079, 102051, -180886, -50905, 3242, 323559, -51489, -171150, -182207, -10366, 104242, -104476, 195326, 169972, 69454, -128536, -90887, 10173, 104706, -69596, -248540, 65302, -310946, -290317, -550576, 203030, 69706, -274271, 58378]
18177c0617H5133J75326b6552G5913a07202n1767L9212A47678A5495a723E3970
18165g9309j15677P9595q2693P045O8837J9908j9472C33215a01031F5360a87009
18153c65609c1041d237j31939q9400H5282b52163b6126j84331j16323o7423J23751
18142b70452C05893a77640C37347a90812M1232A48747N740b50950l8657a1334
18131f5580E410a29519n3230B3714j0004N4749a97785R2289G7062c89833G8203
18119B93380A8382R9300B9738c1188A11574b29825c6985B7955d5755I6807a84137
18107B7135g6068n0626e8859B5995a63431M6110e6637B01801L7421m586b67366
18095b399k24640i4701A06737a89082h8139A19886a08463C09045H6826a25149
$$ y = [-30617, 85133, 260459, -26552, 75913, -107202, -158969, -119757, 147678, 15495, -1723, 53970, -79309, -194986, -115391, -198084, -191039, -122202, -102294, -121766, 333215, -101031, 65360, -187009, -365609, -31041, -4237, -136176, -225576, 85282, -252163, -26126, -210457, -326780, -394203, -270452, 305893, -177640, 337347, -190812, -149580, 148747, 154487, -250950, -289607, -11334, -65580, 5410, -129519, -182749, 23714, 13710, 68459, -197785, -105496, 77062, -389833, 78203, 293380, 18382, 117682, 29738, -31188, 111574, -229825, -36985, 27955, -45755, 96807, -184137, 27135, -76068, -126694, -58859, 25995, -163431, -117321, -56637, 201801, 239222, 234636, -267366, -2399, -227039, -94701, 106737, -189082, -88139, 119886, -108463, 309045, 86826, -125149]
18084b25546F3100B9985J70597f0070j38320j3288G9486B9805b31524j85884a35292
18072C120R153a3900B57609G8898a65886C3511a6309j49894B17995A1978c9148
18060B7166a55592P2166A12854a07530B0877b92529C16554E1046K28759d2953
18049C60396A32431B195e5361q5272B10105n8931D7663O6541A5464h1027P119
18038g3908b6090j21485B17131c1798J0540C4339a0977j1913j38273N6228F4640
18026b33945A31961b57744a13589C0358K06830J88776d4989j70004A62345a22493
18015d033C8028J43411b70237A83298p0159N4660a75063N510j15581A66962a20696
18003d49565a77745p0868l4832J20059f7510H842c26422a1727A21690b93854D6568
$$ y = [-225546, 63100, 29985, 200582, -60070, -198390, -211678, 79486, 29805, -231524, -417408, -135292, 3120, 12273, -13900, 257609, 78898, -165886, 33511, -16309, -166203, 217995, 11978, -39148, 27166, -155592, -83426, 112854, -107530, 20877, -292529, 316554, 51046, 279805, -42953, 360396, 132431, 2195, -55361, -140633, 210105, 151174, 47663, 114204, 15464, -81027, -73908, -26090, -147575, 217131, -31798, -21258, 34339, -10977, -22890, -161163, -104935, 64640, -233945, 131961, -257744, -113589, 30358, 237188, 425964, -44989, -214993, 162345, -122493, -4033, 38028, 181439, -270237, 183298, 113139, 167799, -175063, -169553, -285134, 166962, -120696, -449565, -177745, -248613, -283445, -163386, -67510, 8842, -326422, -11727, 121690, -293854, 46568]
17991A42610O5932a16807L0099A26056c9733A88691e4381B3955J47398c76052
17980e7272A29274e5556j71828A61888b04246A23307c1499A2996a77511P1657
17970a05854A27551K3792h4613p8260k12932C6846J91713D5550L50706a8354k00937
17959b19291a933C9048J10396n8416a16902k9002A04793L2285c3167j61902A3307
17947A10087K80856a01392J9513A13950L18840f8396m73070K60366J32261f9791
17936f7200A96159b2404n8086k3621k04042B5a87910n4145F2957b10285H5372
17924a56114B66717H0250P3785e9081H4292e3603A56720a78862j9753k3215G1868
17912D4411a0708m0094p2285n2319j2961B50982B228c26477M8695F605c3652k7879
$$ y = [142610, 208542, -116807, -86708, 126056, -39733, 188691, -54381, 23955, 171353, -376052, -57272, 129274, -55556, -227384, 161888, -204246, 123307, -31499, 12996, -177511, -105854, 127551, 151343, -84613, -162873, -375805, 36846, 228559, 45550, 396256, -18354, -219291, -1933, 39048, 149444, 91028, -116902, -145904, 104793, 137078, -33167, -195069, 13307, 110087, 390943, -101392, -81879, 113950, 432790, -68396, -541466, -281100, -148839, -69791, -67200, 196159, -22404, -80490, -104111, -308153, 25, -187910, -242055, 62957, -210285, 85372, -156114, 266717, 80250, 154035, -59081, 84292, -53603, 156720, -178862, -198615, -221830, 71868, 44411, -10708, -50802, -123087, -175406, -188367, 250982, 2228, -326477, -277782, 6605, -33652, -61531]
17900f1531N193G2641L4565B6200K21906h9399m0975B041f6490F6494L9782a23202
17887I7493K76024f6688H5421j8390b0501A77935E9617a62652O9755l52690G6967
17875b87701A71135a6009k1430k03086D9765a82869I4243j4972K8357A0858J52955
17864A63813B0114R3010b185j49415N0646j87420A16631a11539A48166c15239
17853A22364D9424e9974B2479N2833J38079r4111K20201A2646P9358J19486p8665
17842A32825d4059D3414M2636R6549N817d3479A64793n3670L32366I0305C807
17830A81707l2023d4994B95595j18190q3046J15718A1657O5575P0443a96029h0745
17818A28099n5598c13121C25328j25178o9093a29555C171L02519a11396b4179
$$ y = [-61531, -56338, 72641, 107206, 26200, 248106, -89399, -130374, 2041, -66490, 66494, 106276, -123202, 97493, 373517, -66688, 85421, 67031, -20501, 177935, 59617, -162652, -92897, -445587, 76967, -287701, 171135, -16009, -37439, -240525, 49765, -182869, 94243, 79271, 107628, 10858, 163813, 20114, 113124, -2185, -151600, -100954, -288374, 116631, -111539, 148166, -315239, 122364, 49424, -59974, 22479, 75312, 213391, 119280, 339481, 12646, 92004, 211490, 132825, -44059, 43414, 86050, 182599, 188416, -43479, 164793, 111123, 443489, 90305, 3807, 181707, 149684, -44994, 295595, 177405, 94359, 210077, 11657, 77232, 147675, -196029, -80745, 128099, 72501, -313121, 325328, 200150, 131057, -129555, 3171, 305690, -111396, -24179]
17807c0203j6368A81600g3489B00287d9375A15931R5956r6610A6461c09835A606
17795b46868f5469f281j3130D0465L03670E5793h0440B81844d66629J58649A14403
17783a16424A61377G3156a40935b9807G7977a79744I7864a26504C13092a12972
17772c94948A70227o3499c7185C34882a32701k27036B26098D5833P6425a97218
17761a69390n0842A1590j736M5223a08511o2081j82975I7849J41444J01260g1386
17749D65897j71116A31801a62966j37120A79769B4616a32306p4466i5090b7683
17738e1179j6314c1426A06523a74501E309b4504k31208E5132a83969A56163b20515
17726D8092H026P8508Q4005g9728E341M70666G3296A7106e5462n2145c7563j71123
$$ y = [-30203, -46571, 181600, -73489, 200287, -49375, 115931, 211887, 115277, 16461, -309835, 1606, -246868, -65469, -6281, -19411, 40465, 344135, 55793, -80440, 281844, -466629, -307980, 114403, -116424, 161377, 73156, -140935, -29807, 77977, -179744, 97864, -126504, 313092, -112972, -394948, 170227, 106728, -37185, 334882, -132701, -359737, 226098, 45833, 122258, -197218, -169390, -220232, 11590, 9854, 55077, -108511, -170592, -353567, 97849, 239293, 340553, -71386, 465897, 294781, 131801, -162966, -300086, 179769, 24616, -132306, -206772, -95090, -27683, -51179, -67493, -31426, 106523, -174501, 5309, -24504, -255712, 55132, -183969, 156163, -220515, 48092, 8026, 86534, 170539, -79728, 5341, 476007, 73296, 17106, -55462, -107607, -37563, -208686]
17714b08686B0323J40344b44465G4114P4457h9056E8616j6016m007a67559A12401
17702I2174k0523j479N6419J33158C454J68423K714f9032A90855O4674c00976
17690F9262d8441J1448C46560b00317h9135K8193k25282I9395c26418A15121b60520
17678a47334B51422h8043E0738J26468o6650m1019C044c2418B16674A0458D388
17666F4716i7495A35269p10a08896j79544L9098h2181K5292j3417G9799J54252
17655B34051h952p2689q2465j65988B09361F8605e4712A66417a08943p7738B32887
17643I8191l7839a22667A03460i0569I7104B69i3730B8122a24190b730E17657
17631d31137g3938G4480b32558A11621E5066a60377R907g357A44693D3551c08307
$$ y = [-208686, 20323, 160667, -244465, 74114, 148571, -89056, 58616, 42600, 38593, -167559, 112401, 92174, 71651, 70172, 126591, 259749, 3454, 171877, 174591, -69032, 190855, 255529, -300976, 69262, -48441, -36993, 346560, -200317, -89135, -60942, -286224, 99395, -326418, 115121, -260520, -147334, 251422, -88043, 50738, 177206, 110556, 69537, 3044, -32418, 216674, 10458, 4388, 64716, -97495, 135269, 134559, -108896, -288440, -249342, -82181, -56889, -70306, 79799, 234051, -8952, -81641, -164106, -330094, 209361, 68605, -54712, 166417, -108943, -186681, 232887, 98191, 60352, -122667, 103460, -90569, 97104, 269, -93730, 28122, -124190, -2730, 517657, -431137, -73938, 74480, -232558, 111621, 55066, -160377, -150470, -7357, 144693, 43551, -308307]
17619h9810o2982k5612F654P3389b13904B1587J30446j9872a71827D0955r898
17608C1057P2856a0610D8638K31832o8329c1884A4457J17309b64291D68618e3860
17596A95377a15127B71475b67917R8422b9827j45808G4900N8189k0081J94001
17586C07009e6939o995B03210c4696E49308b36207C07754d9112F0826b92169J20012
17575a72157A55838C4399c3259C5417J78598b05316A89180i4281G9305b19773
17564E0325d0205p4620M2383j40018A6224K31393K79631A02360J0659O5277C7047
17552D09438A55860m8320b2117j31740C9259M4468k6562j2587K92494A06118O9696
17541A75814E1140d1742l34016F5889C443K2505P5286J54490b9334D4148P6174
$$ y = [-89810, -152792, -178404, 6654, 80043, -213904, 21587, 152033, 132161, -171827, 40955, 31057, 103913, -10610, 48638, 280470, 212141, -31884, 14457, 131766, -264291, 468618, -53860, 195377, -115127, 271475, -267917, -169495, -29827, -175635, 74900, 133089, 113008, 307009, -56939, -63934, 203210, -34696, 549308, -236207, 307754, -49112, 60826, -292169, -172157, 155838, 34399, -33259, 35417, 214015, -205316, 189180, -94281, 79305, -219773, 50325, -40205, -114825, -72442, -212460, 16224, 247617, 527248, 102360, 113019, 178296, 37047, 409438, 155860, 107540, -22117, -153857, 39259, 83727, 57165, 44578, 337072, 106118, 175814, 51140, -41742, -375758, 65889, 3443, 25948, 101234, 255724, -29334, 44148, 120322]
17530A20322J19029C8030c7312j7817B66221A02580K57765A30051c5069o448B46388
17518A76880C0049c0858j28157H6417J73526a64730G9691K8282J63516A21185
17507C56074B8066c91962E7091A2756g6607D081L86207A56513e192A32789K74577
17496D07366A02302J29665O7366O863f1961A98562K78303H4844p2h4527C9494
17484A63531F2643L40360I03J26256l1387j6554Q3315M9125m7048q0398k1243
17473F2969K44488q2225k0926J0235j04688J0780a16930A1122J97404p8495K32422
17462C62453A10926d0575o6179B99618D4084m381e346A21413J1724j2591k6247
17451I4299J83249M8754E3925O1929J84711A41078N8412q775N5169o6244k0435
$$ y = [120322, 239351, 38030, -37312, -55129, 266221, 102580, 360345, 130051, -35069, -41517, 246388, 176880, 30049, -30858, -159015, 86417, 259943, -164730, 79691, 107973, 271489, 121185, 356074, 28066, -391962, 57091, 12756, -76607, 4081, 390288, 156513, -5192, 132789, 407366, 102302, 231967, 299333, 306196, -61961, 198562, 476865, 84844, 84772, -84527, 39494, 163531, 62643, 403003, 903, 127159, 95772, 79218, 162533, 211658, 164610, 84212, 62969, 307457, 225232, 204306, 214541, 109853, 120633, -116930, 11122, 208526, 130031, 362453, 110926, -40575, -106754, 299618, 44084, 39703, -5346, 121413, 133137, 120546, 94299, 277548, 326302, 53925, 115854, 300565, 141078, 199490, 190715, 245884, 179640, 159205]
17440A59205K19168r9880E4967N06538i3C0950M61234B16412J31985j69534J29910
17429C08773k1359o7618r3228a31558C51230A06093J05001J7698K53598B34870
17418A50832e0251C95435A39232D5856Q819J3630a53335B26266F8933a8951j3008
17407c1959G9374L4868K26257A01809L26024H6252K29543A24862L5969J53193
17397C14024A30720a20772A63602F1819J62253J85912A43714N5144F3743J36154
17387A99897k0657a26433A27133J08210A04099K71399J48305a25665D06191j29023
17377B77168f188D77692e7011F6583J16657R7227b57997I0701p171j3088L90244
17366D60686F5550K79812a01855K9016A83733Q2337J7880a6272B01652c70390
$$ y = [159205, 378373, 278493, 54967, 561505, -93, 30950, 492184, 216412, 348397, 178863, 308773, 287414, 219796, 126568, -131558, 351230, 106093, 211094, 228792, 482390, 234870, 150832, -50251, 395435, 139232, 45856, 54675, 68305, -153335, 226266, 68933, -18951, -31959, 79374, 114242, 340499, 101809, 427833, 86252, 315795, 124862, 160831, 314024, 130720, -120772, 163602, 61819, 224072, 409984, 143714, 198858, 63743, 199897, 179240, -126433, 127133, 235343, 104099, 375498, 523803, -125665, 406191, 277168, -6188, 477692, -57011, 66583, 183240, 280467, -257997, 90701, 83530, 70442, 460686, 65550, 345362, -101855, -72839, 183733, 266070, 283950, -16272, 201652, -370390]
17355A03029O9424J29036I0249J18574c2316B89444i1277D2655e0044A62711C9399
17343C05126j01173D7924J22563L62381G5515C0712g487B88691k0839H6495R9705
17332A86200K48663A40012E9265P0208N6290J18145j00488b6720B07383o1615
17322A45768J20604J46738G6497K43097j41958p919J8269q9415K55891j02132
17312B52330K6168A34108P3409H8245P0789J3473E0832K33282r7424o4086J38742
17301B61346I6087r63l4902q123e1724A2560O5823d3591E28812a36631A25238
17289g5659B13981l9994K55187a39374l9771B20881n5551B8834j4067J13999J49353
17278B78119Q9197K519j52787n6663J02334J15236c7161A80521n8278N7697J27141
$$ y = [103029, 172453, 301489, 90249, 208823, -32316, 289444, -91277, 42655, -50044, 162711, 39399, 305126, 203953, 47924, 170487, 532868, 75515, 30712, -7487, 288691, 267852, 86495, 186200, 434863, 140012, 59265, 129473, 185763, 303908, 203420, -26720, 207383, 145768, 266372, 413110, 76497, 319594, 177636, 169717, 187986, 98571, 354462, 252330, 278498, 134108, 207517, 88245, 159034, 172507, 50832, 284114, 186690, 122604, 261346, 96087, 95124, 60222, 52099, -51724, 12560, 78383, -43591, 528812, -136631, 125238, -75659, 213981, 173987, 429174, -139374, -179145, 220881, 165330, 28834, 14767, 128766, 278119, 367316, 369835, 217048, 160385, 262719, 377955, -37161, 180521, 122243, 179940, 307081]
17267C07081e9756D95701j50022C544a94146F6529k4752O9151f2973A46525L1863
17256A78388p617J9398K3684A4375K88514I0422J2498L04594j08449j49339K85136
17245D34862j84371a18969B00007a59677A74065F5328J48213J2457l8200J27613
17235C15411B2884e8197B64603b3516K583B418N85622e4519C32330j34214J19586
17224C17702m923G2041K0715K4982J62091L934j26439L49448j53365K37091k50706
17213C39792D4153K66745Q4131A48804K72135A89070J769K94042A61008F405K21315
17202B27720L47883A83051P8353N7044K46150j18941j77402A16688K39883N8650
17192D15221l355m7679j42071K31933B00311J46878l1067J35989a03329D0472
$$ y = [307081, -59756, 495701, 345679, 3544, -194146, 66529, 41777, 110928, -62973, 146525, 178388, 170771, 190169, 213853, 14375, 302889, 90422, 102920, 407514, 299065, 149726, 434862, 250491, -118969, 200007, -159677, 174065, 65328, 213541, 225998, 187798, 315411, 22884, -58197, 264603, -23516, -20933, 2418, 588040, -54519, 332330, 198116, 317702, 312779, 72041, 92756, 117738, 279829, 283763, 157324, 506772, 353407, 590498, 339792, 44153, 310898, 395029, 148804, 420939, 189070, 190839, 484881, 161008, 6405, 227720, 575603, 183051, 261404, 318448, 564598, 445657, 268255, 116688, 356571, 415221, 411866, 364187, 222116, 454049, 200311, 347189, 316122, 452111, -103329, 40472]
17181C65550j17539E1186L17744A66967L37181D5485Q6711M11609A69068J77664
17171C46732Q3473A33724J30518j166c06765E67127k47496m7291j5778M5610R0466
17160C92638r2445g6881A80312L49647j97393N7751L6599A11560M24057A64755
17149C65035m6023A10334L61504B26752a12035B2524N12198B37435L2363J05989
17139C75787A59658L52467o2943k05620l5628n0608D7014M64835A04315R9999
17129B04314J50544K86702k77388J6439L42584k51719j96696L14306d0048D46572
17118E02861k09519j44295J80168j51252F7794M39455j15342A67189M867b127
17107C68924A02932N82620r1776A79639J19645J61085j59569K58126B17065K58653
$$ y = [365550, 248011, 51186, 368930, 166967, 504148, 45485, 132196, 543805, 169068, 346732, 430205, 133724, 264242, 263076, -306765, 567127, 319631, 272340, 256562, 302172, 392638, 300193, -76881, 180312, 529959, 332566, 390317, 426916, 111560, 535617, 164755, 365035, 319012, 110334, 471838, 226752, -112035, 22524, 534722, 237435, 269798, 375787, 159658, 512125, 449182, 243562, 207934, 157326, 47014, 511849, 104315, 204314, 354858, 641560, 364172, 380611, 723195, 471476, 274780, 589086, -40048, 446572, 502861, 293342, 149047, 329215, 177963, 67794, 507249, 391907, 167189, 172056, -2127, 368924, 102932, 685552, 593776, 179639, 299284, 460369, 300800, 558926, 217065, 475718]
17097D75718a65477F04977q0846A04184L25383j90624K40331k34430K98157A98366
17086C70862J68611J41919j90794m1026B24416K18721J1364R7476q9403K33435
17076F96009M5966k41459j294k04770K49440K37315l21976J03109k07927L11537
17066F65950k66346K91245B74623K99803B27590M67746A72902J40234L93636A90145
17055C66224J5188J40299o1075A14033M05935J04246J22693C30310L01493j81895
17045D49908J87328O5874B87662J49534K88699q7206J5070K7171J63233j07932
17035G36231k56095K77410q9592r5996j5133K15375j63775K87632k35071o3093
17025E97893M0829R447j36543k26225L47971J18239k26976L52284Q4528l40561
$$ y = [475718, -165477, 604977, 524131, 104184, 429567, 238943, 479274, 244844, 543001, 198366, 370862, 539473, 681392, 490598, 449572, 224416, 443137, 454501, 551977, 462574, 696009, 741975, 500516, 499222, 294452, 543892, 781207, 459231, 562340, 354413, 665950, 399604, 690849, 274623, 574426, 227590, 695336, 172902, 313136, 706772, 190145, 366224, 381412, 521711, 460636, 114033, 519968, 624214, 746907, 330310, 631803, 449908, 637236, 703110, 287662, 437196, 725895, 638689, 653759, 680930, 844163, 736231, 480136, 757546, 667954, 571958, 556825, 772200, 608425, 896057, 660986, 597893, 638722, 648169, 511626, 285401, 633372, 751611, 524635, 876919, 961447, 620886]
17015F20886r9204B57615J59916J84920J95161l5357j06128K18156N1694j47039
17005G78938j49297j23112J93509j01410J72441q9656J67594k38620n9708J67998
16995G18677K70448l32161L15736l38853O7872J40895k42230N2968N1247k16653
16985D87946L2777n0353K55935J59700k14929r5272K31338J32654q5998j23864
16975G29934r3344L11091o3022Q8304N5151j16994M3802q8217m7588k80500L98229
16964I36846j16515k12755M44282k27737K68141m078k34015J99289j37458L5400
16954I51400J55502j52961N649L6894j93754J47789J76438r8132J70316l79971
16944H19170K4075M17862p9788j44828K21599l130k12077L28095j63112l66574
$$ y = [620886, 521682, 257615, 417531, 602451, 797612, 762255, 656127, 874283, 925977, 778938, 629641, 506529, 700038, 598628, 771069, 681413, 849007, 610387, 550679, 718677, 989125, 656964, 972700, 633847, 701719, 842614, 600384, 653352, 704599, 487946, 520723, 470370, 726305, 886005, 671076, 575804, 807142, 939796, 853798, 729934, 636590, 947681, 884659, 972963, 1028114, 911120, 954922, 866705, 819117, 538617, 936846, 820331, 607576, 1051858, 824121, 1092262, 1088184, 854169, 1053458, 916000, 951400, 1106902, 953941, 959590, 996484, 802730, 950519, 1126957, 1028825, 1199141, 819170, 843245, 1261107, 1181319, 1036491, 1258090, 1254960, 1042883, 1370978, 1207866, 841292]
16934H41292J34276K42507K14307F85921N11386k14941J67147o8284M20817j34218
16924A367828p4261q3149k31970M98134k860j68855L05974J22315m36117p2262
16914A224777J58862k24578J95565K34401k07437J13103p243k11068J54137K63886
16904A694405k04103L16096l48422j96963K27668K29986k6798m5619p0940J59858
16894A735168k70573J68748K28088j81703K93779m74484M25620j91418L44947
16885B078172k07139M9354K27281L47374m81708L1560K76682o3347k14211J70663
16875B214681n4675n4897N17940j66502l09647J94607k56648L64528o5350M4236
16865B428273J11275j71100L89484o11634K88745M1664j73635K18280J47357k39804
$$ y = [841292, 975568, 1218075, 1432382, 685921, 1197307, 982366, 1149513, 1081229, 1502046, 1367828, 1293567, 1210418, 978448, 1476582, 1473722, 1304867, 1610841, 1733156, 1297039, 1224777, 1383639, 1159061, 1354626, 1589027, 1381590, 1494693, 1487450, 1276382, 1430519, 1694405, 1490302, 1806398, 1457976, 1261013, 1488681, 1718667, 1691869, 1646250, 1575310, 1735168, 1464595, 1633343, 1861431, 1679728, 1973507, 1499023, 1924643, 1733225, 2078172, 1871033, 1920387, 2147668, 2495042, 2013334, 2044894, 2321576, 2258229, 2044018, 2214681, 2160006, 2105109, 2623049, 2456547, 2146900, 2341507, 2084859, 2449387, 2384037, 2428273, 2539548, 2368448, 2757932, 2146298, 2435043, 2476707, 2303072, 2521352, 2668709, 2428905]
16855B428905L84367m1628p5285K4480j8087N12780k49096K96036k3672p6761
16845C162039j12349L5791R2024K00479l4070K36680k65088N5617K88891J70013
16835C830027o2004o6999K1471L54839o3406M59084n09044N22686k09222K49139
16825D526571j60194K22393L5058j74274K55694K40650l5530J11856j04866K5303
16815D942661L56745J52891j14464j117j42522K34771M45579J67797J10091J98034
16805F350466K64415k54900L56884k03198N89680n3747k331L46918L30841K00826
16795G925854l32969Q56401J20388M7688O0910O40834J11687m3275K32522M33521
16785A0053561J66828K67807J55839N33577L72859J79560N69829N5093Q62655
$$ y = [2428905, 2813272, 2771644, 2696359, 2720839, 2702752, 3215532, 2966436, 3262472, 3238800, 3162039, 3049690, 3085481, 3177505, 3377984, 3343914, 3580594, 3315506, 3371123, 3660014, 3830027, 3768023, 3701024, 3722495, 4077334, 4013928, 4473012, 3963968, 4486654, 4277432, 4526571, 4366377, 4588770, 4623828, 4449554, 4705248, 4945898, 4910368, 5022224, 4917358, 4942661, 5299406, 5452297, 5337833, 5336716, 5194194, 5428965, 5874544, 6042341, 6152432, 6350466, 6614881, 6359981, 6716865, 6513667, 7103347, 7049600, 7047269, 7394187, 7725028, 7925854, 7592885, 8449286, 8569674, 8617362, 8678272, 9319106, 9430793, 9387518, 9620040, 10053561, 10220389, 10488196, 10644035, 11177612, 11550471, 11730031, 12299860, 12354953, 13217608]
16776A3217608n0594P00487J08701P24081J52475Q62313L1698M88291P56981M25828
16766A7417869O56721N25189J068324N51344Q97968O04607J179932Q72826J044156
16757B4818936R61018N38266J226655J362185J356530R89063J597844J547337
16749C4397834J579402J909519J726218K030309K031687K347251K482107K344103
16741E0848430K327687L174425L636520L022081L707067M217581M164899M898347
16733G9997037M813444N081966N778371O165759O209964P205537P039479P638265
16725A29929822P650601Q321501P871842Q293837Q022111P778859O800016O165463
16717A90834052N623269L945194L001540J189231p4055j637317k944152m485024
$$ y = [13217608, 13167014, 13867501, 13976202, 14700283, 14852758, 15715071, 15746769, 16235060, 16992041, 17417869, 18074590, 18599779, 19668103, 20219447, 21117415, 21722022, 22901954, 23774780, 24818936, 25779954, 26318220, 27544875, 28907060, 30263590, 31252653, 32850497, 34397834, 35977236, 37886755, 39612973, 41643282, 43674969, 46022220, 48504327, 50848430, 53176117, 56350542, 59987062, 63009143, 66716210, 70933791, 75098690, 79997037, 84810481, 89892447, 95670818, 101836577, 108046541, 115252078, 122291557, 129929822, 137580423, 145901924, 153773766, 162067603, 170089714, 177868573, 184668589, 190834052, 196457321, 200402515, 203404055, 204593286, 204519231, 202881914, 199937762, 195452738]
16709A95452738n388166p000937p238395p910713p952079q768247q467027q026991
16701A34700183q045680p773140p611724o949909o278784o329299n758085n130375
16693H0823187n061777m636832m211819m040273l608410l306193l320043k496521
16685E0141319k876227k475086k663433j861418k282174j583383j855304j620287
16677C2924007j712385j774118j098810r38143j390462j247090j115162n79884
16669B3067953j349176q23314q71377o36521r33802p11792l30131p04640q85169
16660A5822031l21432q43771k89715k71486q20902l64354j81475p14991l46922
16651A1666983K4142m03689j63400o24201k72900l94744m2841o59155L02462p29626
$$ y = [195452738, 190064572, 183063635, 175825240, 167914527, 159962448, 151194201, 142727174, 134700183, 126654503, 118881363, 111269639, 104319730, 98040946, 91711647, 85953562, 80823187, 75761410, 71124578, 66912759, 62872486, 59264076, 55957883, 52637840, 50141319, 47265092, 44790006, 42126573, 40265155, 37982981, 36399598, 34544294, 32924007, 31211622, 29437504, 28338694, 27400551, 26010089, 24762999, 23647837, 23067953, 21718777, 20895463, 20024086, 19387565, 18453763, 17741971, 17411840, 16707200, 15822031, 15500599, 14656828, 14367113, 14095627, 13274725, 12910371, 12728896, 12013905, 11666983, 11691125, 11287436, 11124036, 10499835, 10226935, 9832191, 9789350, 9130195, 9432657, 8703031]
16641H703031j91220k84410j44496l23208j99762k75883O8392k12342m3580l93674
16631F702848K93724l99782k52948j57430m17352J08553j76132k84976k71295
16622E145210L5273J33839j33821l04897j20165j05733P6548O6463n86724L10798
16612D516791k339m70408N1908J01372j20152k13165j66656J51188j36889j87554
16602C524096q0751J43250j64023p8406K75482m14180j70409N300J29342O1816
16592C231517n67561L9216K35914k89571J22837k2977j1498K5344J6159k27409
16582B551971n9135l0643J64108m70432j53108K16693K92825l12555J06009k07900
16572B097833M6836l40784K76325k02264J1975N507l87272M22679m13562L65714
$$ y = [8703031, 8511811, 8227401, 8082905, 7759697, 7559935, 7284052, 7352444, 7140102, 7096522, 6702848, 6996572, 6596790, 6343842, 6186412, 5769060, 5877613, 5701481, 5416505, 5145210, 5180483, 5314322, 5180501, 4875604, 4755439, 4649706, 4726254, 4792717, 4205993, 4516791, 4514452, 4044044, 4095952, 4197324, 4077172, 3864007, 3697351, 3848539, 3711650, 3524096, 3443345, 3586595, 3422572, 3344166, 3619648, 3205468, 3035059, 3040359, 3169701, 3231517, 2663956, 2703172, 2939086, 2649515, 2772352, 2749375, 2737877, 2763221, 2779380, 2551971, 2492836, 2462193, 2626301, 2155869, 2002761, 2219454, 2512279, 2199724, 2305733, 2097833, 2144669, 1803885, 2080210, 1877946, 1889921, 1895428, 1508156, 1930835, 1517273, 1882987]
16562A882987k22115L15594l12062K28992r7841J71221l75920j13184O05723l37079
16552A746316r1644l60747O9758L94418l53381K70504m32781K97545l04697L81884
16542A617175m96762M20692l33563j9422P2377n1480O4643p687n6535L33652l57396
16531A185694J52491k31127k1190j23904K71088n01080M51075l27082J73080k6706
16521A002339J00569R6170j45421M2444J95015k65313k20269J93801m2681r9491
16511H57163K2504n1701j11212J15653K26323l79558N63952n66163K08996j07232
16501G78725l49666L40589L54052m81818k93460N40998O6157p7685J83230k29608
16491H31514K03163k64421J35280o1280R869o0369j8870k6007K86581k78457K94759
$$ y = [1882987, 1660872, 1976466, 1664404, 1893396, 1795555, 1966776, 1590856, 1477672, 2083395, 1746316, 1654672, 1293925, 1363683, 1758101, 1404720, 1675224, 1242443, 1539988, 1235291, 1617175, 1120413, 1541105, 1207542, 1188120, 1260497, 1209017, 1273660, 1265973, 1209438, 1543090, 1185694, 1338185, 1107058, 1085868, 961964, 1233052, 731972, 1183047, 855965, 1029045, 1002339, 1102908, 1199078, 1053657, 1096101, 1291116, 1025803, 805534, 999335, 956654, 857163, 879667, 827966, 716754, 832407, 1058730, 679172, 1243124, 676961, 885957, 778725, 429059, 769648, 1123700, 641882, 348422, 889420, 955577, 877892, 1061122, 831514, 1034677, 770256, 905536, 844256, 854125, 793756, 774886, 748879, 1035460, 757003, 1051762]
16480A051762l79119j77357K79378R1104j71398m6306J30862j57422J47336j40835
16470F28005k25707L52668k16031K50636j78806N4429k72605L0070M62604D27596
16459F53103J8553l8732r2270A32066N66713K44047B12757O9135K93502j2455
16449E62939j32147A05129L96815p3924J20429q5010M9517J32874k36181J89711
16439E99360P8083k87592n1232L95707k88661K72205k95014N6069j88765k1938
16429B68222M31913o7199k01164m976j0035j84903i5575A14468L78186J64700
16419F57354J06312l55950j39498M21604B70183J55091K72726l36684K1462j8186
16409C64592L08254j80501G7300K10632J61836B03394O9471a61492D90928B22432
$$ y = [1051762, 672643, 495286, 774664, 865768, 694370, 648064, 778926, 621504, 768840, 628005, 402298, 754966, 538935, 789571, 610765, 665194, 392589, 422659, 885263, 427596, 653103, 671656, 632924, 540654, 132066, 698779, 942826, 212757, 281892, 575394, 562939, 430792, 105129, 501944, 428020, 548449, 463439, 512956, 645830, 409649, 599360, 677443, 389851, 338619, 734326, 445665, 717870, 422856, 478925, 290160, 268222, 700135, 632936, 431772, 426796, 416761, 231858, -95575, 114468, 492654, 657354, 763666, 407716, 268218, 689822, 270183, 425274, 698000, 361316, 382778, 364592, 672846, 492345, 77300, 287932, 449768, 203394, 272865, -161492, 490928, 222432]
16398C33626q346N5144p5763h585D00125f5278F15530k12740n6380J15493e0993
16386G77690C58521j55038L19997j06145B0484O00306I6678J63872k5060K08542
16376D44032k7025k07004j4367F8668J88275j28099J18157j21162J18502R9677
16366C44018l2950h99A59773J25853n9114k7203F5645i3253B55712k1755K5526
16355B59483C5491K76361c1887p5904G8324a53863C97362j83093b19319C75918
16344G7019L18418j56130K61752C6645e1397C15864j12570J47554A49353K66409
16334D15762k4065A75341K18828j02781j15477a4656I372K31231r4662p2335J08721
16323A82327q889J97015H9434e8349B62614I7099B4762A835K78992a0620A09325
$$ y = [333626, 325280, 380424, 304661, -8585, 400125, -65278, 615530, 402790, 346410, 461903, -50993, 777690, 358521, 203483, 523480, 417335, 20484, 620790, 96678, 260550, 235490, 444032, 417007, 210003, 195636, 68668, 256943, 128844, 247001, 125839, 244341, 344018, 311068, -899, 159773, 285626, 226512, 199309, 65645, -93253, 255712, 233957, 259483, 35491, 311852, -31887, -107791, 78324, -153863, 397362, 214269, -219319, 375918, 77019, 395437, 239307, 501059, 36645, -51397, 315864, 203294, 350848, 149353, 415762, 391697, 175341, 394169, 291388, 175911, -14656, 9372, 240603, 145941, 73606, 182327, 173438, 370453, 89434, -58349, 262614, 97099, 24762, 1835, 280827, -10620, 109325]
16311E40551D4393A4836K79141j11698b17655C75470j80474f8670I4571J5547
16301A10118K14543a76940Q2512I198J38202a90819d6842C17543A4910L1306Q0942
16290A27158J48527a69695A39004K7993J09372j5169j22252K62546e947l2488
16280c8435A87980I2416a5903k98728D8615J62990n2766a0667q634C04185A11258
16268B75997q7550m842m99n4305M045k951a45443A17728K0466g2597H970J09585
16256A18555h9019k48939B44539F2866J51591a36586a6275n0793E3687B247c09584
16244H0960a06448A9841J29752a31582B33470B9672a414A22442k3081J43329e8324
16232a0117A02288f4475C44162i3199A70900k6258l5780O6334b27634D08573A2729
$$ y = [540551, 44393, 14836, 293977, 182279, -217655, 375470, 194996, -68670, 94571, 110118, 324661, -176940, -94428, 9198, 147400, -190819, -46842, 317543, 14910, 46216, 127158, 275685, -169695, 139004, 166997, 276369, 261200, 138948, 401494, -5947, -38435, 187980, 92416, -15903, -314631, 48615, 211605, 158839, -10667, -19301, 304185, 111258, 275997, 188447, 183605, 183106, 128801, 132846, 129895, -145443, 117728, 138194, -72597, 8970, 118555, -89019, -337958, 244539, 62866, 214457, -136586, -16275, -67068, 53687, 2247, -309584, 80960, -106448, 19841, 149593, -131582, 233470, 29672, -1414, 122442, 99361, 242690, -58324, -10117, 102288, -64475, 344162, -93199, 170900, 144642, 108862, 175196, -227634, 408573, 12729]
16220C04918l8194b19197A05559h5115A50991J2901c1366A18850J7727a53875
16209a3188C0586R869j7465a79183C7541p508J53424p9285m8230M72255b4788
16197I6328l8908J31634c8429C02140A42355D1394K27653a8151D9907c14663h369
16185e57300G6299L75655a85327B3676P1168d813B36193a60243A47834i2537D8775
16173C7336J37807b28051j877B7195J16621a10356A00249a88k39006c4027j3994
16162d8021B99369l7701E9030r569e581A81944a24739D9603c1809j92721A41472
16150a49127j83294c5549k17823g9079A1072b99241I3330O6467G8717J99777E2864
16138C13039j47664J68721A00749Q1914L4852f7235k19700A72475D8452K8459
$$ y = [304918, 266724, -219197, 105559, -85115, 150991, 163892, -31366, 118850, 136577, -153875, -13188, 30586, 40455, 22990, -179183, 37541, 30033, 183457, 104172, 55942, 528197, -24788, 96328, 57420, 189054, -38429, 302140, 142355, 41394, 269047, -18151, 49907, -314663, -8369, -557300, 76299, 451954, -185327, 23676, 94844, -4813, 236193, -160243, 147834, -92537, 48775, 37336, 175143, -228051, -229928, 27195, 143816, -110356, 100249, -188, -239194, -34027, -48021, 299369, 261668, 59030, 49461, -5581, 181944, -124739, 49603, -31809, -224530, 141472, -149127, -332421, -35549, -253372, -79079, 11072, -299241, 93330, 159797, 78717, 278494, 52864, 313039, 165375, 334096, 100749, 182663, 217515, -67235, -286935, 172475, 48452, 76911]
16128G6911J39096O0726b07003a4768l9001B66040H0940J96309a39755d4882A65086
16116f7830n8453B53669h3845A01733C5745J87075g5234K6076A7817P1580g4111
16104C8462A065L42566c59105G9971J70752g6915H2751B4377a79605A72570K9144
16093B01714d16846i5134A33682l2808e0870B1284c57459A67904q0834B63N3923
16082E4186b28867C7887J24111b31066f3603j1328p2817m9241O6136E8833J1578
16071G0411a60380j11760E0657J53963a71019B55139g2113K3059A95062q1000
16061A14062n5019e7577J636a8209d463C37829b39982R6898q6423F3539Q0246
16050A43785b92245j68576a54534G4630d05499h1560l5697A86302a76980K6702
$$ y = [76911, 216007, 276733, -207003, -14768, -53769, 266040, 80940, 277249, -139755, -44882, 165086, -67830, -126283, 253669, -83845, 101733, 35745, 222820, -75234, -49158, 17817, 89397, -74111, 38462, 1065, 343631, -359105, 79971, 250723, -76915, 82751, 24377, -179605, 172570, 201714, -416846, -95134, 133682, 100874, -50870, 21284, -357459, 167904, 87070, 263, 54186, -228867, 37887, 161998, -231066, -63603, -74931, -147748, -196989, -130853, 58833, 70411, -160380, -272140, 50657, 204620, -171019, 255139, -72113, -49054, 195062, 114062, 59043, -57577, -55941, -18209, -4463, 337829, -239982, -143084, -229507, 63539, 143785, -292245, -460821, -154534, 74630, -405499, -81560, -117257, 186302, -176980, -150278]
16040a50278k62001B57439b48817A69979J85657F7962K3841m4331M255a08919
16029A97080J26132b96136J11156G1298J08057i5049C6482J3399a40619A30294
16018a18661k1434f4871j52463A29039n4396b19277J03117K8975L7071l11720
16008c61834C50307H9256a4371F2190L57592G2360c1486A60953f9602a9124k59601
15997b78725A4858a93913F0332I810c82035c6928q1586B16940j0291M8925c1795
15985i9323C31843B6102b0381E00751j0418q1619G965L8776b7206B97874A20125
15973a58214B31469O0527b57511A33625B1987h110j10218A93296a63241I3352
15962f6779I9499O1050L8565B1456M1923a37841I4624d2573E3707h8220r8284
$$ y = [-150278, -412279, 257439, -248817, 169979, 355636, 67962, 91803, 47472, 51727, -108919, 197080, 323212, -296136, -184980, 71298, 179355, -95049, 36482, 49881, -140619, 130294, -118661, -140095, -64871, -217334, 129039, 74643, -219277, -116160, -87185, -50114, -361834, 350307, 89256, -14371, 62190, 419782, 72360, -31486, 160953, -69602, -19124, -278725, 14858, -193913, 60332, 9810, -382035, -36928, -118514, 216940, 206649, 255574, -31795, -99323, 331843, 26102, -20381, 500751, 490333, 408714, 7965, 46741, -27206, 297874, 120125, -158214, 231469, 291996, -257511, 133625, 21987, -8110, -118328, 193296, -163241, 93352, -66779, 99499, 160549, 199114, 21456, 63379, -137841, 94624, -42573, 53707, -88220, -186504]
15951a86504M8366m9667j53433p205a3758c433q1033A8213b67236o3559b9155
15939c1566C29485b4545B44929a86699r8453a25946r8217i3617K6180G4982b8284
15927C71352c68434J60720k44641J89274a24648N151A58778e5828C8421b37646
15916d52315A24321a50120J5526d4644O042I3137K30j3037a21016j46582J31884
15905a35714m7579k09983a47020c3724A05518i7856l8363p6146r7713B82550B4109
15893b94674H2720b20281O7012j53267A14494l8257a02629j04213N2679C06037
15882a31057G8900c49383A7593b70713A06626a93509D3187b24419H8913k1047
15872F7866J7245a11151M9006j99134d6447J2124j40583M7340k39141a49612F9678
$$ y = [-186504, -138138, -187805, -341238, -348443, -13758, -3433, -84466, 18213, -267236, -330795, -29155, -31566, 329485, -24545, 244929, -186699, -285152, -125946, -224163, -93617, -67437, 74982, -28284, 371352, -368434, -207714, -452355, -263081, -124648, -119497, 158778, -55828, 38421, -237646, -452315, 124321, -150120, -134594, -44644, -38602, 93137, 93367, 80330, -121016, -267598, -135714, -183293, -393276, -147020, -33724, 105518, -97856, -136219, -212365, -310078, 282550, 24109, -294674, 82720, -220281, -153269, -306536, 114494, 76237, -102629, -206842, -154163, 306037, -131057, 78900, -349383, 17593, -270713, 106626, -193509, 43187, -224419, 88913, 67866, 85111, -111151, -62145, -261279, -46447, -34323, -174906, -127566, -366707, -149612, 69678]
15860B716K07416D7634K01566O6321b27864J09244j55310C83462E6500i9156j21091
15849b20247A00829a4858k1919F5683O5226b2325r8514A30161d64728A49626C5197
15837i0631A0795h3376r9817N3580A14187b16355d2573j32995d7181k27298p9820
15826c54299A41630f1278j57722J0248k59100J68746k6383e0235l6444c0473p0899
15815a01372K6135M902j9251B88782I4023a79253i194j10026F0275K34317A41223
15803d66283A09673L6154M0489a82257F5438a47723j3717A74036l2655a24518
15792f9585k91600f7390o9896L6586A63951f3033j79450B38512b40132J02950
15782a37182R754a0351A17303d0188A25103c03421f2715A02960A5449J65987H0509
$$ y = [2716, 210132, 47634, 249200, 315521, -227864, -118620, -273930, 383462, 56500, -99156, -220247, 100829, -14858, -36777, 65683, 130909, -22325, -120839, 130161, -464728, 149626, 35197, -90631, 10795, -83376, -183193, -129613, 114187, -216355, -42573, -175568, -47181, -274479, -354299, 141630, -61278, -219000, -208752, -467852, -299106, -325489, -50235, -86679, -30473, -101372, -75237, -70335, -89586, 288782, 94023, -179253, -9194, -119220, 60275, 294592, 141223, -466283, 109673, 145827, 186316, -182257, 65438, -147723, -161440, 174036, 141381, -124518, -69585, -361185, -67390, -137286, -100700, 163951, -63033, -242483, 238512, -240132, -137182, -127428, -10351, 117303, -40188, 125103, -303421, -62715, 102960, 15449, 181436, 80509]
15770c53831h4848d2087B6229b28755J06858j52305a08552j100A12763j9415j6359
15759G6989g0728C7047e5341b1719F4427a28196k20174A0395K79676g3710A2826
15747b29025A69921a1187H2461k3853a59649A9008b46779O9268H1142a74395c6835
15735B81034G8164C3297i3833A3526J5418b71277O912A6828J12862D8222b37260
15723a35204a5285k5842p4026j23354b1227l85948a71994g0481j94573f0990c415
15711c67273B55240A9659b8603n4609C3040J9061a39105N9332p9598p3117J15937
15700a16551l5078F752a89819o2939p6194I8246b18391B21546b98984A55199j8620
15689A36579a68708b8437j15405k2466B093a32909N9554A71053q2098G82J31524
$$ y = [-353831, -84848, -42087, 26229, -228755, -121897, -274202, -108552, -109652, 112763, 93348, 76989, -70728, 37047, -55341, -21719, 64427, -128196, -348370, 10395, 290071, -73710, 12826, -229025, 169921, -11187, 82461, 58608, -159649, 19008, -246779, -177511, 81142, -174395, -36835, 281034, 78164, 33297, -93833, 13526, 28944, -271277, -264365, 16828, 129690, 48222, -237260, -135204, -15285, -41127, -115153, -238507, -21227, -407175, -171994, -70481, -265054, -60990, -3415, -367273, 255240, 19659, -28603, -83212, 33040, 52101, -139105, -79773, -159371, -232488, -116551, -151629, 6752, -189819, -252758, -328952, 98246, -218391, 221546, -298984, 155199, 136579, -168708, -28437, -143842, -166308, 2093, -132909, -73355, 171053, 88955, 782, 132306]
15678A32306b40276A93483D7348J02343c765k7501A01024a47409g2792A04342
15667b4707A03454M0035j0552a38392A89933m0082E5961d4397C70264A65477d1240
15655A94836b1108F9263J54315D3164N07154d7196k79816J17227f0931H5632J67895
15644B53527d7002J0268A4834J75949b39349i303l87282a03903n4921c9824A18791
15632c14706R9653A53334c06110e4019q899m20622a9417k56798D4657j5004d0104
15620B36348b22332i8886A29031c7156p2548c4333a4442j2548R455j59145B96275
15608a24042B9039O976L48646j75266o0326b39340P155n9016C6630J58507h6165
15596i254j23042p1328J1649P2657A1833J65664p5484e8095B44980e8649A2507
$$ y = [132306, -240276, 193483, 47348, 149691, -3765, -31266, 101024, -147409, -72792, 104342, -24707, 103454, 143489, 132937, -138392, 189933, 149851, 55961, -44397, 370264, 165477, -41240, 194836, -21108, 69263, 223578, 43164, 550318, -47196, -327012, -209785, -60931, 85632, 253527, -47002, -36734, 14834, 190783, -239349, -9303, -396585, -103903, -158824, -39824, 118791, -314706, -215053, 153334, -306110, -54019, -62918, -483540, -19417, -276215, 44657, 29653, -40104, 236348, -222332, -98886, 129031, -37156, -109704, -34333, -14442, -26990, -17535, -176680, 296275, -124042, 29039, 36015, 384661, 209395, 149069, -239340, -232185, -291201, 36630, 195137, -86165, -9254, -132296, -203624, -191975, -119318, 11833, 177497, 102013, -58095, 244980, -58649, 12507]
15584D51097a30406A67290a00965C4322J23487a01254J9965j38281i4228k02499
15574b96727E4936g8404C2202a58428G1046K1356C272J26964a12391E4854J45515
15563B00369a60185e4013q2703k95270e597C86521c0371j95334B5873a10313O961
15552a03352o5356k19804A54205a17922L7046A54776a25944A00940h0808C7783
15541g2055A35974a1749o7472j19302d4786F3723B4165J8316O9308k3476g0715
15529F859Q5976K96628d0207k11479I7874b31848B05466r1234l615c48631C001
15517A7412K8380A8242b4669C10656h4091o6204d3992A63911b442l8919C21127
15505a4940B4948K769a54087A99709J37382G6802O6859d58223J12870J59243H30
$$ y = [451097, -130406, 167290, -100965, 34322, 157809, -101254, -81289, -219570, -94228, -296727, 54936, -78404, 32202, -158428, 71046, 92402, 3272, 130236, -112391, 54854, 200369, -160185, -54013, -136716, -431986, -5597, 386521, -30371, -225705, 25873, -110313, -103352, -168708, -388512, 154205, -117922, -80876, 154776, -125944, 100940, -80808, 37783, -72055, 135974, -11749, -79221, -198523, -44786, 63723, 24165, 42481, 111789, 88313, -70715, 6859, 92835, 389463, -40207, -251686, 97874, -231848, 205466, 114232, 110617, -348631, 3001, 17412, 45792, 18242, -24669, 310656, -84091, -150295, -43992, 163911, -2442, -41361, 321127, -14940, 24948, 27717, -154087, 199709, 337091, 76802, 143661, -458223, -345353, -186110, 830]
15493a78353Q1791n9480k05558a19415f685p6969F1842k2223J03351b23467A16466
15481B1840J27002O0120a01536m21636B40204C5260A1977d1191k28051a03425
15470C31853a47621A69004h8748q2788e9498B64313c28635E7463K20118I8647
15459I2745J44588H4558a99480B70489b6120B47469j14046e6422F4327R8811R2494
15448B55632b5379k90890G1069C3056b65369F4253F019J68878q2681Q7228d819
15436A24732e4817l9081B4755b57168q55d155A38263a95289D70566B2898K48270
15425B71168a68304j472A60720o0549m6061K92787O9956a12505B36199a84262
15414B60591F4431k8887b03376B05955r97a08885N759B01119O9678A1082a23053
$$ y = [-178353, -96562, -156042, -361600, -119415, -6685, -83654, 61842, 39619, 142970, -223467, 116466, 21840, 148842, 208962, -101536, -523172, 240204, 35260, 11977, -41191, -269242, -103425, 331853, -147621, 169004, -88748, -171536, -59498, 264313, -328635, 57463, 277581, 98647, 92745, 237333, 84558, -199480, 270489, -26120, 247469, 133423, -56422, 64327, 163138, 255632, -25379, -316269, 71069, 33056, -265369, 64253, 6019, 174897, 92216, 179444, -4819, 124732, -54817, -93898, 24755, -257168, -258023, -4155, 138263, -195289, 470566, 22898, 271168, -168304, -169776, 160720, 100171, 54110, 346897, 416853, -112505, 236199, -184262, 260591, 64431, 35544, -203376, 205955, 204958, -108885, -103126, 201119, 270797, 11082, -123053]
15402E7673N5353a53269M3609j50793A59382b603E1468c1018C4429e0439k529
15391e2968B05580j8051h2346A35842a11642d5423k29404A1000K3217j0702i0863
15379i9277G733L98562a71218j41730A34817K86901a6246L613j65818N0177F2159
15367A33631a38719m1492G4294h6416l0566B34251A13381d7259B47988o0463h4689
15355I3230A1665j084d42168b08616B61620I020J08785H062J86040M0361d78917
15343f8384p4579A37518k7718E1477a22288H6201l0470A2021g0704p687H4639
15331b9905p8170b6871C4759K81952C3750M0431J3340c6533A07551N6634a2895
15319A43699d7392D0477b75367A0234f0248A39706B974L57006a4903A88315b45223
$$ y = [57673, 113026, -153269, -109660, -260453, 159382, -2603, 51468, -31018, 34429, -50439, -52968, 205580, 187529, -82346, 135842, -111642, -45423, -274827, 11000, 34217, 23515, -90863, -99277, 7733, 406295, -171218, -312948, 134817, 421718, -16246, -12633, -178451, -128274, 62159, 133631, -138719, -180211, 74294, -86416, -116982, 234251, 113381, -47259, 247988, 187525, -84689, 93230, 11665, 10581, -442168, -208616, 261620, 9020, 117805, 8062, 194102, 234463, -478917, -68384, -142963, 137518, 109800, 51477, -122288, 86201, 55731, 12021, -70704, -78391, 84639, -29905, -108075, -26871, 34759, 316711, 33750, 74181, 87521, -36533, 107551, 164185, -12895, 143699, -47392, 40477, -275367, 10234, -60248, 139706, 2974, 359980, -14903, 188315, -245223]
15307B37341R4927k700a88589A63351F5432g3865k86956F139N04655B09127D6400
15295f6519F679J3251J13451k9619J3247M6331o7507i7125B42418i5739j11547
15284b07286D36147a27389C2817R4521a09998A9928O835K125K0261K11155k2478
15273B37826e3219D0201Q045K37093a20024N8685L0087B51195b35417B62032A02006
15261a01230M7735B99199G5417Q7335Q7075m7766R743a6321k7836D02882A9134
15249G15252j42468J042439l49684r0064J96426C87713j07753j37903D5486r734
15239C5752a8157Q263q6632D6334a88173E3904F08a33426c657D5865f0964A78664
15226C6772d08375A82950r180a38685G1224O1005J12934E5798a28639C8498M247
$$ y = [237341, 332268, 329568, -188589, 163351, 65432, -73865, -360821, 6139, 510794, 209127, 46400, -66519, 6679, 19930, 133381, 103762, 117009, 163340, 95833, -97125, 242418, -95739, -207286, 436147, -127389, 32817, 127338, -109998, 19928, 26763, 28888, 49149, 260304, 237826, -53219, 40201, 48246, 285339, -120024, -61339, -31252, 251195, -235417, 262032, 102006, -101230, -53495, 299199, 75417, 162752, 249827, 202061, 211804, -16321, -44157, 402882, 19134, 715252, 572784, 1615223, 1265539, 1175475, 1371901, 387713, 279960, 142057, 45486, 35752, -18157, -9894, -96526, 46334, -188173, 53904, 608, -133426, -3657, 45865, -60964, 178664, 36772, -408375, 182950, 173770, -138685, 71224, 132229, 245163, 55798, -128639, 38498, 42745]
15215D2745J12043J4311J70167e1417B73052M3383H4717M8920F513M28555h3833
15203C42661g6571G5379J15906A7891K63047G346b04318F0262K89013A30419J3282
15192A43701b4545B75543A4717K81074K3737A5909J41075Q4124r6514J72368E6670
15180a08992j57360B0073K71339h9239E1937K73715d7813B44398k8145j06318
15170A09935n099a10016d4317r1185A4872M2723c2367D6849R7331K1526A4024
15158b64035H8643A205J22403N7854J1237a5416C4285a56279B00059o0437N8452
15147A98074q1714K73563j63769h8777A27044R264J46406n088D1256L62380n7205
15136C46431A70810i6990B66827K54320B21919o2985J14911b4631j39689B28963
$$ y = [42745, 154788, 169099, 339266, -51417, 273052, 316435, 84717, 133637, 6513, 435068, -83833, 342661, -76571, 75379, 191285, 17891, 280938, 7346, -204318, 60262, 349275, 130419, 143701, -24545, 275543, 14717, 295791, 319528, 15909, 156984, 241108, 144594, 316962, 56670, -108992, -266352, 20073, 291412, -89239, 51937, 325652, -47813, 244398, 216253, 109935, 104836, -110016, -44317, -135502, 14872, 57595, -32367, 46849, 144180, 165706, 14024, -264035, 88643, 1205, 123608, 181462, 192699, -15416, 34285, -156279, 200059, 139622, 198074, 116360, 389923, 226154, -88777, 127044, 136308, 282714, 277626, 41256, 403636, 346431, 170810, -96990, 266827, 521147, 221919, 158934, 273845, -24631, -164320, 228963]
15125A37578J31853j5067A04486K33793A30287J24040C4495M01457A53064m2462
15115A10602n905J01776C5125K14977l4489d99768B68174E2416P8306P9197K04376
15104D14295c02435g7222D6106i5969F2813i2295A97796r681F7894i6161F602
15092e7141A646Q1517j3309J16620J31273k5955j13032p2250b50575A83234a384
15080A69202K62498D0529J17583g2919A38645d2509A0158K7321P1649L76275E4189
15068E5842b3277B61776a27458A15082J43357R4810a42260A19986L63783b32492
15057D36638A50918a55893B40803p3716K8010R9504i7364L8667E32288j47932
15047C84356D5634L36729j79587J044J4887o9656a05982A24362J37473k1170k23
$$ y = [137578, 269431, 254364, 104486, 338279, 130287, 254327, 34495, 435952, 153064, 110602, 104697, 206473, 35125, 250102, 215613, -499768, 268174, 52416, 130722, 209919, 414295, -302435, -77222, 46106, -95969, 62813, -92295, 197796, 188115, 67894, -96161, 6602, -57141, 1646, 83163, 69854, 186474, 317747, 291792, 178760, 106510, -250575, 183234, -1384, 169202, 431700, 40529, 158112, -72919, 138645, -42509, 10158, 37479, 109128, 485403, 54189, 55842, -23277, 261776, -127458, 115082, 258439, 353249, -142260, 119986, 483769, -232492, 436638, 150918, -155893, 240803, 167087, 195097, 294601, -97364, -58697, 532288, 384356, 45634, 382363, 202776, 203820, 218707, 149051, -105982, 124362, 261835, 240665, 240442]
15036B40442J01970R808A50300a86795B93794f771C24666A05503K9527A0477L3226
15025D3703M76539A02895J39457N033G9899J85727K69338Q4465A66241A5515L1624
15014D7139K87539A29322C1642K62552n9961J36834K25463k875C138J06717j5383
15003I4472F767K13156d7136j3923A82966q1226D1156J66241j12J54259O081A57453
14990f980B22715E6340J45486J22451M0151d6010B70419J37418r0375m9806G1159
14978C73583K3452j22755J21924C8695J43145G5693J39764I2453N66l6531M10008
14967D66496k2664j09936G1934K10088N3074h196B80769J7196C6231N46137j13359
14956D69009I0932i0602E15914j85389l2984a54885E58092B17956q5698M16377
$$ y = [240442, 342412, 352220, 150300, -186795, 293794, -6771, 324666, 105503, 135030, 10477, 43703, 520242, 102895, 242352, 247385, 79899, 265626, 534964, 619429, 166241, 15515, 47139, 334678, 129322, 31642, 294194, 234233, 371067, 596530, 593655, 3138, 109855, 94472, 6767, 219923, -47136, -61059, 182966, 101740, 41156, 207397, 207285, 361544, 367625, 157453, -6980, 222715, 56340, 201826, 324277, 364428, -46010, 270419, 407837, 317462, 267656, 71159, 373583, 397035, 274280, 396204, 38695, 181840, 75693, 215457, 92453, 93019, 56488, 466496, 443832, 333896, 71934, 282022, 335096, -8196, 280769, 297965, 36231, 582368, 469009, 90932, -90602, 515914, 330525, 297541, -154885, 558092, 217956, 132258, 548635]
14946E48635k73138f3507C79256A76711K76347m6121A61836J06670G791N0464
14936E8255K88768a17194D31057K8861j97233j06392J21301B4296K52171J9072
14926B95539Q7391J52686k12932l850J04488B01667P615P7293J90070F8041K94645
14915C62686j54178K80793P194A15960K7793l4924J44111N66081I9336J59121
14905B58457J44621a04258B90252K66907m4848J97368k23874j95951j24912J20760
14895B85702J99286O756J79470C28986a0761B79250M4707M79019H7758L08815
14885C96573M3184A62585K77222F3205M03785K37855D0584M03071A81262L20351
14875E01613p0627n046K7035j69809M02286k02620N5520j47352Q1370G3499L39778
$$ y = [548635, 275497, -63507, 379256, 176711, 453058, 406937, 161836, 268506, 7791, 58255, 347023, -117194, 431057, 459918, 262685, 156293, 277594, 24296, 276467, 295539, 382930, 535616, 322684, 318834, 423322, 201667, 209282, 286575, 476645, 68041, 362686, 208508, 489301, 496495, 115960, 143753, 108829, 252940, 819021, 99336, 258457, 403078, -104258, 290252, 557159, 512311, 709679, 485805, 289854, 164942, 285702, 484988, 491744, 671214, 328986, -10761, 279250, 323957, 802976, 87758, 396573, 439757, 162585, 439807, 63205, 466990, 704845, 40584, 443655, 181262, 501613, 430986, 425940, 452975, 283166, 685452, 482832, 538352, 391000, 472370, 73499, 413277]
14864D13277L83117l20330j67517M1884N204j49512M2088K74860k26445L8299
14854C34925Q7443K1186j85812K99963k48766q170J31293J91059J76677p5442
14844G24356L1786k57261J2384J93797q3387m6854o2870j48220J41614j53706
14834C51639J41674m8691p7070P7591N7220J04418j34616J77162m4312J6610L6991
14823F58616j42849Q2458B91750K13848j44723J73163J43027j33331L8976k6329
14813E56381L7765k28942L78134k71143O4913J41522j32460j46888J24299J5476
14803E39057o8909K87218k39992Q1765j50114J69501j636k22521J25994K27163
14793G47526o2415k69623m1283M54186j67884k50788K1243J81350j32734L6129
$$ y = [413277, 796394, 476064, 308547, 350431, 355635, 206123, 248211, 523071, 296626, 334925, 422368, 443554, 257742, 557705, 308939, 300769, 432062, 623121, 799798, 724356, 756142, 498881, 511265, 705062, 621675, 574821, 511951, 363731, 505345, 351639, 493313, 444622, 367552, 445143, 502363, 606781, 472165, 649327, 605015, 621625, 658616, 515767, 598225, 291750, 505598, 360875, 534038, 677065, 543734, 582710, 556381, 594146, 365204, 743338, 472195, 537108, 678630, 546170, 399282, 523581, 539057, 470148, 757366, 517374, 599139, 449025, 618526, 616890, 394369, 520363, 747526, 685111, 415488, 374205, 828391, 660507, 409719, 430962, 612312, 479578, 515707]
14783E15707P3605k67952K73704N03726l00625l72325j40619j39612N35813Q8307
14773G69729l9437n9363r9096j20191J84461L6673j49912J36082J28312l3006
14763G54252A72317O11085o9540R0233k01377O3688j44685J30663j79435j65675
14753C07274M65635O2537j43589P001l43221L73484L9133k41184K27626l58326
14743C96370M61243n8269j46232p5171J33871J50719C62225N22831j26490J06601
14733H65167l96008O68990l43402q1271M12049m54587o8524L33555j26005K7992
14723H37956K6359k1528l3929l55463L66431j977k95869J88886K73773k19360
14713G65279j32489L51370j63613P7787P6609C86992N49698L1026N3760J36795
$$ y = [515707, 589312, 321360, 595064, 1098790, 798165, 425840, 285221, 145609, 681422, 769729, 730292, 670929, 571833, 451642, 636103, 672776, 522864, 658946, 787258, 754252, 172317, 783402, 713862, 804095, 602718, 666406, 521721, 652384, 472949, 307274, 772909, 835446, 691857, 698858, 355637, 729121, 768254, 527070, 754696, 396370, 857613, 799344, 653112, 577941, 711812, 862531, 362225, 885056, 758566, 865167, 469159, 1138149, 794747, 713476, 1125525, 670938, 602414, 935969, 809964, 837956, 864315, 842787, 808858, 453395, 819826, 817849, 521980, 710866, 984639, 765279, 632790, 984160, 820547, 898334, 974943, 386992, 936690, 967716, 1021476, 1158271]
14703A158271m91721J26614l7742K05217r2410j6980o3696J72280m2308j4875
14693I02650k07212J40419l611J22011q2414j56402J52682n8951L46263j17303
14683A038132L34929l25589K32451m83801N60190l75465K90089k4696k27834r7575
14673I20831J63951J25899k17860M03445n64541M63564l31244r218o427J53226
14663A101626K80867l92547O4666N4181j9171K35453K9757j16373j96129J2264
14653A054594L26321J46045o05446J61800K47810j57316M23364l89732n1461M14140
14643A570119l98361J77628l97215K34813M0682Q0514j87079M64753j69656k73195
14633A143003j87523M16795L23993o16771K77572k10638J06987j03404K96954
$$ y = [1158271, 666550, 793164, 755422, 960639, 868229, 851249, 787553, 959833, 917525, 902650, 695438, 835857, 832246, 954257, 871843, 715441, 868123, 809172, 1155435, 1038132, 1373061, 1047472, 1279923, 796122, 1356312, 980847, 1270936, 1246240, 1018406, 920831, 1084782, 1210681, 992821, 1396266, 831725, 1295289, 964045, 954827, 948400, 1101626, 1382493, 989946, 1054612, 1108793, 1089622, 1325075, 1354832, 1238459, 1042330, 1054594, 1380915, 1526960, 921514, 1083314, 1331124, 1173808, 1597172, 1207440, 1155979, 1570119, 1171758, 1349386, 952171, 1186984, 1227666, 1308180, 1121101, 1585854, 1416198, 1143003, 955480, 1372275, 1696268, 1079497, 1357069, 1146431, 1253418, 1150014, 1446968]
14624A446968K7965J11738j27980k7160q9322n9267M58362j9574k39732l7817
14614A444181J15587j79781N8669l8135J77078k3927n6448J4763J79960o0917
14604A631030J78887J16977l20021K10085l20055l8673K97238j89857J07490K31092
14594A904193j31860o444L20147l01247j24469Q5509K73095j44576J34669J43170
14584B152187J98624o07506N24396J398m05854l7048j3718M04697j07148P7817
14574B187845j33058K05416M0603K941J08023l39312M50817l5654j48658K0578
14564B359541J54578q7397J21437o0866J53704L7097L08722L40744k00977O55409
14554C781992j77250L45602M83699O85667J069164K093517M261838J0109674J7845765
$$ y = [1446968, 1474933, 1586671, 1458691, 1431531, 1342209, 1282942, 1741304, 1721730, 1481998, 1444181, 1559768, 1379987, 1438656, 1400521, 1577599, 1553672, 1497224, 1511987, 1691947, 1631030, 1809917, 1926894, 1606873, 1816958, 1496903, 1458230, 1755468, 1565611, 1673101, 1904193, 1772333, 1765889, 2086036, 1784789, 1660320, 1745829, 2018924, 1874348, 2009017, 2152187, 2350811, 1743305, 2267701, 2269099, 1863245, 1826197, 1812479, 2217176, 2110028, 2187845, 2054787, 2260203, 2300806, 2303747, 2411770, 2072458, 2523275, 2487621, 2338963, 2359541, 2514119, 2426722, 2548159, 2487293, 2640997, 2678094, 2986816, 3327560, 3126583, 3781992, 3604742, 3950344, 4434043, 5119710, 6188874, 8282391, 12544229, 22653903, 40499668]
14545D0499668M375129B0558765H435165D197171j161779m32230l64568j09391
14537B129203K37786m46198m4359K39352J18141M6938j72055K23222L31021k93698
14527B369353q1600J10604p6851K78765p6684l3819J66611q5785M07099n36399
14517B441294M43926j13620n4448j40415J57629J63594m3676m2294J20556P4835
14507C007381N7134l0877K05742j24665J97810o9051j16373J12501K62364k00425
14497C301541m1658J06989k06191L18599l18505J71056J68580L45660m10047K33547
14487C669571l44211O65124l64170j09348K92453P6762J0307K06744k17273K65129
14477D151088j32822r4926L61973j80543K48491M9596j4451l12662M70403o9332
$$ y = [40499668, 44874797, 20558765, 8435165, 4197171, 3035392, 2603162, 2238594, 2129203, 2366989, 1920791, 1876432, 2115784, 2233925, 2280863, 2108808, 2332030, 2663051, 2369353, 2287753, 2398357, 2321506, 2600271, 2523587, 2489768, 2656379, 2570594, 2977693, 2441294, 2885220, 2771600, 2717152, 2576737, 2734366, 2897960, 2854284, 2811990, 2932546, 3007381, 3064515, 3033638, 3239380, 3114715, 3312525, 3243474, 3127101, 3239602, 3501966, 3301541, 3259883, 3366872, 3160681, 3479280, 3160775, 3331831, 3500411, 3846071, 3436024, 3669571, 3325360, 3990484, 3626314, 3516966, 3809419, 3886181, 3896488, 4103232, 3885959, 4151088, 4018266, 3923340, 4285313, 4104770, 4353261, 4402857, 4388406, 4075744, 4546147, 4476815]
14467D476815L9135O7662j2484k6715N0927O62710n96638O30169k54083K75015
14457E312513k95233P0677K65913n22963N93295J90009j17204j53634K92317N3098
14447E688788l958o0967N33876k33114J04349J10949J6700j58481O42625n12997
14437F127770K33088K23135K37470k92624K82305L36228L346J392m9602J26922
14427G229430J61584l18854Q54105l45050K44827j29535L76764l56066P99443
14418H516648M1110n28940N03018Q4066N5875k5581L54738n2839K65747R0471
14408I304313k0036L197O95165K74510j04618K20574J89221j27103M80840r7680
14398A0818383L44410K33154J93927Q0117K8419O68970k80629K16774N57861j22129
$$ y = [4476815, 4515950, 4583612, 4571128, 4544413, 4595340, 5258050, 4661412, 5291581, 5037498, 5312513, 5017280, 5087957, 5353870, 4830907, 5424202, 5614211, 5497007, 5343373, 5635690, 5688788, 5684830, 5623863, 6157739, 5924625, 6028974, 6139923, 6156623, 5998142, 6640767, 6127770, 6360858, 6583993, 6821463, 6528839, 6811144, 7147372, 7150718, 7152110, 7102508, 7229430, 7391014, 7072160, 7926265, 7581215, 7826042, 7696507, 8073271, 7717205, 8516648, 8557758, 8028818, 8531836, 8615902, 8671777, 8646196, 9000934, 8948095, 9213842, 9304313, 9284277, 9287474, 9982639, 10257149, 10152531, 10373105, 10562326, 10435223, 10916063, 10818383, 11162793, 11395947, 11589874, 11669991, 11698410, 12367380, 12086751, 12303525, 12861386, 12739257]
14388A2739257M97488O0826K77211N0609O61214j16824J51358K37376N63591M83306
14378A5605412K19439L6737K91104J89879R18599j81253M13879Q5160L50159P48945
14368A8678060Q0459O50062L75346L28286M70296M86687J42351Q45845L76777
14359B2434169O27868N24438N74447M95850P62075J73068P49679N58997N50289
14350B7450880Q72907O03019J200877N28407N59267P90729Q93563O96412J230566
14341C4826627O73117J002202J212058J135463Q34601J474485J040718J535402
14333D3734673J008151J362259J641826J435757J565435J584469J676102J347986
14325E5356658K213586K070337K184543J929475K254415K059823K971594K600089
$$ y = [12739257, 13236745, 13297571, 13574782, 13625391, 14286605, 14169781, 14321139, 14558515, 15122106, 15605412, 15824851, 15861588, 16152692, 16342571, 17261170, 17079917, 17493796, 17578956, 17929115, 18678060, 18758519, 19408581, 19783927, 20112213, 20582509, 21069196, 21211547, 22057392, 22434169, 23062037, 23586475, 24160922, 24656772, 25418847, 25591915, 26341594, 26900591, 27450880, 28323787, 28926806, 30127683, 30656090, 31215357, 32006086, 32899649, 33596061, 34826627, 35499744, 36501946, 37714004, 38849467, 39684068, 41158553, 42199271, 43734673, 44742824, 46105083, 47746909, 49182666, 50748101, 52332570, 54008672, 55356658, 57570244, 59640581, 61825124, 63754599, 66009014, 68068837, 71040431, 73640520]
14317G3640520K765190K672671L055550L154392L158527L584739L758501L691389
14309I9481479M574448M460292M274101M983452N191725N747767O019009N953968
14301A40686241O639517P067488O999261Q264638Q145926Q683834R031035R794441
14293B05312381J0532584J0789598J1645226J1930569J2285167J2975051J3749313
14286B89219889J4265166J4551881J4692986J5167124J4933174J4869281J4697277
14279C92396778J3719782J3124025J1690081J0110505R081337P075205M991909
14272D62189622J807396k277812j202518j563933m436435n306960p637250j0228587
14264D31343523j1323486j2925760j4357945j5200051j5419477j5663506j5315286
$$ y = [73640520, 76405710, 79078381, 82133931, 85288323, 88446850, 92031589, 95790090, 99481479, 104055927, 108516219, 112790320, 117773772, 122965497, 128713264, 134732273, 140686241, 147325758, 154393246, 161392507, 169657145, 177803071, 186486905, 195517940, 205312381, 215844965, 226634563, 238279789, 250210358, 262495525, 275470576, 289219889, 303485055, 318036936, 332729922, 347897046, 362830220, 377699501, 392396778, 406116560, 419240585, 430930666, 441041171, 450122508, 457197713, 462189622, 463997018, 461719206, 460516688, 458952755, 454516320, 449209360, 441572110, 431343523, 420020037, 407094277, 392736332, 377536281, 362116804, 346453298, 331138012]
14257C31138012j5669430j4919537j4055901j3504108j3632977j2956984j2329221
14250B34069854j1529262j1061522j0455006r965612r205583q779771p550668
14243A65522430q139226p516116o869179o760042o035112n107998n525013n126310
14235A14443434n067617m811784m678464l509113l388851l762295l783657l235268
14227H2206385l095572l193447k779104k568297k871629k088510k211795k105144
14219F1292887k022145k298630j561404j629523j526625j620971j557020j573767
14211D7502802j530348j337959j475587r21608p11844j372879j206557j213548
14203C7732472p04926j123746q19701p28245j212664n91797r39296r91959n23467
$$ y = [331138012, 315468582, 300549045, 286493144, 272989036, 259356059, 246399075, 234069854, 222540592, 211479070, 201024064, 191058452, 181852869, 173073098, 165522430, 157383204, 149867088, 142997909, 136237867, 130202755, 125094757, 119569744, 114443434, 109375817, 104564033, 99885569, 96376456, 92987605, 89225310, 85441653, 82206385, 79110813, 75917366, 73138262, 70569965, 67698336, 65609826, 63398031, 61292887, 59270742, 56972112, 55410708, 53781185, 52254560, 50633589, 49076569, 47502802, 45972454, 44634495, 43158908, 42237300, 41525456, 40152577, 38946020, 37732472, 37027546, 35903800, 35084099, 34355854, 33143190, 32551393, 31612097, 30620138, 30096671]
14194C0096671r70962n00825q71654n31033o24665p35835p46603l58026m97452
14185B4259616p59752r3116r19295m06428o33534m69673k64916o29043J26097
14176B0209956q43482l69361o11529k28486m06481k78698k35776j32806n18794
14167A6584543j45687o45405j03119n72033k3818k18111n49495M5972j21728j39131
14157A4111988q08602J34720k98692k67124l60910j23894q0788j27119l34790
14148A1844789q7125j66757j62665l23482l92814K02359m06640j38812m6520o6111
14138A0256222m29200P5254k02840N0655k23899p4995k66868l64489L8211N6953
14128H915004K0025m99227j24377J94685k61469m79778M74934l83656N6738j40172
$$ y = [30096671, 29125709, 28624884, 27753230, 27222197, 26597532, 25861697, 25115094, 24757068, 24259616, 23499864, 23406748, 22487453, 22081025, 21447491, 20977818, 20712902, 20083859, 20209956, 19366474, 18997113, 18385584, 18157098, 17750617, 17471919, 17236143, 17103337, 16584543, 16438856, 15793451, 15690332, 15118299, 15094481, 14876370, 14326875, 14372847, 14251119, 14111988, 13303386, 13438106, 13139414, 12872290, 12511380, 12387486, 12306698, 12179579, 11844789, 11757664, 11590907, 11428242, 11104760, 10711946, 10914305, 10507665, 10368853, 10322333, 10256222, 9827022, 9902276, 9699436, 9750091, 9526192, 9451197, 9184329, 8819840, 8858051, 8915004, 8935029, 8435802, 8311425, 8506110, 8244641, 7764863, 8239797, 7856141, 7912879, 7772707]
14118G772707j52913j80767k95981K65192l02511j25946M2453j78434J28240k66894
14108F705146k88060P3428J47827k89678J09112Q4327j53264k16153K42513m97643
14098E917555j63041J75837j79267l69075M35996l77195L65277n55932O3306j74246
14088E139215l2173K44571j66508k04856o188K07291m12900J73548J60382n04885
14078D597497K18218k17078Q9500J62589l02542L6155J06157o40453M06121m5366
14068D410798j01320l8698P0381k04788r8716J52968m38374K17814j54206J47134
14058C962993k39037j556K97565K1141j67947k08879M36552o11674K18662Q6422
14048C794242m20414N3216J89817j26549k03165N2180j80531p2459Q3576J2681
$$ y = [7772707, 7619794, 7439027, 7143046, 7408238, 7105727, 6979781, 7022234, 6843800, 6972040, 6705146, 6417086, 6490514, 6638341, 6348663, 6457775, 6542102, 6388838, 6172685, 6415198, 5917555, 5754514, 5930351, 5751084, 5382009, 5818005, 5440810, 5806087, 5250155, 5313461, 5139215, 5107042, 5351613, 5185105, 4980249, 4974061, 5181352, 4768452, 4942000, 5102382, 4597497, 4815715, 4598637, 4688137, 4850726, 4548184, 4584339, 4690496, 4050043, 4456164, 4410798, 4309478, 4270780, 4341161, 4136373, 4037657, 4190625, 3752251, 3970065, 3815859, 3962993, 3723956, 3722400, 4019965, 4041106, 3873159, 3664280, 4100832, 3489158, 3707820, 3794242, 3373828, 3427044, 3616861, 3490312, 3287147, 3339327, 3158796, 3086337, 3169913, 3182594]
14038C182594q0033L01156l12842J60321j04643l5914j07268N5497j49822l8403
14028B870643M06400m82968K09510k92830J79816k14870j80757N8038N08644o33575
14018B428051K4979J97526J01075m55426M82883Q1195m08598J04214k09869J87290
14008B533320m94603K40099J15711k57831P3994L14020l52736J26799j78658J1593
13998B131708J40820j82937p7282K71983k11876j31889O77060J53200M78538R76846
13988D226171K656464Q338186J7539830J3071993k1199076j2195792m639908k012307
13980E785561j047279o42626p63352p037j37450m88107J39698N1127k75310r2916
13970B522309K24832M3137n90424L99759k83897J98822j09257k45634J50757k50928
$$ y = [3182594, 3102561, 3403717, 3090875, 3251196, 3146553, 3110639, 3003371, 3058868, 2909046, 2870643, 3277043, 2794075, 3003585, 2710755, 2890571, 2675701, 2494944, 2552982, 3061626, 2428051, 2453030, 2650556, 2751631, 2296205, 2779088, 2860283, 2451685, 2555899, 2346030, 2533320, 2038717, 2278816, 2394527, 2136696, 2210690, 2524710, 2171974, 2298773, 2120115, 2131708, 2272528, 2089591, 2012309, 2284292, 2072416, 1940527, 2617587, 2770787, 3249325, 4226171, 6882635, 15220821, 32760651, 45832644, 24633568, 12437776, 7797868, 5785561, 4738282, 4095656, 3332304, 3325267, 3187817, 2699710, 2839408, 2890535, 2615225, 2522309, 2747141, 2790278, 2199854, 2599613, 2315716, 2514538, 2405281, 2159647, 2310404, 2059476]
13960B059476J28016k61796r500K51360m89504N10809m67396M16722m40234J04323
13950A802276K53901m9374k30623M2282p8644K39415k68143Q6974J18329k42881
13940A673512L9963j70906O5538k58555K32186K49393l25660L68100l64356M38684
13930A947899k32607k4239K42905m06173L0842m8923q7906J18356K93570n41788
13920A291936R582L227J57941K99230j0223n33177J8681r0429N22950R146k88415
13909A390449r3748M8428o2402J26621n1126n9998k6002p9782M24804m67777J33278
13898A282745Q0818K1179k17599L0010p5507J41847K09827o78314N85778l47946
13888A032838J38945K83945m47193N22765l77774N7780J59274l57103J82027L19575
$$ y = [2059476, 2187492, 1925696, 1916196, 2167556, 1678052, 2188861, 1721465, 2138187, 1697953, 1802276, 2056177, 2006803, 1776180, 1818462, 1739818, 1979233, 1711090, 1798064, 1916393, 1673512, 1713475, 1542569, 1608107, 1349552, 1581738, 1831131, 1505471, 1873571, 1509215, 1947899, 1715292, 1691053, 1933958, 1527785, 1558627, 1509704, 1421798, 1540154, 1833724, 1291936, 1301518, 1304745, 1462686, 1761916, 1751693, 1218516, 1237197, 1146768, 1669718, 1678864, 1390449, 1296701, 1345129, 1282727, 1409348, 1358222, 1298224, 1272222, 1192440, 1617244, 1149467, 1282745, 1363563, 1384742, 1167143, 1197153, 1121646, 1263493, 1473320, 795006, 1380784, 1032838, 1171783, 1455728, 1008535, 1531300, 1153526, 1211306, 1370580, 1013477, 1195504, 1515079]
13878A515079k41042M4173j48390j24375P8371j98200M24659j28747j55059K25774
13868A292243l1734m63112K20000J51689R3348k71349k03906L89417P0504n00265
13858G46835O03452j88985k03917M77510j86359j99243P2776k9827o6353L30802
13848A356691k80923M547k77528K58915j08016N1707q0469J52058j06997J8872
13838I88857J6019k08026L50327j20376m6336j69596k68045M07395J65606n8900
13828A056925r1777R6035k80164L24197q806J9683r1857k7486p2406J49444n33677
13817E40111L30358n3311J0858k9427R9443l89037M67366j77759j50789M06361
13807A054174k60990j6350J00377j87070K92831k46343K64771m53414L58434q5956
$$ y = [1515079, 1274037, 1318210, 1169820, 1045445, 1123816, 925616, 1350275, 1221528, 1066469, 1292243, 1260509, 797397, 1017397, 1169086, 1262434, 991085, 787179, 1176596, 1247100, 746835, 1350287, 1161302, 957385, 1434895, 1248536, 1049293, 1122069, 1092242, 1025889, 1356691, 1075768, 1080315, 802787, 1061702, 953686, 1005393, 924924, 1076982, 969985, 988857, 1004876, 796850, 1147177, 1026801, 980465, 810869, 542824, 950219, 1115825, 1056925, 965148, 1061183, 781019, 1105216, 1096410, 1116093, 1024236, 996750, 924344, 1073788, 540111, 870469, 817158, 828016, 798589, 898032, 508995, 976361, 798602, 647813, 1054174, 793184, 776834, 877211, 690141, 982972, 736629, 1001400, 547986, 906420, 820464]
13797H20464j47597j92l7755M11316j49399k10838o0470L71300j31054l17193
13787E48582J08803L2994l2158J13507K62556m00528C11973M74635k60430L38820
13777H64998J15755k46374n3167R2245j11957M84725j69330j67211j63380K14407
13767H60711j02479k76047K32306N6367j61277o1818P4542M05244m28110k28239
13757C71200K94462j84340K32878Q4016L9239r1041k28060M75188l09238Q5675
13747G69979l51601L75553j30976j93189K7184J40715j68838N4357K75875l45182
13737D53877l6294O7343r0305L39490k32053J97973k14040K94403Q443l57169
13727D31668K97996j84819k38455O1237M85131j45133l25444L29703k21302k2525
$$ y = [820464, 672867, 672675, 634920, 1046236, 896837, 685999, 625529, 996829, 865775, 548582, 657385, 690379, 658221, 771728, 1034284, 633756, 311973, 786608, 526178, 864998, 980753, 734379, 681212, 773457, 661500, 1146225, 976895, 809684, 646304, 860711, 758232, 482185, 714491, 770858, 609581, 547763, 622305, 1027549, 599439, 371200, 665662, 481322, 714200, 798216, 837455, 746414, 518354, 993542, 684304, 769979, 418378, 793931, 662955, 469766, 496950, 637665, 468827, 523184, 799059, 453877, 417583, 484926, 394621, 734111, 502058, 700031, 485991, 780394, 788837, 431668, 729664, 544845, 306390, 367627, 852758, 707625, 382181, 711884, 490582, 468057]
13717D68057R0820n4869L0223n7524N9344B23697L5187K26036j25980K80119m8428
13706E90631n3279k38468K76643j96144p0065K84921A43298L15485l8848J92215
13696F12150q0121L63016l29905J20698k49618P9145p3954K16372k72595M2249
13686D27437P8313n822J01620K5550j01762o3488m649P2765B18043J93456L42121
13675G53620k52197o2610I6249L35298j44760J99156L02518l61149A43317L70722
13665E14039j2858K32482j38336J77998B75504r284K50508j91384q1038M7561
13655B91867K60709M2423A82574M22317J1870J47186k45683J96484j47529k51562
13645C15657K96672A78745C4181K02408J88038K94867B62041N92648l22213q5980
$$ y = [468057, 558877, 504008, 534231, 476707, 536051, 223697, 258884, 484920, 358940, 639059, 590631, 537352, 298884, 575527, 379383, 309318, 594239, 143298, 458783, 419935, 612150, 532029, 895045, 565140, 685838, 436220, 515365, 441411, 657783, 385188, 427437, 505750, 499928, 601548, 627098, 525336, 461848, 457199, 529964, 218043, 411499, 753620, 501423, 438813, 96249, 431547, 286787, 485943, 788461, 427312, 143317, 514039, 501181, 733663, 595327, 773325, 275504, 266220, 516728, 325344, 244306, 291867, 552576, 594999, 182574, 604891, 616761, 763947, 518264, 714748, 567219, 315657, 612329, 178745, 34181, 236589, 424627, 719494, 262041, 854689, 532476, 446496]
13635D46496J68365j95905J03803B30462J44758K26616j45084R2081j13709P8492
13625E13616I562N97314j42782M3945l105B10105q2278M94299C10453J28759j06066
13614C33146J14805P6641A81857K02956J48292d81D28959O0780B07151n3245M19648
13603E73554n6474j99834J67079k18400j6259o4597J03799K88986k62474j00883
13593B14497J12933K2053j29483Q3007J08345J4937r4501J4338L9003A56279N3951
13582B10230K08265j04954N5921L4852L29490B06498m8865J19513J98805j47103
13572C28848r5010J58167j28849K21801m3552A4294N06036R0912B94630A30540
13561C79451n6599J10677R9309A65742o4891M5149K47907Q1944k30218J36764
$$ y = [446496, 614861, 418956, 522759, 230462, 375220, 601836, 456752, 548833, 435124, 513616, 9562, 606876, 464094, 508039, 504934, 210105, 127827, 622126, 310453, 439212, 333146, 447951, 524592, 181857, 384813, 533105, -481, 428959, 489739, 207151, 153906, 573554, 517080, 317246, 484325, 265925, 249666, 185069, 288868, 577854, 315380, 214497, 327430, 349483, 220000, 303007, 411352, 426289, 331788, 346126, 385129, 156279, 210230, 418495, 313541, 369462, 404314, 733804, 206498, 157633, 277146, 475951, 328848, 233838, 392005, 263156, 484957, 441405, 14294, 520330, 611242, 294630, 130540, 379451, 322852, 433529, 532838, 165742, 100851, 146000, 393907, 475851, 245633, 382397]
13551C82397A83148N9265J18881J51131E4835J15656K25446j39322L29777j44858
13541D41534k6464j92262O9402H7560j1814a1210E7628L60327A89398J11939K3920
13530C25257C9962J36850J72882m253A42180P2219q7403K03744N5509p0804A30640
13518B49183H3695L03298l6900A43301J37889J93292j61899A18379K18745j14579
13508B22545H2434J85889G3909J10443L19029a44693I8070L29799Q6827k56050
13498B58646m9567r3561m7912K59772G9804K78170K29863k31647R611q3827E9372
13486D96162p1089P5496k30225J07327j02757e3956A84080l2695C5728J95176
13476B30904A3359L77779j25232L721q4401J9648L5749L00651B66129J42412j71117
$$ y = [382397, 183148, 242413, 361294, 512425, 54835, 170491, 395937, 256615, 586392, 441534, 415070, 222808, 292210, 87560, 75746, -11210, 57628, 417955, 189398, 301337, 325257, 39962, 176812, 349694, 345441, 142180, 214399, 126996, 330740, 386249, 315445, 130640, 249183, 83695, 386993, 350093, 143301, 281190, 474482, 312583, 118379, 337124, 222545, 82434, 268323, 73909, 184352, 503381, -144693, 98070, 427869, 514696, 258646, 209079, 115518, 67606, 327378, 79804, 357974, 587837, 356190, 365801, 281974, 59372, 496162, 425073, 500569, 270344, 377671, 274914, -53956, 184080, 151385, 35728, 230904, 13359, 391138, 265906, 269627, 185226, 204874, 240623, 541274, 266129, 408541, 237424]
13465B37424J32702j36446l3221K58176j19302j34081o7559K04057J24295a07079
13454H4227J75447E3613M12743o6407A02663M32970A04760A3094J44802J9904
13444A77800H8183R9944d7189C27915a1533n8786C07237m0984f8943B53012H5209
13432E50154A60274R1865i4682A32488E2938P3170J7931d0092D23318A23695o386
13421A17309L38629j42690G5636c6489E6033J02562K65060J72158A59027L09804
13411D68831G8518K99347n5952J9316j08926J75293A95031J62049j22232J07188
13401C42036d506D53618A54456J90622o3522n2878l6039E3826K50520j23886a789
13389A40437J88879j1101j49078O3367K07687k18806B7627L53182r0844b07207
$$ y = [237424, 370126, 233680, 200459, 458635, 339333, 205252, 137693, 341750, 466045, -107079, 84227, 259674, 53613, 466356, 399949, 102663, 535633, 104760, 13094, 157896, 177800, 88183, 188127, -47189, 327915, -11533, -70319, 307237, 266253, -68943, 253012, 85209, 550154, 160274, 252139, -94682, 132488, 52938, 126108, 144039, -40092, 423318, 123695, 117309, 455938, 313248, 75636, -36489, 56033, 158595, 423655, 595813, 159027, 468831, 78518, 377865, 321913, 341229, 232303, 407596, 195031, 357080, 234848, 342036, -4506, 453618, 154456, 345078, 281556, 228678, 192639, 53826, 304346, 180460, -1789, 140437, 329316, 318215, 169137, 232504, 440191, 221385, 27627, 380809, 289965, -207207]
13378d7643D6483N6008k401K5587A3738Q4933M28414c0637C45680A42467K57458
13367C99925A52091L68567k30917J65537j63063p142A33596K39209o4006j1700
13357B97099m3250J88021j55897K10565A24876J21781j05714K25402j04825K08618
13347D70138a0669j05086p7721E15793Q0697k92849j21589p8308g3441A44180
13336D57411A43975J93068k6636q7891J02048j55044k4702R1975B6431K749K9845
13325E9025j2403J00710r084p051M8254J77813p4723c877B39998r0397L14261
13314D63862j89476a48449B31459j2205h7347C30734j10622G2302K21656H8552
13303A26727J10943h113A64325J27063i6256C854L11247A09611P1280E7214Q5733
$$ y = [-47643, 46483, 102491, 100090, 125677, 13738, 98671, 527085, -30637, 345680, 142467, 399925, 152091, 520658, 289741, 455278, 292215, 285073, 133596, 372805, 308799, 297099, 253849, 441870, 285973, 496538, 124876, 246657, 140943, 366345, 261520, 470138, -10669, -115755, -193476, 515793, 596490, 303641, 182052, 103744, -73441, 144180, 457411, 143975, 337043, 310407, 222516, 324564, 169520, 144818, 236793, 26431, 29180, 59025, 46622, 147332, 138248, 131197, 179451, 357264, 282541, -3877, 239998, 149601, 463862, 274386, -148449, 231459, 219254, -87347, 330734, 220112, 72302, 293958, 88552, 126727, 237670, -8113, 164325, 291388, -96256, 3854, 315101, 109611, 180891, 57214, 142947]
13292A42947K51615A02918M8468j6320R4849J15969I7739M9367a65986a5042C68024
13280I8270J12680q428a1230A41076K68897P1196k33544Q3060G0583h3609E43942
13268a4757n440A04371K82335A32879J52908J05831d8606A57102K02100a16712
13257a23668I3347a39633A35820J0164f6795F44043H6702a99553P1953K4102C77062
13245C32446H2233J4519K21703H5404Q2465b91970h7170l650b1375B16191I1915
13233A79927n0874a93002A54169L2357a56500j01895F3273J42390I6463j3015
13223H3448h4958B83965F3969d2815j46869d053A18637J70866A20212J13255J42825
13212C76292A87706J09582I8107e0960A0020M47480j92645M0412q9436a66823
$$ y = [142947, 394562, 102918, 151386, 135066, 229915, 345884, 97739, 147106, -165986, -15042, 368024, 98270, 210950, 202522, -11230, 141076, 409973, 481169, 247625, 330685, 70583, -83609, 543942, -14757, -20197, 104371, 386706, 132879, 285787, 391618, -48606, 157102, 359202, -116712, -123668, 93347, -139633, 135820, 145984, -66795, 644043, 86702, -199553, -127600, -103498, 377062, 332446, 82233, 96752, 318455, 85404, 167869, -291970, -87170, -90820, -21375, 216191, 91915, 179927, 129053, -193002, 154169, 186526, -156500, -258395, 63273, 205663, 96463, 83448, -84958, 283965, 63969, -42815, -189684, -4053, 118637, 289503, 120212, 233467, 376292, 187706, 297288, 98107, -50960, 10020, 457500, 264855, 305267, 215831, -166823]
13201F0252L67604b970l15606D27909D7687J51322J80311H4531j1691J00559K1979
13190A95378f2122p0252A09265N6639G6284J26804r3870a88650B41557a14449
13179A84760d683D7569J72882A09304r04b9944G5918O5525a78153n5472G6512
13167A67305L276e6836o7477d5735C40319A53887j3624J5936a47952B7637i1435
13155B3668K03817f9221A43368a59857A69001o8574m1148d1021A46694P7235b0231
13143f2090B2062J41031F0788a25992B73462a10928b6454G4294c9925L601j38767
13132a75091B94005b76874A86271n1917K3773c2795D8763h6896k5695b6834C26751
13120a58699g3010q0800A32789m0016g386j03328A30145N979N5038h8262C60921
$$ y = [60252, 427856, -2970, -318576, 427909, 47687, 199009, 379320, 84531, 72840, 173399, 195378, -62122, -132374, 109265, 165904, 76284, 203088, 109218, -188650, 241557, -114449, 184760, -4683, 47569, 220451, 109304, 108400, -29944, 75918, 141443, -178153, -233625, 76512, 167305, 170581, -56836, -124313, -45735, 340319, 153887, 140263, 156199, -147952, 27637, -91435, 23668, 227485, -69221, 143368, -159857, 169001, 100427, 59279, -41021, 146694, 223929, -20231, -62090, 22062, 163093, 60788, -125992, 273462, -110928, -26454, 74294, -39925, -36324, -175091, 294005, -276874, 186271, 134354, 158127, -32795, 48763, -86896, -112591, -26834, 326751, -158699, -73010, -153810, 132789, 92773, -7386, -110714, 130145, 136124, 191162, -88262, 360921]
13108B4310M81058B5883O454c4501A71143J4873j3050k8853a92154B12440K6075
13097B38515a08480A55850E2055B3077K9710c6387C04913p4286i7205B21677N0447
13086B72124J1916d00A81205J3030K9679a8115A16694l8129Q2124a27998B644
13074b67180A02027D5288a08138b1787o7027B16111J89662j36220Q0064J1355
13064C60972j24980l8421b0179I9051b60809A01417b63798H5752E083O7278J16011
13053A88372K39936D7663a46022A17184J3240c01908A69665F2443L63274b76189
13042A43787m1502a74825B30536B8149f6887C73534j42268O5196a835l23561B91548
13030b13425A47245E6010J7793L12009q0584g0015K7500C2067i9878l041B90439
$$ y = [24310, 505368, 25883, 32337, -34501, 171143, 186016, 172966, 144113, -192154, 212440, 238515, -108480, 155850, 52055, 23077, 52787, -36387, 304913, 230627, -97205, 221677, 272124, 284040, -400, 181205, 194235, 223914, -18115, 116694, 78565, 160689, -127998, 2644, -267180, 102027, 45288, -108138, -21787, -88814, 216111, 405773, 269553, 349617, 360972, 235992, 197571, -20179, 99051, -260809, 101417, -263798, 85752, 5083, 72361, 188372, 428308, 47663, -146022, 117184, 130424, -301908, 169665, 62443, 425717, -276189, 143787, 102285, -174825, 230536, 28149, -66887, 373534, 231266, 296462, -1835, -325396, 291548, -213425, 147245, 56010, 73803, 385812, 305228, -70015, -42515, 32067, -99878, -102919, 290439]
13018I684J03533O9810a05282B16031G117e9816D20301A04513i6270J4560B34853
13006B93354j06226P5314O7396I2165f4606J5174B20331J57419D8995J70988b51539
12994C7279J9668L67932A24776g1120K3761k06595C17098o1386J45740b29170
12983b68644Q1886B1687J75432A8017d3537i939A00985M7711n986a6441F563J76204
12971A82767l0243k991J07885j19008J01125a49392G4202O9551J02754L2682a3084
12959a00430B07368C9803J53777A2790h9591C17048b45772F3784K00152j18970
12949A44966J46043j20690a45993A13337O2700D3007K3553d6250a1745A40987
12938b1182A35209d9835C31280j04914e1985C04905m2129I6384M4207C9675a40924
$$ y = [9684, 113217, 183027, -105282, 216031, 7117, -59816, 420301, 104513, -96270, -81710, 234853, 293354, 187128, 262442, 329838, 92165, -64606, -49432, 220331, 377750, 48995, 219983, -251539, 37279, 56947, 424879, 124776, -71120, -47359, -253954, 317098, 255712, 401452, -229170, -268644, -186758, 21687, 197119, 18017, -43537, -9939, 100985, 148696, 142710, -16441, 6563, 182767, 152524, 149533, 257418, 138410, 239535, -149392, 74202, 143753, 246507, 279189, -13084, -100430, 207368, 39803, 193580, 12790, -89591, 317048, -245772, 63784, 263936, 144966, 291009, 170319, -145993, 113337, 176037, 43007, 66560, -46250, -11745, 140987, -21182, 135209, -49835, 331280, 226366, -51985, 304905, 262776, 96384, 140591, 39675, -140924]
12926f9283a1380E5638L7074m3296b04981Q4355E4030J05640c70927A3894J12298
12915A26192h2430k56600h6597I4450d36398E3384L55881C3885M6205j118J90402
12904B69374c4447B38466A17785M3273D0269a9672N198k04432d6439A14297D7673
12892A44304o4724J34388a5457p2662B31860m7152Q0290b77448p5163G6242a85554
12880A20627J17021b04322A21620Q7425a33702B33719c49462J48398d7295A88099
12869G5532g0356A98022e5635B2668c01949B02895b192G3933a19044B8722L97658
12858D26380k04286a0208k47054B25346b56145p7737J51473r8464Q4623a1258
12847a35764A48696e9p1369K2322G2681J3924J14088E0499P6664j3280e887n5608
$$ y = [-69283, -11380, 55638, 92712, 49416, -204981, -120626, 54030, 159670, -370927, 13894, 126192, -82430, -339030, -86597, 94450, -436398, 53384, 409265, 33885, 80090, 78972, 269374, -34447, 238466, 117785, 161058, 40269, -19672, -14474, -218906, -46439, 114297, 47673, 144304, 79580, 213968, -15457, -88119, 231860, 184708, 264998, -277448, -352611, 76242, -185554, 120627, 237648, -204322, 121620, 209045, -133702, 233719, -349462, -201064, -47295, 188099, 75532, -70356, 198022, -55635, 22668, -301949, 202895, -2192, 73933, -119044, 28722, 426380, 222094, -10208, -257262, 225346, -256145, -333882, -182409, -280873, -196250, -11258, -135764, 148696, -59, -71428, -49106, 72681, 86605, 200693, 50499, 127163, 113883, -5887, -61495]
12835f1495A84891f7114G7250a12182R967l3172F1696J05076a488j9931J0122
12824a1297k11663J08955j9423A33662b70995E0877b52112B52299A04001a01967
12813b31120A10885a22768A8388K20841E2756a48213f1070D2557b64858A01682
12802a20544b4529o2039C68810a7929C08298e0745k03729a9257A9168P7956D6776
12790f2172A00295C9826b26965A3803a91683B37359M0070j15405e5782p9209A00780
12778C8213L4901K9282O0726C2636K43982j4760d6528A52958B272J23816a97428
12766a63659C59446E872J25687b73659B38815J0007E8773J49196H1114c25367
12755e3410A16200e5237A19765J59208c1505G839J27441l2953g6727q8719j42693
$$ y = [-61495, 184891, -67114, 77250, -112182, -102215, -135387, 61696, 166772, -1488, -21419, -11297, -222960, -114005, -133428, 133662, -270995, 50877, -252112, 252299, 104001, -101967, -231120, 110885, -122768, 18388, 239229, 52756, -148213, -61070, 42557, -264858, 101682, -120544, -24529, -86568, 368810, -17929, 308298, -50745, -254474, -19257, 19168, 97124, 46776, -62172, 100295, 39826, -226965, 13803, -191683, 237359, 277429, 162024, -55782, -134991, 100780, 38213, 73114, 102396, 163122, 32636, 276618, 261858, -46528, 152958, 2272, 126088, -197428, -163659, 359446, 5872, 131559, -273659, 238815, 248822, 58773, 207969, 81114, -325367, -53410, 116200, -55237, 119765, 278973, -31505, 7839, 135280, 102327, -76727, -165446, -308139]
12744c08139f7955B01015A9938a3630j85229F8954b04882J691e6326j94345D41655
12732A65067D6979J84595L2333A13983b3751B39465o0694m2547e7067j3952j18129
12721a89148l3311A18303c6042b912j85950d5177j89537F9176a31236B35791d7312
12709h8098B10416a39847G09746C10867m0658N7648R3699m1320A58352g7003H5918
12697A90127b68674l8827B26362J05351A32622a7566A45835m8318N3514F0620
12686C33707D0245J41044a98944h2435d754G5121J11020B4847J05245a879A45338
12674a3958j6805A7053J78517O2354f8255C7490L01102N6778A07958b94097J33727
12663a60370A38329m7686d5268J5918A82870i314A69707a87001A34009K9676B8985
$$ y = [-308139, -67955, 201015, 19938, -13630, -198859, 68954, -204882, -203191, -56326, -250671, 441655, 165067, 46979, 231574, 263907, 113983, -23751, 239465, 178771, 136224, -57067, -71019, -189148, -222459, 118303, -36042, -2912, -188862, -45177, -234714, 69176, -131236, 235791, -47312, -88098, 210416, -139847, 709746, 310867, 270209, 327857, 421556, 380236, 158352, -77003, 85918, 190127, -268674, -307501, 226362, 331713, 132622, -17566, 145835, 97517, 151031, 60620, 333707, 40245, 181289, -198944, -82435, -4754, 75121, 186141, 24847, 130092, -1879, 145338, -13958, -30763, 17053, 195570, 257924, -68255, 37490, 338592, 395370, 107958, -294097, -160370, 138329, 90643, -45268, -29350, 182870, -9314, 169707, -187001, 134009, 163685, 28985]
12651f0962F1529J45528L5816b42183A14762f075B27507b7227j13804A18208Q5535
12640B03743h4682B23038J71924j59904B5052e8880B69487b50120A34916g0986
12629A7811L02985n5859R445j12401L49266a94663F8396N0479P5956g0764j63862
12618b34626j24234C53190A4117e4757d768B68210a14843C71197A15568l3779
12608H1789a735A45296q204a21837B0041K28665a11521B22451f7476A95168q7111
12597A08057K716L96520c3396l2563m9179d4125l7616I367b41816G5161a73177
12585b12278B22585K5361a4631l4699a476A4649h3290A47504C1090R6837a67758
12573c09155B32140C5631F113c60268b4147D537J10451M627A82f2334j88543B68337
$$ y = [-60962, 61529, 207057, 242873, -242183, 114762, -6075, 227507, -27227, -141031, 118208, 203743, -84682, 223038, 394962, 235058, 25052, -58880, 269487, -250120, 134916, -70986, 17811, 320796, 264937, 274382, 161981, 511247, -194663, 68396, 118875, 194831, -70764, -234626, -358860, 353190, 14117, -54757, -4768, 268210, -114843, 371197, 115568, 81789, -1735, 145296, 137092, -121837, 20041, 248706, -111521, 222451, -67476, 195168, 108057, 110773, 507293, -33396, -65959, -115138, -44125, -81741, 9367, -241816, 75161, -173177, -212278, 222585, 247946, -14631, -49330, -1476, 14649, -83290, 147504, 31090, 127927, -167758, -309155, 232140, 35631, 6113, -360268, -24147, 4537, 114988, 119615, 182, -62334, -250877, 268337]
12560E6547h4204a1966F7823P1567k5947N8621A0199J2747a66432B26513i8607
12548A14427f8907A22535c33739R8248g6586k92540b7801j03307A42148b04056
12537f7860m7055k5762M7674P764A9680f8290F1840i1554C54076J11789A42552
12525A62346a55022D53996b38544j25589E8975K1092k8869a97107C7074d9421
12514I8395e526A37972E0989b0821A41622g8587A98726F3219d7503k58085A45598
12502b06779q0735I2067h4565A10147j8685c1567A01302b12513a03048b1280C04312
12490B0217M6K4215c22163a2470B1365a50392j29392B49012H614J26916c91931
12478c16843f8710j36747c8403l10361b3938C1213a82963h9780B67110l7615A02945
$$ y = [56547, -84204, -11966, 67823, 139390, 113443, 172064, 10199, 22946, -166432, 226513, -98607, 114427, -68907, 122535, -333739, -235491, -76586, -369126, -27801, -131108, 142148, -204056, -67860, -114915, -140677, -93003, -85239, 19680, -68290, 61840, -91554, 354076, 465865, 142552, 162346, -155022, 453996, -238544, -364133, 58975, 80067, 51198, -197107, 37074, -49421, 98395, -5526, 137972, 50989, -20821, 141622, -78587, 198726, 63219, -47503, -305588, 145598, -206779, -287514, 92067, -84565, 110147, 91462, -31567, 101302, -212513, -103048, -21280, 304312, 20217, 20263, 44478, -322163, -12470, 21365, -150392, -279784, 249012, 8614, 135530, -391931, -316843, -68710, -205457, -38403, -348764, -23938, 31213, -182963, -89780, 267110, 229495, 102945]
12466F6052g254l28605B19569A3726a45493B52954B3695J1821J5275c70106B45288
12454B05482e764B11009J48442d4240l4358n4395C92776a29576A57430c2074j35716
12443a67790A73429F3853c80829G512L27218b97989E7553b2095B61619a92757
12432B34992a44134H510J06839j5777D586c85621Q048B52317b33886A31905P0206
12421B02111b30852Q2778j08638B78070e1207A00950a09943k6162A00896P4193
12411A75089P532a87745P7264m5579n605g2533n00021A60583b32188E2728b50537
12399c546B96176b54677B53686K9803C4882J19329d2003j04779j06275C5792d2590
12387A15545B1373a57064H9104b94993B84186F7475K76792a02723b1593D3685
$$ y = [66052, -7254, -335859, 219569, 13726, -145493, 252954, 23695, 35516, 50791, -370106, 245288, 205482, -5764, 211009, 359451, -44240, -78598, -132993, 392776, -129576, 157430, -32074, -167790, 173429, 63853, -380829, 7512, 334730, -297989, 57553, -22095, 261619, -192757, 234992, -144134, 8510, 115349, 99572, 4586, -385621, -377573, 252317, -233886, 131905, 202111, -230852, -148074, -256712, 278070, -51207, 100950, -109943, -136105, 100896, 175089, 182621, -187745, -110481, -156060, -161665, -72533, -572554, 160583, -232188, 52728, -250537, -3546, 296176, -254677, 253686, 283489, 34882, 154211, -42003, -146782, -253057, 35792, -42590, 115545, 21373, -157064, 89104, -294993, 284186, 67475, 344267, -102723, -21593, 43685]
12376b89517B72326c57326a44250G7261j091J0861f427E0101f9167J9980g451
12364B01520C6057J10548a82791j53863F8585Q1011J31140I0339f9853k98033
12354c67886R6102B37460j13198h8809j6911j10257b883j48102E6167J753J99924
12343B57844D673c4721D22479e7319A63486J80893g0440m7597H939e7007a9757
12331h5474I4047O9567l5632c55562B68655c2808o5357q912j43491B65629F4255
12319F8630a34400B64430F3020b5635j15503A36672a73137m9526J05723b329r3163
12308i5492B7174a14051A08636a74219P4466F2147K61163A37327D1095b93302
12297B15269e2802A25257a84796A09331a38332H7447k6619e0473a0556A04709
$$ y = [-289517, 272326, -357326, -144250, 77261, 76170, 87031, -6427, 50101, -69167, -49187, -7451, 201520, 36057, 146605, -182791, -336654, 68585, 149596, 280736, 90339, -69853, -367886, -271784, 237460, 124262, -88809, -105720, -215977, -2883, -150985, 56167, 57920, 257844, 4673, -34721, 422479, -57319, 163486, 344379, -70440, -118037, 8939, -57007, -19757, -85474, 94047, 163614, 127982, -355562, 268655, -32808, -98165, -107077, -250568, 265629, 64255, 68630, -134400, 264430, 63020, -25635, -141138, 136672, -173137, -222663, -116940, -2329, -95492, 27174, -114051, 108636, -174219, -99753, 62147, 323310, 137327, 41095, -293302, 215269, -52802, 125257, -184796, 109331, -138332, 87447, 60828, -50473, -10556, 104709]
12286B03654a8453E1318N9989B9410b00103f3601B76557E985P1183L277a5110
12274B21965o4919F659a29288C42505A9449a4343D57010j92013c2708A28664m3202
12263H5462a75963G0048j602C0968K39527A899e0654I4763N7151G1460k2697O5579
12251A14342f9962A42789J11853A3053A892a38720k53107F8562M118K85400B1804
12239C8518J28903q2336b30539A94641F8689l3627L48889g6324J6542n4373A53316
12227A58139J40495J544n8642K43537A02943R7074K73109H4868C0739J45149c69916
12215D38524D4826J3992K14231j3993a93361B57953E1651j2348K19785i5953c6133
12203e6350A33861J8700J9736K23086B3588K24136a87072I7426c6040B24478c8286
$$ y = [203654, -18453, 51318, 111307, 29410, -200103, -63601, 276557, 5985, 77168, 80445, -15110, 221965, 157046, 6659, -129288, 342505, 19449, -14343, 457010, 264997, -32708, 128664, 85462, -175963, 70048, 68446, 30968, 270495, 1899, -50654, 94763, 151914, 71460, 48763, 114342, -69962, 142789, 254642, 13053, 1892, -138720, -391827, 68562, 72680, 358080, 21804, 38518, 167421, 85085, -230539, 194641, 68689, 35062, 383951, -76324, -59782, -114155, 153316, 158139, 298634, 300178, 241536, 485073, 102943, 200017, 473126, 84868, 30739, 175888, -369916, 438524, 44826, 58818, 273049, 259056, -193361, 257953, 51651, 39303, 259088, -95953, -36133, -56350, 133861, 152561, 172297, 395383, 23588, 247724, -187072, 97426, -36040, 224478, -38286]
12191I2000J83655L4001d449A60632l7290M5863c7495C38369b38022E5616M9800
12180A05416j0488J37128J78095A18560M6850J32759b66570A57284J75583c31228
12169A47970J55750C5811N0242A1691f5794B87402I1929P6934B7503J7465i058
12157a41555q3295a2485E59757a26783C13701j36818F6354k5235K640a80356I112
12145a7766A98089a6192l06309a26349B67525J8815H5304M5329a4409F9772a61669
12133c5269A37619F0104a82559d7223j73574g7837b9560p4399L3563r3749B9228
12121d8837A35815k2152J25756A05170J70895A04744K19602i4599B02926H1659
12110C37915A41179F0894a20684e9998j15714j01865e3298B63428A04257f2200
$$ y = [92000, 275655, 309656, -4449, 160632, 123342, 169205, -37495, 338369, -238022, 55616, 105416, 94928, 232056, 410151, 118560, 165410, 298169, -266570, 157284, 332867, -331228, 147970, 303720, 35811, 86053, 11691, -65794, 287402, 91929, 168863, 27503, 44968, -9058, -141555, -224850, -12485, 559757, -126783, 313701, 176883, 66354, 41119, 43759, -180356, 9112, -17766, 198089, -16192, -322501, -126349, 267525, 286340, 85304, 130633, -14409, 69772, -161669, -35269, 137619, 60104, -182559, -47223, -220797, -77837, -29560, -103959, -70396, -164145, 29228, -48837, 135815, 113663, 239419, 105170, 276065, 104744, 324346, -94599, 202926, 81659, 337915, 141179, 60894, -120684, -59998, -175712, -277577, -53298, 263428, 104257, -62200]
12099B72563e0856I0291e4432C0593L933a12458D7600P0600b31762N1706E2515
12087A93793a43802b433N15D09919b54603E9869J19601p2461b44017A50017b42556
12075D88731N19294J270298A052158C63760i0661B86439A41462b7625B8786d2775
12064G2638b61904B58938a342r4541B08582o1856c09743a14294p5687A69891l5805
12053A34086n0531K07373j02074b74846e3391K4197j65667a4943I804J39750m6817
12042A02737K6856a83056A80035m5545a04593q7060H4655e2486J2710B9512L41249
12031C70761d8692n6841A22256a22729n1950H966K04759B358J5814i3765F5502
12019H9103b96477i3217I9605a250B76912h9m5089I3823c4725k31301i7919m5205
$$ y = [272563, -50856, 90291, -54432, 30593, 34526, -112458, 47600, 118200, -231762, -180056, 52515, 193793, -143802, -2433, -1918, 409919, -254603, 59869, 179470, 107009, -244017, 150017, -242556, 488731, 1008025, 2278323, 1052158, 363760, -90661, 286439, 141462, -27625, 28786, -42775, 72638, -261904, 258938, -1342, -95883, 208582, 146726, -309743, -114294, -189981, 169891, 134086, 83555, 290928, 188854, -274846, -53391, -29194, -194861, -14943, 9804, 149554, 102737, 129593, -183056, 180035, 134490, -104593, -191653, 84655, -52486, -39776, 29512, 370761, -48692, -105533, 122256, -122729, -174679, 8966, 213725, 2358, 18172, -93765, 65502, 89103, -296477, -93217, 99605, -1250, 276912, -89, -45178, 93823, -34725, -266026, -97919, -143124]
12007a43124d4759C90438h6097j46130O307A21377m0544F343O3596g1463J188
11996g0275A75018e6870D2286b59597A9089J16418A5613f7668K2109m01183g5627
11984F7777g5072A24981C9261A3662K4690j5033a8581l52248h5085m40563D2721
11972b14569C607b87891F0082b86397A05960A6358a64662N5318o174H8519k1386
11961F7133K41558i663j00281A86410a97157Q7319b1995A28072a28078j08745
11951b36823f9516c820j80707B52381q838I3441L4730K961F1936h5408k58803
11940c44211b7720A76456g4230A29390a86880M2929a0432B10247J38623o7492
11930B81378a31724A87100c18983B41080B9882c0086C3924K96332b06587J3564
$$ y = [-143124, -44759, 390438, -86097, -232227, -225920, 121377, 80833, 6343, 69939, -71463, -70275, 175018, -56870, 42286, -259597, 19089, 135507, 15613, -67668, -45559, -446742, -75627, 67777, -75072, 124981, 39261, 13662, 38352, 23319, -18581, -370829, -85085, -525648, 42721, -214569, 3607, -287891, 60082, -286397, 105960, 16358, -164662, -109344, -115518, 88519, 67133, 308691, -9663, -109944, 186410, -197157, -109838, -21995, 128072, -128078, -236823, -69516, -3820, -184527, 252381, 243543, 93441, 128171, 131132, 61936, -85408, -344211, -27720, 176456, -74230, 129390, -186880, -143951, -10432, 210247, 348870, 281378, -131724, 187100, -318983, 241080, 29882, -30086, 33924, 330256, -206587, -193023]
11920a93023A8294K27403b84546B11452a80338I3772a65920A11656h3425B31248
11909b14332A63864a0843A10551D5979g2892c4354l5146I357L4539J46611c6051
11897d4467d62j20786M027k87284J38526P0777j37780C1112f9508E0557b57354
11885C7537e2754k89679B46327A13263J20362q444c44187b4863G27K20880e037
11873B62594a59755A48625k9415K9670c90223e2262C5925b87137O4431B6019K15456
11862B41475a89252B7773R4288I512R2215b50069C22721a43007B63240m0406e0105
11850a38139A74402p4705c46480e9464j38515B26414b1469A15087J75006a19108
11839A47476a37786G6945N4850a17031q6058A85123A6398b19808a06683J712K3198
$$ y = [-193023, 18294, 245697, -284546, 211452, -180338, 93772, -165920, 111656, -83425, 231248, -214332, 163864, -10843, 110551, 45979, -72892, -34354, -69500, 9357, 43896, 190507, -36051, -44467, -462, -121248, -117221, -404505, -265979, -195202, -332982, 31112, -69508, 50557, -257354, 37537, -52754, -342433, 246327, 113263, 233625, 225181, -344187, -24863, 727, 221607, -5037, 262594, -159755, 148625, 119210, 148880, -390223, -52262, 35925, -287137, -222706, 26019, 241475, -189252, 27773, 122061, 9512, 101727, -250069, 322721, -143007, 263240, 222834, -50105, -138139, 174402, 99697, -346480, -59464, -197979, 226414, -21469, 115087, 290093, -119108, 147476, -137786, 76945, 131795, -117031, -203089, 185123, 16398, -219808, -106683, -104971, -81773]
11828h1773j70646a11040j52431R4009l5348Q9452A840f6471D1870c1063l28603
11817c59666B7116M0157A5492K4902a93251h963F2545f5928E3016c0509k83228
11806c13737a16975G7037a10209k01093g885B91210A17986k3868M9771k7708J09636
11795B25817k8416F9331A9706J5851F894b51529C6517c319k68928f2644J7627
11784d5017A37745b58521f6781r0025N2325H8191h866k02369j3637A17758A8552
11772a00848D1177a5179p0704n7261B92461a38482j873d0187j66018f725F0331
11760E7114a95015B6985a29821J5264c0373E634a08397j2228I1392h5476r8824
11749a84300M0937A34158O2567h1012q6460N7807j62313p879C7448a68130N7861
$$ y = [-81773, -252419, -111040, -263471, -169462, -204810, -115358, 1840, -66471, 41870, -31063, -359666, 27116, 67273, 15492, 40394, -193251, -8963, 62545, -65928, 53016, -30509, -313737, -116975, 77037, -110209, -311302, -7885, 291210, 117986, 94118, 143889, 116181, 225817, 197401, 69331, 19706, 35557, 6894, -251529, 36517, -3319, -272247, -62644, -45017, 137745, -258521, -66781, -156806, -104481, 88191, -8866, -211235, -224872, 117758, 18552, -100848, 41177, -15179, -85883, -143144, 292461, -138482, -140355, -40187, -206205, -6725, 60331, 57114, -195015, 26985, -129821, -114557, -30373, 5634, -108397, -120625, 91392, -85476, -184300, -143363, 134158, 196725, -81012, -167472, -109665, -271978, -279857, 37448, -168130, -110269]
11738a10269I7833l2107L63656I5094f7910a3155A52782c35378A4448L20801e7024
11726a91478G4623e7576I639b53891G1140e2880D7553Q6391a48811e1433j70502
11715b21935d6841A96071B8514c7257A1129i7010J3086A27611N8891a95446Q3513
11704a11933A85437e3944A18907P3750Q2894a7236A30828a11137A46436C1546
11693I8307J71483a91593A56580A3833R2597D5623a14760b189H6907i5002k3510
11682a18512n2193B12155G7682a41945I1445k9832K61064q7950K64021a46372
11671G4327a82056A76124g0257A53853E979a6834h340j45134E0502b3907F5579
11659a78847J6750B59284A15253i7068j028b0237A16554L5639p3157p091b33201
$$ y = [-110269, 97833, 65726, 429382, 95094, -67910, -13155, 152782, -335378, 14448, 335249, -57024, -191478, 74623, -57576, 9639, -253891, 71140, -52880, 47553, 133944, -148811, -51433, -221935, -46841, 196071, 28514, -37257, 11129, -97010, -83924, 127611, 186502, -195446, -111933, 185437, -53944, 118907, 192657, 275551, -17236, 130828, -111137, 146436, 31546, 98307, 269790, -191593, 156580, 13833, 106430, 45623, -114760, -2189, 86907, -95002, -118512, -170705, 212155, 77682, -141945, 91445, 61613, 322677, 234727, 498748, -146372, 74327, -182056, 176124, -70257, 153853, 5979, -16834, -8340, -153474, 50502, -23907, 65579, -178847, -162097, 259284, 115253, -97068, -98096, -20237, 116554, 152193, 79036, 71945, -233201]
11647C48062o6069d7532j1420A87859L7572g5052H7866d486j31502G2374a25041
11635A25768A2008R3758h3837B94976j11720l6801K67311a43650m1060g5969G488
11623f8109B6814J29225L5449H6115g3668q0599D7981O7126a6439E3442b06490
11611F0889h8599A51717a89273N3725A98433E0096d912A98883j8571b30004B45588
11599b93174A9390a0906A21195D6212J8107c983D46014A3579d1201B18469n9886
11588A58583L7407J49732b72993a5910A16441B7062a29897e3114o8901H3504a22851
11576I924J36750a43080B51731J46066j15306a53546B63941E5688B1788O1911
11566H3699a82028j59923a4451L772r8684B37345a09843D9978J33726a23947E5203
$$ y = [348062, 281993, -47532, -58952, 187859, 225431, -75052, 87866, -4486, -135988, 72374, -125041, 125768, 12008, 105766, -83837, 294976, 183256, 146455, 413766, -143650, -184710, -75969, 7488, -68109, 26814, 156039, 191488, 86115, -73668, -154267, 47981, 115107, -16439, 53442, -206490, 60889, -88599, 151717, -189273, -135548, 198433, 50096, -4912, 198883, 180312, -230004, 245588, -293174, 19390, -10906, 121195, 46212, 64319, -3983, 446014, 13579, -41201, 218469, 158583, 195990, 345722, -272993, -15910, 116441, 27062, -129897, -53114, -122015, 83504, -122851, 9924, 146674, -143080, 251731, 397797, 282491, -153546, 263941, 55688, 21788, 83699, -182028, -341951, -14451, -10679, -109363, 237345, -109843, 49978, 183704, -123947, 55203]
11554a25275H6835a0952q7402k1068q4201M9921F7731K14658F5615M6171g4162
11542a32420A57996j3310N0679E0859k3691L33912i4430d327r1510A85799a45008
11530A20353j0614F773M6567a57074A97889h0229A46209R7884A14505M2959f7352
11518E3254b50080k33413b28020g848C73506b02519m7995B88030p1132D7917a36823
11506B56717r4608n8677a38094B16233C7924a56001B13041f9180k785A06473K63394
11495C69867a37773k46354B52730c0057A59400a50526E884P3936L779L33945j82892
11484B34652m7924n8168R4528P9264F7904K4976J9869c265C13685l474j29634
11473A80577F0947B8870n227J53634a4667j87242B22052C4209L97418Q1575F5825
$$ y = [-125275, 86835, -10952, -98354, -119422, -203623, -153702, 67731, 282389, 65615, 111786, -74162, -132420, 157996, 144686, 195365, 50859, 27168, 361080, -94430, -4327, -95837, 185799, -145008, 120353, 109739, 6773, 53340, -157074, 197889, -80229, 146209, 244093, 114505, 157464, -67352, 53254, -250080, -483493, -228020, -7848, 373506, -202519, -250514, 288030, 216898, 47917, -136823, 256717, 162109, 103432, -138094, 216233, 37924, -156001, 213041, -69180, -71965, 106473, 369867, -137773, -384127, 252730, -30057, 159400, -150526, 5884, 79820, 83599, 417544, 234652, 186728, 128560, 223088, 302352, 67904, 92880, 112749, -3265, 313685, 310211, 180577, 60947, 28870, 23643, 177277, -14667, -201909, 222052, 34209, 431627, 513202, 65825]
11461B20476O0796O8978I7375K52345F5805K43617a7747I6401K88888o2442p2246
11450B50601m573A16065C2106a9507l6504A08101c0668D03960a03182A66761d0661
11438i9165k7498n2413C59379a8391B10745a43677A21288J15148C9762K05881
11428B45643r347k4238n0523n649J21989i0503B20258i8117D0988a7092A75553
11416a06684A48728d1076A96323m2511Q2174F992b3799j99623a10326C3351h4329
11404a45883K3602d6448C6886c0944j75341k3598A04973a90792R2609E2857g2815
11392E8133c02604C34225j66732A6068b08735B54872A916J77170a13231L5614
11382g7617B23224b13289f9787k39413B64171A11714d8811H9353F435N40172E2615
$$ y = [220476, 281272, 350250, 97375, 349720, 65805, 309422, -17747, 96401, 385289, 322847, 250601, 246028, 116065, 32106, -19507, -56011, 108101, -30668, 403960, -103182, 166761, -40661, -99165, -126663, -179076, 359379, -18391, 210745, -143677, 121288, 236436, 39762, 245643, 236296, 212058, 161535, 155886, 277875, -90503, 220258, -98117, 40988, -17092, 175553, -106684, 148728, -41076, 196323, 153812, 235986, 6992, -23799, -223422, -110326, 33351, -84329, -145883, -122281, -46448, 36886, -30944, -206285, -229883, 104973, -190792, -98183, 52857, -72815, 58133, -302604, 334225, 167493, 16068, -208735, 254872, 1916, 179086, -113231, -77617, 223224, -213289, -69787, -309200, 264171, 111714, -48811, 89353, 6435, 546607, 52615]
11370B80374b70824G3452L877h8093l2467f0250j23031Q8092k31283D5803L4119
11359G9922c0498E5068J77948c0006k06328a11530E0584a98342B53600a33068
11348a87579d4093k04892E6282J79285a15261e4645j00879k2305k6750A51921
11337c12768a4256B09787G2859M0141c49525J70264A18197j6312C928b14959d8891
11325B14413K4387r0133j9071O5010a1424r8176B16200F3394b8847A42458e4818
11313g8523C6351K00902j17434M0570e9545j67018a2253k85509i7324c2259l8642
11302g0901H5687d6151j54096A00482e6929j72066h737F210K7187a68752d4039
11290b74775A296b20659C6581a60745f7010j6857o63B89894a23209o7198B89174
$$ y = [280374, -270824, 73452, 77329, -88093, -120560, -60250, -183281, -95189, -326472, 45803, 79922, -30498, 55068, 233016, -30006, -236334, -111530, 50584, -198342, 253600, -133068, -187579, -44093, -248985, 56282, 235567, -115261, -54645, -155524, -177829, -204579, 151921, -312768, -14256, 209787, 72859, 113000, -349525, -179261, 118197, 101885, 3928, -214959, -48891, 214413, 238800, 148667, 129596, 194606, -11424, -109600, 216200, 63394, -28847, 142458, -54818, -78523, 36351, 237253, 119819, 160389, -59545, -226563, -12253, -297762, -97324, -32259, -70901, 85687, -46151, -200247, 100482, -56929, -228995, -8737, 6210, 33397, -168752, -44039, -274775, 1296, -220659, 36581, -160745, -67010, -83867, -84530, 289894, -123209, -190407, 289174]
11278c9495E1912j7202a97133A08765b03374A8831a44013A30940a43837M5304
11268i8533A0346b67571a28800h67j75975f4685r1668f2826j0298k627J6031A29178
11255A01339i1715H782N4287a26520q4642P8190m848A99989L4001a04749j03023
11244b07772A82774a55989A65846b18921O5650b180l08121A10021J90625A39823
11233a19770F6748b56616A31574o1824M29939a17421G4837a4559A72582e6429
11222b15477A81299m7997a93796A2704a53316L7919K2192A08666g3735G9312m457
11211G4855a3862O141j91462F3245J3071a51676m7014n7175A35592K56703A1643
11199B2098O2858C07b13523H0703c8030k98050B55626b56880B78800A2779J27513
$$ y = [-39495, 51912, 34710, -197133, 108765, -203374, 18831, -144013, 130940, -143837, -98533, 10346, -267571, -128800, -867, -176842, -64685, -156353, -62826, -73124, -75751, -59720, 129178, 101339, -91715, 8782, 63069, -126520, -211162, -132972, -137820, 199989, 233990, -104749, -207772, 182774, -155989, 165846, -218921, -153271, -2180, -310301, 110021, 300646, 139823, -119770, 66748, -256616, 131574, 69750, 499689, -117421, 74837, -14559, 172582, -56429, -215477, 181299, 133302, -193796, 12704, -153316, -115397, -93205, 108666, -73735, 79312, 74855, -13862, -7721, -199183, 63245, 76316, -151676, -198690, -255865, 135592, 392295, 11643, 22098, 84956, 307, -213523, 80703, -38030, -336080, 255626, -256880, 278800, 12779, 140292]
11188A40292i4193C42391h5859m1002a3446o1349B0132b96486a5894m31395K08235
11177b39054a09746M9194B09994a46934j22229g7368j10544q2898h2634o0151
11167a42785F0680b07096c1517g55A0423J56289a11586k37654C9233d5167A87257
11155B9317N4894C4440b02722B83964a8934k39320B15182b66477d4143A08429
11144a39846A74897l3843B3967i2579j44936b7325A31695d9804B38761J6066a14426
11132a30386C1357J10031e9687B79378H991Q4690Q754a70375I2717R3975L0137
11121B16829o5386j922a0987A45194j1183b7833q5674c2088B16275b04106A52011
11109A41895P0639a41987B15875J4245o3962J16382a51498C1634J92090J21744
$$ y = [140292, -94193, 342391, -85859, -126861, -13446, -74795, 20132, -296486, -15894, -447289, -239054, -109746, -60552, 209994, -146934, -269163, -77368, -187912, -270810, -82634, -142785, 60680, -207096, -31517, -755, 10423, 166712, -111586, -349240, 39233, -45167, 187257, 29317, 84211, 34440, -202722, 283964, -18934, -258254, 215182, -266477, -44143, 108429, -139846, 174897, 141054, 23967, -92579, -237515, -27325, 131695, -49804, 238761, 254827, -114426, -130386, 31357, 141388, -59687, 279378, 8991, 93681, 102435, -170375, 92717, 186692, 216829, 151443, 149521, -10987, 145194, 134011, -27833, -113507, -32088, 216275, -204106, 152011, 141895, 212534, -141987, 215875, 230120, 166158, 282540, -151498, 31634, 223724, 345468]
11099C45468b74779F7937d6745A94424a63501F2056K91719a04226A87018a48205
11088B92162O566m3464L54037B32035K78683H3086K08569K18688k53535P0936
11078C27744k3654A5707K25752j01995J38370N922K90348k15545J27964k04883
11068B81640A9147K10370Q9728M0111K53671A84947R1164J34238J05858j59837
11058C56370L75749B11681J83379K30871L90251C21722K68152J10754o2607K25271
11048H63292p5564P2487J4340k41049J29778N1735j36085j43987O8593l91M3602
11037F46751L8135k7996A82207M82483j2385l04722P1818J76750B49197O85543
11027I34740j46817j6341K15292l37772L74719D67174K10007k47312p9046J36000
$$ y = [345468, -274779, 67937, -46745, 194424, -163501, 62056, 353775, -104226, 187018, -148205, 292162, 298728, 255264, 609301, 232035, 510718, 83086, 291655, 510343, 256808, 327744, 304090, 15707, 241459, 139464, 277834, 283756, 574104, 358559, 486523, 281640, 19147, 229517, 319245, 359356, 613027, 184947, 276111, 410349, 516207, 356370, 732119, 211681, 395060, 625931, 1016182, 321722, 589874, 700628, 638021, 863292, 787728, 860215, 874555, 633506, 763284, 815019, 678934, 534947, 603540, 603149, 646751, 684886, 656890, 182207, 664690, 652305, 347583, 419401, 596151, 249197, 934740, 787923, 771582, 986874, 649102, 1023821, 467174, 677181, 429869, 350823, 486823]
11017D86823M47511D28193J83621B87630K98733j76947K35256J63198m02621K91410
11007F96659j38867P31J74684l08924n420l2953K82591k24316M8958L53528l91125
10996D55546L27183J09554l87942L07160k32510J31107K40319k78707K03469J48430
10986A023609k49512R6234J66445j68442K52737l23482N89806J7985m94403P74857
10976A685834r4721K97910L54440k7863L06602J75295l3689L4976l22061m20462
10966A956261j84600L10740n62699p8483J23102j66300J44496J93380J32421q8615
10956A779703o6738k72553o36858L41670j55284P5113j88449l62741k38872o937
10946B68054J55054k01086A09221l1633J87428j05295J6495J40236a5201C28784
$$ y = [486823, 934334, 428193, 611814, 287630, 586363, 409416, 644672, 807870, 405249, 696659, 557792, 558523, 733207, 424283, 418863, 385910, 668501, 444185, 493143, 846671, 455546, 782729, 892283, 504341, 811501, 578991, 710098, 950417, 671710, 875179, 1023609, 774097, 870331, 1036776, 868334, 1121071, 797589, 1387395, 1405380, 910977, 1685834, 1591113, 1889023, 2243463, 2215600, 2522202, 2697497, 2663808, 2698784, 2376723, 1956261, 1771661, 2082401, 1519702, 1441219, 1564321, 1398021, 1542517, 1735897, 1868318, 1779703, 1712965, 1440412, 803554, 1145224, 989940, 1065053, 876604, 513863, 274991, 268054, 423108, 222022, 109221, 77588, 265016, 159721, 176216, 316452, -15201, 328784]
10935a39644j32959A4991e5368A719b7453B6461K66757N8673D9235h3159B50297
10923B88145j25240a64922j10204l60B79253n3876a7213H1863L0251a00475c05
10911B88655A12437b78203n2179d0359J7450m13915A33571b74283O1633f3876
10900d36944C16138e5477l5777I4942g1852D8509P709e5366r185j91287A19092
10888B14220L4213F2516b97898J48067o2249b9666A10775d9695H989a72314C2984
10876A0412h8053A13286j4872D3158d4880A53489j3257F9327M8364f473C0898
10864C9965Q6834e9031q9076k28921d4228j07204n2466i2394D0249b2776B37808
10852a39923p6630B56333g9678I321J52660L3626Q4802a3541o2763j42987G9830
$$ y = [-139644, -272603, 14991, -55368, 1719, -27453, 26461, 293218, 351891, 49235, -83159, 250297, 288145, 162905, -164922, -275126, -275486, 279253, 225377, -17213, 81863, 112114, -100475, -305, 288655, 112437, -278203, -330382, -40359, -22909, -436824, 133571, -274283, -212650, -63876, -436944, 316138, -55477, -91254, 94942, -71852, 48509, 56218, -55366, -64551, -255838, 119092, 214220, 248433, 62516, -297898, -149831, -212080, -29666, 110775, -49695, 8989, -172314, 32984, 10412, -88053, 113286, 98414, 43158, -44880, 153489, 140232, 69327, 117691, -6473, 30898, 39965, 126799, -59031, -148107, -377028, -44228, -151432, -203898, -92394, 40249, -22776, 237808, -139923, -216553, 256333, -79678, 9321, 161981, 195607, 280409, -13541, -76304, -219291, 79830]
10840A54664D2139J18510g2201A87680H3976a37698n2271D0763J43944a13570
10829b1635j73926B75652e5845A01310b25774e3485j07641k03802e5786B8213
10818B13893h1682J4131j52932p5741E8332M1543P1428p7019a26727j38380A76520
10806b7889l2319A0205a05801A13663i8650c3947A33745J70296a58983K1678j74433
10795c11738g7166A25899l2830M061h4825c5162n1084A91739b03073i7368k70039
10784c67407J04840O9055B3030g937A21056g5011B55817p6246a85912A72600L149
10773A75749j0735c94B9792e4075B79040j29421b52973d5945E8746a78230l7483
10762b15713M7473N5937B058K16220J7358e8718G984J75563a34861M2492m3727
$$ y = [154664, 42139, 160649, -72201, 187680, 83976, -137698, -189969, 40763, 184707, -113570, -21635, -195561, 275652, -55845, 101310, -225774, -53485, -161126, -364928, -55786, 28213, 213893, -81682, -67551, -220483, -296224, 58332, 99875, 171303, 94284, -126727, -265107, 176520, -27889, -60208, 10205, -105801, 113663, -98650, -33947, 133745, 304041, -158983, -137305, -311738, -77166, 125899, 93069, 97130, -84825, -35162, -86246, 191739, -203073, -97368, -367407, -262567, -193512, 23030, -7937, 121056, -75011, 255817, 179571, -185912, 172600, 175749, 165014, -394, 29792, -54075, 279040, 149619, -252973, -45945, 58746, -178230, -215713, -168240, -112303, 2058, 218278, 235636, -58718, 7984, 183547, -134861, -92369, -136096]
10751a36096L7261p1849D5560a91518C880i6450A1149K20585A5366a95545j21318
10740c16863A86666K8907c2145D2699f9081D752L5321a55471k94846J07019k0791
10729c64089a51128j05956c9632k7580J7448G8681a60221f540H059N0392m469
10718E3982e1627a0739k01160C8060h6311j20940A41714d9396l47565J52273A30554
10706A61641a72477B04185a5511k75386m6735I260b5513A05937i53l06667J22287
10695a85333j94259A62466g1048C3795M44406H3487a04452A18927b58961b2112
10684F1981b73490A66532a74171n0834F2635c11899c1666A71048c5574H4343e37558
10672A43684P3658e40871i0414n8341e3889D6877b43769A40885b69419A10083
$$ y = [-136096, -98835, -170684, 45560, -191518, 3880, -96450, 11149, 231734, 15366, -195545, -316863, 186666, 215573, -32145, 42699, -69081, 4752, 40073, -155471, -450317, -343298, -364089, -151128, -257084, -39632, -67212, -49764, 78681, -160221, -6540, 8059, 58451, 53982, -51627, -10739, -211899, 38060, -86311, -207251, 141714, -49396, -396961, -244688, 130554, 161641, -172477, 204185, -15511, -290897, -337632, 9260, -25513, 105937, -953, -307620, -185333, -379592, 162466, -71048, 33795, 478201, 83487, -104452, 118927, -258961, -22112, 61981, -273490, 166532, -174171, -225005, 62635, -311899, -31666, 171048, -35574, 84343, -537558, 143684, 217342, -540871, -90414, -148755, -53889, 46877, -243769, 140885, -269419, 110083]
10661E2324R063a50969G0536O4495J89447e7004n1177L7339B85297n328b31859
10649A28057b04n8259j67205j69681J46186e4031a4759j32526M4310l52987C5102
10637C74947j7733c9037k20293J00532A67937K967h768I227J06532E6517b86719
10625A52389Q6817c21735A96778h5591G1099b95475A47786b02451A49948C2220
10614c0727j86503m5859A79507b4423j09028m8109j38130C1881N6401K13353j48231
10603A53404a54864E9367a46176j42707B08636A8504a59195f032l21686P9696
10593b48022p1550I3771b40680B5934a26585A52492a37655n0933B21835e1898
10582F49c37362C0436c5779k40326g9575j07862A99995O90E647N3983Q0309b43765
$$ y = [52324, 61387, -150969, 70536, 135031, 324478, -57004, -108181, -70842, 285297, 279969, -231859, 128057, -204, -58463, -225668, -395349, -249163, -54031, -14759, -147285, -102975, -455962, 35102, 374947, 357214, -39037, -259330, -158798, 167937, 170904, -8768, 9227, 115759, 56517, -286719, 152389, 239206, -321735, 196778, -85591, 71099, -295475, 147786, -202451, 149948, 32220, -30727, -217230, -263089, 179507, -24423, -133451, -181560, -319690, 31881, 88282, 301635, 153404, -154864, 59367, -146176, -288883, 208636, 18504, -159195, -6032, -327718, -248022, -319572, 93771, -240680, 25934, -126585, 152492, -137655, -188588, 221835, -51898, 649, -337362, 30436, -35779, -276105, -79575, -187437, 199995, 200685, 5647, 59630, 139939, -243765]
10569f5384j88550o6246a55277A1485b433j17214j14755B77014n9140d5627r1898
10558a37525A03029b87754a5689A37409h0600p7037j60920D9998l422J09926E2060
10546H3847J50389c46531P5396g1914C2245Q686L35531c48403L8653C0297a38478
10534A26894j4814E6036b015A92402b92158d0253I5305J21071R8569i5005F8200
10522a17522K9081j58519A53039b09911e4352E6749i9789o6665B22972m1398D5333
10510a77796A22950O348K29850g6160A90554a64509C25041a04153q5791b5269
10499H888a03205k410A724a52567l00202B30926L88e9286A12469a95204a6259
10487c00209d7976A68169b76657b5714B15583M9170P230J19599j90133O6432j578
$$ y = [-65384, -253934, -320180, -155277, 11485, -2433, -119647, -234402, 277014, 217874, -45627, -137525, 103029, -287754, -15689, 137409, -80600, -157637, -318557, 49998, 46576, 156502, 52060, 83847, 234236, -346531, -271135, -71914, 32245, 40931, 376462, -348403, -309750, 30297, -138478, 126894, 112080, 56036, -2015, 192402, -292158, -40253, 95305, 216376, 314945, -95005, 68200, -117522, -88441, -246960, 153039, -209911, -54352, 56749, -99789, -166454, 222972, 181574, 45333, -177796, 122950, 129298, 359148, -76160, 190554, -164509, 325041, -104153, -189944, -25269, 8888, -103205, -105615, 1724, -152567, -452769, 230926, 231314, -59286, 112469, -195204, -16259, -300209, -47976, 168169, -276657, -25714, 215583, 264753, 271983, 391582, 201449, 267881, 266303]
10476B66303R682o1151a65881C76343a88903R3545A59562J08020a52910I1900
10465A39063b17818h2096k4206j66719a13244l2974d9559k18929f7606b0806E2465
10453a9976k13381B67487J09757b60438l6293k6392A44360a7159n1208n8771B46974
10441i6646A70195m9741b8306n7265e240j21231I9916a94702H7167R6890d4741
10429G4555A6286K48894f9675G6742b2804A45756c66091C3619K58802a45191m8852
10418a94043B17581M3327A1334K672a35515D387c46430A54674i8603F5530b55007
10406D1553N3589i5500I072K05448l0265b51443a01221d7128j76923a08992j94607
10395c03599B83712c9163D2865K49335l3237K5876m019j02682p6872a01482a4146
$$ y = [266303, 275985, 214834, -165881, 376343, -188903, -95358, 159562, 267582, -152910, 91900, 139063, -217818, -82096, -106302, -273021, -113244, -146218, -49559, -268488, -67606, -20806, 52465, -19976, -233357, 267487, 377244, -260438, -296731, -323123, 144360, -17159, -68367, -127138, 246974, -96646, 170195, 120454, -28306, -85571, -5240, -126471, 99916, -194702, 87167, 184057, -44741, 74555, 16286, 265180, -69675, 76742, -22804, 145756, -366091, 33619, 292421, -145191, -194043, 217581, 260908, 11334, 14006, -135515, 4387, -346430, 154674, -98603, 65530, -255007, 41553, 95142, -95500, 9072, 214520, 184255, -251443, -101221, -47128, -224051, -108992, -303599, 283712, -39163, 42865, 292200, 258963, 284839, 280820, 178138, 101266, -101482, -14146]
10383A90423a29160d4533j36707j77983A33519L5546c786E3415J2591M81907j99320
10372C48593n7551K35791A63926a4393E7156L56278o755J57705J93740k74773
10362D83351B40663H8544e2457E02200h8379A04190N223K3712N7031G7120M73865
10351E50985k9796j22423P5113k10070a56434B53389J34372j532j3997q9434h2554
10339B54294K63507A9822J35713N266f4521A97009h6329C15600I0775b9330q2318
10328a11648C98144f0359B84587a56881A77705m1175C3660a1598H9477D0108J89913
10317B30021I755J18457L34398D0111g9036A6055b8640D356a37544C02811K64834
10306E67645G1940b31483E3156N2835J76087a67471A00252f8375j33962j14448
$$ y = [190423, -129160, -44533, -181240, -359223, 133519, 169065, -3786, 53415, 66006, 547913, 348593, 291042, 526833, 163926, -14393, 57156, 413434, 406679, 564384, 758124, 483351, 240663, 88544, -52457, 502200, -88379, 104190, 109413, 133125, 190156, 77120, 550985, 521189, 398766, 473879, 263809, -156434, 253389, 387761, 386229, 372232, 282798, -82554, 254294, 517801, 19822, 155535, 160801, -64521, 197009, -86329, 315600, 90775, -29330, -111648, 398144, -60359, 284587, -156881, 177705, 136530, 33660, -11598, 89477, 40108, 230021, 9755, 128212, 462610, 40111, -79036, 16055, -28640, 4356, -137544, 302811, 567645, 71940, -231483, 53156, 105991, 282078, -167471, 100252, -68375, -202337, -316785]
10296c16785F9802P6063a00603K3716k24260N6617f5881k03972h4415H2108m0204
10285D1904L3014g0708k3354A5631a75722b5734O508j08943F6683j7938a12968
10273g0810B8150K01706a47969n7227P3385B92272D8630f9294k210A73377A5503
10261B72344J82759A4331K28697P4439A01828M3516O5810A02100a13496M4800
10251f8696K0841A09244B8693A2738d601C581N7821a42065G7594k4919e4873m860
10239e9733q8600e5545B58807A5172J22241c3667n2075B59358a35293B30730A2633
10227A80127H5567f2004A75899a43200j10567O8003b7581F0366b11220g9477A04146
10215a93507p8224A78060a46586p9793D24899A22023C4171O7748a80853j06396
$$ y = [-316785, 69802, 145865, -100603, -76887, -301147, -244530, -65881, -269853, -84415, 82108, 41904, 74918, -70708, -94062, 15631, -175722, -25734, -19226, -128169, 66683, 48745, -112968, -70810, 28150, 229856, -147969, -205196, -131811, 292272, 48630, -69294, -71504, 173377, 15503, 272344, 455103, 14331, 243028, 317467, 101828, 145344, 211154, 102100, -113496, -68696, -47855, 109244, 28693, 12738, -4601, 3581, 61402, -142065, 77594, 52675, -54873, -59733, -148333, -55545, 258807, 15172, 137413, -33667, -85742, 259358, -135293, 230730, 12633, 180127, 85567, -62004, 175899, -143200, -253767, -185764, -27581, 60366, -211220, -79477, 104146, -193507, -271731, 178060, -146586, -226379, 424899, 122023, 34171, 101919, -180853, -287249]
10205b87249b7240A37607B0642L5360j6683j6196J36145Q1163D2184L7736c06784
10193h6909F89a67414d2451j16620c6558j43584e4763h060k95114J6481K9112
10182b57581a26902c8859F3499a21358A34094e9417m28222a60246m0082B1687
10171b33589J03048A51078e2933B72181A12122B9956b07815r3981J39615J703
10161a60478B47095k2966h4450a8464k74355e9637A65155f2711R118j3536I2885
10149b54845H7241n17A1873a84414n2510h4548a7090B25855g3010j23212C61847
10137a3701A71738a47276D9108i0509L4653j28346A19222C5224c8895r276o6476
10126a14647J8350E4103K30047A23052b24697a2269A14727R0105h5569l44466
$$ y = [-287249, -27240, 137607, 20642, 56002, 39319, 23123, 159268, 240431, 42184, 79920, -306784, -86909, 689, -167414, -42451, -159071, -36558, -180142, -54763, -8060, -303174, -286693, -257581, -126902, -38859, 63499, -121358, 134094, -59417, -487639, -160246, -200328, 21687, -233589, -130541, 151078, -52933, 272181, 112122, 29956, -207815, -301796, -162181, -160478, 247095, 224129, -84450, -18464, -292819, -59637, 165155, -62711, -53593, -67129, 92885, -254845, 87241, 86724, 11873, -184414, -236924, -84548, -17090, 225855, -73010, -196222, 361847, -13701, 171738, -147276, 49108, -90509, -55856, -184202, 119222, 35224, -38895, -48171, -114647, -96297, 54103, 284150, 123052, -224697, -12269, 114727, 204832, -85569, -430035]
10116d30035a3541m0672A20583b69959D435J10792h4303k45233E1083f8843j85087
10105b53930B19465k2970N5118b22245P5506I5406f8413j43236N1642e5091l50686
10094d05777a71085H4552N4034a09077c7110b258k92624J2468a07158a3644l04150
10083c17794C68400a30340j69392B15357l6529g4188A17671O5781a02694B0594
10072e7719g040l19599e0540I2236H598g2640A00011c80363B40905b83699a17281
10060a29259j28804G0148h3137o7703j3269j91833D286a01817A49409b18782H9494
10048f561m07715F1247B0733J19794R7249q6007O751m4458D3413b39503i1712
10036c23122P7495C26249a80756j34647h6708c8448J3609l4079A66948b92715
$$ y = [-430035, -13541, -54213, 120583, -269959, 4435, 115227, -84303, -329536, 51083, -68843, -253930, 219465, 196495, 251613, -222245, -146739, 95406, -68413, -211649, -160007, -55091, -405777, -171085, 84552, 138586, -109077, -37110, -2258, -294882, -282414, -107158, -13644, -317794, 368400, -130340, -299732, 215357, 178828, -74188, 117671, 183452, -102694, 20594, -57719, -7040, -326639, -50540, 92236, 8598, -72640, 100011, -380363, 240905, -283699, -117281, -129259, -258063, 70148, -83137, -150840, -164109, -355942, 4286, -101817, 149409, -218782, 89494, -6561, -414276, 61247, 20733, 140527, 237776, 151769, 158520, 114062, 43413, -239503, -91712, -323122, -245627, 326249, -180756, -315403, -86708, -38448, -24839, -58918, 166948, -292715]
10025a61042D6268b01189A52648M4449b0178F7274b42717F6566a53424F7272R7773
10014A65045F4989K7673K3188e5312p7877j22130C54605a08132b9839l00807g3619
10002g8051k00257d6249j31038g2884k39257G8080L5552b82813b8598C99608a34382
9990C9041c42621C06632c10145J12394D123b49063D1162g9392F2630e3395k4369
9979g7764J2057M060A56623A1798a36291F8622a38865G7408a42881d6015k31204
9968b77219J28845j50085a05195b6067k32811c6576o5300j85024A36154f9856
9957C6482h8824d501q3488k18977B29339g5271o6261a900j86557b5148k26935
9946b52083j01152d3750a8132j45701q8414A32973b23637j7776r4470F8867F531
$$ y = [-161042, 46268, -201189, 152648, 197097, -20178, 67274, -242717, 66566, -153424, 67272, 165045, 64989, 92662, 115850, -55312, -133189, -255319, 354605, -108132, -29839, -330646, -73619, -78051, -278308, -46249, -177287, -72884, -312141, 78080, 113632, -282813, -28598, 399608, -134382, 39041, -342621, 306632, -310145, -197751, 4123, -249063, 41162, -79392, 62630, -53395, -77764, -65707, -61647, 156623, 11798, -136291, 68622, -138865, 77408, -142881, -46015, -277219, -148374, -298459, -105195, -26067, -258878, -36576, -101876, -286900, 136154, -69856, 36482, -88824, -4501, -87989, -306966, 229339, -75271, -141532, -1900, -188457, -25148, -252083, -353235, -43750, -18132, -163833, -252247, 132973, -223637, -241413, -335883, 68867, 6531]
9934H741b01033B6013d5174l3259c3628k71238B55219i3055C86212C3319o908
9923B6411a78578J1148j12116J17815B19299d97939g5640A67062a460j01265j63975
9912b66700D39195j88453j03963C7067i8442m9013q5091j913H556b73919A08994
9900a22785q94n4638j09905C8399g1546n1622L1810K3694j01835l8600B1693b38669
9887A79725H9204J29486j05248a10691q5310g9153A22197a02404l2291l5316a4376
9875b01305P2842B48199b03931a4727C75120A57260R261b36703n7049A43313D2123
9863a09763a1339l16620B30910f2351B63741R4316i4230k62396A7044O4539c0505
9851d20753A23353a39591J5263D5318c85853a4144q3035A26899O0334d71961C4576
$$ y = [8741, -201033, 26013, -45174, -78433, -33628, -304866, 255219, -93055, 386212, 33319, 26411, -178578, -167430, -279546, -161731, 219299, -497939, -75640, 167062, -1460, -102725, -266700, 439195, 250742, 146779, 37067, -98442, -147455, -232546, -234459, 8556, -273919, 108994, -122785, -123679, -178317, -288222, 38399, -71546, -123168, -91358, -67664, -169499, -208099, 21693, -238669, 179725, 89204, 218690, 113442, -110691, -196001, -79153, 122197, -102404, -134695, -170011, -14376, -201305, -128463, 248199, -203931, -14727, 375120, 157260, 166521, -236703, -293752, 143313, 42123, -109763, -11339, -327959, 230910, -62351, 263741, 358057, -94230, -356626, 17044, 81583, -30505, -420753, 123353, -139591, -124328, 45318, -385853, -14144, -97179, 126899, 187233, -471961, 34576]
9839f8955b3179D8559R3325L1108b42682a03643j85455A24269K6698n4031g6170
9827a41327B56187b80564d6051j93601f414F2423b41172i0174B0702K08254b76908
9815a23836J1841A18278a53585B01299c30100P3721a8707k21141R8722f2466m0245
9804a02711l8600A9783M6526b78984c0237m18869c4280j97133N0398O1103k55962
9793c75874a47241M3150B41016F4283L60024A2546N19P6621m0512j0270Q6914
9782A25818c2665p977k98633b948j8804j02354j69437C31771j053a90633A01122
9770a49526m1937c9385A52910a09849L4488I046K65478C6392a09627o8354Q2102
9759i5879E9245K66675f5650r2768A36677a03788k7483G88a21630d6022k77749
$$ y = [-68955, -23179, 48559, 141884, 172992, -242682, -103643, -289098, 124269, 150967, 96936, -76170, -141327, 256187, -280564, -46051, -239652, -6414, 62423, -241172, -90174, 20702, 228956, -276908, -123836, -111995, 118278, -153585, 201299, -330100, -256379, -18707, -239848, -141126, -62466, -102711, -141311, 19783, 66309, -278984, -30237, -449106, -34280, -231413, -181015, -119912, -375874, -147241, -104091, 241016, 64283, 424307, 12546, 13065, 89686, 49174, 38904, 125818, -32665, -40642, -339275, -2948, -21752, -124106, -293543, 331771, 330718, -190633, 101122, -149526, -191463, -39385, 152910, -109849, -75361, 9046, 274524, 36392, -109627, -177981, -95879, 59245, 325920, -65650, -158418, 136677, -103788, -131271, 788, -121630, -46022, -323771]
9748c23771E5456b04086r4985n3600f3809A69705c89086A93794c27189a16155
9737a03276j03338M5434k924p594A49306b3308j68794e7478k16769B57245C3121
9725G9819c25631A3664c9594l63375h6903l23057a10432C4749l325a0749C7667
9713C071K42600i341E3939a09757G5386J64831a40519b570l2276j82024J04089
9702a12781j85000a05097C0833b95895B00743F151b41791C4159b49336K4719Q2585
9691a42032B24507a1361B87276f8224j18876o7197p3667I9348D6262a65628n1708
9680b17336k29992a14905F1706c95171a90402A65702b13832G7442b19741r0483
9670c10224R0910m1175B8027a30931l27664J98476i131l62322e4479m23453J7150
$$ y = [-323771, 55456, -204086, -299071, -352671, -63809, 169705, -389086, 193794, -327189, -116155, -103276, -206614, -161180, -164104, -171698, 149306, -23308, -192102, -57478, -274247, 257245, 33121, 79819, -325631, 13664, -39594, -402969, -86903, -409960, -110432, 34749, 31424, -10749, 37667, 3071, 245671, -9341, 53939, -109757, 75386, 240217, -140519, -2570, -34846, -216870, -112781, -297781, -105097, 30833, -295895, 200743, 6151, -241791, 34159, -249336, -224617, -142032, 224507, -11361, 287276, -68224, -187100, -254297, -327964, 99348, 46262, -165628, -217336, -447328, -114905, 61706, -395171, -190402, 165702, -213832, 77442, -219741, -310224, -219314, -260489, 28027, -130931, -458595, -260119, -9131, -371453, -54479, -477932, -460782]
9659d60782F3427k28a40884P792n081k51769A2967b06983A81705c34299a36638
9647b31120I1518a41327f9372j44002A16461f4145j24215P8561c6996A25113a01050
9635a25773A54468G5008B0851B324a29620J643C5980h0326k75800J32963m1968
9624b65131P1806C26575A8053M7813d3090l1221F3851e2483k64799i7045d0064
9612A18998J37995a71420A0866a63973I0571b06063h1517i994k82001a22881d3414
9600e5857r2548q4528A08925b003k83052a17520c5134C7310F914a75991O2418
9589a13573k05491B0075e8121A38466d8044k73474B9354a53482P4552B91616i0992
9577B01057d9050B54078a43878M3025B08172b47043C42500a306A76212E21J00234
$$ y = [-460782, 63427, 63199, -140884, -133092, -138173, -389942, 12967, -206983, 181705, -334299, -136638, -231120, 91518, -141327, -69372, -213374, 116461, -64145, -188360, -109799, -36996, 125113, -101050, -125773, 154468, 75008, 20851, 2324, -129620, -127977, 35980, -80326, -356126, -223163, -265131, -193325, 326575, 18053, 65866, -43090, -74311, 63851, -52483, -317282, -97045, -40064, 118998, 256993, -171420, 10866, -163973, 90571, -206063, -81517, -9994, -291995, -122881, -43414, -55857, -148405, -232933, 108925, -2003, -285055, -117520, -35134, 37310, 6914, -175991, -113573, -319064, 20075, -58121, 138466, -48044, -321518, 29354, -153482, -78930, 291616, -90992, 201057, -49050, 254078, -143878, -100853, 208172, -247043, 342500, -1306, 176212, 521, 100755]
9566A00755O5279F625b22505M1016h2667A33335a80829C9846h8547k9071l91954
9555e09572I5189g9255l17334C7666c695A72422A1401J58747B9907b75474N9318
9544b16156e1499j23652F8389a34324f6980j97353B54129E8963J8128a59435j52388
9533c11823i3860j55467J12947B75066j21830b61306j55603b01154l88707i0729
9522a44871k17666C30207a57100A69421c0634l62990e8004A86059i5610q5817
9512a81427H3851a42737B4532c44424f9971j01149A94365p4717b17548b13A88326
9500b04648e8190K8413j34034P7391j70919A83946N7411a14434l08101J60005
9490b62530A47836a70483k47912a44070o169A68022F9935c7256A3317K695d86755
$$ y = [100755, 166034, 6625, -222505, -181489, -82667, 133335, -180829, 39846, -88547, -117618, -509572, 95189, -79255, -396589, 37666, -3695, 172422, 11401, 170148, 29907, -275474, -216156, -51499, -175151, 68389, -134324, -66980, -264333, 254129, 58963, 77091, -159435, -311823, -93860, -249327, -136380, 275066, 153236, -261306, -416909, -201154, -589861, -90729, -144871, -362537, 330207, -157100, 169421, -30634, -393624, -58004, 186059, -95610, -181427, 83851, -142737, 24532, -344424, -69971, -171120, 194365, 119648, -217548, -213, 188326, -204648, -58190, -29777, -163811, -86420, -257339, 183946, 241357, -114434, -422535, -262530, 147836, -170483, -418395, -144070, -150239, 168022, 69935, -37256, 13317, 16012, -486755]
9478b77849b7430o6062k54636J49741A98354g2105l6483E7437J62836g3030j54070
9467b27100b1099j27833e8744C1275b13407C4847a68279Q2487a9268q353k62915
9456b90536a23541e4855m53437I4105K40287a07018k08307A32047b34270h3675
9445A50169g1786R360j5019F4882k6149A5004M4015b31527G2767h6152p5917B12752
9432b66687C7637g5212C9555d16917a04480M837L4281C13538g5886A49051o1366
9421H7685a4141A20668a50501e5589b1854k57353H9175a05680M7842a5591F1157
9409a30427B63719a17754M414N4966A22411a1931j8790l3707q7473B97822F4779
9397b9544k08775A4605a90358P5393A22324a03544B94258e1502G5939j2385f3283
$$ y = [-277849, -27430, -93492, -348128, -198387, 198354, -72105, -108588, 57437, 220273, -73030, -227100, -21099, -148932, -58744, 31275, -213407, 34847, -168279, -85792, -19268, -27621, -290536, -123541, -54855, -508292, 94105, 334392, -107018, -315325, 132047, -234270, -83675, 150169, -71786, -62426, -77445, 64882, 38733, 15004, 59019, -231527, 72767, -86152, -162069, 212752, -266687, 37637, -75212, 39555, -416917, -104480, -99643, -65362, 313538, -75886, 149051, 87685, -14141, 120668, -150501, -55589, -21854, -279207, 89175, -105680, -57838, -15591, 61157, -130427, 263719, -117754, -113340, -58374, 122411, -11931, -30721, -64428, -151901, 297822, 64779, -29544, -238319, 14605, -190358, -114965, 122324, -103544, 294258, -51502, 75939, 63554, -63283]
9385c5714o7918A3857K760c28701R0347a13327J763j19430A59808c62851A99190
9373a17911D7402K6952b79939A54414b91245B9648J39115a78430B05175c07667
9362A4939d9438h913j96909k40998B31126b33018A6810J50028K232f0607j3321
9351g3928o9414L941A35153a62688L4458f0146j88707L102j0447G3663d0142a5994
9338B65830N8027a47805H6001J34554a07065m9826a9813H071e1652k4989q338
9327h4979j14705n8739c2013A1550d2875m0809L7174n8868e489o7946B98423a00406
9314A9374a47216o1703f758A76771e42281a29215F008a42386m5071D8898b16894
9302a81111b8006j74079n9528R9358k409d5339k81983B58532b46346F8574c0463
$$ y = [-35714, -103632, 13857, 16617, -328701, -238354, -113327, -111564, -230994, 159808, -362851, 199190, -117911, 47402, 74354, -279939, 154414, -291245, 29648, 168763, -178430, 205175, -307667, 14939, -49438, -8913, -205822, -446820, 231126, -233018, 16810, 166838, 169070, -60607, -73928, -143342, -139401, 135153, -162688, -128230, -60146, -248853, -245751, -256198, 73663, -40142, -15994, 265830, 323857, -147805, 86001, 220555, -107065, -156891, -19813, 8071, -51652, -76641, -84979, -199684, -258423, -32013, 11550, -42875, -83684, -46510, -105378, -5489, -73435, 298423, -100406, 19374, -147216, -208919, -6758, 176771, -542281, -129215, 6008, -142386, -187457, 48898, -216894, -181111, -28006, -202085, -261613, -162255, -164664, -45339, -327322, 258532, -246346, 68574, -30463]
9290A67712a89049B27L64026e6523B23270b78146C834J29338J43016f8531A2056
9278B02211i2832o5772a6648G8287J01931c92831c6191l30035a65624D1158a26177
9266B25125d0758n052A22661a78790F5591l1814c41046J60455E636h5262b3097
9254A79678P143h3242q1530L3243B18492c91404B5628a48014B02132a25255d4051
9242b79427J08457A53918b23432B61343a41113k1290I497c9800A11212b00210
9231B5794O5843b45562B70346H5789e53434K74205A16400g5746l6271l34055g0184
9219A3667b17205P8288E7308a24705b9017j50941d6630C1377f4706k50089E5394
9207f5536F3206J2698h855l1456l3623k6272I2299a07262c3684H251a22157j843
$$ y = [167712, -189049, 227, 364253, -56523, 223270, -278146, 3834, 133172, 276188, -68531, 12056, 202211, -92832, -158604, -16648, 78287, 180218, -392831, -36191, -366226, -165624, 41158, -126177, 225125, -40758, -45810, 122661, -178790, 65591, 33777, -341046, -180591, 5636, -85262, -23097, 179678, 186821, -83242, -164772, -131529, 218492, -391404, 25628, -148014, 202132, -125255, -44051, -279427, -170970, 153918, -223432, 261343, -141113, -162403, 9497, -39800, 111212, -200210, 25794, 91637, -245562, 270346, 85789, -553434, -279229, 116400, -75746, -112017, -446072, -70184, 13667, -217205, -138917, 57308, -124705, -29017, -179958, -46630, 31377, -64706, -314795, 55394, -65536, 63206, 75904, -8855, -40311, -73934, -100206, 92299, -107262, -33684, 8251, -122157, -124000]
9195a24000l53143D2020R1523b97265B5659p221b10439q1774O1504E2431K21786
9184B74217i7797F4564K1881a05023k5263H9655B5678G215f8596j60068K8118
9173b00546q1301a38088A91429a98882a933n4559K7905j42733A22412a03623j76609
9162b80232M8841k8851i0819k2833j36313O8834B15102A00820a01213q1897N4396
9151a28714B45525b39758B72713a00702A03681j6261d0105H6585H677c7267A2282
9139C30064a44354O2750L4645k04648e3314j58062h4974r1127j22997L9063i7513
9127A05395K11678a01292E1914k2276m744a77550A06582b88762A09000b21041
9116i8219l18547A67229i3669j8323j17327f5697k7580K6611B79616a11437c5856
$$ y = [-124000, -477143, 42020, 133543, -297265, 25659, 18438, -210439, -292213, -230709, 52431, 274217, -97797, 64564, 86445, -105023, -130286, 89655, 25678, 7215, -68596, -228664, -200546, -281847, -138088, 191429, -198882, -1933, -56492, -28587, -171320, 122412, -103623, -280232, -231391, -260242, -90819, -113652, -249965, -181131, 215102, 100820, -101213, -183110, -128714, 245525, -239758, 272713, -100702, 103681, 87420, -40105, 86585, 8677, -37267, 12282, 330064, -144354, -81604, -46959, -251607, -53314, -211376, -84974, -176101, -299098, -260035, -97513, 105395, 317073, -101292, 51914, 29638, 24894, -177550, 106582, -288762, 109000, -221041, -98219, -416766, 167229, -93669, -111992, -229319, -65697, -93277, -66666, 279616, -111437, -35856]
9104b5923n5521k21006i7028B1193K0172a10007D7498b06424n5954j09307J83785
9093a87900A3965R970b43758I2381c04423B2448b3351j43838j85219J04070H0598
9081b53427f2989j4805K5759k6156l23270g4917D01538g7011r9411C16756b07256
9069A38497j7190J120D5431b80550k4047J6385B35449b10771g3526H2239b47990
9057a48671q3433I0366E670a63821q4894K4149g6323H6889b82452B63248E5513
9045c12815A21884R434D5999g2540A60862a27779K4299A92704c05444f8980k05547
9034b74527d0519l0053l3275k22942g7500D12788D2464J02404f6800A46450b10156
9022g1668F168J26963f3009j4325E0184c59350e1408B40065h5203E4853L5524
$$ y = [-25923, -81444, -302450, -97028, 21193, 41365, -110007, 47498, -206424, -262378, -371685, -187900, 13965, 23935, -243758, 92381, -304423, 22448, -23351, -167189, -352408, -248338, 80598, -253427, -62989, -77794, -52035, -78191, -401461, -74917, 401538, -77011, -176422, 316756, -207256, 138497, 121307, 122427, 45431, -280550, -304597, -288212, 235449, -210771, -73526, 82239, -247990, -148671, -232104, 90366, 5670, -163821, -248715, -224566, -76323, 86889, -282452, 263248, 55513, -312815, 121884, 131318, 45999, -72540, 160862, -127779, -103480, 192704, -305444, -68980, -274527, -40519, -70572, -103847, -326789, -77500, 412788, 42464, 144868, -66800, 146450, -210156, -71668, 6168, 133131, -63009, -77334, 50184, -359350, -51408, 240065, -85203, 54853, 90377]
9011I0377c02535B92193A41942b33183I0987f9924m4254C23847A04271M8178J58556
9000C11005A07524a12362R995B8515J49834p8068b77887a621A2507c36974k6644
8989c63618a46093j8275N1818B91185n5713F9928d8800j73376O5248q417a1966
8977f5545A90638C2198b7116I2085g1303L4243F2488a29919A46300B1081b05453
8965b48687C4961J5781R868a54408p1508e3857j99127k30831D2917b83630B7711
8953H1842B4790Q5162h4495l29910J24241E0157h995B42282b3344l4597n1072
8942a09013B46521a01832B86422f6580q4655A9061M5225L38115G6791i4589J881
8931i2708n1977B68237a57841B26177J32538R64J70957M27478K905693O302368
$$ y = [90377, -302535, 292193, 141942, -233183, 90987, -69924, -114178, 323847, 104271, 152449, 311005, 107524, -112362, -102367, 28515, 178349, 100281, -277887, -1621, 12507, -336974, -363618, -146093, -164368, -112550, 291185, 235472, 69928, -48800, -222176, -156928, -165345, -11966, -65545, 190638, 32198, -27116, 92085, -71303, -37060, 62488, -129919, 146300, 21081, -205453, -248687, 34961, 50742, 60610, -154408, -225916, -53857, -252984, -483815, 42917, -283630, 27711, 81842, 24790, 109952, -84495, -414405, -290164, 50157, -8995, 242282, -23344, -57941, -109013, 246521, -101832, 286422, -66580, -151235, 19061, 64286, 402401, 76791, -94589, -92708, -144685, 268237, -157841, 226177, 358715, 359679, 530636, 958114, 3863807, 10166175]
8921A0166175k493697A983113D62055j07064A69136A484d3978j08625m6318G8136
8910C85272j13770b80521A60933J01808j3468b08645O4157j88466J12221d6068
8899G5002k8529c47778I4899a97939A03290A3818a58857A25771f269k8363G5726
8887G655g3600k62911J47009G1901J30906b5474j50780A8347J833K25837H1930
8875D3173b74065J04140I477b35550l8079a33880l9653B81348a06989B09055b64986
$$ y = [10166175, 7672478, 1983113, 462055, 354991, 169136, 1484, -43978, -152603, -198921, 78136, 385272, 271502, -280521, 160933, 262741, 249273, -208645, -144488, -332954, -220733, -46068, 75002, 46473, -347778, 94899, -197939, 103290, 13818, -158857, 125771, -6269, -34632, 75726, 7655, -73600, -336511, -189502, 71901, 202807, -25474, -176254, 18347, 20180, 246017, 81930, 43173, -274065, -169925, 9477, -235550, -273629, -133880, -173533, 281348, -106989, 209055, -264986]
$$ [...]
##END NTUPLES=NMR SPECTRUM
##END=
