##TITLE=AC1606_TANAH13336_8316815_klo7cDLdu6
##JCAMPDX= 6.0         $$ Bruker NMR JCAMP-DX V2.0
##DATA TYPE= NMR SPECTRUM
##DATA CLASS= NTUPLES
##ORIGIN= BRUKER
##OWNER= Administrator
$$ 1.72 TOPSPIN		Version 2.1
$$ 2013-11-09 22:27:27.166 -0800  Administrator@X
$$ Compression mode = diff/dup
##.OBSERVE FREQUENCY= 400.02188249412
##.OBSERVE NUCLEUS= ^1H
##.ACQUISITION MODE= SIMULTANEOUS (DQD)
##.ACQUISITION SCHEME= undefined
##.AVERAGES= 64
##.DIGITISER RES= 22
##SPECTROMETER/DATA SYSTEM= spect
##.PULSE SEQUENCE= noesygpps1d.comp
##.SOLVENT NAME= COFFEE_meoh
##.SHIFT REFERENCE= INTERNAL, COFFEE_meoh, 1, 14.96096
##AUDIT TRAIL= $$ (NUMBER, WHEN, WHO, WHERE, PROCESS, VERSION, WHAT)
$$ ##TITLE= Audit trail, TOPSPIN		Version 2.1
$$ ##JCAMPDX= 5.01
$$ ##ORIGIN= Bruker BioSpin GmbH
$$ ##OWNER= Administrator
$$ $$ E:\/data/COFFEE/nmr/AC1606_TANAH13336_8316815_klo7cDLdu6/12/pdata/1/auditp.txt
$$ ##AUDIT TRAIL=  $$ (NUMBER, WHEN, WHO, WHERE, PROCESS, VERSION, WHAT)
(   1,<2013-11-09 22:27:21.963 -0800>,<Administrator>,<X>,<go>,<TOPSPIN 2.1>,
      <created by zg
	started at 2013-11-09 22:15:53.150 -0800,
	POWCHK enabled, PULCHK disabled,
       configuration hash MD5:
       C8 4E 4E 5D D3 5C D8 9E 9F 52 82 E0 59 8A DE 15
       data hash MD5: 64K
       D2 7D 1D 25 28 F4 95 17 C4 93 49 2D 5D 38 3B 86>)
(   2,<2013-11-09 22:27:25.151 -0800>,<Administrator>,<X>,<proc1d>,<TOPSPIN 2.1>,
      <Start of raw data processing
       efp LB = 0.3 FT_mod = 6 PKNL = 1 PHC0 = 0 PHC1 = 0 SI = 128K 
       data hash MD5: 128K
       6F 80 9A 4A 15 04 10 73 D7 DB 75 6B 49 AC 88 13>)
(   3,<2013-11-09 22:27:26.182 -0800>,<Administrator>,<X>,<proc1d>,<TOPSPIN 2.1>,
      <pk PHC0 = -88.30261 PHC1 = 0 
       data hash MD5: 128K
       CA 1A B5 D6 58 57 AC 6F 35 24 A6 48 F5 4D 7A 1F>)
(   4,<2013-11-09 22:27:26.588 -0800>,<Administrator>,<X>,<proc1d>,<TOPSPIN 2.1>,
      <abs ABSG = 1 
       data hash MD5: 128K
       E3 8E 2F 80 70 62 5A 5A 9D 8F 5F 4D 5B 8E 40 92>)
(   5,<2013-11-09 22:27:26.698 -0800>,<Administrator>,<X>,<proc1d>,<TOPSPIN 2.1>,
      <abs ABSG = 2 
       data hash MD5: 128K
       5D E7 B7 B2 6D 1F EF 98 5D C9 D4 8A 75 62 37 A4>)
(   6,<2013-11-09 22:27:26.807 -0800>,<Administrator>,<X>,<proc1d>,<TOPSPIN 2.1>,
      <abs ABSG = 3 
       data hash MD5: 128K
       93 F6 42 C9 A3 50 89 31 15 D1 66 7F D2 7B B4 6F>)
(   7,<2013-11-09 22:27:26.885 -0800>,<Administrator>,<X>,<proc1d>,<TOPSPIN 2.1>,
      <abs ABSG = 4 
       data hash MD5: 128K
       F8 6D D7 73 49 09 F6 04 A0 B9 32 09 13 99 D6 E8>)
(   8,<2013-11-09 22:27:26.994 -0800>,<Administrator>,<X>,<proc1d>,<TOPSPIN 2.1>,
      <abs ABSG = 5 
       data hash MD5: 128K
       A6 BF 6F BD 9C 82 33 D7 2C 63 4B 73 46 DE 0C 63>)
$$ ##END=
$$ 
$$ $$ hash MD5
$$ $$ 04 E5 10 AE B1 7C 7A 65 70 0F FF D4 75 32 46 EA
##$RELAX= 
##$RELAX= 
##$RELAX= 
##$RELAX= 
##$RELAX= 
##$RELAX= 
##$RELAX= 
##$RELAX= 
$$ Bruker specific parameters
$$ --------------------------
##$DU= <E:\>
##$EXPNO= 12
$$ [...]
##$TP07= 0
##$TPNAME0= <>
##$TPNAME1= <>
##$TPNAME2= <>
##$TPNAME3= <>
##$TPNAME4= <>
##$TPNAME5= <>
##$TPNAME6= <>
##$TPNAME7= <>
##$TPOAL= (0..7)
0.5 0.5 0.5 0.5 0.5 0.5 0.5 0.5
##$TPOFFS= (0..7)
0 0 0 0 0 0 0 0
##$TUNHIN= 0
##$TUNHOUT= 0
##$TUNXOUT= 0
##$USERA1= <user>
##$USERA2= <user>
##$USERA3= <user>
##$USERA4= <user>
##$USERA5= <user>
##$V9= 5
##$VALIST= <valist>
##$VCLIST= <CCCCCCCCCCCCCCC>
##$VD= 0
##$VDLIST= <DDDDDDDDDDDDDDD>
##$VPLIST= <PPPPPPPPPPPPPPP>
##$VTLIST= <TTTTTTTTTTTTTTT>
##$WBST= 1024
##$WBSW= 4
##$XGAIN= (0..3)
0 0 0 0
##$XL= 0
##$YL= 0
##$YMAX_a= 6242782
##$YMIN_a= -12630322
##$ZGOPTNS= <>
##$ZL1= 120
##$ZL2= 120
##$ZL3= 120
##$ZL4= 120
##$ABSF1= 14.96096
##$ABSF2= -5.597221
##$ABSG= 5
##$ABSL= 3
##$ALPHA= 0
##$AQORDER= 0
##$ASSFAC= 0
##$ASSFACI= 0
##$ASSFACX= 0
##$ASSWID= 0
##$AUNMP= <proc_prof1d_extract.lims>
##$AXLEFT= 0
##$AXNAME= <>
##$AXNUC= <1H>
##$AXRIGHT= 0
##$AXTYPE= 0
##$AXUNIT= <>
##$AZFE= 0.1
##$AZFW= 0.1
##$BCFW= 0
##$BC_mod= 0
##$BYTORDP= 0
##$COROFFS= 0
##$CY= 15
##$DATMOD= 1
##$DC= 0
##$DFILT= <>
##$DTYPP= 0
##$F1P= 0
##$F2P= 0
##$FCOR= 0.5
##$FTSIZE= 131072
##$FT_mod= 6
##$GAMMA= 0
##$GB= 0
##$INTBC= 1
##$INTSCL= 1
##$ISEN= 128
##$LB= 0.3
##$LEV0= 0
##$LPBIN= 0
##$MAXI= 10000
##$MC2= 0
##$MEAN= 0
##$ME_mod= 0
##$MI= 0
##$NCOEF= 0
##$NC_proc= -2
##$NLEV= 6
##$NOISF1= 0
##$NOISF2= 0
##$NSP= 0
##$NTH_PI= 0
##$NZP= 0
##$OFFSET= 14.96096
##$PC= 1
##$PHC0= -88.30261
##$PHC1= 0
##$PH_mod= 1
##$PKNL= yes
##$PPARMOD= 0
##$PPDIAG= 0
##$PPIPTYP= 0
##$PPMPNUM= 2147483647
##$PPRESOL= 1
##$PSCAL= 4
##$PSIGN= 0
##$PYNMP= <proc.py>
##$REVERSE= no
##$SF= 400.020009651439
##$SI= 131072
##$SIGF1= 0
##$SIGF2= 0
##$SINO= 400
##$SIOLD= 131072
##$SPECTYP= <>
##$SREGLST= <1H.CDCl3>
##$SSB= 0
##$STSI= 131072
##$STSR= 0
##$SW_p= 8223.68421052631
##$SYMM= 0
##$S_DEV= 0
##$TDeff= 65536
##$TDoff= 0
##$TI= <>
##$TILT= no
##$TM1= 0
##$TM2= 0
##$TOPLEV= 0
##$USERP1= <user>
##$USERP2= <user>
##$USERP3= <user>
##$USERP4= <user>
##$USERP5= <user>
##$WDW= 1
##$XDIM= 131072
##$YMAX_p= 436111502
##$YMIN_p= -11245
##$CURPLOT= <Network HP LaserJet P1505>
##$CURPRIN= <$Network HP LaserJet P1505>
##$DFORMAT= <normdp>
##$LAYOUT= <+/1D_H.xwp>
##$LFORMAT= <normlp>
##$PFORMAT= <normpl>
##$SURQMSG= 1
$$ End of Bruker specific parameters
$$ ---------------------------------
##NTUPLES= NMR SPECTRUM
##VAR_NAME=  FREQUENCY,     SPECTRUM/REAL,   SPECTRUM/IMAG
##SYMBOL=    X,             R,               I
##VAR_TYPE=  INDEPENDENT,   DEPENDENT,       DEPENDENT
##VAR_FORM=  AFFN,          ASDF,            ASDF
##VAR_DIM=   131072,        131072,          131072
##UNITS=     HZ,            ARBITRARY UNITS, ARBITRARY UNITS
##FACTOR=    0.0627417313425164, 1,          1
##FIRST=     8223.62146879497, -733,         -68294
##LAST=      0,             2340,            -69554
##MIN=       0,             -11245,          0
##MAX=       8223.62146879497, 436111502,    0
$$ Real data points
##PAGE= N=1
##DATA TABLE= (X++(R..R)), XYDATA
$$ [...]
61609D38451l343m212m769n122n570o225o876p227p156o737o192n837n719n358
61595C58108m265k883k371l157m190m186l231k511k631k977k799k258k017k171
61581C16461k152j605r67q88j338j628j360q76o17m04J84J002J426J137L92l83
61565C08384q00n20L88J147J001K06l34l04j16R5O54J422J683J332J150J536J891
61548C18815J826J899K475K803K212J356J198J431J049M1o40n23N7Q60J938L018
61532C39815L658L949M193M043K907J150j31n99r95j823k666l027l036l013l008
61517C41417l029l113k961k209j215q14j065j006j00R26J135O52K32J37O6q3q7
61500C28883J15L31M89O76Q30P12K15m25p90n89O9P13R62R67J118J341J079J18
$$ y = [438451, 435108, 430896, 426127, 421005, 415435, 409210, 402334, 395107, 387951, 381214, 375022, 369185, 363466, 358108, 353843, 350960, 348589, 345432, 341242, 337056, 333825, 331314, 328683, 325706, 322907, 320649, 318632, 316461, 314309, 312704, 311737, 310849, 309511, 307883, 306523, 305647, 305030, 304626, 304810, 305812, 307238, 308375, 308767, 308384, 307584, 307064, 307452, 308599, 309600, 309806, 309472, 309168, 309052, 309147, 309801, 311223, 312906, 314238, 315388, 316924, 318815, 320641, 322540, 325015, 327818, 330030, 331386, 332584, 334015, 335064, 335105, 334465, 333942, 333999, 334859, 336797, 339815, 343473, 347422, 351615, 355658, 358565, 359715, 359584, 358985, 357990, 356167, 353501, 350474, 347438, 344425, 341417, 338388, 335275, 332314, 330105, 328890, 328076, 327011, 326005, 325905, 326831, 327966, 328618, 328850, 328987, 329053, 328970, 328883, 328998, 329329, 329818, 330494, 331324, 332036, 332251, 331826, 331036, 330447, 330516, 331229, 332191, 333158, 334276, 335617, 336696, 336814]
61482C36814q69j054l94M10Q61J171J754K548L065L061K858K868K932K458J259
61467C59742j07r33j061p37j62M85Q56P36M40M05M97J79n89j182j126o87l75k21
61449C56160J97J149K342L085K852J848R58R20J567K121K196K183K607L403M054
61434C87642M191L874L323K614J752R67O85R66J148M78p91j515j077k27m2m93
61418D03495o57q8P03J082R67N87J03l69p11r00r78r36q99j170j751k046j568
61401C94864p79o10j228j923k202k300k430k300j648p68j08K46M20M75M51M04
61385C80564K21j98m83o8R07J545J392J153J699K861L777M080M097M012L562K664
61369D11785J801J483J693K019K177K113J763J092L55P5M74J117J355J136J019
$$ y = [336814, 335945, 334891, 334497, 334907, 335768, 336939, 338693, 341241, 344306, 347367, 350225, 353093, 356025, 358483, 359742, 359635, 358702, 357641, 356904, 356742, 357227, 358083, 358819, 359259, 359664, 360161, 360340, 359751, 358569, 357443, 356756, 356381, 356160, 356357, 357506, 359848, 362933, 365785, 367633, 368591, 369511, 371078, 373199, 375395, 377578, 380185, 383588, 387642, 391833, 395707, 399030, 401644, 403396, 404363, 405048, 406014, 407162, 407640, 406849, 405334, 404257, 404030, 403988, 403495, 402838, 402750, 403453, 404535, 405502, 406089, 406192, 405823, 405112, 404212, 403234, 402298, 401399, 400229, 398478, 396432, 394864, 394085, 393475, 392247, 390324, 388122, 385822, 383392, 381092, 379444, 378676, 378568, 378814, 379234, 379709, 380160, 380564, 380785, 380587, 380104, 380036, 380943, 382488, 383880, 385033, 386732, 389593, 393370, 397450, 401547, 405559, 409121, 411785, 413586, 415069, 416762, 418781, 420958, 423071, 424834, 425926, 426281, 426356, 426830, 427947, 429302, 430438, 431457]
61354D31457J452K382L687N439P424Q896R325R037Q652Q199P452O737O581O680
61340E23400O147M895L896L751L888L520K755K234K224K559K975K987J918l24
61326E66825k788m344m846m974n205n435n382m856l721k110o46K7l9k02m3M02
61310E22663J180K658M911P313R127J0378J1760J3715J5796J7000J6500J4128
61298F47129J0509O844M164K410M53k490n659p557p902p987q831r835r895r087
61284F02266q375q144q048p980q128q076o951m712k360n63J009K679M007M559
61270E51183M661M748M667M242L966M367N117N524N569N797O430P241Q051Q729
61256F30292Q968Q645Q206Q057P763O568M572K689J472P00J49n0k4l81j417k645
$$ y = [431457, 432909, 435291, 438978, 444417, 451841, 460737, 470062, 479099, 487751, 495950, 503402, 510139, 516720, 523400, 529547, 534442, 538338, 542089, 545977, 549497, 552252, 554486, 556710, 559269, 562244, 565231, 567149, 566825, 564037, 559693, 554847, 549873, 544668, 539233, 533851, 528995, 525274, 523164, 522518, 522545, 522506, 522304, 522261, 522663, 523843, 526501, 531412, 538725, 547852, 558230, 569990, 583705, 599501, 616501, 633001, 647129, 657638, 664482, 668646, 671056, 671509, 669019, 663360, 655803, 647901, 639914, 631083, 621248, 611353, 602266, 593891, 585747, 577699, 569719, 561591, 553515, 546564, 541852, 539492, 538929, 539938, 542617, 546624, 551183, 555844, 560592, 565259, 569501, 573467, 577834, 582951, 588475, 594044, 599841, 606271, 613512, 621563, 630292, 639260, 647905, 656111, 664168, 671931, 678499, 683071, 685760, 687232, 687932, 688081, 688031, 688007, 687626, 686209, 683564]
61240F83564l490m026m593n086n135m791m432m164l751l166k702k451k039j179
61226F32559j24P81J686K904M127M578M102L473L362L495L374L292L860M862N373
61211F81704N073M558M257L796K740J353J58o09q32l34O24J272J290J488K901
61196G09439N533Q458J0937J2896J4594J6258J7881J8897J8379J6009J2614R236
61184H71131O150L314J260N79P75O42j61r19j339k165l926n927p163p599p943
61169H46709q528r045r106q627p870p460q085r671j1152j1574j1257j1294j1998
61156G21042j2512j2084j1024r947q671o619m052k094j302q84J41J452J738K94
61142F55478k311n088p488r248j0104j0047r432q481p087n368l927l100k439j379
$$ y = [683564, 680074, 676048, 671455, 666369, 661234, 656443, 652011, 647847, 644096, 640930, 638228, 635777, 633738, 632559, 632435, 633216, 634902, 637806, 641933, 646511, 650613, 654086, 657448, 660943, 664317, 667609, 671469, 676331, 681704, 686777, 691335, 695592, 699388, 702128, 703481, 703639, 703030, 702198, 701864, 702488, 703760, 705050, 706538, 709439, 714972, 723430, 734367, 747263, 761857, 778115, 795996, 814893, 833272, 849281, 861895, 871131, 877281, 880595, 881855, 882434, 883209, 883851, 883690, 882771, 881432, 879267, 875341, 869414, 862251, 854652, 846709, 838181, 829136, 820030, 811403, 803533, 796073, 787988, 778317, 767165, 755591, 744334, 733040, 721042, 708530, 696446, 685422, 675475, 666804, 660185, 656133, 654039, 652737, 651853, 651994, 653446, 655184, 655478, 653167, 648079, 640591, 631343, 621239, 611192, 601760, 593279, 586192, 580824, 576897, 573797, 571358, 569979]
61128E69979n7J135K340L852N322O193O846Q320J0873J3577J5572J6994J8402
61115F79348J9967K1526K2883K3784K4070K4080K4376K4896K4981K4454K3966
61104I38331K3893K3566K2111J9537J6439J3078R388N509J688k121o081j0011
61092A055327j3591j6722j9334k1137k2073k2617k3199k3590k3435k3008k2758
61081H23863k2451k1524k0115j8865j7802j6294j4252j2460j1438j0729r676q250
61069F40007o793n401m068k960k149j393m79M63J278K044K827L508M130N001O170
61054F42185P139P497P500P728Q406R459J0931J2886J5066J6998J8507J9798K1135
61041H05235K2649K4357K6106K7525K8319K8577K8772K9381L0494L1695L2399
$$ y = [569979, 569922, 571057, 573397, 577249, 582571, 588764, 595610, 603930, 614803, 628380, 643952, 660946, 679348, 699315, 720841, 743724, 767508, 791578, 815658, 840034, 864930, 889911, 914365, 938331, 962224, 985790, 1007901, 1027438, 1043877, 1056955, 1066343, 1071852, 1073540, 1071419, 1065338, 1055327, 1041736, 1025014, 1005680, 984543, 962470, 939853, 916654, 893064, 869629, 846621, 823863, 801412, 779888, 759773, 740908, 723106, 706812, 692560, 680100, 668662, 657933, 648257, 640007, 633214, 627813, 623745, 620785, 618636, 617243, 616764, 617227, 618505, 620549, 623376, 626884, 631014, 636015, 642185, 649324, 656821, 664321, 672049, 680455, 689914, 700845, 713731, 728797, 745795, 764302, 784100, 805235, 827884, 852241, 878347, 905872, 934191, 962768, 991540, 1020921, 1051415, 1083110, 1115509]
61030A115509L2511L2596L3213L4236L5236L6273L7683L9296M0540M1338M2070
61019A520501M2605M2474M2216M3511M7451N3651O1498P1093Q2117R2978J02320
61008B202415J10840J20760J34355J53776J81199K18007K64958L24414M01068
60999D111792M99413O22540P75103R63924J191791J453614J742495K049588K337503
60990A5747763K509313K431643K028613J370692O59298J06392j79879k07795m0603
60981B4425437K39806N12151O09984L94588j41188q48203j511709j975783k198504
60972A9506579k220474k106779j914816j688546j458265j240416j042284q68221
60964F966778p20647n98175m97211m15498l51911l03721k66741k37903k15628
$$ y = [1115509, 1148020, 1180616, 1213829, 1248065, 1283301, 1319574, 1357257, 1396553, 1437093, 1478431, 1520501, 1563106, 1605580, 1647796, 1691307, 1738758, 1792409, 1853907, 1925000, 2007117, 2100095, 2202415, 2313255, 2434015, 2568370, 2722146, 2903345, 3121352, 3386310, 3710724, 4111792, 4611205, 5233745, 6008848, 6972772, 8164563, 9618177, 11360672, 13410260, 15747763, 18257076, 20688719, 22717332, 24088024, 24747322, 24853714, 24673835, 24466040, 24425437, 24665243, 25177394, 25787378, 26181966, 26040778, 25192575, 23680866, 21705083, 19506579, 17286105, 15179326, 13264510, 11575964, 10117699, 8877283, 7834999, 6966778, 6246131, 5647956, 5150745, 4735247, 4383336, 4079615, 3812874, 3574971, 3359343]
60955C359343j98001j82822j69290j57651j47167j36215j24459j13061j02653
60946B028024r2859q4003p7420p3539p1064o8665o6140o3608o0821n7884n5384
60935A256637n3254n0617m7244m4039m1469l8733l5138l1405k8715k7211k6107
60924H32705k4665k2604k0105j7808j6227j4954j3207j1290j0443j0903j1176
60913F59323r924p535n210l382j878p50n6O18J507K064J740R38M10K09k9j45K73
60896F38173R54J052K32r70j863k301k606l064l533l550k971k394k560l417m364
60881F06818n300o648q291r371r425q991q745q751q845q972q824q003o891o474
60867D93287o851o933o107n112m628m092k869j531q93o42lQ84J463J904K559K860
$$ y = [3359343, 3161342, 2978520, 2809230, 2651579, 2504412, 2368197, 2243738, 2130677, 2028024, 1935165, 1851162, 1773742, 1700203, 1629139, 1560474, 1494334, 1430726, 1369905, 1312021, 1256637, 1203383, 1152766, 1105522, 1061483, 1020014, 981281, 946143, 914738, 886023, 858812, 832705, 808040, 785436, 765331, 747523, 731296, 716342, 703135, 691845, 681402, 670499, 659323, 649399, 641864, 636654, 633272, 631394, 630644, 630588, 631206, 632713, 634777, 636517, 637455, 637865, 638074, 638045, 637900, 638173, 639127, 640179, 640411, 639441, 637578, 635277, 632671, 629607, 626074, 622524, 619553, 617159, 614599, 611182, 606818, 601518, 594870, 586579, 577208, 567783, 558792, 550047, 541296, 532451, 523479, 514655, 506652, 499761, 493287, 486436, 479503, 473396, 468284, 463656, 459564, 456695, 455164, 454271, 453629, 453626, 454510, 455973, 457877, 460436, 463296]
60851D63296K085Q02K37N50R84J444K444L678M115L674L353L432K877J037j220
60836D92788k684l170l072k457j344k72J86J49J11K09K78L78P27J227J437J067
60820D85558K96l81o26o14q54j521k099j972j323j008j548k555l294l533l641
60805D60885l957m365m496m312m220m483m689m209l205k629l112m198m989n133
60791D02888m885m549m271m140m050l694k917j920r77k53L7k26o79p62n99q30
60775C68173j346j126J14J144R87N72J430L363M782N087N278O116O972P003O395
60760D14944N892N696N480N033M475L914L178J935J39j607k437k185j658j686
60746D41113k269k976l604l969l625k614j943k559m034n204n751o221o704o589
$$ y = [463296, 465381, 466183, 466420, 466970, 467954, 469398, 471842, 475520, 479635, 483309, 486662, 490094, 492971, 494008, 492788, 490104, 486934, 483862, 481405, 480061, 479789, 479975, 480124, 480235, 480444, 480722, 481100, 481827, 483054, 484491, 485558, 485854, 485473, 484847, 484233, 483379, 481858, 479759, 477787, 476464, 475456, 473908, 471353, 468059, 464526, 460885, 456928, 452563, 448067, 443755, 439535, 435052, 430363, 426154, 422949, 420320, 417208, 413010, 408021, 402888, 398003, 393454, 389183, 385043, 380993, 377299, 374382, 372462, 371485, 371232, 371269, 371043, 370364, 369602, 369003, 368173, 366827, 365701, 365815, 366959, 367946, 368518, 369948, 373311, 378093, 383180, 388458, 394574, 401546, 408549, 414944, 420836, 426532, 432012, 437045, 441520, 445434, 448612, 450547, 450686, 449079, 446642, 444457, 442799, 441113, 438844, 435868, 432264, 428295, 424670, 422056, 420113, 417554, 413520, 408316, 402565, 396344, 389640, 383051]
60732C83051n686m657m020l607l165k834k724k641k461k303k187j995j773j650
60718C41348j479j002l11K95P64J068Q44p7r77r30p1O00N83K77M0j35q0N28J424
60699C42709J935K023K260K670K592J970J774K624L911M803N316N790O026N682
60685C92085N043M724M856N077N059M659L861K906K228J933J595Q89J76J31Q62
60670D36084J608J352j87k115l155l113l158m242n714o182n443m552m167l811
60656C93205l030k213j856j719j278n08J88N21O08R49K099L864M963M237K145
60641D02175L04m84q87j620k410k793l017l464l864l682k898j888r43l04k31n70
60625C73424o71j12P63J336J422J202Q11K99j94n09n66l72j00p7l94o43m40j9
$$ y = [383051, 377365, 372708, 368688, 365081, 361916, 359082, 356358, 353717, 351256, 348953, 346766, 344771, 342998, 341348, 339869, 338867, 338556, 338851, 339615, 340683, 341527, 341450, 340473, 339543, 339472, 340072, 340655, 340932, 340972, 340837, 340757, 341285, 342709, 344644, 346667, 348927, 351597, 354189, 356159, 357933, 360557, 364468, 369271, 374587, 380377, 386403, 392085, 397128, 401852, 406708, 411785, 416844, 421503, 425364, 428270, 430498, 432431, 434026, 434915, 435091, 435222, 436084, 437692, 439044, 438857, 436742, 433587, 430474, 427316, 423074, 417360, 411178, 405735, 401183, 397016, 393205, 390175, 387962, 386106, 384387, 383109, 382601, 382789, 383310, 383918, 384867, 386966, 390830, 395793, 400030, 402175, 402479, 401995, 401108, 399488, 397078, 394285, 391268, 387804, 383940, 380258, 377360, 375472, 374529, 374225, 373994, 373424, 372753, 372641, 373404, 374740, 376162, 377364, 378175, 378474, 378280, 377771, 377205, 376833, 376733, 376656, 376262, 375619, 375179, 375160]
60607C75160J61J90M68R22J145J138J125Q60J4q20o60K70O36m6o24M3J588K845
60589C84415L247L062K782K758K938K725J693M25o5K26M01J26%K46L45K50O61
60572D06235J627K147J873J974L510N983Q394J0573J2629J4090J4652J4955J5474
60559E14116J5417J3805J0966P860M572O65l416o443p846q041p565o655n498m237
60545E17700k790j239l6O76J534L201N541Q060J0631J3271J5720J7874K0048K2154
60531F32345K3218K2416K0018J6659J2328O987J566k691n581p772r550j0586j0765
60518F88592j0450r999r490q817p732o105m387l294k783k075r53j45P6N85K042
60503F25065L868N478P504J0724J4701J8687K2964K8096L3558L8485M3102M8084
$$ y = [375160, 375321, 375511, 375979, 376901, 378046, 379184, 380309, 381169, 381183, 380363, 379703, 379973, 380609, 380563, 379939, 379982, 381570, 384415, 387662, 390724, 393506, 396264, 399202, 401927, 403620, 404045, 403980, 404206, 404607, 404733, 404733, 404979, 405324, 405574, 406235, 407862, 410009, 411882, 413856, 417366, 423349, 431743, 442316, 454945, 469035, 483687, 498642, 514116, 529533, 543338, 554304, 562164, 566736, 567401, 563985, 557542, 549696, 541655, 534090, 527435, 521937, 517700, 514910, 513671, 513635, 514311, 515845, 519046, 524587, 532647, 543278, 556549, 572269, 590143, 610191, 632345, 655563, 677979, 697997, 714656, 726984, 733971, 735537, 732846, 727265, 719493, 709943, 699357, 688592, 678142, 668143, 658653, 649836, 642104, 635999, 631612, 628318, 625535, 623460, 622507, 622362, 622438, 623023, 625065, 628933, 634411, 641915, 652639, 667340, 686027, 708991, 737087, 770645, 809130, 852232, 900316]
60491I00316N3001N6723N8861N9516N8156N4192M8170M0884L1724J9590N227r021
60479A377339k1847l3752m5007n4473o0893o4096o4468o2376n8522n3930m9098
60468H08877m3911l8516l3542k9351k5882k3153k1124j9156j6603j3851j1836
60457E31952j0642r610q634q167p997p386o420n964o082n832m852l855l268k662
60443D40581j878j461j479j183m25k26j206k456k739j981r54j86O8l40j110j503
60427D21522j270r64r89j059r12p90p48l25N57J162R80M99L98O09Q03J067J508
60410D22048J698J299P31O16R03J081R21N57J52o0K60J138K125K848L378L788
60394D43483L812L280K517J949J641J485J510J736J987K111K119K071K102K529
$$ y = [900316, 953317, 1010040, 1068901, 1128417, 1186573, 1240765, 1288935, 1329819, 1361543, 1381133, 1386360, 1377339, 1355492, 1321740, 1276733, 1222260, 1161367, 1097271, 1032803, 970427, 911905, 857975, 808877, 764966, 726450, 692908, 663557, 637675, 614522, 593398, 574242, 557639, 543788, 531952, 521310, 511700, 503066, 494899, 486902, 479516, 473096, 467132, 461050, 455218, 450366, 446511, 443243, 440581, 438703, 437242, 435763, 434580, 434155, 433929, 432723, 430267, 427528, 425547, 424593, 424407, 424475, 424135, 423025, 421522, 420252, 419288, 418299, 417240, 416328, 415538, 414790, 414465, 415022, 416184, 417164, 417663, 418061, 418670, 419473, 420540, 422048, 423746, 425045, 425776, 426392, 427295, 428376, 429297, 429854, 430006, 429946, 430206, 431344, 433469, 436317, 439695, 443483, 447295, 450575, 453092, 455041, 456682, 458167, 459677, 461413, 463400, 465511, 467630, 469701, 471803, 474332]
60380D74332L435M229M173L402K754K606K508K132J793J813K014K160K273K277
60366E11901J975J577J606K000J999J161pp47p09J51J612K890L163K785L189N114
60350E39660P593R248R895J0264J0714J0932J0560R584Q190O557M652K188q88
60337F39149l889n958p117q129r295j0101j0152r597q560p010n442m647m500m051
60323E40701l196l097m312n590n515m351l315k755k163j418p91k1J553L938O399
60308E16067Q358R866J1204J2680J4620J7110J9815K2393K4796K6755K7266K5197
60296G36127K0336J3559O121j046p601j3696j9314k3597k5324k4292k1718j8991
60284F20564j6491j3987j1520r378p674o337n314m430l563l065l428m311m675
$$ y = [474332, 477767, 481996, 486169, 489571, 492325, 494931, 497439, 499571, 501364, 503177, 505191, 507351, 509624, 511901, 513876, 515453, 517059, 519059, 521058, 522219, 522212, 521465, 520756, 520907, 522519, 525409, 528572, 531357, 534546, 539660, 547253, 556501, 566396, 576660, 587374, 598306, 608866, 618450, 626640, 633197, 637849, 640037, 639149, 635260, 629302, 622185, 614056, 604761, 594660, 584508, 574911, 566351, 559341, 553899, 549252, 544752, 540701, 537505, 534408, 530096, 524506, 518991, 514640, 511325, 508570, 506407, 504989, 504198, 504177, 505730, 509668, 516067, 524425, 534291, 545495, 558175, 572795, 589905, 609720, 632113, 656909, 683664, 710930, 736127, 756463, 770022, 776143, 775097, 767496, 753800, 734486, 710889, 685565, 661273, 639555, 620564, 604073, 590086, 578566, 569188, 561514, 555177, 549863, 545433, 541870, 538805, 535377, 531066, 526391]
60271E26391m166l556l410l276k842k804l674m583m374l302k549k472k398j924
60257D81061j303p51k82j63o33j200j011J8J071J438J123N42K04N24J355J827
60241D83820J232Lp95p80m92l96k94J72R53J661J929J765J645K068K868L382L494
60224E02235L859M653M905L816K147J347J714K425L035L838M829N491N755O191
60210E56240O926P302P013O856P748R422J0640J0492R220P874P342P593P796P285
60196F69749O223N196M422L751L229L055K998K441J223m1p03r10j387k501l759
60181F92986m392m318m373n337o899p988q108p770p484o963n727l974k332j120
60167F16201l71k52q12j544j790j510j248j354j670j831j584q84oN92Q09J021
$$ y = [526391, 522225, 518669, 515259, 511983, 509141, 506337, 502663, 498080, 493706, 490404, 487855, 485383, 482985, 481061, 479758, 479007, 478725, 478562, 477929, 476729, 475718, 475736, 476807, 478245, 479368, 479910, 480114, 480638, 481993, 483820, 485052, 485055, 484260, 483480, 482988, 482592, 482298, 482470, 483423, 485084, 487013, 488778, 490423, 492491, 495359, 498741, 502235, 506094, 510747, 515652, 519468, 521615, 522962, 524676, 527101, 530136, 533974, 538803, 544294, 550049, 556240, 563166, 570468, 577481, 584337, 592085, 601507, 612147, 622639, 631859, 639733, 647075, 654668, 662464, 669749, 675972, 681168, 685590, 689341, 692570, 695625, 698623, 701064, 702287, 702246, 701543, 700633, 699246, 696745, 692986, 688594, 684276, 679903, 674566, 667667, 659679, 651571, 643801, 636317, 629354, 623627, 619653, 617321, 616201, 615830, 615578, 614766, 613222, 611432, 609922, 608674, 607320, 605650, 603819, 602235, 601351, 601345, 601937, 602746, 603767]
60151F03767J431J647J288P28P17J478K561L474M011M155M071M149M700N736P142
60136F51055Q757J0180J0984J1550J2967J5595J8171J9134J8421J7109J5572J3031
60124H22526Q999M307L40k268l839m948n816o295o194n577m648l528k361j555
60110G89143j484j907k199k292k689l458m010m216m825o185p398p537o951o438
60096G27554n807m442k796j985k078j903p33R04K290L454M732O067P154P901Q519
60081G48831R271J0140J0627J0236R373R218J0182J1020J0154P366L461j138o379
60068H42362j1562j5604j8281k0181k1395k1397k0286j8990j7961j6679j4837
60057F45189j3037j1823j0804r347p523n802m345l143k417k292k334j840n66J097
$$ y = [603767, 605198, 606845, 608133, 608861, 609578, 611056, 613617, 617091, 621102, 625257, 629328, 633477, 638177, 643913, 651055, 659812, 669992, 680976, 692526, 705493, 721088, 739259, 758393, 776814, 793923, 809495, 822526, 831525, 835832, 836172, 833904, 830065, 825117, 819301, 813006, 806812, 801235, 796587, 793059, 790698, 789143, 787659, 785752, 783553, 781261, 778572, 775114, 771104, 766888, 762063, 755878, 748480, 740943, 733992, 727554, 721747, 717305, 714509, 712524, 710446, 708543, 707810, 708714, 711004, 714458, 719190, 725257, 732411, 740312, 748831, 758102, 768242, 778869, 789105, 798478, 807696, 817878, 828898, 839052, 846418, 849879, 848741, 842362, 830800, 815196, 796915, 776734, 755339, 733942, 713656, 694666, 676705, 660026, 645189, 632152, 620329, 609525, 600178, 592655, 586853, 582508, 579365, 576948, 574656, 572322, 570482, 569916, 571013]
60043E71013K605L670M328M703M822M722M683N059N710N963N400M333L184J862
60029F32057K54j149j761j777j862k239k722l406m534n832o699p062p334p633
60015E78301p730p698p897q277q399q136p700p021n804m207k798j797j016n40
60001D99281p02j290j531j029j67N35R21J004R13J101J967L218M160M618M955
59986E17954N226N064M493M102M207M458M495M394M276L954L155J807N8j539k184
59971E63920j658q15n63o30l5J411L039M614O573Q957J1119J2740J4195J5698
59957F38565J6889J7517J7688J7101J4967J1036O088J050l721q036j1503j3884
59945G03757j5242j5561j4796j3407j2126j1038r664q040o869o393o060n515n057
$$ y = [571013, 573618, 577288, 581616, 586319, 591141, 595863, 600546, 605605, 611315, 617278, 622678, 627011, 630195, 632057, 632311, 631162, 629401, 627624, 625762, 623523, 620801, 617395, 612861, 607029, 600330, 593268, 585934, 578301, 570571, 562873, 554976, 546699, 538300, 530164, 522464, 515443, 509639, 505432, 502634, 500837, 499821, 499281, 498579, 497289, 495758, 494729, 494562, 495097, 496018, 497022, 497935, 499036, 501003, 504221, 508381, 512999, 517954, 523180, 528244, 532737, 536839, 541046, 545504, 549999, 554393, 558669, 562623, 565778, 567585, 567643, 566104, 563920, 562262, 561447, 560884, 560254, 560219, 561630, 564669, 569283, 575856, 584813, 595932, 608672, 622867, 638565, 655454, 672971, 690659, 707760, 722727, 733763, 739851, 740901, 737180, 729144, 717641, 703757, 688515, 672954, 658158, 644751, 632625, 621587, 611923, 603883, 597014, 590621, 584561, 579046, 573989]
59932E73989m723l943k514j102l16L5L77Q57J805L744O424Q616R527R774J0375
59917F12925J1441J2340J2611J2118J0958R683R095R379J0000J0746J2079J3936
59905G47311J5241J5269J4781J4814J4986J3953J1198P475L623j46l834p104r410
59892H38157j0429j0389r973r604q851p086m684k855k065j444j66J409K602L643
59878G78265N251P381R225J0192J0315R825Q909P795O670N598M681M065L684L316
59864H75172K961K764K461J504j44j954l708n743q110j0194j1498j2071j1923
59851H19517j0955r691r168r416r101p283m710k562p88J302L466M626M172K302
59837G71711n08l510n569n889m797l172j527j71K58o84k490m313o006p745r060
$$ y = [573989, 569266, 565323, 562809, 561707, 561391, 561426, 561803, 562660, 564465, 568209, 574633, 583249, 592776, 602550, 612925, 624366, 636706, 649317, 661435, 672393, 682076, 691171, 700550, 710550, 721296, 733375, 747311, 762552, 777821, 792602, 807416, 822402, 836355, 847553, 855028, 858651, 858505, 854671, 847567, 838157, 827728, 817339, 807366, 797762, 788911, 781825, 777141, 774286, 772221, 770777, 770611, 772020, 774622, 778265, 783516, 790897, 800122, 810314, 820629, 830454, 839363, 847158, 853828, 859426, 864107, 868172, 871856, 875172, 878133, 880897, 883358, 884862, 884718, 882764, 879056, 873313, 865203, 855009, 843511, 831440, 819517, 808562, 798871, 789703, 780287, 771186, 763903, 759193, 756631, 755843, 757145, 760611, 765237, 769409, 771711, 771203, 767693, 762124, 756235, 751438, 748266, 746739, 746568, 746826, 746142, 743652, 739339, 733333, 725588, 716528]
59822G16528r236q514p883p660p222o245n327n099n354n439n031m274l493l035
59808F32716l100l560l958l871l230k333j588j136p21j23L92L82q2m67n40n45
59792F08236n72m15j92m40j180j591j073j29K75j51r91j805k460k983l398l508
59776E87623k876j492k61o9m18N5J560K814L053L156M050N207N663N619N961O891
59760F26536P991R103J0225J1111J1747J2689J4150J5494J6459J7994K0820K3896
59748G98215K5710K6401K7182K8034K7655K5652K3221K1308J9390J6558J2843
59737A052169Q868M893Q47l118o542r095j0984j2857j5070j6971j7397j6146j4389
59724I44208j3249j2664j2190j2130j2857j3670j3478j2428j1707j1866j2268
$$ y = [716528, 707292, 698778, 690895, 683235, 676013, 669768, 664441, 659342, 653988, 648549, 643518, 639244, 635751, 632716, 629616, 626056, 622098, 618227, 614997, 612664, 611076, 609940, 609219, 609096, 609488, 609870, 609788, 609321, 608781, 608236, 607664, 607249, 607057, 606617, 605437, 603846, 602773, 602644, 602919, 602768, 601777, 599972, 597512, 594529, 591131, 587623, 584747, 583255, 582994, 582925, 582507, 582562, 584122, 586936, 589989, 593145, 597195, 602402, 608065, 613684, 619645, 626536, 634527, 643630, 653855, 664966, 676713, 689402, 703552, 719046, 735505, 753499, 774319, 798215, 823925, 850326, 877508, 905542, 933197, 958849, 982070, 1003378, 1022768, 1039326, 1052169, 1061037, 1065930, 1066777, 1063659, 1057117, 1048022, 1037038, 1024181, 1009111, 992140, 974743, 958597, 944208, 930959, 918295, 906105, 893975, 881118, 867448, 853970, 841542, 829835, 817969, 805701]
59713H05701j2207j1678j0941j0140r445q950q314p041n099k982j183kM60M99
59699G18678P12J289J764J895K206L100M079M506M546M521L999K479M88j046k088
59684G51128l135l970l917l103k352k047k070k609l969n646o764p252p697q161
59670F88436q208p942p845p701o810n307m183l871l809l449k741j668k53R21J281
59655F26851J285J873K995L754M014M535N545O393O740O761O046L755K90k598
59641F78239l987m770n917p061p620q043q847r285q199n744l360k219k388l182
59627E97617l816l867l526l238l042k677k325k597l585m601n118n284n335n149
59613E43457m723m350l965l051j559k69K46L61O72J077J213J243J568J990J815
$$ y = [805701, 793494, 781816, 770875, 760735, 751290, 742340, 734026, 726985, 721886, 718904, 717721, 717719, 718179, 718678, 719390, 720679, 722443, 724338, 726544, 729644, 733723, 738229, 742775, 747296, 751295, 753774, 754262, 753216, 751128, 747993, 744023, 740106, 737003, 734651, 732604, 730534, 727925, 723956, 718310, 711546, 704294, 696597, 688436, 680228, 672286, 664441, 656740, 649930, 644623, 640440, 636569, 632760, 629311, 626570, 624902, 624649, 625570, 626851, 628136, 630009, 633004, 636758, 640772, 645307, 650852, 657245, 663985, 670746, 676792, 680547, 680837, 678239, 674252, 669482, 663565, 656504, 648884, 640841, 631994, 622709, 614510, 608766, 605406, 603187, 600799, 597617, 593801, 589934, 586408, 583170, 580128, 577451, 575126, 572529, 568944, 564343, 559225, 553941, 548606, 543457, 538734, 534384, 530419, 527368, 525809, 525540, 525786, 526147, 526819, 527896, 529109, 530352, 531920, 533910, 535725]
59598E35725P65n04r11LJ499K259J815J026R10J340J530J295J048Q65N08J84K46
59581E49603K56n77j930k580k192j808k216k955l394l673m011l987l209k044j093
59566E14190n50m70r62j693j914j470j130j445j890j671p70J71O45O14M21N94
59550E02670J223J570J021K36M78J769K892L313L814M936O203P377R086J1473
59536E58061J3677J5569J8485K2679K5326K2951J5475O355r70n391p262p052n388
59523F72515l208j153P66K523L607L480K209M41j115k214l157m409o058p825r496
59508F46906j0952j1827j1705j0799r811r006q023o826o001n772n481m666l885
59495E42152l778l945l526k422j189q9R53J714J803J375J121J461K189K850L169
$$ y = [535725, 536490, 535986, 535075, 535078, 536577, 538836, 540651, 541677, 542587, 543927, 545457, 546752, 547800, 548665, 549173, 549357, 549603, 549859, 549282, 547352, 544772, 542580, 540772, 538556, 535601, 532207, 528534, 524523, 520536, 517327, 515283, 514190, 513640, 513170, 512208, 510515, 508601, 507131, 506001, 504556, 502666, 500995, 500225, 500396, 501041, 501655, 502076, 502670, 503893, 505463, 506484, 506720, 507198, 508967, 511859, 515172, 518986, 523922, 530125, 537502, 546588, 558061, 571738, 587307, 605792, 628471, 653797, 676748, 692223, 698578, 697608, 692217, 684955, 677903, 672515, 669307, 668154, 668920, 671443, 675050, 678530, 680739, 681180, 680065, 677851, 674694, 670285, 664227, 656402, 646906, 635954, 624127, 612422, 601623, 591812, 582806, 574783, 567957, 561956, 556184, 550703, 546037, 542152, 538374, 534429, 530903, 528481, 527292, 527203, 528156, 529870, 531673, 533048, 534169, 535630, 537819, 540669, 543838]
59480E43838L171L136L389L991M746N536O358P042P297P073O474N366L670J930
59466F13017Q62L11m93j547j926j308n48k65J40J308K750L673M274N306O884Q445
59450F40883R482R771R363Q840Q914R247Q476O074L276J290m91l327o931r638
59436F95229j0448r710q167o444n306n195n503n205m242l385k867k104p78P44
59422F26619K147L579N181O913Q932J1435J4099J6408J8494K0911K3526K5575
59410G83819K7058K8960L1287L1581K6520J5352J280j0660j7095j7921j5169j0797
59398H74215n503R54Q533J5758J9511J6737P217n457j6443k3212k6160k6427k4596
59385H15127k1564j8800j6850j4716j1674q630o708n473l781j687j52O50J434
$$ y = [543838, 547009, 550145, 553534, 557525, 562271, 567807, 574165, 581207, 588504, 595577, 602051, 607417, 611087, 613017, 613879, 614190, 613697, 612150, 610224, 608916, 608368, 608103, 608243, 609551, 612301, 615974, 620248, 625554, 632438, 640883, 650365, 660136, 669499, 678339, 687253, 696500, 704976, 711050, 714326, 715616, 715125, 711798, 704867, 695229, 684781, 675071, 666904, 660460, 655154, 649959, 644456, 639251, 635009, 631624, 628757, 626653, 625875, 626619, 628766, 632345, 637526, 644439, 653371, 664806, 678905, 695313, 713807, 734718, 758244, 783819, 810877, 839837, 871124, 902705, 929225, 944577, 945857, 935197, 918102, 900181, 885012, 874215, 868712, 869666, 878199, 893957, 913468, 930205, 937422, 931965, 915522, 892310, 866150, 839723, 815127, 793563, 774763, 757913, 743197, 731523, 722893, 716185, 710712, 706931, 705244, 705092, 705742, 707176]
59372G07176K448L260L740M224M730M990N250N995O954P249O710O178O373P150
59358G82427P998Q540Q492P880P343P594Q437R031R167R549J0714J2330J3792
59345I03294J4793J5101J4502J3397J2865J3524J4610J4639J2870R839O559L507
59333A049500M44k945o408r270j1164j2380j3367j4173j4573j4506j4074j3288
59321I23796j2168j0922r759q585p147n421l695k361j677j529j340n48O49J394
59307H60687J182M68L5J75O68J238J646J715J637J955K912M100N043N885P042
59292H96388Q367Q814O909J706o213j4563k0780k3889k4646k3952k1940j8764
59280G67437j5248j2082r030n637k198O39K902N327Q497J2243J5721J7881J8255
$$ y = [707176, 709624, 712884, 716624, 720848, 725578, 730568, 735818, 741813, 748767, 756016, 762726, 768904, 775277, 782427, 790425, 798965, 807457, 815337, 822680, 830274, 838711, 847742, 856909, 866458, 877172, 889502, 903294, 918087, 933188, 947690, 961087, 973952, 987476, 1002086, 1016725, 1029595, 1039434, 1045993, 1049500, 1049944, 1046999, 1040591, 1031321, 1020157, 1007777, 994410, 980237, 965664, 951158, 937084, 923796, 911628, 900706, 890947, 882362, 875215, 869794, 866099, 863738, 862061, 860532, 859192, 858644, 859293, 860687, 861869, 862337, 862372, 862547, 863215, 864453, 866099, 867814, 869451, 871406, 874318, 878418, 883461, 889346, 896388, 904755, 913569, 920478, 922184, 915971, 901408, 880628, 856739, 832093, 808141, 786201, 767437, 752189, 740107, 731077, 725440, 723242, 723881, 726783, 732110, 740607, 752850, 768571, 786452, 804707]
59267H04707J7432J6371J5330J3963J2276J0553Q492N572K349kj676m182p739
59254H93446j0374j0600r443q543p801o373m784m112l929k910j127rk06r63j457
59239H20815j457q81P5N15j81j157j031J57J115J207R06N20k44j386k405l156
59223H13412l890m455m486m336m828o041p188p646p309o163m443k990k475k422
59209G44740j980j390j569k510l239l281k982k511j761j179j512k578l396l570
59195G11282l540l475l032k230j430n23Q38K206K737K548K584L156L835M697O241
59180G25894P983Q613P901P097P074P299P156O973P180P484P465P206O860O433
59166H28618O231O714P560P846P354O790O454N694M043J912k03k296m337o036
$$ y = [804707, 822139, 838510, 853840, 867803, 880079, 890632, 899124, 904696, 907045, 907043, 905367, 901185, 893446, 883072, 872472, 863029, 854486, 846685, 840312, 835528, 831416, 827487, 824577, 823450, 823441, 823235, 822272, 820815, 819358, 818477, 818552, 819067, 818886, 817729, 816698, 816855, 817970, 819177, 820083, 820603, 820359, 818973, 816568, 813412, 809522, 805067, 800581, 796245, 791417, 785376, 778188, 770542, 763233, 757070, 752627, 749637, 747162, 744740, 742760, 741370, 739801, 737291, 734052, 730771, 727789, 725278, 723517, 722338, 720826, 718248, 714852, 711282, 707742, 704267, 701235, 699005, 697575, 697052, 697890, 700096, 702833, 705381, 707965, 711121, 714956, 719653, 725894, 733877, 742490, 750391, 757488, 764562, 771861, 779017, 785990, 793170, 800654, 808119, 815325, 822185, 828618, 834849, 841563, 849123, 856969, 864323, 871113, 877567, 883261, 887304, 889216, 889013, 886717, 882380, 876344]
59152H76344p459q978j0428j1222j1533j2218j3352j3908j3391j2543j1956j1098
59140G38258r485p867p328p776q131p568o153m590l623l326k865j461M67J815
59126F70367K380L013M215N537O502P116P313O935O465O758P706Q188P729P129
59112G57353P123P390P389P215P082O803O237N599M927L970K838K045J642J084
59098H28697J24r40j948k944l571l463l189l645m426m197k846j799j802j974j589
59083G90488j305j808k601l136l917n519p380q591r084r318r409r300r071q583
59069G01466p554o355n843o022n906n112m457m470m497l970l460l662m338m939
59055F30881n309n241m365l078k443k562k301j256n85r80j311m04J090J852J889
$$ y = [876344, 868885, 859907, 849479, 838257, 826724, 814506, 801154, 787246, 773855, 761312, 749356, 738258, 728773, 720906, 713578, 705802, 697671, 690103, 683950, 679360, 675737, 672411, 669546, 668085, 668552, 670367, 672747, 675760, 679975, 685512, 692014, 699130, 706443, 713378, 719843, 726601, 734307, 742495, 750224, 757353, 764476, 771866, 779255, 786470, 793552, 800355, 806592, 812191, 817118, 821088, 823926, 825971, 827613, 828697, 828821, 827881, 825933, 822989, 819418, 815955, 812766, 809121, 804695, 800498, 797652, 795853, 794051, 792077, 790488, 789183, 787375, 784774, 781638, 777721, 772202, 764822, 756231, 747147, 737829, 728420, 719120, 710049, 701466, 693912, 687557, 681714, 675692, 669786, 664674, 660217, 655747, 651250, 647280, 643820, 640158, 635820, 630881, 625572, 620331, 615966, 612888, 610445, 607883, 605582, 604326, 603741, 602761, 601450, 601046, 602136, 603988, 605877]
59040F05877K059K531K953L394L945M121L713L510M205N365O435P906J0368J3284
59026F79666J5913J8600K1965K5515K8333L0533L2726L4555L4985L3559L0319
59015I86669K5005J7542Q964P59o388j2456j7155k0190k1891k2627k2057j9881
59003H96294j6828j3935j1348q732o318m524l147j907j278j727k613k966k883
58990H18088l120l769m413n143o285p427p810p429o806o023m984m193m177m334
58976G42175l391j029J826M134N557O390P418R418J2147J4275J4958J4860J4931
58963H43669J4962J4321J3325J2650J1957J0383P983N442K729o72m443p607r938
58950I14761j2087j4278j6003j6976j7412j7355j6543j5056j3361j1697j0008
$$ y = [605877, 607936, 610467, 613420, 616814, 620759, 624880, 628593, 632103, 636308, 641673, 648108, 656014, 666382, 679666, 695579, 714179, 736144, 761659, 789992, 820525, 853251, 887806, 922791, 956350, 986669, 1011674, 1029216, 1038180, 1038939, 1032551, 1020095, 1002940, 982750, 960859, 938232, 916175, 896294, 879466, 865531, 854183, 845451, 839133, 834609, 831462, 829555, 828277, 826550, 823937, 820971, 818088, 814968, 811199, 806786, 801643, 795358, 787931, 780121, 772692, 765886, 759863, 754879, 750686, 746509, 742175, 738784, 737755, 739581, 743715, 749272, 755662, 763080, 772498, 784645, 798920, 813878, 828738, 843669, 858631, 872952, 886277, 898927, 910884, 921267, 929250, 934692, 937421, 936749, 932306, 924699, 914761, 902674, 888396, 872393, 855417, 838005, 820650, 804107, 789051, 775690, 763993, 753985]
58939G53985q316o644m791k754r55M36J926L728N059N259N079N785P338Q461Q248
58924G81844O832M699K187m50l115n818q115r206r077q847r269r655r070p750
58910G15190o412n028l354j931j267o72Q72L158N270P076Q978J0733J1863J2691
58896G57167J3788J4747J4795J4191J3697J3205J2294J1699J2640J4894J6978
58885I10095J8140J8799J9136J8686J7356J5563J3308J0237O609L146M5k883n295
58872A042942o809q051r964j2185j3418j3248j2353j1123r447p775o948o821o409
58859I18391n542n097n408n594m850l392j905q11j85L62J641L897O110O997O446
58844I11060M995K504j535o628j1541j5651j8985k1253k2132k2198k2232k1900
$$ y = [753985, 745669, 739025, 734234, 731480, 730525, 730961, 732887, 736615, 741674, 746933, 752012, 757797, 765135, 773596, 781844, 788676, 793375, 795562, 795112, 791997, 786179, 778064, 768858, 759781, 750934, 741665, 732010, 722940, 715190, 708778, 703750, 700396, 698465, 697198, 696526, 697398, 700556, 705826, 712902, 721880, 732613, 744476, 757167, 770955, 785702, 800497, 814688, 828385, 841590, 853884, 865583, 878223, 893117, 910095, 928235, 947034, 966170, 984856, 1002212, 1017775, 1031083, 1041320, 1047929, 1051075, 1051120, 1048237, 1042942, 1036133, 1028082, 1018118, 1005933, 992515, 979267, 966914, 955791, 946344, 938569, 931621, 924800, 918391, 912849, 907752, 902344, 896750, 891900, 888508, 886603, 885792, 885607, 885969, 887610, 891507, 897617, 904614, 911060, 916055, 918559, 917024, 910396, 898855, 883204, 864219, 842966, 820834, 798636, 776404, 754504]
58832G54504k0430j8229j6339j4585j1987q850o726o114n848m950l635k201m77
58819F34133J277K263K416K594L235L833M021M048M096M048M057M275M158L089
58805F81543J566N46q8j153k419k808k245j832k150k833l726m972n997o033n650
58790F41749o024o674n871l462j398r27j096o14N17J869L503N256O488P207Q083
58775F48606Q935Q557O646M364K473M37j981l854m618n009n637n915n362m619
58761F43023m248l651k119K6K258M770P729J0389J1825J1844J0627Q175M758J144
58747G06550k096m902p069q018p549o146m328k388p45L14J149K130K760K484K056
58732F74202K683M045M766M659M739N068M508K887J508J067Q27L16P5K02J0l06
$$ y = [754504, 734074, 715845, 699506, 684921, 672934, 664084, 657358, 651244, 645396, 640446, 636811, 634610, 634133, 635410, 637673, 640089, 642683, 645918, 649751, 653772, 657820, 661916, 665964, 670021, 674296, 678454, 681543, 683109, 683655, 683567, 682414, 679995, 677187, 674942, 673110, 670960, 668127, 664401, 659429, 653432, 647399, 641749, 635725, 629051, 623180, 619718, 618320, 617393, 616297, 615683, 616200, 618069, 621572, 626828, 633316, 640523, 648606, 657541, 666098, 672744, 677108, 679581, 680018, 678037, 674183, 669565, 664556, 658919, 653004, 647642, 643023, 638775, 635124, 633005, 633031, 635289, 640059, 647788, 658177, 670002, 681846, 692473, 700648, 705406, 706550, 704454, 699552, 692483, 684465, 676916, 670770, 666442, 664054, 663309, 663623, 664772, 666902, 669662, 672146, 674202, 676885, 680930, 685696, 690355, 695094, 700162, 704670, 707557, 709065, 710132, 710959, 711275, 711350, 711552, 711562, 711256]
58716G11256N37K769M897N878O215O358N788M537L654L355K400L03j707k901m434
58701G48905p268j0453j2750j4409j6027j7137j7249j7033j7095j6799j5458j3543
58689E73684j1672r647p458n956n482n170m548m395m964n041l998l153l650m457
58675D94093m073k862k019j428l05J058J869K399L419M804O019P286Q977J0572
58661E29809J1414J1707J1583J0099O512J855k053m553o079o921p184p302p459
58648E41428p081n850m480l748l522l527m035m842m766l258j535r54j182j079
58634D91569m35L73J443K860L927M007L435K693J544l3j106j051o66q64j189p10
58618E05797L99J294J835K485L468M751O174P053O557M987L688L181K726K098
$$ y = [711256, 711793, 714562, 719459, 725337, 731552, 737910, 743698, 748235, 751889, 755244, 757644, 757947, 756240, 753339, 748905, 741637, 731184, 718434, 704025, 687998, 670861, 653612, 636579, 619484, 602685, 587227, 573684, 562012, 552365, 544907, 538951, 533469, 528299, 523751, 519356, 514392, 509351, 505353, 502200, 498550, 494093, 490020, 487158, 485139, 483711, 483406, 484464, 486333, 488732, 492151, 496955, 502974, 510260, 519237, 529809, 541223, 552930, 564513, 574612, 581124, 582979, 580926, 576373, 570294, 563373, 556189, 548887, 541428, 534347, 528497, 524017, 520269, 516747, 513220, 509185, 504343, 499577, 496319, 494784, 493830, 492648, 491569, 491134, 491507, 492950, 495810, 499737, 503744, 507179, 509872, 511416, 511383, 510277, 509226, 508560, 507696, 506507, 505797, 506196, 507490, 509325, 511810, 515278, 520029, 526203, 533256, 539813, 544800, 548488, 551669, 554395, 556493]
58604E56493K191L156L714L221K649K478J549o73k515k415j240p26j026j302j342
58589E64212j066J62K192L538L619M093O362R307J1165J2050J2781J2855J1659
58576F52929J0268R819R437P894O085N637O189O377O523Q014J0801J3707J6551
58563G70231J9848K3097K5433K7311K9583L1518L1694L0170K7840K4431J9144
58552A060300J2691O748J825k493n879p637q161q218p564n930m696n578q328j1454
58538A005626j4548j8132k1898k4951k7147k8569k8510k6631k4202k2413k0452
58527G48173j7093j3078j0025q018o229m809m123l346j971j425k820m382l795
58514F67059j910j341k313k890k552k503k903k704k043k043k423j883o42o1n0
$$ y = [556493, 558684, 561840, 565554, 568775, 571424, 573902, 575451, 574778, 572263, 569848, 568608, 567882, 566856, 565554, 564212, 563146, 563308, 565500, 569038, 572657, 576750, 583112, 592419, 603584, 615634, 628415, 641270, 652929, 663197, 673016, 682453, 690347, 696432, 702069, 708258, 714635, 721158, 729172, 739973, 753680, 770231, 790079, 813176, 838609, 865920, 895503, 927021, 958715, 988885, 1016725, 1041156, 1060300, 1072991, 1079739, 1081564, 1079071, 1073192, 1065555, 1057394, 1049176, 1041612, 1035682, 1030986, 1025408, 1017080, 1005626, 991078, 972946, 951048, 926097, 898950, 870381, 841871, 815240, 791038, 768625, 748173, 731080, 718002, 707977, 699959, 693730, 688921, 684798, 681452, 679481, 678056, 675236, 670854, 667059, 665149, 663808, 661495, 658605, 656053, 653550, 650647, 647943, 645900, 643857, 641434, 639551, 638909, 638848, 638798]
58499F38798N84J521J254r1r06q87j149j666j175L50J583K189L094M466N674O947
58483F60586Q852J0593J1194J1860J4478J8240K0556K1001K1342K1866K0826J7724
58471H59118J4056J0441N809N1n219r070j2055j4161j4387j2812j0883r199p121
58458G94568m672k607n62K567O338R175J1016J3123J5321J5880J4208J1238P217
58445H92810J686m330q800j1474j3699j5551j5778j4518j3211j1871r224n625
58433G70415k850r54J605M588N952N613N935P891R780J0559J1373J2866J3785
58420H56558J3235J1800R667O140J689k032m685p403j0122j1385j1124j0941j1285
58407H30112j1012j0050r636r693q811p153o340o236m960k411o04m4R27K728L849
$$ y = [638798, 639382, 640903, 642157, 642066, 641160, 640273, 639124, 637458, 636283, 636633, 638216, 640405, 643499, 647965, 653639, 660586, 669438, 680031, 691225, 703085, 717563, 735803, 756359, 777360, 798702, 820568, 841394, 859118, 873174, 883615, 889424, 889475, 884256, 875186, 863131, 848970, 834583, 821771, 810888, 801689, 794568, 789896, 787289, 786727, 789294, 795632, 804807, 815823, 828946, 844267, 860147, 874355, 885593, 892810, 894496, 890166, 881366, 869892, 856193, 840642, 824864, 810346, 797135, 785264, 776040, 770415, 767565, 766611, 768216, 772804, 778756, 784369, 790304, 798195, 807975, 818534, 829907, 842773, 856558, 869793, 881593, 891260, 897400, 899089, 897057, 892372, 884969, 874847, 863462, 852338, 841397, 830112, 819100, 809050, 799414, 789721, 780910, 773757, 767417, 761181, 756221, 753810, 753206, 753162, 754089, 756817, 760666]
58392G60666M096N124O963P436N875M144L219K009L72o3R20J408P11K49M14j26
58376H03417j232r52Q31J909J735K299M160N394N485O415Q687J0106R878J0127
58362H68259J1875J3288J3381J3786J5223J5807J4516J2906J1869J0187P656O067
58350A014820N656M240J348m76N2J091J426K296M077N104N298O883J0049J1981
58336A073845J1801J2257J4692J6690J6610J6211J6765J6782J5564J4881J5152
58325A241250J4148J1312R065Q124O132K714R43J754J992K75l83J674L645L613
58311A306258L849N893P482P404Q223J1130J3198J2996J3636J6861J9411J8872
58299A445213J7935J9070K0050J8717J7206J7561J7924J6861J6542J8036J8518
$$ y = [760666, 764762, 769886, 776849, 784285, 790160, 794304, 797523, 799532, 799904, 799841, 800761, 802169, 802880, 803129, 803543, 803417, 802185, 801233, 802064, 803973, 805708, 808007, 812167, 817561, 823046, 829461, 838148, 848254, 858132, 868259, 880134, 893422, 906803, 920589, 935812, 951619, 966135, 979041, 990910, 1001097, 1008753, 1014820, 1020476, 1024716, 1026064, 1025588, 1025640, 1026731, 1028157, 1030453, 1034530, 1039634, 1044932, 1051815, 1061864, 1073845, 1085646, 1097903, 1112595, 1129285, 1145895, 1162106, 1178871, 1195653, 1211217, 1226098, 1241250, 1255398, 1266710, 1275775, 1283899, 1290031, 1292745, 1293688, 1295442, 1297434, 1297709, 1297326, 1299000, 1302645, 1306258, 1310107, 1316000, 1323482, 1330886, 1339109, 1350239, 1363437, 1376433, 1390069, 1406930, 1426341, 1445213, 1463148, 1482218, 1502268, 1520985, 1538191, 1555752, 1573676, 1590537, 1607079, 1625115, 1643633]
58288A643633J6807J6405J9283K2093K2364K2792K5383K7221K6339K5908K8194
58277A896422L0220K9889L0339L3577L6093L5583L5685L9039M2173M2516M3654
58266B295190M8103N1796N1667N1775N5718N9926O0897O2045O6599P0621P0140
58255B944477O8433O9265O9875O7664O6572O9598P2425P1849P2684P8735Q5105
58244C736682Q7562R0885R9351J07883J11856J16526J26976J37917J43850J49881
58234D909369J61607J73871J81095J88932K03532K19262K29823K41389K61309
58225F770189K84144L02945L23599L53179L85264M12415M41847M82309N27495
58216A0283386N69821O17826O81127P51699Q20287Q97413R96494J111141J232624
$$ y = [1643633, 1660440, 1676845, 1696128, 1718221, 1740585, 1763377, 1788760, 1815981, 1842320, 1868228, 1896422, 1926642, 1956531, 1986870, 2020447, 2056540, 2092123, 2127808, 2166847, 2209020, 2251536, 2295190, 2343293, 2395089, 2446756, 2498531, 2554249, 2614175, 2675072, 2737117, 2803716, 2874337, 2944477, 3012910, 3082175, 3152050, 3219714, 3286286, 3355884, 3428309, 3500158, 3572842, 3651577, 3736682, 3824244, 3915129, 4014480, 4122363, 4234219, 4350745, 4477721, 4615638, 4759488, 4909369, 5070976, 5244847, 5425942, 5614874, 5818406, 6037668, 6267491, 6508880, 6770189, 7054333, 7357278, 7680877, 8034056, 8419320, 8831735, 9273582, 9755891, 10283386, 10853207, 11471033, 12152160, 12903859, 13724146, 14621559, 15618053, 16729194, 17961818]
58207A7961818J374051J551928J761014J995610K277618K633426L064089L573484
58199C6193038M204500N010393O018526P270076Q868455J0935815J3550509J6776798
58191A08828110K0694307K5302172L0435514L5838525M1110384M5206916M6011165
58184C53427093M1027122K9226332J2430955n349224k0180653l0036384l4905336
58177C45639905l5800559l3965292l0664264k7082775k4041064k1775118k0046518
58170A52264315j8472668j6803022j5003399j3179952j1450262r871047q455407
58163E9028558p212855o147979n243182m472517l824016l289392k844806k463307
58155B3530504k136381j864361j635902j435918j263900j125031j011207r08846
$$ y = [17961818, 19335869, 20887797, 22648811, 24644421, 26922039, 29555465, 32619554, 36193038, 40397538, 45407931, 51426457, 58696533, 67564988, 78500803, 92051312, 108828110, 129522417, 154824589, 185260103, 221098628, 262209012, 307415928, 353427093, 394454215, 423680547, 436111502, 430762278, 410581625, 380545241, 345639905, 309839346, 275874054, 245209790, 218127015, 194085951, 172310833, 152264315, 133791647, 116988625, 101985226, 88805274, 77355012, 67483965, 59028558, 51815703, 45667724, 40424542, 35952025, 32128009, 28838617, 25993811, 23530504, 21394123, 19529762, 17893860, 16457942, 15194042, 14069011, 13057804, 12148958]
58147A2148958q17857p45177o86160o29261n73486n25241m83009m40212l98484
58138F850071l63726l33386l01151k69854k46815k30635k15094k01611j95155
58129D492644j92019j84236j72798j64467j58797j50087j39173j31536j26160
58120C073371j17494j06453r8735r4113q7679q0003p5990p4991p1693o5727o1400
58109B139093n9092n5593n1670n0797n1518m9332m4967m2916m3096m1731l9146
58098A609235l8792l9729l7890l3887l1987l2246l0928k7909k6419k6276k4462
58087A258710k1688k1355k2685k1731j8692j7485j8593j8866j7976j8510k0053
58076A041076j9601j7616j7480j9125j9268j7685j7236j7922j6953j4579j3936
$$ y = [12148958, 11331101, 10585924, 9899764, 9270503, 8697017, 8171776, 7688767, 7248555, 6850071, 6486345, 6152959, 5851808, 5581954, 5335139, 5104504, 4889410, 4687799, 4492644, 4300625, 4116389, 3943591, 3779124, 3620327, 3470240, 3331067, 3199531, 3073371, 2955877, 2849424, 2750689, 2656576, 2568897, 2488894, 2412904, 2337913, 2266220, 2200493, 2139093, 2080001, 2024408, 1972738, 1921941, 1870423, 1821091, 1776124, 1733208, 1690112, 1648381, 1609235, 1570443, 1530714, 1492824, 1458937, 1426950, 1394704, 1363776, 1335867, 1309448, 1283172, 1258710, 1237022, 1215667, 1192982, 1171251, 1152559, 1135074, 1116481, 1097615, 1079639, 1061129, 1041076, 1021475, 1003859, 986379, 967254, 947986, 930301, 913065, 895143, 878190, 863611, 849675]
58065H49675j4973j4385j1720r966r929r370p924p577q184p651o528p392r692
58052G24384j0378r529j0056j1900j1887r631q216q568q228o381n171n309n035
58039F14095m073m152n082m731l298l302m899n594m898m944o155o725o672q015
58025E41555j0475j1384j0331r587r606q480o312n592o544o548m958m151m915
58012D42672n091l802k956l418l540k573j842j619m93J323J772P67N81J725K089
57997D25595R80K21M26o9j719k826k990l799n355n652m351l516l757l281j622
57982C88285p18j307j858j843k512l632l347k015k210l984m294k256o94j021r99
57967C55595O02J433p9j668j123L13Q23J149K264K916J985O96J83o15k523m089
$$ y = [849675, 834702, 820317, 808597, 798631, 788702, 779332, 771408, 763831, 755647, 747996, 741468, 734076, 724384, 714006, 704477, 694421, 682521, 670634, 661003, 652787, 644219, 635991, 629610, 624439, 619130, 614095, 610022, 605870, 600788, 596057, 592759, 589457, 584558, 578964, 574066, 569122, 562967, 556242, 549570, 541555, 531080, 519696, 509365, 499778, 490172, 481692, 475380, 469788, 463244, 456696, 451738, 447587, 442672, 437581, 433779, 430823, 427405, 423865, 421292, 419450, 417831, 417338, 418661, 420433, 421200, 421781, 423506, 425595, 426575, 426796, 427222, 427153, 425434, 422608, 419618, 415819, 410464, 404812, 400461, 396945, 393188, 389907, 388285, 387567, 386260, 384402, 382559, 380047, 376415, 373068, 371053, 368843, 364859, 360565, 358309, 357615, 356594, 355595, 356197, 357630, 357551, 355883, 354760, 355073, 355896, 357045, 359309, 362225, 364210, 364906, 365089, 364474, 361951, 357862]
57951C57862m034l404l331l036j908j202j727k115j266l03k89j51J257L128M419
57936C43900N637P294Q556Q988R617J0884J1498J0637R210P773N450K123o53k176
57922D38738l628n360n880m935m784o633q533q655q085q308q430p166n347m236
57908C48758l282j692k48L43J055K534L431K608J161M52Q1m18k9J666K939K522
57892C61881J743K033K373J455L31M70J001M21o18p23m76j197k302k404j904k153
57876C59931l023l592m210n691p263p501o603n835n399m592l380k176q36P10J705
57861C02245J764J799K516L198L345L985N839P678Q269Q455R441J0424R944Q375
57847C87277P066O118M920L745K990J888j16j854k203k200l406n263o158o096
$$ y = [357862, 353828, 350424, 347093, 344057, 342149, 340947, 339220, 337105, 335839, 335536, 335247, 335096, 336353, 339481, 343900, 349537, 356831, 365387, 374375, 383992, 394876, 406374, 417011, 426221, 433994, 439444, 441567, 440914, 438738, 435110, 429750, 423870, 418935, 414151, 407518, 398985, 390330, 382245, 373937, 365507, 358341, 352994, 348758, 345476, 343784, 343536, 343879, 344934, 347468, 350899, 353507, 354668, 355120, 355201, 354783, 354754, 356420, 359359, 361881, 363624, 365657, 368030, 369485, 369816, 370286, 371287, 371708, 371090, 370367, 369891, 368694, 366392, 363988, 362084, 359931, 356908, 353316, 349106, 343415, 336152, 328651, 322048, 316213, 310814, 306222, 302842, 300666, 299830, 300540, 302245, 304009, 305808, 308324, 311522, 314867, 318852, 324691, 332369, 340638, 349093, 358534, 368958, 378902, 387277, 394343, 400461, 405381, 409126, 412116, 414004, 413888, 412034, 409831, 407631, 404225, 398962, 392804, 386708]
57833C86708o197o430o080n616n961o483n850m368l502l480l269k484j567n17
57819C24904Q40J724J202k53j395j861j938j491n68k29j181k440k930l405n029
57804C05950p035p734p167o695o609o110n248m847m779m075k659j427p53k63K50
57789B40799P94J552K276K103J085Q24K259M092M860N272O620Q289Q928Q939R453
57774C08145R902R046P604P269P718P190N643M723M693L970J805p90k995m985
57760C68938o628p369p509p794p817o698n196m991n935o112m805l272k377j539
57746B90896m20K72J95j03m27j034j323j96J888K964K119N44l48l12M40J751K905
57729B99811L024K464K526L510M418M643M529M170L222K056J542J519J019J04
$$ y = [386708, 380511, 374081, 368001, 362385, 356424, 349941, 344091, 339723, 336221, 332741, 329472, 326988, 325421, 324904, 325744, 327468, 328670, 328417, 327022, 325161, 323223, 321732, 321164, 320935, 319754, 317314, 314384, 310979, 305950, 298915, 291181, 284014, 277319, 270710, 264600, 259352, 254505, 249726, 245651, 242992, 241565, 240812, 240549, 240799, 241593, 243145, 245421, 247524, 248609, 249433, 251692, 255784, 260644, 265916, 272536, 280825, 289753, 298692, 308145, 318047, 327093, 334697, 341966, 349684, 356874, 362517, 367240, 371933, 375903, 377708, 376918, 373923, 368938, 362310, 354941, 347432, 339638, 331821, 325123, 319927, 314936, 309001, 302889, 298084, 294812, 292435, 290896, 290476, 290748, 290943, 290840, 290413, 289379, 288056, 287860, 289748, 292712, 294831, 295375, 295027, 294715, 295155, 296906, 299811, 302835, 305299, 307825, 311335, 315753, 320396, 324925, 329095, 332317, 334373, 335915, 337434, 338453, 338557]
57715C38557j90P8m30k074l522l858l808m272n088n808o405o699o354n813n980
57700B78334o619o426m956l161j754n03N06N47l47j064j037r36j233j544j718
57685B48089k218k884k729j545k79O81K124M298O130P001Q050J0651J4745J9583
57671C11697K5177L2049M0311M9757O0178P0749P9350Q2811P7653O1340L4427
57660I25499J986k8405n1011o4269o9457o8599o3835n7225n0070m2834l5901k9649
57648C66230k3896j8402j3862j1218r957q503o402m696l973l560k979k588k454
57635B53740j974j200r78j358j290m45K54M26Q82J767J785K70j530k303k453k824
57619B42769l064k520j737j657k119k315k104j859j624j294j138j318j494j422
$$ y = [338557, 338367, 338445, 338015, 335941, 332419, 328561, 324753, 320481, 315393, 309585, 303180, 296481, 290127, 284314, 278334, 271715, 265289, 260333, 257172, 255418, 254915, 255421, 255968, 255621, 254557, 253520, 252584, 251351, 249807, 248089, 245871, 242987, 240258, 238713, 238434, 239115, 241239, 245537, 251667, 258668, 266718, 277369, 292114, 311697, 336874, 368923, 409234, 458991, 519169, 589918, 669268, 752079, 829732, 891072, 925499, 927485, 899080, 848069, 783800, 714343, 645744, 581909, 524684, 474614, 431780, 395879, 366230, 342334, 323932, 310070, 298852, 288895, 280392, 273990, 269294, 265321, 261761, 258782, 256194, 253740, 251766, 250566, 249588, 248230, 246940, 246495, 246749, 247175, 248057, 249824, 251609, 251879, 250349, 248046, 245593, 242769, 239705, 237185, 235448, 233791, 231672, 229357, 227253, 225394, 223770, 222476, 221338, 220020, 218526, 217104]
57605B17104j335j281r35m48n92j445j990j652j245j644k473k946l103l384l665
57590A88966l543l009k257j450j048j554k508k693j804r69j059j555j655j391
57576A62471j019m26J26k21j493k417k244j959k630l626l668k811k126k056k237
57561A33664k434k521k053q19M77R31O00K36L21Q72J751K501K499J846J474J853
57545A41198K231J819R67M16J08m06q88p08J41J034J514J522J224R12P84N25l47
57528A52046j524k035j531o92j16L22O45M09l24o84k13M32O01O32J064J785K479
57511A53296L129L521L123J964Q12O2o18j211j123m33j33n57q76p17q73j669k150
57494A55547j801j617k317k928k439j564j509k065k312k206k124j776r42l80o89
$$ y = [217104, 215769, 214488, 213553, 213105, 212513, 211068, 209078, 207426, 206181, 204537, 202064, 199118, 196015, 192631, 188966, 185423, 182414, 180157, 178707, 177659, 176105, 173597, 170904, 169100, 168131, 167072, 165517, 163862, 162471, 161452, 161026, 161152, 160931, 159438, 157021, 154777, 152818, 150188, 146562, 142894, 140083, 137957, 135901, 133664, 131230, 128709, 126656, 125837, 126314, 127245, 127845, 128081, 128402, 129274, 131025, 133526, 136025, 137871, 139345, 141198, 143429, 145248, 146215, 146631, 146739, 146333, 145445, 144737, 144878, 145912, 147426, 148948, 150172, 151084, 151868, 152393, 152046, 150522, 148487, 146956, 146264, 146148, 146470, 147115, 147524, 147200, 146516, 146303, 146735, 147336, 147968, 149032, 150817, 153296, 156425, 159946, 163069, 165033, 165845, 165907, 165289, 164078, 162955, 162522, 162389, 161832, 160956, 160239, 159366, 157697, 155547, 153746, 152129, 149812, 146884, 144445, 142881, 141372, 139307, 136995, 134789, 132665, 130889, 129947, 129567, 128878]
57479A28878j084o21K07M20K18K92K72o69k205l232l374l002k328j567j320j731
57463A09154j957j510j166j507j669q14K38M23L53J078J907J436N1o09k53p9n44
57446A04532q68o71m78n23m42j46K02Q69J999K738K218J042M10K41l18j016p76
57429A09013L86J351J643J710J548P02m62r87p64m65k04K57K86r49k645k992j720
57412A05708m09j07k61j94m6J84J004K322L208L139K432J298l10j798k178j518
57396A12474q65o37k51M38P96P03Q15J204J094L67j5M49J095J448K026L117L900
57379A28158L618K807K519K936L335L010J818K19j008j450j477j614j780j684
57365A39407j564j715j632o84O01R97J99j015j994k607k629j937j152r24p73J73
$$ y = [128878, 127794, 127173, 127380, 127800, 128018, 128310, 128582, 127913, 125708, 122476, 119102, 116100, 113772, 112205, 110885, 109154, 107197, 105687, 104521, 103014, 101345, 100531, 100769, 101192, 101545, 102623, 104530, 105966, 106017, 105408, 105155, 105076, 104532, 103664, 102993, 102515, 101992, 101550, 101404, 101606, 102475, 104474, 107212, 109430, 110472, 110882, 111123, 110805, 109789, 109013, 109399, 110750, 112393, 114103, 115651, 116353, 115891, 114904, 114140, 113675, 113471, 113728, 114014, 113065, 110420, 107428, 105708, 105299, 105192, 104931, 104737, 104691, 104875, 105879, 108201, 111409, 114548, 116980, 118278, 117968, 116170, 113992, 112474, 111609, 110972, 110721, 111159, 111955, 112658, 113473, 114677, 115771, 116138, 116123, 116572, 117667, 119115, 121141, 124258, 128158, 131776, 134583, 137102, 140038, 143373, 146383, 148201, 148420, 147412, 145962, 144485, 142871, 141091, 139407, 137843, 136128, 134496, 133812, 134413, 135410, 135609, 134594, 132600, 129993, 127364, 125427, 124275, 123351, 122578, 122751]
57349A22751J466J772R15Q4K7L22N29O79N49j85r52q16o2P6n47p74k09J9q46j892
57329A22906j859o70Q76K045K435K050J463J199R88L65k86l17n2j92l90J22Q71
57312A31554Q12M77J371L246M011K766R71N8k29m39k91K73N12L20O95J967K973
57295A51047K888K427K419K508K188J843J865J896J665J475J237L07j059j459
57281A71247l66J018J702K272L334M073L598K620K531L637N243O702P516P201
57267B22328N888M447L461K825K632L352M780N932O473P043P815Q126P980Q353
57253C01435R433J0057R658R153R171R055Q509Q651J0212J2181J3339J3793J3940
57240D38587J3433J2357J1889J2533J3079J2636J2303J3374J5174J6225J6373
$$ y = [122751, 124217, 125989, 126904, 126988, 127015, 127337, 127866, 128545, 129094, 128909, 127957, 127141, 127079, 127155, 126608, 125834, 125625, 125644, 124798, 122906, 121047, 120377, 121253, 123298, 125733, 127783, 129246, 130445, 131433, 131798, 131512, 131195, 131143, 130951, 130561, 130683, 131554, 132366, 132843, 134214, 137460, 141471, 144237, 145208, 145266, 145037, 144598, 144307, 144580, 145092, 145412, 146107, 148074, 151047, 153935, 156362, 158781, 161289, 163477, 165320, 167185, 169081, 170746, 172221, 173458, 173765, 172706, 171247, 170881, 171899, 173601, 175873, 179207, 183280, 186878, 189498, 192029, 195666, 200909, 207611, 215127, 222328, 228216, 232663, 236124, 238949, 241581, 244933, 249713, 255645, 262118, 269161, 276976, 285102, 293082, 301435, 310868, 320925, 330583, 339736, 348907, 357962, 366471, 375122, 385334, 397515, 410854, 424647, 438587, 452020, 464377, 476266, 488799, 501878, 514514, 526817, 540191, 555365, 571590, 587963]
57229E87963J6337J6211J5938J6213J7514J9061K0031K0832K1928K2548K1989
57218G96565K1127K1101K1382K0693J9053J7480J6319J5223J4127J3090J1908
57207I88068J0947J1400J3595J6056J7460J8492K0437K3065K5315K7095K8845
57196A200775L0218L0692L0660L0527K9613K7247K4161K1427J9020J6762J5458
57185A476560J5614J6133J5971J5990J7459J9826K1828K3795K6766L0139L2307
57174A712388L3027L3220L2967L1633K9588K7908K6763K5697K5136K5854K7394
57163B031575K8622K9454L0466L1341L1268L0446K9741K9428K9599L0903L3231
57152B366074L4762L4072L2325L1449L1122K9683K7113K4740K2648J9847J6561
$$ y = [587963, 604300, 620511, 636449, 652662, 670176, 689237, 709268, 730100, 752028, 774576, 796565, 817692, 838793, 860175, 880868, 899921, 917401, 933720, 948943, 963070, 976160, 988068, 999015, 1010415, 1024010, 1040066, 1057526, 1076018, 1096455, 1119520, 1144835, 1171930, 1200775, 1230993, 1261685, 1292345, 1322872, 1352485, 1379732, 1403893, 1425320, 1444340, 1461102, 1476560, 1492174, 1508307, 1524278, 1540268, 1557727, 1577553, 1599381, 1623176, 1649942, 1680081, 1712388, 1745415, 1778635, 1811602, 1843235, 1872823, 1900731, 1927494, 1953191, 1978327, 2004181, 2031575, 2060197, 2089651, 2120117, 2151458, 2182726, 2213172, 2242913, 2272341, 2301940, 2332843, 2366074, 2400836, 2434908, 2467233, 2498682, 2529804, 2559487, 2586600, 2611340, 2633988, 2653835, 2670396]
57141B670396J3981J2012R551O813N126M587M046L372L691N403P892J1096J5555
57128B773521K1069K6905L2982L9253M4675M8514N1802N5542N8528N9248N8874
57117C270913N9798O2104O4178O5965O8765P2621P6724Q1646Q8384R6232J04698
57106D112028J16456J35309J63015K02065K59523L42204M48354N69858P03631
57097G052443Q56551J039757J263758J539225J875362K274377K730890L235961
57089B1868324L775191M322550M844312N311823N705058O006062O201890O294318
57081F4329528O283602O123509N705320M916827L733405K251666O39626r37488
57073I3045995k356642l542310m463983n129426n566186n801557n857659n758233
$$ y = [2670396, 2684377, 2696389, 2705940, 2712753, 2717879, 2722466, 2726512, 2729884, 2733575, 2738978, 2746870, 2757966, 2773521, 2794590, 2821495, 2854477, 2893730, 2938405, 2986919, 3038721, 3094263, 3152791, 3212039, 3270913, 3330711, 3392815, 3456993, 3522958, 3591723, 3664344, 3741068, 3822714, 3911098, 4007330, 4112028, 4228484, 4363793, 4526808, 4728873, 4988396, 5330600, 5778954, 6348812, 7052443, 7908994, 8948751, 10212509, 11751734, 13627096, 15901473, 18632363, 21868324, 25643515, 29966065, 34810377, 40122200, 45827258, 51833320, 58035210, 64329528, 70613130, 76736639, 82441959, 87358786, 91092191, 93343857, 93983483, 93045995, 90689353, 87147043, 82683060, 77553634, 71987448, 66185891, 60328232, 54569999]
57065E4569999n531789n207905m814961m381107l933155l492907l075642k691307
57057B1441226k345288k038755j770564j539282j342778j177076j037141r18416
57049I271926q16713p27671o47863n76118n12639m57124m08434l65417l27190
57040D432757k92986k62401k35440k11867j90927j71939j54614j38673j23978
57031B649932j10992j00065r0083p9144o6680n3581l9955k4485o441J3657L5683
57020B127846N9088P8175Q1051N7916J1292m4123r2072j23996j39386j41369j34161
57009A740261j22429j09826r7651q5758p4364o4231n5647m8403m2542l8142l4614
56998I66654l1143k7776k5154k3219k1206j9016j7526j7057j6493j4600j1453
$$ y = [54569999, 49038210, 43830305, 39015344, 34634237, 30701082, 27208175, 24132533, 21441226, 19095938, 17057183, 15286619, 13747337, 12404559, 11227483, 10190342, 9271926, 8455213, 7727542, 7079679, 6503561, 5990922, 5533798, 5125364, 4759947, 4432757, 4139771, 3877370, 3641930, 3430063, 3239136, 3067197, 2912583, 2773910, 2649932, 2538940, 2438875, 2348792, 2269648, 2202968, 2149387, 2109432, 2084947, 2078506, 2092163, 2127846, 2186934, 2265109, 2346160, 2404076, 2415368, 2371245, 2279173, 2155177, 2015791, 1874422, 1740261, 1617832, 1508006, 1410355, 1324597, 1250233, 1186002, 1130355, 1081952, 1039410, 1001268, 966654, 935511, 907735, 882581, 859362, 838156, 819140, 801614, 784557, 768064, 753464, 742011]
56987G42011p882m110J85M865R168J2267J3276J1128N404k736j1195j8364k3453
56974G30564k5899k5601k3579k1243j8886j5794j1927q270n384k703K35L023N396
56961E79932Q058J1777J6386K1291K6064K9764L0372K5935J6250L151j0424k1457
56949G37099k8007l0200k9856k8594k6678k3882k0524j7044j3313r173n095j524
56937E03209J993O245J1362J7014K3101K9539L5607M0023M1247L7399K6972J0777
56925G84488p246k2304l1986l6812l8303l7519l5244l2268k9039k5587k1977j8490
56913D47713j5373j2773j0870r727r116q721q313p550o075m116k526j808j554
56900C49191j239r87j006q59%J404K864M378O203Q203J0212J2688J6201K0419
$$ y = [742011, 734129, 730019, 730204, 735069, 744237, 756504, 769780, 780908, 786312, 783576, 772381, 754017, 730564, 704665, 679064, 655485, 634242, 615356, 599562, 587635, 579365, 573981, 571278, 571513, 574536, 579932, 587990, 599767, 616153, 637444, 663508, 693272, 723644, 749579, 765829, 768980, 758556, 737099, 709092, 678892, 649036, 620442, 593764, 569882, 549358, 532314, 519001, 509828, 504733, 503209, 505202, 511447, 522809, 539823, 562924, 592463, 628070, 668093, 709340, 746739, 773711, 784488, 777242, 754938, 722952, 686140, 647837, 610318, 575074, 542806, 513767, 488180, 466203, 447713, 432340, 419567, 408697, 398970, 389854, 381133, 372820, 365270, 359195, 355079, 352553, 350745, 349191, 347952, 346965, 345959, 345100, 345100, 346504, 349368, 353746, 359949, 368152, 378364, 391052, 407253, 427672]
56886D27672K4254K6808K7447K5251J9457J0600O93q027j4248j7720j8808j8080
56874D85299j6013j3009r615o396l348J44M501R436J4551K0094K6601L4128M2199
56861E88572N0350N8256O5186O9264O7252N5932L4977Q674j6222l4873m6254n1317
56849H49797n1080m7019m1380l5509k8792k0373j1046k226O161J5350K5899L7540
56837F97322N0295O4364P9077R3087J05036J12488J10536R3808O1259J8614k4406
56826A461480n9266q1938r2976r5402r2202q5159p5401o4213n2735m1402l0307
56815F90479j9777r875J62J1176K3074L5237M7560O0050P1421P8751P8547O8021
56803A134826M6397J6357j5988m3860o3271p3847p7122p5044o9611o2452n4270
$$ y = [427672, 451926, 478734, 506181, 531432, 550889, 561489, 562182, 554155, 539907, 522187, 503379, 485299, 469286, 456277, 446662, 440266, 436918, 437062, 441563, 450999, 465550, 485644, 512245, 546373, 588572, 638922, 697178, 762364, 831628, 898880, 954812, 989789, 998463, 982241, 947368, 901114, 849797, 798717, 751698, 710318, 674809, 646017, 625644, 614598, 612372, 618533, 633883, 659782, 697322, 747617, 811981, 891058, 984145, 1089181, 1201669, 1312205, 1406013, 1467272, 1485886, 1461480, 1402214, 1320276, 1227300, 1131898, 1039696, 954537, 879136, 814923, 762188, 720786, 690479, 670702, 660827, 660989, 672165, 695239, 730476, 778036, 838086, 909507, 988258, 1066805, 1134826, 1181223, 1197580, 1181592, 1137732, 1074461, 1000614, 923492, 848448, 778837, 716385, 662115]
56792F62115m5239l5969k7431k0017j3307o710J68P558J5288K2704K9316L5108
56780F23584L9530M0621L6133K5514J0328o779k2889l5327m2801m6088m6800m5586
56768E29440m2285l7391l2234k7704k3721k0014j6661j3834j1645j0237r483q861
56756B75370q074p405o911n915m127k555k221k568k341j594j404j955k299k017
56742B23984j700j697j573j008k30N43J186J186J41j243j712j074k68J22L47M86
56726B17490J82l90l48O17J683J892J113j16j029r23J93J315J487J051R87J346
56710B26550J345Q61N88O91N27j06n04j61O01J277J626J389M84m03l75L76P12
56693B35478N9r96j637j511n70Q10J658J333N57M90J019J079N15J82K40o0p15
$$ y = [662115, 616876, 580907, 553476, 533459, 520152, 513442, 513610, 521168, 536456, 559160, 588476, 623584, 663114, 703735, 739868, 765382, 775710, 768931, 746042, 710715, 667914, 621826, 575026, 529440, 487155, 449764, 417530, 389826, 366105, 346091, 329430, 315596, 303951, 293714, 284231, 275370, 267296, 259891, 252980, 247065, 242938, 240383, 238162, 235594, 233253, 231659, 230255, 228300, 226001, 223984, 222284, 220587, 219014, 218006, 217776, 218319, 219505, 220691, 220832, 219589, 217877, 216803, 216535, 216657, 217004, 217490, 217672, 217282, 216934, 217551, 219234, 221126, 222239, 222123, 221094, 220171, 220364, 221679, 223166, 224217, 225204, 226550, 227895, 228756, 229344, 230035, 230562, 230456, 229952, 229791, 230392, 231669, 233295, 234684, 235168, 234765, 234390, 234766, 235478, 235537, 234541, 232904, 231393, 230823, 231633, 233291, 234624, 235181, 235671, 236690, 237769, 238284, 238466, 238706, 238646, 237931]
56676B37931o77L04J051Q47N26R46J598J688J521J778K211K034J193L76O2J71
56660B53560L44K56k04p70j047r66o54J7J173K356K867K639K177J718J118M08
56644B64992j78n76o70p0J083J629P14q17j540j527j869k543k390j254m00n10
56628B54074q21o31l28l93o53r26j366j775j687j332j448j916j795q80o3J12r
56611B38163k70q70j344p94M33Q31r9j138j292r33n76k8N51L31o53j050j55R48
56593B32055J098O85N97P52O65N45Q26J306J547J488J162N89K38P32J707K020
56577B48012J402P41N13K43j12K11J200J636J013M82J077K349L587N025O866Q392
56561B82637R109R692J0850J2313J3657J4943J5684J4554J1146O928L418O34j767
$$ y = [237931, 237254, 237558, 238609, 239456, 239982, 240928, 242526, 244214, 245735, 247513, 249724, 251758, 252951, 253327, 253389, 253560, 253904, 254160, 253956, 253186, 252139, 251173, 250519, 250536, 251709, 254065, 256932, 259571, 261748, 263466, 264584, 264992, 264814, 264238, 263568, 263498, 264581, 266210, 266924, 266107, 264567, 263040, 261171, 258628, 256238, 254984, 254584, 254074, 253253, 252622, 252294, 251901, 251248, 250322, 248956, 247181, 245494, 244162, 242714, 240798, 239003, 238123, 238060, 238172, 238163, 237893, 237023, 235679, 234885, 235318, 236149, 236050, 234912, 233620, 232687, 232111, 232083, 232634, 232965, 232312, 231262, 231107, 232055, 233153, 233838, 234435, 235187, 235852, 236397, 237223, 238529, 240076, 241564, 242726, 243315, 243553, 244285, 245992, 248012, 249414, 250155, 250668, 250911, 250799, 251010, 252210, 253846, 254859, 255341, 256418, 258767, 262354, 267379, 274245, 282637, 291746, 301438, 312288, 324601, 338258, 353201, 368885, 383439, 394585, 401513, 404931, 405565, 403798]
56548D03798l147k948j984j363j091p71p40j286j696j285o44q03j752k792l645
56533C77851m315m644m720n035n542n452m593l925l998m048l411k642k387k295
56519C20844k078k400l635m843n082m710m362l715k428j218q01p14l11L6k74r88
56503B83321j657k419l108k853j540n19p14j262j178r96j430j751j058L2N08O73
56487B64049J155J363O54J6P16K095K516J819J107O95R4m68k84L75N90L60M33
56470B77285Q83J146J104R55M39n85j265p41M54J102R42N34Q3m55p08m00lJ12
56452B80882M36J205J516P23k44l17J1j71l43M73J714J983J233N72M07K88Q3j03
56434B90348o60j732k277j349K23Q28K02p11j326j487p78P20J610P68q54j500
$$ y = [403798, 400651, 397703, 395719, 394356, 393265, 392494, 391754, 390468, 388772, 387487, 386843, 386040, 384288, 381496, 377851, 373536, 368892, 364172, 359137, 353595, 348143, 343550, 339625, 335627, 331579, 328168, 325526, 323139, 320844, 318766, 316366, 312731, 307888, 302806, 298096, 293734, 290019, 287591, 286373, 285572, 284858, 284547, 284583, 284309, 283321, 281664, 279245, 276137, 273284, 271744, 271225, 270511, 269249, 268071, 267075, 265645, 263894, 262836, 262868, 263376, 264049, 265204, 266567, 267221, 267237, 267953, 270048, 272564, 274383, 275490, 276185, 276279, 275811, 275527, 275902, 276492, 276852, 277285, 278168, 279314, 280418, 281373, 281812, 281227, 279962, 279221, 279675, 280777, 281719, 282253, 282336, 281881, 281173, 280773, 280770, 280882, 281318, 282523, 284039, 284762, 284518, 284201, 284212, 284041, 283698, 284171, 285885, 287868, 289101, 289673, 290080, 290368, 290451, 290348, 289688, 287956, 285679, 284330, 284553, 285381, 285583, 284872, 283546, 282059, 281281, 282001, 283611, 284379, 283525, 282025]
56418B82025j006m14J1N86Q23J02p32k90J129J980J842J648J819J791J310P29
56402B93353J57m19n24M1M10j02o03O4J287J614J072Q69J277J533J476J584J693
56385C04782J277O90P19J192J396J363J465J382Q13M53Q70J237P43J68M74R12
56369C19936M35j57L78J250R25o2l3P95Q06m2l06J67J92k28J83J495K399K481
56351C30614K568K829K648K251K317K235R65o21o85M45O27o22j479q42M49J624
56335C45323K910M117M467M206M333M612L912K504J902K359K775K961L666M393
56321C94440L818K462K235L024K566K48j746j886j258j101r27k98j49r68j478
56306C98982m73J511L254M286M556M129L777M494N968O865O768O371N853M744
$$ y = [282025, 281019, 280605, 280616, 281202, 282025, 282127, 281395, 281105, 282234, 284214, 286056, 287704, 289523, 291314, 292624, 293353, 293510, 293091, 292567, 292608, 293018, 292916, 292313, 292377, 293664, 295278, 296350, 297219, 298496, 300029, 301505, 303089, 304782, 306059, 306749, 307468, 308660, 310056, 311419, 312884, 314266, 315079, 315532, 316402, 317639, 318382, 318550, 319024, 319936, 320371, 320214, 320592, 321842, 322767, 322705, 322672, 323467, 324273, 324231, 323925, 324092, 324284, 324056, 324239, 325734, 328133, 330614, 333182, 336011, 338659, 340910, 343227, 345462, 346427, 345806, 345121, 345566, 346193, 345571, 344092, 343250, 343699, 345323, 348233, 352350, 356817, 361023, 365356, 369968, 373880, 376384, 378286, 380645, 383420, 386381, 390047, 394440, 398258, 400720, 402955, 405979, 408545, 408793, 407047, 405161, 403903, 402802, 401875, 401577, 401428, 400460, 398982, 398509, 400020, 403274, 407560, 412116, 416245, 420022, 424516, 430484, 437349, 444117, 450488, 456341, 461085]
56292D61085L396K750K668K355K235L335M963N340M545M402N366O037N937O217
56278E20631P097P327O743O878Q258R472R677R794J0531J1366J2176J3674J5539
56265F49163J6310J5874J5966J7601J9943K2143K4275K6190K7635K9773L4220
56254H99093M0333M5939N0911N7280O5560P3981Q1927R0970J01590J11872J20620
56243A740076J28845J36929J43137J46291J47292J46593J42630J34237J22230
56234B988260J07274Q8549O5998M1704J7597o205k9602n1155o9712q5446r8259
56223B969003j07231j12683j16501j19473j20369j18607j15540j12078j07420
56214A939101j01196r4775q9267q4224p9121p4195o9200o3512n7899n3812n0610
$$ y = [461085, 464481, 467231, 469899, 472254, 474489, 477824, 482787, 488127, 492672, 497074, 502440, 508477, 514414, 520631, 527728, 535055, 541798, 548676, 556934, 566406, 576083, 585877, 596408, 607774, 619950, 633624, 649163, 665473, 681347, 697313, 714914, 734857, 757000, 781275, 807465, 835100, 864873, 899093, 939426, 985365, 1036276, 1093556, 1159116, 1233097, 1315024, 1405994, 1507584, 1619456, 1740076, 1868921, 2005850, 2148987, 2295278, 2442570, 2589163, 2731793, 2866030, 2988260, 3095534, 3184083, 3250081, 3291785, 3309382, 3303177, 3273575, 3222420, 3152708, 3067262, 2969003, 2861772, 2749089, 2632588, 2513115, 2392746, 2274139, 2158599, 2046521, 1939101, 1837905, 1743130, 1653863, 1569639, 1490518, 1416323, 1347123, 1283611, 1225712, 1171900, 1121290]
56203A121290m6179m0689l6674l4872l3122l0160k7201k4844k1779j7894j5258
56192G92618j4602j3918j1975j0188r477q438o229m319l709l314k558k648l809
56179F97434m167k908j623j165k34J559K446J750J233J744J840J080J181K466
56165G02636K859J964K299M681O389N964N771P479R047Q866Q958J1118J3424J3696
56151H05151J3168J3905J5583J7510K0671K5224K9149L1892L6161M3684N2585
56140A104683O1271P1198Q3260R5282J05734J15858J25154J29006J24272J13561
56130B129279J00826Q6794P2246O1337N7064N6530N4694M9825M1968K9968J4261
56119B754792p18j1224j8499k5111l0707l5373m3184n7527p5662r2314j05789
$$ y = [1121290, 1075111, 1034422, 997748, 962876, 929754, 899594, 872393, 847549, 825770, 807876, 792618, 778016, 764098, 752123, 741935, 732458, 724020, 717791, 713472, 709763, 706449, 703891, 701243, 697434, 693267, 690359, 688736, 687571, 687337, 688896, 691342, 693092, 694325, 696069, 697909, 698989, 700170, 702636, 705495, 707459, 709758, 714439, 720828, 726792, 732563, 740042, 749089, 757955, 766913, 778031, 791455, 805151, 818319, 832224, 847807, 865317, 885988, 911212, 940361, 972253, 1008414, 1052098, 1104683, 1165954, 1237152, 1320412, 1415694, 1521428, 1637286, 1762440, 1891446, 2015718, 2129279, 2230105, 2316899, 2389145, 2450482, 2507546, 2564076, 2618770, 2668595, 2710563, 2740531, 2754792, 2754074, 2742850, 2724351, 2699240, 2668533, 2633160, 2589976, 2532449, 2456787, 2364473, 2258684]
56108B258684j16374j22039j20640j13989j05347r5060q2468o9537n8628m9198
56098A325404m0218l3047k8419k3813j7489j1883r315p882n334l175k922k278
56086A139629O42L285L341L336N818Q192P417N796O753Q729Q722Q096R399J1039
56072A230194J0689J0326J2338J4393J3722J2692J4394J6678J6447J5850J8005
56061A385728K0653K0423J9422K0932K2638K1041J8617J9443K1411K0152J7141
56050A607601J6511J7307J6303J5136J7098K0136K0526K0136K2561K5604K5359
56039A824278K4217K6696L0770L1497L0106L1203L4239L5726L6716L9972M3145
56028B188565M2911M2152M4915M8333M7916M6442M8728N2276N2399N1739N4995
$$ y = [2258684, 2142310, 2020271, 1899631, 1785642, 1680295, 1585235, 1502767, 1433230, 1374602, 1325404, 1285186, 1252139, 1223720, 1199907, 1182418, 1170535, 1161220, 1153338, 1148004, 1144829, 1141907, 1139629, 1140271, 1143556, 1146897, 1150233, 1156051, 1164243, 1171660, 1177456, 1184209, 1192938, 1201660, 1209756, 1219155, 1230194, 1240883, 1251209, 1263547, 1277940, 1291662, 1304354, 1318748, 1335426, 1351873, 1367723, 1385728, 1406381, 1426804, 1446226, 1467158, 1489796, 1510837, 1529454, 1548897, 1570308, 1590460, 1607601, 1624112, 1641419, 1657722, 1672858, 1689956, 1710092, 1730618, 1750754, 1773315, 1798919, 1824278, 1848495, 1875191, 1905961, 1937458, 1967564, 1998767, 2033006, 2068732, 2105448, 2145420, 2188565, 2231476, 2273628, 2318543, 2366876, 2414792, 2461234, 2509962, 2562238, 2614637, 2666376, 2721371]
56017B721371N9196N9454N9210O4035P0469P2287P2530P7493Q4088Q5751Q5669
56006C511553R0930R8597J01212J01366J06714J15235J19930J23383J32645J44354
55996D645919J50462J54073J63628J76265J83675J89414K02774K20442K32686
55987F319338K42894K61555K85749L04880L21983L48159L80538M08092M34614
55978I307802M72638N19303N62685O07254O67043P38595Q08308Q81616R75697
55969A5540941J088650J207298J340014J508076J710932J936994K202631K540406
55961B9075942K956502L445552M041302M804471N771427O974021Q502034J0480259
55953G6051510J2991506J6088777J9850073K4306975K9326199L4654474L9940008
$$ y = [2721371, 2780567, 2840021, 2899231, 2963266, 3033735, 3106022, 3178552, 3256045, 3340133, 3425884, 3511553, 3602483, 3701080, 3802292, 3903658, 4010372, 4125607, 4245537, 4368920, 4501565, 4645919, 4796381, 4950454, 5114082, 5290347, 5474022, 5663436, 5866210, 6086652, 6319338, 6562232, 6823787, 7109536, 7414416, 7736399, 8084558, 8465096, 8873188, 9307802, 9780440, 10299743, 10862428, 11469682, 12136725, 12875320, 13683628, 14565244, 15540941, 16629591, 17836889, 19176903, 20684979, 22395911, 24332905, 26535536, 29075942, 32032444, 35477996, 39519298, 44323769, 50095196, 57069217, 65571251, 76051510, 89043016, 105131793, 124981866, 149288841, 178615040, 213269514, 253209522]
55946B53209522M4320974M5883988M2068049L1376872J5022467l290087j9430030
55939D09161755l0889213l7262510l9422874l8594150l5914359l2288726k8320515
55932A66469408k4361944k0647832j7345641j4514760j2120330j0116619q476351
55925E8885931p150005o061873n158739m420099l818287l310764k874948k511940
55917B3579276k211774j948605j712132j511235j343833j192823j053648r37341
55909A1667885q43706p57983o76256o09033n57285n08698m60157m21303l93233
55900F440231l65014l33918l08751k90661k70122k45519k26081k13692j99602
55891C986871j81659j67720j59442j49234j35794j26620j22525j15253j03174
$$ y = [253209522, 297530496, 343414484, 385482533, 416859405, 431881872, 428591785, 409161755, 378272542, 341010032, 301587158, 262993008, 227078649, 194789923, 166469408, 142107464, 121459632, 104113991, 89599231, 77478901, 67362282, 58885931, 51735926, 45674053, 40515314, 36095215, 32276928, 28966164, 26091216, 23579276, 21367502, 19418897, 17706765, 16195530, 14851697, 13658874, 12605226, 11667885, 10824179, 10066196, 9389940, 8780907, 8223622, 7714924, 7254767, 6833464, 6440231, 6075217, 5741299, 5432548, 5141887, 4871765, 4626246, 4400165, 4186473, 3986871, 3805212, 3637492, 3478050, 3328816, 3193022, 3066402, 2943877, 2828624, 2725450]
55882B725450r4247r0592q4715p3974o4811n9783n4100m7947m8588n6690o3275
55871A986728o3860o3664o5624o5300o1183n8539n9089n7480n1569m6179m3581
55860A350660m0071l4804l2253l3063l2110k8291k6744k8735k8984k5722k3888
55849A015995k5425k5824k3403k2773k5624k7044k4545k2334k2949k2788j9707
55838G53579j7314j7874j8171j5992j4006j3873j3055j0504r114r759r224o564
55826E98129n228o512p287o418o855r195r869q053p634r942j1191r646q616r722
55812D81961r857p630o295p265p203m479k265k187j158K339M975M905N266P951
55798D59058R788Q497O833P102O880L919L40j676l534o291p787p015o592p762
$$ y = [2725450, 2631203, 2540611, 2455896, 2381922, 2317111, 2257328, 2203228, 2155281, 2106693, 2050003, 1986728, 1922868, 1859204, 1793580, 1728280, 1667097, 1608558, 1549469, 1491989, 1440420, 1394241, 1350660, 1310589, 1275785, 1243532, 1210469, 1178359, 1150068, 1123324, 1094589, 1065605, 1039883, 1015995, 990570, 964746, 941343, 918570, 892946, 865902, 841357, 819023, 796074, 773286, 753579, 736265, 718391, 700220, 684228, 670222, 656349, 643294, 632790, 623676, 613917, 604693, 598129, 592901, 586389, 579102, 572684, 565829, 556634, 546765, 538712, 531078, 521136, 509945, 500299, 491683, 481961, 472104, 464474, 458179, 450914, 443711, 439232, 436967, 434780, 433622, 435961, 440936, 445841, 451107, 459058, 468846, 477343, 484176, 491278, 498158, 502077, 502417, 500741, 497207, 490916, 483129, 476114, 469522, 461760]
55784D61760p656m669j868j806k753l208n224r630j2778j1854r173p459n175l33
55770C78174N229R324J3268J8202K1070J8402J1283L097m699j1437j5147j5216
55758D31550j4386j4956j5581j4565j3315j3606j4359j4056j3559j3823j3532
55747B75812j1735r982r356q286n784l772l626l539j953l85j49M12K502L829K252
55732B26240m87j713j848k421k884k471k621m391n910n470m680n466o407n227
55718A74244k797j414j089n39J0JO81L175O062P499Q075R085R783Q825O767M659
55702B33027J988j715m984o504p306q586r325q293o587n786n418m439l384k885
55688A59803k063n37J33p49j065Q71L304L999L899N029O669O797N649M854M336
$$ y = [461760, 454104, 449435, 447567, 445761, 443008, 439800, 434576, 424946, 412168, 400314, 391141, 383682, 378507, 378174, 383403, 392727, 405995, 424197, 445267, 463669, 474952, 478049, 473350, 461913, 446766, 431550, 417164, 402208, 386627, 372062, 358747, 345141, 330782, 316726, 303167, 289344, 275812, 264077, 254095, 244739, 236453, 230669, 226897, 223271, 219732, 217779, 217394, 217245, 217657, 220159, 223988, 226240, 225753, 224040, 222192, 219771, 216887, 214416, 211795, 207404, 201494, 196024, 191344, 185878, 179471, 174244, 171447, 170033, 168944, 168405, 168415, 168416, 169097, 172272, 178334, 185833, 193908, 202993, 212776, 221601, 228368, 233027, 235015, 233300, 228316, 221812, 214506, 205920, 196595, 188302, 181715, 175929, 170511, 166072, 162688, 159803, 157740, 157203, 157336, 156587, 155522, 156393, 159697, 163696, 167595, 172624, 179293, 186090, 191739, 196593, 200929]
55673B00929K929R98k53j078k395l645l727l032k586k245j563j163j454j404l00
55658A80011P77J034J569L141M242L517K198J876J778O55n60n23j45q75j875j628
55642A95192q64j252k449l108l578m940o479o681n871n427n264m426l255k716
55628A38882k435j538n53m88r14q72o88j070j500j351j306j890j973p35M22l4
55612A21957j204j483j269j702k179j674j112j877l082k854j357j59L56O65L17
55597A03343j087k254j882r84j160j729j105J14J09r66j415r13m72j71O27J402
55581I1457J191N80P59J303J023K93K79P66R67J526L301N080N091M029L960M934
55565A26539N256M520L733K955J428l87j298j618k477l448l251k312k178k808
$$ y = [200929, 203858, 204856, 204603, 203525, 201130, 197485, 193758, 190726, 188140, 185895, 184332, 183169, 181715, 180311, 180011, 180788, 181822, 183391, 186532, 190774, 194291, 196489, 198365, 200143, 200798, 200238, 199715, 199570, 198695, 196820, 195192, 194328, 193076, 190627, 187519, 183941, 179001, 172522, 165841, 159970, 154543, 149279, 144853, 141598, 138882, 136447, 134909, 134356, 133868, 132954, 132082, 131394, 130324, 128824, 127473, 126167, 124277, 122304, 121569, 121991, 121957, 120753, 119270, 118001, 116299, 114120, 112446, 111334, 109457, 106375, 103521, 102164, 102005, 102361, 103026, 103343, 102256, 100002, 98120, 97136, 95976, 94247, 93142, 93256, 93365, 92399, 90984, 90071, 89599, 89428, 90055, 91457, 92648, 93228, 93987, 95290, 96313, 96606, 96885, 97651, 98618, 100144, 103445, 108525, 113616, 117645, 121605, 126539, 131795, 136315, 140048, 143003, 144431, 144044, 142746, 141128, 138651, 135203, 131952, 129640, 127462, 124654]
55551A24654k850k204j843j609o68K95l3r82q16J44J29o82l76J130J759Q55K45
55534A17148J095K222K299J561O41l58j123j207j126j736k528k335j577j767k883
55519A08326l393k898k575k795k506j288j05K86k7j032k571l386k362o16k08r76
55503H1874r58J93P21r2r17r39j033j683j920j194l25Q0M61R13P09k31r54r75
55485G3730p08k45O98J525J289N31P22J717J892R36M16J039J564J065K91K1j49
55468H6334o01q77p76p92r73q11n26r24j673j490l15M15J07k61j33k44q92j126
55450G4442l94M94P15M13n2m70k48R91K139J611k29j424j250q18p39l83K51K16
55432G5265l17R6J533K156J079k65n50l46m90n54o9M15N69R20J487J373N38K45
$$ y = [124654, 121804, 119600, 117757, 116148, 115480, 115775, 115742, 114760, 113944, 114088, 114217, 113535, 113159, 114289, 116048, 116903, 117148, 118243, 120465, 122764, 124325, 124966, 124608, 123485, 122278, 121152, 119416, 116888, 114553, 112976, 111209, 108326, 104933, 102035, 99460, 96665, 94159, 92871, 92766, 93052, 93025, 91993, 89422, 86036, 83674, 83058, 82850, 81874, 80916, 81109, 81830, 81738, 80821, 79882, 78849, 77166, 75246, 74052, 73727, 73807, 74268, 75181, 75890, 75659, 74705, 73730, 73022, 72777, 73475, 75000, 76289, 76820, 77542, 79259, 81151, 82087, 82503, 83542, 85106, 86171, 86462, 86483, 86334, 85733, 84856, 84080, 83288, 82315, 81504, 80978, 80054, 78381, 76891, 76576, 76991, 77098, 76837, 76704, 76460, 75568, 74442, 74048, 74542, 75257, 75670, 75618, 75148, 74900, 75891, 78030, 79641, 79412, 77988, 76738, 75920, 75181, 74798, 75049, 75265, 74948, 75044, 76577, 78733, 79812, 79547, 78997, 78651, 78161, 77607, 77538, 77953, 78522, 79442, 80929, 82302, 82840, 83085]
55414H3085Q87J252P54M96J074J317M01o24p46o71j226j713j328p09o91q33n16
55397H0209j60j43J78J008J147j18j477j426m11K93O70J364K037J882J104M44
55381H6601q2p51j187r78o36p69j012p23j11K39L32L76K10j78l09q9j34o34r26
55362G9239p83r30j518j511m94L30P8l06J90Q44N91K3K68Q75O42k10m77n5N9l90
55342G6465o38l77j24k04m19o30p78n38K02Q51R02P76J057J365J022K98n4j05
55324G9071m52r42q25r4L72N0o05r47q51n63l74m26m98j57O17J204J053L58k71
55305G5720m68j99L82Q67Q09K46l31o35p07l76N70J623J787R67K60M39J021J164
55287H3139P93L43J10K18N86P28K28m40m31J30L18p8l54l07m88q51o54j4J3o61
$$ y = [83085, 83972, 85224, 85978, 86474, 87548, 88865, 89266, 88642, 87896, 87225, 85999, 84286, 82958, 82249, 81558, 80725, 80209, 80049, 79906, 80084, 81092, 82239, 82121, 80644, 79218, 78807, 79100, 79770, 81134, 83171, 85053, 86157, 86601, 86519, 85768, 84581, 83603, 82967, 82198, 81186, 80463, 80352, 80591, 80923, 81299, 81509, 81331, 81022, 80933, 80799, 80165, 79239, 78456, 77526, 76008, 74497, 74003, 74333, 74411, 74105, 74295, 75139, 75730, 75753, 76021, 76896, 77538, 77328, 76851, 76796, 76855, 76465, 75827, 75450, 75326, 75122, 74703, 74073, 73295, 72757, 72959, 73810, 74712, 75488, 76545, 77910, 78932, 79230, 79176, 79071, 78619, 77677, 76852, 76758, 77130, 77180, 76575, 75628, 74777, 74214, 73840, 73414, 72916, 72759, 73376, 74580, 75633, 75991, 75720, 75252, 75053, 75435, 76302, 77111, 77357, 77026, 76391, 75684, 75308, 75878, 77501, 79288, 80255, 80515, 80954, 81975, 83139, 83932, 84275, 84385, 84603, 85189, 85917, 86145, 85705, 85274, 85404, 85722, 85644, 85290, 84983, 84495, 83644, 82990, 82976, 82989, 82328]
55267H2328q19j29J99l24l94P08J563Q40m94p94j94K09L68P54Q88K37l40K18J206
55248H6030J160J54n22m62k40P9Q64J607J311O3j087j658j872j666r32m05q63
55231H1561j653j474m23J58j28k57L67J024J033P76Q81J255J399J033J35j014
55215H4673j743j524o62N5L29M79P12R03R71R25O00m6n92n65j35J36O9j5J82O54
55195H5406J113J083L68m09l64L69O99K68J7N69J051N32l94n34P9M54J95k38n18
55176H9746o33n13k06j06l10l12J14M15L71O73J539J850R52J96J015K404K160
55159I9355K32j268j197o28o99j008p75j76K36M45O42P12N66M52O03R90J455J726
55141A01663J435N99j74n07q91j805k581k154o50O94J109Q55L58l45j117j572
$$ y = [82328, 81509, 81380, 81579, 81255, 80861, 81569, 83132, 83972, 83478, 82684, 82490, 82699, 83067, 83821, 84709, 84946, 84606, 84824, 86030, 87190, 87344, 86822, 86360, 86120, 86199, 87063, 88670, 89981, 90044, 88957, 87299, 85427, 83761, 82829, 82424, 81561, 79908, 78434, 78011, 78169, 78041, 77784, 78151, 79175, 80208, 80984, 81865, 83120, 84519, 85552, 85687, 84673, 82930, 81406, 80744, 80799, 81128, 81607, 82319, 83222, 84193, 85118, 85718, 85672, 85080, 84515, 84380, 84516, 84585, 84570, 84752, 85406, 86519, 87602, 87970, 87561, 87197, 87566, 88265, 88533, 88550, 89119, 90170, 90702, 90308, 89774, 89853, 90307, 90502, 90264, 89746, 89113, 88600, 88394, 88288, 87978, 87666, 87780, 88195, 88566, 89239, 90778, 92628, 93580, 93776, 94791, 97195, 99355, 99587, 98319, 97122, 96494, 95795, 94787, 94012, 93836, 94072, 94517, 95159, 95871, 96437, 96889, 97492, 98482, 99937, 101663, 103098, 103697, 103523, 103016, 102125, 100320, 97739, 95585, 94935, 95629, 96738, 97593, 97951, 97606, 96489, 94917]
55125I4917j472q92n5N55L54n19j003m77L01L90J81N59J175R18j46p08r1J043
55107I5030J869K143J690L19j381k205j621k23J163K128K435J978J140N22J91
55092A05178j74n01m21l0J37n4l18n69q65r04l52L78N32Q5l22l83k71k7M02O58
55072A02179L89rR3N22O46M90N44O75L62j59j66K19J18n94r94n21L28R05J134
55053A06161J105Q26N22M56L81m6m19j06M92K92q29j771j787j270p81l15J33J91
55035A03235k83q34r44m65M81J432J574N83o14p98nP29J010J287J554J145Oj001
55017A08092j347j325j078l61M77M84m02r67m31M42O41L62L92P41P48J98m10n50
54999A05706k54L3L1O8P57J972K587J782K02q20q59l97K92J163J641J037k40j034
$$ y = [94917, 93445, 92553, 92498, 93053, 93407, 92888, 91885, 91408, 91709, 92099, 92280, 92839, 94014, 94932, 94786, 94078, 93987, 95030, 96899, 99042, 100732, 101051, 99670, 97465, 95844, 95621, 96784, 98912, 101347, 103325, 104465, 104987, 105178, 105004, 104503, 104082, 104052, 104189, 104135, 103817, 103248, 102383, 101479, 101127, 101505, 102037, 102122, 101800, 101417, 101146, 101119, 101521, 102179, 102568, 102559, 102652, 103174, 103820, 104310, 104854, 105529, 105891, 105732, 105566, 105785, 105903, 105309, 104315, 103794, 104122, 105027, 106161, 107266, 108092, 108614, 109070, 109451, 109405, 108986, 108880, 109372, 109664, 108835, 107064, 105277, 104007, 103226, 102911, 103044, 103235, 102952, 102118, 101174, 100709, 101190, 102622, 104196, 104779, 104165, 103367, 103362, 104091, 105101, 106388, 107942, 109087, 109093, 108092, 106745, 105420, 104342, 103981, 104458, 104942, 104540, 103573, 103142, 103584, 104225, 104587, 104979, 105720, 106468, 106666, 106256, 105706, 105452, 105485, 105516, 105584, 106341, 108313, 110900, 112682, 112884, 112064, 111205, 110808, 111100, 112263, 113904, 114941, 114701, 113667]
54981A13667r66o72n21k71L5J5j28J61N97L40l82l50O86J476J147L23j16j28J74
54962A15087J026K140K440J498K85k58m56r80j533j309j65J284K339K484J588
54947A25470K24p09r52r63j024r92r57j138j107k31R84J233L92j84K65R28R81
54930A22220P14M66p6o90j90J690L291L218K392K597L900N039N622O421P701Q707
54914A73022Q790Q044O811N295L611J672p88l562n735o586o380n846n429n398
54900A67521n997o871o994n891m287l007j913o66K15M0q14j295r97l41K70P26
54884A29699R61J042J320J966K662L111L405L580L444L279L919N523P016P444
54870A78371P167O906O402M956K705L32j953m210n921o450o087n772n924o260
$$ y = [113667, 112701, 112029, 111508, 111237, 111272, 111287, 111159, 111320, 111917, 112257, 111875, 111525, 112211, 113687, 114834, 115157, 115041, 114913, 115087, 116113, 118253, 120693, 122191, 122476, 122218, 121762, 120782, 119249, 117940, 117775, 119059, 121398, 123882, 125470, 125694, 124985, 124033, 123070, 122046, 121054, 120097, 118959, 117852, 117621, 118605, 119838, 120230, 120046, 120311, 121239, 122220, 122934, 123400, 123324, 122634, 122444, 124134, 127425, 130643, 133035, 135632, 139532, 144571, 150193, 156614, 164315, 173022, 181812, 189856, 196667, 201962, 205573, 207245, 206457, 202895, 197160, 190574, 184194, 178348, 172919, 167521, 161524, 154653, 147659, 141768, 137481, 134474, 132561, 131895, 132110, 132150, 131336, 130041, 129044, 128703, 128973, 129699, 130660, 131702, 133022, 134988, 137650, 140761, 144166, 147746, 151190, 154469, 158388, 163911, 170927, 178371, 185538, 192444, 198846, 203802, 206507, 206839, 204886, 200676, 194755, 188305, 182218, 176446, 170522, 164262]
54856A64262o469o369n672m442l408l158l255k954k348j962j622p73K69M83l90
54841A22192j435j789j512j055n69K8O92J210J330R39L00j41k96n34r58j070n34
54824A16798K17N99O31O06M88J59j35k34m47r31j180p98k33k2J69Q63J566J344
54806A19460L44k61J24Q92J297J277J083P81L96J20J07L05N62P02N64K02j96o43
54788A27116j241j644j223q0Q17R29Q59J190J421R23K31K90R18J212J146J529
54772A34393K434K903K494K001K314L276M131M562M931N831P495R398J0410R730
54758B06303P682N278L173J392j57j499k829m435o268p862q678q371p077n584
54744A71068m873n084n396n111m370l474k285q86m4j41l20L71J475J822J278P77
$$ y = [164262, 157793, 151424, 145752, 141310, 137902, 134744, 131489, 128535, 126187, 124225, 122603, 121830, 122099, 122582, 122192, 120757, 118968, 117456, 116401, 115832, 115860, 116552, 117762, 119092, 120031, 120331, 120190, 119894, 119360, 118402, 117332, 116798, 117015, 117614, 118245, 118851, 119339, 119498, 119363, 119129, 118682, 117751, 116571, 115773, 115540, 115518, 115687, 116550, 118116, 119460, 119804, 119543, 119667, 120559, 121856, 123133, 124216, 124997, 125393, 125513, 125620, 125925, 126487, 127189, 127753, 127955, 127759, 127116, 125875, 124231, 123008, 122928, 123745, 124674, 125533, 126723, 128144, 129067, 129298, 129588, 130506, 131718, 132864, 134393, 136827, 139730, 142224, 144225, 146539, 149815, 153946, 158508, 163439, 169270, 176765, 186163, 196573, 206303, 213985, 219263, 222436, 223828, 223671, 222172, 219343, 214908, 208640, 200778, 192100, 183729, 176652, 171068, 166195, 161111, 155715, 150604, 146234, 142760, 140475, 139589, 139545, 139404, 139084, 139455, 140930, 142752, 144030, 144807]
54728A44807Q12J055J249J494J724J872K460L969N756O647O607O631O953O598
54714A98634N012K988J411J06j437l036m211m997n688o178o179n820n519n393
54700A59693n178m610l691k675j872j412j088o42p5M35P40O54n5j226k088k011
54684A34899j269o30l60j73j0j90p56j231j190p12k28j62o51j289j353o59R9K53
54666A24388K9j7%l68q76q36k87lk62m82k81k5p3j35J65O30P46L19l96r29q78
54645A20429k52M08N01O6l05j52M52J096J344R88L47Q3M12P52N26l2l48l98m69
54626A25448m25J19J007J574J407N64o84j778j911q92L51Q11O88P71R62N07m77
54609A28042r30m13K99M36J57n1o3P0K85K78j81n75r2J109J881J562P07N5l88
$$ y = [144807, 145619, 146674, 147923, 149417, 151141, 153013, 155473, 159442, 165198, 171845, 178452, 185083, 192036, 198634, 203646, 206634, 208045, 208151, 206714, 203678, 199467, 194470, 188782, 182604, 176425, 170605, 165086, 159693, 154515, 149905, 146214, 143539, 141667, 140255, 139167, 138525, 138450, 138885, 139625, 140279, 140224, 138998, 136910, 134899, 133630, 133000, 132640, 132467, 132457, 132267, 131511, 130280, 129090, 128378, 128150, 127988, 127337, 126048, 124695, 124036, 124135, 124388, 124417, 124400, 124400, 124032, 123156, 122320, 122033, 122030, 121768, 121286, 121005, 120980, 120907, 120772, 120937, 121567, 122313, 122632, 122236, 121307, 120429, 120177, 120585, 121086, 121152, 120847, 120695, 121147, 122243, 123587, 124575, 124922, 125005, 125417, 126169, 126695, 126663, 126315, 125917, 125448, 125023, 125142, 126149, 127723, 129130, 129694, 129010, 127232, 125321, 124429, 124780, 125591, 126279, 127050, 128012, 128519, 128042, 127112, 126699, 126998, 127434, 127591, 127540, 127477, 127547, 127832, 128110, 127929, 127354, 127262, 128371, 130252, 131814, 132521, 132576, 132188]
54590A32188q70j210j132q07n68m49k59J13O18J013R30L59n7K80R78J096M42k05
54572A32460k36J39M56N65N04L30J28j68q59j851k245j342K20J143J156J043J186
54555A32629J138O44M3m54q27n98O88K221K420J077l02n97l38k86j26O36J498
54538A39466J680J285R09O85M05J15m0p1J09O02R12K80j043j725j111j36J17j60
54520A42279k49j71k97l54J13P92R47M74j16m49m48r7M14O16L27q9l50o06q80
54501A41856p83k49J66K08L76R27J187O05k59n81n26p54j225j324q58j84L61N31
54483A39474J75l65l44L09O70J89l53o3O70R35Q13J025J561J788J626J506J447
54466A51063J218J140J662K323K187J276M86J74j33n50m92K27Q72P57J4q45j451
$$ y = [132188, 131318, 130108, 128976, 128169, 127601, 127152, 126893, 127006, 127624, 128637, 129567, 129926, 129869, 130149, 131127, 132223, 132665, 132460, 132224, 132363, 132819, 133384, 133888, 134218, 134346, 134178, 133319, 131468, 129223, 127881, 128101, 129244, 130400, 131443, 132629, 133767, 134411, 134454, 134000, 133173, 132575, 133263, 135484, 137904, 138981, 138679, 138082, 137744, 137458, 137332, 137968, 139466, 141146, 142431, 143340, 144025, 144430, 144545, 144505, 144434, 144543, 145145, 146057, 146337, 145294, 143569, 142458, 142322, 142439, 142279, 142030, 141859, 141562, 141208, 141321, 142113, 143060, 143534, 143418, 142969, 142521, 142424, 142838, 143454, 143781, 143692, 143342, 142736, 141856, 141073, 140824, 140990, 141198, 141574, 142501, 143688, 144293, 144034, 143453, 142927, 142173, 140948, 139624, 138766, 138582, 138943, 139474, 139649, 139284, 138940, 139249, 139919, 140108, 139755, 139692, 140362, 141297, 142110, 143135, 144696, 146484, 148110, 149616, 151063, 152281, 153421, 155083, 157406, 159593, 160869, 161355, 161529, 161396, 160846, 160354, 160581, 161453, 162210, 162224, 161379, 159928]
54449A59928j510q53J47P26N41p6p19j297j718j777j484j073o10l9L58N7r22j782
54431A47897j786r98q1M30M57K42j4k85n28m47K44J306K113K407K461K350J726
54414A57494N96l61o76p04q28p67l20l5k71l38M04J231J032J29k09J91K92k32
54396A56628m73J51J070J739K397L142L321K534J379N54j6o17j024j074j218j799
54380A66694k243j743m22P93J246J006M57j03n55r72j369j377n01J067K375K747
54364A67100K479K173J951J737J793K277K631K240J538J644K764L711L309J737
54350A99084J03r39j592k182k593k589k321k176k299k491k623k756k890k792k237
54335A66707j258j10Q36J128N58l74p30k00M47L33m08r72j105j279j701j934j660
$$ y = [159928, 158418, 157565, 157712, 158438, 158979, 158903, 158184, 156887, 155169, 153392, 151908, 150835, 150225, 150186, 150544, 150601, 149679, 147897, 146111, 145113, 145032, 145462, 145919, 146161, 146147, 145862, 145334, 144887, 145131, 146437, 148550, 150957, 153418, 155768, 157494, 158090, 157729, 157053, 156349, 155521, 154754, 154434, 154399, 154128, 153790, 154194, 155425, 156457, 156586, 156377, 156568, 156860, 156628, 156155, 156306, 157376, 159115, 161512, 164654, 167975, 170509, 171888, 172442, 172426, 171809, 170785, 169711, 168493, 166694, 164451, 162708, 162286, 163079, 164325, 165331, 165788, 165685, 165130, 164158, 162789, 161412, 160911, 161978, 164353, 167100, 169579, 171752, 173703, 175440, 177233, 179510, 182141, 184381, 185919, 187563, 190327, 194038, 197347, 199084, 199187, 198248, 196656, 194474, 191881, 189292, 186971, 184795, 182496, 180005, 177382, 174626, 171736, 168944, 166707, 165449, 165339, 166175, 167303, 167861, 167487, 166757, 166557, 167004, 167337, 166929, 165957, 164852, 163573, 161872, 159938, 158278]
54318A58278j219j027r53o37j02L72P37J111J375J190M60m97j225j467j250q42
54302A54304n22l21J6N61Q76M31n51j088n60M26P13Q1n38m10L1L9k00J02R86J584
54282A55960J416J058J216J734J902J367M03m44o93k65K59J54n20r64p65l78k16
54265A61224M7O91J198R70K94j35k29k52n9N41J029P36M9jP50J411J462J321J334
54246A72381J129M28l24o04n73o35q28r63r87q74n28j33j59o97j195j139o90l08
54228A63301j06J28N49J148J769J994J376J27p90o74R1N67M39J98K94O08P51N46
54210A72316Rp70j533j887j661j210j056j215j155n92k5p7n18m74K85R58Q22J52
54192A62369l57n56o06l23M87J313J393Q06L63L54K61k38o88o22k31L4K7k10n87
$$ y = [158278, 157059, 156032, 155079, 154442, 154340, 154712, 155449, 156560, 157935, 159125, 159585, 159088, 157863, 156396, 155146, 154304, 153782, 153461, 153477, 154038, 154914, 155345, 154794, 153706, 153146, 153572, 154285, 154366, 153828, 153418, 153449, 153488, 153288, 153390, 154376, 155960, 157376, 158434, 159650, 161384, 163286, 164653, 165056, 164612, 163919, 163654, 163913, 164067, 163547, 162583, 161818, 161440, 161224, 161271, 161962, 163160, 164130, 164424, 164289, 164060, 163808, 163749, 164290, 165319, 166055, 166104, 166103, 166853, 168264, 169726, 171047, 172381, 173510, 173938, 173614, 173010, 172437, 171802, 170974, 170011, 169024, 168150, 167622, 167489, 167330, 166633, 165438, 164299, 163609, 163301, 163195, 163323, 163872, 165020, 166789, 168783, 170159, 170286, 169496, 168822, 168913, 169480, 169919, 170117, 170411, 171019, 171770, 172316, 172325, 171555, 170022, 168135, 166474, 165264, 164208, 162993, 161838, 161246, 161221, 161144, 160626, 160152, 160437, 161395, 162217, 162369, 162012, 161456, 160850, 160527, 161014, 162327, 163720, 164526, 164889, 165243, 165504, 165266, 164578, 163956, 163725, 163759, 163786, 163576, 162989]
54173A62989p17o5J237K239K242J656J306J261R14j3j107j893k275k301j888j035
54157A62550j00L74J95k26k58K35O95N14k24q43q46l33K60N84N09J74l6J40M85
54138A63849N74L82K71M04N28M55L81N21P71Q78P13J99o58j495j695r83K16J257
54120A66568J844J975J626Q61K5m79n54l45O2O06J053J096P53M18M81R57J483
54103A78430J625J186L54l88n53k8P32J024O11P8J82Q68J282R32L88N27J422K476
54085A91148L377M315N316N973N947N253L974K106j50k216l557m043l881l337
54071B10225k599j752q54j25J44qj27L9J15k56o96n73j0K50j4k21O6O03R95J167
54051B06369J103P80N90J159K377L253L127K564K508L045L577L861M227M927N864
$$ y = [162989, 162272, 162207, 163444, 165683, 167925, 169581, 170887, 172148, 173062, 173049, 171942, 170049, 167774, 165473, 163585, 162550, 162450, 162824, 163019, 162793, 162535, 162770, 163465, 163979, 163755, 162912, 162066, 161733, 161993, 162577, 163086, 163260, 163224, 163364, 163849, 164423, 164805, 165076, 165480, 166008, 166463, 166844, 167365, 168136, 169014, 169727, 169926, 169268, 167773, 166078, 165095, 165311, 166568, 168412, 170387, 172013, 172874, 172899, 172420, 171866, 171521, 171583, 172189, 173242, 174338, 175091, 175509, 175990, 176947, 178430, 180055, 181241, 181595, 181207, 180654, 180626, 181358, 182382, 182993, 183071, 183253, 184121, 185403, 186335, 186723, 187250, 188672, 191148, 194525, 198840, 204156, 210129, 216076, 221329, 225303, 227409, 227259, 225043, 221486, 217443, 213562, 210225, 207626, 205874, 205020, 204895, 205039, 205031, 204904, 204943, 205058, 204802, 204106, 203533, 203523, 203773, 203759, 203538, 203604, 204207, 205202, 206369, 207472, 208252, 208842, 210001, 212378, 215631, 218758, 221322, 223830, 226875, 230452, 234313, 238540, 243467, 249331]
54036B49331O942Q204R495J0414J0677J0342R589Q504P141N710M523L708L015
54023C47595K113J079L76J91J31j44l16O1O63O93m0r94j847k823l895m540m651
54006C33652n001o148p442p794p122o378o231o338o017n117m082l342k897k424
53992B57319j760j151r62j294k016k972l884m229l726k860k353k172j700q97n03
53977B24840p82r70m58J14k23j231j647q35M85J190R65M27L18P30J081Q12R1m26
53959B24481l85J5N63J268J925K080J770J706K300L019L225L164L495M172M601
53944B57399M713N216O685Q964J1488J3824J5837J7628J9090J9362J7063J1793
53932D09062N183l39l824o169q161r189q378o187l998k353o46J456L127L515L115
$$ y = [249331, 256273, 264477, 273972, 284386, 295063, 305405, 314994, 323498, 330639, 336349, 340872, 344580, 347595, 349708, 350787, 351163, 351354, 351485, 351341, 351025, 351086, 351749, 352442, 352402, 351408, 349561, 346738, 342843, 338303, 333652, 328651, 322503, 315061, 307267, 300145, 293767, 287536, 281198, 275181, 270064, 265982, 262640, 259743, 257319, 255559, 254408, 253446, 252152, 250136, 247164, 243280, 239051, 235325, 232465, 230112, 227940, 226240, 225343, 224840, 224058, 223088, 222630, 222744, 222521, 221290, 219643, 218808, 219293, 220483, 221448, 221875, 222193, 222923, 224004, 224816, 224907, 224481, 224096, 224111, 224674, 225942, 227867, 229947, 231717, 233423, 235723, 238742, 241967, 245131, 248626, 252798, 257399, 262112, 267328, 274013, 282977, 294465, 308289, 324126, 341754, 360844, 380206, 397269, 409062, 414245, 413906, 410082, 403913, 395752, 386563, 378185, 371998, 368000, 365647, 365001, 366457, 369584, 373099, 376214]
53917C76214L279M477N870O693P252Q154R150R542R348R242R456R455Q773P458
53903D84363N564L012K44j718k328k168k092k290k580l080l955m929n677o441
53889D55925p576q722r137q838q773r625j0936j1644j1263j0301r599r402r139
53876C30970q140o470m882l985l714l625l364k813k199k101k919m172m799m418
53862B73369l730l485l591l599l519l550l435k733j543m85q8m72j402k332k705
53847B36700k533k346k297j921j062m03m38n63n8O40O20Q4P8P52J031K78q07j310
53829B26445j284j292j398j180m12O94J718K231K015J302O03K10L9j1J52O09J281
53812B31722K083K916L488L441K784K010J597J671K141K950M021N152O059O569
$$ y = [376214, 379493, 383970, 389840, 396533, 403785, 411939, 421089, 430631, 439979, 449221, 458677, 468132, 476905, 484363, 489927, 492939, 493183, 491465, 489137, 486969, 484877, 482587, 480007, 476927, 472972, 468043, 462366, 455925, 448349, 439627, 430490, 421652, 412879, 403254, 392318, 380674, 369411, 359110, 349511, 340109, 330970, 322830, 316360, 311478, 307493, 303779, 300154, 296790, 293977, 291778, 289677, 286758, 282586, 277787, 273369, 269639, 266154, 262563, 258964, 255445, 251895, 248460, 245727, 244184, 243699, 243611, 243139, 241737, 239405, 236700, 234167, 231821, 229524, 227603, 226541, 226138, 225700, 225137, 225079, 225719, 226339, 226423, 226501, 227253, 228284, 228562, 227755, 226445, 225161, 223869, 222471, 221291, 220879, 221573, 223291, 225522, 227537, 228839, 229442, 229652, 229691, 229680, 229832, 230441, 231722, 233805, 236721, 240209, 243650, 246434, 248444, 250041, 251712, 253853, 256803, 260824, 265976, 272035, 278604]
53798B78604O759O897P144P301P035O390N734N093M104K846K186K693L719M118
53784C50623L619K818K062J124j32j475k747l939m815n096n095n517o454p187
53770C17789p122o448n649m952m462m329m497m616m501m328m191l855l154k349
53756B53336j773j455j266j212j323j481j519j416j289j329j674k185k404k040
53742B30970j405j017r12o59o5N81R44R28N57L4j23L81R26N34p56j713j548r47
53724B26710r09j119l60J640L575M090L314K496K328K239J472M18L04J489K796
53709B50483K891J968J412J964K985L482L183K406J489P71O55J270K215K944L253
53694B83371L238L098L061L299L662L810L652L388K995K108P31m01n76l9K98o0
$$ y = [278604, 285363, 292260, 299404, 306705, 313740, 320130, 325864, 330957, 335061, 337907, 340093, 342786, 346505, 350623, 354242, 357060, 359122, 360246, 360114, 358639, 355892, 351953, 347138, 342042, 336947, 331430, 324976, 317789, 310667, 304219, 298570, 293618, 289156, 284827, 280330, 275714, 271213, 266885, 262694, 258839, 255685, 253336, 251563, 250108, 248842, 247630, 246307, 244826, 243307, 241891, 240602, 239273, 237599, 235414, 233010, 230970, 229565, 228548, 227636, 226977, 226912, 227493, 228437, 229365, 229922, 229956, 229833, 230214, 231140, 231674, 230918, 229205, 227657, 226710, 225801, 224682, 224322, 225962, 229537, 233627, 236941, 239437, 241765, 244004, 245476, 245894, 246198, 247687, 250483, 253374, 255342, 256754, 258718, 261703, 265185, 268368, 270774, 272263, 273034, 273689, 274959, 277174, 280118, 283371, 286609, 289707, 292768, 296067, 299729, 303539, 307191, 310579, 313574, 315682, 316413, 316012, 315436, 315397, 315695, 315635]
53678C15635p60j175j087p20m29m28o63q69q17n82m19m38m40j98J88L12j06q86
53660C06118j548j749j423o62L05J020J060N25k9k37k23j28J58N94P63M64J12
53643C05120J52M36N98O70P58N62q6n56p2J146K205K854L491L993L578K166Q13
53626C27828M21P38J145J604K268K821K944K976L384L969M210M182M486N355O381
53611C74712P145P594P750P450O582N361M200L379K861K504K320K437K701K649
53597D39645K045J310R86R76P52K86J83P60J494J706J308O53q5r12j644j892j494
53580D46077q27n72j077j925k346k138j909k157k531k466k140k141k418k388k006
53565D17036j849k030j931j252n69m19n59n40l80k28P1N45P54M30N2J81N80N69
$$ y = [315635, 314875, 313700, 312613, 311893, 311464, 311036, 310373, 309504, 308687, 308105, 307686, 307248, 306808, 306610, 306798, 307110, 307004, 306118, 304570, 302821, 301398, 300736, 301041, 302061, 303121, 303646, 303617, 303380, 303157, 303029, 303187, 303781, 304544, 305008, 305120, 305272, 305708, 306306, 306976, 307734, 308296, 308210, 307654, 307582, 308728, 310933, 313787, 317278, 321271, 324849, 327015, 327828, 328249, 328987, 330132, 331736, 334004, 336825, 339769, 342745, 346129, 350098, 354308, 358490, 362976, 368331, 374712, 381857, 389451, 397201, 404651, 411233, 416594, 420794, 424173, 427034, 429538, 431858, 434295, 436996, 439645, 441690, 443000, 443986, 444962, 445714, 446000, 446183, 446943, 448437, 450143, 451451, 452104, 452019, 451107, 449463, 447571, 446077, 445250, 444678, 443601, 441676, 439330, 437192, 435283, 433126, 430595, 428129, 425989, 423848, 421430, 419042, 417036, 415187, 413157, 411226, 409974, 409405, 408986, 408427, 407887, 407507, 407279, 407350, 407895, 408649, 409079, 409131, 409312, 409892, 410461]
53547D10461M7l63k08K64N82P04J076J930K734K659J775J263K032L491M399M553
53531D37399M734N210N500N653O457Q009R247R529R575J0133J0774J0926J1136
53518E44282J2181J3618J4408J4590J5155J6512J8087J9422K0658K1860K2677
53507G33450K2903K2830K2906K3350K4087K4749K4907K4594K4316K4295K4053
53496I96440K3117K1739K0516J9721J9404J9605J9928J9559J8376J7468J7687
53485A213560J8275J7832J6360J5240J5411J6507J7682J8410J8428J7756J6792
53474A402253J5756J4204J1818R312P663O562M720J659j755m617o870q709j0114
53461A441882j1269j2513j3623j3886j3246j2600j2729j3538j4638j5877j7073
$$ y = [410461, 410508, 410145, 409937, 410201, 410783, 411487, 412563, 414493, 417227, 419886, 421661, 422924, 424956, 428447, 432846, 437399, 442133, 447343, 452843, 458496, 464953, 472962, 482209, 491738, 501313, 511446, 522220, 533146, 544282, 556463, 570081, 584489, 599079, 614234, 630746, 648833, 668255, 688913, 710773, 733450, 756353, 779183, 802089, 825439, 849526, 874275, 899182, 923776, 948092, 972387, 996440, 1019557, 1041296, 1061812, 1081533, 1100937, 1120542, 1140470, 1160029, 1178405, 1195873, 1213560, 1231835, 1249667, 1266027, 1281267, 1296678, 1313185, 1330867, 1349277, 1367705, 1385461, 1402253, 1418009, 1432213, 1444031, 1453343, 1461006, 1467568, 1472288, 1473947, 1472192, 1467575, 1460705, 1451996, 1441882, 1430613, 1418100, 1404477, 1390591, 1377345, 1364745, 1352016, 1338478, 1323840, 1307963, 1290890]
53450A290890j7961j8720j9822k1097k1739k1493k0993k0542j9557j7780j6088
53439A075098j5228j4554j2983j0648q566p065n621m126l251l290l459k782j207
53426I82318N26J890L049M457O173P697Q597R156J0152J1903J3864J5307J6132
53413A091221J6784J7698J9116K1165K3675K6055K7768K8906K9962L1092L2013
53402A365455L2745L3989L6447L9879M3140M5223M6129M6664M7595M9107N0890
53391A837263N2438N3334N3567N3658N4081N4503N3955N2107M9884M8429M7767
53380B410986M6988M5500M3453M1095L8409L5489L2588K9625K6126K1900J7388
53369B789547J3052Q765L902k138r550j7790k5658l2115l7152m1406m4981m7316
$$ y = [1290890, 1272929, 1254209, 1234387, 1213290, 1191551, 1170058, 1149065, 1128523, 1108966, 1091186, 1075098, 1059870, 1045316, 1032333, 1021685, 1013119, 1006054, 1000433, 996307, 993056, 989766, 986307, 983525, 982318, 982844, 984734, 987783, 992240, 998413, 1006110, 1014707, 1023863, 1034015, 1045918, 1059782, 1075089, 1091221, 1108005, 1125703, 1144819, 1165984, 1189659, 1215714, 1243482, 1272388, 1302350, 1333442, 1365455, 1398200, 1432189, 1468636, 1508515, 1551655, 1596878, 1643007, 1689671, 1737266, 1786373, 1837263, 1889701, 1943035, 1996602, 2050260, 2104341, 2158844, 2212799, 2264906, 2314790, 2363219, 2410986, 2457974, 2503474, 2546927, 2588022, 2626431, 2661920, 2694508, 2724133, 2750259, 2772159, 2789547, 2802599, 2811364, 2815266, 2813128, 2803578, 2785788, 2760130, 2728015, 2690863, 2649457, 2604476, 2557160]
53357B557160m8386m9185n0454n1499n1053m8982m6440m4393m2693m0774l8766
53346B044535l7509l7612l8761m0023m0774m1100m1215m0845l9522l7309l4763
53335A615102l2183k9491k6892k4976k3756k2247j9612j6411j4108j3478j4040
53324A377908j4954j5861j6736j7417j7600j7163j6263j5170j4081j3043j2021
53313A207599j1055j0243r476q366o590m292k062m59L33N64P54J414K738M553
53299A165412O596Q714J0756J2455J3714J4937J6769J9342K1920K3564K4049K3977
53287A362205K3940K3904K3550K2908K2300K1822K1301K0708K0092J9046J6864
53276A598640J3463R673O279L312O05j594l206m971p652j0952j4015j6699j9373
$$ y = [2557160, 2508774, 2459589, 2409135, 2357636, 2306583, 2257601, 2211161, 2166768, 2124075, 2083301, 2044535, 2007026, 1969414, 1930653, 1890630, 1849856, 1808756, 1767541, 1726696, 1687174, 1649865, 1615102, 1582919, 1553428, 1526536, 1501560, 1477804, 1455557, 1435945, 1419534, 1405426, 1391948, 1377908, 1362954, 1347093, 1330357, 1312940, 1295340, 1278177, 1261914, 1246744, 1232663, 1219620, 1207599, 1196544, 1186301, 1176825, 1168459, 1161869, 1157577, 1155515, 1155056, 1155389, 1155953, 1156707, 1158121, 1160859, 1165412, 1172008, 1180722, 1191478, 1203933, 1217647, 1232584, 1249353, 1268695, 1290615, 1314179, 1338228, 1362205, 1386145, 1410049, 1433599, 1456507, 1478807, 1500629, 1521930, 1542638, 1562730, 1581776, 1598640, 1612103, 1621776, 1628055, 1631367, 1631972, 1630378, 1627172, 1622201, 1614549, 1603597, 1589582, 1572883, 1553510]
53263A553510k1699k2819k2881k3128k4152k5146k5480k5851k7031k8307k8338
53252A278678k7073k5712k4983k4476k3754k3170k3219k3656k3710k3003k2016
53241A013906k1685k2523k4055k5168k5123k4096k2725k1396k0137j8860j7383
53230G70755j5518j3492j1943j1147j0533r480q356q128r030j0262j1080j1630
53218F40156j2427j3524j4539j5164j5348j5101j4527j3944j3610j3306j2461
53207D86205j0872r114q012p788p979q122q173q091p559o544n764n951o759p101
53193C78376o637o149o268o570o401n891n491n014l996k758k221k679l411l627
53179C11263l253k639k079j806k009k512k785k520k024j827k107k661l195l487
$$ y = [1553510, 1531811, 1508992, 1486111, 1462983, 1438831, 1413685, 1388205, 1362354, 1335323, 1307016, 1278678, 1251605, 1225893, 1200910, 1176434, 1152680, 1129510, 1106291, 1082635, 1058925, 1035922, 1013906, 992221, 969698, 945643, 920475, 895352, 871256, 848531, 827135, 806998, 788138, 770755, 755237, 741745, 729802, 718655, 708122, 698642, 690286, 682158, 673128, 662866, 651786, 640156, 627729, 614205, 599666, 584502, 569154, 554053, 539526, 525582, 511972, 498666, 486205, 475333, 466219, 458207, 450419, 442440, 434318, 426145, 418054, 410495, 403951, 398187, 392236, 385477, 378376, 371739, 365590, 359322, 352752, 346351, 340460, 334969, 329955, 325959, 323201, 320980, 318301, 314890, 311263, 308010, 305371, 303292, 301486, 299477, 296965, 294180, 291660, 289636, 287809, 285702, 283041, 279846, 276359]
53165B76359l369k802j945j069m51l04o65j211j435j066l51K14L04kk88j54L83
53148B62148Q07O05p9n27k85L61Q20Q67O23J11p13j548j783j160j47O06R04R45
53130B62555Q45O28N26Q12J291J394R67N35N35O87N45L60P87J837K683K693K113
53113B81793J548J218J017R79J172J327R80M1j093j995k553k780k616k112j699
53098B75227j851k435k666j947o31L33M59J12j66k94n16r55j520k029k186j746
53082B57189q97k28j1J40N83R83P62k1p49r66n80L80J585K234J775P32J33K07
53064B63251L13M0l83q04j318j697j494r45q69j340j451p78j48k61n27q0P84J128
53046B53421Q68O87Q03P02J32n03p02l52L42R27Q87K10l17P0J076J664J295M52
$$ y = [276359, 272990, 270188, 268243, 267174, 266723, 266419, 265754, 264543, 263108, 262042, 261691, 261905, 262209, 262207, 261919, 261765, 262148, 262955, 263560, 263481, 262954, 262669, 263030, 263850, 264717, 265340, 265451, 264738, 263190, 261407, 260247, 260100, 260706, 261610, 262555, 263400, 264028, 264554, 265366, 266657, 268051, 269018, 269553, 270088, 270775, 271320, 271680, 272467, 274304, 276987, 279680, 281793, 283341, 284559, 285576, 286555, 287727, 289054, 290034, 290075, 288982, 286987, 284434, 281654, 279038, 276926, 275227, 273376, 270941, 268275, 266328, 265697, 266030, 266489, 266601, 266435, 266141, 265625, 264670, 263150, 261121, 258935, 257189, 256292, 256064, 256053, 256193, 256776, 257759, 258521, 258500, 257751, 256785, 256205, 256585, 258170, 260404, 262179, 262911, 263044, 263251, 263564, 263604, 263221, 262417, 261099, 259402, 257908, 256963, 256094, 254754, 253303, 252525, 252377, 252116, 251589, 251509, 252293, 253421, 254289, 254976, 255779, 256481, 256613, 256110, 255408, 255056, 255398, 256325, 257212, 257422, 257105, 257175, 258251, 259915, 261210, 261662]
53028B61662j05j60j14m46j090j338n71Q17J698J589J141R57O84j56j075j258
53012B62235p79l02L5N14Q86O25K1o1M48O49J22m84n83m63n41n29K5R36J659J970
52992B66383J909J411M30p42j598j802j285k49Q28J414J406J182J167J487K014
52977B73955K414K242J398N71P39K043L503M029L432K308J327P29K95l42j153
52962B97490j547j014J51J149J653J914J988J467J90j316k390k769k436j449k92
52947B92789J63m64j550k192k185j954j769j465q75j91J74k4o10j117j286j338
52931B76106j576j770j425n48K27M13J41k10l95j77N78J415J460M49p37j091o67
52914B72193l08m50p41p70o40o26o65m66j8K83J33k13j97K52N90M59K48M10O09
$$ y = [261662, 261557, 261397, 261283, 260837, 259747, 258409, 257838, 258655, 260353, 261942, 263083, 264040, 264724, 264568, 263493, 262235, 261456, 261154, 261189, 261703, 262589, 263214, 263235, 263174, 263622, 264271, 264393, 263909, 263326, 262863, 262322, 261793, 261818, 262754, 264413, 266383, 268292, 269703, 270133, 269391, 267793, 265991, 264706, 264457, 265285, 266699, 268105, 269287, 270454, 271941, 273955, 276369, 278611, 280009, 280580, 281319, 283362, 286865, 290894, 294326, 296634, 297961, 298690, 298985, 298643, 297490, 295943, 294929, 295080, 296229, 297882, 299796, 301784, 303251, 303441, 302125, 299735, 296966, 294530, 293081, 292789, 292952, 292488, 290938, 288746, 286561, 284607, 282838, 281373, 280498, 280307, 280481, 280457, 279847, 278730, 277444, 276106, 274530, 272760, 271335, 270787, 271014, 271427, 271568, 271358, 270963, 270786, 271364, 272779, 274239, 274688, 273951, 272860, 272193, 271885, 271435, 270694, 269924, 269284, 268658, 267993, 267527, 267509, 267792, 267925, 267712, 267515, 267767, 268357, 268816, 269064, 269474, 270083]
52895B70083K13n88r53p04n45p69o80J96J070R37P3l05K46Q90P59R2j99L07J108
52876B71231J449J213R16Q43N54l19j058m46J509L244L466K623J997J892J612
52861B90726Q95M12P45J559K130K150J715Q86l46j718k691k946k851l152m115
52846B83399n103n282m607l729l068k488j921j679j851j933j450o27q5j64p66
52831B48646j481j659q65L91Q95K10o74o69l1L19K84M56P78N06m75j250j097k93
52813B43991N08J031J157P14r4n65k74M02Q69J045J151J159Q94M10r9n90j054
52796B50655j265j031o05m51o80r69j007p83m02Q4N76Q44P19L33N2J13L87N51
52778B47121M69L57M70P32Q37O86N80Q20J205J133L19p26j200r23n37o18r67j059
$$ y = [270083, 270296, 269708, 268755, 268051, 267506, 266737, 266057, 266253, 267323, 268260, 268333, 268028, 268274, 269164, 269923, 270015, 269816, 270123, 271231, 272680, 273893, 274809, 275652, 276206, 275887, 274829, 274383, 275892, 279136, 282602, 285225, 287222, 289114, 290726, 291621, 292033, 292778, 294337, 296467, 298617, 300332, 301218, 300872, 299154, 296463, 293517, 290666, 287514, 283399, 278296, 273014, 268407, 264678, 261610, 259122, 257201, 255522, 253671, 251738, 250288, 249661, 249576, 249412, 248646, 247165, 245506, 244641, 245032, 245927, 246137, 245463, 244794, 244763, 245082, 245366, 245822, 246600, 247106, 246631, 245381, 244284, 243991, 244499, 245530, 246687, 247401, 247307, 246742, 246468, 246870, 247739, 248784, 249935, 251094, 251988, 252398, 252299, 251709, 250655, 249390, 248359, 247754, 247303, 246623, 245654, 244647, 243864, 243462, 243546, 244122, 244966, 245685, 246018, 246070, 246183, 246570, 247121, 247590, 247947, 248417, 249149, 249986, 250672, 251252, 252072, 253277, 254410, 254729, 254003, 252803, 251880, 251343, 250725, 249758, 248699]
52760B48699q92r03j117r67j15J027J787J939J716J485J502J597J089m13j996
52745B54438k002q2K077K726K132J827K376L012L203L283L372K894J656N18L15
52730B81745P49R33O42L29K65K65J46m8l12p06j152j406j403j348j407j410j031
52713B74851k66L90L93k04q08j036j128j432j765j651j028l06J33K12ok56p1P24
52695B66746J539J615J014M93L63J54m23q74o50Q0P72J236J551J577J011r6j234
52678B74874j826j670j082o32n68n81l44j19l65q63r50n53k85l90m36k97n14j139
52660B62260j159J16J747K278J632R88J048J445J737J991K324K652L074L776M388
52645B90297M102K642O27j173k376k826k493j800j448j643j904j788j321o21L02
$$ y = [248699, 247807, 246904, 245787, 244820, 244705, 245732, 247519, 249458, 251174, 252659, 254161, 255758, 256847, 256434, 254438, 252436, 252354, 254431, 257157, 259289, 261116, 263492, 266504, 269707, 272990, 276362, 279256, 280912, 281430, 281745, 282494, 283427, 284069, 284398, 284663, 284928, 285074, 285026, 284714, 284008, 282856, 281450, 280047, 278699, 277292, 275882, 274851, 274585, 274975, 275368, 275164, 274356, 273320, 272192, 270760, 268995, 267344, 266316, 266010, 266143, 266355, 266349, 266093, 266022, 266746, 268285, 269900, 270914, 271407, 271770, 271924, 271501, 270627, 269977, 270057, 270829, 272065, 273616, 275193, 276204, 276108, 274874, 273048, 271378, 270296, 269664, 269096, 268515, 268171, 268052, 267687, 266824, 265874, 265321, 265036, 264646, 264210, 263913, 263399, 262260, 261101, 261217, 262964, 265242, 266874, 267862, 268910, 270355, 272092, 274083, 276407, 279059, 282133, 285909, 290297, 294399, 297041, 297668, 296495, 294119, 291293, 288800, 287000, 285552, 283909, 282005, 280217, 278896, 278275, 278577]
52630B78577J147J408J165J198J901K719L110L452M188M615L503Q54j819l104
52616C02914l009k481k254k371k492k277j658r36m60j92K21Q18J089N48n17j177
52600B85766p51M43J323J070m0q94p39R0P11P89O84O39L37n07j495j814j092K21
52582B84741J367J958K125K148J966J286J79o05l40O81J234N32q15j507r93J41
52566B94098R86J072L59r01k121k629k258j497q32k87K36N41M91M38P50J036N18
52549B90000p77j755j519m35M49O54M76K17k19q51j290j172o41j86m2L8L97J001
52531B84345J384J112L15l32k53M34J102J361J351J403J599J830J963J784J042
52516C00440j10q82m54J034K508L017K614K036J832K045K535L152L580L375K381
$$ y = [278577, 279724, 281132, 282297, 283495, 285396, 288115, 291225, 294677, 298865, 303480, 306983, 307837, 306018, 302914, 299905, 297424, 295170, 292799, 290307, 288030, 286372, 285436, 284976, 284784, 285005, 285823, 286912, 287460, 286943, 285766, 285015, 285458, 286781, 287851, 287811, 286917, 286178, 286268, 286979, 287768, 288452, 289091, 289428, 288921, 287426, 285612, 284520, 284741, 286108, 288066, 290191, 292339, 294305, 295591, 295770, 295165, 294825, 295506, 296740, 297272, 296457, 294950, 293957, 294098, 295084, 296156, 296515, 295614, 293493, 290864, 288606, 287109, 286277, 285990, 286226, 286767, 287258, 287696, 288446, 289482, 290000, 289223, 287468, 285949, 285514, 285963, 286617, 287093, 287310, 287091, 286240, 284950, 283778, 283137, 282951, 282909, 282947, 283344, 284345, 285729, 286841, 287156, 286824, 286571, 287005, 288107, 289468, 290819, 292222, 293821, 295651, 297614, 299398, 300440, 300330, 299448, 298994, 300028, 302536, 305553, 308167, 310203, 312035, 314080, 316615, 319767, 323347, 326722, 329103]
52501C29103R47m67j777l142m452n144m797l663k473j668j098n53k56n41j199
52486B98820j595j462j197j140j034n59n1m6l28j03P66J470J448J234J556K115
52470B99894K023J215O00P71J261J351J087J128J846K932L736L884L557L242L086
52455C31613K559J154o90j905k135k189k842l704l837l157k531k616l113l270
52441C03337k681j540m50Kk64p42r42r47j078j221j009n18j56J21P60J657K026
52424B96355J516Q21O56P76O02L00M22Q59R99Q61J104J805K104J471O50Q10K087
52407C14198L554M454M973N778P180Q914J0538J1878J2903J3249J2090Q832L883
52394D22424j431n761q417r390r174q543q103p757o962n568m047k760j537l07
$$ y = [329103, 330050, 329583, 327806, 324664, 320212, 315068, 310271, 306608, 304135, 302467, 301369, 300816, 300560, 300019, 298820, 297225, 295763, 294566, 293426, 292392, 291833, 291782, 291736, 291408, 291305, 292071, 293541, 294989, 296223, 297779, 299894, 301917, 303132, 303732, 304503, 305764, 307115, 308202, 309330, 311176, 314108, 317844, 321728, 325285, 328527, 331613, 334172, 335326, 334636, 332731, 330596, 328407, 325565, 321861, 318024, 314867, 312336, 309720, 306607, 303337, 300656, 299116, 298666, 298668, 298404, 297662, 296720, 295773, 294695, 293474, 292465, 291947, 291791, 291912, 292672, 294329, 296355, 297871, 298692, 299348, 300124, 300726, 301026, 301448, 302307, 303306, 304167, 305271, 307076, 309180, 310651, 311301, 312111, 314198, 317752, 322206, 327179, 332957, 340137, 349051, 359589, 371467, 384370, 397619, 409709, 418541, 422424, 420993, 415232, 406815, 397425, 388251, 379708, 371605, 363848, 356886, 351318, 347271, 344511, 342974, 342667]
52380C42667M07J63n75r10o24j62L30J228K598L850M563N066N781O413O334N491
52364C82620M463L641K832J788P18P8j8j4m45j295j903j592m40P12J101P69L70
52347C93385L73O43P87P39Q87J626K838L852M034L403K656K517L139M171N226
52332D30276O127O843P413Q019Q949J0378J2155J3911J5339J6379J7171J7908
52320E70868J8655J9266J9469J9107J8360J7652J7321J7347J7512J7705J7954
52309G71216J8233J8464J8759J9437K0576K1680K1995K1221J9806J8569J7988
52298I87944J7787J7250J6025J4524J3246J1845R452O044K756M06j608m132o630
52285A084909p817p666p510p979q216p627p118p594q215p422n169k813j080O05
$$ y = [342667, 343074, 343237, 342662, 341752, 341128, 340966, 341296, 342524, 345122, 348972, 353535, 358601, 364382, 370795, 377129, 382620, 387083, 390724, 393556, 395344, 396062, 396140, 396122, 396108, 395663, 394368, 392465, 390873, 390433, 391145, 392246, 393015, 393385, 393758, 394401, 395188, 395927, 396814, 398440, 401278, 405130, 409164, 412567, 415223, 417740, 420879, 425050, 430276, 436403, 443246, 450659, 458678, 467627, 478005, 490160, 504071, 519410, 535789, 552960, 570868, 589523, 608789, 628258, 647365, 665725, 683377, 700698, 718045, 735557, 753262, 771216, 789449, 807913, 826672, 846109, 866685, 888365, 910360, 931581, 951387, 969956, 987944, 1005731, 1022981, 1039006, 1053530, 1066776, 1078621, 1088073, 1094117, 1096873, 1097279, 1095671, 1091539, 1084909, 1077092, 1069426, 1061916, 1053937, 1045721, 1038094, 1030976, 1023382, 1015167, 1007745, 1002576, 999763, 998683, 999288]
52271I99288K627M376N370O177P560R434J1267J2958J4554J5556J5350J4272J3508
52258A132297J3796J4672J5253J5346J5471J6039J6792J7168J6974J6520J6068
52247A306396J5339J3717J0890P216L421J20k378m027m993n653o493p849r586
52234A316120j1079j1681j1418j1007j0997j1098j0650r633q757q503q535q230
52222A194532p423o362n241m105l046k126j248l11N58J145J464J730K117K692
52208A174376L507M490N354N885O270O860P553P773P168O138N407N274N465N633
52194A257153N752N986O397O889P331P576P455O917O157N429M685L597K006K01
52180A333531j449k997m798o923q949j0389j1086j1154j0794j0267r845r525q937
$$ y = [999288, 1001915, 1006291, 1011661, 1017838, 1025398, 1034832, 1046099, 1059057, 1073611, 1089167, 1104517, 1118789, 1132297, 1146093, 1160765, 1176018, 1191364, 1206835, 1222874, 1239666, 1256834, 1273808, 1290328, 1306396, 1321735, 1335452, 1346342, 1353558, 1356979, 1357099, 1354721, 1350694, 1345701, 1340048, 1333555, 1325706, 1316120, 1305041, 1293360, 1281942, 1270935, 1259938, 1248840, 1238190, 1228557, 1219800, 1211297, 1202762, 1194532, 1187109, 1180747, 1175506, 1171401, 1168355, 1166229, 1164981, 1164670, 1165228, 1166373, 1167837, 1169567, 1171684, 1174376, 1177883, 1182373, 1187727, 1193612, 1199882, 1206742, 1214295, 1222068, 1229236, 1235374, 1240781, 1246055, 1251520, 1257153, 1262905, 1268891, 1275288, 1282177, 1289508, 1297084, 1304539, 1311456, 1317613, 1323042, 1327727, 1331324, 1333330, 1333531, 1332082, 1329085, 1324287, 1317364, 1308415, 1298026, 1286940, 1275786, 1264992, 1254725, 1244880, 1235355, 1226418]
52167A226418p754o120m516l209k079r32J76J086J863K781L915M852M957L965
52153A225403K245M00j206k444l134l126k611k000j428o80K84J107J587J996K496
52138A218889K592J737K65q48j125r13n23K28J383K451L203M386O904J0503J3989
52123A263121J6694J9058K1663K4344K6573K8196K9347K9979K9941K9309K8312
52112A546537K7077K5790K4795K4123K3071K0882J7782J4812J2581J0798R203
52101A757451Q226Q298R038R655R815R538Q541O410L431N10j924m472p921j2147
52087A804449j6107j8816k0109k0591k0912k1046k0345j8445j5941j3836j2345
52076A605956j0711q348n669l547k216j048P26L342O395R159J1146J2487J3734
$$ y = [1226418, 1218664, 1212544, 1208028, 1204819, 1202740, 1201808, 1201984, 1203070, 1204933, 1207714, 1211629, 1216481, 1221438, 1225403, 1227648, 1228048, 1226842, 1224398, 1221264, 1218138, 1215527, 1213527, 1212099, 1211419, 1211703, 1212810, 1214397, 1216393, 1218889, 1221481, 1223218, 1223483, 1222635, 1221510, 1220597, 1220074, 1220302, 1221685, 1224136, 1227339, 1231725, 1238629, 1249132, 1263121, 1279815, 1298873, 1320536, 1344880, 1371453, 1399649, 1428996, 1458975, 1488916, 1518225, 1546537, 1573614, 1599404, 1624199, 1648322, 1671393, 1692275, 1710057, 1724869, 1737450, 1748248, 1757451, 1765677, 1773975, 1783013, 1792668, 1802483, 1812021, 1820562, 1826972, 1830403, 1830913, 1828989, 1824517, 1816596, 1804449, 1788342, 1769526, 1749417, 1728826, 1707914, 1686868, 1666523, 1648078, 1632137, 1618301, 1605956, 1595245, 1586897, 1581228, 1577681, 1575465, 1574417, 1575143, 1578485, 1584880, 1594039, 1605185, 1617672, 1631406]
52063A631406J5144J6331J6771J6452J5845J5385J5197J5174J5049J4519J3580
52052A800853J2591J1793J0839R117O504L475M98k413n468q766j2290j5920j9279
52039A791534k1769k3018k3306k3351k3627k3947k3739k2702k1146j9678j8586
52028A546665j7661j6639j5512j4356j3082j1746j0883j1083j2218j3441j4076
52017A395968j4125j3859j3361j2754j2417j2531j2674j2379j1919j1969j2613
52006A255367j3273j3726j4495j5930j7493j8499j9154k0216k1846k3364k4109
51995A053262k3913k2740k0542j7759j5300j3664j2441j1158j0207j0353j1554
51984H83631j2932j3847j4457j5080j5618j5803j5724j5691j5808j5890j5740
$$ y = [1631406, 1646550, 1662881, 1679652, 1696104, 1711949, 1727334, 1742531, 1757705, 1772754, 1787273, 1800853, 1813444, 1825237, 1836076, 1845193, 1851697, 1855172, 1855670, 1853257, 1847789, 1839023, 1826733, 1810813, 1791534, 1769765, 1746747, 1723441, 1700090, 1676463, 1652516, 1628777, 1606075, 1584929, 1565251, 1546665, 1529004, 1512365, 1496853, 1482497, 1469415, 1457669, 1446786, 1435703, 1423485, 1410044, 1395968, 1381843, 1367984, 1354623, 1341869, 1329452, 1316921, 1304247, 1291868, 1279949, 1267980, 1255367, 1242094, 1228368, 1213873, 1197943, 1180450, 1161951, 1142797, 1122581, 1100735, 1077371, 1053262, 1029349, 1006609, 986067, 968308, 953008, 939344, 926903, 915745, 905538, 895185, 883631, 870699, 856852, 842395, 827315, 811697, 795894, 780170, 764479, 748671, 732781, 717041]
51973G17041j5322j4757j4207j3711j3034j1813r825p128l949o59K286M531O067
51960F25520P104P792Q182Q300P940O537L735J43k997n048o438p707q626q640
51946F35797p698o187m259j860P62L117N051O939R126J1466J3462J4677J5044
51933F95437J4872J4479J3754J2276R952P270M650J942j066l958n996o923o938
51920G49751o115m500k766k039k874m930p773j1383j5567j9471k2064k2879k1966
51907F05424j9628j6492j3391j0673p884m634j402J004K502L588M313M187L170
51894E50084J938P84j044m290q357j1642j3136j3107j2301j1110r734q526p651
51881D51908o645m870k384N1J870L257M681O303P930R304J0108J0006Q954P397
$$ y = [717041, 701719, 686962, 672755, 659044, 646010, 634197, 624372, 617244, 613295, 612636, 614922, 619453, 625520, 632624, 640416, 648598, 656898, 664838, 671375, 675110, 675253, 672256, 667208, 660770, 653063, 644437, 635797, 628099, 621912, 617653, 615793, 616555, 619672, 624723, 631662, 640788, 652254, 665716, 680393, 695437, 710309, 724788, 738542, 750818, 760770, 768040, 772690, 774632, 773566, 769608, 763612, 756689, 749751, 743636, 739136, 736370, 734331, 731457, 726527, 718754, 707371, 691804, 672333, 650269, 627390, 605424, 585796, 569304, 555913, 545240, 537356, 532722, 531320, 532324, 534826, 538414, 542727, 546914, 550084, 552022, 552806, 551762, 547472, 539115, 527473, 514337, 501230, 488929, 477819, 468085, 459559, 451908, 445263, 440393, 438009, 438060, 439930, 443187, 447868, 454171, 462101, 471405, 481513, 491519, 500473, 507870]
51867E07870N830M312K591O47j226k743l734m029l626k973k662k699k367j003
51853D94188J227L405M598M580L948L472L199K356M57j825l427m332n449p021
51839D99376q083p924p222p012p125o553n025l351k191j329l26P22J411J644J673
51824D48685J702J575Q42p22k585l714l695l286l329l452k644r30M16N68J71K32
51808D29834P69J138J144J089J027P00J01m37p08q32r67j171j342j171k82J149
51792D30041K269K362J566M06j010k656l860l766k526j229n15m6M63O10R0n85
51776D21614p55n03l18k76j47R0M58J369L261N889Q522J0644J2035J2453J1873
51761D86209J0847R936Q850O808L775O12k103m648p251r355j0339j0478j0542
$$ y = [507870, 513700, 518012, 520603, 521250, 520024, 517281, 513547, 509518, 505892, 502919, 500257, 497558, 495191, 494188, 495415, 498820, 503418, 507998, 511946, 515418, 518617, 520973, 521430, 519605, 516178, 511846, 506397, 499376, 491293, 483369, 476147, 469135, 462010, 455457, 450432, 447081, 444890, 443561, 443235, 443957, 445368, 447012, 448685, 450387, 451962, 452804, 452082, 449497, 445783, 442088, 438802, 435473, 432021, 429377, 428447, 428863, 429431, 429602, 429834, 430603, 431741, 432885, 433974, 435001, 435701, 435802, 435365, 434657, 433825, 432858, 431687, 430345, 429174, 428892, 430041, 432310, 434672, 436238, 436644, 435634, 432978, 429118, 425352, 422826, 421597, 421082, 421036, 421499, 422109, 422199, 421614, 420859, 420356, 420038, 419762, 419615, 419705, 420163, 421532, 424793, 430682, 439204, 449848, 461883, 474336, 486209, 497056, 506992, 515842, 522650, 526425, 527037, 524934, 520286, 513035, 503680, 493341, 482863, 472321]
51748D72321j0697j0377r156p346n673m613m086l596k669j305K5R07J400J921
51734D17056K857M353O205P862Q716Q546P508N709L196N57j077j035J30J353K185
51719D74121K728K698J468q58l152m432m787m733m162k642o01N64j15k069l766
51704D50262m213l578k483j164M87K374M019M897M695L402J373o49j953k391k319
51689D52759j936j013M93J868K069P51j403l336m509n118n588n923n620m316k382
51674D16796o59M05J036J503J724J642J605J919K384K738L283M555O504Q501J0008
51659D63944J0651R844P125L123n96k961m163m704m338k572K46L055N207O771
51645D90632P789P781O266L328n64m845q752j1326j2076j1592j0993j0638r835
$$ y = [472321, 461624, 451247, 442091, 434745, 429072, 424459, 420373, 416777, 414108, 412803, 412828, 413735, 415135, 417056, 419913, 424266, 430471, 438333, 447049, 455595, 463103, 468812, 472008, 472565, 471488, 470453, 470583, 471936, 474121, 476849, 479547, 481015, 480157, 477005, 472573, 467786, 463053, 458891, 456249, 455648, 456212, 456097, 454028, 450262, 446049, 442471, 439988, 438824, 439311, 441685, 445704, 450601, 455296, 458698, 460071, 459422, 457469, 455078, 452759, 450823, 449810, 450303, 452171, 454240, 454991, 453588, 450252, 445743, 440625, 435037, 429114, 423494, 419178, 416796, 416137, 416542, 417578, 419081, 420805, 422447, 424052, 425971, 428355, 431093, 434376, 438931, 445435, 453936, 463944, 474595, 484439, 491564, 494687, 494091, 491130, 486967, 482263, 477925, 475353, 475599, 478654, 483861, 490632, 498421, 506202, 512468, 515796, 515232, 510387, 501635, 490309, 478233, 466641, 455648, 445010, 435175]
51632D35175p969n544l653k708k183j553q02Q0J371L044M435N009N003M753L862
51617D38320J836p12k409k742k550k726l203l459l399l219k960k633k445k505
51603D05194k657k799k969k867j905j84J221J599J768L123N767Q442J0224J1385
51589D35342J2413J2906J1845Q693L979r44m679o688p507p921p935o978m919k351
51575D35256K25K897N851Q896J1698J4024J5545J5911J5385J4987J5608J7218
51563E73501J9249K1313K3144K4337K4809K5277K6703K9247L2297L5205L7354
51552H72436L7631L4807K8768K0759J2024K805o968j6583k4867l1260l5919l8938
51540H54695m0148l9763l8490l6725l4138l0374k5803k1230j7153j3702j1090
$$ y = [435175, 427206, 421662, 418009, 415301, 413118, 411565, 410763, 410843, 412214, 415258, 419693, 424702, 429705, 434458, 438320, 440156, 439444, 437035, 434293, 431743, 429017, 425814, 422355, 418956, 415737, 412777, 410144, 407699, 405194, 402537, 399738, 396769, 393902, 391997, 391813, 393034, 394633, 396401, 399524, 405291, 413733, 423957, 435342, 447755, 460661, 472506, 481199, 485178, 484234, 479555, 472867, 465360, 457439, 449504, 442526, 437607, 435256, 435481, 438378, 444229, 453125, 464823, 478847, 494392, 510303, 525688, 540675, 556283, 573501, 592750, 614063, 637207, 661544, 686353, 711630, 738333, 767580, 799877, 835082, 872436, 910067, 944874, 973642, 994401, 1006425, 1009230, 1002262, 985679, 960812, 929552, 893633, 854695, 814547, 774784, 736294, 699569, 665431, 635057, 609254, 588024, 570871, 557169, 546079]
51529E46079r579q919q288p049n315l560j858J23K351M040M306L103J229n37k065
51514E14061l572n050o211o910p203p104o576n808n230n047n048m962m835m828
51500D35677m861m665m114l325k535k014j908j985j683p21M63J149J159R27Q45
51485D12409Q57O94K89j47k73J07O39N14o63k162k787k308j664j625j911j949
51469D00020j871k145k659k893k858l075l589l643k611q75N77J098Q27L18j8j94
51453C76409m91j032j492j418p68O1P31J269J868K610L565M869O520Q273R951
51438D10925J1711J3683J5299J5296J2712P969K843q08k351k435k029j703j778
51425D79334k613m179n697o176n424m142k978k014j263j102j745k672l072k748
$$ y = [546079, 536500, 527581, 519293, 512244, 506929, 503369, 501511, 501634, 503985, 508025, 512331, 515434, 516663, 516126, 514061, 510489, 505439, 499228, 492318, 485115, 478011, 471435, 465627, 460397, 455350, 450302, 445340, 440505, 435677, 430816, 426151, 422037, 418712, 416177, 414163, 412255, 410270, 408587, 407866, 408329, 409478, 410637, 411564, 412409, 413266, 413960, 414249, 414102, 413829, 413936, 414575, 415089, 414426, 412264, 409477, 407169, 405505, 403880, 401969, 400020, 398149, 396004, 393345, 390452, 387594, 384519, 380930, 377287, 374676, 373801, 374378, 375476, 376303, 376621, 376603, 376409, 375918, 374886, 373394, 371976, 371208, 371269, 372000, 373269, 375137, 377747, 381312, 386181, 392701, 400974, 410925, 422636, 436319, 451618, 466914, 479626, 487595, 490438, 489630, 487279, 484844, 482815, 481112, 479334, 476721, 472542, 466845, 460669, 455245, 451103, 448125, 446111, 444848, 443746, 442001, 439329, 436257, 433509]
51411D33509k132j550r01j34M31M35o9o51q86n89J36R20J341J230Q43O61J058
51394D33652K037L164L855L859L543L571M360N908P937J0019J1703J2958J4517
51381E21083J7359K1736K6986L2361L7612M2601M6877N0090N2551N4777N6459
51370I60492N6165N2179M3547L0765J5725Q40j2315k3567l3290m1301m7033n0437
51358I51770n2042n2180n0777m8004m4534m0919l7240l3388k9335k4994k0437
51347E17920j6349j3642j2293j1266r856q505p869p699p252o334n313m515m122
51334D02905m274m664m456l286j938j318j128m49O36J066M51l47m42M3M86O09
51318C83894M94L44M87J156K136K988L567L857L496K220O30l25o84j233k012k177
$$ y = [433509, 431377, 429827, 428926, 428792, 429223, 429658, 429589, 428938, 428052, 427463, 427599, 428519, 429860, 431090, 431933, 432594, 433652, 435689, 438853, 442708, 446567, 450110, 453681, 458041, 463949, 471886, 481905, 493608, 506566, 521083, 538442, 560178, 587164, 619525, 657137, 699738, 746615, 796705, 849256, 904033, 960492, 1016657, 1068836, 1112383, 1143148, 1158873, 1159713, 1147398, 1123831, 1090541, 1049240, 1002207, 951770, 899728, 847548, 796771, 748767, 704233, 663314, 626074, 592686, 563351, 538357, 517920, 501571, 487929, 475636, 464370, 454514, 446009, 438140, 430441, 423189, 416855, 411542, 407027, 402905, 398631, 393967, 389511, 386225, 384287, 382969, 381841, 381392, 382028, 383094, 383545, 383198, 382756, 382799, 383285, 383894, 384388, 384732, 385219, 386375, 388511, 391499, 395066, 398923, 402419, 404639, 405269, 404944, 404260, 403027, 401015, 398838]
51302C98838j693j714k693l366k638j380j150j921k373j932j215p60n19n77j176
51287C73731j979k290k105j952j678m58J693L419L722L370L919N722P601Q287
51273D01002P650O447N293M122K620R41l29r05j092j099n48Q30K407L194K975
51258D33508K233J197k89j888k688k274j307p20q30j428k250l032l581l982m413
51243D08256m620m120l093k455k651k962k555j705j376j788k126j675o87O3K09
51228C76715L9K3L06P08J008J088Q13J74l94j21J219K818L630L548L269L155K850
51211D00848K065J058J47o66j282j305n43O38J755K583K961K795K429K423K676
51196D18582K461J597R04R16R44J83r69j600j720k005k390k117j105k01P1L5j5
$$ y = [398838, 397145, 395431, 392738, 389372, 386734, 385354, 384204, 382283, 379910, 377978, 376763, 376003, 375484, 374907, 373731, 371752, 369462, 367357, 365405, 363727, 363269, 364962, 368381, 372103, 375473, 379392, 385114, 392715, 401002, 408652, 415099, 420392, 424514, 427134, 428075, 427746, 426841, 425749, 424650, 424102, 424932, 427339, 430533, 433508, 435741, 436938, 436649, 434761, 432073, 429799, 428492, 427772, 426942, 425514, 423264, 420232, 416651, 412669, 408256, 403636, 399516, 396423, 393968, 391317, 388355, 385800, 384095, 382719, 380931, 378805, 377130, 376443, 376506, 376715, 376754, 376777, 377083, 377791, 378799, 379887, 380700, 380874, 380480, 380359, 381578, 384396, 388026, 391574, 394843, 397998, 400848, 402913, 403971, 404118, 403452, 402170, 400865, 400322, 400960, 402715, 405298, 408259, 411054, 413483, 415906, 418582, 421043, 422640, 423544, 424460, 425404, 425587, 424618, 423018, 421298, 419293, 416903, 414786, 413681, 413480, 413551, 413586, 413571]
51179D13571k89p87r35l74M63R64R74N64j92q57p56M6M58l06j590k113j474k56
51161D07111J080K527L894M667M653M242L842L521L231K940K399J204o46k543
51147D42122l777m086l721l230l177l650m045l707k893k536k892l054k193p67
51133C98394J09J35k0J51M87P48J051J529K086K624L103L271K856K233K257L203
51117D24217M304M729M453L822K821J467M09L25R18J269J104R71J194J436J390
51102D54829J214J011N92L9q5M59J126J351J296J346J270N66n84j397j520j381
51086D60132j443j561j339p96l95m61q00r08n00K38R24J395J661J596J048K77
51070D59068o1L73J177J727J938K209K842L821N024O372P781R300J1255J3978
$$ y = [413571, 413282, 412495, 411560, 411186, 411649, 412613, 413587, 414151, 413959, 413102, 412346, 412392, 412850, 412544, 410954, 408841, 407367, 407111, 408191, 410718, 414612, 419279, 423932, 428174, 432016, 435537, 438768, 441708, 444107, 445311, 444665, 442122, 438345, 434259, 430538, 427308, 424131, 420481, 416436, 412729, 409836, 407300, 404408, 401354, 399161, 398394, 398503, 398638, 398618, 398769, 399256, 400004, 401055, 402584, 404670, 407294, 410397, 413668, 416524, 418757, 421014, 424217, 428521, 433250, 437703, 441525, 444346, 445813, 446222, 446547, 447465, 448734, 449838, 450809, 452003, 453439, 454829, 456043, 457054, 457646, 457685, 457600, 458059, 459185, 460536, 461832, 463178, 464448, 465014, 464430, 463033, 461513, 460132, 458689, 457128, 455789, 454993, 454598, 454137, 453337, 452429, 451929, 452167, 453091, 454486, 456147, 457743, 458791, 459068, 459007, 459380, 460557, 462284, 464222, 466431, 469273, 473094, 478118, 484490, 492271, 501571, 512826, 526804]
51056E26804J7268K0194K1460K0181J6617J2330R229Q228Q860J0261J1932J3262
51044F96626J3112J0818P402M742L396K025p63m755q626j1353j2491j1744r243
51031F79146o223m571n384q178j1567j4256j5429j4754j2517r563o738m350k311
51018E63305n88P31J691K436K930L027L002L576N129P118Q690R694J0630J1683
51004F33054J2414J2564J2492J2462J2060J0920R597Q946Q753P820N604K989J110
50991G50785L4q79j781k233k162k122k481k764k182m98J892M596P529J0651J3706
50976G72091J6416J8710K0505K1432K1183K0197J9630K0366K2304K4871K7931
50965A005636L1805L6488M1419M6138N0740N5470O0158O4351O7763P0368P2166
$$ y = [526804, 544072, 564266, 585726, 605907, 622524, 634854, 644083, 652311, 661171, 671432, 683364, 696626, 709738, 720556, 727958, 732700, 736096, 738121, 737358, 732603, 723977, 712624, 700133, 688389, 679146, 672923, 668352, 662968, 654790, 643223, 628967, 613538, 598784, 586267, 576704, 569966, 565616, 563305, 562717, 563448, 565139, 567575, 570505, 573532, 576534, 580110, 585239, 592357, 601047, 610741, 621371, 633054, 645468, 658032, 670524, 682986, 695046, 705966, 715563, 724509, 733262, 741082, 746686, 749675, 750785, 750819, 749940, 748159, 745926, 743764, 741642, 739161, 736397, 734215, 733717, 735609, 740205, 747734, 758385, 772091, 788507, 807217, 827722, 849154, 870337, 890534, 910164, 930530, 952834, 977705, 1005636, 1037441, 1073929, 1115348, 1161486, 1212226, 1267696, 1327854, 1392205, 1459968, 1530336, 1602502]
50954A602502P3063P2909P1482O8542O4070N8394N1945M5036L7964L1182K5154
50943B202243K0099J6045J3042J1204J0613J1260J2857J4524J4979J3418J0166
50932B350450O186K108j990o053r882j3601j7810k2995k9054l5510m1971m8226
50920B131652n4234o0086o5662p0187p2626p2767p1520o9735o7211o3392n8658
50909A405574n4069n0022m5921m1338l6723l2723k9504k6984k5167k3755k2040
50898A017328j9683j7247j5446j4225j3119j2106j1399j0622r110o992n237m395
50886H77747l934l102j833n11O36J493J855J748J726K392L763N418P016Q411R463
50871I12288J0153J0726J1408J2048J2433J2831J3831J5651J7937K0207K2262
$$ y = [1602502, 1675565, 1748474, 1819956, 1888498, 1952568, 2010962, 2062907, 2107943, 2145907, 2177089, 2202243, 2222342, 2238387, 2251429, 2262633, 2273246, 2284506, 2297363, 2311887, 2326866, 2340284, 2350450, 2356636, 2358744, 2356754, 2350701, 2340819, 2327218, 2309408, 2286413, 2257359, 2221849, 2179878, 2131652, 2077418, 2017332, 1951670, 1881483, 1808857, 1736090, 1664570, 1594835, 1527624, 1464232, 1405574, 1351505, 1301483, 1255562, 1214224, 1177501, 1144778, 1115274, 1088290, 1063123, 1039368, 1017328, 997645, 980398, 964952, 950727, 937608, 925502, 914103, 903481, 894371, 887379, 882142, 877747, 873813, 870711, 868878, 868367, 869003, 870496, 872351, 874099, 875825, 878217, 881980, 887398, 894414, 902825, 912288, 922441, 933167, 944575, 956623, 969056, 981887, 995718, 1011369, 1029306, 1049513, 1071775]
50860A071775K4141K6075K8446L1460L4887L8483M2628M8042N4720O1722O8349
50849A530728P5054Q2721R1422J00461J09481J18835J28696J38413J47038J54209
50839B677058J60090J64602J67073J66653J62796J55246J43758J28195J09029
50830D034500Q7722O6304M6316K8218J1947k013j2508j8692k0680j9038j4079
50819D187997o155L616J3573K2424K9312L3022L1904K5032J2991k937k1871m3204
50807D285704o5788q8040j08839j27845j44853j59254j70133j76615j78199j75128
50797B891010j68407j59171j48075j35547j22286j08986r5790q2674p0270n9476
50787A740328n0201m1357l2438k4348j8258j4246j1547r562q038o809n983n996
$$ y = [1071775, 1095916, 1121991, 1150437, 1181897, 1216784, 1255267, 1297895, 1345937, 1400657, 1462379, 1530728, 1605782, 1688503, 1779925, 1880386, 1989867, 2108702, 2237398, 2375811, 2522849, 2677058, 2837148, 3001750, 3168823, 3335476, 3498272, 3653518, 3797276, 3925471, 4034500, 4122222, 4188526, 4234842, 4263060, 4275007, 4272994, 4260486, 4241794, 4221114, 4202076, 4187997, 4181842, 4185458, 4199031, 4221455, 4250767, 4283789, 4315693, 4340725, 4353716, 4350779, 4328908, 4285704, 4219916, 4131876, 4023037, 3895192, 3750339, 3591085, 3420952, 3244337, 3066138, 2891010, 2722603, 2563432, 2415357, 2279810, 2157524, 2048538, 1952748, 1870074, 1799804, 1740328, 1690127, 1648770, 1616332, 1591984, 1573726, 1559480, 1547933, 1538371, 1530333, 1523524, 1517541, 1511545]
50775A511545o854p717p927q045r120j1157j3166j4619j5889j7191j8072j8417
50763A363371j9082k0803k2966k4144k3812k2854k2336k2172k1312j9031j5762
50752A129097j2660j0517r245q241o939m992k242J164M904Q808J2909J6983K0476
50739A139505K3280K6312L0718L6579M2797M8305N2931N7081O1109O5118O9081
50728A652816P2877P6376P9485Q1985Q3411Q3455Q2474Q1227Q0045P8530P5980
50717B528661P1711O5045N5547M3513K9909J5622J200j2608k4480l3040l7572
50706B703508l8166l5470l0407k3729j5699o490K989J1244J7377K1509K3682K2880
50694B653228J7788Q187m921k0263l6681n2900o7664q0270r0346r7190r9964r8754
$$ y = [1511545, 1504691, 1496974, 1489047, 1481002, 1471882, 1460725, 1447559, 1432940, 1417051, 1399860, 1381788, 1363371, 1344289, 1323486, 1300520, 1276376, 1252564, 1229710, 1207374, 1185202, 1163890, 1144859, 1129097, 1116437, 1105920, 1096675, 1088434, 1081495, 1076503, 1074261, 1075425, 1080329, 1089137, 1102046, 1119029, 1139505, 1162785, 1189097, 1219815, 1256394, 1299191, 1347496, 1400427, 1457508, 1518617, 1583735, 1652816, 1725693, 1802069, 1881554, 1963539, 2046950, 2130405, 2212879, 2294106, 2374151, 2452681, 2528661, 2600372, 2665417, 2720964, 2764477, 2794386, 2810008, 2811208, 2798600, 2774120, 2741080, 2703508, 2665342, 2629872, 2599465, 2575736, 2560037, 2553547, 2556536, 2567780, 2585157, 2606666, 2630348, 2653228, 2671016, 2679203, 2674282, 2654019, 2617338, 2564438, 2496774, 2416504, 2326158, 2228968, 2129004, 2030250]
50682B030250r4803q9390q2848p5025o6126n6746m7324l8056k9140k0665j2380
50671A417747l993M301J1929J8544K4102K8395L0960L1634L0825K8953K6113K2549
50659A672059J9073J6422J4413J2401J0472R406R378R430Q717P559O738O209N444
50646A807721M677M913O554Q868J1117J3508J6560K0139K3726K7323L1282L5299
50634B011687L8253L9379L9117L8474L7843L6876L5395L3887L2956L2797L3491
50623B410155L5334L7916L8736L3706K0144l67k2313l9555m8705n0052m6192l9837
50611B328970l2379k4032j5086o669j39L956N872N822L686n09o408j3844k2911
50598B226329l3256m3738n3093o0701o6361o9745p0547o9123o6494o3589o0558
$$ y = [2030250, 1935447, 1846057, 1763209, 1688184, 1622058, 1565312, 1517988, 1479932, 1450792, 1430127, 1417747, 1413754, 1418055, 1429984, 1448528, 1472630, 1501025, 1531985, 1563619, 1594444, 1623397, 1649510, 1672059, 1691132, 1707554, 1721967, 1734368, 1744840, 1754246, 1763624, 1773054, 1781771, 1789330, 1796068, 1802277, 1807721, 1812398, 1817311, 1823865, 1832733, 1843850, 1857358, 1873918, 1894057, 1917783, 1945106, 1976388, 2011687, 2049940, 2089319, 2128436, 2166910, 2204753, 2241629, 2277024, 2310911, 2343867, 2376664, 2410155, 2445489, 2483405, 2522141, 2555847, 2575991, 2575624, 2553311, 2513756, 2465051, 2414999, 2368807, 2328970, 2296591, 2272559, 2257473, 2250804, 2250665, 2254621, 2260493, 2266315, 2270001, 2269492, 2263084, 2249240, 2226329, 2193073, 2149335, 2096242, 2035541, 1969180, 1899435, 1828888, 1759765, 1693271, 1629682, 1569124]
50587A569124n6969n2591m7902m3771m0654l8285l6214l4279l2334k9907k6758
50576A129460k3484k0861j8576j5516j1449p558m900l075r91J676M487P110R456
50563A045779J1232J2235J2966J4233J6157J8188K0048K2019K4315K6798K9434
50552A253404L2260L4782L6039L5731L4700L3883L3193L1917K9910K7837K6327
50541A609983K5453K5093K5364K6487K8495L1311L5005L9703M5283N1185N6674
50530B000036O1210O4713O7563P0378P3658P7556Q2023Q7071R2664R8309J03047
50519B878228J06101J07359J06935J04469R9306R1328Q1048O8904N4839L8779
50509C737296K1062K285j6849l5396n2388o7488q0799r1724r8688j00690r8526
$$ y = [1569124, 1512155, 1459564, 1411662, 1367891, 1327237, 1288952, 1252738, 1218459, 1186125, 1156218, 1129460, 1105976, 1085115, 1066539, 1051023, 1039574, 1032016, 1027116, 1024041, 1023050, 1024726, 1029213, 1036323, 1045779, 1057011, 1069246, 1082212, 1096445, 1112602, 1130790, 1150838, 1172857, 1197172, 1223970, 1253404, 1285664, 1320446, 1356485, 1392216, 1426916, 1460799, 1493992, 1525909, 1555819, 1583656, 1609983, 1635436, 1660529, 1685893, 1712380, 1740875, 1772186, 1807191, 1846894, 1892177, 1943362, 2000036, 2061246, 2125959, 2193522, 2263900, 2337558, 2415114, 2497137, 2584208, 2676872, 2775181, 2878228, 2984329, 3091688, 3198623, 3303092, 3402398, 3493726, 3574774, 3643678, 3698517, 3737296, 3758358, 3760643, 3743794, 3708398, 3656010, 3588522, 3507723, 3415999, 3317311, 3216621, 3118095]
50498C118095r3634q6104p4880n9919m3013k6127r799O266K1651L4969M4725M9827
50486B882057M9414M2876L0246J2383r248l2764n5934p6581r3325j05911j14669
50475B528544j19703j20834j18384j13574j07713j01065r3065q3776p4503o6493
50465A529434n9536n2523m5165l8340l2826k8535k5239k3217k2629k2696k2146
50454A156582k0279j7216j3367r241n499k575j21K624N784Q624J0555J2060J4151
50441A142082J7183K0562K3552K5902K7452K7578K5444K0997J5414J0393O995
50430A363554N199M384M097M346N294O805Q322R193R181Q691Q455Q904R796J0556
50416A466777J1098J2273J5222K0099K5690L0572L4428L7977M1733M5444M8710
$$ y = [3118095, 3024461, 2938357, 2863477, 2803558, 2760545, 2734418, 2724619, 2730885, 2752536, 2787505, 2832230, 2882057, 2931471, 2974347, 3004593, 3016976, 3007728, 2974964, 2919030, 2842449, 2749124, 2643213, 2528544, 2408841, 2288007, 2169623, 2056049, 1948336, 1847271, 1754206, 1670430, 1595927, 1529434, 1469898, 1417375, 1372210, 1333870, 1301044, 1272509, 1247270, 1224053, 1201424, 1178728, 1156582, 1136303, 1119087, 1105720, 1096479, 1090980, 1088405, 1088284, 1090908, 1096692, 1105316, 1115871, 1127931, 1142082, 1159265, 1179827, 1203379, 1229281, 1256733, 1284311, 1309755, 1330752, 1346166, 1356559, 1363554, 1368753, 1373137, 1377234, 1381580, 1386874, 1393679, 1402001, 1411194, 1420375, 1429066, 1437521, 1446425, 1456221, 1466777, 1477875, 1490148, 1505370, 1525469, 1551159, 1581731, 1616159, 1654136, 1695869, 1741313, 1790023]
50405A790023N1467N3571N4442N3677N1679M9204M6448M3096L9020L4382K9047
50394B296056K2368J3784L367q252k0257l1978m3047n3198o1716o7424o9649o8964
50382A911090o6429o2278n6001m7712l8524k9312j9852r733L98R177J5692J9797
50370A626313K1472K0524J6926J0980L078o346j6585k6605l5409m2352m7223n0142
50358A474631n1339n0903m8890m5746m2336l9363l6862l4520l2214k9913k7297
50347A035248k3940j9862j5487j0995o151q61M334Q479J0604R961O333M77n878
50334I92262j0853j3446j3825j2896j1527r992p963n171k086L54J750K625L650
50321I12882M812N741O571P862R688J1319J1999J1660J0695R383P840O326N172
$$ y = [1790023, 1841490, 1895061, 1949503, 2003180, 2054859, 2104063, 2150511, 2193607, 2232627, 2267009, 2296056, 2318424, 2332208, 2335575, 2327323, 2307066, 2275088, 2232041, 2178843, 2117127, 2049703, 1980054, 1911090, 1844661, 1782383, 1726382, 1678670, 1640146, 1610834, 1590982, 1581249, 1581647, 1590824, 1606516, 1626313, 1647785, 1668309, 1685235, 1696215, 1699293, 1692947, 1676362, 1649757, 1614348, 1571996, 1524773, 1474631, 1423292, 1372389, 1323499, 1277753, 1235417, 1196054, 1159192, 1124672, 1092458, 1062545, 1035248, 1011308, 991446, 975959, 964964, 958813, 957952, 962286, 970765, 981369, 991330, 997663, 998140, 992262, 981409, 967963, 954138, 941242, 929715, 919723, 911760, 906589, 904503, 904857, 906607, 909232, 912882, 917694, 923435, 930006, 937868, 947556, 958875, 970874, 982534, 993229, 1002612, 1010452, 1016778, 1021950]
50308A021950M472M083L920M085M656N574O729P970R004R466R244Q660Q264Q442
50294A116519R240J0476J1969J3727J6016J9179K3241K7748L2262L7177M3513
50283A361067N0980N6035N2904L8054J4096j1276l0684m1319m4515m2688l7700
50272A364954l1213k4840j9455j5016j1303q362o103m226k686j762j422j168o80
50259A236718q8O54K050M381P303J0521J4337J9011K4056K8781L3112L7257M0815
50246A458908M2886M2999M1475L8979L6200L3844L2408L1939L2207L2800L2765
50235A857410L0620K5495J7961R088r99j2709k5217l6306m4315m9323n2027n2309
50223A667369m9764m4980l9401l4124k9656k6798k6800l0171l5687m1039m4404
$$ y = [1021950, 1026422, 1030505, 1034425, 1038510, 1043166, 1048740, 1055469, 1063439, 1072443, 1081909, 1091153, 1099813, 1108077, 1116519, 1125759, 1136235, 1148204, 1161931, 1177947, 1197126, 1220367, 1248115, 1280377, 1317554, 1361067, 1412047, 1468082, 1520986, 1559040, 1573136, 1561860, 1531176, 1489857, 1445342, 1402654, 1364954, 1333741, 1308901, 1289446, 1274430, 1263127, 1254765, 1248662, 1244436, 1241750, 1239988, 1238566, 1237398, 1236718, 1236630, 1237284, 1239334, 1243715, 1251018, 1261539, 1275876, 1294887, 1318943, 1347724, 1380836, 1418093, 1458908, 1501794, 1544793, 1586268, 1625247, 1661447, 1695291, 1727699, 1759638, 1791845, 1824645, 1857410, 1888030, 1913525, 1931486, 1940574, 1939575, 1926866, 1901649, 1865343, 1821028, 1771705, 1719678, 1667369, 1617605, 1572625, 1533224, 1499100, 1469444, 1442646, 1415846, 1385675, 1349988, 1308949, 1264545]
50212A264545m5248m3895m0879l6848l2665k9048k6056k3222k0254j7330j4692
50201I34408j2351j0377r056q427p984p190o106n164m623m511m800n144m889l905
50187H39881l163l697n200o341o432n958n406m545l197j978j729k568l918n098
50173G80651n608n183l989k538j277m39k16n77q69k86J064K128K306K223K717
50158G70107L605M132M250M719O041P804R155R607R477R648J0788J2643J4312
50145H76288J5278J5848J6473J7147J7798J8799K0664K3566K7605L3158M0481
50134A123105M9149N8306O7298P5630Q2511Q6873Q7957Q5783Q1303P6236P2268
50123A946419O9998O8888O8334O8135O7495O4291N6276M2835K5102M817j6148
$$ y = [1264545, 1219297, 1175402, 1134523, 1097675, 1065010, 1035962, 1009906, 986684, 966430, 949100, 934408, 922057, 911680, 902624, 894197, 886213, 879023, 872917, 867753, 863130, 858619, 853819, 848675, 843786, 839881, 836718, 833021, 827821, 821480, 815048, 809090, 803684, 799139, 795942, 793964, 792235, 789667, 785749, 780651, 775043, 769860, 765871, 763333, 762056, 761617, 761401, 760824, 759955, 759669, 760733, 762861, 765167, 767390, 770107, 773712, 777844, 782094, 786813, 792854, 800658, 809813, 819420, 828897, 838545, 849333, 861976, 876288, 891566, 907414, 923887, 941034, 958832, 977631, 998295, 1021861, 1049466, 1082624, 1123105, 1172254, 1230560, 1297858, 1373488, 1455999, 1542872, 1630829, 1716612, 1797915, 1874151, 1946419, 2016417, 2085305, 2153639, 2221774, 2289269, 2353560, 2409836, 2452671, 2477773, 2482590, 2466442]
50112B466442l5705n2333o6090p7861q7477r3417r4701r2210q7662q2036p5513
50101A621437o8363o1182n4471m8511m3588l9884l7266l5402l3963l2541l0577
50090A135689k7678k3915j9717j5612j2078r358p144m735j820J045L049M042M555
50077A026323N080N650O129O489O661O449N798N047M629M561M405L753K637J358
50063A094969O4j312k761m082n144o065o965p613p612o966o292o260o879p464
50049A019618p366o541n324l821j872L94K395L749M823O221P956R505J0589J1427
50035A051753J2281J3214J4316J5660J6917J7566J7597J7494J7338J6598J5117
50024A225851J3679J3020J2859J2512J2073J2261J3365J5090J7329K0328K4093
$$ y = [2466442, 2430737, 2378404, 2312314, 2234453, 2146976, 2053559, 1958858, 1866648, 1778986, 1696950, 1621437, 1553074, 1491892, 1437421, 1388910, 1345322, 1305438, 1268172, 1232770, 1198807, 1166266, 1135689, 1108011, 1084096, 1064379, 1048767, 1036689, 1027331, 1020187, 1015452, 1013632, 1014677, 1017726, 1021768, 1026323, 1031403, 1037053, 1043182, 1049671, 1056332, 1062781, 1068579, 1073626, 1078255, 1082816, 1087221, 1090974, 1093611, 1094969, 1095033, 1093721, 1090960, 1086878, 1081734, 1075669, 1068704, 1061091, 1053479, 1046513, 1040221, 1033961, 1027082, 1019618, 1012252, 1005711, 1000387, 996566, 994694, 995088, 997483, 1001232, 1006055, 1012276, 1020232, 1029737, 1040326, 1051753, 1064034, 1077248, 1091564, 1107224, 1124141, 1141707, 1159304, 1176798, 1194136, 1210734, 1225851, 1239530, 1252550, 1265409, 1277921, 1289994, 1302255, 1315620, 1330710, 1348039, 1368367, 1392460]
50013A392460K8151L1948L4981L6581L6216L4126L1228K8249K5322K2538K0341
50002A722141J9230J9372K0551K2115K2823K1184J6266Q040k962j5964k9773m2827
49990A780196n3712o1571o6033o7137o5496o2187n8157n3877m9643m5935m3122
49979A153326m0945l8617l5534l1860k8339k5515k3169k0693j8006j5786j4535
49968H60327j3756j2512j0671r036q212p868p318o445n721n565n907o327o390
49955G54599n885m809l188j034J468L818N519O544P333Q287R338R963R618Q275
49941H09846O591N353M734M282L663K944K100P95j036k962m869p393j0850j4320
49927G98878j6561j7507j7952j8094j7332j5415j2865j0219p716n686m347l159
$$ y = [1392460, 1420611, 1452559, 1487540, 1524121, 1560337, 1594463, 1625691, 1653940, 1679262, 1701800, 1722141, 1741371, 1760743, 1781294, 1803409, 1826232, 1847416, 1863682, 1871722, 1868760, 1852796, 1823023, 1780196, 1726484, 1664913, 1598880, 1531743, 1466247, 1404060, 1345903, 1292026, 1242383, 1196448, 1153326, 1112381, 1073764, 1038230, 1006370, 978031, 952516, 929347, 908654, 890648, 874862, 860327, 846571, 834059, 823388, 814352, 806140, 798272, 790954, 784509, 778788, 773223, 767316, 760989, 754599, 748714, 743905, 740717, 739683, 741151, 744969, 750488, 757032, 764365, 772652, 781990, 791953, 801571, 809846, 816437, 821790, 826524, 830806, 834469, 837413, 839513, 840308, 839272, 836310, 831441, 824048, 813198, 798878, 782317, 764810, 746858, 728764, 711432, 696017, 683152, 672933, 665217, 659531, 655184, 652025]
49915F52025j384O41J777J782J717K283K893K874K582K682L175L839M843O217
49901F87946P444Q243R141J0585J2139J3195J3770J3902J3040J0945Q549O822
49889H15721N302K788q10m322o711p819q028q098r061j1158j3134j3631j3072
49876G27967j2989j3674j3767j2351j0159q302o902n562m229k984j704n18L4j68
$$ y = [652025, 650641, 651282, 653059, 654841, 656558, 658841, 661734, 664608, 667190, 669872, 673047, 676886, 681729, 687946, 695390, 703633, 712774, 723359, 735498, 748693, 762463, 776365, 789405, 800350, 808899, 815721, 821023, 823811, 823001, 818679, 811968, 804149, 796121, 788023, 778962, 767804, 754670, 741039, 727967, 714978, 701304, 687537, 675186, 665027, 656725, 649823, 644261, 640032, 637048, 635344, 634826, 634860, 634692]
$$ [...]
##END NTUPLES=NMR SPECTRUM
##END=
