##TITLE=AC1607_BRALA13337_8316913_9S6nsyCp7H
##JCAMPDX= 6.0         $$ Bruker NMR JCAMP-DX V2.0
##DATA TYPE= NMR SPECTRUM
##DATA CLASS= NTUPLES
##ORIGIN= BRUKER
##OWNER= Administrator
$$ 1.72 TOPSPIN		Version 2.1
$$ 2013-11-09 22:56:14.984 -0800  Administrator@X
$$ Compression mode = diff/dup
##.OBSERVE FREQUENCY= 400.02188249412
##.OBSERVE NUCLEUS= ^1H
##.ACQUISITION MODE= SIMULTANEOUS (DQD)
##.ACQUISITION SCHEME= undefined
##.AVERAGES= 8
##.DIGITISER RES= 22
##SPECTROMETER/DATA SYSTEM= spect
##.PULSE SEQUENCE= zg30
##.SOLVENT NAME= COFFEE_meoh
##.SHIFT REFERENCE= INTERNAL, COFFEE_meoh, 1, 14.98509
##AUDIT TRAIL= $$ (NUMBER, WHEN, WHO, WHERE, PROCESS, VERSION, WHAT)
$$ ##TITLE= Audit trail, TOPSPIN		Version 2.1
$$ ##JCAMPDX= 5.01
$$ ##ORIGIN= Bruker BioSpin GmbH
$$ ##OWNER= Administrator
$$ $$ E:\/data/COFFEE/nmr/AC1607_BRALA13337_8316913_9S6nsyCp7H/10/pdata/1/auditp.txt
$$ ##AUDIT TRAIL=  $$ (NUMBER, WHEN, WHO, WHERE, PROCESS, VERSION, WHAT)
(   1,<2013-11-09 22:56:08.218 -0800>,<Administrator>,<X>,<go>,<TOPSPIN 2.1>,
      <created by zg
	started at 2013-11-09 22:55:02.171 -0800,
	POWCHK enabled, PULCHK disabled,
       configuration hash MD5:
       C8 4E 4E 5D D3 5C D8 9E 9F 52 82 E0 59 8A DE 15
       data hash MD5: 64K
       7D 1B 95 6B CF 82 DB 48 5C 4F 9E C7 92 08 42 AE>)
(   2,<2013-11-09 22:56:11.140 -0800>,<Administrator>,<X>,<proc1d>,<TOPSPIN 2.1>,
      <Start of raw data processing
       efp LB = 0 FT_mod = 6 PKNL = 1 PHC0 = 0 PHC1 = 0 SI = 32K 
       data hash MD5: 32K
       C4 08 3D 88 86 14 1A FA 2A 7F 13 9D 40 3C 6E 08>)
(   3,<2013-11-09 22:56:11.453 -0800>,<Administrator>,<X>,<proc1d>,<TOPSPIN 2.1>,
      <pk PHC0 = 92.03247 PHC1 = 0 
       data hash MD5: 32K
       08 78 BE 79 F8 3F 6B D2 9A AF 63 65 08 E1 BD 89>)
(   4,<2013-11-09 22:56:11.593 -0800>,<Administrator>,<X>,<proc1d>,<TOPSPIN 2.1>,
      <abs ABSG = 1 
       data hash MD5: 32K
       B5 F0 F1 A1 1D E4 0B 36 A1 27 9E 37 2A 51 10 00>)
(   5,<2013-11-09 22:56:11.671 -0800>,<Administrator>,<X>,<proc1d>,<TOPSPIN 2.1>,
      <abs ABSG = 2 
       data hash MD5: 32K
       8D 07 FA B8 04 9A 18 BC 9C 09 B1 04 1C 29 05 3A>)
(   6,<2013-11-09 22:56:11.734 -0800>,<Administrator>,<X>,<proc1d>,<TOPSPIN 2.1>,
      <abs ABSG = 3 
       data hash MD5: 32K
       71 AC 36 AE E3 18 28 4E BA E4 B0 DA 21 AB A3 50>)
(   7,<2013-11-09 22:56:11.828 -0800>,<Administrator>,<X>,<proc1d>,<TOPSPIN 2.1>,
      <abs ABSG = 4 
       data hash MD5: 32K
       5B 5F 7B 8B EE 4A DD F2 85 FE AF FF 74 DC 23 83>)
(   8,<2013-11-09 22:56:11.890 -0800>,<Administrator>,<X>,<proc1d>,<TOPSPIN 2.1>,
      <abs ABSG = 5 
       data hash MD5: 32K
       8B 44 29 2E CD 4C F6 8A F3 74 C6 60 8C 6A B4 F3>)
$$ ##END=
$$ 
$$ $$ hash MD5
$$ $$ CE 01 28 69 83 E4 5C 3B EB CB A2 D7 1F 4E 34 F9
##$RELAX= 
##$RELAX= 
##$RELAX= 
##$RELAX= 
##$RELAX= 
##$RELAX= 
##$RELAX= 
$$ Bruker specific parameters
$$ --------------------------
##$DU= <E:\>
##$EXPNO= 10
##$NAME= <AC1607_BRALA13337_8316913_9S6nsyCp7H>
$$ [...]
150 150 150 150 150 150 150 150
##$TP07= 0
##$TPNAME0= <>
##$TPNAME1= <>
##$TPNAME2= <>
##$TPNAME3= <>
##$TPNAME4= <>
##$TPNAME5= <>
##$TPNAME6= <>
##$TPNAME7= <>
##$TPOAL= (0..7)
0.5 0.5 0.5 0.5 0.5 0.5 0.5 0.5
##$TPOFFS= (0..7)
0 0 0 0 0 0 0 0
##$TUNHIN= 0
##$TUNHOUT= 0
##$TUNXOUT= 0
##$USERA1= <user>
##$USERA2= <user>
##$USERA3= <user>
##$USERA4= <user>
##$USERA5= <user>
##$V9= 5
##$VALIST= <valist>
##$VCLIST= <CCCCCCCCCCCCCCC>
##$VD= 0
##$VDLIST= <DDDDDDDDDDDDDDD>
##$VPLIST= <PPPPPPPPPPPPPPP>
##$VTLIST= <TTTTTTTTTTTTTTT>
##$WBST= 1024
##$WBSW= 4
##$XGAIN= (0..3)
0 0 0 0
##$XL= 0
##$YL= 0
##$YMAX_a= 646520
##$YMIN_a= -548028
##$ZGOPTNS= <>
##$ZL1= 120
##$ZL2= 120
##$ZL3= 120
##$ZL4= 120
##$ABSF1= 14.98509
##$ABSF2= -5.573092
##$ABSG= 5
##$ABSL= 3
##$ALPHA= 0
##$AQORDER= 0
##$ASSFAC= 0
##$ASSFACI= 0
##$ASSFACX= 0
##$ASSWID= 0
##$AUNMP= <proc_prof1d_extract_pilot.lims>
##$AXLEFT= 0
##$AXNAME= <>
##$AXNUC= <1H>
##$AXRIGHT= 0
##$AXTYPE= 0
##$AXUNIT= <>
##$AZFE= 0.1
##$AZFW= 0.1
##$BCFW= 0
##$BC_mod= 0
##$BYTORDP= 0
##$COROFFS= 0
##$CY= 15
##$DATMOD= 1
##$DC= 0
##$DFILT= <>
##$DTYPP= 0
##$F1P= 0
##$F2P= 0
##$FCOR= 0.5
##$FTSIZE= 32768
##$FT_mod= 6
##$GAMMA= 0
##$GB= 0
##$INTBC= 1
##$INTSCL= 1
##$ISEN= 128
##$LB= 0
##$LEV0= 0
##$LPBIN= 0
##$MAXI= 10000
##$MC2= 0
##$MEAN= 0
##$ME_mod= 0
##$MI= 0
##$NCOEF= 0
##$NC_proc= -8
##$NLEV= 6
##$NOISF1= 0
##$NOISF2= 0
##$NSP= 0
##$NTH_PI= 0
##$NZP= 0
##$OFFSET= 14.98509
##$PC= 1
##$PHC0= 92.03247
##$PHC1= 0
##$PH_mod= 1
##$PKNL= yes
##$PPARMOD= 0
##$PPDIAG= 0
##$PPIPTYP= 0
##$PPMPNUM= 2147483647
##$PPRESOL= 1
##$PSCAL= 4
##$PSIGN= 0
##$PYNMP= <proc.py>
##$REVERSE= no
##$SF= 400.02
##$SI= 32768
##$SIGF1= 0
##$SIGF2= 0
##$SINO= 400
##$SIOLD= 32768
##$SPECTYP= <>
##$SREGLST= <1H.CDCl3>
##$SSB= 0
##$STSI= 32768
##$STSR= 0
##$SW_p= 8223.68421052631
##$SYMM= 0
##$S_DEV= 0
##$TDeff= 65536
##$TDoff= 0
##$TI= <>
##$TILT= no
##$TM1= 0
##$TM2= 0
##$TOPLEV= 0
##$USERP1= <user>
##$USERP2= <user>
##$USERP3= <user>
##$USERP4= <user>
##$USERP5= <user>
##$WDW= 1
##$XDIM= 32768
##$YMAX_p= 270769421
##$YMIN_p= -765207
##$CURPLOT= <Network HP LaserJet P1505>
##$CURPRIN= <$Network HP LaserJet P1505>
##$DFORMAT= <normdp>
##$LAYOUT= <+/1D_H.xwp>
##$LFORMAT= <normlp>
##$PFORMAT= <normpl>
##$SURQMSG= 1
$$ End of Bruker specific parameters
$$ ---------------------------------
##NTUPLES= NMR SPECTRUM
##VAR_NAME=  FREQUENCY,     SPECTRUM/REAL,   SPECTRUM/IMAG
##SYMBOL=    X,             R,               I
##VAR_TYPE=  INDEPENDENT,   DEPENDENT,       DEPENDENT
##VAR_FORM=  AFFN,          ASDF,            ASDF
##VAR_DIM=   32768,         32768,           32768
##UNITS=     HZ,            ARBITRARY UNITS, ARBITRARY UNITS
##FACTOR=    0.250966925370066, 1,           1
##FIRST=     8223.43324360094, -66891,       -114561
##LAST=      0,             82862,           -137294
##MIN=       0,             -765207,         0
##MAX=       8223.43324360094, 270769421,    0
$$ Real data points
##PAGE= N=1
##DATA TABLE= (X++(R..R)), XYDATA
$$ [...]
19545A98760a33074r6460j87525H1498a96107A179c9694j00002A90556a48596
19534B83707b21676g2015j51607C81416r5784j0089a07132A19332m6022a36755
19523g0990j615k61586A05082J2078K5029K07460d5293j30681K6478h044j18097
19512a26141A22630g7593n8327M838c0937a0418k98913K7246R903N4224R8501
19501a19457C51869a026j71520j15654a30629C9134J48843i3662A46034i04k97043
19490b97947a24911e6132m7087d863k2862l94392e8172k19957j88083C298b4317
19478b33970k13571i7511A51623C4081R1135m0594l5627a37014D2565a74892h4594
19466B75566c373j15842E1633O0066a79470J1590m3571B20080b90600a09414E041
$$ y = [198760, -133074, -229534, -417059, 81498, -196107, 1179, -39694, -139696, 190556, -148596, 283707, -221676, -72015, -223622, 381416, 285632, 275543, -107132, 119332, 73310, -136755, -70990, -72605, -334191, 105082, 117160, 142189, 349649, -45293, -175974, -149496, -8044, -126141, 122630, -77593, -135920, -131082, -30937, -10418, -309331, -282085, -272182, -217958, -119457, 351869, -1026, -172546, -288200, -130629, 39134, 187977, -93662, 146034, -904, -297947, -124911, -56132, -103219, -4863, -27725, -422117, -58172, -278129, -466212, 3298, -24317, -233970, -447541, -97511, 151623, 34081, 125216, 84622, 48995, -137014, 42565, -174892, -84594, 275566, -3373, -119215, 51633, 111699, -179470, -167880, -211451, 220080, -290600, -109414, 5041]
19454a85101j25450a40094A62139d13917J68732B39353a59271A29978B1801c19384
19443B0520a94559b2897r6419D8665a29252j31858C74610g5590k7166J2700k6213
19432a16269j61390h5747H1015j8392E12e4568j20327k29682J19006F3715J72698
19421B36413a9942j10541q0409B3545g7935j47255N3556M516d8661C05641a590
19409d94321K44027i4432A8452J47322a91843A31846l9878b04927j18376B16410
19398E3498a40947C9052d3916j98848A4564R3153d16874J21762L5046E7714d00674
19386B1725d1680J8354E5558J21441k6661a4936n9334G3369h3865D1967J06416
19375A48383a71210A61947a15129A62432G2402g3586e993B2905b01058E2610f3630
$$ y = [-185101, -310551, -140094, 162139, -413917, -245185, 239353, -159271, 129978, 21801, -319384, 20520, -194559, -22897, -119316, 48665, -129252, -261110, 374610, -75590, -102756, -90056, -116269, -277659, -85747, 81015, 62623, 512, -54568, -174895, -404577, -285571, 63715, 236413, -19942, -130483, -210892, 23545, -77935, -225190, -171634, -167118, -48661, 305641, -1590, -494321, -250294, -94432, 18452, 165774, -191843, 131846, 91968, -204927, -323303, 216410, 53498, -140947, 39052, -43916, -242764, 14564, 107717, -416874, -295112, -260066, 57714, -400674, 21725, -41680, -23326, 55558, 176999, 150338, -14936, -74270, 73369, -83865, 41967, 148383, -171210, 161947, -115129, 162432, 72402, -73586, -5993, 22905, -201058, 52610, -63630]
19363a73191j6457H8250a5839C5799a51890A06977j6998a12170l94553D3428f8549
19351c08259A78809e10836a59568D1638A5902b86543e6491j53120B52240b8934
19340A09556h9242B7156J75421c1832q5884D7876L438b5381k74754A59702b50809
19328b57660j37094a79483J6413g8118A22327d9330A45454J70127g1309k2568
19318i3877M086j27714c9374k41537B11272g2653D2763K8551k6391e0239j27949
19307a78188B6104K97091J17016A63386K04149H6676a95695a4419j32698N2106
19297i5011a0374H5677b06697E2889O620f4981G1297e4248j28111h1474h750C13682
19284b89035c9755A19822m1817Q414a08204A97030c0395k42825p5740B09296A00771
$$ y = [-173191, -189648, 88250, -15839, 35799, -151890, 106977, 89979, -112170, -506723, 43428, -68549, -308259, 178809, -510836, -159568, 41638, 15902, -286543, -56491, -209611, 252240, -28934, 109556, -89242, 27156, 202577, -31832, -117716, 47876, 51314, -25381, -300135, 159702, -250809, -257660, -394754, -179483, -163070, -78118, 122327, -49330, 145454, 315581, -71309, -93877, -89791, -217505, -39374, -280911, 211272, -72653, 42763, 71314, 44923, -50239, -178188, 26104, 323195, 440211, 163386, 367535, 86676, -195695, -14419, -147117, -95011, -10374, 85677, -206697, 52889, 59509, -64981, 71297, -54248, -182359, -81474, -8750, 313682, -289035, -39755, 119822, 78005, 86419, -108204, 197030, -30395, -273220, -348960, 209296, 100771]
19272A534f7853F6060c03969J45714d6600C3205J70346c26088B71285j13212p4527
19261H3546O439a60245e7576C4422e7835m09404c5860j7645j05236B99623q5712
19250B13911I1827f4042D6022d01411a49305j25341A79245b14313p1249J13950
19240a71612A96254a46966j32229D2671b23445M3262l1108D3681f0473q3804B67609
19228D1050K39572b72388A04911a35k92695F8542a78856k64537B28455e7379B6741
19216f3554j58052M3500G5727b84432h6883k47948J22997M1261G8104h7816q7432
19205a75248E1920a89052G878a66262C6335b05841O6195I0996a18895q6769j81637
19194c87301a9717A31937a01252M5070j57121m8262A95313o7507L8883P1520a8684
$$ y = [1534, -67853, 66060, -303969, -158255, -46600, 33205, 203551, -326088, 271285, 158073, 83546, 89985, -160245, -57576, 34422, -57835, -467239, -35860, -53505, -158741, 299623, 213911, 91827, -64042, 46022, -401411, -149305, -274646, 179245, -214313, -285562, -171612, 196254, -146966, -279195, 42671, -223445, -180183, -211291, 43681, -60473, -144277, 267609, 41050, 280622, -272388, 104911, -135, -292830, 68542, -178856, -443393, 228455, -57379, 26741, -63554, -221606, -178106, 75727, -284432, -86883, -334831, -211834, -170573, 78104, -87816, -175248, 51920, -189052, 7878, -166262, 36335, -205841, -139646, 90996, -118895, -205664, -387301, -19717, 131937, -101252, -56182, -213303, -261565, 195313, 127806, 166689, 238209, -18684]
19182a92692b2707l01853B15606c96194f4663j97991d3015h614E39259a33326
19171c54100J9144J46400f1433M906A8141d53889g0991n0200R734H2461a47198
19159A92465D8005c5593H8717C2607J88230C8121b38426A12019L9236c2435k46291
19148b78726O3687d5409k79104J44397C8821a91288j12433h7709A2796a51757
19137E4922M5121k218h2281C03958b8932k74619F7791c37105Q0435C4984a50119
19125a00826K6175B25739D9180b34643R9252E2150g3477j05234A56080b79987
19114a12725A32950R4398K38277A04823a60304L1054p3315A04909b12903k5361
19104b38264E4895c92002d8897c939k32970O1854e097H3464k2214Q8662J7416
$$ y = [-192692, -22707, -324560, 215606, -396194, -64663, -262654, -43015, -8614, 539259, -133326, -354100, -334956, -188556, -61433, -56527, 18141, -453889, -70991, -121191, -111457, 82461, -147198, 192465, 48005, -35593, 88717, 32607, 220837, 38121, -238426, 112019, 151255, -32435, -278726, -215039, -45409, -324513, -180116, 38821, -191288, -303721, -87709, 12796, -151757, 54922, 100043, 97825, -82281, 303958, -28932, -303551, 67791, -337105, -256670, 34984, -150119, -100826, -74651, 225739, 49180, -234643, -135391, 52150, -73477, -178711, 156080, -279987, -112725, 132950, 227348, 465625, 104823, -160304, -129250, -202565, 104909, -212903, -238264, 54895, -392002, -48897, -3939, -236909, -175055, -5097, 83464, 61250, 149912, 167328]
19093A67328F7805J18979a44905L3592c1065o5548j0219e0680b1176G8384a3698
19081i5683K8917C97897e5159m75767C0424a39697b668C93697c24083K7764f2836
19069f7662n54007b53233o2421A28200a32716M1791j95905M0343i5859A7063K24474
19058B41537k3784a61761k5164E4169c259m1950A32543D1378m222g3197A60719
19046c0458F58b10783N9616a0631A03742E0258a40406G6387a88863k6613L4510
19035a80966j62689d2758j6065D4035a72516J0569A51261R9607r6158a23660B73424
19023B35495c5163a474B28506j11874n1319b58667R0163L509B76996H080Q1380
19012H9460R9657d4679C0475a10533A46516F5969a76508j2335c7758B0691N4171
$$ y = [167328, 67805, 186784, -144905, -111313, -31065, -96613, -106832, -50680, -21176, 78384, -13698, -95683, -66766, 397897, -55159, -530926, 30424, -139697, -2668, 393697, -324083, -296319, -62836, -67662, -621669, -253233, -315654, 128200, -132716, -90925, -286830, -246487, -95859, 17063, 241537, 217753, -161761, -186925, 54169, -3259, -45209, 132543, 41378, 37156, -73197, 160719, -30458, 658, -210783, -151167, -10631, 103742, 50258, -140406, 76387, -188863, -215476, -180966, -343655, -42758, -58823, 44035, -172516, -161947, 151261, 250868, 154710, -123660, 273424, 235495, -35163, -1474, 228506, 116632, 65313, -258667, -168504, -164995, 276996, 8080, 89460, 189117, -44679, 30475, -110533, 146516, 65969, -176508, -188843, -37758, 20691, 74862]
19001G4862b18992H7463m320d47773g3607E0174b43731O1516G3545B4409a06817
18989c54970a35428f6466j35160g7768k048c6813k24054g3149G7274J4415b46057
18977a31887d8244B83557a84242A49500o871b01427B66606e0402j03105j78849
18967c32356n832J29043o522B13110a68296D7415a22873q8543R2880j0687B735
18955a19242C28243n2355A33255K67125E9346K6293D668e0501q3355A0623b41947
18943C00819b09252K0264a0253k33025A45842b67472j42007F3520c20106g0556
18932i0845B0398c61262A56536b0266j96856m4611J16900d4239A41807a47942
18921a26741K5756o4588j22285J41286r1414C3857b93312a5068A02130a11158
$$ y = [74862, -218992, 87463, 83143, -447773, -73607, 50174, -243731, -182215, 73545, 24409, -106817, -354970, -135428, -66466, -201626, -77768, -79816, -36813, -260867, -73149, 77274, 91689, -246057, -131887, -48244, 283557, -184242, 149500, 142629, -201427, 266606, -50402, -153507, -332356, -338188, -209145, -215667, 213110, -168296, 47415, -122873, -211416, -118536, -129223, 2735, -119242, 328243, 275888, 133255, 400380, 59346, 85639, 4668, -50501, -133856, 10623, -241947, 300819, -209252, -188988, -10253, -243278, 145842, -267472, -409479, 63520, -320106, -70556, -90845, 20398, -361262, 156536, -20266, -217122, -261733, -144833, -44239, 141807, -147942, -126741, -100985, -165573, -287858, -146572, -237986, 33857, -293312, -15068, 102130, -111158]
18910a4844D283c03946C00407c9109k14816A08046l2039g7056F2972a15064K6665
18899h8399j41835f1983j06502q8E0264e2124B72838i582r0660d6207l1996k52431
18887c30634i214p099m10404J75356J12484G7086a60032H0774f7076B7378a64298
18875B47776a38390A11024a75457A96621C5814K28229c9843A40758b96656G2410
18864c29371H3866R6706b07048g2027p959b6983H2491J9277B831b41626L0867
18853b10759c4273l9241A15089d6935D7709f0734b322p6760b0145k57094g1178
18841A53942g2470B62775e9586D1276i6301k48918b5245B81778a95097K7974A80957
18829c8857I2612K9118f0368K5928j30527k701A36256Q7751I7975J16475C8873
$$ y = [-14844, 4283, -303946, 300407, -39109, -253925, 108046, 76007, -77056, 62972, -115064, -88399, -230234, -61983, -168485, -168573, 50264, -52124, 272838, -9582, -100242, -46207, -78203, -330634, -9214, -16313, -426717, -251361, -138877, 77086, -160032, 80774, -67076, 27378, -164298, 247776, -138390, 111024, -175457, 196621, 35814, 264043, -39843, 140758, -296656, 72410, -329371, 83866, 180572, -207048, -72027, -79986, -26983, 82491, 101768, 2831, -241626, -210759, -34273, -73514, 115089, -46935, 47709, -60734, -2322, -79082, -20145, -277239, -71178, 153942, -72470, 262775, -59586, 41276, -96301, -345219, -25245, 281778, -195097, -167123, 180957, -38857, 92612, 121730, -60368, -34440, -164967, -167668, 136256, 224007, 97975, 214450, 38873]
18817g0152L0192j42951n0917L4143A80512i4352p8225N9220G3923a51108I1189
18805C85694G2207b67660P1965A5609h2368k98656a08511j43855A71739N086D8606
18793g2304A437a75224b3932o1527D70237b18873A90741h1674A46337K58905b55095
18781h0371G1214J49569g833l1520k75123B21624a18008E2128i6807I4330a9986
18769d97927C22345a07702D7680J6280c3837L289k05395B0780c17783d31A35565
18757a49167c7588j69458B59841b1928j58965A911M910J7135b85757a12370m3860
18746a56230J9253M7255c4932F4828d24366J12998h0471p5356B59060d35267H1830
18734D7551a15490D3852a6298B51233A15854i3276B6347a58744C3212a01007A75089
$$ y = [-70152, -39960, -182911, -233828, -199685, 180512, -94352, -172577, -113357, 73923, -151108, 91189, 385694, 72207, -267660, -195695, 15609, -82368, -381024, -108511, -252366, 171739, 176825, 48606, -72304, 1437, -175224, -23932, -85459, 470237, -218873, 190741, -81674, 146337, 405242, -255095, -80371, 71214, 220783, -7833, -39353, -314476, 221624, -118008, 52128, -96807, 94330, -19986, -497927, 322345, -107702, 47680, 63960, -33837, -30548, -235943, 20780, -317783, -431, 135565, -149167, -37588, -207046, 259841, -21928, -180893, 1911, 6821, 23956, -285757, -112370, -156230, -136977, -89722, -34932, 64828, -424366, -311368, -80471, -155827, 259060, -435267, 81830, 47551, -115490, 43852, -16298, 251233, 115854, -93276, 26347, -158744, 33212, -101007, 175089]
18722i5469A31802f9690C87125a48690A9392k103c3887j79446d8605n6680C34534
18710A1686J07256b63228C65280a60039f0321j8599C7310a66881b2558j04865
18700a27423N7870j02775B14290b32795l48350c8212l0700l30670g7294j62816
18690b40110M1288n0645b2824j55957F9193d4088B88614a58879p2277k4669a15585
18678a54178O4439j38588B0168O806a03135b9499m6170j14078a2479l3601q6490
18667a32570A83652a20541j11997A2912J46805a16058D2978b78862f6783j67276
18657b34059n8591J19306j10588C0130J63201b52027R3815M731F4080b04465h8578
18645F6854b00790o4526q3132A72853f4368a0701G1554P8869p4551J753b01329
$$ y = [-95469, 131802, -69690, 387125, -148690, 19392, 17289, -33887, -213333, -48605, -105285, 334534, 11686, 118942, -263228, 365280, -160039, -60321, -78920, 37310, -166881, -22558, -127423, -69553, -172328, 214290, -232795, -581145, -38212, -68912, -399582, -77294, -240110, -198822, -249467, -22824, -178781, 69193, -44088, 288614, -158879, -231156, -255825, -115585, -154178, -89739, -228327, 20168, 26974, -103135, -29499, -75669, -189747, -12479, -46080, -132570, 183652, -120541, -232538, 12912, 159717, -116058, 42978, -278862, -66783, -234059, -292650, -173344, -283932, 30130, 193331, -252027, -158212, -153481, 64080, -204465, -88578, 66854, -200790, -265316, -348448, 172853, -64368, -10701, 71554, 150423, 75872, 77625, -201329]
18633A40968E0532K6358b26885F8141O069c79433a7240O382E6721K8670a04863
18621A44884e4321C750J68443B3231b57803J05709f9686j2174r7116j19502J13692
18610a84786A0978R4761K8814a181B81808a61930i719o66r4484A97737o6953J39386
18598B70170a42452F0028a73964b2188F7919i4697D8678b44137A90052a30164
18587c53114A70635c67797d9511j71254H5040a3243k13338c8529a1041l24070
18577c35111a16252a5762m49403c3063k41024A55991b46363c3166p7690n04518
18567f15374a46874j40269j17393d7184A83738C7473R1775b1733j90548B556P5237
18556G7793Q1331C9976d5536D9006e193j17518M4294A5311b6079j12496K5099
$$ y = [140968, 50532, 76890, -226885, 68141, 74210, -379433, -17240, -10858, 56721, 85391, -104863, 144884, -54321, 3750, 172193, 23231, -257803, -152094, -69686, -81860, -178976, -298478, -184786, 10978, 105739, 134553, -1181, 281808, -161930, -9719, -10385, -104869, 197737, 130784, 270170, -142452, 60028, -173964, -22188, 67919, -94697, 48678, -244137, 190052, -130164, -353114, 170635, -367797, -49511, -220765, 85040, -13243, -226581, -38529, -11041, -335111, -116252, -15762, -465165, -33063, -274087, 155991, -246363, -33166, -110856, -615374, -146874, -287143, -404536, -47184, 183738, 37473, 129248, -21733, -212281, 2556, 77793, 159124, 39976, -45536, 49006, -5193, -122711, -78417, 15311, -26079, -138575, -113476]
18545a13476I9319K3638L8666f6235A0406K87880A21717j2846f7929k04763A59451
18533b77769h6217A28130B8211J54254d15582A08709l1305d35010A83611b82198
18522A17405n2282J56317f8670A44656Q3415i5358f489k64719O4386l5667j56577
18511c99066a85216B37322E7632c2130m4595b4985r2911o9488f7903A5692c30251
18499a46658J2467d7075l47544A09962g2530k68682E4995h3241A34974b19303
18488a45169G4377a8003k49722K8908A13611N0221A8861a08988b6864B8551K28530
18477B57081c60662B10739a06733k30315q8196a57064j06507E865P6927b4122
18466b63483A61352n1648a5805p1303k8789A8944K3223a8607j06367p0886l2537
$$ y = [-113476, 99319, 122957, 161623, -66235, 10406, 298286, 121717, 108871, -67929, -272692, 159451, -277769, -86217, 128130, 28211, 182465, -415582, 108709, 77404, -435010, 183611, -282198, 117405, 65123, 221440, -68670, 144656, 228071, -95358, -6489, -271208, -206822, -242489, -399066, -185216, 237322, 57632, -32130, -76725, -24985, -117896, -187384, -67903, 15692, -330251, -146658, -134191, -47075, -394619, 109962, -72530, -341212, 54995, -83241, 134974, -219303, -145169, 74377, -18003, -267725, -238817, 113611, 163832, 18861, -108988, -26864, 28551, 257081, -360662, 210739, -106733, -337048, -425244, -157064, -263571, 5865, 82792, -24122, -263483, 161352, 109704, -15805, -87108, -115897, 18944, 42167, -18607, -124974, -195860, -228397]
18455b28397B16170C1444a58229K7329j41987A50350M6747b0994l6969B24901
18444b7604m4367A35362e0393C30201a2677j69913C9971K6310d15729H1577a18208
18432A61248c5052j66802f5248j53278a3814j20638B24182I5772a64148B74457
18421c12932J14280C8505i0689L8123m1614r650I1495a33714D39297i0958E3462
18409h3769q1168j8259k26291A38953a17766j59453a10838C5306b08407B78793
18398B56684d6670j11002O3246j08784k34005a76682J9745k49085a51146B14218
18387b13653C1370b01290M3550g3295B46696J10597a43586a219E4286c6282A8906
18375F7348b17362A88819b08779N3098j87095m4256B08982P8931a14395C30244
$$ y = [-228397, 216170, 31444, -158229, -130900, -272887, 150350, 197097, -20994, -57963, 224901, -27604, -71971, 135362, -50393, 330201, -12677, -182590, 39971, 66281, -415729, 81577, -118208, 161248, -35052, -201854, -65248, -218526, -13814, -134452, 224182, 95772, -164148, 274457, -312932, -198652, 38505, -90689, -52566, -94180, -103830, 91495, -133714, 439297, -90958, 53462, -83769, -164937, -183196, -409487, 138953, -117766, -277219, -110838, 35306, -208407, 278793, 256684, -46670, -157672, -94426, -203210, -437215, -176682, -156937, -406022, -151146, 214218, -213653, 31370, -201290, -157740, -73295, 246696, 357293, -143586, -1219, 54286, -36282, 18906, 67348, -217362, 188819, -208779, -155681, -342776, -387032, 208982, 287913, -114395, 330244]
18364b33793l4467g5944A42269a76932n4671a08551A95548D5763i608D2833J08754
18353A51587a90756k3400E374c37404A7530G295P953J99321e2957J2673j3683
18342e3967B05396g5420C8442O8927j7930c83982B29578c15566b1029j872k53386
18331b76287J16700D5117f2009a6821l9548D7918a63326H3789J18881f5800j09339
18320a75139o2364E2549B795J32852J48400f0222k5112l17148B18011F9666a41821
18308b22917j05561a03829A7245a77981l7200A27816a8281B4193b13408C5852
18297A63809J15946D1111a31193n1472j49797a58170O7087H3269a32439K876L499
18286a26064A35291L14529c07689O5715A39785o3177g9732A6745J49722d5882
$$ y = [-233793, -268260, -75944, 142269, -176932, -231603, -108551, 195548, 45763, -9608, 42833, 151587, -190756, -214156, 5374, -337404, 17530, 7295, 15248, 214569, -52957, -40284, -53967, 205396, -75420, 38442, 107369, 89439, -383982, 229578, -315566, -21029, -22901, -276287, -159587, 45117, -62009, -16821, -56369, 47918, -163326, 83789, 202670, -65800, -175139, -237503, 52549, 2795, 135647, 284047, -60222, -85334, -402482, 218011, 69666, -141821, -222917, -328478, -103829, 17245, -177981, -215181, 127816, -18281, 24193, -213408, 35852, 163809, 279755, 41111, -131193, -182665, -332462, -158170, -91083, 83269, -132439, -129563, -126064, 135291, 449820, -307689, -241974, 139785, 76608, -79732, 16745, 166467, -45882]
18275a19059d5793p0418J9350A02740a5778j59058L6466A76121b16963A32170
18264E0619a42888K8412o9903k2401R6252j53861A88433m6678b55692q1237f6834
18252b44080b4420r1538A73167O2479A11612a02326K5290D9798a16280G8807K53184
18241C31991a2996k27784A05457a78986p7367M7911C03545l4336b00643O5178
18231a35465I6664i8398r6681A40184a98282m3019A13788a25606L8983d3232k95577
18220c38809D6837J05984a765H0145b53780a21965L8144k88535a71696J6076d7748
18208b3195m8185j45343H0943K01493A2001K29054E3106M2109b03745f965j08078
18197a15043F7380j7149M3158b07595r5943A29607a54088l0445f7559j2122a9130
$$ y = [-119059, -45793, -116211, -96861, 102740, -15778, -174836, -138370, 176121, -216963, 132170, 50619, -142888, -114476, -184379, -206780, -110528, -264389, 188433, 141755, -255692, -336929, -66834, -244080, -24420, -115958, 173167, 235646, 111612, -102326, -77036, 49798, -116280, 78807, 331991, -12996, -240780, 105457, -178986, -256353, -208442, 303545, 269209, -200643, -135465, 96664, -98398, -195079, 140184, -198282, -241301, 113788, -125606, -86623, -43232, -338809, 46837, 152821, -1765, 80145, -253780, -121965, -83821, -372356, -171696, -155620, -47748, -23195, -71380, -216723, 80943, 282436, 12001, 241055, 53106, 95215, -203745, -6965, -115043, 67380, 50231, 93389, -207595, -303538, 129607, -154088, -184533, -67559, -79681, -19130]
18185A32111H084a5049O783B08468F9425c70504A49448B9877O220K33871c23659
18173A87486F7297b91519q2095I2301a06053G729J17954c15377A52429f0000k46820
18162c06820D5980M3425a27250A3771J47908a45831c8795B2498J12732P778a90947
18150b67512A04185f89B27819g0250J5987K1717L985B55896P8617A47182a74330
18138e0925r4402k0457m259e6269m6859A38782o4177c71618B94182b04047H4460
18126b11697L3243A08692e9672B37020h5512p8087J7810a5057r5664B45561b37439
18114A06998d39025h2905k03311i7201M6068p7635A769b21470A15729a66600H7525
18102b35352b6674p9243I6513a69067P5778K4899k76726A23684a24210l6246C80214
$$ y = [132111, 8084, -15049, -8266, 208468, 69425, -370504, 149448, 29877, 36097, 269968, -323659, 187486, 67297, -291519, -373614, 92301, -106053, 7729, 125683, -315377, 152429, -60000, -306820, 45980, 89405, -127250, 13771, 161679, -145831, -38795, 22498, 135230, 143008, -190947, -267512, 104185, -689, 227819, -70250, -54263, -32546, -28561, 255896, 334513, 147182, -174330, -50925, -145327, -165784, -170043, -56269, -103128, 138782, 74605, -371618, 294182, -204047, 84460, -211697, -178454, 108692, -59672, 237020, -85512, -163599, -145789, -15057, -110721, 245561, -237439, 106998, -439025, -82905, -286216, -97201, -51133, -128768, 1769, -221470, 115729, -166600, 87525, -235352, -26674, -105917, 96513, -169067, -93289, -68390, -345116, 123684, -124210, -160456, 380214]
18090C31765D0999P9546b5813A71422a25879k19263d5989k24047a6127j31495
18080a47622F9683b10825M0843A34163E3175a08563l7534C57274a59047A15500
18069e67118H2841a14177c1089o009G2528b16798j25885a30897E8451a89962N8939
18058a31023A54027G3159b01626B1490d669j50152b3092A29101f5729a7667C26889
18046a87762M2897G6989g1261C66452h4774C35378a05985b182j14709H2336a07176
18034A03608m8609M9357b32221L4286A39021r676d84850a08516b0329F9717K50071
18023C19788a44810A37558n0252c4858F1931K70380j07251a74828c2172l38531
18013c70703A88289b54255R7207a1881q31m0860n3396m1682k2839A39623D3263
$$ y = [331765, 40999, 120545, -25813, 171422, -125879, -345142, -45989, -270036, -16127, -147622, 69683, -210825, -169982, 134163, 53175, -108563, -146097, 357274, -159047, 115500, -567118, 82841, -114177, -31089, -37098, 72528, -216798, -342683, -130897, 58451, -189962, -131023, 154027, 73159, -201626, 21490, -4669, -154821, -23092, 129101, -65729, -17667, 326889, -187762, -144865, 76989, -71261, 366452, -84774, 335378, -105985, -2182, -116891, 82336, -107176, 103608, 54999, 104356, -232221, -197935, 139021, 129345, -484850, -108516, -20329, 69717, 319788, -144810, 137558, 87306, -34858, 61931, 332311, 225060, -174828, -32172, -370703, 188289, -254255, -157048, -11881, -12712, -53572, -106968, -148650, -171489, 139623, 43263]
18001b92389E1962R4314a15948A91152b26786P671g2619l18441a04125m2049o3542
17990b09716J02800o3275A35846b1367A47827b46766B3778J46998D3681M56628
17980E00309g8414q7356c8036k98337H1149a23641o5772p406r6114F2050K32072
17969B94122d4249m34367F9327a42091A65575e2788D95352A37324J8271C7564
17958A35519a81691A07940L13175b31261a06672A46678K4248B5357i5371B01329
17947b04818A78961a97720a2750p3386a4252j74834f6938k82406A57966c5681
17936a33706a6940l42383q1757A10383b28993H3973a9622G4053h2105A83442J3553
17925A96995b70324G6999e1724l1170j49920R6676A65376a24827j39747R3465
$$ y = [-292389, 51962, 146276, -115948, 191152, -226786, -219115, -72619, -391060, -104125, -146174, -209716, -106916, -170191, 135846, -21367, 147827, -246766, 23778, 170776, 43681, 500309, -78414, -165770, -38036, -336373, 81149, -123641, -189413, -196819, -292933, 62050, 294122, -44249, -478616, 69327, -142091, 165575, -52788, 495352, 137324, 155595, 37564, 135519, -181691, 107940, 421115, -231261, -106672, 146678, 170926, 25357, -95371, 201329, -204818, 178961, -197720, -12750, -86136, -14252, -189086, -66938, -349344, 157966, -35681, -133706, -16940, -359323, -441080, 110383, -228993, 83973, -19622, 74053, -82105, 183442, 196995, -270324, 76999, -51724, -82894, -232814, -136138, 165376, -124827, -264574, -171109]
17915a71109f1493A47940Q2725b86582e6893k4703G4598d24365J61505M3328c7906
17903B35290G6496K93673A33084a67999L6526d75k74237i8178o4726B92326j33601
17892A58725k9436a05396A67108d0880k05624J09073D9974e6615B03490b80974
17881b31912a3972j10805b5945p4835k13820B0340J25374h3728g071k37474c6613
17869I970M1018j4099a38965D19820b38417e7400j59025g9426C21943d31603A90842
17857b47708A05003b02658G3407R5994J01569F3522a48862f4131j63574H3739
17846a74800A35516a3982j78210j79937f5875D22J41472A809P4720J66054a92966
17834d4572A43228n531b65867F3361a48486A38397N5326C8096d7423n126p4934
$$ y = [-171109, -61493, 147940, 230665, -286582, -56893, -81596, 74598, -424365, -262860, -219532, -37906, 235290, 76496, 370169, 133084, -167999, -131473, -475, -274712, -98178, -162904, 292326, 158725, 129289, -105396, 167108, -40880, -246504, -137431, 49974, -56615, 203490, -280974, -231912, -13972, -124777, -25945, -100780, -314600, 20340, 145714, -83728, -7071, -244545, -36613, 9970, 50988, 36889, -138965, 419820, -238417, -57400, -216425, -79426, 321943, -431603, 190842, -247708, 105003, -202658, 73407, 169401, 270970, 63522, -148862, -64131, -227705, 83739, -174800, 135516, -13982, -192192, -372129, -65875, 422, 141894, 1809, 76529, 242583, -192966, -44572, 143228, 137697, -265867, 63361, -148486, 138397, 193723, 38096, -47423, -52549, -127483]
17823a27483A17678O5221K3390A5779h6690c5404k34884O4071C68449d8476J2936
17812c5540C10647g1182r7553B19974i3636J0057o9299f8132a2903k4106a4135
17800D8779a41891B01029n1924K7172c03984I470J70758g5467B32962G5457a8486
17788A13748a70710Q2677j60617A12627L2033b25783h528j23309o2319B44236
17777b01914h9887O302B8447d4388j79656M7129q3146F4180i6626C9141L5196
17766G4337L4b80084A16808J53271o3552a10560B4791b0624m1837j01397A18280
17754A83285b0207F8323R8186h9178j57792o6946h3151J9743A6420f9613h874
17742b75993A89941c19173B99351J04119J08a04215k06848j44923h3652C77614
$$ y = [-127483, 117678, 182899, 206289, 15779, -86690, -35404, -270288, -206217, 368449, -48476, -35540, 310647, -71182, -168735, 219974, -93636, -83579, -152878, -68132, -12903, -37009, -14135, 48779, -141891, 201029, 149105, 176277, -303984, 9470, 180228, -75467, 232962, 75457, -18486, 113748, -170710, -88033, -248650, 112627, 144660, -225783, -8528, -131837, -194156, 244236, -201914, -89887, -83585, 28447, -44388, -224044, -176915, -260061, 64180, -96626, 39141, 74337, 74371, -280084, 116808, 270079, 206527, -110560, 24791, -20624, -62461, -163858, 118280, 183285, -20207, 68323, 166509, -89178, -246970, -313916, -83151, -63408, 16420, -69613, -8874, -275993, 189941, -319173, 299351, 403470, 403578, -104215, -311063, -455986, -83652, 377614]
17731d2901q7820F8743i17j82277B5860a89214F660Q2872m790J79226B0221a76337
17718A48286c31009A54434a50063M024B14367c38582C3161L13308c05718B97078
17707a1551A2434a08654C0589f909A23162d7870B7669P1061a68201J9613J5419
17696a33169a599A40632D2457b16370C4492L22225A77537a04231E0378J63397
17686B13775B784L81187p9879g844A71296c9491G139k469M0454J96920D1116K17897
17674B59013a33080F9702f9871k14702B67761d43165J98668q2798b5032m2121
17664f7153A01674a31835A45486k3911H267d2252A45137n5075b30024b3213A68166
17652A04296l366g4432A27802b14924A77781n87d1839i447H7758R8196a4391k53499
$$ y = [-42901, -130721, 68743, -917, -183194, 25860, -189214, 6660, 89532, 84742, 263968, 20221, -176337, 148286, -331009, 154434, -150063, -146039, 214367, -338582, 33161, 346469, -305718, 297078, -11551, 12434, -108654, 30589, -6909, 123162, -47870, 27669, 98730, -168201, -148588, -133169, -1599, 140632, 42457, -216370, 34492, 356717, 177537, -104231, 50378, 213775, 2784, 383971, 304092, -7844, 171296, -39491, 7139, 4670, 45124, 242044, 41116, 259013, -133080, 69702, -69871, -284573, 267761, -443165, -244497, -327295, -25032, -67153, 101674, -131835, 145486, 121575, 8267, -42252, 145137, 90062, -230024, -23213, 168166, 104296, 100930, -74432, 127802, -214924, 177781, 177194, -41839, -9447, 87758, 185954, -14391, -267890]
17640b67890A66271K150a31920b500A46382m8306f2789B49892e8500a3156j03716
17629a16872B07753C409R2735a06468J4039B16266a21548D7449i6173B71517G1090
17617I4718M5552a45873N148A02831e8192m6199A47579c79127I5312K06273a65763
17605f6347C42882A45989a15282A6288P7906D4983g6192B61792a52022C1790M3585
17594G5375J77872a52435a6895j29379A24688a85232B43063h8126f11E8724O9771
17583A28495a30077q3603C29799c12430B28659o4171a338A34877E7861b20167
17572h8969D7737a10469C49721b81541J27844A11009K34102l1610a01057C34294
17561b43362D13155e5945B20075m1689E5410R4927a11629A28428b05717C3107
$$ y = [-267890, 166271, 168421, -131920, -2500, 146382, 98076, -62789, 249892, -58500, -13156, -116872, 207753, 3409, 96144, -106468, -92429, 216266, -121548, 47449, -96173, 271517, 71090, 94718, 140270, -145873, -140725, 102831, -58192, -104391, 147579, -379127, 95312, 301585, -165763, -66347, 342882, 145989, -115282, 16288, 94194, 44983, -76192, 261792, -152022, 31790, 75375, 253247, -152435, -16895, -146274, 124688, -185232, 243063, -88126, -611, 58724, 128495, -130077, -213680, 329799, -312430, 228659, 164488, -1338, 134877, 57861, -220167, -88969, 47737, -110469, 349721, -281541, -153697, 111009, 345111, 313501, -101057, 334294, -243362, 413155, -55945, 220075, 178386, 55410, 150337, -111629, 128428, -205717, 33107]
17550F5782M44504A66354i5239I3745b2832j20089j17038A4541P9840a0605F8807
17538E1308M7235b63103A96297C9970b14399C27297a29793j8294M8725b5103A76641
17526a39715A48210A2295d8452D96442F394a70402f980A3323J0672K1910K87375
17515C33280A30139l0522a5560C43836f2446A51862J16578B9852a1963H0040J20014
17504B00054M14m0404j0581a48381A82576d29899B46321g4987L1313k1838B50227
17492B42221g51A21292a4497C99346A61770K23145c41370C50051g6390H2938a98102
17480a28937A80696P3925r7755D7948a495B16111o3049m3299d4627B12850j2466
17469B00384q9860i1733J7957A80571K41006j55815l4085F0079F288J12624n1689
$$ y = [65782, 510286, 166354, -95239, 93745, -22832, -142921, -259959, 14541, 94381, -10605, 68807, 51308, 98543, -263103, 196297, 39970, -214399, 327297, -129793, -148087, -99362, -25103, 176641, -139715, 148210, 12295, -48452, 496442, 6394, -170402, -6980, 13323, 23995, 45905, 333280, 130139, 99617, -15560, 343836, -62446, 151862, 268440, 29852, -11963, 80040, 200054, 200468, 160064, 149483, -148381, 182576, -429899, 246321, -74987, -43674, -65512, 250227, 242221, -751, 121292, -14497, 399346, 161770, 384915, -341370, 350051, -76390, 82938, -198102, -128937, 180696, 254621, 156866, 47948, -1495, 216111, 153062, 109763, -44627, 212850, 200384, 110524, -91733, -73776, 180571, 421577, 265762, 231677, 60079, 6288, 118912, 67223]
17458F7223J27149a59313F5729J07944A3823L92202R1435A30054J55096A34469
17447E6231L19236P6837j35501A42647N730J0901K04970L3730j18496D5768K15590
17436B61358a00970m9470f3687H083P8027L12479F1352J84132A2718L50393j68203
17425A94908p1120L30676H7644K03720q4191k9976L4305O680k3915j3190O8055
17414B49132n8651p9896n0686K2671a00513B71380k4739A06629a85908C08461
17403C7931a01815A53316K57869j61120a63161A94165B8560J79127a53427f1900
17392B46134A7343J37740L23799D248b2633j77035B75274j4635n9257I3685i7673
17380A07265N3639a00753A61249J22536q7169a8619l5504C73043A00988K45082
$$ y = [67223, 194372, -159313, 65729, 173673, 13823, 406025, 497460, 130054, 285150, 134469, 56231, 375467, 452304, 316803, 142647, 148377, 159278, 364248, 397978, 279482, 45768, 261358, -100970, -150440, -63687, 8083, 86110, 398589, 61352, 245484, 12718, 363111, 194908, 123788, 454464, 87644, 291364, 207173, 177197, 211502, 218182, 194267, 181077, 249132, 190481, 110585, 59899, 82570, -100513, 271380, 246641, 106629, -185908, 308461, 37931, -101815, 153316, 411185, 250065, -163161, 194165, 28560, 207687, -153427, -61900, 246134, 17343, 155083, 478882, 4248, -22633, -199668, 275274, 260639, 201382, 93685, -97673, 107265, 160904, -100753, 161249, 283785, 196616, -18619, -54123, 373043, 100988, 346070]
17370C46070g6609K6701A8572L40571A74567N3878j0108q4857n1256R4931J57177
17359C34332j48612J70714c5979B99147A44339R9551n0163H0351K90352b7825
17348A51792L9709C333a38659D41373a00530q7903B53752c509A02224L1653J7929
17337A51806J49973O6541a58644B96612J7508A40447m162K39992J01734g7994
17326E3691R1775r836M5520B3169J88333K84785A16304J91176E540L30211j24720
17315B11031k1293g8786B99582j06743a9229A1086Q8353J28231K05099a4282A41821
17303B0175i4452g887G692J64485a98094E08849r4154o1374A55178k720G4039
17291A68665a48009e8004j68407A48323a4457A29968L46461A40476n3609C6143
$$ y = [346070, -76609, -49908, 18572, 359143, 174567, 228445, 218337, 133480, 82224, 177155, 334332, 185720, 356434, -35979, 299147, 144339, 243890, 193727, 80351, 370703, -27825, 151792, 191501, 3333, -138659, 441373, -100530, -188433, 253752, -3509, 102224, 133877, 151806, 301779, 368320, -158644, 296612, 314120, 140447, 136285, 376277, 478011, -77994, 53691, 145466, 135630, 181150, 23169, 211502, 496287, 116304, 307480, 5540, 335751, 211031, 189738, -78786, 299582, 192839, -19229, 11086, 99439, 227670, 432769, -14282, 141821, 20175, -94452, -7887, 7692, 172177, -198094, 508849, 414695, 353321, 155178, 152458, 74039, 168665, -148009, -58004, -226411, 148323, -14457, 129968, 476429, 140476, 86867, 36143]
17280A20967R1291j1869q9459M1438Q7996Q2902e5158C72111A19029K64004A00138
17268C38181j1654M5930J702o1762l4618D2359a03783D92607A77717M6401j02453
17257A21665r000D037b2107B12529J54417a00220B86084d0657F2019J17819G1696
17245A1829J19477J66921Q7600A67409L4081F8867L24087Q2377A90867N210J01426
17234B97503A43322a02268C20819o1490L3681a5820B19250Q2364K7324j17572
17224B11366g241B55643d9488D14216I8217K63378m0086m5912a87818B01735r2005
17213A09730R8813J19385K7973C6652J65768J00813p8159m532c2439F38630B36872
17201B16117j7785K41529A37125K22020l9141J9303b8117C71746E1882J21784
$$ y = [120967, 212258, 200389, 110930, 152368, 240364, 323266, -55158, 372111, 119029, 383033, 100138, 338181, 326527, 372457, 374159, 312397, 277779, 42359, -103783, 492607, 177717, 224118, 121665, 112665, 4037, -22107, 212529, 366946, -100220, 286084, -40657, 62019, 179838, 71696, 11829, 131306, 298227, 385827, 167409, 201490, 68867, 392954, 475331, 190867, 196077, 297503, 143322, -102268, 320819, 259329, 293010, -15820, 219250, 301614, 328938, 211366, -7241, 255643, -49488, 414216, 98217, 361595, 321509, 275597, -187818, 201735, 109730, 208543, 327928, 355901, 36652, 202420, 303233, 225074, 220542, -32439, 638630, 236872, 216117, 198332, 439861, 137125, 359145, 320004, 339307, -28117, 371746, 51882, 173666]
17191A73666J0205m9299J94859K1983A59155K62858j15470L2396C5369Q8830J5659
17180A39858K8789b0985C45098k1226r6967R484L5925r5656J22438a55105E43427
17168B57846J70981o4724j02620p1942J7692n6377l7782l0777J57640d1930B12128
17156C70739m8082f1419a0522B84062J582O7698I8829P7711h941D16819j41040
17145B75779J2961L57732B12439J23858a95758H7246L71812A68374B0541K43413
17135B63954J69431j62763r802J22963A27977M8655J74937J00206j37287A17114
17124E60495F2421J07641F7066Q6127J96452J32424A89928K43900j69077o876
17114B57875J11357A22444L56620k30957L0845k6463Q7557q4911J90937j44821
$$ y = [173666, 183871, 134572, 329431, 351414, 159155, 422013, 306543, 338939, 35369, 124199, 139858, 168647, -20985, 345098, 323872, 226905, 236389, 272314, 176658, 299096, -155105, 543427, 257846, 428827, 364103, 261483, 189541, 207233, 150856, 113074, 82297, 239937, -41930, 212128, 370739, 322657, -61419, -10522, 284062, 285644, 353342, 98829, 176540, -8941, 416819, 275779, 288740, 646472, 212439, 336297, -195758, 87246, 459058, 168374, 20541, 263954, 433385, 270622, 260820, 383783, 127977, 176632, 351569, 451775, 314488, 117114, 560495, 62421, 170062, 67066, 153193, 349645, 482069, 189928, 433828, 264751, 257875, 369232, 122444, 479064, 248107, 278952, 252489, 340046, 255135, 446072, 301251]
17104C01251j00282J21921J49458K82386j78779A31262K32592j6945N7010j29167
17094B74752j10447N463J82723N8574J74337n8647k07636Q7512A56533M10835
17084E67368k08960j51588M81384j34661p0746n9057j44295K62907k66014J02799
17074C79137j64748l1824J52973J60669Q9750k86345k0091L19190B41466Q2204
17064C23670N2024K05306r9695O4506k20530j9697J31431K14097C17872J11096
17054D28968K56517C40873L4090o3447K48764j24936m973K46108k89023J66323
17044E53779J15928l8964k89701p8773J54199K7655O63311m88277l587j30128
17034D85442M9755j64752j09898O5384M79790B37903P1354L92815j31923J37028
$$ y = [301251, 200969, 322890, 472348, 754734, 575955, 131262, 363854, 346909, 403919, 274752, 164305, 169768, 352491, 411065, 585402, 526755, 319119, 406631, 156533, 567368, 358408, 206820, 688204, 553543, 482797, 423740, 279445, 542352, 276338, 379137, 214389, 182565, 335538, 496207, 585957, 299612, 279521, 598711, 241466, 323670, 375694, 581000, 481305, 545811, 325281, 305584, 437015, 651112, 317872, 428968, 685485, 340873, 374963, 311516, 560280, 435344, 430371, 676479, 387456, 553779, 669707, 630743, 341042, 262269, 416468, 444123, 1107434, 619157, 615570, 485442, 535197, 370445, 260547, 325931, 805721, 237903, 309257, 702072, 570149, 707177]
17024G07177j87706n2829J25387k37435L82131J542M8454k17939o4040m6166J40108
17013E98684p6295p3046j39949J18972K67964r3556k30764L31183o4226j9069
17003F19898J55434j77901L94359l69736k80472N42976k01238Q9122p9126l04492
16993C88824K35506K25415j17551m6876k22123o3239N28457m29195L89136m2600
16983H45754n0778J24777C47291L4612N05601r5593L6390J08693m04193M30684
16973I63485l75874K9260O9223O7020K19927k10692o8000M14942k50316o4070
16963G94905q0918K96461M8985O6974l14193j48511J8725N26794j89178J7650
16953A037694r9339j55577J90363q1135J40832R098K72922n24779J72323J94148
$$ y = [707177, 519471, 466642, 592029, 354594, 736725, 738267, 786721, 568782, 504742, 458576, 598684, 522389, 449343, 309394, 428366, 696330, 602774, 372010, 703193, 638967, 619898, 775332, 597431, 991790, 622054, 341582, 884558, 683320, 772442, 693316, 388824, 624330, 849745, 732194, 685318, 463195, 399956, 928413, 499218, 888354, 845754, 794976, 919753, 347291, 381903, 887504, 791911, 828301, 936994, 532801, 963485, 587611, 616871, 686094, 753114, 973041, 762349, 694349, 1109291, 858975, 794905, 713987, 1010448, 1059433, 1126407, 812214, 663703, 682428, 1209222, 1020044, 1037694, 938355, 782778, 973141, 892006, 1032838, 1041936, 1314858, 790079, 962402, 1156550]
16943A156550J0183m52711N9929M47635j92037r5984L06447J5513Q2681j56583
16933A181623K18720l39736L31475l84014j38607J9255K32664K55037k69216J25344
16923A232545J86938O0013k16154J109J78275o1841k47240N54233j90819K8366
16913A525425m1088L6481l51793N44075p8896r8839k6693J41795k80350P297J44873
16902A522287J64735r6634J14405l0118M9261r5541K96196m21770M67262k08893
16892A761190q057J2929K17465k3645n10864L22145K6156K02499q0573l129J74768
16881B090884j46121m33717O26205K70782l78045J9813O1862K55194k00250l88440
16871A778167O57352l47933K42431m7301L99355k02874K9595L77912n20977P6375
$$ y = [1156550, 1166733, 714022, 773951, 1221586, 1029549, 933565, 1240012, 1255525, 1338206, 1181623, 1400343, 1060607, 1392082, 1008068, 869461, 888716, 1121380, 1376417, 1107201, 1232545, 1419483, 1479496, 1263342, 1264451, 1442726, 1380885, 1133645, 1687878, 1497059, 1525425, 1484337, 1520818, 1169025, 1713100, 1634204, 1535365, 1508672, 1650467, 1370117, 1377414, 1522287, 1687022, 1590388, 1704793, 1674675, 1723936, 1628395, 1924591, 1502821, 1970083, 1761190, 1753133, 1766062, 1983527, 1959882, 1449018, 1771163, 1797319, 1999818, 1919245, 1916116, 2090884, 1944763, 1511046, 2137251, 2408033, 2029988, 2049801, 2111663, 2366857, 2166607, 1778167, 2435519, 2087586, 2330017, 2282716, 2682071, 2479197, 2508792, 2886704, 2365727, 2442102]
16861B442102J32462O7077K14770o0832k88187M85229m8986j7181K44387L14580
16851C485421m66927K40187J79595l65656R5072J94837K12973M9544M186K57639
16841C886871k57355L39046M30332p5326l10954M00867j24226J17923J29405N9596
16831D596179J89454K02191j85252L04469K08420j38018K94914J52592j19852
16822E505097P57407k81045J87947M38334j44963K63382J44799j02580L08733
16813G077111L94742K54829k3536J92616N1449P83632l46187O95254j539M07903
16803I486274K69412Q8412L98908M12442L26956J13295L75432K60691O29283J65824
16793A2526929N76000L63750N84845J53441M62094O19920N30295M16501O09902
$$ y = [2442102, 2574564, 2641641, 2856411, 2795579, 2507392, 2992621, 2943635, 2926454, 3170841, 3485421, 3018494, 3258681, 3438276, 3072620, 3167692, 3362529, 3575502, 3625046, 3629232, 3886871, 3629516, 3968562, 4398894, 4323568, 4012614, 4413481, 4289255, 4407178, 4536583, 4596179, 4785633, 4987824, 4802572, 5107041, 5315461, 5177443, 5472357, 5624949, 5505097, 6262504, 5981459, 6169406, 6607740, 6462777, 6726159, 6870958, 6768378, 7077111, 7471853, 7726682, 7703146, 7895762, 7947211, 8730843, 8384656, 9079910, 9078371, 9486274, 9755686, 9844098, 10243006, 10655448, 10982404, 11095699, 11471131, 11731822, 12361105, 12526929, 13102929, 13466679, 14051524, 14204965, 14667059, 15286979, 15817274, 16233775, 16843677]
16784A6843677J18302Q04260K62651J054344K63586P52595R36898N91957M17744
16775B2046014Q61383P52350J463307Q29345M33292J036093J118830J371803Q95681
16766C0808098J241694J210720R68186J433706J553976J333212J598666J611466
16758D1759724J532237J388645J530807J820634J588304J838605J910306J694504
16750E5063766K122316J702067K101408K212615J433041K538459J231746K106044
16742G0511462K168298K085496J646068J931869J949401J904619J922452J959241
16734H6078906J961580J836553J512159J978060J730009J384338J520885J868533
16726I9871023J207320J527614J135787J524849J029574Q75578J337141P9334
$$ y = [16843677, 16961979, 17766239, 18028890, 19083234, 19346820, 20099415, 21036313, 21628270, 22046014, 22907397, 23659747, 25123054, 25952399, 26385691, 27421784, 28540614, 29912417, 30808098, 32049792, 33260512, 34228698, 35662404, 37216380, 38549592, 40148258, 41759724, 43291961, 44680606, 46211413, 48032047, 49620351, 51458956, 53369262, 55063766, 57186082, 58888149, 60989557, 63202172, 64635213, 67173672, 68405418, 70511462, 72679760, 74765256, 76411324, 78343193, 80292594, 82197213, 84119665, 86078906, 88040486, 89877039, 91389198, 93367258, 95097267, 96481605, 98002490, 99871023, 101078343, 102605957, 103741744, 105266593, 106296167, 107171745, 108508886, 108588220]
16718A08588220N90143N74413L86183M48640L0453k0829l10762J35041p8947p64875
16708A09577680m86453m50592r43217o56127j223254p05133j371484r47087r21553
16699A01872780j674556q96553j655907j528187j852615j579533j774579k028640
16691H8882210k261858j878503k294105k280432k532557k682065k097775k288698
16683G0566217k532722k207888k519079k114200k022764k422343k385765j996106
16675E2365350j712641k075337j785626k259154j409192j970193j443119j304306
16667C8405782j869591j401670j723133j192179j863984q97771j187434j345169
16659B6924851j346559q46152r92049j699211l06648j167446j041579j102381
$$ y = [108588220, 109178363, 109752776, 110138959, 110587599, 110618052, 110597223, 110286461, 110421502, 110342555, 109577680, 109091227, 108640635, 107697418, 107041291, 105818037, 105112904, 103741420, 102794333, 101872780, 100198224, 99301671, 97645764, 96117577, 94264962, 92685429, 90910850, 88882210, 86620352, 84741849, 82447744, 80167312, 77634755, 74952690, 72854915, 70566217, 68033495, 65825607, 63306528, 61192328, 59169564, 56747221, 54361456, 52365350, 50652709, 48577372, 46791746, 44532592, 43123400, 41153207, 39710088, 38405782, 36536191, 35134521, 33411388, 32219209, 30355225, 29457454, 28270020, 26924851, 25578292, 24732140, 23740091, 22040880, 21734232, 20566786, 19525207, 18422826]
16651A8422826m05610q82814m70780q86372m94439n94345p66309m97964q3314
16642A3340879o05707o75018n01760k69010o10472o4679r6912o59409j60780n88623
16632I108509J33481n18378m9239k76461l59198p4635j89728m94172J08701l74276
16622G014604j7672k33681P3376m49172k23844r6581K4443l73230P8136k90641
16612E505738p6512j89651j9813m71130N47209l37469K37255n26092j80j75133
16602D494222j66881K00573l23653K09813l02228l596r3284m36784K63628L89402
16592D231212m27066K8489l71693J805J74629j14235L2699k60065j74450m1979
16582C079346L49754j05554Q6033n72617J85304J70627j62500j9766k05412M24357
$$ y = [18422826, 18017216, 17134402, 16663622, 15777250, 15282811, 14688466, 13922157, 13424193, 13340879, 12735172, 12060154, 11558394, 11289384, 10678912, 10614233, 10517321, 9857912, 9697132, 9108509, 9241990, 8723612, 8674373, 8397912, 8038714, 7964079, 7774351, 7280179, 7388880, 7014604, 6996932, 6763251, 6836627, 6387455, 6163611, 6067030, 6091473, 5718243, 5796379, 5505738, 5429226, 5239575, 5219762, 4748632, 5295841, 4958372, 5195627, 4669535, 4669355, 4494222, 4327341, 4527914, 4204261, 4414074, 4111846, 4108250, 4014966, 3578182, 3841810, 4231212, 3804146, 3832635, 3460942, 3462747, 3637376, 3523141, 3555840, 3295775, 3121325, 3079346, 3429100, 3323546, 3409579, 2836962, 3022266, 3192893, 3030393, 3010627, 2805215, 3229572]
16572C229572l20851n53990M22366q4698J66492k96926R4251M04160m29679q3692
16562B547005J08435j31239R1959l45831O17721q47671L54899J65832k49647l44762
16552A966701J05084P2140O6434J29128p3149l40292r0767J32951j89055k6936
16542A752239L46275k63339Q4843j29721m97774K77348j43898M01695j41441k07008
16532A479219J20197J66904m83979L17794j15330J46951L9933l67087J98083j3242
16522A489443k45306J80779J31535r1734j73720k31555L752K24763k41392q0659
16512I65906J24172K24632j53997l12293j11108N28395l15507m2385L10287j04127
16502A113975l60149J22614K40067J02562k62604L02966k79924k42694K99813
$$ y = [3229572, 2908721, 2354731, 2777097, 2692399, 2858891, 2561965, 2656216, 3060376, 2630697, 2547005, 2655440, 2524201, 2616160, 2270329, 2888050, 2040379, 2395278, 2561110, 2311463, 1966701, 2071785, 2143925, 2210359, 2339487, 2266338, 1926046, 1835279, 1968230, 1779175, 1752239, 2098514, 1835175, 1920018, 1790297, 1292523, 1569871, 1425973, 1827668, 1686227, 1479219, 1599416, 1766320, 1282341, 1600135, 1484805, 1631756, 1671689, 1304602, 1502685, 1489443, 1244137, 1424916, 1556451, 1464717, 1290997, 1059442, 1063194, 1287957, 1046565, 965906, 1090078, 1314710, 1160713, 848420, 737312, 1265707, 950200, 907815, 1218102, 1113975, 753826, 876440, 1116507, 1219069, 956465, 1259431, 979507, 736813, 1036626]
16493A036626L8658J8266j30633k66542J53823q7474j75772L89045j65907L5005
16483H45095L36153K5863l11793R7190l5617p8603Q091M6497Q2874K7264k37936
16472H05078K09698k56384K07634o6456K71173l97375K83493m56272K27367K7809
16462H55765M3293n6233Q0777q0134J28677k58520P1204m4617l2874l0861m8523
16451F27954r8919M45947k45143J72595j74553K02998r8762J803j48522L11518
16441I96916D06735N42768l10571J28655n0844k08055J24004K61294m39864P2974
16431E27096K30217j53116j2411p9029J07198r7583K43579l41632M44330O9445
16421I38094j29340p5315J31082j21079k70224L64370k10478j99613J96674j65475
$$ y = [1036626, 1075284, 1093550, 962917, 696375, 850198, 762724, 586952, 975997, 810090, 845095, 1181248, 1207111, 895318, 992508, 956891, 878288, 886379, 932876, 1015750, 1043014, 805078, 1014776, 758392, 966026, 899570, 1170743, 773368, 1056861, 600589, 827956, 855765, 899058, 842825, 923602, 843468, 972145, 713625, 784829, 740212, 707338, 676477, 627954, 529035, 974982, 729839, 902434, 727881, 930879, 832117, 833920, 685398, 996916, 406735, 949503, 638932, 767587, 716743, 508688, 632692, 893986, 454122, 527096, 757313, 604197, 591786, 512757, 619955, 522372, 765951, 424319, 868649, 938094, 808754, 733439, 864521, 743442, 473218, 837588, 627110, 427497, 624171, 458696]
16411D58696J29249K8669K0148j26805m3633l7804M9157j55360M0150J51761J73650
16400F87878j38149r1167L5281K68564N241C75460j45943L13653k69990n2687
16390B20493J30997K4789J42439A91042O175K18232k4650J580J06849j7052k7178
16379D54998m157A72887O2234K65341K85144A61259M3050J92909J49126j60691
16369C85653j37671A12273J24534N5917L5651J3499F3712K88680A20794K22325
16359C43119K2961K6337J41541B15168J68943p3120M35712B89397A06439M49948
16349E56387j70380A13099K0288J33628k7375K2307i4660C68304A58916J53536
16339C12452A51085M29903j53239J50149j18142D4955P84409B77650J24128A87237
$$ y = [458696, 587945, 616614, 636762, 509957, 466324, 428520, 477677, 322317, 362467, 514228, 687878, 549729, 458562, 493843, 762407, 767648, 375460, 229517, 543170, 273180, 220493, 351490, 376279, 518718, 191042, 197217, 415449, 390799, 392379, 499228, 482176, 454998, 450841, 172887, 235121, 500462, 785606, 161259, 204309, 397218, 546344, 385653, 247982, 112273, 236807, 292724, 328375, 341874, 63712, 352392, 120794, 343119, 366080, 392417, 533958, 215168, 384111, 310991, 746703, 289397, 106439, 556387, 386007, 113099, 133387, 267015, 239640, 261947, -94660, 368304, 158916, 312452, 151085, 580988, 427749, 577898, 459756, 44955, 829364, 277650, 401778, 187237]
16328D95935m0101j54038J17826r7835J3169j53456J03999Q1346j76231J12753
16318C03367O0170J28043k07271g4620A52633P6779A8262J93847p1697F377M27685
16307D34062j77174N9265o9618M3406K22722A69257K43262A27390J78326I4344
16296a2272F2373L35060J57197B49881K7008A6386c8824j51687c4583C13176q8331
16285B24845E0225K52684i4419D51550I0571c9666C7828K91084a61291C99574
16274E30058A43188A7500J06574a70486B63070K45j15410J81546a9014C7880J40047
16263A77927L46780G8494Q380R7532J62679M3551r0504M8894n730e1574H3251
16251c079C32580C5152b52393A49141a78161D8075a479B85237p3502o5103P0635
$$ y = [495935, 455834, 301796, 419622, 321787, 334956, 181500, 285499, 366845, 190614, 303367, 363537, 491580, 284309, -74620, 152633, 229412, 18262, 212109, 140412, 6377, 434062, 256888, 316153, 246535, 289941, 512663, 169257, 412519, 127390, 305716, 94344, -12272, 62373, 397433, 554630, 249881, 276889, 16386, -38824, -190511, -34583, 313176, 224845, 50225, 302909, -94419, 451550, 90571, -39666, 37828, 328912, -161291, 399574, 530058, 143188, 17500, 124074, -170486, 263070, 263315, 147905, 329451, -19014, 37880, 177927, 524707, 78494, 86874, 184406, 347085, 390636, 300132, 349026, 343296, -51574, 83251, -3079, 332580, 35152, -252393, 149141, -178161, 48075, -1479, 285237, 211735, 146632, 217267]
16240B17267A03158b62323A9919a58182H8477K28481C2215Q0621c218j44272A34165
16228a5152B72804b89319O7040b1938n8787C02629b24378E9234i5231j39715o483
16217b41429b2735I6055i3303F5808N1397k5088K41009B8940D797J13616g6584
16205C10704c5882j846F4066a56564F4820L57925a18391A51248j155J64922a85363
16193B92716j00608D2996J92662I0148l8678R397a38593c2273B41381a76691B09565
16181A22179R3811c47160A02710M50K27907E308K21359d7831j18034f72I8406
16169b41052A34954N969B4963q12J68191G3932K72576p4541b54642B87737A24031
16157c10499e6427o5824A00730a50729A27472k9478a01689k6325A36535O9868
$$ y = [217267, 103158, -262323, 19919, -158182, 88477, 316958, 32215, 112836, -3218, -147490, 134165, -15152, 272804, -289319, -222279, -21938, -80725, 302629, -224378, 59234, -95231, -234946, -241429, -22735, 96055, -93303, 65808, 117205, 92117, 333126, 28940, 4797, 118413, -76584, 310704, -35882, -37728, 64066, -156564, 64820, 422745, -118391, 151248, 150093, 315015, -185363, 292716, 192108, 42996, 235658, 90148, 51470, 60867, -138593, -32273, 241381, -176691, 209565, 122179, 215990, -347160, 102710, 103160, 331067, 5308, 226667, -47831, -165865, -672, 98406, -241052, 134954, 140923, 24963, 24151, 192342, 73932, 346508, 271967, -254642, 287737, 124031, -310499, -56427, -122251, 100730, -150729, 127472, 97994, -101689, -128014, 136535, 206403]
16147B06403A1543J25796b61470B46396a36579b3681A99888G9184f6737A52645
16136B22055K5779b6471D5941O1625A8384h6262F30e7588C2953J92231l3016d5203
16123C17154B5964c593k73477e096A54094a34184e998j31468o590b6063A09122
16111d4905G7794k439j7377a54061K8310I0506K1029c0126j87182n492J0780B36958
16098H2107g687B72893j20614j6876J57059a91228l56895C9435i656A87499b75961
16086C39847B3344d4305A83784a84206B99203j01947e4721A03287a99080C72161
16075i3481F5525k2537p569b55542q0865J14852C03937j51641d9648m19616i8424
16063A18232m135g6711j61991f2254k2589j099j68069A5848J39583b51171a6869
$$ y = [206403, 11543, 137339, -261470, 246396, -136579, -23681, 199888, 79184, -66737, 152645, 222055, 247834, -26471, 45941, 107566, 18384, -86262, 630, -57588, 32953, 225184, 192168, -45203, 317154, 25964, -3593, -277070, -5096, 154094, -134184, -5998, -137466, -144056, -26063, 109122, -44905, 77794, 75355, 57978, -154061, -125751, 90506, 111535, -30126, -217308, -222800, -212020, 236958, 82107, -7687, 272893, 152279, 135403, 292462, -191228, -548123, 39435, -9656, 187499, -275961, 339847, 23344, -44305, 183784, -184206, 299203, 197256, -54721, 103287, -199080, 372161, -93481, 65525, 42988, 35419, -255542, -336407, -221555, 303937, 152296, -49648, -469264, -98424, 118232, 114097, -76711, -238702, -62254, -84843, -85942, -254011, 15848, 155431, -251171, -16869]
16051A94201n0575L9632J14093a19330p1285a3689H726b45596a12242B03828a85093
16039a25175B6207R9913D7224M0904K11834I0812a52183N4006b7586C9278a2831
16027a31936B91993a01514l02959H4850Q1669b05155A87350a30555N3607r661
16017h6609A91677A1010J89698k8266q5088c46095A77121B8649e4690C3407h8540
16005a58986g177j72778n0059C9964K8851Q1568h3982B66464c4118j14636A74703
15993A73382F7000l738A9212J47987n72h3801m580C15041a88723A71164c64368
15981f1217I8112m4005N771c53349f7959A69297o2271a97954B74106J20684a12414
15969b01479e5531a0616k25064a11288G8379J3843a35003A67497O3897a04914
$$ y = [194201, 143626, 183258, 297351, -119330, -190615, -13689, 8726, -245596, -112242, 203828, -185093, -125175, 26207, 126120, 47224, 88128, 299962, 90812, -152183, -98177, -27586, 39278, -12831, -131936, 291993, -101514, -404473, 84850, 166519, -205155, 187350, -130555, -76948, -86609, 191677, 11010, 200708, 172442, 87354, -346095, 177121, 28649, -54690, 33407, -88540, -158986, -7177, -179955, -230014, 39964, 68815, 150383, -83982, 266464, -34118, -148754, 174703, 173382, 67000, 63262, 19212, 167199, 166627, -83801, -88381, 315041, -188723, 171164, -364368, -61217, 98112, 54107, 59878, -353349, -67959, 169297, 107026, -197954, 274106, 394790, -112414, -201479, -55531, -10616, -235680, -111288, 78379, 92222, -135003, 167497, 231394, -104914]
15958a46937A07846m7976i718A22235b09295C07363F5418N3565J95609b92841
15947A0117g3799A00215a18637B91766b8944B0452J35138a32813N110d2765p066
15936d9831k3019L0002j70093P8558k07765a5739j71704p575B49763b27708c4075
15924A59480h7152j36484m3526i3871A41754C1940b97644G5171L4447m3023J09331
15913A75926a68410l14372D4708H160b26173F2215c61136d9626J1672A34977a17204
15901A32918B6886M92192A3506h2002j05018A20979i513B82686j03059a99645
15890i6479M4033A60153f85k0850D5435b53606f9525B8397K24325b74838B48754
15878C17205G0143a492j67451j4351J4414g1977I413g8781o5465l4976F6192a24377
$$ y = [-146937, 107846, 59870, -9718, 122235, -209295, 307363, 65418, 118983, 314592, -292841, 10117, -73799, 100215, -118637, 291766, -28944, 20452, 155590, -132813, -127703, -42765, -49831, -72850, -42848, -212941, -134383, -342148, -15739, -187443, -195018, 249763, -227708, -34075, 159480, -87152, -223636, -267162, -93871, 141754, 31940, -297644, 75171, 109618, 66595, 175926, -168410, -482782, 44708, 8160, -226173, 62215, -361136, -49626, -37954, 134977, -117204, 132918, 26886, 519078, 13506, -82002, -187020, 120979, -9513, 282686, 179627, -199645, -96479, -52446, 160153, -685, -21535, 45435, -253606, -69525, 28397, 252722, -274838, 248754, 317205, 70143, -1492, -168943, -183294, -168880, -71977, 9413, -78781, -144246, -179222, 66192, -124377]
15865a5k9420j40856q6830g4939A02968a62074B94877b19721o2971O7861f0771
15853F8891c09897a37349m031G283a67617m0938e0006j60296d8157A78295b6244
15841a49638g4192C9337Q5279K05369a65013j9775g2628F5968a7602k1176F4448
15829c6330H8144a86243j69993J57367A38998e9877G4597N2849g3295J4753j92428
15818b50970B2368b43921N6165l9850q2346A24867K1186d08428A76812d7357L529
15807d3828D0201K73081A35840c20471J31854E720g7936A08505J73823a0823A23010
15795b28840c0475k21328K3113n3000Q5243a0651l19063a2507k23035q9874g7629
15783b32692B57745C7131e5657r6175N7191m3956F8164a9793m8809M373B10203
$$ y = [-15, -29435, -170291, -257121, -74939, 102968, -162074, 294877, -219721, -282692, -214831, -60771, 68891, -309897, -137349, -141380, 7283, -167617, -208555, -50006, -210302, -48157, 178295, -26244, -149638, -74192, 39337, 124616, 329985, -165013, -184788, -72628, 65968, -17602, -38778, 64448, -36330, 88144, -186243, -356236, -198869, 138998, -59877, 74597, 127446, -73295, -58542, -250970, 22368, -243921, -187756, -227606, -309952, 124867, 146053, -408428, 176812, -47357, -43828, 40201, 313282, 135840, -320471, -188617, 5720, -77936, 108505, 282328, -10823, 123010, -228840, -30475, -251803, -228690, -281690, -196447, -10651, -329714, -12507, -235542, -325416, -77629, -232692, 257745, 37131, -55657, -151832, -94641, -138597, 68164, -19793, -68602, -64229, 210203]
15771a37163A5863e3047j37269A73154I292P511c87415L4609J62498j68295e7867
15759h985C50767A24934A3844i9338C29765g3222j85784A7109h1586A52381d5846
15747B36514f593j50087b7861B57667a45878L295c2499A69252E3981O9530K1004
15736A44515B6577P9014m8341c70910J64547C21757c51083B06576b32103A54957
15725a31261L1675B00374a18321N7924A40701b1634A39914i7176B65365e7349
15714C03444b08599A50080A4911K3498L4620f627j81846P0612k77668g6123j78513
15703b54636G8766a16274p9539J6271A9992g3005j5885k59790A86691B6753O7945
15692I4698J61012a02411J9037p6940F9580a1182A72383a49739B13798P4174j23939
$$ y = [-137163, 15863, -53047, -190316, 173154, 9292, 16803, -387415, -352806, -190308, -358603, -57867, -8985, 350767, 124934, 13844, -99338, 329765, -73222, -259006, 17109, -81586, 152381, -45846, 236514, -6593, -156680, -27861, 257667, -145878, -142583, -32499, 169252, 53981, 123511, 144515, 26577, 105591, 57250, -370910, -206363, 321757, -351083, 206576, -232103, 154957, -131261, -99586, 200374, -118321, -60397, 140701, -21634, 139914, -97176, 265365, -57349, 303444, -208599, 150080, 14911, 38409, 73029, -6627, -188473, -117861, -395529, -76123, -254636, 78766, -116274, -195813, -179542, 19992, -73005, -88890, -348680, 186691, 26753, 94698, 255710, -102411, -83374, -160314, 69580, -11182, 172383, -149739, 213798, 287972, 164033]
15681A64033a18509A8b27271j58026C22373j58389m3773b02167e9966B50273b12160
15669A56508K036o0381b06018h2809j7657A10643b8839o1005A27717f5062k30505
15658b95567A8996a8646A7923d21257E4104A2342K89630d0838j05383j3228P7509
15647h1940C9957b99991B37083a59067O2392A74529g6892H4450Q2288l687g5478
15635b5974l62882h3959q5349L1619C9891J46097K94509f3340A83303J6640o8542
15624A31401K0708c09521h8072n5920A59562e8299k16508A5287L6714N9214a34185
15612C0998b34756D90346A91326a5544A12721a83635k46618a67105N7327A66650
15601e1338A64447a40981j8362d3900A37644B4179a47512G0608c6926j59814B30999
$$ y = [164033, -118509, 18, -227271, -385297, 322373, 163984, 120211, -202167, -59966, 250273, -212160, 156508, 158544, 98163, -206018, -82809, -100466, 110643, -28839, -89844, 127717, -65062, -295567, 18996, -18646, 17923, -421257, 54104, 12342, 301972, -40838, -146221, -159449, -81940, 39957, -299991, 237083, -159067, -96675, 174529, -76892, 84450, 166738, 163051, -75478, -25974, -388856, -83959, -169308, -137689, 39891, 185988, 480497, -63340, 183303, 199943, 131401, 152109, -309521, -88072, -143992, 159562, -58299, -274807, 15287, 52001, 111215, -134185, 30998, -234756, 490346, 191326, -15544, 112721, -183635, -430253, -167105, -109778, 166650, -51338, 164447, -140981, -159343, -43900, 137644, 24179, -147512, 70608, -36926, -196740, 230999]
15589b16807e4519B88983g3588I1065i1721A1746d8735j61362B14527b51281A01757
15577b78585R6420N0425d8839k13464Q0359k76l1458N1631A2224a68023C48844
15565C1641b12408j1481O0216k46826h5753q2969d8819j03517D1999a08103i155
15553a50620l3496B1889b59333B1888Q9879b78854C1585H899b95770B83871b7353
15541b9292B99640F0047f6916k24531k7843i2098A11169b4306B09314b33385R8292
15530a35093k59335J63356f0816q9505j35030A1818R9591d54124h4724o0007A81918
15518C8937a15938A2910C718a474q171j05269B73596a00690j39903J877A03621
15506A66506g5502E2059A0483a4470n49593A70221J50580D852h8300D3964L4240
$$ y = [-216807, -54519, 288983, -73588, 91065, -91721, 11746, -48735, -210097, 214527, -251281, 101757, -278585, -182165, -131740, -48839, -262303, -181944, -182220, -213678, -162047, 12224, -168023, 348844, 31641, -212408, -223889, -163673, -410499, -85753, -168722, -48819, -152336, 41999, -108103, -9155, -150620, -184116, 21889, -259333, 21888, 111767, -278854, 31585, 8899, -295770, 283871, -27353, -29292, 299640, 60047, -66916, -291447, -319290, -92098, 111169, -24306, 209314, -233385, -135093, -394428, -231072, -60816, -150321, -285351, 11818, 111409, -454124, -84724, -144731, 181918, 38937, -115938, 12910, 3718, -1474, -9645, -114914, 273596, -100690, -240593, -238716, 103621, 166506, -75502, 52059, 10483, -14470, -564063, 170221, 320801, 4852, -88300, 43964, 78204]
15495G8204j7119a01974A30845A7235a06079L2468C5290a48532a5745j44665A35100
15483c6804k65235A12847D3150J71136F2943G325p05c05602Q6861O3369J0711
15472a44661A64393C8248L2694K24625p4678J52925a81748I922K12427E0011J34909
15461A84920K73702e8237j12082B6854J39710b53019B84328G1024J97292p6845
15451A91471G5589A0391e3240A62671M5826i8080A00156G928c6838F0862J44282
15440B05144J67841j73021c5624n5746J0522F2628g5622j06776M7736j51168a37939
15428D5977h2791C5645K03954j13639e0385k77404Q4764h1784A22586q430d4120
15416A71691a44343J8310j13966D59145b06374F903f5258j06085C432a75690B98376
$$ y = [78204, 61085, -101974, 130845, 17235, -106079, -73611, 35290, -148532, -15745, -160410, 135100, -36804, -302039, 112847, 43150, 214286, 62943, 7325, 6620, -305602, -218741, -155372, -144661, 164393, 38248, 70942, 295567, 220889, 373814, -181748, 9922, 222349, 50011, 184920, 458622, -58237, -170319, 26854, 166564, -253019, 284328, 71024, 268316, 191471, 75589, 10391, -53240, 162671, 208497, -98080, 100156, 7928, -36838, 60862, 205144, 372985, 199964, -35624, -91370, -80848, 62628, -75622, -182398, -134662, -285830, -137939, 45977, -82791, 35645, 239599, 125960, -50385, -327789, -243025, -81784, 122586, 114156, -44120, 171691, -144343, -126033, -239999, 459145, -206374, 6903, -65258, -171343, 3432, -175690, 298376]
15404c8846A58490a26046D88351a62337e1574j13917M5750G6267k693b9746n4197
15393h3943k34281B7741J43053b7947h861B0189J43099E0051a75347j66091A64295
15381A82497Q8063J0390c22711J39940C00341k4491A02027a12707E3267a17239
15370B13905a35222A33636k3492k8989a34117B45832d8495j62794B66924I0495
15359A20099D6324G615J53014L8453f2673A79812g3373J9071A54492k6929E6953
15347c16403D3989B0699L5174a53874P2812q8662N3886A75997a61646r5378b0753
15335I8596J82392f0173j63611j1448J06495F1851L043j6766L4862M4049a3378
15323A04932Q0248b02243A2778J493J1563L11999A26781M0214p1883a7566h088
$$ y = [-38846, 158490, -126046, 488351, -162337, -51574, -165491, -119741, 76267, 73574, -29746, -83943, -318224, 27741, 170794, -27947, -8861, 20189, 163288, 50051, -175347, -341438, 164295, 182497, 270560, 280950, -322711, -182771, 300341, 275850, 102027, -112707, 53267, -117239, 213905, -135222, 133636, 110144, 81155, -134117, 245832, -48495, -211289, 266924, 90495, 120099, 46324, 7615, 160629, 199082, -62673, 179812, -73373, -54302, 154492, 127563, 56953, -316403, 43989, 20699, 55873, -153874, -81062, -169724, -115838, 175997, -161646, -257024, -20753, 98596, 280988, -60173, -223784, -235232, -128737, 61851, 64894, 48128, 82990, 127039, -13378, 104932, 185180, -202243, 12778, 14271, 25834, 337833, 126781, 166995, 95112, -17566, -8088]
15311A65236E3572J22879H5908h1036B5618a76420G8527J9056N847J04853b62535
15299a61081j77302c2705A27374a1798d111k19843i1789A20942g3786o5125A0342
15287b29790c0878B2031a7873C50147h120B61171B3368K81430a84599B53111A24280
15275a70774O5987A28301K50179j42545d0973C55083A73270q1575m3932M39893
15265D87656k28955I3364a7437j00775B61686n1572b667B75162I6115K63682A36015
15253H1267A1482a184l3486C67201D4091j6726b57162C46142h1939F03236H2514
15241A11333k0651e5936A39393J08076P9148p4030m1365i8868A18534J31299E2618
15229B56949D9922J15442a2882f152B31109a28797B46682K83517h0249c0723k26532
$$ y = [165236, 53572, 176451, 85908, -81036, 25618, -176420, 78527, 97583, 103430, 208283, -262535, -161081, -338383, -32705, 127374, -11798, -4111, -223954, -91789, 120942, -73786, -138911, 10342, -229790, -30878, 22031, -17873, 350147, -8120, 261171, 23368, 304798, -184599, 253111, 124280, -170774, -104787, 128301, 378480, 235935, -40973, 355083, 173270, 91695, 47763, 487656, 258701, 93364, -17437, -118212, 261686, 210114, -2667, 275162, 96115, 359797, 136015, 81267, 11482, -1184, -34670, 367201, 44091, 27365, -257162, 346142, -81939, 603236, 82514, 111333, 90682, -55936, 139393, 247469, 326617, 252587, 211222, -98868, 118534, 249833, 52618, 256949, 49922, 165364, -12882, -6152, 231109, -128797, 246682, 530199, -80249, -30723, -257255]
15218b57255j74804A71897J47606e0622G0952g5527C55541g1591B68973c0789
15207C96674a23055j5228B28159e8079p0364B32839b30142B63533a96762A82802
15196A88670H1333K46529a69955C33515J82387A41023J09564a66264F0259c5134
15185B63621b0157C54107h3248C17460A30829a1337B7908K36886r6941b36709
15174a4715A4786M4115J59952a10605A56909a12106B88969E2654a08033B97232
15163B42232o8603G2061L25498n3498p9028B8229c35216a48768A62665g4856I8400
15151a25284A27178l0693D993J8665J30622p3651O1787B9349L41235A02874L04985
15140D07859A1694a2720m682A09207J97446D1321j7824K5594A2159K80595i6349
$$ y = [-257255, -432059, 171897, 319503, -50622, 70952, -75527, 355541, -71591, 268973, -30789, 396674, -123055, -138283, 228159, -58079, -128443, 232839, -230142, 263533, -196762, 182802, 188670, 81333, 327862, -169955, 333515, 515902, 141023, 250587, -166264, 60259, -35134, 263621, -20157, 354107, -83248, 317460, 130829, -11337, 27908, 264794, 167853, -236709, -14715, 14786, 58901, 218853, -110605, 156909, -112106, 288969, 52654, -108033, 297232, 242232, 173629, 72061, 397559, 344061, 265033, 28229, -335216, -148768, 162665, -74856, 98400, -125284, 127178, 96485, 4993, 23658, 154280, 80629, 142416, 29349, 370584, 102874, 407859, 11694, -12720, -17402, 109207, 306653, 41321, 23497, 49091, 12159, 292754, -96349]
15128B38103D8812K27540b35426a03100D1543Q9350R3686L5298j9419n0408C8648
15116A65571n3615J60149C5936a13066A50886b2239C53592b71503D03665b18591
15105a20518B06298B9320K24127A11739a21864B39020A04275J34285j7956N6981
15095B77585m6450J35800l0090q7807A12093B3408K70094j34305g0035C02689
15084f6547n0071l752c0635a0209d12A39416D3468K12355r6309J25347B8392N0404
15072G8796R9437k3365b7708B72420J12706A07899M1323K48843A71586J11094
15062B82680F7874f404B10466a03669d28C88931A90474q6011K11286F6020J06942
15051A72962L6955n5056A7103M11295j92320J05246C5186J26190b039C37859O6999
$$ y = [238103, 48812, 276352, -235426, -103100, 41543, 130893, 224579, 259877, 240458, 190050, 38648, 165571, 111956, 272105, 35936, -113066, 150886, -22239, 353592, -271503, 403665, -218591, -120518, 206298, 29320, 253447, 111739, -121864, 239020, 104275, 238560, 220604, 277585, 231135, 366935, 336845, 249038, 112093, 23408, 293502, 159197, -70035, 302689, -66547, -116618, -120370, -30635, -10209, -412, 139416, 43468, 255823, 159514, 284861, 28392, 78796, 178233, 154868, -27708, 272420, 385126, 107899, 149222, 398065, 171586, 282680, 67874, -6404, 210466, -103669, -428, 388931, 190474, 104463, 315749, 66020, 172962, 209917, 154861, 17103, 428398, 236078, 341324, 35186, 161376, -2039, 337859, 404858]
15040D04858j52100G5156b3899F2363f2196B87033C2560J59423g3984A05942a59436
15028i2758D48444g494A5453O0324N6929M75163B48405a10093C37119l2080p7409
15017B27630C3906K65260K4474J35493B09001e6153A29472c9850C15484a00936
15006A46311L2308b4774A66428n5419J37460a4171B27898A00011K16696j18884
14996A97823N3235i5727F2351L7539J35341A7577M15084K9454k0074a5325D00100
14984a56931b9786B14705d9955j42523C44763j13675K21173m1925A57005J2887
14974A69892K56923g5018F1961K47287D7628R3994m0114j6941J87914I6340K41966
14963C38306L00039B18722b4961J0379E0789A3830N41364k16895J49486B16993
$$ y = [404858, 252758, 75156, -23899, 62363, -62196, 287033, 32560, 191983, -73984, 105942, -159436, -92758, 448444, -7494, 15453, 75777, 132706, 607869, 248405, -110093, 337119, 305039, 227630, 33906, 299166, 323640, 459133, 209001, -56153, 129472, -39850, 315484, -100936, 146311, 178619, -24774, 166428, 111009, 248469, -14171, 227898, 100011, 316707, 197823, 251058, -95727, 62351, 99890, 235231, 17577, 432661, 462115, 442041, -15325, 400100, -156931, -29786, 214705, -49955, -192478, 344763, 231088, 452261, 410336, 157005, 169892, 426815, -75018, 61961, 309248, 47628, 141622, 101508, 84567, 272481, 96340, 338306, 638345, 218722, -24961, -14582, 50789, 13830, 555194, 338299, 487785, 216993]
14952a27559C48044A40664N56069G9128L30067h9059C54155Q1879j28118K06815
14942E14731A92942K45930e0375B78858j12368E5516M25698j51962Q0283j62742
14932B46793e5638B30471L18525J00907A51243D4899L17839L31596k39685o1729
14922C92920A94661K08181A22272a31749D43388j12299I9853R1598J78177j29464
14912B40164K19959B18738G2767O8562K06806j826M960j04204J46224A11177E0536
14900B90729E5212J99807K48248q6883q5972j14643j2471k6260J8964O5698K09468
14889D71168J48138j00671A93146L76257j90415J67355k71261J7072K57213j52804
14879C96563P589j10210L09275A94305N2018K78205j53010J03750k077j24339
$$ y = [-127559, 348044, 140664, 696733, 79128, 409195, -89059, 354155, 436034, 307916, 514731, 192942, 438872, -50375, 278858, 166490, 55516, 481214, 329252, 409535, 246793, -55638, 230471, 548996, 649903, 151243, 44899, 362738, 694334, 454649, 392920, 194661, 402842, 122272, -131749, 443388, 331089, 99853, 191451, 369628, 240164, 460123, 218738, 72767, 141329, 348135, 346309, 351269, 247065, 393289, 111177, 50536, 290729, 55212, 255019, 503267, 416384, 330412, 215769, 203298, 177038, 196002, 261700, 471168, 619306, 518635, 193146, 569403, 378988, 546343, 275082, 292154, 549367, 396563, 404152, 293942, 603217, 194305, 246323, 524528, 371518, 475268, 473191, 348852]
14869C48852M44492j95448j28026A49516K75976o986J55632r9973j29424R1270
14859D36011q3817j10871J10632J77661o2118j62723M0326J59877M7506Q1086
14849F33570B64538L39892j18180K504A62193O59217C83920K26886j10736k44357
14839B55713M53052B01114K12620K08706k08507O5793k27795O4018K45867A95721
14828F65916l04681E1814L71624J33419k03473M43850C59076L56012k00155j025
14818E13908B56620Q5695L72608k5407j66268M9661k37809J53749K51335k23143
14808E17041N0452P906J1529j23874K61857P278j97395q0988K91946l36818j77227
14797B31707M36944m5584k19114G9973O75644P1804j53175K434k1015J23923A65140
$$ y = [348852, 793344, 597896, 469870, 149516, 425492, 418506, 574138, 474165, 344741, 436011, 352194, 241323, 351955, 529616, 467498, 304775, 345101, 504978, 552484, 633570, 264538, 604430, 486250, 488754, 162193, 821410, 383920, 610806, 500070, 255713, 708765, 201114, 413734, 622440, 413933, 479726, 251931, 315949, 561816, 195721, 665916, 361235, 51814, 423438, 556857, 353384, 797234, 359076, 715088, 514933, 513908, 256620, 342315, 714923, 689516, 523248, 572909, 335100, 488849, 740184, 517041, 567493, 575399, 586928, 463054, 724911, 732189, 534794, 453806, 745752, 408934, 231707, 668651, 623067, 403953, 79973, 755617, 827421, 674246, 676680, 655665, 779588, 165140]
14785I20047C78989L23296j48109K01629n9686j82301m1995K11815p5918J64639
14775G72359k08513J906l5077K42785l2769J8965k03777l4045K52803j75295Q9461
14764F88803k74986L41196l69964O51923J1259k99669l60898K28478j40334L40459
14754H16267k02994L89983D98492L33614j60153O7278k4321M5171l57664M13743
14744H16160q2875l53862L13408j8166J920k87306J11961K8825K26199k36936
14734E19328P2979N42247k88805l62641M74245k39662N7794j66378L26477k48429
14724F87155K38176Q8870j28740J2816n694j97088Q2221j31331K55968k94055
14714F08298N3353K5239N608K62535k54917J63288j06538m9510N89803n03696
$$ y = [920047, 378989, 702285, 554176, 755805, 696119, 513818, 471823, 683638, 607720, 772359, 563846, 565752, 530675, 773460, 740691, 759656, 555879, 521834, 774637, 599342, 688803, 413817, 755013, 385049, 1036972, 1048231, 748562, 387664, 616142, 475808, 816267, 613273, 1003256, 498492, 832106, 671953, 739231, 714910, 760081, 402417, 816160, 733285, 379423, 692831, 674665, 676585, 389279, 501240, 530065, 756264, 519328, 592307, 1134554, 845749, 483108, 957353, 717691, 775485, 609107, 935584, 687155, 925331, 1014201, 885461, 898277, 892583, 695495, 777716, 646385, 902353, 608298, 661651, 686890, 692498, 955033, 700116, 863404, 756866, 707356, 1297159, 793463]
14704G93463J10613m2656k48342j93538J55316L39574k64726J71403P3125l97042
14694D97190L61806n0723K5175k51753L31183O7197O1204p8115j34891L77052
14684A205325E28952M82963K3693k49318K37136O5711l8179m29612J58868L87489
14674A167703l15045j32038J18683K63492m69992K13046K65264j42286K39274
14665A208101j75640J88667k00570Q2211k8450p4096j54292M75035j11746k31482
14655I77738k13827O3359K32879K58439j43479j24449k1624P8774j5547J85221
14645A277484j87710K17367L294n3105J95644j85502j31548R3877n4087L36927
14635A512641k15831L5350j53782N944J91208l61216L31012j22844J84060K01287
$$ y = [793463, 904076, 861420, 613078, 419540, 574856, 914430, 649704, 821107, 894232, 497190, 858996, 808273, 833448, 581695, 912878, 980075, 1041279, 963164, 828273, 1205325, 528952, 1011915, 1035608, 786290, 1023426, 1089137, 1050958, 621346, 780214, 1167703, 852658, 720620, 839303, 1102795, 632803, 845849, 1111113, 968827, 1208101, 1032461, 1221128, 1020558, 1102769, 1074319, 1000223, 845931, 1320966, 1209220, 977738, 763911, 827270, 1060149, 1318588, 1175109, 1050660, 1029036, 1107810, 1092263, 1277484, 1089774, 1307141, 1310435, 1257330, 1452974, 1267472, 1135924, 1229801, 1175714, 1512641, 1296810, 1332160, 1178378, 1184322, 1375530, 1014314, 1345326, 1222482, 1406542, 1607829]
14625A607829j87992R8054p4920J24251J95729m84539K65403o6206J72126j11376
14615A538359j42620J57203L6525J0249Q959l05147K42625K8418J90362m048j95907
14604A564978j21932K50299j13589K17744J27434l86046J52590k5925J15019q6402
14594A694170K07944K18830l75385L98309j17558J69610K0963K43801j22054q0397
14584B258233K29687J2952j54144N12961q0539k39721K17400P9962J05205J15716
14574C057712j21100M8031N0613K18376K41188o18135P19186j77212M15757l3269
14564C801147k00985M10507J25118q0566R7307j26180J06264L50526p949J65000
14554D640189L18984o4938j1102P4691k15082L96810j20091q9550j96370J4464
$$ y = [1607829, 1419837, 1517891, 1442971, 1567222, 1762951, 1278412, 1543815, 1477609, 1649735, 1538359, 1395739, 1552942, 1589467, 1599716, 1608675, 1303528, 1546153, 1574571, 1764933, 1760885, 1564978, 1443046, 1693345, 1579756, 1797500, 1924934, 1538888, 1691478, 1665553, 1780572, 1694170, 1902114, 2120944, 1745559, 2143868, 2026310, 2195920, 2216883, 2460684, 2338630, 2258233, 2487920, 2500872, 2346728, 2859689, 2779150, 2539429, 2756829, 2836791, 2941996, 3057712, 2936612, 2984643, 3035256, 3253632, 3494820, 2876685, 3595871, 3418659, 3834416, 3801147, 3600162, 4010669, 4135787, 4055221, 4152528, 4026348, 4132612, 4483138, 4475189, 4640189, 4959173, 4894235, 4883133, 4957824, 4742742, 5139552, 5019461, 4929911, 4733541, 4748005]
14544D748005L41987l09297M70194j57510J57796j49591n88679N45300k76909
14535D781296j05661K7145J62809j66067M69847p11303J73067J61096O23l98397
14525D394455K62717l11248M4295j5489m5720j97145o6055J69011q19960J39806
14515C554667k04541L26750k24790k1177l0996M41372k24547n86142L43215k07883
14505C165928K1819J65386o3734m2952K19316k05515m8666o3988N25630j12598
14495C560626N3773n2801j7273K0273J31797m20558K49086j46364M43093m6573
14485C775079n2049o9654j2956J82554o7026R8926Q2092J40372n7793j78260Q568
14474C849853R3351K0662O46612n67077M33497n82617O04622j94748M61650k40934
$$ y = [4748005, 5089992, 4780695, 5250889, 5093379, 5251175, 5101584, 4512905, 5058205, 4781296, 4675635, 4702780, 4865589, 4699522, 5169369, 4458066, 4631133, 4792229, 4792852, 4394455, 4657172, 4345924, 4390219, 4374730, 4329010, 4131865, 4065810, 4234821, 3414861, 3554667, 3350126, 3676876, 3452086, 3430909, 3399913, 3841285, 3616738, 3030596, 3373811, 3165928, 3187747, 3353133, 3289399, 3246447, 3465763, 3260248, 3211582, 3147594, 3673224, 3560626, 3614399, 3561598, 3544325, 3564598, 3696395, 3275837, 3524923, 3378559, 3821652, 3775079, 3723030, 3653376, 3640420, 3822974, 3755948, 3854874, 3936966, 4077338, 4019545, 3841285, 3849853, 3943204, 3963866, 4610478, 4043401, 4476898, 3894281, 4498903, 4304155, 4765805, 4524871]
14464D524871K48103k40935L14422l39710J9999R10593k33937j10736k01791K12866
14454E103745j42487j64180M31515j4031j52572J25398O07235k95284L3685K91986
14444E825010K9582j30386L01154k38788M27394j31642j41625J75871L18220J43239
14434F578029q4053O4949K11815M8795J29292j95426M32075k57944M05311J54045
14424G486888J04110k02085M56432j01087K31687K46843P5684M5090j75993K17079
14414H384648K37546N53800N266j14072J15849N67996L12537J20362n3400n8585
14404A0071947P38600k12073M47065J63684M0796N01968J37034K40596l8635L62587
14394A2453569O25960l9416L30132L21258L25914M51055K3921N41728M07666L08791
$$ y = [4524871, 4772974, 4532039, 4846461, 4506751, 4526750, 5437343, 5203406, 5092670, 4890879, 5103745, 4961258, 4797078, 5228593, 5214562, 5061990, 5187388, 5794623, 5499339, 5533024, 5825010, 5854592, 5724206, 6025360, 5786572, 6213966, 6082324, 5940699, 6116570, 6434790, 6578029, 6493976, 6558925, 6770740, 6819535, 6948827, 6753401, 7185476, 6927532, 7332843, 7486888, 7590998, 7388913, 7845345, 7744258, 7975945, 8222788, 8298472, 8343562, 8167569, 8384648, 8622194, 9175994, 9181260, 9067188, 9183037, 9751033, 10063570, 10183932, 10130532, 10071947, 10810547, 10598474, 11045539, 11209223, 11250019, 11751987, 11889021, 12129617, 12090982, 12453569, 13079529, 13040113, 13370245, 13691503, 14017417, 14468472, 14492393, 15034121, 15441787, 15750578]
14384A5750578O14007M7092N43877M05330L32687K82396P80555L47596O72571
14375A9776689L87235N74540N00774P76286J92937O61302P97259N17587Q55484
14366B5040093N34920P70767P85591J314021M17793Q27491O33245P48928J043041
14357C2115890R51497J407810O66288J264922J025361R97478J167375J356266
14349D0952887J784185J458264R47053J440665J537154J607523J582455J541654
14341E2851840J950925J661515J889425J503028J668036K588101K092772K049873
14333F8255515J982745K219539K497622K769000K615587K872785K549398L336025
14325H9098216L348638L046122L584500L925928L966688M647858M273337M461015
$$ y = [15750578, 16364585, 16411677, 16955554, 17360884, 17693571, 17975967, 18756522, 19104118, 19776689, 20163924, 20738464, 21239238, 22015524, 22208461, 22869763, 23667022, 24184609, 25040093, 25575013, 26345780, 27131371, 28445392, 28863185, 29690676, 30323921, 31072849, 32115890, 33067387, 34475197, 35141485, 36406407, 37431768, 38429246, 39596621, 40952887, 42737072, 44195336, 45142389, 46583054, 48120208, 49727731, 51310186, 52851840, 54802765, 56464280, 58353705, 59856733, 61524769, 64112870, 66205642, 68255515, 70238260, 72457799, 74955421, 77724421, 80340008, 83212793, 85762191, 89098216, 92446854, 95492976, 99077476, 103003404, 106970092, 111617950, 115891287, 120352302]
14317A20352302N149396N510795M992385M354770L620158M290433M424424M525378
14309A57220041M349368N334027M355704M890279M473230N077581M325775L983201
14301A94009206K745734L046541K770717K340214K682237M290646M900475L203245
14293B19989015L258652K190974L711839N032049J24630J822619j504445j592608
14285B33032725J517140L463657L283819K501059M443010O312876O389324P445256
14277B68388866K380555q116002n047570j098674k081526j204406m07061L050187
14269B55864369L896186J815533P5957M69818n63952k530941j396333n150655
14261B52479982n166320k901436M00731j266694j04838p38953j093725J003591
$$ y = [120352302, 125501698, 131012493, 136004878, 140359648, 143979806, 148270239, 152694663, 157220041, 161569409, 166903436, 171259140, 176149419, 180622649, 185700230, 190026005, 194009206, 196754940, 199801481, 202572198, 204912412, 207594649, 211885295, 216785770, 219989015, 223247667, 225438641, 229150480, 234182529, 234307159, 236129778, 234625333, 233032725, 234549865, 238013522, 241297341, 243798400, 248241410, 254554286, 260943610, 268388866, 270769421, 262653419, 257605849, 256507175, 254425649, 253221243, 252814182, 255864369, 259760555, 261576088, 261652045, 262121863, 261557911, 259026970, 257630637, 252479982, 247313662, 244412226, 244812957, 243546263, 243441425, 242702472, 241608747, 242612338]
14253B42612338Q14511M92083J682662j91291k95146k323157l459337k186234
14245B37146429l723767k679273l859295l664222l305275n794354n126040n401870
14237B03592333o021079o383943o349064n779870o592141o537988n108236m538615
14229A56281397n181482n326498m646875m890497m308741m481064l667627l486005
14221A20292608k831936k353646k443343k957132j288409k027699p700821q277999
14213I0411623o648693n556313m440258l831487l574479l185278k541008k739536
14205E7894571k486928k085007j938569k112108j633156k067808j879743j191764
14197D2499488j089646j256200j261985j380990j247324j358429p52756r79088
$$ y = [242612338, 243426849, 243918932, 245601594, 245410303, 245115157, 242792000, 239332663, 237146429, 233422662, 230743389, 226884094, 223219872, 219914597, 214120243, 208994203, 203592333, 197571254, 191187311, 184838247, 179058377, 172466236, 165928248, 160820012, 156281397, 151099915, 145773417, 141126542, 136236045, 131927304, 127446240, 123778613, 120292608, 117460672, 115107026, 112663683, 109706551, 108418142, 106390443, 98689622, 90411623, 83762930, 78206617, 73766359, 69934872, 66360393, 63175115, 60634107, 57894571, 55407643, 53322636, 51384067, 49271959, 47638803, 45570995, 43691252, 42499488, 41409842, 40153642, 38891657, 37510667, 36263343, 34904914, 34152158, 33173070]
14189C3173070q73609q18448p95974j019295o67973j054449o42894p01603p37580
14180B5861245o62808o48975k23090o29334o45001l37030n47511p53902m40907
14171B0972687n19661m56945m12109o11886k61460q71005Q991k38163l81086O9922
14161A7299285n04094n46284J5118n45208j79808m29991m43974K30556o40370
14152A4255230k17652j08068l98286P727q0165j81099k67254n83052n6205j82085
14142A2189091K38136k45930o06156j7310r5677m7936J5369l90804k69252j79814
14132A0589717r9336K08855n19785K7027k63199j44811j0469k73022N3540m81056
14122I087461m3305J39264Q6313k93042m16627J83254l36049N8701r2949R2154
$$ y = [33173070, 32299461, 31481013, 30685039, 29665744, 28997771, 27943322, 27300428, 26598825, 25861245, 25198437, 24549462, 24326372, 23697038, 23052037, 22715007, 22167496, 21413594, 20972687, 20453026, 19996081, 19583972, 18972086, 18710626, 17839621, 17848612, 17610449, 17229363, 17299285, 16795191, 16248907, 16264025, 15718817, 15539009, 15109018, 14665044, 14895600, 14255230, 14037578, 13929510, 13531224, 13538951, 13458786, 13277687, 13010433, 12427381, 12371176, 12189091, 12427227, 12181297, 11575141, 11557831, 11462154, 11414218, 11429587, 11038783, 10769531, 10589717, 10490381, 10699236, 10179451, 10206478, 9943279, 9798468, 9787999, 9514977, 9568517, 9087461, 9044156, 9183420, 9269733, 8976691, 8560064, 8743318, 8407269, 8465970, 8373021, 8465175]
14112H465175m9370J57575o96534k83580M28130l36319J94281l09727l66978K55666
14102G458319l31830J34439j8324k10271k9378Q0432k32006k11614j00860J1901
14092F550808k58124k01652Q4884q4182k28830j5755R7914J15010k01103k88934
14082E570036J16503n2205k01132n2309J02087J69673n30227j76751N22522n98954
14072D869243K67105k13959O1372J7482j3053j71909l23714K6975l2091N6335
14062D543786l8615j53831J18524j66237J23671l37420N96437m80612m3840P6840
14052D238703l18170j24053L24504k44150J40532r535k09425P7203K21733J36360
14042D233702j5857n10097j44896J77827J85516n0969l30785J42155k40784K31413
$$ y = [8465175, 8415805, 8573380, 7876846, 7593266, 8021396, 7685077, 7879358, 7569631, 7202653, 7458319, 7126489, 7260928, 7242604, 7032333, 7002955, 7083387, 6851381, 6639767, 6538907, 6550808, 6292684, 6091032, 6175916, 6091734, 5862904, 5847149, 5945063, 6060073, 5858970, 5570036, 5686539, 5634334, 5433202, 5380893, 5482980, 5652653, 5122426, 4945675, 5468197, 4869243, 5136348, 4922389, 4983761, 5001243, 4988190, 4816281, 4492567, 4519542, 4487451, 4543786, 4505171, 4351340, 4469864, 4303627, 4427298, 4089878, 4686315, 4205703, 4161863, 4238703, 3920533, 3796480, 4120984, 3876834, 4017366, 4007831, 3798406, 3875609, 4097342, 4233702, 4217845, 3707748, 3562852, 3740679, 3926195, 3875226, 3544441, 3686596, 3445812, 3677225]
14032C677225K13306j37326j22842q5022j60091M15685k27866L62705q4917j18979
14022C731878K68465j20040j63465J70200Q7827l47534L78372j51424K28129j17915
14012C964493l14135J97584J73881J53185j55933L64033j55034P3000J95593J15938
14002D612605l50125R2670P4871M79852o29952N72006J7687L86615n405O8217
13992E319041j01255J60796K71789m52068R0667Q819k09908K80000j72N3491J6927
13981E438127J11029j55317K59649l85895l81865K01836p6791j00587L50978n62367
13971D698797M55705n20289J35771J15543n18063J27885K17316l17736j17561
13962D277368k96134K260l4502p8681k28212k00390k35984L08340j3111o36494
$$ y = [3677225, 3890531, 3753205, 3630363, 3545341, 3385250, 3800935, 3573069, 3935774, 3850857, 3731878, 4000343, 3880303, 3716838, 3887038, 3974865, 3627331, 4005703, 3854279, 4082408, 3964493, 3650358, 3847942, 4021823, 4175008, 4019075, 4383108, 4228074, 4301074, 4496667, 4612605, 4262480, 4355150, 4430021, 4909873, 4279921, 4851927, 4869614, 5256229, 5250824, 5319041, 5217786, 5378582, 5650371, 5198303, 5288970, 5297789, 5087881, 5367881, 5367709, 5421200, 5438127, 5549156, 5393839, 5653488, 5267593, 4885728, 5087564, 5010773, 4910186, 5261164, 4698797, 5154502, 4634213, 4769984, 4885527, 4367464, 4495349, 4712665, 4394929, 4277368, 3981234, 3983494, 3948992, 3870311, 3642099, 3441709, 3205725, 3514065, 3500954, 2864460]
13952B864460P9020J93463m68409R4210K40909n6484n34077j641M53003k45003
13942B619451j50578k57494J05049j42494K6749J9185j79474o9720M64817m24560
13932B010931J05826k20963P2005k58278K5322M6939J13973j91192O1887J6882
13922A783332m07481O04801l39989J63371j87120N23476n94122J20337j44880
13913A521725K73094J28893m33218K16430j55879j15024K64254j78353p0684J55610
13903A606848r4968Q9630k53910J36181j16162K43164l16783K72983l31250J94806
13893A430539o0632R6156j44913p9086o0011p0594K09018J99692j48102O4235
13883A436302m9382O4193M6999k90582K81426j96967J41038j98837J79648r8410
$$ y = [2864460, 2943480, 3136943, 2668534, 2762744, 3003653, 2947169, 2413092, 2411451, 2864454, 2619451, 2468873, 2211379, 2316428, 2173934, 2200683, 2219868, 2040394, 1970674, 2435491, 2010931, 2116757, 1895794, 1967799, 1709521, 1734843, 1781782, 1895755, 1704563, 1766450, 1783332, 1375851, 1980652, 1640663, 1804034, 1616914, 2140390, 1546268, 1666605, 1521725, 1794819, 1923712, 1490494, 1706924, 1551045, 1436021, 1700275, 1521922, 1451238, 1606848, 1511880, 1601510, 1347600, 1483781, 1367619, 1610783, 1294000, 1566983, 1235733, 1430539, 1369907, 1466063, 1321150, 1242064, 1182053, 1111459, 1320477, 1520169, 1372067, 1436302, 1386920, 1451113, 1498112, 1207530, 1488956, 1291989, 1433027, 1234190, 1413838, 1315428]
13873A315428j53496L19732j23879Q2697j97917j56355K69016k80329R3379L81226
13863A549502k61588n9811J18775k80054J56169K23158l85649M08823j6525l09874
13853A142926j09490M52889j30263l87845K84758j79251m2598P0630J38705J9772
13843A260233l5534j15724J75158P315J24667m80123O713J24769j93243K54802
13833A129033j08096q2410L06558j06446k20549K52628J50805l35324M6115m2218
13823I90096n0969l30351K77146j8515R3103k36027O5723J63743m0688j06415
13813H06846L32281k35225p2164K14107j71808k9049Q932K28676p5250l83889
13803F23457J75099j54686K0209j60757L9405j45689N48576k9991k66386J13735
$$ y = [1315428, 1161932, 1481664, 1357785, 1440482, 1242565, 1086210, 1355226, 1074897, 1168276, 1549502, 1287914, 1228103, 1346878, 1066824, 1222993, 1446151, 1060502, 1469325, 1452800, 1142926, 1033436, 1486325, 1356062, 968217, 1252975, 1073724, 1031126, 1101756, 1240461, 1260233, 1224699, 1108975, 1284133, 1291448, 1416115, 935992, 942705, 1067474, 874231, 1129033, 1020937, 938527, 1245085, 1138639, 918090, 1170718, 1321523, 986199, 1032314, 990096, 939127, 608776, 885922, 867407, 960510, 724483, 790206, 953949, 913261, 806846, 1139127, 903902, 831738, 1045845, 874037, 844988, 853920, 1082596, 1007346, 623457, 798556, 643870, 664079, 503322, 542727, 397038, 945614, 915623, 649237, 762972]
13793G62972k45620L42707J59970C28869K02160J87900J58154l6223J37996n9517
13783I19339l91001J35393Q0358k05812J93337J07822j90745M8619L9449L7207
13773G73966m5166l2251j95037L21362j08317k59490J77614j32461N241m5262
13763D60199m6230K02858k73177N90337n0967j61795o5338J44290j91818L03378
13753I11737k55570j11395B50291K95783O044o9593j77558K69073n9704K72997
13743G87333r5189J31655j07154l48786K99672C26244M6177R4276M8372L64053
13733H79122C87295M30389k64075Q6500o3142k16424J77605K39666k91064P6787
13723E63537K36545B17654J19464M60685j76126C07918P966L41792J79003k1586
$$ y = [762972, 517352, 860059, 1020029, 328869, 531029, 718929, 877083, 840860, 978856, 919339, 528338, 663731, 744089, 538277, 731614, 839436, 648691, 697310, 736759, 773966, 728800, 696549, 501512, 822874, 714557, 455067, 632681, 500220, 505461, 460199, 413969, 616827, 343650, 933987, 883020, 721225, 655887, 800177, 608359, 911737, 656167, 544772, 250291, 546074, 552118, 482525, 304967, 574040, 514336, 787333, 692144, 823799, 716645, 367859, 667531, 326244, 372421, 466697, 515069, 879122, 387295, 817684, 553609, 640109, 576967, 360543, 538148, 777814, 486750, 563537, 800082, 217654, 337118, 797803, 621677, 307918, 315884, 657676, 836679, 815093]
13713H15093n5721K67384k67988j97335J32073j09563k1363K42682j90824j02927
13703E11511j80862L44431k7756B88182J81229K13831B53946L45768k2947q9813
13693D86954G8641N18391j3952j5746K23228k17697j56794M02079l05347L00029
13683H12832l5046B15358J17960J80328l0311P3273R5431B51106M65554j99425
13673E17235R5806B81120l1881K11375Q8719j69456J39018A51447Q83211m11269
13663F23389j92199k2667p7020q3451A05690M67890j38829J13054M1846K5047
13653F14698l6104k4696k27225L65911B91602M20232l26660J96726j41520F7483
13642D12971q282j05769m103K41277k22781L16189O2407l00282o6541A61684L27796
$$ y = [815093, 759372, 1026756, 758768, 561433, 693506, 583943, 562580, 805262, 614438, 511511, 330649, 675080, 647324, 288182, 469411, 683242, 253946, 599714, 576767, 486954, 78641, 597032, 583080, 567334, 790562, 572865, 416071, 818150, 512803, 812832, 777786, 215358, 333318, 513646, 483335, 556608, 652039, 251106, 716660, 517235, 613041, 281120, 249239, 460614, 549333, 379877, 518895, 151447, 1034658, 623389, 431190, 408523, 331503, 248052, 105690, 573580, 434751, 547805, 589651, 614698, 578594, 553898, 326673, 692584, 291602, 711834, 385174, 581900, 440380, 67483, 412971, 404689, 298920, 294817, 536094, 313313, 629502, 691909, 391627, 325086, 161684, 489480]
13631D89480B16464L56294j46487l7319P1718j26029L60185k88741p5454j44816
13621A85815J38276j7524K09374B11684L91729k42401K53263j78950j28585m2810
13611B63930J75567Q9710A60314K57849p0041r3299O8958K32597A93148K18410
13601D11558A71432J29918K49318j84816N4498j75832K52463J03280k67985o5920
13591B66356o3180r05G6672K01012E2573M53734r3929F4297N39490B46109M3723
13580B89832M0383A27047M81140k43283J28906Q7113k75178P3192q7149B934L95380
13569C98314m6050K89928j36955M4807j27409P8670j9124K26614l51019j58765
13559A99011K56095E8684M76882j1408a43516G13919A01283P2292k8224M79698
$$ y = [489480, 216464, 572758, 426271, 388952, 460670, 334641, 694826, 406085, 330631, 185815, 324091, 306567, 515941, 211684, 603413, 361012, 614275, 435325, 306740, 263930, 439497, 529207, 160314, 418163, 348122, 254823, 323781, 556378, 193148, 411558, 171432, 301350, 550668, 365852, 420350, 244518, 496981, 600261, 332276, 266356, 203176, 202271, 76672, 277684, 52573, 506307, 412378, 64297, 603787, 246109, 289832, 330215, 127047, 608187, 364904, 493810, 580923, 305745, 378937, 291788, 2934, 398314, 352264, 642192, 505237, 550044, 422635, 501305, 482181, 708795, 357776, 199011, 455106, 58684, 535566, 524158, -143516, 713919, 101283, 173575, 145351, 625049]
13549F25049j31931j34469J91439A5891K38845N6638L00130B75876K7172C8662
13538C44363K89840B47494L75549B70455K54468Q5640A52253J61841a43394C17002
13527E16985B17862n3223J51509J90836k11393l2602L6532j17614N6100P9786
13517C17793Q5779j43813r5759K53951C1009J77081J73351I3043K52185A36146
13506E2395J90416o837K93370k63211N3948J7247R0536M7533k23547l5874L307
13495B19283M4014j06750a90537A01791K66769j22026j7703P4975J23215J11725
13485E38746A19616L0672L14250j93188n5920K57479j16691j18944q7328o6203
13475H3743a42942C18702m5081K25466A99176B2570J95164r7540n2606M8725J10533
$$ y = [625049, 493118, 358649, 550088, 15891, 254736, 311374, 611504, 275876, 303048, 38662, 344363, 634203, 247494, 623043, 270455, 524923, 610563, 152253, 314094, -143394, 317002, 516985, 217862, 164639, 316148, 506984, 295591, 262989, 299521, 181907, 238007, 317793, 403572, 259759, 164000, 417951, 31009, 208090, 381441, 93043, 345228, 136146, 52395, 242811, 235974, 529344, 266133, 320081, 337328, 427864, 475397, 251850, 215976, 219283, 263297, 156547, -190537, 101791, 368560, 246534, 228831, 303806, 427021, 538746, 119616, 150288, 464538, 271350, 215430, 472909, 356218, 237274, 149946, 83743, -142942, 318702, 273621, 499087, 199176, 22570, 217734, 120194, 67588, 116313, 226846]
13464B26846r6476L78861f9128C18460j22761J86879d557A54181N330j2680K66287
13453D13118n6073A61915K7759a3431k00253A09363C5366J73690J72781I0407
13442I4594l2049K12346p593a69571B65574K7345J75689m7867I6820J48575c8382
13430B32709n2328a24974D84408A0166L25463j19853q878R0848J8291j39044a75996
13418F7377K38493P9695O7142c9517I8075J01109J15368j06086K17459L8463q4095
13407C80293o5058Q6581A5757R7678d666D49223G5066J21010C789K06508R319
13396B19616M9270A07321Q2141D5864K00173p812E4579L82963Q3715B22874O8012
13385B90886A09548O503R8757B4777J06811k7774P4506f9076C28556r2011L5548
$$ y = [226846, 130370, 509231, -69128, 318460, 195699, 382578, -4557, 154181, 159511, 146831, 413118, 357045, 161915, 189674, -13431, -213684, 109363, 35366, 209056, 381837, 90407, 94594, 62545, 274891, 267298, -169571, 265574, 292919, 468608, 420741, 96820, 245395, -38382, 232709, 180381, -124974, 484408, 10166, 335629, 215776, 206898, 297746, 316037, 176993, -175996, 67377, 305870, 385565, 452707, -39517, 98075, 199184, 314552, 208466, 425925, 464388, 380293, 315235, 401816, 15757, 113435, -4666, 449223, 75066, 196076, 3789, 210297, 219616, 268886, 107321, 189462, 45864, 246037, 238225, 54579, 437542, 521257, 222874, 290886, 109548, 116051, 214808, 24777, 131588, 103814, 178320, -69076, 328556, 236545, 272093]
13374B72093I2577O4514J65301a32204E24197k59649a54526B37595E6846K33030
13364B89876j36626p716j1511E6355J19299J97181Q2548G0075K50030j48808K5314
13353A96611P8228j7838k5129H1122M5487f508B04006I9220Q7962J54074A56052
13341C39620I3303O4437B6563b29158B05996j0654c5639C90171B6122g856A16971
13329A85924G9597L05719J43340m4926k34070m7596N5605a1985E03108d940B52937
13317E78847a27611G7031a89452F2674K7127L12202A80033M1746p0530C4625L86416
13306D21041I9571J10709p5604E1749J65862M0140j10204J27113K45739A31295
13295b8171B47634k6453M9585J86796A58763J42190K0397A1044Q1671r653J39899
$$ y = [272093, 92577, 157091, 322392, -132204, 524197, 264548, -154526, 237595, 56846, 289876, 153250, 145534, 134023, 56355, 175654, 372835, 455383, 70075, 320105, 171297, 196611, 274839, 257001, 231872, 81122, 126609, -6508, 204006, 99220, 187182, 341256, 156052, 339620, 93303, 157740, 26563, -229158, 205996, 195342, -35639, 390171, 26122, -7856, 116971, 185924, 79597, 385316, 528656, 483730, 249660, 202064, 257669, -11985, 503108, -4940, 252937, 578847, -127611, 77031, -189452, 62674, 89801, 402003, 180033, 221779, 151249, 34625, 421041, 99571, 210280, 134676, 51749, 217611, 257751, 147547, 274660, 520399, 131295, -28171, 247634, 221181, 270766, 457562, 158763, 300953, 321350, 11044, 92715, 83062, 222961]
13284B22961B5614i138B26344l3225l9448J01287J07458A71103J75982A69945
13273F2512a6160m0922B26320q0782Q1403r1973a42810k91863K06936C03117F9790
13261B70489k6762G6398h755I717L03524j9313j27046K10734r3798e249q7577
13250i2826b5800C50715a1487k35596C52994j54656b5932C88273D0991N9482J7424
13239A17897I253R9035d1693A7119a88271b509k5685B33524q6236O2811r8974
13228A11125K09693A36356N5128b27522B95713j8127n3472E1109J69995b60454
13217e2908o0887A23992C6903a01459C67796A20332a53229f966C90977R8275A43625
13205b54812B77131j9476K95083k13788b15301A69604k9260J82094a9425b195
$$ y = [222961, 25614, -9138, 226344, 193119, 153671, 254958, 362416, 171103, 347085, 169945, 62512, -16160, -57082, 226320, 145538, 226941, 134968, -142810, -434673, -227737, 303117, 69790, 270489, 243727, 76398, -8755, 9717, 313241, 293928, 166882, 377616, 283818, -5249, -92826, -25800, 350715, -11487, -247083, 352994, 198338, -25932, 388273, 40991, 100473, 117897, 9253, 108288, -41693, 17119, -188271, -2509, -28194, 233524, 147288, 210099, 111125, 320818, 136356, 191484, -227522, 295713, 277586, 224114, 51109, 221104, -260454, -52908, -113795, 123992, 36903, -101459, 367796, 120332, -153229, -6966, 390977, 489252, 143625, -254812, 277131, 257655, 552738, 338950, -215301, 169604, 140344, 322438, -19425, -2195]
13194C96383L179e579G5370a05217C41724A69875Q5837A20312O2959q3094f7576
13182H1659b2319q2255D6703M3466K8327d2859I5377j4737c6691n622H1668F290
13169a66750J5407F3602a43640B01560Q1945F6034B3614L45091i140A6751J01227
13158A17978f8719A42279K8892J79388a50190n5138I8405b35818B34897q5308
13148A49589C7933A1206J2371L38043a19526a2019K08o484j56818M0493A82878
13136A23990N3104C4193J74615a59824J549c9469A26041c0212B68888J138J50065
13125D20091f0681E851K3717c0428C47433F4314R8259I882C606e1008j22760A12607
13112G2802a13103B36196b16975D94K5671J28713l9418J0096n9945f2082a8116
$$ y = [396383, 399562, -5579, 75370, -105217, 341724, 169875, 255712, 120312, 183271, 100177, -67576, 81659, -22319, -104574, 46703, 90169, 118496, -42859, 95377, 80640, -36691, -42313, 81668, 6290, -166750, -151343, 63602, -143640, 201560, 283505, 66034, 23614, 368705, -9140, 16751, 117978, -68719, 142279, 171171, 350559, -150190, -205328, 98405, -235818, 234897, 149589, 37933, 11206, 23577, 361620, -119526, -12019, -11811, -18295, -175113, -134620, 182878, 123990, 177094, 34193, 208808, -159824, -158275, -39469, 126041, -30212, 268888, 270026, 420091, -60681, 5851, 29568, -30428, 347433, 64314, 162573, 9882, 3606, -51008, -173768, 112607, 72802, -113103, 236196, -216975, 494, 26165, 154878, 115460, 125556, 65611, -62082, -18116]
13100b43403B10187k3261a66427B22432J05951A08152E0880A9455a83346f1154
13089C93556G9891J84738D9664A6115g3659C85233I8926J81530D004K45769Q5923
13078C35696I8804K30132c7953e491j14382B69852j5747e0570C2374R6797J69005
13067B98176F9984Q2269c8990A60176J10182j05652a94301B37265a078A1833J50847
13056A62680l1096m0226J43463a19962d1967H6412o009Q600d9976A88067n7749
13045A30318L0911K13460F8770a0911m6855j50352I9182a35372A99314J41611
13035C40925r3262F9648J20828h7608k4330A91685a24541F4293j8653J48034a1544
13023C81450A61642J09101H6188K77115c6270B11896a3135C25267A357d07k20374
$$ y = [-243403, 210187, 186926, -166427, 222432, 328383, 108152, 50880, 19455, -183346, -61154, 393556, 79891, 264629, 49664, 16115, -73659, 385233, 98926, 280456, 4004, 249773, 335696, 98804, 328936, -37953, -5491, -119873, 269852, 254105, -50570, 32374, 129171, 298176, 69984, 152253, -38990, 160176, 270358, 164706, -194301, 237265, -1078, 11833, 162680, 131584, 91358, 234821, -119962, -41967, 86412, 80403, 89003, -49976, 188067, 130318, 161229, 374689, 68770, -10911, -57766, -208118, 99182, -135372, 199314, 340925, 247663, 69648, 190476, -87608, -111938, 191685, -124541, 64293, 45640, 193674, -11544, 381450, 161642, 270743, 86188, 363303, -36270, 211896, -13135, 325267, 1357, -407, -220781]
13012b20781k5301f2234H5412l0122E505L99301r6908H9948O2381a29210B84826
13000a52394A52758g2671B33620k024a06684B26533K047r4414h48D26291j77280
12989B49011k2049K8700b6533l95309A3286J40806A6983c09943A35609J05780
12979B41389j10027j2029L9405L82416a13629D46328A35486J4452c12341e2396
12968b15924A84497G7014J21319P5509j33756p924k7661a6081D6964L54125H9377
12956e8873j05679B14172h9959B02547a41824B22410a76228A43081c67545A94638
12945g3238B14579K1061B3455K08723e3460l3160C31440a29541C5938J85423f9900
12933a6509j24932a659C8025K13679a5666o7685A22532C7413L12541H4004J90808
$$ y = [-220781, -246082, -62234, 85412, 55290, 5505, 404806, 307898, 89948, 152329, -129210, 284826, -152394, 152758, -72671, 233620, 231596, -106684, 226533, 228580, 134166, -848, 426291, 249011, 226962, 255662, -26533, -421842, 13286, 154092, 16983, -309943, 135609, 241389, 131362, 119333, 158738, 541154, -113629, 446328, 135486, 149938, -312341, -52396, -215924, 184497, 77014, 198333, 273842, 140086, 132162, 104501, -16081, 46964, 401089, 89377, -58873, -164552, 214172, -89959, 202547, -141824, 222410, -176228, 143081, -367545, 194638, -73238, 214579, 235640, 23455, 232178, -53460, -86620, 331440, -129541, 35938, 221361, -69900, -16509, -141441, -1659, 38025, 251704, -15666, -83351, 122532, 37413, 349954, 84004, 274812]
12922B74812A13304n6333b29511O0482A42058R0145b3535j9040C64818f4546B38207
12910e763B79749A0202J36154N838b31251A21779C0173a09169E968L65510A77053
12898a28272d3415A62612d47122B63022c5140k1022C2489b6678l9812A21300a78616
12886c03215I4213m4735J8233f1511n5361B07108O9486A08925L59919j95475L44885
12875F18254j88903j33011b02191A58646l5285N7139J08829A10933a21677e6323
12864a59436c1108A76421a95283J4025g8787E2427a54342A90967h0402B80445
12853d62170b4186C58377f4853p5902e4036I8381A6103J57522p8885d3333p062
12842e0395B58033I8912a88895r4884B39526A18023N07535A41077a259k88450
$$ y = [274812, 113304, 56971, -229511, -169029, 142058, 232203, -23535, -42575, 364818, -64546, 238207, -5763, 279749, 10202, 146356, 152194, -231251, 121779, 30173, -109169, 5968, 371478, 177053, -128272, -43415, 162612, -447122, 263022, -35140, -56162, 32489, -26678, -66490, 121300, -178616, -303215, 94213, 49478, 67711, -61511, -116872, 207108, 276594, 108925, 468844, 273369, 618254, 429351, 296340, -202191, 158646, 123361, 180500, 289329, 110933, -121677, -56323, -159436, -31108, 176421, -195283, -181258, -78787, 52427, -154342, 190967, -80402, 280445, -462170, -24186, 358377, -64853, -140755, -54036, 98381, 16103, 173625, 94740, -43333, -50395, 258033, 98912, -188895, -283779, 239526, 118023, 625558, 141077, -1259, -289709]
12832b89709a10590J3763A81400a10361A44952b40882M8549R1536k2773C28664
12821A03946L1262b12970A00605K58306b00858A96247r6562j9503M75516a28678
12810c48703a72003B93759a67241N2150j41035i4875j30017A39076a06797j62627
12800b69424f1461I3120a00755B52071g3251m92A80087D9160d19950a82708A85146
12788a39531O1044o3186A27298j9073q940l5890A9358f550j05213j243I0352M6697
12776A37049a56722a5179A69463a42886A02952a59545E5260f103A84857p6219
12766A08638c57409G8357a97464k5354B60319J86702A41232d1083l0482p8377
12756a49942O6134j17298A70261f3977K8854A79533P7869b50299H2975J76529
$$ y = [-289709, -110590, -96827, 181400, -110361, 144952, -240882, -192333, -100797, -123570, 328664, 103946, 135208, -212970, 100605, 358911, -200858, 196247, 99685, 80182, 555698, -128678, -348703, -172003, 293759, -167241, -115091, -256126, -94875, -224892, 139076, -106797, -269424, -61461, 93120, -100755, 252071, -73251, -73743, 180087, 49160, -419950, -182708, 185146, -139531, -78487, -141673, 127298, 108225, 99285, 63395, 19358, -6550, -111763, -113006, 90352, 137049, -156722, -15179, 169463, -142886, 102952, -159545, 55260, -6103, 184857, 108638, -357409, 78357, -197464, -222818, 260319, 447021, 141232, -41083, -71565, -149942, -83808, -201106, 170261, -63977, -35123, 179533, 257402, -250299, 82975, 259504]
12746B59504E5227d3510k3540K9081q3630A45302j7115F3009K05663a66995I4040
12734A12106J061b32134I9414K33422i523j18754N4281B43502a18077C6698P4257
12723A10955l6765j3029O9354l789M06812A90241a91510H9529a82448C6506J51828
12712A88334J56481C9402j6473a87B27326G6212a05294B10564b5484I5280M04116
12701D99396g073B16524b1933a675j32184k3385G3033a4290j44698d0377B64860
12689B77552e0691B77031j35438R7541m6454P8000F3971J72942b6310j22836q6707
12678b35853D27416A53906n7781h4564B88848C389f923A66757F4356e0154b4052
12666B31700l2884J12948B9971K77417a73327g5044K6369D5142J42253q7239b917
$$ y = [259504, 55227, -43510, -67050, -37969, -121599, 145302, 128187, 63009, 268672, -166995, 94040, 112106, 113167, -232134, 99414, 332836, -9523, -128277, -73996, 243502, -118077, 36698, 110955, 74190, 61161, 130515, 126726, 533538, 190241, -191510, 89529, -182448, 36506, 188334, 344815, 39402, 22929, -187, 227326, 76212, -105294, 210564, -25484, 95280, 499396, -7073, 216524, -21933, -1675, -133859, -157244, 73033, -14290, -158988, -40377, 264860, 277552, -50691, 277031, 141593, 239134, 192680, 270680, 63971, 236913, -26310, -149146, -235853, 427416, 153906, 96125, -84564, 288848, 3389, -6923, 166757, 64356, -50154, -24052, 231700, 198816, 311764, 29971, 307388, -173327, -75044, -48675, 45142, 187395, 100156, -2917]
12654g1814B30704J84210d8279A92100G756J13734R3624C4124h3774B93826D3344
12642A07636a32138C6238a11461B39248o9864q3630L45201B00370d8156C59964
12631f6682D4820J28274c23252B81005F3003K57487A35958N1897J84553C2407
12620c19852a0743I2457K90444a44511A7689N8239a78287H2039e564B30591I9367
12608G4321K06836l4504G1963A375h5487c9589A49409m78h1205A10921J73063
12597B83984M4473a20599j20587F1449e6620i733B27056E7496L51687j95074f3620
12585a81118p798A12456o206P7785a9838b699j08058D1484L89523A94802P1359
12574B66161A18018b29123h9917A05753a74138a5475k57032A41344a31587E1758
$$ y = [-71814, 230704, 414914, -48279, 192100, 7756, 121490, 215114, 34124, -83774, 293826, 43344, 107636, -132138, 36238, -111461, 239248, 169384, 85754, 430955, 200370, -48156, 359964, -66682, 44820, 173094, -323252, 281005, 63003, 320490, 135958, 187855, 372408, 32407, -319852, -10743, 92457, 382901, -144511, 17689, 75928, -178287, 82039, -5564, 230591, 99367, 74321, 281157, 246653, 71963, 1375, -85487, -39589, 149409, 148931, -81205, 110921, 283984, 328457, -120599, -241186, 61449, -56620, -9733, 227056, 57496, 409183, 214109, -63620, -181118, -188916, 112456, 106250, 184035, -19838, -2699, -110757, 41484, 431007, 194802, 266161, 118018, -229123, -89917, 105753, -174138, -15475, -272507, 141344, -131587, 51758]
12563a63518j10284E2328e6392B21708O7026G3313a12678Q825k763C66539G2685
12551C39980c1744l6430C413a03125C46108A45060b28j21329A27595M212g2411
12539I0946a56830g0652q3886L8220B89471a34372d7399k7246C46145a79178A32926
12527D40235f04923a34265B095J92267q4219M3756p318K78245I1973A8883L6791
12516E5674K14474b10829C80545h0687D26305b12705E2081L2357A8125R5322d5483
12504B07685k8264a83114d4033B07157C6204J26783b1434l2941A51311c4485B72370
12492f6728D57063B803g9095j72338D0536b43201A07689m3060c12191g1688L2331
12481c9357o7113L3796B10480b20400C85517b13530N3911J5736B01057p1808J71745
$$ y = [-163518, -273802, 52328, -56392, 221708, 288734, 73313, -112678, -103853, -106616, 366539, 72685, 339980, -31744, -68174, 3413, -103125, 346108, 145060, -228, -121557, 127595, 131807, -72411, 90946, -156830, -70652, -154538, -116318, 289471, -134372, -47399, -74645, 346145, -179178, 132926, 440235, -604923, -134265, 2095, 194362, 110143, 153899, 146581, 424826, 91973, 18883, 55674, 270148, -210829, 380545, -80687, 426305, -212705, 52081, 84438, 18125, 113447, -45483, 207685, 179421, -183114, -44033, 207157, 36204, 162987, -21434, -54375, 151311, -34485, 272370, -66728, 457063, 2803, -79095, -251433, 40536, -243201, 107689, 64629, -312191, -71688, -39357, -106470, -72674, 210480, -220400, 385517, -213530, -159619, -143883, 201057, 129249, 300994]
12470C00994a61951A15144a3377A39041B8052N4077Q7359i1311k59018d4590E2752
12458c4783A14994N2775L483c4438a970C8993c25802c7245m0053J2012F8960R3363
12446A62323a09162C80031D9720M2381A5855K3149c80295C3746N6173j8820c50865
12434A26327n5653M9055a62754A46707F866a43907A19270b30761A23975J86399
12424C10374b11949B49679c00317a0330C02454a5800D0574K23432c58262E535
12413i2665A3315R2980d2016I0100a05718A62484a33120E4947g5595k38688D4390
12401A14697a73254k84416a40808G31N9626a1243j32238p101j1737B21975a12427
12389C60241a90996g1142b0102r8399N0252B14785I6365b6468B98454M6351A7846
$$ y = [300994, -161951, 115144, -13377, 139041, 28052, 82129, 169488, -91311, -350329, -44590, 52752, -34783, 114994, 167769, 171252, -34438, -1970, 38993, -325802, -37245, -77298, -65286, 68960, 162323, -109162, 380031, 49720, 92101, 15855, 39004, -380295, 33746, 89919, 71099, -350865, 126327, 70674, 119729, -162754, 146707, 6866, -143907, 119270, -230761, 123975, 310374, -211949, 249679, -300317, -10330, 302454, -15800, 40574, 264006, -358262, 5535, -92665, 13315, 106295, -42016, 90100, -105718, 162484, -133120, 54947, -75595, -314283, 44390, 114697, -173254, -457670, -140808, 731, 60357, -11243, -143481, -150582, -162319, 221975, -112427, 360241, -190996, -71142, -20102, -118501, -68249, 214785, 96365, -26468, 298454, 344805, 17846]
12377h9248d4607B46173I6629b10029j5338b9503B9887Q313a00355F5642Q8602
12366A54244d8446j37160d1780G9786J25106a20812A28958J04624h5630K8530
12356e7100I751K81719F9519a00881F6041c18245A3833a13602H8870c24090A09930
12344d22800A28206a35109b4209H0121r460J08025b2755A64636J5335D3094K71821
12333C14915A20033b70012c2051B9669P5683a63155B2598Q9807a70370D89917
12322A90525m4571a57901M4840H4192J34855E8218J55062b30367M5777A14763
12311A60195a02455N0984C64526n0596a41491B78144A3363a13038q0008B1589
12300e7064b6013B06575h1472B16383n1482f7955B62964k5986a7827f384j72851
$$ y = [-89248, -44607, 246173, 96629, -210029, -225367, -29503, 29887, 38200, -100355, 65642, 154244, -48446, -185606, -41780, 79786, 204892, -120812, 128958, 233582, -85630, -57100, 9751, 291470, 69519, -100881, 66041, -318245, 13833, -113602, 88870, -324090, 109930, -422800, 128206, -135109, -24209, 80121, 70661, 178686, -22755, 164636, 179971, 43094, 314915, 120033, -270012, -32051, 29669, 105352, -163155, 22598, 112405, -170370, 489917, 190525, 145954, -157901, -113061, 84192, 219047, 58218, 213280, -230367, -184590, 114763, 160195, -102455, -51471, 364526, 313930, -141491, 278144, 13363, -113038, -193046, 21589, -57064, -26013, 206575, -81472, 216383, 164901, -67955, 262964, 236978, -17827, -6384, -179235]
12289a79235C1782N7444a8081B1463a15315C6582a14519a2422j04004C3206K37424
12278B70630c77p1822A26339f1949k6938j43577A90937D5458J30919E129K6815
12267C1944A176K82833a83931k7819D15926A47873h0501k39006H4179C2273J03629
12256A35902B1513J59757B099a89314B25434b48985e3121K4985A73745M2932J99559
12245D16236A7825J72060J21558p5973k2858O1395D7583K69498j28887a63220
12234I5076Q1064r189C4503L24421F5809K6886g4613G4363j0962P1141R5595o2041
12222A68096K87817c359A85011H9033M03563D9908K0246K46701n9974K35474B3080
12210B314M68700A93965J53884i1390H2306Q8602K03067A4866K19810R5538p2654
$$ y = [-179235, 31782, 89226, -18081, 21463, -115315, 36582, -114519, -12422, -116426, 33206, 270630, -377, -72199, 126339, -61949, -88887, -232464, 190937, 45458, 176377, 5129, 31944, 1176, 284009, -183931, -211750, 415926, 147873, -80501, -319507, 84179, 32273, 135902, 21513, 181270, 2099, -189314, 225434, -248985, -53121, -28136, 173745, 216677, 416236, 17825, 189885, 311443, 235470, 212612, 274007, 47583, 317081, 188194, -163220, 95076, 176140, 166951, 34503, 358924, 65809, 92695, -74613, 74363, 63401, 134542, 230137, 168096, 455913, -3359, 185011, 89033, 492596, 49908, 70154, 316855, 256881, 492355, 23080, 2314, 471014, 193965, 347849, -91390, 82306, 170908, 373975, 14866, 234676, 330214, 257560]
12199B57560H8023i9236A9953J26121K21501A4329J0896Q5189j5842g9644A1046
12187F6520J2176L9859c078o1477c1085k3666j37895M9019B9880A0714M25706
12176D36420a4838A52057c5066Q008m8271k7769C11218A22588m2362a12813C28969
12164D3094J47498j5040H1594b0610B57276a82166A65668a91582O0152B43560
12153a0208k63611A87506D464L42827B0054e2845C22680a9305j20824C12847A09203
12141g1487C33758g7628C76111a39796A59150a74097A88825j2936J80471H0988
12130b33682A76461i3222j52994A1930L44594e5306G4097d07627A74943A7327
12119h5568B19712d9218G7396b00005B11259F9825d884F3474A9359J16660O7794
$$ y = [257560, 88023, -99236, 19953, 146074, 367575, 14329, 25225, 110414, 94572, -79644, 11046, 66520, 78696, 118555, -3078, -64555, -31085, -54751, -192646, -143627, 29880, 10714, 436420, -14838, 152057, -35066, -27058, -75329, -103098, 311218, 122588, 80226, -112813, 328969, 43094, 190592, 175552, 81594, -20610, 257276, -182166, 165668, -191582, -131430, 243560, -10208, -273819, 187506, 4464, 347291, 20054, -52845, 322680, -19305, -140129, 312847, 109203, -71487, 333758, -77628, 376111, -139796, 159150, -174097, 188825, 175889, 356360, 80988, -233682, 176461, -93222, -246216, 11930, 356524, -55306, 74097, -407627, 174943, 17327, -85568, 219712, -49218, 77396, -200005, 211259, 69825, -4884, 63474, 19359, 136019, 203813]
12108B03813K9097O6885f610l6405A41458c72877B1713M271b71486d4774C8552
12096B87980f3248E25933H5181a26435r5525B32902J43766b5134o7887D97518
12085C1730c39768B32884e083I1993b1872i679A51616l5466g5412o6605A83052
12073F6241b23190C53526I9241e4725n7027D10970I4629a48251f6648m5736d8238
12061C49579A63521J01810J62683A52945m604J80865A18935m9230c0018A11978
12050A83672D2124f5558E4874M39990j01537H9936a22284C184g53j28627A54640
12038A55614c48099f0973j72181R5407F6298a09907A49817o6899G368O2153J282
12027G0803b59304A02609o009m0517j2555P5679f4446E8546L5428l9520a82950
$$ y = [203813, 232910, 299795, -6610, -43015, 141458, -372877, 21713, 25984, -271486, -44774, 38552, 287980, -63248, 525933, 85181, -126435, -221960, 232902, 376668, -25134, -93021, 497518, 31730, -339768, 232884, -5083, 91993, -21872, -9679, 151616, 116150, -75412, -142017, 183052, 66241, -223190, 353526, 99241, -54725, -111752, 410970, 94629, -148251, -66648, -112384, -48238, 349579, 163521, 265331, 428014, 152945, 148341, 329206, 118935, 69705, -30018, 111978, 183672, 42124, -65558, 54874, 494864, 393327, 89936, -122284, 3184, -753, -129380, 154640, 155614, -348099, -60973, -233154, -137747, 66298, -109907, 149817, 82918, 7368, 69521, 70803, -259304, 102609, 96600, 56083, 43528, 119207, -64446, 58546, 93974, 54454, -182950]
12015f4566A13474N267J6153J34101J2102g7274D14413a61201g1620j88182B27838
12003a10059e711A31687b43700C8676K23647a02988A567c6791D519b365j7819
11992b0184D34380a28945G8129J0625a37761e3369I3410h9335l49553J88670i4900
11980c36046H3378C8566J16577A533c7955B32602a12189m147n6549A32357a01148
11968a47393A99009g1053b8764A32177B120L1596n799h9539j52523e651H2889
11956D8936O8895H539J82559a72587B5412e05190a99378h6410J7201D5807O8669
11945A14476A9956D768a4812j84505L4575a9042m5342A95528a26630N5736j06039
11934a76933A01050a67601A69052F260a89486I5894j8661K75867G0832N8927a04734
$$ y = [-64566, 113474, 118741, 134894, 268995, 281097, -77274, 414413, -161201, -71620, -259802, 227838, -110059, -5711, 131687, -243700, 38676, 262323, -102988, 1567, -36791, 4519, -2365, -20184, 434380, -128945, 78129, 88754, -137761, -53369, 93410, -89335, -438888, -250218, -94900, -336046, 83378, 38566, 155143, 1533, -37955, 232602, -112189, -116336, -172885, 132357, -101148, -147393, 199009, -71053, -28764, 132177, 2120, 33716, 27917, -89539, -242062, -5651, 82889, 48936, 117831, 8539, 191098, -172587, 25412, -505190, -199378, -86410, -69209, 45807, 114476, 19956, 4768, -14812, -199317, -164742, -19042, -64384, 195528, -126630, -70894, -176933, 101050, -167601, 169052, 6260, -189486, 95894, 77233, 353100, 70832, 129759, -104734]
11922C65904a71885P4211j26451M8577A01122N6325g42C17959a1378l8279C530
11910c551o5777b7345G39J40942b6184B56971a18235B892R7268L1965a40951F8134
11897a92113Q5561G003O9407d8128r3129A20224c15935A08197a22478H9176a0029
11885a81875J7452A29532D6900a16477B12139a66155P7763K1181j51734H8147
11874b15279n6594A90432b62917C04211a18144j00560C77618m400a37664C67288
11863d9297o1489n4702P5640A89976b93221N5536O4114K3670M9757j04156c2880
11851D3372b26529B54410H846Q657a91479j78114b1877j8356l5577o2013J6810
11840a21013E8605f4357G6814J02464G0347g3996j16718j8949N518C53581a28356
$$ y = [365904, -171885, -97674, -224125, -175548, 101122, 157447, -742, 317959, -11378, -49657, 3530, -3551, -69328, -27345, 739, 141681, -26184, 256971, -118235, 2892, 100160, 132125, -140951, 68134, -192113, -106552, 7003, 76410, -48128, -141257, 120224, -315935, 108197, -122478, 89176, -10029, -181875, -164423, 129532, 46900, -116477, 212139, -166155, -88392, -67211, -218945, 88147, -215279, -271873, 190432, -262917, 304211, -118144, -218704, 377618, 373218, -137664, 367288, -49297, -110786, -165488, -89848, 189976, -293221, -237685, -173571, -149901, -100144, -204300, -32880, 43372, -226529, 254410, 8846, 17503, -191479, -369593, -21877, -40233, -75810, -137823, -121013, 58605, -64357, 76814, 179278, 70347, -73996, -190714, -209663, -204145, 353581, -128356]
11828a01793m181k5850b2450j73634i7201n3030k6124n0102A59257l7488n0685
11817G1084d547k15739N8643B91273E9991J53322q5166M0549c53323a56883B45645
11805A76018h4086j96616G0625c28973A79423a97490A10718B4094f9772E4557
11794A80635A5653b1437n873k9356E64332c4726n635a8597k14310B5930C138g0168
11781a14275B43861b8322k55528C2513b83322f1360f510E9355a76232J2292A1506
11769i3205L1411r5490C5351b0584C8763i5685A26892E067a84361N4309b9229
11757f3830n4096E9288a63544P4555A94244J36935o3294f1214C6708b27609e6960
11745c4004j58883B9749K47238d7043B983J50728d891r0420B47949I6200e9839
$$ y = [-101793, -105974, -131824, -22450, -196084, -97201, -150231, -176355, -226457, 159257, 121769, 71084, -4547, -220286, -161643, 291273, 59991, 213313, 128147, 168696, -353323, -156883, 245645, 176018, -84086, -280702, 70625, -328973, 179423, -197490, 110718, 24094, -69772, 54557, 180635, 15653, -21437, -27310, -56666, 564332, -34726, -40361, -18597, -232907, 25930, 3138, -70168, -114275, 243861, -28322, -283850, 32513, -283322, -61360, -6510, 59355, -176232, -163940, 11506, -93205, -61794, -157284, 35351, -20584, 38763, -95685, 126892, 5067, -184361, -130052, -29229, -63830, -117926, 59288, -163544, -88989, 194244, 331179, 267885, -61214, 36708, -227609, -56960, -34004, -192887, 29749, 276987, -47043, 2983, 153711, -4891, -95311, 247949, 96200, -59839]
11733d3990B8168K00257b87492H7191e4636r7000H7536J2734P060b02223O7210
11722a35013A37503c09941G6331a5317j539j02430G9842K0014h6668H1669a00276
11710A93770B5805J91291r3468B173a05860K4671K6808D49790A76686a168k59036
11699b60204C037a67098A47506b36660B14306J222a50498g1273H2657b65580A21272
11687a21245D07388j41187a23037l9485A3362O253a4328j20118D402L30898A44134
11675B9236a64275B26854c0926J1053k97016A76686a27833B6788a66386a893C49996
11663A08681i3735B21863m5304H194Q9501j4015J11395F7368j9239j1252J7403
11652E4280a78589N4885B9015K4865J63097l0743b04213C50115q0533q3706a38002
$$ y = [-43990, 28168, 228425, -287492, 87191, -54636, -151636, 87536, 100270, 107330, -202223, -135013, 137503, -309941, 76331, -15317, -16856, -119286, 79842, 99856, -86668, 81669, -100276, 193770, 25805, 217096, 123628, 2173, -105860, -81189, -54381, 449790, 176686, -1168, -260204, 3037, -167098, 147506, -236660, 214306, 215528, -150498, -71273, 82657, -265580, 121272, -121245, 407388, 266201, -123037, -162522, 13362, 19615, -14328, -134446, 4402, 335300, 144134, 29236, -164275, 226854, -30926, -19873, -316889, 176686, -127833, 26788, -166386, -1893, 349996, 108681, -93735, 221863, 176559, 8194, 97695, 83680, 195075, 67368, 48129, 36877, 54280, -178589, -123704, 29015, 53880, 216977, 186234, -204213, 350115, 269582, 185876, -138002]
11640F784l07J30342P8315p2882F2320a48843B41375b24397a8082B36429c08367
11628A483a52085B10520g1194B570a90959h9796b847A1923e6711A08040Q6722
11617A94762l3506l2173J55768c2136G6890K27812f4256k50243b800A75163N6924
11606B32087H4973R4699b59359B21419a81530Q8678A78754b91302b7771l32508
11596c60279C38428A28080P5550n2152B8535N7205l7320c6381B42148B5376K12389
11585B37765a52304A29160O4937P5363b42484H4511R1880m9048P5994L3971k2038
11574B15270g2831D4195K7674J8236b598I2527E276R0922c3797B8687J6127N0676
11562I5490J8P6846L9015a41591B65900J92778b52471Q5978C764K34721E2964
$$ y = [6784, 6477, 136819, 215134, 142252, 62320, -148843, 241375, -224397, -18082, 236429, -308367, 1483, -152085, 210520, -71194, 2570, -190959, -89796, -2847, 11923, -56711, 108040, 194762, 161256, 129083, 284851, -32136, 76890, 304702, -64256, -314499, -2800, 175163, 232087, 84973, 179672, -259359, 221419, -181530, -92852, 178754, -291302, -27771, -360279, 338428, 128080, 203630, 151478, 28535, 85740, 48420, -36381, 242148, 25376, 237765, -152304, 129160, 194097, 269460, -242484, 84511, 176391, 127343, 203337, 237308, 215270, -72831, 44195, 71869, 90105, -2598, 92527, 5276, 96198, -33797, 28687, 44814, 95490, 95508, 172354, 211369, -141591, 265900, 458678, -252471, -166493, 3764, 238485, 52964]
11550D81486B33089b24413A07299D9647K06505C5009f2603B43741J53896A06179
11539D2001N2970m3603O6621e7700A93055h0184B2156b2263j9190A41892N3063
11528A94955I576K57260A13569k3831a0356A05261e6815D16463A75358a11012
11517C39596A16348K710E2933J13190n7443a53023j01239f2578A60278J27745
11507B88023b8124k18152i6967a9659C19265g0446b9553E5623a17061j48122A69394
11495C96497A45329c9880H4777b36290A60723J90368e1671A40733h1950I031J39855
11484A48886a87229H4746I015K75916J31674A34155O3003J56339a9942A04773
11473A75022h3178B91680G4908J22590L7671b68163J27118M6457B20054F7722
$$ y = [481486, 233089, -224413, 107299, 49647, 256152, 35009, -62603, 243741, 397637, 106179, 42001, 94971, 51368, 117989, -57700, 193055, -80184, 22156, -22263, -41453, 141892, 194955, 9576, 266836, 113569, 89738, -10356, 105261, -56815, 416463, 175358, -111012, 339596, 116348, 119058, 52933, 166123, 108680, -153023, -254262, -62578, 160278, 288023, -28124, -246276, -96967, -19659, 319265, -70446, -29553, 55623, -117061, -265183, 169394, 396497, 145329, -39880, 84777, -236290, 160723, 351091, -51671, 140733, -81950, 9031, 148886, -187229, 84746, 9015, 284931, 416605, 134155, 197158, 353497, -19942, 104773, 175022, -83178, 291680, 74908, 197498, 235169, -268163, -141045, -94588, 220054, 67722]
11462A32777J424N7728h61A82565e0385k08541A24777E5674K29596r7359a34755
11450A97593K870p4701n4226j2247P4396f9575A64309B3024L6959N5962a59811
11438A18552n2696J64413j07026J18820a86777j1519A67082a06340B39586E8439
11427A9303Q1549C1511L2793L5353a80o8081C45848j18984a49309q684g3266j12879
11415a86145e8501b7904C54304A09411M7828N1655I0205d5500b1287H165J14247
11404A22412M02167H4231I48a5481F2443d5081k054j07858a0775B82663n155A05898
11391I4984a25449k8101A69163e5005k34962b4586m3100B23262J8061D5221h0304
11379G3011J31334A6406a57162A64223c7339F6837M4921a45876n4490B09430b54390
$$ y = [132777, 134201, 191929, -861, 182565, -50385, -258926, 124777, 55674, 285270, 187911, -134755, 197593, 200463, 125762, 71536, 59289, 133685, -69575, 164309, 23024, 59983, 115945, -159811, 118552, 65856, 230269, 123243, 242063, -186777, -198296, 167082, -106340, 239586, 58439, 19303, 100852, 31511, 64304, 99657, -180, -68261, 345848, 226864, -149309, -157993, -73266, -186145, -58501, -27904, 354304, 109411, 157239, 208894, 90205, -45500, -21287, 8165, 122412, 524579, 84231, 948, -15481, 62443, -45081, -47135, -154993, -10775, 282663, 277508, 105898, 94984, -125449, -153550, 169163, -55005, -289967, -24586, -67686, 223262, 241323, 45221, -80304, 73011, 204345, 16406, -157162, 164223, -37339, 66837, 111758, -145876, -200366, 209430, -254390]
11367F8306M05455b28589G3695a53052B09078c02148Q5240M5662d8694l5076C8286
11355i7117B36217H1816a93655d2763F8568Q6296g9236A98460b32731B0516a39857
11343g2308q339k36541L1269A95914F638K83967k314a3433k5141j45924O0235
11332a24263D8448a27837R953A57174P2392b66806A27263Q0969a46927B950a32769
11320C11033A05377b54291C20602A44296a61557A6886L2309Q748J78152i8980
11309b11135j98237E3485N0119i538n4862j506B07530b11300A5326b89742B72564
11297g9114B6693b56539J15452l1689O4309l00003G3706B0417P3210a20384j27051
11286b47435A39538J07318q1065k615g0989B37690b6864n6890B12528c00306J38956
$$ y = [68306, 473761, -228589, 73695, -153052, 209078, -302148, -216908, -171246, -48694, -83770, 38286, -97117, 236217, 81816, -193655, -42763, 68568, 154864, -79236, 198460, -232731, 20516, -139857, -72308, -80647, -317188, -285919, 195914, 6638, 290605, 288291, -13433, -38574, -184498, -124263, 48448, -127837, -117884, 157174, 229566, -266806, 127263, 208232, -146927, 2950, -132769, 311033, 105377, -254291, 320602, 144296, -161557, 16886, 49195, 57943, 236095, -98980, -211135, -409372, 53485, 103604, -9538, -64400, -65906, 207530, -211300, 15326, -289742, 272564, -79114, 26693, -256539, -141087, -172776, -108467, -408470, 73706, 20417, 93627, -120384, -247435, 139538, 246856, 165791, 163176, -70989, 237690, -26864, -83754, 212528, -300306, -161350]
11275a61350d8463B43318a47831m9017h7382L3439B40704a60466c0860B49119
11264a67163M845l7744A49384b38322I4316m3610j941Q549k2164J29612i0769
11252e4576C2924L83445a07725K0162j69357a06395j82359F8932b49344Q7544
11242a61800B57495h3542c1035p6909k22242A31468b52889i2054j77428h4852
11231h0171K2952j01082J9278A01463a8286C8355Q7233a58852A36753a39752I024
11219a96541I1392a61173a8531n2156G5657l6841m750J55588G8151h4932G7314
11207e2889k52617B37344b56505B895K0354b59818A77261F2810a99847o8384a8633
11195b05885f8539M941p6385a4730j21886M7861B25218a64693j84609c2956A43844
$$ y = [-161350, -48463, 243318, -147831, -196848, -87382, -53943, 240704, -160466, -30860, 249119, -167163, -162318, -200062, 149384, -238322, 94316, 50706, 48765, 57314, 35150, 164762, -90769, -54576, 32924, 416369, -107725, -87563, -256920, -106395, -288754, 68932, -249344, -161800, 257495, -83542, -31035, -107944, -330186, 131468, -252889, -92054, -269482, -84852, -80171, -57219, -158301, -139023, 101463, -18286, 38355, 125588, -158852, 136753, -139752, 9024, -196541, 91392, -161173, -18531, -70687, 75657, 38816, 34066, 189654, 78151, -84932, 77314, -52889, -305506, 237344, -256505, 2895, 23249, -259818, 177261, 62810, -199847, -268231, -18633, -205885, -68539, -63598, -139983, -14730, -136616, -88755, 225218, -164693, -349302, -32956, 143844]
11183f3865K8263B4358b555r9749k25939d2345B2315Q4224J02646f8905j70479
11172b39384l5216R5777A42223G0552M9732K14488F9114K11649n6594A9231n232
11161A3999a11853B09717r7047c4785C08515m4006a31586o4813d7255E449N8070
11150F3519c9567H4378D2026e235G9321J69332b31665M8949A35671l8977J61418
11139B58112A5152a27100j2010B16168B5805a64690I7834c5325B861K08805b4749
11127B50260A00337K86530h7608E6918M63192j06044F6557b11858C16816e2049
11116A04886b16961H5193l3302J34935g6351D57135b39998A79787E3573K06947
11106B60520a46865A90264q8873a09597q758L4815C43196f107A52916J43427j07538
$$ y = [-63865, -35602, 24358, -2555, -102304, -328243, -42345, 22315, 106539, 209185, -68905, -239384, -274600, -178823, 142223, 70552, 120284, 334772, 69114, 280763, 224169, 19231, 13999, -111853, 209717, 112670, -34785, 308515, 264509, -131586, -196399, -47255, 5449, 63519, -39567, 84378, 42026, -5235, 79321, 248653, -231665, -182716, 135671, 96694, 258112, 15152, -127100, -139110, 216168, 25805, -164690, 97834, -35325, 2861, 211666, -24749, 250260, 100337, 386867, -87608, 56918, 520110, 414066, 66557, -211858, 316816, -52049, 104886, -216961, 85193, 51891, 186826, -76351, 457135, -239998, 179787, 53573, 260520, -146865, 190264, 101391, -109597, -118355, -83540, 343196, -6107, 152916, 296343, 188805]
11095A88805N0648D6403M60251a53683C60447a44644A44851K86523A73280Q2372
11085B55652L7713j02761m497K97697k09122M4589a38090C01895Q4603L7238A28817
11073D34591p4608J17114B00724L64795B34996j0227N6418M06185k24922J33173
11063E95623k27967R526n8968l0274J92432L6581L0109j02997J90098L0180k96027
11052C68316J18880l9970j19576L11337k34935J30012B21231N44656j62888k92334
11042C10665N69074D03709j68402O32141O741l36374P9970j1611k5268A12151
11031H49238D00666M3896J76267J68730j04623B95240L01527K78503m36467Q9946
11021E28749L34881l42287Q7408L1633L84862n3024D70758K42908P2306Q4700
$$ y = [188805, 239453, 46403, 506654, -153683, 360447, -144644, 144851, 431374, 173280, 255652, 293365, 190604, 186107, 483804, 274682, 319271, -138090, 301895, 386498, 423736, 128817, 434591, 359983, 477097, 200724, 565519, 234996, 224769, 281187, 687372, 462450, 595623, 367656, 377182, 318214, 287940, 480372, 516953, 547062, 444065, 634163, 664343, 368316, 487196, 447226, 327650, 638987, 404052, 534064, 221231, 765887, 602999, 310665, 879739, 403709, 235307, 867448, 874189, 537815, 617785, 606174, 580906, 112151, 849238, 400666, 444562, 620829, 789559, 684936, 295240, 596767, 875270, 438803, 528749, 863630, 521343, 608751, 640384, 1025246, 972222, 470758, 713666, 785972, 870672]
11011H70672K71126m22537k00152J72807J55431J72282l10918j12086K38903q5489
11001G50039J72278p9823K84723r1079j2855q9977k24313J84363K82260l58887
10991H16729J88225p723L59989k74501j54891r3673k18749L69379N5562m32770
10981F07577J34141K99556K28826N5058j92715M0206J09166J21832j26081J05691
10971A383257M6329k18480N8332K08079j93649J23568k51936O497j9839J13256
10961A255414j78742j27139K53574K8374K92760l85573r7239k9439K72177k16441
10951A067726k25775m6460J78723k76180L71061m15067L10086j35322j02873l0431
10941F95488M048j3275j67913m0124K64087j61988N5114k61833J02844j65217
$$ y = [870672, 1141798, 719261, 519109, 691916, 847347, 1019629, 708711, 596625, 835528, 750039, 922317, 842494, 1127217, 1036138, 1023283, 933306, 708993, 893356, 1175616, 816729, 1004954, 997231, 1357220, 1082719, 927828, 834155, 615406, 984785, 1040347, 607577, 741718, 1041274, 1270100, 1325158, 1132443, 1172649, 1281815, 1403647, 1277566, 1383257, 1429586, 1211106, 1269438, 1477517, 1283868, 1407436, 1155500, 1161997, 1142158, 1255414, 1076672, 949533, 1203107, 1231481, 1524241, 1138668, 1041429, 1011990, 1284167, 1067726, 841951, 795491, 974214, 698034, 1069095, 654028, 964114, 828792, 725919, 695488, 699536, 686261, 518348, 478224, 742311, 580323, 635437, 373604, 476448, 311231]
10931C11231q5969J31501K53623j50838n2909j01312J75548j81156o558q7299
10921B05862J36930b8863p5309A81511R0235a03484D01338q8864j47497J57370
10911C22347k404a42533B56239M2747A5988a17409l1278A45913o5602d0020j32202
10900a72222e6015B05674L0968k9207g1732I1799a8549E2419a0360m1637r6335
10889a48332B53256A11090K05698a73899A79730F9668a48153j13462J9737j6163
10879b58041f2243k76467J28093L7671B79823D239a49971I5629b09507e8211A93143
10867b00270B6291j0942c3869H0081a9245l09206B249O6565a32251B404L50680
10856C53084A28687b52526A20397N709c4788j54289A35885b16966a8981B46113
$$ y = [311231, 225262, 356763, 610386, 459548, 406639, 305327, 480875, 299719, 293161, 205862, 342792, -28863, -104172, 181511, 271746, -103484, 401338, 312474, 164977, 322347, 319943, -142533, 256239, 298986, 15988, -117409, -148687, 145913, 80311, -40020, -172222, -56015, 205674, 236642, 207435, -71732, 91799, -18549, 52419, -10360, -51997, -148332, 253256, 111090, 316788, -173899, 179730, 69668, -148153, -261615, -241878, -258041, -62243, -338710, -210617, -172946, 279823, 4239, -149971, 95629, -209507, -58211, 193143, -200270, 26291, 15349, -33869, 80081, -19245, -328451, 2249, 68814, -132251, 2404, 353084, 128687, -252526, 120397, 126106, -34788, -189077, 135885, -216966, -18981, 246113]
10845a68436I0718b95459B71557r8638C0238a27184G0377b80694d105A53148p4636
10834G8512L457K401d57402G3385b36746A41105J24902b95738G1075c34463D6061
10822B78150b9629B3890e49239G1540e0613o5823C56603c47666I1439d07679B31112
10810I3851I435J18387a22110a4164k59322J8111a27638A20978b82154B5173Q5675
10799A10848b4551A5995c773C9041J22518i4964N513I1252m17A1648K77477B3627
10786B95123a9962l27509E7161h9993r8780b8019A72377h8997o8090o3602i4403
10774A88528c24532A32342C6476b36637I6875J64635I0191J08266D8851R7637
10764A46488J09083h6630B3046c1340I4345b11649A6423J18108g4394m9505L8412
$$ y = [-168436, 90718, -295459, 271557, 172919, 30238, -127184, 70377, -280694, -4105, 153148, 78512, 81969, 84370, -457402, 73385, -236746, 141105, 266007, -295738, 71075, -334463, 46061, 278150, -29629, 23890, -549239, 71540, -50613, -116436, 356603, -347666, 91439, -407679, 231112, 93851, 9435, 127822, -122110, -14164, -273486, -255375, -127638, 120978, -282154, 25173, 110848, -24551, 15995, -3773, 39041, 161559, -94964, -89451, 91252, 90835, 11648, 289125, 23627, 295123, -19962, -347471, 57161, -89993, -188773, -28019, 172377, -88997, -157087, -220689, -94403, 188528, -324532, 132342, 36476, -236637, 96875, 261510, 90191, 198457, 48851, 146488, 255571, -86630, 23046, -31340, 94345, -211649, 16423, 134531, -74394, -123899, -85487]
10753h5487G0454d12936c6609j64303n3475C31578c074n7297j92133E8569A365
10741a83013A38084e1648B23182i5533m16401b2734k84058E5402K22689a49059
10730B85805d40311a68313d1557k00063a17728A95493c170H0336R8880b63833
10719b57518D2774g1495A48035Q3347b92196A58887b03181d5852H3441N8994n4674
10708H7761J26465b45500A80575K08404b59548E1725J612I912J8648O4336K6715
10697A19611n7955J87671a84814k36933a2262B76778k3631a42128d6590J5103
10687c1487I3307b35565N0149k4325R4176B49543c10075P6230O3165I229b72746
10675B64356a50430j96950A13506M5130a69152P4643B95641i0414k19546a02610
$$ y = [-85487, 70454, -412936, -36609, -200912, -254387, 331578, -3074, -60371, -252504, 58569, 1365, -183013, 138084, -51648, 223182, -95533, -511934, -22734, -306792, 55402, 278091, -149059, 285805, -440311, -168313, -41557, -241620, -117728, 195493, -3170, 80336, 179216, -263833, -257518, 42774, -71495, 148035, 231382, -292196, 158887, -203181, -45852, 83441, 142435, 87761, 214226, -245500, 180575, 388979, -259548, 51725, 53337, 9912, 28560, 92896, 119611, 61656, 249327, -184814, -421747, -12262, 276778, 253147, -142128, -46590, -31487, 93307, -235565, -185416, -209741, -115565, 249543, -310075, -233845, -170680, 9229, -272746, 264356, -150430, -347380, 113506, 158636, -169152, -94509, 295641, -90414, -309960, -102610]
10664A73409o1933b9177j13431i408o7043l6970q8204j06643E4552b33149a09036
10652F8704a91421j6272A44761D8773K2482b39749b5103A8326J92681J4173n4802
10641A70378h9074A72734g3210H7843k8524b35495A18690J76936a47811a2447
10630b0120l64890a30647A57124i7391E480J27165h4824l32179a43000k62906
10620d05906i9794H4234i419l82374a90572C1074a95991h2884j79594A62606n9131
10609A03475a71180r9430e1053D8328a8940A93673J15815b32228D4213a28239
10598B5284a31860b9244B43135A13388l5341a58481B26951a47674A08371f6702
10587a55198G0395K01262a52993k9418A16371k343a07998k427j61947N8489D3343
$$ y = [173409, 111476, -29177, -142608, -9408, -76451, -113421, -201625, -308268, 54552, -233149, -109036, 68704, -191421, -207693, 144761, 48773, 71255, -239749, -25103, 18326, 211007, 225180, 170378, -89074, 172734, -73210, 87843, 59319, -235495, 118690, 295626, -147811, -12447, -20120, -385010, -130647, 157124, -97391, 5480, 132645, -84824, -417003, -143000, -405906, -99794, 84234, -9419, -391793, -190572, 31074, -195991, -82884, -262478, 162606, 103475, -171180, -270610, -51053, 48328, -18940, 193673, 309488, -232228, 44213, -128239, 25284, -131860, -29244, 243135, 113388, 78047, -158481, 226951, -147674, 108371, -66702, -155198, 70395, 271657, -152993, -182411, 116371, 114028, -107998, -110425, -272372, -213883, 43343]
10575a13965p4552i1634n1602A66276J5358a76163j827a7226m9298A35565h1576
10563a33391D1496r624b12117A57860K25599C7806Q2240c65444a73119E6534O1613
10552A18147a12143l5463A26907J35920j05234a19452F3686k8290d5755r3157
10542a38912H5761g6334L4687A76482B2563i699Q04j25613A56818k4896d74024
10530b55880o2329f3346d598j94006A48511c49604E0669J72773E8076J81375f5904
10518a42532H4380A3810K8724i8272A39243b9187E3577a11958O665m7995b1671
10506c8646m8244c2666n7340a5991k96136o9583C68153a89721L9276E0073A1390
10494A55444a58977A03134d5381B3857L31049A24250a34756e0376B59025c60337
$$ y = [-113965, -188517, -91634, -143236, 166276, 181634, -176163, -177990, -17226, -66524, 135565, -81576, -133391, 41496, 31872, -212117, 157860, 383459, 37806, 120046, -365444, -173119, 56534, 118147, -112143, -147606, 126907, 262827, 157593, -119452, 63686, 35396, -45755, -138912, 85761, -76334, -41647, 176482, 22563, -9699, -8895, -134508, 156818, 131922, -474024, -255880, -318209, -63346, -4598, -198604, 148511, -349604, 50669, 223442, 58076, 239451, -65904, -142532, 84380, 13810, 42534, -98272, 139243, -29187, 53577, -111958, -105293, -153288, -21671, -38646, -86890, -32666, -90006, -15991, -312127, -381710, 368153, -189721, -150445, 50073, 11390, 155444, -158977, 103134, -45381, 23857, 354906, 124250, -134756, -50376, 259025, -360337]
10483c28919i1553A17986A7167K82309b05202M1845c0578g53l7768A70802j6074
10472A54728C0358i6913A64381C9124d7334q2611A41940h6151c3099E9843a88123
10460a65168I0876C5070N6395a76951c5073I8116K7546c26524d8907C64256F4837
10448A16198c94087A60829b61149c8040B0841a11021M9494A97949H3590a28678
10437h214o8349A81124e1469B38054a09420B94539d69405h1624a4908A2259J3578
10426B5837a13380B54a54299A62912B0256L0256a23862N96A19319a35041i778
10414a5453m4980j8852B37144d9072B66489a07064m0716k12171i5593F9382J33313
10403B02695r9690P8643a72203B8689a01315A7918J23969J33679a62303q4331
$$ y = [-328919, -91553, 117986, 17167, 299476, -205202, -163357, -30578, -753, -38521, 170802, 154728, 30358, -96913, 164381, 39124, -47334, -129945, 141940, -86151, -33099, 59843, -188123, -165168, 90876, 35070, 91465, -176951, -35073, 98116, 125662, -326524, -48907, 364256, 64837, 116198, -394087, 160829, -261149, -38040, 20841, -111021, -61527, 197949, 83590, -128678, -8214, -76563, 181124, -51469, 238054, -109420, 294539, -469405, -81624, -14908, 12259, 25837, -113380, 254, -154299, 162912, 20256, 50512, -123862, -123266, 119319, -135041, -9778, -15453, -60433, -79285, 237144, -49072, 266489, -107064, -147780, -359951, -95593, 69382, 202695, 103005, 181648, -172203, 28689, -101315, 17918, 141887, 275566, -162303, -246634]
10393b46634E7648j7508L56226j26866f990A27886n2306J16296a5271B81184j28303
10382A52881K7843d6489B72053a06108A17524a73819A51343e1036c173l1172A06681
10370A24721J2189L36464A83476E9432a71251A12560n589J82644D4397J53445
10360A97842J70710D9106J25519n1703j072g5959A91477A0165J79651F2968L65535
10349D28503A3451J84234G3648J22315j2884o3975m7098N7188L971J1203K71454
10338D15822j8353j95307a37625B36827m7024a52454A36025J56965K64967B28356
10327B14073L78800k26365j80944n5244g4103E5999R6794L0527a2158C8887A4254
10315c5034B95465j10468F1268a10308B2332M44476C0235K13645h8280m8618B13887
$$ y = [-246634, 57648, 40140, 396366, 269500, -6990, 127886, 75580, 191876, -15271, 281184, 152881, 180724, -46489, 272053, -106108, 117524, -173819, 151343, -51036, -3173, -34345, 106681, 124721, 136910, 473374, 183476, 59432, -171251, 112560, 106971, 289615, 44397, 197842, 368552, 49106, 174625, 122922, 121850, -75959, 191477, 10165, 189816, 62968, 428503, 13451, 197685, 73648, 195963, 183079, 119104, 72006, 129194, 133165, 144368, 415822, 397469, 202162, -137625, 236827, 189803, -152454, 136025, 292990, 557957, 228356, 214073, 592873, 366508, 185564, 130320, -74103, 55999, 152793, 183320, -12158, 38887, 14254, -35034, 295465, 184997, 61268, -110308, 22332, 466808, 30235, 243880, -88280, -136898, 213887]
10303b26747a06807h177C5417K11317A14667a37974r9183C0316J75339j7850C4140
10291A02457M2628K78820q1514j62635J75681E1025K87087j46540D0592A0556
10280d06464A27045c32040O4426I3980K89876h4845p5074F2994L0887p141r35
10269H5805L82740A02663a44913M8450A55518K04971a06939d0508F6801a65117
10258C00244A3138a50068d0883B2750J81580c7808j3p7486n6493d5392C6392J20433
10246A56825c08806D4979J71198g3215A90724i292j66463B63149A7071J74482
10236A91553A7607K30916B9437K9345L3031R0108b09875A60977l9184h7167g669
10224E2979O2533k4460O4671a90791L4121O1441c7710r905j17404g2818k17570
$$ y = [-226747, -106807, -8177, 35417, 246734, 114667, -137974, -237157, 30316, 205655, 187805, 34140, 102457, 145085, 423905, 342391, 179756, 355437, 51025, 338112, 191572, 40592, 10556, -406464, 127045, -332040, -267614, 93980, 383856, -84845, -159919, 62994, 93881, 86740, 85805, 468545, 102663, -144913, -96463, 155518, 360489, -106939, -40508, 66801, -165117, 300244, 13138, -150068, -40883, 22750, 204330, -37808, -37821, -115307, -171800, -45392, 36392, 156825, -308806, 44979, 216177, -73215, 190724, -9292, -175755, 263149, 17071, 191553, 17607, 248523, 29437, 58782, 91813, 181921, -209875, 160977, 121793, -87167, -7669, 52979, 115512, 91052, 155723, -190791, -156670, -95229, -37710, -47615, -165019, -72818, -290388]
10213b90388f6126A32771g3956j34249A19369a03051M7132r6301q9587K7194A42262
10201f5553c0830o5694a6819j28967B9585j3793b53607H8155a98936E783f5329
10189a41676A10100A4249b63109G7790b56620a11720A7268N1498Q623a46420n7739
10178b04159M4978j31435a8385A84881b30640R8451j1778H1554a57622e7486E9999
10166b06595P0202f1797R350l24163a20279c4603j17445k9102a5266D5442g2355
10154d15287i6323j34891f6023A34557B6284h9682K8087F4952a65265g4960C06753
10142A14388J09025J8353c22304J41180A6680f48566K63143e9008b1787j89765
10132b11552A8681N786J60437f4416G8148K45781A17409a48845b6653H537a0632
$$ y = [-290388, -66126, 132771, -73956, -208205, 119369, -103051, -55919, -152220, -241807, -214613, 142262, -65553, -30830, -96524, -16819, -145786, 29585, 15792, -253607, 88155, -198936, 5783, -65329, -141676, 110100, 14249, -263109, 77790, -256620, -111720, 17268, 68766, 77389, -146420, -204159, -159181, -290616, -18385, 184881, -230640, -132189, -143967, 81554, -157622, -57486, 59999, -206595, -136393, -61797, -52447, -376610, -120279, -34603, -152048, -181150, -15266, 45442, -72355, -415287, -96323, -231214, -66023, 134557, 26284, -89682, -61595, 64952, -165265, -74960, 306753, 114388, 223413, 241766, -322304, -181124, 16680, -648566, -385423, -59008, -21787, -211552, 18681, 24467, 184904, -64416, 78148, 323929, 117409, -148845, -26653, 8537, -10632]
10120b10398R2472A96029a29403j06847j63727C03365A40745c34799J5488i6499
10109C8903a9913k6801j54088P1123n4644A48837J72326a42367k14567J21829
10099b35105B89625c89348C44146a48307R999N971p3524M7538b965j48266A88986
10087a72139e7892q7791j88366o917a59764B0691c90793a52764O4210B01778a66653
10075I2978N5776n2700J17244c58903D24809b34517K1370A77662E749J18121d09881
10063A64868a2300l31083A67908j0957j3834c99732g1220r6474C6616b26252N0166
10052a76086F1238i1027I503N9902i6355l26450E4031a2844l41995i1078G254
10040A05715a38345k75008b0617A97202e14669J45440a73547B29816b05786C46252
$$ y = [-210398, -117926, 196029, -129403, -236250, -399977, 303365, 140745, -334799, -319311, -96499, 38903, -19913, -46714, -200802, -129679, -184323, 148837, 321163, -142367, -356934, -235105, 289625, -389348, 344146, -148307, -138308, -132337, -205861, -158323, -2965, -151231, 188986, -172139, -57892, -145683, -334049, -340966, -159764, 20691, -390793, -152764, -88554, 201778, -166653, 92978, 148754, 96054, 213298, -358903, 424809, -234517, -213147, 177662, 5749, 123870, -409881, 164868, -12300, -343383, 167908, 156951, 143117, -399732, -71220, -167694, 36616, -226252, -176086, 61238, -91027, 9503, 69405, -96355, -422805, 54031, -12844, -354839, -91078, 7254, 105715, -138345, -413353, -20617, 197202, -514669, -369229, -173547, 229816, -205786, 346252]
10029e5270j50304B67155D3691c6704a2923l2604H4692j3906k8370K5620a7434
10017f5664B16441a91723B22921a15788L8340l8571m5207m2045a1759r3578B27366
10005h1496A29542b04370g0834j33399N1682E066c75423E2939h7777C4056K17530
9994B51586h0411B38749h9502c9313j85167E4174a49893k1846Q678f6355j26939
9983a93294N4429k2922o6171N6398Q5490B06276f1316l15577c7082F9622e18656
9971c56882f6384k18810k15040J36407d1344j48125k4591j06300B79076F6157
9960A37687c63489h4147C3463a49716C4943L2648J78576c01881J1888h7653A27873
9948b09051B00247F2915a24717f1522j66972C6799N6383h1159j30584Q6345C22382
$$ y = [-55270, -205574, 267155, 43691, -36704, -12923, -45527, 84692, 70786, 42416, 68036, -17434, -65664, 216441, -191723, 222921, -115788, -77448, -116019, -161226, -203271, -11759, -105337, 227366, -81496, 129542, -204370, -70834, -204233, -152551, 5066, -375423, 52939, -87777, 34056, 251586, -80411, 238749, -89502, -39313, -224480, 54174, -149893, -171739, -163061, -66355, -193294, -138865, -161787, -227958, -171560, -86070, 206276, -61316, -376893, -37082, 69622, -518656, -356882, -66384, -285194, -500234, -363827, -41344, -189469, -214060, -320360, 279076, 66157, 137687, -363489, -84147, 33463, -149716, 34943, 67591, 246167, -301881, -289993, -87653, 127873, -209051, 200247, 62915, -124717, -61522, -228494, 36799, 93182, -81159, -211743, -125398, 322382]
9936b7061a1170A64061E727P8843D1465a23751L9906L4379C4103a38958j20892
9925b59850k1472F0970e1114j71986j28223I3493b7827D7307a7524A4803b5684
9913C08011A7664i2337k15013Q5337j59714Q8850a5228l2990o8019j51964A62389
9901B77062j18169b90995N1560f0724e986p0895i869B2099d9464K0188j79045
9890b08321R9301d1816F3563M5392i5208A70421b77898A54910a03640J8722k09047
9879b93965b9579A28335a79596G0539d8378k3354D2399c25920i1604k3191A2323
9867b04949J985A32335d1379E1623L6642L4492c81306G5651c4838l3395l2816
9856a01049m4871p6007N1346I8176a13975l3909L0427A10203a78642l6051k6501
$$ y = [-27061, -11170, 164061, 5727, 84570, 41465, -123751, -83845, -49466, 34103, -138958, -259850, -281322, 60970, -51114, -223100, -351323, 93493, -27827, 47307, -17524, 14803, -25684, 308011, 17664, -92337, -307350, -222013, -381727, -292877, -15228, -48218, -116237, -268201, 162389, 277062, 158893, -290995, -239435, -60724, -5986, -76881, -9869, 22099, -49464, -29276, -208321, -109020, -41816, 63563, 108955, -95208, 170421, -277898, 154910, -103640, -84918, -293965, -29579, 128335, -179596, 70539, -48378, -71732, 42399, -325920, -91604, -114795, 12323, -204949, -202964, 132335, -41379, 51623, 88265, 122757, -381306, 75651, -34838, -68233, -101049, -145920, -221927, -170581, 98176, -113975, -147884, -117457, 110203, -178642, -214693, -241194]
9845b41194c3135A5655b86638f3470A93945a37363K9532B07817i2171A71306a38768
9833b10544a00305B23132J61866a94016B47956c38875I4998b84984E0473a77006
9822a62073A06407b21267p7983A84138b65866J27828H3723j6174K00462D9076
9811h9724J8643l75810b9042k62575d6343k95506a19530M7984L2974m3751M0980
9800d1343j56276b5051j10900b7791j61151k94512b05241N9481L4386I6793b06970
9788c46563B8302e1875A19309Q2601c34445B85907b49030J00807I7413L5638A4026
9776E4271b06631B2331R0794b47320B00018c2945l98785i7918l9848O5555j15277
9765a87488B2249i3629A39879C8876J8648O9569e7443C8344a7377l2402C36204
$$ y = [-241194, -33135, 15655, -286638, -63470, 193945, -137363, -107831, 207817, -92171, 171306, -138768, -210544, -100305, 223132, 384998, -194016, 247956, -338875, 94998, -284984, 50473, -177006, -162073, 106407, -221267, -299250, 184138, -265866, -138038, 83723, 67549, 268011, 49076, -89724, -71081, -446891, -29042, -291617, -46343, -341849, -119530, -71546, -38572, -82323, -41343, -197619, -25051, -135951, -27791, -188942, -483454, -205241, -145760, -111374, 96793, -206970, -346563, 28302, -51875, 119309, 201910, -334445, 285907, -249030, -148223, 97413, 133051, 14026, 54271, -206631, 22331, 113125, -247320, 200018, -32945, -431730, -97918, -137766, -72211, -187488, 22249, -93629, 139879, 38876, 57524, 127093, -57443, 38344, -17377, -49779, 336204]
9753a31757j47564g3017o8549A71566c60231C23568a21100m1078k58967a29018
9742b28128Q7303Q570I5031a56278q3815G511c2575j17651I3738C4669K9938e4687
9729a41875M612A04596d3396a2909k4676I6649b60786p8895a11042j73387M9641
9718b34788B54424b95811A95531a90773A81909d76469J92185J8344C19156j14948
9708B04208a81145j42383b2103H7248a89011n1790B17899l605c05108A19437a64981
9696b21642F6503f51056e3939p752A45213a23816G2915h172k65485A68028a2821
9684e6880B22066c02496B5961p953J38546b16191N2838B982R0866b24037j189
9673b25226j57799A8525K03611a94583A91745G0182K98669a68951f5824k23692
$$ y = [-131757, -279321, -73017, -141566, 171566, -360231, 323568, -121100, -162178, -421145, -129018, -228128, -140825, -132255, 95031, -156278, -240093, 7511, -32575, -150226, 93738, 34669, 64607, -54687, -141875, -137263, 104596, -43396, -12909, -37585, 96649, -260786, -339681, -111042, -284429, -234788, 254424, -295811, 195531, -190773, 181909, -476469, -284284, -265940, 319156, 204208, -181145, -323528, -22103, 87248, -189011, -240801, 217899, 214294, -305108, 119437, -164981, -221642, 66503, -651056, -53939, -61691, 145213, -123816, 72915, -8172, -273657, 168028, -12821, -56880, 222066, -302496, 25961, 18008, 156554, -216191, -163353, 2982, 93848, -224037, -225226, -383025, 18525, 222136, -194583, 191745, 70182, 368851, -168951, -65824, -289516]
9663b89516M4060J8600R7332B20728d4440l09496a29014A50380f3430G5096i8709
9651d0165l32062f8422l81167H6512b40394A30742Q8370J0811J7271F5486b25045
9639c69069F7110d22371a66955j27020a07000k86484J58355E4621J25212e7580
9628b75182E2738M4723m8565a58404R862l9368C3303a40221A66079f1410b9794
9616b3014l1617j04223F5130b95561e1268A8960g6862K1332I6739F525i8429j45869
9604b44298J19901A05046f2887o1993A15298J681C2659a09410H3609J14295l2204
9593A65700b46265e4263j2638K8259C1220J34332o0104C7978d6152l09043C3665
9581a01306b9975E9607a65467e7921B87033B6679b6982n7440r0472K1836A25118
$$ y = [-289516, -245456, -226856, -129524, 220728, -44440, -353936, -129014, 150380, -63430, 75096, -98709, -40165, -372227, -68422, -449589, 86512, -240394, 130742, 219112, 229923, 247194, 65486, -225045, -369069, 67110, -422371, -166955, -293975, -107000, -393484, -235129, 54621, 179833, -57580, -275182, 52738, 97461, 48896, -158404, -148542, -187910, 33303, -140221, 166079, -61410, -29794, -23014, -54631, -158854, 65130, -295561, -51268, 18960, -76862, -55530, 96739, 6525, -98429, -244298, -124397, 105046, -62887, -124880, 115298, 116979, 32659, -109410, 83609, 197904, 165700, -246265, -54263, -66901, -38642, 31220, 165552, 105448, 37978, -46152, -355195, 33665, -101306, -29975, 59607, -165467, -57921, 287033, 26679, -26982, -84422, -174894, -153058, 125118]
9569A3517E599k289K50769I2946b8143j79653B98697a10004A19784C4924j6610
9558A8314c03721A43014h4105o3166A1909c85837a61859P8342k10994J30620A64219
9546c24077e9373B9477f1921F9752K51487g5723K3561B97044h5410A04945a44309
9534I3410a17079B690d6874A8709a80750A6248a21161a8933l7491j75636P6025
9523a56035A32104a34995j82601C8881b21341j83228a73837K634D3860a8847l73858
9512c92705J61104A78197a74147H7658C5684J85794a86279b9633m654e261m5365
9501e0626B41445p5387b7228B789a67734A16574a56871A24278a32252k7618A9569
9489a6242B22936o4290i646p7283I2662a41375D0113Q8168a44625k70489j1822
$$ y = [13517, 5599, 3310, 254079, 92946, -28143, -207796, 298697, -110004, 119784, 34924, 18314, -303721, 143014, -84105, -147271, 11909, -385837, -161859, -83517, -294511, -163891, 164219, -324077, -59373, 29477, -61921, 69752, 321239, -75723, -52162, 297044, -85410, 104945, -144309, 93410, -117079, 2690, -46874, 18709, -180750, 16248, -121161, -18933, -56424, -232060, -156035, 132104, -134995, -317596, 38881, -221341, -404569, -173837, -171203, 43860, -18847, -392705, -231601, 178197, -174147, 87658, 35684, 221478, -186279, -29633, -34287, -5261, -50626, 241445, 166058, -27228, 2789, -167734, 116574, -156871, 124278, -132252, -159870, 19569, -16242, 222936, 158646, -9646, -86929, 92662, -141375, 40113, 128281, -144625, -415114, -426936]
9478d26936M2681F5259N0046b48872C45282b98918L3672A27247E8985j1533a67718
9466d3178q176l3932B28748h2540j97477a0633A2703b48510F6034b57975a145
9454A5197a0457A65843h3237l0267o1061k10371A6096d70057a60172E6108a87562
9442A17713a88699F7055a96842k51292C102h8113b6671k21769K4087B3804b26331
9430A6284R6404B8133J45681c95283R3488c0429F7656M9275i3001j681l0012j41015
9418b65709e191l68024c343G4401a47301O3935j21527i8015C2457n9J17658b18429
9405a2648A32927m4366h9606A79659F1878a70644j21353k62176a1053l8444B60859
9393c6464j98686M3451C1134R0736i3247A51919l3554a89247c226l8336A89991
$$ y = [-426936, -384255, 65259, 115305, -248872, 345282, -298918, -265246, 127247, 58985, 47452, -167718, -43178, -51354, -85286, 228748, -82540, -280017, -10633, 12703, -248510, 66034, -257975, -1145, 15197, -10457, 165843, -83237, -113504, -174565, -384936, 16096, -470057, -160172, 56108, -187562, 117713, -188699, 67055, -196842, -448134, 3102, -88113, -26671, -248440, -224353, 23804, -226331, 16284, 112688, 28133, 173814, -395283, -301795, -30429, 67656, 116931, -93001, -94682, -124694, -265709, -5191, -373215, -3343, 74401, -147301, -83366, -204893, -98015, 32457, 32398, 150056, -218429, -12648, 132927, 88561, -89606, 179659, 61878, -170644, -291997, -554173, -11053, -49497, 260859, -36464, -235150, -191699, 31134, 121870, -93247, 151919, 118365, -189247, -3226, -41562, 189991]
9381b3157l28250A67516h1632I0862c03530D94095a47920r7909B39309f9774O432
9370f3342A21007d24764d4691B14172a68253e5287j73883L2410n9754J08304r3879
9359b42089P8044g2075K7644l04717d6732r9071e858C7551J99212e7341n1643
9348a08984a3874m7269A53502b47866b8735A95675f7258a0656B51204a44762l16664
9337d61426b1091k74554J37676j76013C9718c20761a01375I7192f2050q7277B9085
9325a29603A63951c6451r7590F96J11315b5161A85037h5302n5645j37991L4701
9314b44237n8922A28205o3681e42419f2127r4810c843j06088K3928d1234j6761
9303e7995H1340c5992B36937J32413b86694A34089b53470a19793A79616c95943
$$ y = [-23157, -351407, 167516, -81632, 90862, -303530, 494095, -147920, -245829, 239309, -69774, -63342, 121007, -424764, -44691, 214172, -168253, -55287, -229170, -196760, -256514, -148210, -242089, -164045, -72075, -44431, -349148, -46732, -145803, -5858, 37551, 236763, -57341, -108984, -13874, -61143, 153502, -247866, -28735, 195675, -67258, -10656, 251204, -144762, -461426, -21091, -295645, -157969, -333982, 39718, -320761, -101375, 97192, -62050, -149327, 29085, -129603, 163951, -36451, -134041, 696, 112011, -25161, 185037, -85302, -140947, -278938, -244237, -303159, 128205, 64524, -542419, -62127, -156937, -3843, -109931, -86003, -41234, -57995, 81340, -35992, 236937, 369350, -286694, 134089, -253470, -119793, 179616, -395943]
9292A14975e7802k124o7609A77417D3442e3417F6841h7876C3878J40560J98781
9281C73219F4560c10519A11529i6045A98267J30915c2022o8751M965m5010F538
9269A85509i9139A78335a33264m71065D3427c19524a7064k0094q2711b6707J2920
9258a3787B29461m6994c7281c492A1891O5414a68975A9796a88454d5818k4064
9247f9882J4889k26987A10361b67889B5830i1110k64200A5412a18203j87083O5313
9236b39973J7910J09607B8127A3566b05186m5089A8069J16912A67a55207g5928
9224B34251g3070o0931K2230b3852j15314e6189A16819a0524l838j94210J8303
9213a90269N7143q4876A46145a21171a7950n0558C5391h0229r2161A63647b38023
$$ y = [114975, -57802, -59926, -127535, 177417, 43442, -53417, 66841, -87876, 33878, 174438, 373219, 64560, -310519, 111529, -96045, 198267, 329182, -32022, -100773, -95808, -140818, 6538, 185509, -99139, 178335, -133264, -604329, 43427, -319524, -17064, -37158, -119869, -26707, -13787, 229461, 182467, -37281, -3492, 11891, 77305, -168975, 19796, -188454, -45818, -69882, -54993, -281980, 110361, -267889, 25830, -91110, -355310, 15412, -118203, -305286, -239973, -222063, -112456, 28127, 13566, -205186, -250275, 18069, 134981, 167, -155207, -75928, 234251, -73070, -134001, -111771, -23852, -139166, -56189, 116819, -10524, -14362, -208572, -190269, -133126, -218002, 146145, -121171, -17950, -68508, 35391, -80229, -172390, 163647, -238023]
9201A54664a09182j20874a4022C1284b20023N7029C8643g7549m9737J8927A18952
9189c4007l4137A64279h4466a9202j93937C0600b0104k19413C8033J69777b21431
9177B52660b3741n132k8740j00081c2553m69306A40926b28032G7202g5938m6495
9166a22433I890J42592Q8494b12368O9745A25929I48d247E121b10932A24924E266
9153A41274l1250b2307j53854M46k51592J34476a41627K2537A13595d3844G3976
9141B59519c7697j71084E228c589D5648b1504E9149b07639d7410B14855b34723
9129e48689b52285C8048c50795A90231B7059c52002a47253j61799J09112E4289
9118b14877L6716N7933l6518j8570c1487l17569D7001b17862C99005b04580B4163
$$ y = [154664, -109182, -230056, -14022, 31284, -220023, -162994, 38643, -77549, -127286, -108359, 118952, -34007, -68144, 164279, -84466, -19202, -213139, 30600, -20104, -239517, 38033, 207810, -221431, 252660, -23741, -28873, -57613, -157694, -32553, -501859, 140926, -228032, 77202, -75938, -122433, 9890, 152482, 240976, -212368, -142623, 125929, 948, -4247, 5121, -210932, 124924, 5266, 141274, 110024, -22307, -176161, -175715, -427307, -292831, -141627, -119090, 113595, -43844, 73976, 259519, -37697, -208781, 5228, -3589, 45648, -21504, 59149, -207639, -47410, 214855, -234723, -548689, -252285, 38048, -350795, 190231, 27059, -352002, -147253, -309052, -199940, 54289, -214877, -178161, -120228, -156746, -175316, -31487, -349056, 47001, -217862, 399005, -204580, 24163]
9106A62048a89228c7953F727a14915m3246B99146a35907m2933B69815r6487m7280
9095A26048b22413r5351H2241a80803h2736l28912i9751j8519p8705A39956b6341
9083H8573I77f0523k44112h8850b3075k11068j18904R6124A23876l5286b89864
9071b83670R2433k3444A05006L82660B15198b76547a18320J358D5321K5286b3538
9059A19312f7362L2503j4308j99586B86333d9260j70795e2636F8029a85238r1703
9048b76941a35514e3827J13G4691a76840b6581j02715g922m6161q533j53499h213
9035e5384j06362P6067I0550B5285M4947i5849m688q963k09757c2891B4195a98730
9022f30919a3320q3460k2995j30352c8730k43130A53991l1462C6698b91257f868
$$ y = [162048, -189228, -37953, 6727, -114915, -158161, 299146, -135907, -178840, 269815, 173328, 126048, -222413, -317764, 82241, -180803, -82736, -411648, -99751, -118270, -196975, 139956, -26341, 88573, 977, -60523, -304635, -88850, -23075, -234143, -353047, -256923, 123876, 88590, -289864, -283670, -191237, -214681, 105006, 487666, 215198, -276547, -118320, -116962, 45321, 70607, -23538, 119312, -67362, -34859, -49167, -248753, 286333, -49260, -220055, -52636, 68029, -185238, -276941, -135514, -53827, -53714, 74691, -176840, -26581, -129296, -7922, -54083, -62616, -216115, -8213, -55384, -161746, -85679, 90550, 25285, 70232, -95849, -100537, -109500, -319257, -32891, 24195, -198730, -630919, -13320, -96780, -119775, -250127, -38730, -281860, 153991, 122529, 36698, -291257, -6868]
9010b982k78440B22599b00019H54a64004G1535b0211l33217H6442a60058B73429
8998b63959h4269c1656o6406K9923j88143o8625B03764c09617P8270q2440A28075
8986A47119c23637A89518r576a65688j21670k12046f0820B28275a62225o2994
8976b25219A98792a31881A67886l1017b71291c2616I9174g5754D3163a69015C5955
8964B69436a10286A82604a85049B8558L6173J28958c0015A68825K82389j70696
8954B80518c3489F7213R1363J05266n2992K65182Q7369G0403K42651j5011A09769
8942D45168A32975B5627L87409P3485j38579q0446L5134D4603d3761F88057k9001
8931F59056K01777C53145K71057K1317C21564r4696L67411j46652A69099L33703
$$ y = [-2982, -281422, 222599, -200019, 854, -164004, 71535, -20211, -353428, 86442, -160058, 273429, -263959, -84269, -31656, -98062, -68139, -256282, -324907, 203764, -309617, -231347, -313787, 128075, 147119, -323637, 189518, 179942, -165688, -287358, -499404, -60820, 228275, -162225, -225219, 198792, -131881, 167886, 136869, -271291, -32616, 99174, -75754, 43163, -169015, 35955, 269436, -110286, 182604, -185049, 28558, 64731, 193689, -30015, 168825, 451214, 280518, -33489, 67213, 158576, 263842, 210850, 476032, 563401, 70403, 313054, 298043, 109769, 445168, 132975, 25627, 413036, 486521, 347942, 267496, 302630, 44603, -43761, 688057, 659056, 860833, 353145, 624202, 645519, 321564, 226868, 594279, 447627, 169099, 502802]
8921E02802l1735J62910j09708M6926j33656j42619L87670k8114q1017j10442
8911D63017m4140j26432p8752J64323j425Q3719K84886n4867k49365J43741A161
8899C11838K11676K079a35844k2248C08599K65345A02143K33683r9434C2132j781
8888C0351K02907n3463e8017A5240c05609G27883G3882c8066a5919B19098a34247
$$ y = [502802, 471067, 633977, 524269, 571195, 437539, 294920, 682590, 654476, 573459, 463017, 418877, 292445, 213693, 378016, 376591, 460310, 745196, 690329, 440964, 584705, 1161, 311838, 523514, 525593, -135844, -158092, 308599, 573944, 102143, 335826, 236392, 32132, 30351, 233258, 179795, -58017, 15240, -305609, 727883, 73882, -38066, -15919, 219098, -134247]
$$ [...]
##END NTUPLES=NMR SPECTRUM
##END=
