##TITLE=AC1611_BRAAN13341_8317122_LOeVKP9LAG
##JCAMPDX= 6.0         $$ Bruker NMR JCAMP-DX V2.0
##DATA TYPE= NMR SPECTRUM
##DATA CLASS= NTUPLES
##ORIGIN= BRUKER
##OWNER= Administrator
$$ 1.72 TOPSPIN		Version 2.1
$$ 2013-11-13 18:06:51.810 -0800  Administrator@X
$$ Compression mode = diff/dup
##.OBSERVE FREQUENCY= 400.02188249412
##.OBSERVE NUCLEUS= ^1H
##.ACQUISITION MODE= SIMULTANEOUS (DQD)
##.ACQUISITION SCHEME= undefined
##.AVERAGES= 8
##.DIGITISER RES= 22
##SPECTROMETER/DATA SYSTEM= spect
##.PULSE SEQUENCE= zg30
##.SOLVENT NAME= COFFEE_meoh
##.SHIFT REFERENCE= INTERNAL, COFFEE_meoh, 1, 14.98509
##AUDIT TRAIL= $$ (NUMBER, WHEN, WHO, WHERE, PROCESS, VERSION, WHAT)
$$ ##TITLE= Audit trail, TOPSPIN		Version 2.1
$$ ##JCAMPDX= 5.01
$$ ##ORIGIN= Bruker BioSpin GmbH
$$ ##OWNER= Administrator
$$ $$ E:\/data/COFFEE/nmr/AC1611_BRAAN13341_8317122_LOeVKP9LAG/10/pdata/1/auditp.txt
$$ ##AUDIT TRAIL=  $$ (NUMBER, WHEN, WHO, WHERE, PROCESS, VERSION, WHAT)
(   1,<2013-11-13 18:06:44.857 -0800>,<Administrator>,<X>,<go>,<TOPSPIN 2.1>,
      <created by zg
	started at 2013-11-13 18:05:38.654 -0800,
	POWCHK enabled, PULCHK disabled,
       configuration hash MD5:
       C8 4E 4E 5D D3 5C D8 9E 9F 52 82 E0 59 8A DE 15
       data hash MD5: 64K
       9B D3 80 F9 A1 2B AE DE 26 D4 78 77 D5 D6 07 30>)
(   2,<2013-11-13 18:06:47.794 -0800>,<Administrator>,<X>,<proc1d>,<TOPSPIN 2.1>,
      <Start of raw data processing
       efp LB = 0 FT_mod = 6 PKNL = 1 PHC0 = 0 PHC1 = 0 SI = 32K 
       data hash MD5: 32K
       B8 D1 58 20 70 3A 7C 6B DC 84 21 82 68 A8 DC 37>)
(   3,<2013-11-13 18:06:48.091 -0800>,<Administrator>,<X>,<proc1d>,<TOPSPIN 2.1>,
      <pk PHC0 = 95.26794 PHC1 = 0 
       data hash MD5: 32K
       62 45 E7 51 7B D5 0A 96 21 0E 37 E4 19 9C F1 C4>)
(   4,<2013-11-13 18:06:48.341 -0800>,<Administrator>,<X>,<proc1d>,<TOPSPIN 2.1>,
      <abs ABSG = 1 
       data hash MD5: 32K
       14 48 EE F6 0B 6E 6B C8 EE 74 81 0F 70 FB 55 AC>)
(   5,<2013-11-13 18:06:48.560 -0800>,<Administrator>,<X>,<proc1d>,<TOPSPIN 2.1>,
      <abs ABSG = 2 
       data hash MD5: 32K
       2B 27 C5 3B 76 D9 88 96 E7 B9 18 DF 89 F9 8A 48>)
(   6,<2013-11-13 18:06:48.747 -0800>,<Administrator>,<X>,<proc1d>,<TOPSPIN 2.1>,
      <abs ABSG = 3 
       data hash MD5: 32K
       0B 02 08 FB 95 61 B2 FE 76 78 33 75 C1 E9 5A A4>)
(   7,<2013-11-13 18:06:48.794 -0800>,<Administrator>,<X>,<proc1d>,<TOPSPIN 2.1>,
      <abs ABSG = 4 
       data hash MD5: 32K
       5A 5C A1 3B 41 96 8E 5F 9B F5 F6 4B 5F 5A B8 95>)
(   8,<2013-11-13 18:06:48.841 -0800>,<Administrator>,<X>,<proc1d>,<TOPSPIN 2.1>,
      <abs ABSG = 5 
       data hash MD5: 32K
       49 98 99 EE FA 1C 78 25 A8 1C 5E 48 E0 BB 94 04>)
$$ ##END=
$$ 
$$ $$ hash MD5
$$ $$ 96 EA 71 D8 E7 85 94 1D DD 44 23 AD 8F 47 C1 24
##$RELAX= 
##$RELAX= 
##$RELAX= 
##$RELAX= 
##$RELAX= 
##$RELAX= 
##$RELAX= 
$$ Bruker specific parameters
$$ --------------------------
##$DU= <E:\>
##$EXPNO= 10
##$NAME= <AC1611_BRAAN13341_8317122_LOeVKP9LAG>
$$ [...]
##$TP= (0..7)
150 150 150 150 150 150 150 150
##$TP07= 0
##$TPNAME0= <>
##$TPNAME1= <>
##$TPNAME2= <>
##$TPNAME3= <>
##$TPNAME4= <>
##$TPNAME5= <>
##$TPNAME6= <>
##$TPNAME7= <>
##$TPOAL= (0..7)
0.5 0.5 0.5 0.5 0.5 0.5 0.5 0.5
##$TPOFFS= (0..7)
0 0 0 0 0 0 0 0
##$TUNHIN= 0
##$TUNHOUT= 0
##$TUNXOUT= 0
##$USERA1= <user>
##$USERA2= <user>
##$USERA3= <user>
##$USERA4= <user>
##$USERA5= <user>
##$V9= 5
##$VALIST= <valist>
##$VCLIST= <CCCCCCCCCCCCCCC>
##$VD= 0
##$VDLIST= <DDDDDDDDDDDDDDD>
##$VPLIST= <PPPPPPPPPPPPPPP>
##$VTLIST= <TTTTTTTTTTTTTTT>
##$WBST= 1024
##$WBSW= 4
##$XGAIN= (0..3)
0 0 0 0
##$XL= 0
##$YL= 0
##$YMAX_a= 643057
##$YMIN_a= -544697
##$ZGOPTNS= <>
##$ZL1= 120
##$ZL2= 120
##$ZL3= 120
##$ZL4= 120
##$ABSF1= 14.98509
##$ABSF2= -5.573092
##$ABSG= 5
##$ABSL= 3
##$ALPHA= 0
##$AQORDER= 0
##$ASSFAC= 0
##$ASSFACI= 0
##$ASSFACX= 0
##$ASSWID= 0
##$AUNMP= <proc_prof1d_extract_pilot.lims>
##$AXLEFT= 0
##$AXNAME= <>
##$AXNUC= <1H>
##$AXRIGHT= 0
##$AXTYPE= 0
##$AXUNIT= <>
##$AZFE= 0.1
##$AZFW= 0.1
##$BCFW= 0
##$BC_mod= 0
##$BYTORDP= 0
##$COROFFS= 0
##$CY= 15
##$DATMOD= 1
##$DC= 0
##$DFILT= <>
##$DTYPP= 0
##$F1P= 0
##$F2P= 0
##$FCOR= 0.5
##$FTSIZE= 32768
##$FT_mod= 6
##$GAMMA= 0
##$GB= 0
##$INTBC= 1
##$INTSCL= 1
##$ISEN= 128
##$LB= 0
##$LEV0= 0
##$LPBIN= 0
##$MAXI= 10000
##$MC2= 0
##$MEAN= 0
##$ME_mod= 0
##$MI= 0
##$NCOEF= 0
##$NC_proc= -8
##$NLEV= 6
##$NOISF1= 0
##$NOISF2= 0
##$NSP= 0
##$NTH_PI= 0
##$NZP= 0
##$OFFSET= 14.98509
##$PC= 1
##$PHC0= 95.26794
##$PHC1= 0
##$PH_mod= 1
##$PKNL= yes
##$PPARMOD= 0
##$PPDIAG= 0
##$PPIPTYP= 0
##$PPMPNUM= 2147483647
##$PPRESOL= 1
##$PSCAL= 4
##$PSIGN= 0
##$PYNMP= <proc.py>
##$REVERSE= no
##$SF= 400.02
##$SI= 32768
##$SIGF1= 0
##$SIGF2= 0
##$SINO= 400
##$SIOLD= 32768
##$SPECTYP= <>
##$SREGLST= <1H.CDCl3>
##$SSB= 0
##$STSI= 32768
##$STSR= 0
##$SW_p= 8223.68421052631
##$SYMM= 0
##$S_DEV= 0
##$TDeff= 65536
##$TDoff= 0
##$TI= <>
##$TILT= no
##$TM1= 0
##$TM2= 0
##$TOPLEV= 0
##$USERP1= <user>
##$USERP2= <user>
##$USERP3= <user>
##$USERP4= <user>
##$USERP5= <user>
##$WDW= 1
##$XDIM= 32768
##$YMAX_p= 455072417
##$YMIN_p= -756310
##$CURPLOT= <Network HP LaserJet P1505>
##$CURPRIN= <$Network HP LaserJet P1505>
##$DFORMAT= <normdp>
##$LAYOUT= <+/1D_H.xwp>
##$LFORMAT= <normlp>
##$PFORMAT= <normpl>
##$SURQMSG= 1
$$ End of Bruker specific parameters
$$ ---------------------------------
##NTUPLES= NMR SPECTRUM
##VAR_NAME=  FREQUENCY,     SPECTRUM/REAL,   SPECTRUM/IMAG
##SYMBOL=    X,             R,               I
##VAR_TYPE=  INDEPENDENT,   DEPENDENT,       DEPENDENT
##VAR_FORM=  AFFN,          ASDF,            ASDF
##VAR_DIM=   32768,         32768,           32768
##UNITS=     HZ,            ARBITRARY UNITS, ARBITRARY UNITS
##FACTOR=    0.250966925370066, 1,           1
##FIRST=     8223.43324360094, -118245,      -31123
##LAST=      0,             -143112,         -78224
##MIN=       0,             -756310,         0
##MAX=       8223.43324360094, 455072417,    0
$$ Real data points
##PAGE= N=1
##DATA TABLE= (X++(R..R)), XYDATA
$$ [...]
19546A74125h1896E5184A7923e334B11010J3124a31030K6132L6848j05800e533
$$ 174125 -81896 55184 17923 -5334 211010 224134 -131030 -104898 -68050 -173850 -5533
19534h069r0629j70768c0458C6297a908D7548J59805F7619a70061C52876F705
$$ -8069 -98698 -269466 -30458 36297 -1908 47548 207353 67619 -170061 352876 6705
19522b26869J02853B49323a34629n3584L5437D03738D8162a89150f3227B45893
$$ -226869 -124016 249323 -134629 -188213 -152776 403738 48162 -189150 -63227 245893
19511A16091a35609M8620B6526h79C45341a3792j81944B9323a80326B9055b6593
$$ 116091 -135609 -86989 26526 -879 345341 -13792 -195736 29323 -180326 29055 -26593
19499A15414a40953A12156d9100F7645g9643I3147d08467g4196L4484A33854a14588
$$ 115414 -140953 112156 -49100 67645 -79643 93147 -408467 -74196 -39712 133854 -114588
19487i072k87063b0394k0347B374b32124C4965a90100r5069J36357C55a077F1623
$$ -9072 -296135 -20394 -40741 2374 -232124 34965 -190100 -285169 -148812 355 -1077 61623
19474b13787G0576O7803k2790a6034j09662A06199e6818C7451a88084l8258l3131
$$ -213787 70576 138379 115589 -16034 -125696 106199 -56818 37451 -188084 -226342 -259473
19463b59473a13533A43995a93926B69894a14050m267A16564A0311b56314A3504
$$ -259473 -113533 143995 -193926 269894 -114050 -118317 116564 10311 -256314 13504
19452A37784a33844C22872c0564j4299C04368E9510a79307L6087A9319L65680
$$ 137784 -133844 322872 -30564 -44863 304368 59510 -179307 -143220 19319 384999
19442C84999a73250o069b007o500k14112R3754J0241c5051e364k45180g0248m2239
$$ 384999 -173250 -179319 -2007 -8507 -222619 -128865 -118624 -35051 -5364 -250544 -70248 -112487
19430a12487q413k67337Q1359J26869j79104I1250K03437b21241H1435a19902
$$ -112487 -120900 -388237 -306878 -180009 -359113 91250 294687 -221241 81435 -119902
19419a16358M4219j27492N6442m4602j25655g4093C73972a6581B17667r5878p565
$$ -116358 -72139 -199631 -143189 -187791 -313446 -74093 373972 -16581 217667 121789 114224
19408A14224h7846J9578k04572c2047D1291b55118J17301C384c85138a24883m8309
$$ 114224 -87846 -68268 -272840 -32047 41291 -255118 -137817 3384 -385138 -124883 -173192
19397a73192G3049a28144j11802a04438K9668j55782A55476O3140a18849A30347
$$ -173192 73049 -128144 -239946 -104438 -74770 -230552 155476 218616 -118849 130347
19386c73004a19027j07915C13768b9977J1281k83791r3635A39924C6487a62460
$$ -373004 -119027 -226942 313768 -29977 -18696 -302487 -396122 139924 36487 -162460
19375b88028I4645i4971A49123a34668A17865n4776b11387H5461l0536L0465a24073
$$ -288028 94645 -94971 149123 -134668 117865 63089 -211387 85461 54925 85390 -124073
19363a77016o2971A22155b01941M2616C0814P3456a4192r1786r8823C2206d11436
$$ -177016 -239987 122155 -201941 -159325 30814 104270 -14192 -105978 -204801 32206 -411436
19351c00688P5877Q3405j91456a24094e7315A38214b35003i9206d0741f24l7059
$$ -300688 -224811 -141406 -332862 -124094 -57315 138214 -235003 -99206 -40741 -624 -37683
19340c7683j58102j5048G7778a68833Q1137j40593H791N7250c2173j21374c0088
$$ -37683 -195785 -210833 77778 -168833 -87696 -228289 8791 66041 -32173 -153547 -30088
19328a14583A08991J38252j11770D5973A4053f3935H501d74744F8938J5043a77855
$$ -114583 108991 247243 135473 45973 14053 -63935 8501 -474744 68938 83981 -177855
19316a42794c3209j11048k2186C14574j53718o9801b2988j17806K9829J5953l1858
$$ -142794 -33209 -144257 -166443 314574 160856 91055 -22988 -140794 -110965 -95012 -126870
19305a26870L2601k8957n2004m1916Q4774I381J01133N4262b14846J9616p7277
$$ -126870 -94269 -123226 -175230 -217146 -132372 9381 110514 164776 -214846 -195230 -272507
19294b72507N9478A9214a02453A21029o67J17083g1846F2947A1897b00360k08708
$$ -272507 -213029 19214 -102453 121029 120362 237445 -71846 62947 11897 -200360 -409068
19283d09068m0375I5353d9060k32775i0239b2732j82071B30538a26697i280j19535
$$ -409068 -449443 95353 -49060 -281835 -90239 -22732 -204803 230538 -126697 -9280 -128815
19272a28815M0522r3161c1056M942A45254d30317A95142d6761j5194j56617D0406
$$ -128815 -88293 -181454 -31056 -26114 145254 -430317 195142 -46761 -61955 -218572 40406
19260a91817d0093C39473c7728j26263P5985j21742d3405j00879f2250B72299
$$ -191817 -40093 339473 -37728 -163991 -88006 -209748 -43405 -144284 -62250 272299
19249A6992C399b06733D2613h1909H7473a89241J947b9127A04535b05428i6272
$$ 16992 3399 -206733 42613 -81909 87473 -189241 -187294 -29127 104535 -205428 -96272
19237C0408L47351b10760A02145A6737a71586I1641b04926B52511N0028b7799
$$ 30408 377759 -210760 102145 16737 -171586 91641 -204926 252511 302539 -27799
19226e4495J1114B07992A00568f477D4916J04575J53074P0274f1696K5357j70273
$$ -54495 -43381 207992 100568 -6477 44916 149491 302565 372839 -61696 -36339 -206612
19215b06612o4011P7441l9603f5871g391j83766b1012m38750C049a04262d1544
$$ -206612 -270623 -193182 -232785 -65871 -7391 -191157 -21012 -459762 3049 -104262 -41544
19203C6908N1494b80761c5768j9590A76466b2341R527k7053k47984a30801n2871
$$ 36908 88402 -280761 -35768 -55358 176466 -22341 -12814 -39867 -287851 -130801 -183672
19192a83672d8622j30474k5721B2270a90526L7871k63516d4143l46861e6609J6467
$$ -183672 -48622 -179096 -204817 22270 -190526 -152655 -416171 -44143 -391004 -56609 -40142
19181d0142o8277D2911a52076j32997a38793k4294G2267a73752g4115j09943a5477
$$ -40142 -108419 42911 -152076 -285073 -138793 -163087 72267 -173752 -74115 -184058 -15477
19169A6327D482b6490r7357A10220C0621a49225j48366b7300j17607j1288A4650
$$ 16327 4482 -26490 -123847 110220 30621 -149225 -297591 -27300 -144907 -156195 14650
19157g4346l07956a77955B03198b53754C57126A6421b5628j65646K8636k9502
$$ -74346 -382302 -177955 203198 -253754 357126 16421 -25628 -191274 -162638 -192140
19147a92140N0739A09470e9283A79727G4066a83872Q5290B74556C9104J05034
$$ -192140 -141401 109470 -59283 179727 74066 -183872 -98582 274556 39104 144138
19137A44138D7638a98007F6934J63663F7121i2990A23891d4165m49806a05094
$$ 144138 47638 -198007 66934 230597 67121 -92990 123891 -44165 -493971 -105094
19126a46175j70389A83434G7783J29811a02008k9143O0248j73912B83632j26386
$$ -146175 -316564 183434 77783 207594 -102008 -131151 -70903 -244815 283632 157246
19116A57246a20660g0G1602h0312m6911q7555B12541d4923D9480J04711a63900
$$ 157246 -120660 -70 71602 -80312 -127223 -214778 212541 -44923 49480 154191 -163900
19104b59781b3824j67684J3630F4426b4758E4756a24962k1012k04701J18010P3145
$$ -259781 -23824 -191508 -177878 64426 -24758 54756 -124962 -145974 -350675 -232665 -159520
19093a59520j86401h2314A09921A5775J34177C7226J15204b10346H951a65764
$$ -159520 -345921 -82314 109921 15775 149952 37226 152430 -210346 8951 -165764
19082a53839j0457q7821h5428q2496A04908b83242p9370e8948m5581A19647B0010
$$ -153839 -164296 -252117 -85428 -167924 104908 -283242 -362612 -58948 -104529 119647 20010
19070c43722A41530c4401A04531J93258a72681H5835b1945l7677l2854k17901
$$ -343722 141530 -34401 104531 297789 -172681 85835 -21945 -59622 -92476 -310377
19060c10377m9928F8254a63246j42673h080j88746f3911A86254A1670m631J95244
$$ -310377 -360305 68254 -163246 -305919 -8080 -196826 -63911 186254 11670 7039 202283
19049B02283b28264E7767b40256e6276p4578k3178N4698j50807e9661G4291J41781
$$ 202283 -228264 57767 -240256 -56276 -130854 -154032 -99334 -250141 -59661 74291 216072
19038B16072b16460a8144B9423a6153k63958H1750O0787J6262J06473j05152o8094
$$ 216072 -216460 -18144 29423 -16153 -280111 81750 142537 158799 265272 160120 92026
19027I2026e1117B9641b24862L8347F57741A64351J3153J67133a03769A16212
$$ 92026 -51117 29641 -224862 -186515 657741 164351 177504 344637 -103769 116212
19016B36954d3542j88220k0067j9701B7881b08154a03711M9808k97928A94356
$$ 236954 -43542 -231762 -251829 -271530 27881 -208154 -103711 -53903 -351831 194356
19005H2908c36162g681k09592K2776B0461d5238k8405p7099A01732b5998j6296
$$ 82908 -336162 -7681 -217273 -194497 20461 -45238 -73643 -150742 101732 -25998 -42294
18994d2294B3658Q197a81298N893f4966A42712G925h3617j2537d0746k8215F3669
$$ -42294 23658 31855 -181298 -175405 -64966 142712 7925 -83617 -96154 -40746 -68961 63669
18981c30835B8335b89679A70378a2687m09363Q1240A14399a45795k92902b04221
$$ -330835 28335 -289679 170378 -12687 -422050 -340810 114399 -145795 -438697 -204221
18970c4279j02341C50168g3922k02366f7037B04869f0469n22296b6739j17334
$$ -34279 -136620 350168 -73922 -276288 -67037 204869 -60469 -582765 -26739 -144073
18960a44073b5962A38217a09605G3827e9830j8564j66072A76615A7922a96057
$$ -144073 -25962 138217 -109605 73827 -59830 -78394 -244466 176615 17922 -196057
18949I06J68302a06398G4206a51997B7348J43152h7529p8547P8072L743F7107
$$ 906 169208 -106398 74206 -151997 27348 170500 -87529 -166076 -88004 -84261 67107
18937d0945k53652b4714A98643a15270q328C3956c0780B90788F7567K03658B14
$$ -40945 -294597 -24714 198643 -115270 -123598 33956 -30780 290788 67567 271225 214
18925A0818L0081N8114B8781a46605L5681r50B2166K60609D4513a06327A18075
$$ 10818 40899 99013 28781 -146605 -110924 -111874 22166 282775 44513 -106327 118075
18913a58448j60980B6707b61206P4343n2314d7139B48225L7273f3387o1003L7740
$$ -158448 -319428 26707 -261206 -186863 -239177 -47139 248225 285498 -63387 -124390 -86650
18902h6650C7663c60203J12852J4726m7095H6199l4691a6803B82181e8558A39503
$$ -86650 37663 -360203 -247351 -232625 -279720 86199 51508 -16803 282181 -58558 139503
18890a02829E7694c01123A57217a72588A37441K7452J00962c24239J29725D0942
$$ -102829 57694 -301123 157217 -172588 137441 164893 265855 -324239 -194514 40942
18879c45853a8122f860B12940p0460a74967A05204c7431q511B42561a5171k74558
$$ -345853 -18122 -6860 212940 142480 -174967 105204 -37431 -45942 242561 -15171 -289729
18868b89729f5930j01760N7593A05914N5001D8360c69071A83649q9279a9731A3393
$$ -289729 -65930 -167690 -110097 105914 160915 48360 -369071 183649 94370 -19731 13393
18856a69884A49047h5485K0041j52176C01277e1888p1458B02983E7855k7058M41150
$$ -169884 149047 -85485 -65444 -217620 301277 -51888 -123346 202983 57855 30797 471947
18845D71947i5924D755b55107b4663B23591a19145l5260f9002D8505A0462P2557
$$ 471947 -95924 4755 -255107 -24663 223591 -119145 -154405 -69002 48505 10462 83019
18834H3019h8898n0818J9305L6918A10075A4254K5612a57475B41961b00991N4180
$$ 83019 -88898 -139716 -120411 -83493 110075 14254 39866 -157475 241961 -200991 -146811
18823a46811C1042L7648J17524J47702C109a30087C15771g2243B62578a22699
$$ -146811 31042 68690 186214 333916 3109 -130087 315771 -72243 262578 -122699
18812D22500a28463C10697N5849A13608k5432C8520K72123A46957D3846a7097
$$ 422500 -128463 310697 366546 113608 88176 38520 310643 146957 43846 -17097
18801A37400E9588L7501K9694B2163a95167B05908h8617k40286C9757j1992d15429
$$ 137400 59588 97089 126783 22163 -195167 205908 -88617 -328903 39757 27765 -415429
18789c47580J30673C02575A30425d4122j82930j1611Q765d4243j04582k00472
$$ -347580 -216907 302575 130425 -44122 -227052 -238663 -229898 -44243 -148825 -349297
18779c49297b0682j64896B27786e56387I4114g0358c4871B04967D6544e9090F5836
$$ -349297 -20682 -185578 227786 -556387 94114 -70358 -34871 204967 46544 -59090 65836
18767I0621b53855A01200b79931C6864J30933G0243b94330C5448A5889d6550k00001
$$ 90621 -253855 101200 -279931 36864 167797 70243 -294330 35448 15889 -46550 -246551
18756b46551B43841C289f9342c1512B51435a73919A14466b39482e5133l04077
$$ -246551 243841 3289 -69342 -31512 251435 -173919 114466 -239482 -55133 -359210
18746c59210B48325f3385l12146B38445a71294g1840B09096a87589f0330B16689
$$ -359210 248325 -63385 -375531 238445 -171294 -71840 209096 -187589 -60330 216689
18735g4248l459l8906j80241B54199A05254a13430k654h955k46515J04110D9331
$$ -74248 -77707 -116613 -296854 254199 105254 -113430 -116084 -8955 -255470 -151360 49331
18723c49241J33355P7652D89859a53789j52902A75036b30891K3392E6725a49651
$$ -349241 -215886 -138234 489859 -153789 -306691 175036 -230891 -207499 56725 -149651
18712C8836J9034c9493B12087a13012A21168b82763K742R9544j5634M5394e4484
$$ 38836 57870 -39493 212087 -113012 121168 -282763 -280021 -180477 -196111 -150717 -54484
18700a72565B12857a21185B49328q1182D5865c13511A01623a9400A52843D9746
$$ -172565 212857 -121185 249328 168146 45865 -313511 101623 -19400 152843 49746
18689d33694J89727i7883C6900a31372L4819H104c9857H3586b8952j46731B03521
$$ -433694 -243967 -97883 36900 -131372 -96553 8104 -39857 83586 -28952 -175683 203521
18677a34952A33519a83607B3768c27714a7246B88243A43610c269B40559b29715
$$ -134952 133519 -183607 23768 -327714 -17246 288243 143610 -3269 240559 -229715
18666A55224J12118d8819A21293m3919e5695j4729A14810e7822l83943B2152d01289
$$ 155224 267342 -48819 121293 77374 -55695 -70424 114810 -57822 -441765 22152 -401289
18654a16678l0495A25234a09358j07463h8761k37218B55596i7481o2396C16100
$$ -116678 -147173 125234 -109358 -216821 -88761 -325979 255596 -97481 -159877 316100
18643E7905b89201a24442G5252a06735n4178A17766a59320A83769l2792D2661
$$ 57905 -289201 -124442 75252 -106735 -160913 117766 -159320 183769 150977 42661
18632A73855a96717K7743M7834K7639j84256f7177a3738H0395P4564c00729f8331
$$ 173855 -196717 -168974 -121140 -93501 -277757 -67177 -13738 80395 154959 -300729 -68331
18620E91J07274a86798N7123l6589a5109j07383c025l44081a69105E8161a72889
$$ 591 107865 -186798 -129675 -166264 -15109 -122492 -3025 -347106 -169105 58161 -172889
18608i6641j2891j00999E41084B03344l1359n8885b63345k55425J79707A94579
$$ -96641 -109532 -210531 541084 203344 171985 113100 -263345 -518770 -339063 194579
18597B22417p0613f4942j82173A4857j040a10935l9574A11688b01701f676n0360
$$ 222417 151804 -64942 -247115 14857 13817 -110935 -150509 111688 -201701 -6676 -57036
18586e7036j89419n1031P7452B91815D7676K02044b99320I1614b496j44111g1324
$$ -57036 -246455 -297486 -220034 291815 47676 249720 -299320 91614 -2496 -146607 -71324
18574g1667C38095a89395C2725J03472c73440a16528m010C85719A08120e65F279
$$ -71667 338095 -189395 32725 136197 -373440 -116528 -120538 385719 108120 -565 6279
18562B5833K8486c6292q6277J9693A11253E2466K17026n4821f3047k96373D2523
$$ 25833 54319 -36292 -122569 -102876 111253 52466 269492 214671 -63047 -359420 42523
18550b15884A55798Q0300a20279J6452A87182a90323h8121j60050r8202a47362
$$ -215884 155798 236098 -120279 -103827 187182 -190323 -88121 -248171 -346373 -147362
18539I9569l25K5540J33958a06161b9306B35856a94743O0599k450c6141k60482
$$ 99569 99244 124784 258742 -106161 -29306 235856 -194743 -134144 -136594 -36141 -296623
18528b96623A02495k2817h9663B4402a16675k3979k663f8702A42983c18036p9366
$$ -296623 102495 79678 -89663 24402 -116675 -140654 -143317 -68702 142983 -318036 -397402
18517c97402C5503h6094j5478A4748h3517B38177b29932A95867a25648B73362
$$ -397402 35503 -86094 -101572 14748 -83517 238177 -229932 195867 -125648 273362
18506b03964l7478b167A9041d4218B2191K4092A9584i9663F1563c16315A0478
$$ -203964 -241442 -2167 19041 -44218 22191 46283 19584 -99663 61563 -316315 10478
18494a75333H9980l6066K2065a89283A65340M6812d79427I1944f6715k5176L0157
$$ -175333 89980 53914 75979 -189283 165340 212152 -479427 91944 -66715 -91891 -61734
18483f1734q8819J1203a9516B732J23561e9047A98414p2008c54671E8337J58189
$$ -61734 -150553 -139350 -19516 2732 126293 -59047 198414 126406 -354671 58337 216526
18472B16526q6822J55448d21771C1991O9763a42232A71079b53417L5959g3702
$$ 216526 129704 285152 -421771 31991 101754 -142232 171079 -253417 -217458 -73702
18461g2255I4674J00653a56231f9215L47B2069J1808L73970a18104q4788O85o6032
$$ -72255 94674 195327 -156231 -69215 -68868 22069 33877 407847 -118104 -202892 -202207 -268239
18449b68239J22111A8170J77401B2267L4017c30103A14570a66833k89546D17073
$$ -268239 -146128 18170 195571 22267 56284 -330103 114570 -166833 -456379 417073
18438a41203B23552g0909F8641h7765n4879L8515A58811i9499K9082C8661K36513
$$ -141203 223552 -70909 68641 -87765 -142644 -104129 158811 -99499 -70417 38661 275174
18427B75174b03842i9657p1952f1633A05636b81797m2316E2288a0676C44646d0530
$$ 275174 -203842 -99657 -171609 -61633 105636 -281797 -324113 52288 -10676 344646 -40530
18415A63900h1514L272k5365A5302a08510o3907F3537c0225l67634J57845D01027
$$ 163900 -81514 -78242 -103607 15302 -108510 -172417 63537 -30225 -397859 -240014 401027
18403D646N5800d15652f4470G2443e589F311K9213L8029C1755a41139I2590a83977
$$ 4646 60446 -415652 -64470 72443 -5589 6311 35524 73553 31755 -141139 92590 -183977
18390B98882D9036c98940K3833B9563J04271b07474A1537J27678k0189J32602
$$ 298882 49036 -398940 -375107 29563 133834 -207474 11537 139215 119026 251628
18380B51628b41968R4439K131q0013e5810K4251j78182B9633e3394I729c21956
$$ 251628 -241968 -147529 -145398 -225411 -55810 -31559 -209741 29633 -53394 9729 -321956
18368a64417B08791K1852D214b10443j48335A06743b5428H7359K04683C0573a99211
$$ -164417 208791 230643 4214 -210443 -358778 106743 -25428 87359 292042 30573 -199211
18356a65878k38521A08173e7607l5773A80883H0958M2237d5752C2470J8021J45311
$$ -165878 -404399 108173 -57607 -93380 180883 80958 123195 -45752 32470 50491 195802
18345A95802c5325E5000q861h5883j9903A954a75397c5272p3188j40161O2634
$$ 195802 -35325 55000 46139 -85883 -105786 1954 -175397 -35272 -108460 -248621 -185987
18334a85987B24227a37965B89302o7402b06520l2898b6703C25387p1395A6891
$$ -185987 224227 -137965 289302 221900 -206520 -239418 -26703 325387 253992 16891
18323B96132a19949H2942M0664g065l33043A72105c56565A01186K76510F9123
$$ 296132 -119949 82942 123606 -7065 -340108 172105 -356565 101186 377696 69123
18312d93251B10072a85923P8476N1862k69321i6695G208Q5514d6876J4280A1881
$$ -493251 210072 -185923 -107447 -55585 -324906 -96695 7208 92722 -46876 -32596 11881
18300b55473A1735J0121g9025K8583o8779k4125D8924c69418f4432A12688a08011
$$ -255473 11735 21856 -79025 -50442 -119221 -143346 48924 -369418 -64432 112688 -108011
18288e6618A15841h4281B02153a99830B04570J84125g059I0707a34738d143l17357
$$ -56618 115841 -84281 202153 -199830 204570 388695 -7059 90707 -134738 -4143 -321500
18277c21500k5920a49278l4236I1309f1734k1821k594j49394E241a13987N6992
$$ -321500 -347420 -149278 -183514 91309 -61734 -83555 -86149 -235543 5241 -113987 -56995
18266e6995D0670N75643a78648C0309N1082c22586G5555K65158d43721A76311
$$ -56995 40670 616313 -178648 30309 81391 -322586 75555 340713 -443721 176311
18255I045O2948b90441b1937o3738k5198A0246M13651d0794p4319p7084Q6110
$$ 9045 71993 -290441 -21937 -85675 -110873 10246 423897 -40794 -115113 -192197 -106087
18244a06087C60128e0555a3270p6223A97827j4267M4031i618A12077L04748g4869
$$ -106087 360128 -50555 -13270 -89493 197827 183560 227591 -9618 112077 416825 -74869
18232e151n6175k05393G8664b3086A59930O0327c31561a19745C14167a20298p897
$$ -5151 -61326 -266719 78664 -23086 159930 220257 -331561 -119745 314167 -120298 -128195
18221a28195D60443d0946G7623l7709L2459J16346b64083O1364Q9123j2831B7439
$$ -128195 460443 -40946 77623 39914 72373 188719 -264083 -202719 -113596 -126427 27439
18209A02785Q9785a84168A02770b26570C07185f0070K9889l90662A22288J12701
$$ 102785 192570 -184168 102770 -226570 307185 -60070 -30181 -420843 122288 234989
18199B34989a22159M0798j75775J25245A40785a50485j56238a37410k07068N5446
$$ 234989 -122159 -81361 -257136 -131891 140785 -150485 -306723 -137410 -344478 -289032
18189b89032B18982e5628k60882a43451i212j64870j35184a40305A05129a39985
$$ -289032 218982 -55628 -316510 -143451 -9212 -174082 -309266 -140305 105129 -139985
18178b5953D0638a2413k36938a03475j41357B291a16816J4899I074a06218C00249
$$ -25953 40638 -12413 -249351 -103475 -244832 2291 -116816 -101917 9074 -106218 300249
18166I2894J48516A15328N2412e96289e9785E8746r601b09205E8794P1292f8324
$$ 92894 241410 115328 167740 -596289 -59785 58746 49145 -209205 58794 130086 -68324
18154f6099A92658H4296J21231i0646J5081j18578k0447P0992b6112C7196J1321
$$ -66099 192658 84296 205527 -90646 -75565 -194143 -214590 -143598 -26112 37196 48517
18143D8517M4478b31044M4751B22970a05891r9872G5493C765a43383k36748b1902
$$ 48517 92995 -231044 -186293 222970 -105891 -205763 75493 3765 -143383 -380131 -21902
18131b69294C32P7901b01706a00264H3593C5155J24935D0824e6921k3975A55410
$$ -269294 332 78233 -201706 -100264 83593 35155 160090 40824 -56921 -80896 155410
18119F5078D036K26135e58945B62046B5810a32460m7541B78808A10566F46f0869
$$ 65078 4036 230171 -558945 262046 25810 -132460 -180001 278808 110566 646 -60869
18107a61088L752A1588h0483D6109b55286f5707A50780a65750B271d40314f8955
$$ -161088 -157336 11588 -80483 46109 -255286 -65707 150780 -165750 2271 -440314 -68955
18095h8521A12844g3999A4044a56986A8671g56310b04840B9733J28542G6894a7372
$$ -88521 112844 -73999 14044 -156986 18671 -756310 -204840 29733 158275 76894 -17372
18083d3262o6567j09718D0691L32236a10843B2461J30197P762a29412r0677E7666
$$ -43262 -109829 -219547 40691 372927 -110843 22461 152658 160420 -129412 -220089 57666
18071C16714b41464A19290a20721I2802k656K44540j52585a64167H1660g8726
$$ 316714 -241464 119290 -120721 92802 90146 334686 182101 -164167 81660 -78726
18060A25724m1133K10229f7769B06489a20404A47297b88691j1205a38364A03792
$$ 125724 84591 294820 -67769 206489 -120404 147297 -288691 -299896 -138364 103792
18049I9766c58584M5960g2819A71977b13532B8252a89996Q6175B59833F1678l677
$$ 99766 -358584 -312624 -72819 171977 -213532 28252 -189996 -103821 259833 61678 58001
18038E8001b09083A31262m6935a43069q1949d4554p7000B67383D8429k1087K28859
$$ 58001 -209083 131262 84327 -143069 -225018 -44554 -121554 267383 48429 27342 256201
18027B56201F3349d21571A49895a23132D24192n1678A31051b82985A20630b09786
$$ 256201 63349 -421571 149895 -123132 424192 372514 131051 -282985 120630 -209786
18016A9435c9530A9281a03070k12112g8253A94751b40788R4642e3304F6939K08588
$$ 19435 -39530 19281 -103070 -315182 -78253 194751 -240788 -146146 -53304 66939 275527
18005B75527b17656F7349P2382P6495a04222A65012b09255D14501F6269e5874
$$ 275527 -217656 67349 139731 216226 -104222 165012 -209255 414501 66269 -55874
17994f2603j40449D7626b46600B11736b03470d8668l0415k9834A78023J2220r804
$$ -62603 -203052 47626 -246600 211736 -203470 -48668 -79083 -108917 178023 190243 180439
17983A80439a20872F29361i7770B74742i3341q4233d5233k68686D2174K0644R1379
$$ 180439 -120872 629361 -97770 274742 -93341 -177574 -45233 -313919 42174 62818 154197
17972A54197A3957K66579r2778b57220B57460a16818G7215a94407C4925j0481
$$ 154197 13957 280536 187758 -257220 257460 -116818 77215 -194407 34925 24444
17962B4444m114P5413a4173C7020a90865b0891E7852L12573b49950a10880j84555
$$ 24444 20330 95743 -14173 37020 -190865 -20891 57852 370425 -249950 -110880 -295435
17951b95435A8930c9408j8383B02324e2874o9672A85089a11290C84558I9673a22815
$$ -295435 18930 -39408 -57791 202324 -52874 -122546 185089 -111290 384558 99673 -122815
17939i4832A59926p8290k1077a07866A70444M3515b93100A43751D7220a72757
$$ -94832 159926 81636 60559 -107866 170444 213959 -293100 143751 47220 -172757
17928E0151K05921D8513O4595c2549l954C4457M6808N9812j5488P0230a35588
$$ 50151 256072 48513 113108 -32549 -36503 34457 81265 141077 125589 195819 -135588
17916a55765f5153A85309C6072J84081c52619B16383b36520C50098C8530J30988
$$ -155765 -65153 185309 36072 220153 -352619 216383 -236520 350098 38530 169518
17906A69518g7055k72097A3200J91462f3823B4196b2781l48376A24143b00112
$$ 169518 -77055 -349152 13200 204662 -63823 24196 -22781 -371157 124143 -200112
17895h4415j12837A73210p0692d7067D9772a19259A2733c7966A61581b65149C2137
$$ -84415 -197252 173210 102518 -47067 49772 -119259 12733 -37966 161581 -265149 32137
17883a58088M6244A13629J05352a77343n4420H8140m3902L0562a08469k57201
$$ -158088 -111844 113629 218981 -177343 -231763 88140 44238 74800 -108469 -365670
17873c65670a75468e757n30047i9228I5573L4858c22309C9710f7126A0073P9464
$$ -365670 -175468 -5757 -535804 -99228 95573 130431 -322309 39710 -67126 10073 89537
17862H9537a74714C75422A19211a67080C5341N175K8414e7008F932a02309o0019
$$ 89537 -174714 375422 119211 -167080 35341 40516 68930 -57008 6932 -102309 -162328
17851a62328b5884B16854b65604b299j96999c8872m1648m7471N3520A2783J62274
$$ -162328 -25884 216854 -265604 -2299 -199298 -38872 -80520 -127991 -74471 12783 175057
17840A75057n30a21061N8152m8650A65520J17191a82943g9204A19129Q210h7644
$$ 175057 174527 -121061 -62909 -111559 165520 282711 -182943 -79204 119129 127339 -87644
17828I0110K13554a67700C8018J31680B0333a29490A06867b58999L7867E8536
$$ 90110 303664 -167700 38018 169698 20333 -129490 106867 -258999 -221132 58536
17817G6403O9563L1419f6662D2397J88762Q1109A20489K04964A54626C8403a28590
$$ 76403 145966 177385 -66662 42397 231159 312268 120489 325453 154626 38403 -128590
17805d7606B65207j886c56937H2426d6678j72059B109J7571a15717I1508d1333
$$ -47606 265207 263321 -356937 82426 -46678 -218737 2109 19680 -115717 91508 -41333
17793b9760k028I151D338a36063E4638g9919k58186G1588f4487E3790d01419R1566
$$ -29760 -31788 9151 4338 -136063 54638 -79919 -338105 71588 -64487 53790 -401419 -309853
17781c09853A16430c2394j70841C7380J98316i1985A10609E221a19813B00627
$$ -309853 116430 -32394 -203235 37380 235696 -91985 110609 5221 -119813 200627
17770B395a22109j43779f0153A8468b3602f889E3291r814a65546j85342A76058
$$ 2395 -122109 -265888 -60153 18468 -23602 -6889 53291 43477 -165546 -350888 176058
17758B55080R2379e0144A2959b29448R3832q6429K935D50443H4953a79794b9508
$$ 255080 347459 -50144 12959 -229448 -135616 -222045 -219110 450443 84953 -179794 -29508
17746C3536J88529A04106f7415j0260j93900i4343B08421J2201q6820a8943C73918
$$ 33536 222065 104106 -67415 -77675 -271575 -94343 208421 220622 133802 -18943 373918
17734d1048A76934n8782M7458e7156b5078j01152A70909R577E1006N1390b52120
$$ -41048 176934 118152 165610 -57156 -25078 -126230 170909 180486 51006 102396 -252120
17722h9258k6380l76716i650j74040H0157g5355j01159Q2106k19465G11c0996
$$ -89258 -115638 -492354 -9650 -183690 80157 -75355 -176514 -94408 -313873 711 -30996
17710a23585A15656b8312j24009A08630P4169n2324b07498A81497A3480P6979
$$ -123585 115656 -28312 -152321 108630 182799 130475 -207498 181497 13480 90459
17700I0459J90545m2b65542H3307h8218F2545A4679L30034b91808a24388B25764
$$ 90459 281004 280962 -265542 83307 -88218 62545 14679 344713 -291808 -124388 225764
17688A16714N8400J32636c03207A91296F1781F861K60648I8896J48975E7799B7297
$$ 116714 175114 307750 -303207 191296 61781 6861 267509 98896 247871 57799 27297
17676A2655J83660m9334F7685a48095d7720A75739C2363J82041a15770r1108B3961
$$ 12655 196315 146981 67685 -148095 -47720 175739 32363 214404 -115770 -206878 23961
17664C6681L20165C9787a49374F5307p386a0070B79244D7034c515B6527K72712
$$ 36681 356846 39787 -149374 65307 57921 -10070 279244 47034 -3515 26527 299239
17653B99239A19222J11378A08645K3762a12687d4374D1651c2356j1715A98011
$$ 299239 119222 230600 108645 132407 -112687 -44374 41651 -32356 -44071 198011
17642B57243j314J6917j25400B0239L8529j6872O2825P9125b91584A04156B2508
$$ 257243 255929 272846 147446 20239 58768 41896 104721 183846 -291584 104156 22508
17630B21001N4698m535a81386A89668J46930B2701a51297J4347G88Q1103j7520
$$ 221001 275699 271164 -181386 189668 336598 22701 -151297 -136950 788 81891 64371
17619F4371I460a28731a1685A02429i752C1242J72453F1528A8968c02084d3339
$$ 64371 9460 -128731 -11685 102429 -9752 31242 203695 61528 18968 -302084 -43339
17607B49334A10962P1617E326J7929J97328G165e068A8457i8029A99271c31618
$$ 249334 110962 182579 5326 23255 220583 7165 -5068 18457 -98029 199271 -331618
17595b82960M8707C0833a9332p0974j365B5545a2894B4533a19122m411j47596
$$ -282960 -234253 30833 -19332 -90306 -91671 25545 -12894 24533 -119122 -123533 -271129
17584b71129B90242a0139F0037J07132o6421Q81b81344B61754h0157k18604D9063
$$ -271129 290242 -10139 60037 167169 100748 101629 -281344 261754 -80157 -298761 49063
17572a05552O556J8106A05992E947J66125a03835B04549G5834B7585P5870e3927
$$ -105552 -98996 -80890 105992 5947 172072 -103835 204549 75834 27585 103455 -53927
17560A9845i579n1110A71176a7283A10230J29819e532q016A28534a27375A86179
$$ 19845 -9579 -60689 171176 -17283 110230 240049 -5532 -13548 128534 -127375 186179
17548B29253A5779O5202K23644b64922g1910o066D20790A2633J11695l4393c9435
$$ 229253 15779 80981 304625 -264922 -71910 -77976 420790 12633 124328 89935 -39435
17536B40826g9940A09961L9714p1679e2590I5338b0546C00071A19674Q1318K37680
$$ 240826 -79940 109961 149675 77996 -52590 95338 -20546 300071 119674 200992 438672
17525D38672r0176j04069a08771b828D55300J2916f1616k00448D7615J09329D0712
$$ 438672 348496 244427 -108771 -2828 455300 468216 -61616 -262064 47615 156944 40712
17513D097a74018O0521R110A28708f8468D72291b8235H9907a4495A42922P5846
$$ 4097 -174018 -113497 -104387 128708 -68468 472291 -28235 89907 -14495 142922 218768
17502B18768G44b31524J8349R5568C72166j69144L0929F4213M14225H3644J76764
$$ 218768 744 -231524 -213175 -117607 372166 203022 233951 64213 478438 83644 260408
17491B60408k7532I571J48259C7172a26581B45839P8479I0149c4035p8065j2425
$$ 260408 232876 9571 157830 37172 -126581 245839 324318 90149 -34035 -112100 -124525
17480a24525F2659K83777o8846d703A35446J13015A2205L12990j45906J3633C2339
$$ -124525 62659 346436 277590 -4703 135446 248461 12205 325195 179289 192922 32339
17468b37770A36032c9698F490L09210m2447a03870K4749B11708F1296K57537j37638
$$ -237770 136032 -39698 6490 315700 273253 -103870 -79121 211708 61296 318833 181195
17457A81195j6165J3805F871J93847H1160b6421A73711J44662B0729K80068J66800
$$ 181195 165030 178835 6871 200718 81160 -26421 173711 318373 20729 300797 467597
17446D67597r7049j46357J88749A19993n9837a54019A12993M68480j92233G9166
$$ 467597 370548 224191 412940 119993 60156 -154019 112993 581473 389240 79166
17435A89097J59497A42405R1751B2431K8781j1190K48311I9959b31696B23118
$$ 189097 348594 142405 234156 22431 51212 40022 288333 99959 -231696 223118
17424A90586o6284l3116K97738A27876P0016K95005j82359J00636j19617K46582
$$ 190586 124302 91186 388924 127876 197892 492897 310538 411174 291557 538139
17414E38139A95532a86791I9849M14890o9148A28043K66476a72873a0617A93829
$$ 538139 195532 -186791 99849 514739 445591 128043 394519 -172873 -10617 193829
17403B91752a77604A86629q8603a033o9246j6360n263F1009J96263R4157A2347
$$ 291752 -177604 186629 98026 -1033 -70279 -86639 -91902 61009 257272 351429 12347
17391A13446N9999D4884J35036l4945l8385D4655K98722g7559C59082J10591A85647
$$ 113446 173445 44884 179920 144975 106590 44655 343377 -77559 359082 469673 185647
17379B25547J43186D9658L53402a61322G1428c37642G7740j5025L83334A99201
$$ 225547 368733 49658 403060 -161322 71428 -337642 77740 62715 446049 199201
17368B04408A6980R7758l288J8788J31872c1734A7085m35J07913k0064J87528
$$ 204408 16980 114738 111450 130238 262110 -31734 17085 16650 124563 104499 292027
17357B92027K330h040A93571H8265h8582B31168J03019A60900N904a97184C6155
$$ 292027 294357 -8040 193571 88265 -88582 231168 334187 160900 166804 -197184 36155
17345F4067L0943K02248C9905M0119J66328B2831a5337A47096l5415M33830a8523
$$ 64067 95010 297258 39905 80024 246352 22831 -15337 147096 111681 545511 -18523
17333C44647f0341B70529f5351J333I8683O808a60779B65533r2497R6188o2609
$$ 344647 -60341 270529 -65351 -64018 98683 105491 -160779 265533 173036 269224 206615
17322B06615E649J83638o5712h6273D9720J56971p439E8266J15271Q3248r2649
$$ 206615 5649 189287 123575 -86273 49720 206691 199252 58266 173537 256785 164136
17311A64136a1713A57276a72923B2862e3276G6084M08996F4070k9367K33758C4412
$$ 164136 -11713 157276 -172923 22862 -53276 76084 485080 64070 34703 268461 34412
17299a36655A41913D4226N68591B15235M5307G7885K33240A10627J31362J34045
$$ -136655 141913 44226 612817 215235 260542 77885 311125 110627 241989 376034
17289C76034P462D7584K27243D9251K92282N0167j30426N1260H5105L51099j38840
$$ 376034 383496 47584 274827 49251 341533 391700 261274 312534 85105 436204 297364
17278B97364a7776C74677g9726A78983J47870r6162a25219B78620J01067E6142
$$ 297364 -17776 374677 -79726 178983 326853 230691 -125219 278620 379687 56142
17267C6236L42521F8553J09110c2977I9213e5537A83960M8339J55757b397A42018
$$ 36236 378757 68553 177663 -32977 99213 -55537 183960 232299 388056 -2397 142018
17255C91927A08536K38226F1361J09704K2612J2595J27539j3860E079a04557A78633
$$ 391927 108536 346762 61361 171065 193677 206272 333811 319951 5079 -104557 178633
17243b35762C59281k6139I1282k6737k5866Q6312J07426G9896K34791j46223p9629
$$ -235762 359281 333142 91282 64545 38679 124991 232417 79896 314687 168464 88835
17232H8835J1909c5981B94537Q2879n1572j372K1231r4596D9697O7546J49890
$$ 88835 100744 -35981 294537 377416 325844 324472 345703 251107 49697 117243 267133
17221B67133I9016O8494D9361N713A3200J99910l1069J57080J4665N4055N6113
$$ 267133 99016 167510 49361 55074 13200 213110 182041 339121 353786 407841 463954
17210D63954A85123P5420g6695E08985E6922M04928q4778O5831b0099F4713J15185
$$ 463954 185123 260543 -76695 508985 56922 461850 377072 442903 -20099 64713 179898
17199A79898J48376i6411A29435J89490A21600L35725A84084k0259M13803A03491
$$ 179898 328274 -96411 129435 318925 121600 457325 184084 163825 577628 103491
17188F16579B35526R8787F6459K58715B7665M05883I4265P0324J19806J9071H7920
$$ 616579 235526 334313 66459 325174 27665 433548 94265 164589 284395 303466 87920
17176I2890L54032A35699Q9250M26126C03551J19976B424L87428J68480A54188
$$ 92890 446922 135699 224949 651075 303551 423527 2424 389852 558332 154188
17165D35885A84908C998L47855E3188K16987J42095A08347J66642j01099c3337
$$ 435885 184908 3998 351853 53188 270175 412270 108347 274989 173890 -33337
17154B54429L19940m5186k57409J73588j03302J42182p6024J15720j68949A21876
$$ 254429 574369 529183 271774 445362 342060 484242 408218 523938 354989 121876
17143A28033N1062J57309j11443K4878R2881J0012o031R1211A69160R2167l1340
$$ 128033 179095 336404 224961 249839 342720 352732 346701 437912 169160 261327 229987
17132B29987L61024k1515j39816j1743A99745J36536K08879p6235k4438j52576
$$ 229987 591011 569496 429680 417937 199745 336281 545160 468925 444487 291911
17122B91911A25135J28458H7421J38795N95285C54967q1992J63915J49049B71459
$$ 291911 125135 253593 87421 226216 821501 354967 272975 436890 585939 271459
17111A34942K64938j54452L17768R474E0544h9384C05009L14864B37938J02885
$$ 134942 399880 245428 563196 572670 50544 -89384 305009 619873 237938 340823
17101C40823e4933C91133m6698N6256J11217n2287J94855l04490K2048N2448J36391
$$ 340823 -54933 391133 344435 400691 511908 459621 654476 349986 372034 424482 560873
17090E60873B75890j15835M94096j49833J48668J06296l22969Q9517n6193q8064
$$ 560873 275890 160055 654151 504318 652986 759282 436313 525830 469637 381573
17080C81573I1765J99579I0323L55592l3690J22085j71123j59493L71502k8900
$$ 381573 91765 291344 90323 445915 412225 534310 363187 203694 575196 546296
17070E46296K85742A25013K35443O0830J63565o369B28652J52912J296o7744M17154
$$ 546296 832038 125013 360456 421286 584851 578482 228652 381564 382860 315116 732270
17059G32270k95996N39948B13451K25758M28409l44067j18100J12690n5135B02081
$$ 732270 436274 976222 213451 439209 867618 523551 405451 518141 463006 202081
17048C76399j47921M20048B43147K06372L30158o0366l48622J84014N7000k09690
$$ 376399 228478 648526 243147 449519 779677 719311 370689 554703 611703 402013
17038D02013L16569k16867Q8362k28182J67740J60213j19454j4133p691L42603
$$ 402013 718582 501715 590077 361895 529635 689848 570394 556261 548570 891173
17028H91173k53824j83562K60512K9078P0490O7150m04495N48870E02026q8104
$$ 891173 637349 453787 714299 743377 813867 881017 476522 1025392 502026 413922
17018D13922K59195Q544o5012N2472J02725C36308M14876j70441J91411o3620
$$ 413922 673117 681661 616649 669121 771846 336308 751184 580743 772154 708534
17008G08534N5576l27049M13737L9400q5365L2384j82856L42536j78039J1974
$$ 708534 764110 437061 850798 890198 804833 837217 654361 996897 818858 830832
16998H30832k68522L90616l23436J59999l43467L44403k87956K24484L1317J36565
$$ 830832 562310 952926 629490 789489 446022 790425 502469 726953 758270 894835
16988H94835l83941K14024J70960J49778k54527m4619j81499P3448J53223J8009
$$ 894835 510894 724918 895878 1045656 791129 746510 565011 638459 791682 809691
16978H09691k27518L35823j32241L07901j50168m16209K24027J1813J36624j04537
$$ 809691 582173 917996 785755 1093656 943488 527279 751306 763119 899743 795206
16968G95206N5754j37973N00874l25189P2879K79010k09760r9645K01376L02K0656
$$ 795206 850960 712987 1213861 888672 961551 1240561 1030801 931156 1132532 1132834 1153490
16957A153490j51310j96098J64535L37174l68310m1346K10295N9193l86458J75619
$$ 1153490 1002180 806082 970617 1307791 939481 898135 1108430 1167623 781165 956784
16947I56784O1491J54649l03027L25554l84214K89786o1307l3422J17910K62456
$$ 956784 1018275 1172924 869897 1195451 811237 1101023 1039716 1006294 1124204 1386660
16937A386660r4759j55147k80058K97404M7428j24064L1033k63657M36650P2611
$$ 1386660 1291901 1136754 856696 1154100 1201528 1077464 1108497 844840 1281490 1354101
16927A354101k43908J91420J76789q2192r4995j15480J38474L49177k54725M4453
$$ 1354101 1110193 1301613 1478402 1396210 1301215 1185735 1324209 1673386 1418661 1463114
16917A463114k9581K34867j56150J29594j48815R4235l1201j81387L81444p8411
$$ 1463114 1433533 1668400 1512250 1641844 1493029 1587264 1556063 1374676 1756120 1677709
16907A677709n8813j83542O6127j08530J44187Q8890J86424j13238q1784N3427
$$ 1677709 1618896 1435354 1501481 1392951 1537138 1626028 1812452 1699214 1617430 1670857
16897A670857k38604N38831q4748n3034k31226j4622M39549J22384j98946k38022
$$ 1670857 1432253 1971084 1886336 1833302 1602076 1587454 2027003 2149387 1950441 1712419
16887A712419J92928L05010k68434J07224l25982K19710k7862P8900J71324r3558
$$ 1712419 1905347 2210357 1941923 2049147 1723165 1942875 1915013 1993913 2165237 2071679
16877B071679O42079n31144m7120L50588k52069J59926k25470K19982k81345L84820
$$ 2071679 2713758 2182614 2135494 2486082 2234013 2393939 2168469 2388451 2107106 2491926
16867B491926m1685M9360P6356j04288k2204P9971J16125J40629l48188M91438
$$ 2491926 2450241 2499601 2575957 2471669 2449465 2529436 2645561 2786190 2438002 2929440
16857B929440J31201l12442J89910L5406j93645J73888J8287l95719O13058j77114
$$ 2929440 3060641 2748199 2938109 2973515 2779870 2953758 2972045 2576326 3189384 3012270
16847C012270N15288n63534N05615l82101J88465J41164J07929r2393k08781L75903
$$ 3012270 3527558 2964024 3469639 3087538 3276003 3417167 3525096 3432703 3223922 3599825
16837C599825L34445m06597K80390J91552J39490n06484M53982j98961M67332
$$ 3599825 3934270 3527673 3808063 3999615 4139105 3632621 4086603 3887642 4354974
16828D354974k73144O27727m46568J85273k4804K15961k76643O37713O4435K56178
$$ 4354974 4081830 4709557 4262989 4448262 4423458 4639419 4362776 5000489 5064924 5321102
16818E321102k95176L70680J23578p329l03251K95494O7928L03881J67566j05804
$$ 5321102 5025926 5396606 5520184 5512855 5209604 5505098 5573026 5876907 6044473 5938669
16808E938669M15081j06864K65479K07129O7439j56727L10805L15038M34797l88517
$$ 5938669 6353750 6246886 6512365 6719494 6786933 6630206 6941011 7256049 7690846 7302329
16798G302329N12270K88479O3701J86065K61414l6206L35056N5323N16824J17248
$$ 7302329 7814599 8103078 8166779 8352844 8614258 8578052 8913108 8968431 9485255 9602503
16788I602503L35592r1945O17432M3822M72698j5086N36780J42731O99824R1473
$$ 9602503 9938095 9846150 10463582 10507404 10980102 10965016 11501796 11644527 12344351 12435824
16778A2435824K35211L72701M77630P60708L29810L57123M91406N63090N36911
$$ 12435824 12671035 13043736 13521366 14282074 14611884 14969007 15460413 16023503 16560414
16769A6560414M73018M11145M23821R91002L47780Q06778N72754R36738P18941
$$ 16560414 17033432 17444577 17868398 18859400 19207180 20013958 20586712 21523450 22242391
16760B2242391R63269O18750J375712R68033Q92873J035618J103730J445449J295514
$$ 22242391 23205660 23824410 25200122 26168155 27061028 28096646 29200376 30645825 31941339
16751C1941339J632321J499269J395683J820988K031362J707688K340990K094734
$$ 31941339 33573660 35072929 36468612 38289600 40320962 42028650 44369640 46464374
16743D6464374K390275K582775K837115K952008L084101L255173L632649M125480
$$ 46464374 48854649 51437424 54274539 57226547 60310648 63565821 67198470 71323950
16735G1323950M089427M354782M695920N377517N246909N110508O601809O243713
$$ 71323950 75413377 79768159 84464079 89841596 95088505 100199013 106800822 113044535
16727A13044535O758051P193956O930285P248713P485153P016340P074324O780773
$$ 113044535 119802586 126996542 133926827 141175540 148660693 155677033 162751357 169532130
16719A69532130O078490N252782M697212L671374K402859J271209J21055j218412
$$ 169532130 175610620 180863402 185560614 189231988 191634847 192906056 193027111 191808699
16711A91808699k411064l938569m445549n520459o076862o895638p218492p461296
$$ 191808699 189397635 185459066 181013517 175493058 169416196 162520558 155302066 147840770
16703A47840770p602254p115782p738503p017749o922589o158627o275170n714976
$$ 147840770 140238516 133122734 125384231 118366482 111443893 105285266 99010096 93295120
16695I3295120n922040n084070m830317m744026m020167m057318l216879l614454
$$ 93295120 87373080 82289010 77458693 72714667 68694500 64637182 61420303 57805849
16687E7805849l306919k872223k700832k753595j868463k476743k035853j817726
$$ 57805849 54498930 51626707 48925875 46172280 44303817 41827074 39791221 37973495
16679C7973495j879797k001584j287996j776765r66498j771374j126722r64492
$$ 37973495 36093698 34092114 32804118 31027353 30060855 28289481 27162759 26198267
16671B6198267o91231j280208j538629q52671q46040o31280n12272j138560m99668
$$ 26198267 25507036 24226828 22688199 21835528 20989488 20358208 19845936 18707376 18207708
16662A8207708n20251p12351q16863l74069n36860n17521m03411o69698k32765
$$ 18207708 17687457 16975106 16158243 15784174 15247314 14729793 14326382 13656684 13423919
16653A3423919n22083m50494l94641l80211j59073k73707p07929m2280n45816
$$ 13423919 12901836 12451342 12056701 11676490 11517417 11243710 10535781 10493501 9947685
16644I947685j84011o3844o63497J09530l93054k38723k99038j36665j29179k47031
$$ 9947685 9763674 9699830 9036333 9145863 8752809 8514086 8215048 8078383 7949204 7702173
16634G702173Q0873k45093n57561M13885o65285L20421n58234j39287j91257k37646
$$ 7702173 7783046 7537953 6980392 7394277 6728992 7049413 6491179 6351892 6160635 5922989
16624E922989q9737J23646k01008k11335J48559m27559L10754m82804n7985L7790
$$ 5922989 5833252 5956898 5755890 5544555 5693114 5265555 5576309 5093505 5035520 5073310
16614E073310m61909J87163k77357l9182K03200k96604j77806k48179K57870l60677
$$ 5073310 4611401 4798564 4521207 4482025 4685225 4388621 4210815 3962636 4220506 3859829
16604C859829K43430k09255j31765j33567N3915K73687k49100l09458q9743L2710
$$ 3859829 4103259 3894004 3762239 3628672 3682587 3956274 3707174 3397716 3307973 3340683
16594C340683r0279N5473j71792O3028P8859m18330K37303m27867M35712m09427
$$ 3340683 3250404 3305877 3134085 3197113 3275972 2857642 3094945 2667078 3102790 2693363
16584B693363K16261o7786j56818J06338k02700o4847J55661k53899J34595p4193
$$ 2693363 2909624 2841838 2685020 2791358 2588658 2523811 2679472 2425573 2560168 2485975
16574B485975k29606j27039j84810K83723j69193J0006m7216j28774l8607M07161
$$ 2485975 2256369 2129330 1944520 2228243 2059050 2069056 2021840 1893066 1854459 2261620
16564B261620k91318q6244j24L22161k65825l11012L44611J92029j65142m64400
$$ 2261620 1970302 1884058 1883934 2206095 1940270 1629258 1973869 2165898 2000756 1536356
16554A536356L43978l43140o1858K21744K16655k05134j15010k5097j91013O7095
$$ 1536356 1880334 1537194 1475336 1697080 1913735 1708601 1593591 1568494 1377481 1444576
16544A444576P7844n7695K19046j38199R7522J65689k60819j20024J95683l93721
$$ 1444576 1522420 1464725 1683771 1545572 1643094 1808783 1547964 1427940 1623623 1229902
16534A229902J68526J91736m4521k85201K1128j13647J09227N1575k63507O6382
$$ 1229902 1398428 1590164 1545643 1260442 1281570 1167923 1277150 1328725 1065218 1131600
16524A131600J61464j2665l0324l0115K15715k89564L71955j46537m12179K1666
$$ 1131600 1293064 1280399 1250075 1219960 1435675 1146111 1518066 1371529 959350 981016
16514I81016k00602m1807K74406J08804J90446n78803L72024j82165P452J37317
$$ 981016 780414 738607 1013013 1121817 1312263 733460 1105484 923319 930771 1068088
16504A068088P3885j22553l65329M15218r8836j27445J12440p7448K09832m56442
$$ 1068088 1141973 1019420 654091 1069309 970473 843028 955468 878020 1087852 631410
16494F31410K71881M8068M1915j98941J15533j57088j26551M79454m94394L09832
$$ 631410 903291 951359 993274 794333 909866 752778 626227 1105681 611287 921119
16484I21119r2090k94112r8304O31830l97581J1748B99571O40403m06741O59321
$$ 921119 829029 534917 436613 1068443 670862 682610 299571 939974 533233 1192554
16474A192554m38727O5963j30963k4156P6766j88767J76950C53920L13472J34127
$$ 1192554 753827 819790 688827 664671 741437 552670 729620 353920 667392 801519
16464H01519p5093K79470D54826L10503L3448k04913J11175j87617L40732l62230
$$ 801519 726426 1005896 454826 765329 798777 593864 705039 517422 858154 495924
16454D95924M92855l30727k25299j3429k04433K92004m0087Q9084A38357N00970
$$ 495924 988779 658052 432753 419324 214891 506895 466808 555892 138357 639327
16444F39327Q2404k37622k34765N66914k63431r4745j14672q5939J64920r9260
$$ 639327 721731 484109 249344 816258 552827 458082 343410 257471 422391 323131
16434C23131J04615K8752l5135A87227K53042j99176L35155k62510J88337R0902
$$ 323131 427746 456498 421363 187227 440269 241093 576248 313738 502075 592977
16424E92977q9355n822j40342q5030J97011L15189C24158j57337F6818M26320
$$ 592977 503622 497800 357458 272428 469439 784628 324158 166821 66818 493138
16414D93138K46983k10576r3172J91189p5015j64944j01891R7442j61643J40162
$$ 493138 740121 529545 436373 627562 552547 387603 285712 383154 221511 361673
16404C61673P3236K0744j69505K34146j0655m7194A9956M58408D2159L25926j25332
$$ 361673 434909 455653 286148 520294 509639 462445 19956 478364 42159 368085 242753
16393B42753J70954L42594k49695k27046I475L81355A77982J39555j15792k9733
$$ 242753 413707 756301 506606 279560 9475 390830 177982 317537 201745 172012
16383A72012L77926B48327j21822Q333J86789M807N0461A80416R3501o0867J30715
$$ 172012 549938 248327 126505 134838 321627 326434 376895 180416 273917 213050 343765
16372C43765k6452J53590C9990a95112A96891m4017N3253k2428K91283m129k00524
$$ 343765 317313 470903 39990 -195112 196891 152874 206127 183699 474982 470853 270329
16361B70329h946l7537E3779J9551l1904L06891n1514J00957A58961B3911L74273
$$ 270329 -8946 -46483 53779 73330 41426 348317 296803 397760 158961 23911 398184
16350C98184K97586l00108Q0988k10684k5612A04865K7534D0560J92605J67651
$$ 398184 695770 395662 476650 265966 240354 104865 132399 40560 233165 400816
16340D00816m2462A01085K84302A07765a30067A21863K00247N6335o4543Q4076
$$ 400816 358354 101085 385387 107765 -130067 121863 322110 378445 313902 397978
16330C97978k687E3179J7405N8878J09960A05909D8602K08207N3911A52118K39541
$$ 397978 395291 53179 70584 129462 239422 105909 48602 256809 310720 152118 391659
16319C91659j76181e8459C17166j2203q9921r9867K5624M703f1581A45530o7869
$$ 391659 215478 -58459 317166 304963 215042 115175 140799 145502 -61581 145530 77661
16308G7661M3736n1147c6228J4302m6665I4005j9224b21057E8498J24172m5379
$$ 77661 121397 70250 -36228 -21926 -68591 94005 74781 -221057 58498 182670 137291
16297A37291a04043b1237k04466B8451P5539J08269J46168A1576a56623c1340
$$ 137291 -104043 -21237 -225703 28451 103990 212259 358427 11576 -156623 -31340
16286h2490h825o3934A77801b8096D90056b1450A22085R1618N1863F2867I396
$$ -82490 -8825 -72759 177801 -28096 490056 -21450 122085 213703 265566 62867 9396
16274C31844q1142a05605D8610J47253o0585L64472H4702K07526f806C24334k5202
$$ 331844 250702 -105605 48610 195863 135278 499750 84702 292228 -6806 324334 299132
16263B99132o6878I342a3684C60886f4624G3644L32766d8783C7433b5126G0935
$$ 299132 232254 9342 -13684 360886 -64624 73644 406410 -48783 37433 -25126 70935
16251h3564j45253C12857a7898D0662O2711R7799q8196j1542J03882a67079b0755
$$ -83564 -228817 312857 -17898 40662 103373 201172 112976 101434 205316 -167079 -20755
16239b19036C34864M9882b87222d9232l1918A87066a6751D63471A0576g3961F12160
$$ -219036 334864 384746 -287222 -49232 -81150 187066 -16751 463471 10576 -73961 612160
16227a51537G8203a11742C6845M13635A10089b41485f5263p1587B6888g9368B71737
$$ -151537 78203 -111742 36845 450480 110089 -241485 -65263 -136850 26888 -79368 271737
16215A37826K2566O1925a49726C40013C8866J56659F8162K72889h7894A03765
$$ 137826 160392 222317 -149726 340013 38866 195525 68162 341051 -87894 103765
16204i4298A24393B4799K86823a44514j44242B92855a37j07303F3833J39802Q0654
$$ -94298 124393 24799 311622 -144514 -288756 292855 -137 -107440 63833 203635 284289
16193B84289E2121J2708N598P925l3767J71785H0780a35884H907K34329g1629
$$ 284289 52121 64829 70427 78352 44585 216370 80780 -135884 8907 243236 -71629
16181A38208J32024o7634m6063e7028e405n4748I884J72117H7567b7140C65071
$$ 138208 270232 202598 156535 -57028 -5405 -60153 9884 182001 87567 -27140 365071
16169G0431k8238K0400L9252a60339a6993I05J11969M4015h4909A86714o8104
$$ 70431 42193 62593 101845 -160339 -16993 905 112874 156889 -84909 186714 118610
16158A18610J84070F3564a00113d5748A1429J33544J58731A36480f4786p6352
$$ 118610 302680 63564 -100113 -45748 11429 144973 303704 136480 -64786 -141138
16148a41138D6838L02478i4090K6082A71473b27669L7966i886B7612J78078a0288
$$ -141138 46838 349316 -94090 -68008 171473 -227669 -189703 -9886 27612 205690 -10288
16136A73930d18687J32553A48907a93353A94176a41521j0088A21543G834K158
$$ 173930 -418687 -286134 148907 -193353 194176 -141521 -151609 121543 7834 9992
16126I992a73886g2635K1F695L21097N6004A49124b19156j3732e2845F7653a17574
$$ 9992 -173886 -72635 -72614 6695 327792 383796 149124 -219156 -232888 -52845 67653 -117574
16113a30263q3358j99549B5403O489d13091A92673q6674K04457b05893h858A44691
$$ -130263 -213621 -413170 25403 31892 -413091 192673 105999 310456 -205893 -8858 144691
16101I8305M15275B14920D62a68284B5405K0788J43753a09252B6219L24245a43610
$$ 98305 513580 214920 462 -168284 25405 46193 189946 -109252 26219 350464 -143610
16089C94810H2657J43779a54187B40760A6089d5834F5904a39149b6402j43741
$$ 394810 82657 226436 -154187 240760 16089 -45834 65904 -139149 -26402 -170143
16079a70143B8796R9657a87893D6471K81619e8025j6697k43058b4988B34072o1042
$$ -170143 28796 128453 -187893 46471 328090 -58025 -74722 -317780 -24988 234072 173030
16068A73030a17157C05680A20525J25797a99479C6149f6473A29328F1585a62983
$$ 173030 -117157 305680 120525 246322 -199479 36149 -66473 129328 61585 -162983
16057a56279B15450b92070O5159P648B55765c71027c1421b610k16440H0490A8225
$$ -156279 215450 -292070 -226911 -219263 255765 -371027 -31421 -2610 -219050 80490 18225
16045a85076F4160J36142A7518d050E90N0941c89224d4031j55058L7960B33596
$$ -185076 64160 200302 17518 -4050 590 51531 -389224 -44031 -199089 -161129 233596
16033F6593L61891b47877A8209J28093a70015n1697b0416A1836a05179B67284
$$ 66593 428484 -247877 18209 146302 -170015 -221712 -20416 11836 -105179 267284
16022A0278L7941P7867F0969g5463A88123L8938a86468C39062j48284n8890F3193
$$ 10278 48219 126086 60969 -75463 188123 227061 -186468 339062 190778 131888 63193
16010e5508B77075c23575a01677A05394a35439C1936a32771N2579j52073J07106
$$ -55508 277075 -323575 -101677 105394 -135439 31936 -132771 -80192 -232265 -125159
16000a25159j52711A85171a71744l5012K4301A44656g4552I9055c46306B52786
$$ -125159 -277870 185171 -171744 -206756 -182455 144656 -74552 99055 -346306 252786
15989D9842a06616A87162b56400I6679c9562I7481J88995K36493j46749D4816
$$ 49842 -106616 187162 -256400 96679 -39562 97481 286476 522969 376220 44816
15978I1611e3728j23591J9426A83083C0182c28866B98425b5193E2606a15288A29822
$$ 91611 -53728 -177319 -157893 183083 30182 -328866 298425 -25193 52606 -115288 129822
15966f6368B70801o2346b26610b3976B2365J78436A5537c53082g8526A94015c19986
$$ -66368 270801 208455 -226610 -23976 22365 200801 15537 -353082 -78526 194015 -319986
15954b9842a3004l8762F0564i2682b3682l2800B5507b79869h1998k06738A18466
$$ -29842 -13004 -51766 60564 -92682 -23682 -56482 25507 -279869 -81998 -288736 118466
15942a17558j19507h0414l8000j48432f7214B6847b56414B9353J63624J22527
$$ -117558 -237065 -80414 -118414 -266846 -67214 26847 -256414 29353 192977 315504
15932C15504G5461P9413l8643b99846g5766p828D0241K60125b73124l1438f4965
$$ 315504 75461 154874 116231 -299846 -75766 -83594 40241 300366 -273124 -304562 -64965
15920g7083D2152a70863G04i3957B03330o5752D1968j2008j2061a74843A75674
$$ -77083 42152 -170863 704 -93957 203330 137578 41968 29960 17899 -174843 175674
15908g58j89122I5021a92002c0546B11549b8002m7725J6419n1711A60695b61807
$$ -758 -189880 95021 -192002 -30546 211549 -28002 -75727 -59308 -111019 160695 -261807
15896f9560j96008A96198o6287c02886f7794A29247c57114E4772K717d5789r8567
$$ -69560 -265568 196198 129911 -302886 -67794 129247 -357114 54772 57489 -45789 -144356
15885a44356F8479N0454a8438B5710a8940B87706E6193b66372A22513d0281j69801
$$ -144356 68479 118933 -18438 25710 -18940 287706 56193 -266372 122513 -40281 -210082
15874b10082P9892F0048a4230j72942O4360L3469j69994A10712Q9972r8116r17
$$ -210082 -130190 60048 -14230 -187172 -122812 -89343 -259337 110712 200684 102568 101651
15863A01651R7662a7412m8487c1526K751j99013H6615j8138a0493j25747A18976
$$ 101651 199313 -17412 -65899 -31526 -28775 -227788 86615 68477 -10493 -136240 118976
15851d06789A7599h1268b086C04199F4663a23251I5187b730k69541k17600b3694
$$ -406789 17599 -81268 -2086 304199 64663 -123251 95187 -2730 -272271 -489871 -23694
15839a32265d4529I7964g8509p0741B50953r7097c03658b9182B16220C7111K45863
$$ -132265 -44529 97964 -78509 -149250 250953 153856 -303658 -29182 216220 37111 282974
15828B82974b6447G726a70167p0952A60362P4843N4213D6273R2846c7187r5874
$$ 282974 -26447 7726 -170167 -241119 160362 235205 289418 46273 139119 -37187 -133061
15817a33061q218F3482F038b9371j92304q1006a00980c9592a8521o0846B01370
$$ -133061 -141279 63482 6038 -29371 -221675 -302681 -100980 -39592 -18521 -79367 201370
15805b63260J13309B73695a57089I816J29425C4822a72213e7290a0641k72347
$$ -263260 -149951 273695 -157089 9816 139241 34822 -172213 -57290 -10641 -282988
15795b82988j988B2098a86736A63631a77908f0708k1322B35761F5361b7516A07817
$$ -282988 -284976 22098 -186736 163631 -177908 -60708 -82030 235761 65361 -27516 107817
15783a038m4643k81980A68041c36241A56539k5014a84056b2849B15464C455e8198
$$ -1038 -45681 -327661 168041 -336241 156539 131525 -184056 -22849 215464 3455 -58198
15771e8711F4265b6415j68734j19974D56716a45463p1855e8504j57821M018e0848
$$ -58711 64265 -26415 -195149 -315123 456716 -145463 -217318 -58504 -216325 -212307 -50848
15759A66751A258K21593I9891N4868d8259B19761r922F9968K52405G8760Q1147
$$ 166751 1258 222851 99891 154759 -48259 219761 209839 69968 322373 78760 159907
15748A59907D9413P1662a63024L6747m280G0667e4060A32769k3739J98704a87377
$$ 159907 49413 121075 -163024 -126277 -130557 70667 -54060 132769 109030 307734 -187377
15736C5728b74694m362R5802A10973a30109k37377h9167A17367C0298b07290F0802
$$ 35728 -274694 -279056 -183254 110973 -130109 -367486 -89167 117367 30298 -207290 60802
15724B68236G5344j4333b61350q5660a22107q8561A71465a36767H6179a51437
$$ 268236 75344 61011 -261350 -347010 -122107 -210668 171465 -136767 86179 -151437
15713A83282b02443n7628C197a75665F3870d14326B15874n9828b81473C6879b75679
$$ 183282 -202443 -260071 3197 -175665 63870 -414326 215874 156046 -281473 36879 -275679
15701H4525K11330I762a24386B53268j17653i6149A77113K75547j78080q2522
$$ 84525 295855 9762 -124386 253268 135615 -96149 177113 452660 274580 192058
15691A92058b66097c1951p18l891C38854b95821B39294B9082a71291C2973Q1351
$$ 192058 -266097 -31951 -32669 -36560 338854 -295821 239294 29082 -171291 32973 114324
15680A14324j2288b6984D8001M5540f7620H9393e6004A68713p046k7654L6974
$$ 114324 102036 -26984 48001 93541 -67620 89393 -56004 168713 161667 134013 170987
15669A70987k2140c34369J38225g1734j24037A82497A1905K12846h6858j51594
$$ 170987 148847 -334369 -196144 -71734 -195771 182497 11905 224751 -86858 -238452
15659b38452a6115l85672K4179Q7802a28331O0592j42330j5833j6503E7854d7605
$$ -238452 -16115 -401787 -377608 -289806 -128331 -67739 -210069 -225902 -242405 57854 -47605
15647d46280f2135A07558i4922j563q3773G1988a50274H341a73348N2738F5722
$$ -446280 -62135 107558 -94922 -96485 -180258 71988 -150274 8341 -173348 -120610 65722
15635I0485J49522b56476J8451q7802e1506l94892H7120e3123A60707h7561A64495
$$ 90485 240007 -256476 -238025 -325827 -51506 -446398 87120 -53123 160707 -87561 164495
15623B24321b0460B20376a09663C1268i8286A67840e4252A44929L31064g5079
$$ 224321 -20460 220376 -109663 31268 -98286 167840 -54252 144929 475993 -75079
15612b02790q7817J02618j02733M9179H6823h6594B79927a31485a3881B39090
$$ -202790 -290607 -187989 -290722 -241543 86823 -86594 279927 -131485 -13881 239090
15601b25656N7000C7044L0680b35476c4911A00401O9578G4367e6252j80656A18565
$$ -225656 -168656 37044 67724 -235476 -34911 100401 169979 74367 -56252 -236908 118565
15589C1869c10003b9782C17201h1595b4595B70521h8626c8563C6379g5738C01417
$$ 31869 -310003 -29782 317201 -81595 -24595 270521 -88626 -38563 36379 -75738 301417
15577b41530a2126l3681A04034a76863j3275g4314p8204l38628C5430K26415B9575
$$ -241530 -12126 -45807 104034 -176863 -190138 -74314 -152518 -491146 35430 261845 29575
15565b51233A43533d86410b4917B72729D057c5936A60391c03478A81205g1705
$$ -251233 143533 -486410 -24917 272729 4057 -35936 160391 -303478 181205 -71705
15554e1694A16250b09191f5955n7208D3653a21675A77166h8401j4634M411M8466
$$ -51694 116250 -209191 -65955 -123163 43653 -121675 177166 -88401 -103035 -98624 -50158
15543e0158j51158b4961j87477i0145B1971a38521A1719K11893K02387a35610
$$ -50158 -201316 -24961 -212438 -90145 21971 -138521 11719 223612 425999 -135610
15532a77368j78288a53380q342B48260R0610A9268L05768C2083J29244M9645B1
$$ -177368 -355656 -153380 -161722 248260 338870 19268 325036 32083 161327 210972 21
15520G6322C3519f583C06229a86697B54177n5398a45348f272B28734J09507c54257
$$ 76322 33519 -6583 306229 -186697 254177 198779 -145348 -6272 228734 338241 -354257
15508b62488A18754b54165g2177I976J98152C7391J30765b4041j36031n2519A9107
$$ -262488 118754 -254165 -72177 9976 208128 37391 168156 -24041 -160072 -212591 19107
15496A1541P9642D2875e6492F7790Q2014g5273n7464Q359m8158A14911c1373A19947
$$ 11541 91183 42875 -56492 67790 149804 -75273 -132737 -124378 -172536 114911 -31373 119947
15483b43724J3016A49497K1877f5008j7088J7523D9797b41481c4450p132G9978
$$ -243724 -230708 149497 171374 -65008 -82096 -64573 49797 -241481 -34450 -41582 79978
15471A31936o3880a61953A32607m2919J67892c9270B07758I4282J64424a68332
$$ 131936 68056 -161953 132607 89688 257580 -39270 207758 94282 258706 -168332
15460g1794L4595j87399A77608n6805J57704a85396A34686b7690M082m12557a20298
$$ -71794 -37199 -224598 177608 120803 278507 -185396 134686 -27690 -23608 -436165 -120298
15448A47927k3536k3943c03220c369r9087n6488B2372a00280B29162c8196m780
$$ 147927 124391 100448 -303220 -3369 -102456 -158944 22372 -100280 229162 -38196 -42976
15437d2976H0379a10985A8880a3343A13416b01240m8839A03757k4399K64306A53014
$$ -42976 80379 -110985 18880 -13343 113416 -201240 -250079 103757 79358 343664 153014
15425A84483a02767o5661A5348L52508A10082J42765q4684a05073A26303c29168
$$ 184483 -102767 -168428 15348 367856 110082 252847 168163 -105073 126303 -329168
15414a00048C6432N2126K18141i9195B5346K07886j8435r7290e9841g293n6964
$$ -100048 36432 88558 306699 -99195 25346 233232 214797 117507 -59841 -7293 -64257
15403f4257D4726J0420J34986G9300c1335l03215J36837D1913b94433a7092C272
$$ -64257 44726 55146 190132 79300 -31335 -334550 -197713 41913 -294433 -17092 3272
15391b95299P6728k5620f8402B0793e6014j63421Q9264A81084b79233a15984p48
$$ -295299 -218571 -244191 -68402 20793 -56014 -219435 -130171 181084 -279233 -115984 -116732
15380a16732A8429f2671E7117b01606j7748H4131B4707b6076j95428A35259o4605
$$ -116732 18429 -62671 57117 -201606 -219354 84131 24707 -26076 -221504 135259 70654
15369G0654b4812k1924J7318B01645I4185c17864a7847I5539j2467j4038b1680
$$ 70654 -24812 -46736 -29418 201645 94185 -317864 -17847 95539 83072 69034 -21680
15357C54701a1154H5384a70798J982g5801j98081C15507b97602A9653R5979k6636
$$ 354701 -11154 85384 -170798 -168816 -75801 -273882 315507 -297602 19653 115632 88996
15346H8996C3677K8025f138A87251B0123J6113b06492A13729k0917D2509O0613
$$ 88996 33677 61702 -6138 187251 20123 36236 -206492 113729 92812 42509 103122
15335A03122k5933a40873A16667J60537a93831B5533c68038G3111K9976L6027
$$ 103122 77189 -140873 116667 277204 -193831 25533 -368038 73111 103087 139114
15325A39114a75551B44041A4131L68758c3596H7807C5343b29386A34030c6729
$$ 139114 -175551 244041 14131 382889 -33596 87807 35343 -229386 134030 -36729
15314a17784A10455J46994e85689a8574k02332g895A11781K6789B6547a60494
$$ -117784 110455 257449 -585689 -18574 -220906 -7895 111781 138570 26547 -160494
15303B81387P0953h015B682e162A15415J5656l021J2925e0543A70444Q6044d405
$$ 281387 352340 -8015 2682 -5162 115415 131071 128050 140975 -50543 170444 256488 -4405
15290A30573a62289A296b484B02618c9868a497E2480d1569H044J39977K5993J6680
$$ 130573 -162289 1296 -2484 202618 -39868 -1497 52480 -41569 8044 148021 174014 190694
15278A90694m517B9959I378L71365l4241B0418b8891B74743a30113A33506N1400
$$ 190694 186177 29959 9378 380743 346502 20418 -28891 274743 -130113 133506 184906
15267A84906E2363g747j96838O413d7970q5070k4449P0537A39449c6806A72908
$$ 184906 52363 -7747 -204585 -198172 -47970 -133040 -157489 -86952 139449 -36806 172908
15255e0723h070F6130P4335F1605O9854R562J74690L07050N62660j28410K09787
$$ -50723 -8070 66130 140465 61605 131459 141021 315711 622761 1185421 1057011 1266798
15244A266798K4662o11463B19084K7977i36C14086j31540Q346h292I8897i7270
$$ 1266798 1291460 679997 219084 247061 -936 314086 182546 190892 -8292 98897 -97270
15232a6406r0326C6881J7727O8119J41226r1228l1260R0391b9225j32041d1315
$$ -16406 -106732 36881 54608 122727 263953 172725 141465 231856 -29225 -161266 -41315
15220H5377M0325b3070r2946K9627A81469J04869j7856H690K46127G212K16061
$$ 85377 125702 -23070 -116016 -86389 181469 286338 268482 8690 254817 7212 223273
15209B23273Q3629c2546j5020H6294M2163L3439c7810B52159j22270J72504a16569
$$ 223273 306902 -32546 -47566 86294 128457 161896 -37810 252159 129889 302393 -116569
15197B08095I4613Q3857L1793E7211A0191d8295n406D0927b15305C3791J79400
$$ 208095 94613 178470 210263 57211 10191 -48295 -53701 40927 -215305 33791 213191
15186B13191B5397c9417A26367L33088h9695A71776J18488I7988b02571A26889
$$ 213191 25397 -39417 126367 459455 -89695 171776 290264 97988 -202571 126889
15175B40005H9177F902L29816d29774I7629L83961E4573O6670m3379K73528D8051
$$ 240005 89177 6902 336718 -429774 97629 481590 54573 121243 77864 351392 48051
15163I376L6034L05418m3659J1466a75888A41619a4144H1679K09969h0163E9596
$$ 9376 45410 350828 307169 318635 -175888 141619 -14144 81679 291648 -80163 59596
15151A76476J29608a29527C79673A59426D5264K63234D2867J13806e6197A39806
$$ 176476 306084 -129527 379673 159426 45264 308498 42867 156673 -56197 139806
15140g1296D7952b95209B73833J06568j41127a21276E1390K88654l2640e3574
$$ -71296 47952 -295209 273833 380401 239274 -121276 51390 340044 307404 -53574
15129a21962M4829e649C28183F4874O9530J58172Q9137m1127j36182A9468N73927
$$ -121962 -77133 -5649 328183 64874 134404 292576 381713 340586 204404 19468 593395
15118E93395B80873A13732C4300J41427n5396A2302J13684h053D39791d964D16583
$$ 593395 280873 113732 34300 175727 120331 12302 125986 -8053 439791 -4964 416583
15106I8614J10793Q3950K049a810D5022L33351j17448e1241k5820A13705j5245
$$ 98614 209407 293357 295406 -1810 45022 378373 260925 -51241 -77061 113705 98460
15095I8460J4386B1090L17247A41108J38371j18623O4041b13063F7383K63819
$$ 98460 112846 21090 338337 141108 279479 160856 224897 -213063 67383 331202
15085C31202l0105H6010N1999L61056C5664L29003d3880E69376b7324A47523M9285
$$ 331202 301097 86010 138009 499065 35664 364667 -43880 569376 -27324 147523 196808
15074A96808L867K51171A12045a14996B12906J46485J14613D0462a9708E8222
$$ 196808 200675 451846 112045 -114996 212906 359391 474004 40462 -19708 58222
15063E53739A09511Q5741b67207B81502n5774b1980E55409C8480J94988J17238
$$ 553739 109511 195252 -267207 281502 225728 -21980 555409 38480 233468 350706
15053C50706h2757A00487b57393L5096C71209b77604A21883R6100j0862m3192
$$ 350706 -82757 100487 -257393 -222297 371209 -277604 121883 217983 207121 163929
15043A63929L6960J75702j73793h4260B99485A46068R8582m7211f1563A98572
$$ 163929 200889 376591 202798 -84260 299485 146068 244650 197439 -61563 198572
15032d37477B24514J49318A84003J13729L1712a77087A59133K43975i2313D3927
$$ -437477 224514 373832 184003 297732 329444 -177087 159133 403108 -92313 43927
15021C68909A51527K862G5965R7338L29303k34576o0243p6808j9439D0606L5843
$$ 368909 151527 154389 75965 173303 502606 268030 207787 130979 111540 40606 76449
15010G6449n880J3897K23499o4856J12922D3499Q9032O0297R2692j4257N9168
$$ 76449 70569 84466 307965 243109 356031 43499 132531 192828 285520 271263 330431
14999C30431G4900P3517c0964D06385j30301H2690J96270r9413L7861I0508K33118
$$ 330431 74900 148417 -30964 406385 276084 82690 278960 179547 217408 90508 323626
14988C23626C5233K80474G1676J09415f0000F55108m1626l05972K60941k82943
$$ 323626 35233 315707 71676 181091 -60000 655108 613482 307510 568451 285508
14978B85508p5023K94151J39482B56475L18346H6533R0868N5269J62816m7108
$$ 285508 210485 504636 644118 256475 574821 86533 177401 232670 395486 348378
14968C48378l7885M5673q875q3190m827R6629K2776B365d4178D21365A06314L3342
$$ 348378 310493 356166 347291 264101 259274 355903 378679 2365 -44178 421365 106314 139656
14956A39656K33203l3453k1178n4288A5109N0554K4087J58335j12281L01092f9257
$$ 139656 372859 339406 318228 263940 15109 65663 89750 248085 135804 436896 -69257
14944B82042l27J68804k05350O9097O5086I3224J79816j13570K6403a03923B39953
$$ 282042 281715 450519 245169 314266 379352 93224 273040 159470 185873 -103923 239953
14932E29530l6809g5116A86110A9951L26581j33091J09719j39668K16140j14593
$$ 529530 492721 -75116 186110 19951 346532 213441 323160 183492 399632 285039
14922B85039J63578J57145j71577A07200O1498J10604N5306j32481Q2886j34310
$$ 285039 448617 605762 434185 107200 168698 279302 334608 202127 285013 150703
14912A50703L16269G7073M01237K4103A84223K4898L4821L42790j72148j02477
$$ 150703 466972 77073 478310 502413 184223 209121 243942 586732 414584 312107
14902C12107J10658j19021J67722l3319A97310J51627K5092o4181J20716l0700
$$ 312107 422765 303744 471466 438147 197310 348937 374029 309848 430564 399864
14892C99864O2719q403B06385J84971K624p5955L69028j18948j67536J01357k03289
$$ 399864 462583 454180 206385 391356 393980 318025 687053 568105 400569 501926 298637
14881B98637L63656C15490J94253j3148j07943p5911N9544J78515B35296L71533
$$ 298637 662293 315490 509743 496595 388652 312741 372285 550800 235296 606829
14871F06829k1832j3227A02753K73896J99062B87345L82996B93573A33398M92273
$$ 606829 584997 571770 102753 376649 575711 287345 670341 293573 133398 625671
14861F25671B23473J62752K74137A88769M91849B61278R2576J87991J9268j84770
$$ 625671 223473 386225 660362 188769 680618 261278 353854 541845 561113 376343
14851C76343J93785k84893J65124N0692N1618L7425A96180O16479D05104M1609
$$ 376343 570128 285235 450359 501051 552669 590094 196180 812659 405104 446713
14841D46713A47198K93439K32571q4857j04766j45202Q0433K33906k76062J28366
$$ 446713 147198 440637 673208 588351 483585 338383 418816 652722 376660 505026
14831E05026J51029j69050j0702K71481j60790k15329A41881K69890J79625k16066
$$ 505026 656055 487005 476303 747784 586994 371665 141881 411771 591396 375330
14821C75330K45622A73702K07646j13262N49716m03394P7162m9451o5770J64662
$$ 375330 620952 173702 381348 268086 817802 414408 491570 442119 376349 541011
14811E41011B25703r5181M41400j49358O18720B57941O3397J26089J77216k21920
$$ 541011 225703 130522 571922 422564 1041284 257941 321338 447427 624643 402723
14801D02723M60507P7814m42846j01935l3458R0167Q3209l1835q0948K32983j4220
$$ 402723 863230 941044 498198 396263 362805 452972 536181 504346 423398 656381 642161
14790F42161k0262N7444o8005k44363L32526j91495J75865C25752o793J72939
$$ 642161 621899 679343 611338 366975 699501 508006 683871 325752 318959 491898
14780D91898j23459K43832K7517Q2899p1510k32757J70853j34349L75229k238
$$ 491898 368439 612271 639788 722687 651177 418420 589273 454924 830153 827915
14770H27915j32823K22600j33786k46132m9966J54972j33060K22988J75232B52974
$$ 827915 695092 917692 783906 537774 487808 642780 509720 732708 907940 252974
14759I05929j45632o5914J42523l15247J92866M7808q7182p7884J75870j7075
$$ 905929 760297 694383 836906 521659 714525 762333 675151 597267 773137 756062
14749G56062K64888k98556R6826K98456m48301j11816K7783J82884J25855j20650
$$ 756062 1020950 722394 819220 1117676 669375 557559 585342 768226 894081 773431
14739G73431j63551J46093K84350k55423k15371K39315j4667K57459k00334P6945
$$ 773431 609880 755973 1040323 784900 569529 808844 794177 1051636 851302 928247
14729I28247k74857L10989k49098K45577k48596J61807J864m8942O7457m26551
$$ 928247 653390 964379 715281 960858 712262 874069 875933 826991 894448 467897
14719D67897P0861l8189N92377l83190O22j13833J62480k3537J82856J45332L5730
$$ 467897 538758 500569 1092946 709756 710378 596545 759025 735488 918344 1063676 1099406
14708A099406k9043l56415N8439k5239N7733K4011L07968k27698k10986K50738
$$ 1099406 1070363 713948 772387 747148 804881 828892 1136860 909162 698176 948914
14698I48914M7299k69414J44508j66522J80524l40824L26620O08310o30775o5522
$$ 948914 996213 726799 871307 704785 885309 544485 871105 1479415 848640 783118
14688G83118K63859C74834N70143N1770J40175l16379K14159p5884l0259N9240
$$ 783118 1046977 374834 944977 996747 1136922 820543 1034702 958818 928559 987799
14678I87799J21149K94142n99208J84222K7707j50119l4823K18616N2367m6634
$$ 987799 1108948 1403090 803882 988104 1015811 865692 830869 1049485 1101852 1055218
14668A055218o8448L46186l20564j31620K00020l22836M68954j52246L14044l67753
$$ 1055218 986770 1332956 1012392 880772 1080792 757956 1226910 1074664 1388708 1020955
14658A020955J43908J59726n81472r292N18118n5663K83457J767o44018K81469
$$ 1020955 1164863 1324589 743117 733825 1251943 1196280 1479737 1481504 837486 1118955
14648A118955k10096j43638M87383p6864J21448m77885M39494K89681l85475K20779
$$ 1118955 908859 765221 1252604 1175740 1297188 819303 1258797 1548478 1163003 1383782
14638A383782K17764j35748k73059N26684m97907k0031k35004L1061N95882n5776
$$ 1383782 1601546 1465798 1192739 1719423 1221516 1201485 966481 997542 1593424 1537648
14628A537648O49m35190j47508P56649m43634K98350j06772j91231L63504k07603
$$ 1537648 1538297 1103107 955599 1712248 1268614 1566964 1460192 1268961 1632465 1424862
14618A424862J92443k39807K82488n32332M03314k10251K98931k9149l05185K88327
$$ 1424862 1617305 1377498 1659986 1127654 1530968 1320717 1619648 1590499 1285314 1573641
14608A573641K30670P8328m16162K47453k13690M37106M7625m6507r6020k07833
$$ 1573641 1804311 1882639 1466477 1713930 1500240 1937346 1984971 1938464 1842444 1634611
14598A634611K41013m21566L24124J0121j50180q0010M09668J92929l27086l44129
$$ 1634611 1875624 1454058 1778182 1788303 1638123 1558113 1967781 2160710 1833624 1489495
14588A489495J90040P9463K13546m3814K09828l14208k70961K75349J40803K5894
$$ 1489495 1679535 1758998 1972544 1928730 2138558 1824350 1553389 1828738 1969541 1995435
14578A995435n432K45516l97937K41641K0423K49115k89635L56055j1347k47973
$$ 1995435 1990003 2235519 1837582 2079223 2099646 2348761 2059126 2415181 2403834 2155861
14568B155861K90720k76757J92744p3518K02342L13363p4105k18048K23023M94586
$$ 2155861 2446581 2169824 2362568 2289050 2491392 2804755 2730650 2512602 2735625 3230211
14558C230211l48753J77767J08202P9609L85376L47122L62964L98572J853013
$$ 3230211 2881458 3059225 3167427 3247036 3632412 3979534 4342498 4741070 6594083
14549F594083K376855M369184P149791J4734404P520981k0452769j0843730n563987
$$ 6594083 8970938 13340122 20489913 35224317 42745298 22292529 11448799 5884812
14541E884812k518386q31445R712l04672m4053L18736l30603m71179M34592r0092
$$ 5884812 3366426 2534981 2544693 2240021 2195968 2514704 2184101 1712922 2147514 2057422
14531B057422K91201K8259O6217j70479o3940l8754M64428j5854k35551P3186
$$ 2057422 2348623 2376882 2443099 2272620 2208680 2169926 2634354 2618500 2382949 2456135
14521B456135P0003j82148K22034J88174l898K05648j93585l2277j70277L30477
$$ 2456135 2526138 2343990 2566024 2754198 2750300 2955948 2762363 2730086 2559809 2890286
14511B890286M4761j00927l9193J95228J4093j9113k9679K41531l3058L5713j65970
$$ 2890286 2935047 2834120 2794927 2990155 3004248 2985135 2955456 3196987 3163929 3199642 3033672
14500C033672l01204N57324j080l43219L33681J23948j10454K3663O9383L26319
$$ 3033672 2732468 3289792 3288712 2945493 3279174 3403122 3292668 3316331 3385714 3712033
14490C712033m90630L65255L78801k01587k044o7813l49354K90118L46916K26207
$$ 3712033 3221403 3586658 3965459 3763872 3761828 3694015 3344661 3634779 3981695 4207902
14480D207902k10637P6881J1347l8400k8544p2803K08948M2206J77198K1537k26130
$$ 4207902 3997265 4074146 4085493 4047093 4018549 3945746 4154694 4196900 4374098 4395635 4169505
14469D169505L26996N8564m91000M18361J29731P8486L85608m26306R802J68503
$$ 4169505 4496501 4555065 4064065 4482426 4612157 4690643 5076251 4649945 4659747 4828250
14459D828250k39306K08459R9735K57792j57463K92075J33956l4175J49819l31557
$$ 4828250 4588944 4797403 4897138 5154930 4997467 5289542 5423498 5389323 5539142 5207585
14449E207585M5260L46539k51021L99104n0944J11399k40938M46239k53823J73103
$$ 5207585 5252845 5599384 5348363 5747467 5696523 5807922 5566984 6013223 5759400 5932503
14439E932503J93870L51700k06552k3488L23587j79386j15222M44166p6834J17972
$$ 5932503 6126373 6478073 6271521 6248033 6571620 6392234 6277012 6721178 6644344 6762316
14429F762316L29239m9761q561J45091N52407l13205J0276L90815J24401q8439
$$ 6762316 7091555 7041794 7033233 7178324 7730731 7417526 7427802 7818617 7943018 7854579
14419G854579J49231r444R6774P6871M74966l2932Q155J76560k02881K84166J98366
$$ 7854579 8003810 7994366 8091140 8168011 8642977 8610045 8618200 8794760 8591879 8876045 9074411
14408I074411K25435K04046L36283l18316M19418k18308N45219K9444P55530l76870
$$ 9074411 9299846 9503892 9840175 9521859 9941277 9722969 10268188 10297632 11053162 10676292
14398A0676292o7638K48671L75586K66583K3872K86852j58551M35590J62223L60224
$$ 10676292 10608654 10857325 11232911 11499494 11523366 11810218 11651667 12087257 12249480 12609704
14388A2609704L99837J86780R1009N58096n4181l4993K79094M39252R0955M92162
$$ 12609704 13009541 13196321 13287330 13845426 13791245 13756252 14035346 14474598 14565553 15057715
14378A5057715L57579j4953O68901K10644N25967k59853J81077P96160L37836
$$ 15057715 15415294 15400341 16069242 16279886 16805853 16546000 16727077 17523237 17861073
14369A7861073K45465N26349J12470M46258M43625M34093N62147K31540N40777
$$ 17861073 18106538 18632887 18745357 19191615 19635240 20069333 20631480 20863020 21403797
14360B1403797M54424O05520N9389M94834J052686M21539O03872M35033O38734
$$ 21403797 21858221 22463741 22523130 23017964 24070650 24492189 25096061 25531094 26169828
14351B6169828J040249N45894P99266L38782O85924J067530M37546Q64481Q60772
$$ 26169828 27210077 27755971 28555237 28894019 29579943 30647473 31085019 31949500 32810272
14342C2810272J125773Q68740P43220J373685O61725J143936J075442J020590
$$ 32810272 33936045 34804785 35548005 36921690 37583415 38727351 39802793 40823383
14334D0823383J277381Q80252J464279J597359J615683J404947J466709J491786
$$ 40823383 42100764 42981016 44445295 46042654 47658337 49063284 50529993 52021779
14326E2021779J921679J767249J524412J924306K180523K455063K052080K264931
$$ 52021779 53943458 55710707 57235119 59159425 61339948 63795011 65847091 68112022
14318F8112022K755782K545389K729209L026156K662661L359631L344018L575121
$$ 68112022 70867804 73413193 76142402 79168558 81831219 85190850 88534868 92109989
14310I2109989L852401M263544L922420M774829M457365M997275N553503N715273
$$ 92109989 95962390 100225934 104148354 108923183 113380548 118377823 123931326 129646599
14302A29646599O036178N885210O875588P083886P817442P829463Q406348R160176
$$ 129646599 135682777 141567987 148443575 155527461 163344903 171174366 179580714 188740890
14294A88740890R160314R794780J0644637J1253212J1878526J2172802J2430550
$$ 188740890 197901204 207695984 218340621 229593833 241472359 253645161 266075711
14287B66075711J3427099J4020405J4355049J4656569J5301063J4913982J5065737
$$ 266075711 279502810 293523215 307878264 322534833 337835896 352749878 367815615
14280C67815615J5088704J4623644J3735881J2451203J1080500Q471697N925952
$$ 367815615 382904319 397527963 411263844 423715047 434795547 443267244 449193196
14273D49193196K321262J101965K197790K58204o84477K52602n316112o507302
$$ 449193196 451514458 452616423 454814213 455072417 454387940 454640542 449324430 442817128
14265D42817128q792099r064626j1082436j3135954j4426576j5402427j5302483
$$ 442817128 434025029 424960403 413877967 400742013 386315437 370913010 355610527
14258C55610527j5776301j5653674j5360993j4908540j3937580j3249924j3309629
$$ 355610527 339834226 324180552 308819559 293911019 279973439 266723515 253413886
14251B53413886j2619807j1809268j1501914j0737445j0327188r641586q767483
$$ 253413886 240794079 228984811 217482897 206745452 196418264 186776678 178009195
14244A78009195q659941p797702p816335p069738o648929o484280n848630n455381
$$ 178009195 169349254 161551552 153735217 146665479 140016550 133532270 127683640 122228259
14236A22228259n231572m994777m965813m339345m187084l669230l858985l578682
$$ 122228259 116996687 112001910 107036097 102696752 98509668 94840438 90981453 87402771
14228H7402771l467912l249499l044867k929390k732041k689157k313390k376113
$$ 87402771 83934859 80685360 77640493 74711103 71979062 69289905 66976515 64600402
14220F4600402k358516j675416k321431k002570j864994j656560j504640j548499
$$ 64600402 62241886 60566470 58245039 56242469 54377475 52720915 51216275 49667776
14212D9667776j372606j515137j588102j409823j080971j022324q57496j300099
$$ 49667776 48295170 46780033 45191931 43782108 42701137 41678813 40821317 39521218
14204C9521218j414440j096191j014607m65555q77380j174465r80919q10607q66081
$$ 39521218 38106778 37010587 35995980 35530425 34653045 33478580 32497661 31687054 30820973
14195C0820973p61942n15193o15964j149309m97514q48108n20079p32190o33277
$$ 30820973 30059031 29543838 28927874 27778565 27281051 26432943 25912864 25180674 24547397
14186B4547397j38506p98768m95277m71922l56081n14324p87148j13662m56109
$$ 24547397 24408891 23610123 23114846 22642924 22286843 21772519 20985371 20871709 20415600
14177B0415600m27880n19614j93682m67781m35423o2232q58380j01330r7011n89704
$$ 20415600 19987720 19468106 19274424 18806643 18371220 18308988 17450608 17349278 17252267 16662563
14167A6662563l70764j48560k49093J1608n39135l53554l25605O8146l32029o11110
$$ 16662563 16291799 16143239 15894146 15905754 15366619 15013065 14687460 14755606 14423577 13812467
14157A3812467j51325K49063m54896l52437j71192k54976J35758n49938j25103
$$ 13812467 13661142 13910205 13455309 13102872 12931680 12676704 12812462 12262524 12137421
14148A2137421q0518k60302l43500p7310j48739r3903l62156O816k43078j33600
$$ 12137421 12056903 11796601 11453101 11375791 11227052 11133149 10770993 10777809 10534731 10401131
14138A0401131l19785M1220J65211n86790j91528j55464k69455J86802m26668
$$ 10401131 10081346 10122566 10287777 9700987 9509459 9353995 9084540 9271342 8844674
14129H844674M39300q31718L09526m08765N568m2920n1483Q9944l43691K84410
$$ 8844674 9283974 8452256 8761782 8353017 8358585 8315665 8264182 8354126 8010435 8294845
14119H294845n49790P1115k32815l82232K52711p8854K83399m53422j12063j54323
$$ 8294845 7745055 7816170 7583355 7201123 7453834 7374980 7658379 7204957 7092894 6938571
14109F938571j40261j63867O0239k08664j53247J38728j29033P3408k5166m71286
$$ 6938571 6798310 6634443 6694682 6486018 6332771 6471499 6342466 6415874 6390708 5919422
14099E919422j7175r5185j27293K15994j70836m1548m62634L97532k11402N0655
$$ 5919422 5902247 5807062 5679769 5895763 5724927 5683379 5220745 5618277 5406875 5457530
14089E457530k19646P809k15809J92628m15447M43738j59706N4501L982k85615
$$ 5457530 5237884 5245693 5029884 5222512 4807065 5250803 5091097 5145598 5149580 4863965
14079D863965J16036j27457L3285k12956J06139l29991o6806K30150k40471l694
$$ 4863965 4980001 4852544 4885829 4672873 4779012 4449021 4382215 4612365 4371894 4368200
14069D368200m3292k38380K95172j61182J22520j321r7787K28339m70359p4897
$$ 4368200 4324908 4086528 4381700 4220518 4343038 4341717 4243930 4472269 4001910 3927013
14059C927013R3217m4161O27910q63995K4584J78922n8198m42636K12676m07434
$$ 3927013 4020230 3976069 4603979 3739984 3764568 3943490 3885292 3442656 3655332 3247898
14049C247898L98826l36308J39499l18600k6713K02738L9225M7976k31578K20942
$$ 3247898 3646724 3310416 3449915 3131315 3104602 3307340 3346565 3394541 3162963 3383905
14039C383905k73659L8946J97863O8447o04403N56040k66365q4065j04634k20072
$$ 3383905 3110246 3149192 3347055 3415502 2811099 3367139 3100774 3016709 2912075 2692003
14029B692003J33684J60019j01906o3346l4132p8122N3562j33514J27738l8493
$$ 2692003 2825687 2985706 2883800 2820454 2786322 2708200 2761762 2628248 2755986 2717493
14019B717493l66645L36330k4724j09064j58523L3277L76334k07151m68542M48474
$$ 2717493 2350848 2687178 2662454 2553390 2394867 2428144 2804478 2597327 2128785 2577259
14009B577259j72620j05210J74447l26685k2003J9336J74852j32861M8972j5551
$$ 2577259 2404639 2299429 2473876 2147191 2125188 2144524 2319376 2186515 2235487 2219936
13999B219936K6929K13165n82245R7092J77041P5238M831j34987P27529N60501
$$ 2219936 2246865 2460030 1877785 1974877 2151918 2227156 2231987 2097000 2824529 3385030
13989C385030J619572L352558N920226J4966220J3775747j5405828j3708609n422816
$$ 3385030 5004602 8357160 14277386 29243606 43019353 27613525 13904916 8482100
13981H482100k174174j653878o66500l26124j75837n75898K87057k84690k82058
$$ 8482100 6307926 4654048 3987548 3661424 3485587 2909689 3196746 2912056 2629998
13972B629998l7597l46340N06630m98777K30803k28340J33869j79232M1469N3944
$$ 2629998 2592401 2246061 2752691 2253914 2484717 2256377 2390246 2211014 2252483 2306427
13962B306427J98527m55154j66207K42325L2398j53801P8712j43967k1299K64077
$$ 2306427 2504954 2049800 1883593 2125918 2158316 2004515 2083227 1939260 1917961 2182038
13952B182038L69221j040717O14567r5438j72051j6218k07844P6838p4339K44752
$$ 2182038 2551259 1510542 2125109 2029671 1857620 1841402 1633558 1710396 1636057 1880809
13942A880809j58068K72894o0899j17766K59287j0421o47922K02803P2367k18637
$$ 1880809 1722741 1995635 1934736 1816970 2076257 2065836 1417914 1620717 1693084 1474447
13932A474447K21319j11324J49490l59862K84901k68514J3600J27536k7631L0813
$$ 1474447 1695766 1584442 1733932 1374070 1658971 1390457 1404057 1531593 1503962 1534775
13922A534775j17806j52782o3886M92972R0626K3961j68638k9836j68033K37607
$$ 1534775 1416969 1264187 1200301 1693273 1783899 1807860 1639222 1609386 1441353 1678960
13912A678960N9241m39078j26590k5811J96229K11098j35964O2477k81243L97887
$$ 1678960 1738201 1299123 1172533 1146722 1342951 1554049 1418085 1480562 1199319 1597206
13902A597206j92678m20768L57964j90847k4544J81391j05399J71251j24890J00062
$$ 1597206 1404528 983760 1341724 1150877 1126333 1307724 1202325 1373576 1248686 1348748
13892A348748m04240j0579L43620M0778P738K14143l59601J91475l69709J23844
$$ 1348748 944508 933929 1277549 1318327 1326065 1540208 1180607 1372082 1002373 1126217
13882A126217J55580l86873L44486j70094K12473j29175M6272m30416K52679J56305
$$ 1126217 1281797 894924 1239410 1069316 1281789 1152614 1198886 768470 1021149 1177454
13872A177454p8572K48292J31189k81501k13772K15645j71803J74926k45873j28448
$$ 1177454 1098882 1347174 1478363 1196862 983090 1198735 1026932 1201858 955985 827537
13862H27537q9799N19052J8117o1883j89560L44163n57187K87437k20116P0949
$$ 827537 737738 1256790 1274907 1213024 1023464 1367627 810440 1097877 877761 948710
13852I48710j87250K82629K89843k19559k00045o3926J59973L2160j64826L13585
$$ 948710 761460 1044089 1333932 1114373 914328 850402 1010375 1042535 877709 1191294
13842A191294j96160j94699J23658l1895J31793R3432P3639j78714J52304l41266
$$ 1191294 995134 800435 924093 892198 1023991 1117423 1191062 1012348 1164652 823386
13832H23386L6150R2717M1521q8333J1656K19834j2117Q2234m11789K08273k35929
$$ 823386 859536 952253 993774 905441 917097 1136931 1124814 1207048 795259 1003532 767603
13821G67603J17902q9475k19059P48712k38083l90572R1522J62076l89488K07407
$$ 767603 885505 796030 576971 1325683 1087600 697028 788550 950626 561138 768545
13811G68545q6237L8055M27811m96688O1191j16710m1520L86281j01233n7232
$$ 768545 682308 720363 1148174 651486 712677 595967 554447 940728 839495 782263
13801G82263j52220N21153m20568l48532O90658k73704O6138k72046L41403l87980
$$ 782263 630043 1151196 730628 382096 1072754 799050 865188 593142 934545 546565
13791E46565K09670J19960l3674r2533J13759k54772L93019j43045J3495l26613
$$ 546565 756235 876195 842521 749988 863747 608975 1001994 858949 872444 545831
13781E45831O555l6827k1391N32222m2350m33315K58198k1012m0159l0981M0577
$$ 545831 552386 515559 494168 1026390 984040 550725 808923 787911 747752 716771 757348
13770G57348k19034K97656k51967L59082C61365M14099O688l53261L64713o9778
$$ 757348 538314 835970 584003 943085 361365 775464 782152 428891 793604 723826
13760G23826k41023K40783p7166j64401J88826J26709j04892j69599O9239M16211
$$ 723826 482803 723586 646420 482019 670845 797554 692662 523063 592302 1008513
13750A008513D35207L25597j12406L96587k14586Q0776j15483l53898J29722J04334
$$ 1008513 435207 760804 648398 1044985 830399 911175 795692 441794 571516 675850
13740F75850q8659j19873k6123M28181j86340L3022k1031C32258O07906l22271
$$ 675850 587191 467318 441195 869376 683036 716058 695027 332258 940164 617893
13730F17893k22575J1271M59284B65061L86877k82627L1134K51631k48087L11415
$$ 617893 395318 406589 865873 265061 651938 369311 400445 652076 403989 715404
13720G15404k36558j4538K4893K30134k20889K97741k26885j23853j68525L87153
$$ 715404 478846 464308 489201 719335 498446 796187 569302 445449 276924 664077
13710F64077k29352J07713K01961k38298J93759k26261j59796L23931B58331N7783
$$ 664077 434725 542438 744399 506101 699860 473599 313803 637734 258331 316114
13700C16114L55658k59345L63261k83649J22530B83564J63462J4333N3184r0871
$$ 316114 671772 412427 775688 492039 614569 283564 447026 461359 514543 423672
13690D23672N3070L5474K57396j7249l28479K15312k05581j46014K28572B37113
$$ 423672 476742 512216 769612 752363 423884 639196 433615 287601 516173 237113
13679D96267Q7308k79345K4836R9405r1202J74132o2148K34689j99558J22443
$$ 496267 583575 304230 329066 428471 337269 511401 449253 683942 484384 606827
13669F06827A19435L88044j8760j70241K39119R6887B68117Q7749Q8438A37673
$$ 606827 119435 507479 488719 318478 557597 654484 268117 355866 444304 137673
13658A89341P0593j6832R7284K32258n0973j71350j38764M165K57909m693q0750
$$ 189341 259934 243102 340386 572644 521671 350321 211557 215722 473631 468938 388188
13647C88188j06536N18343C52499J52891J32661K1488k05791j27712M03412C24996
$$ 388188 281652 799995 352499 505390 638051 659539 453748 326036 729448 324996
13636D80358J08363p6985r7819j01963M7755Q5900j62166K25378r3782J28714
$$ 480358 588721 511736 413917 311954 359709 445609 283443 508821 415039 543753
13626E43753B46838K06180A51109J49391J38075K9503k20836j6111K92402j63231
$$ 543753 246838 453018 151109 300500 438575 468078 247242 231131 523533 360302
13616C60302l8975A22621J04063K44774m7376N1316j51882k7100K71941q5814
$$ 360302 321327 122621 226684 471458 424082 475398 323516 296416 568357 482543
13606D82543J5668j41124J7845A56958K81778j55359K84564o5867r2148j59655
$$ 482543 498211 357087 374932 156958 438736 283377 567941 502074 409926 250271
13596B50271K97181m8103A01907K63133r9541J66395j60750K37438F9963J40926
$$ 250271 547452 499349 101907 365040 265499 431894 271144 508582 69963 210889
13586B10889J89229K8228A46332K77590J19161B07462J46088O3596M0255o6502
$$ 210889 400118 428346 146332 423922 543083 207462 353550 417146 457401 390899
13576C90899E4887J76005O9613P4954A30679M86957A02689j293M52358J87734
$$ 390899 54887 230892 300505 375459 130679 617636 102689 101396 553754 741488
13566G41488H8405R2218N1338M0504J17412L367D3098O2672K64370Q2163k4795
$$ 741488 88405 180623 231961 272465 389877 393244 43098 105770 370140 452303 427508
13555D27508J31043j53823A94337k0927M28173n3600j61621c5760C28843l9163
$$ 427508 558551 404728 194337 173410 601583 547983 386362 -35760 328843 289680
13545B89680j15198K41436K0455j78729N2669A38532K70683J15475j92637J37707
$$ 289680 174482 415918 436373 257644 310313 138532 409215 524690 332053 469760
13535D69760k32921o163J24947L8495K7005k5673q7039p6016L0677J64862j20068
$$ 469760 236839 230676 355623 394118 421123 395450 308411 232395 263072 427934 307866
13524C07866o776N3031P0971I1915J98026N855I8145b524D0419K71010J80057
$$ 307866 301090 354121 425092 91915 289941 295796 98145 -2524 40419 311429 491486
13513D91486j76494e2128A35000B1304J01760J40463j00300b0869A71945J08048
$$ 491486 314992 -52128 135000 21304 123064 263527 163227 -20869 171945 279993
13503B79993n5860n193K29161H4731a44030D48795A22004M71683k04644q1208
$$ 279993 224133 218940 448101 84731 -144030 448795 122004 593687 389043 307835
13493C07835j38246J311G4572R6600J94786j51945K57688j93169o5426a36276
$$ 307835 169589 170900 74572 171172 365958 214013 471701 278532 213106 -136276
13482B62360o6325P9733j19941Q4008j1630J04954n8750L36575D4993L21106J4417
$$ 262360 196035 275768 155827 239835 228205 333159 274409 610984 44993 366099 380516
13471C80516A37738A6035K06777k7017L4479j09896K95467q5891A33030K12914
$$ 380516 137738 16035 222812 195795 230274 120378 415845 329954 133030 345944
13461C45944D7703J67896J19250F1665K0494J20835N9561h3405B75013J913G5621
$$ 345944 47703 215599 334849 61665 82159 202994 262555 -83405 275013 276926 75621
13449h4280B76390K5764A42844K9245M7181N6181L83085k00653A66601K06882
$$ -84280 276390 302154 142844 172089 219270 275451 658536 457883 166601 373483
13439C73483j56660p6432B8674M18228A15489j5346i4126C5956L02920n9023F0965
$$ 373483 216823 140391 28674 446902 115489 100143 -94126 35956 338876 279853 60965
13427A88042j1170q6165K78346O4948d2046B08723L34501k15837A25774J7562
$$ 188042 176872 90707 369053 434001 -42046 208723 543224 327387 125774 143336
13417A43336a8724B2268M67628k12190j02903C5492K83318Q7577l1950E1609E11
$$ 143336 -18724 22268 489896 277706 174803 35492 318810 406387 374437 51609 511
13405A90117p4653L30515d9044q2880a315C6598K46751A13846b8327j13312E75921
$$ 190117 115464 445979 -49044 -131924 -1315 36598 283349 113846 -28327 -141639 575921
13393a78484A69435B8024M52138H1575K09020C4077J81650J08694a8253j07639
$$ -178484 169435 28024 480162 81575 290595 34077 215727 324421 -18253 -125892
13383a25892C20898D4137L514N3505J18050C5616L47925A56467K16254H6146L34131
$$ -125892 320898 44137 47651 101156 219206 35616 383541 156467 372721 86146 420277
13372D20277A99495c8677B55553G2917k4992b28919A50651J10215l7676P6130
$$ 420277 199495 -38677 255553 72917 47925 -228919 150651 260866 223190 299320
13362B99320H0705d8220C59899a70051A66613A9714J95371O0183B7461J1083c326
$$ 299320 80705 -48220 359899 -170051 166613 19714 215085 275268 27461 38544 -3326
13350A52526J87098I9582N4958L3150K11866P0321l9235A35250L10132r0242A00371
$$ 152526 339624 99582 154540 187690 399556 469877 430642 135250 445382 355140 100371
13338B49855p1992J60936A09353J04878g1816l4597M5451A68313H2818Q8735J1339
$$ 249855 177863 338799 109353 214231 -71816 -106413 -60962 168313 82818 171553 182892
13327A82892H4125J4783M98064B45821K54329j28129j73886B5148Q3394K38787
$$ 182892 84125 98908 596972 245821 500150 372021 198135 25148 108542 347329
13317C47329J1491n6204J4786j14371J10570p6674O6868M8925A49067J07108G9787
$$ 347329 358820 302616 317402 203031 313601 236927 303795 352720 149067 256175 79787
13305B00297q0296J72290g3891A4422M18849A6287M4259N4610J0218K30190a00207
$$ 200297 120001 292291 -73891 14422 433271 16287 60546 115156 125374 355564 -100207
13293B59951q6150a6317A28552a50632b390A17072N089B1727J54165k4687c2839
$$ 259951 173801 -16317 128552 -150632 -2390 117072 122161 21727 175892 151205 -32839
13281b34798G9811M920i786C60066a75501B27118m2962L6875A2403h2811K5481
$$ -234798 79811 84731 -9786 360066 -175501 227118 184156 221031 12403 -82811 -57330
13270e7330K1356A52484R4298a06433C733J98048F8147b5250A25621c6405F440
$$ -57330 -35974 152484 246782 -106433 3733 201781 68147 -25250 125621 -36405 6440
13258b3012E6894a51403E7448J09436m619c4229G263K14880n6446a65777j68349
$$ -23012 56894 -151403 57448 166884 162265 -34229 7263 222143 165697 -165777 -334126
13247c34126C29739A46220l1668C8237K09553l5632j0357K71283d9042A95411
$$ -334126 329739 146220 114552 38237 247790 212158 201801 473084 -49042 195411
13236a2324B54843i3581G5392b3621A05270J22190K4748R6290I0622J08194C9244
$$ -12324 254843 -93581 75392 -23621 105270 227460 252208 348498 90622 198816 39244
13224A75862G5062J07362J05316a03343n8551a9837D1778L44500A59216l0299
$$ 175862 75062 182424 287740 -103343 -161894 -19837 41778 386278 159216 128917
13214A28917E1773b4622B38179A09909J03806n0664K37801K0757F754P1534L456
$$ 128917 51773 -24622 238179 109909 213715 163051 400852 421609 6754 78288 81744
13203H1744J4113J14823b4856D96490a1030B24581C0238K24505F2925N9982M54656
$$ 81744 95857 210680 -24856 496490 -11030 224581 30238 254743 62925 122907 577563
13192E77563a27613L2527A32457J63452f5610c519j54146B51527m6196q2874J57664
$$ 577563 -127613 -95086 132457 295909 -65610 -3519 -157665 251527 205331 122457 280121
13181B80121j32714b59733E5936d166A03555A9204i480D8335c9431j61404a111
$$ 280121 147407 -259733 55936 -4166 103555 19204 -9480 48335 -39431 -200835 -1111
13169B73157H3944J00354a03669M1016B61455A00361d0982B50362H7238J7085
$$ 273157 83944 184298 -103669 -62653 261455 100361 -40982 250362 87238 104323
13159A04323b05744L1024l20513A01040Q6252k0059c74518a26354I9745b6081
$$ 104323 -205744 -174720 -495233 101040 187292 167233 -374518 -126354 99745 -26081
13148a81205a6128C5635K14224l4940F0359K3802e9458A31109Q7791F4184g3188
$$ -181205 -16128 35635 249859 214919 60359 84161 -59458 131109 218900 64184 -73188
13136b3204o4972A04361K3942M7071c12174F6991a77599A04748J5193P5147J54711
$$ -23204 -88176 104361 128303 175374 -312174 66991 -177599 104748 119941 195088 349799
13125C49799A47219a17499p4854e8689b6277C93371p6681A55494c3222O874m8395
$$ 349799 147219 -117499 -192353 -58689 -26277 393371 316690 155494 -33222 -26348 -74743
13114g4743k3762j43745h1919E1870R0129o6485k5757c17882J26802N0057A99163
$$ -74743 -98505 -242250 -81919 51870 141999 75514 49757 -317882 -191080 -141023 199163
13102D43798b9189A35067c1129A52620d9425j86841A61042P6329G6099o352d2703
$$ 443798 -29189 135067 -31129 152620 -49425 -236266 161042 237371 76099 69747 -42703
13090C47263B6189K82640a4324B03372G5119a28199C18464A23067L0925l5175
$$ 347263 26189 308829 -14324 203372 75119 -128199 318464 123067 153992 118817
13080A18817N0109a04671N1194n6624j32470B24021D5125M9641J87895l0527M0823
$$ 118817 168926 -104671 -53477 -110101 -242571 224021 45125 94766 282661 252134 292957
13069B92957A03316F524K78470B6931K88572j13341r427a62589D34153b9706D31909
$$ 292957 103316 6524 284994 26931 315503 202162 192735 -162589 434153 -29706 431909
13057B9187J25826j3276c5723A22856K2191h8204K0088A82909k4668J03853a1555
$$ 29187 155013 141737 -35723 122856 145047 -88204 -68116 182909 158241 262094 -11555
13045G8609J13832n7916L8467d1079B27426a2204B65622R3424a36915k52508M3715
$$ 78609 192441 134525 172992 -41079 227426 -12204 265622 359046 -136915 -389423 -345708
13034c45708a14391E0212L17447L1178A93756r3083j7348k5404j7296L0607N3256
$$ -345708 -114391 50212 367659 398837 193756 100673 83325 57921 40625 71232 124488
13023A24488n0045P8383h3839B44263J56051a42794A89776J31388H3067J47945
$$ 124488 74443 152826 -83839 244263 400314 -142794 189776 321164 83067 231012
13013B31012m6116D8973Q8042k9321c6920i500C58481H3181b35260D297B82L10451
$$ 231012 184896 48973 137015 107694 -36920 -9500 358481 83181 -235260 4297 282 310733
13001C10733H5925K586L92103B16296c1280C42701j53720b548B39356F4095H88
$$ 310733 85925 88511 480614 216296 -31280 342701 188981 -2548 239356 64095 888
12989A2379K25928p8683g9842H2867M293O4329A9857K28737J13931o7550j02776
$$ 12379 238307 159624 -79842 82867 87160 151489 19857 248594 362525 294975 192199
12978A92199a94522A68598f0420H1529e3236J9074p5690j68559a1799A9964P4430
$$ 192199 -194522 168598 -60420 81529 -53236 -34162 -109852 -278411 -11799 19964 94394
12967I4394d2233j74639C30865C6756a92145A16330K7783g9916G0710e5534p4046
$$ 94394 -42233 -216872 330865 36756 -192145 116330 144113 -79916 70710 -55534 -129580
12956a29580B7727a25160F4998J11411J72812A16998J8135a45597C55158r6891
$$ -129580 27727 -125160 64998 176409 349221 116998 135133 -145597 355158 258267
12946B58267M0221c964F7608a51605G0496L8400Q692a11652C62625i8413A05516
$$ 258267 298488 -3964 67608 -151605 70496 108896 117588 -111652 362625 -98413 105516
12934i1939k115C75874j58066j03261E7002O1528a06010l34187f5622p6589q9674
$$ -91939 -94054 375874 217808 114547 57002 118530 -106010 -440197 -65622 -142211 -231885
12923b31885h9380C0438A762a62667E0728A1823c3107E4058K19469i9782p2018
$$ -231885 -89380 30438 1762 -162667 50728 11823 -33107 54058 273527 -99782 -171800
12912a71800B70503c7221g47m7518B12564l3334J09671a91583C63289C0288b17953
$$ -171800 270503 -37221 -747 -48265 212564 179230 288901 -191583 363289 30288 -217953
12900B4038e2171j36541J6065P3005j0558e535j38660f2928H5407L4565R0837
$$ 24038 -52171 -188712 -172647 -99642 -110200 -5535 -144195 -62928 85407 119972 210809
12889B10809H3823h8037H2091J09184c1091p482j11599A89784p9462a03044j73862
$$ 210809 83823 -88037 82091 191275 -31091 -38573 -150172 189784 110322 -103044 -276906
12878b76906B10444K81120a0637B53381n3956r2603d5744a3536B16707c60B2704
$$ -276906 210444 491564 -10637 253381 199425 106822 -45744 -13536 216707 -360 22704
12866A43249d4058k29410O9486i8567G5362P4004n8285a47064H4702B5214e6504
$$ 143249 -44058 -273468 -203982 -98567 75362 149366 91081 -147064 84702 25214 -56504
12854c93B89579e6221A46517b29567B5921i7445o4052l992G075c50579G327P0376
$$ -393 289579 -56221 146517 -229567 25921 -97445 -161497 -165489 7075 -350579 7327 77703
12842G7703Q2929M25846A08762Q8276a24541d0777A7739J43459b46783K5005a1646
$$ 77703 160632 586478 108762 197038 -124541 -40777 17739 161198 -246783 -221778 -11646
12830g69H8964a80788j98342I8501K1493j1262P0006n3134a53055o3027G5487
$$ -769 88964 -180788 -379130 98501 119994 108732 178738 125604 -153055 -216082 75487
12818A72203n1595m8355A5268b15220A69975c1436F7984a6402A81392q9289B3353
$$ 172203 120608 72253 15268 -215220 169975 -31436 67984 -16402 181392 92103 23353
12806d5087n1013j13735A38642M6188m9406J5080b04290A4022J56789n5446K2905
$$ -45087 -96100 -209835 138642 184830 135424 150504 -204290 14022 170811 115365 138270
12795A38270a61401A51191n0393b2687G7298J25235R9894c30657e297A6615P1665
$$ 138270 -161401 151191 100798 -22687 77298 202533 302427 -330657 -5297 16615 88280
12784H8280J15645Q5570a76990q0541E66184C2919a13139H2204a51033C66831
$$ 88280 203925 289495 -176990 -257531 566184 32919 -113139 82204 -151033 366831
12773A18973J70773a13096C74Q3134a8425B08672I8641a9899k18832A64925e9352
$$ 118973 289746 -113096 374 83508 -18425 208672 98641 -19899 -238731 164925 -59352
12761D42284A07836l7819n848P7401e385C12082b30225A51557d5072l1071j9590
$$ 442284 107836 70017 64169 141570 -5385 312082 -230225 151557 -45072 -76143 -95733
12750i5733C0001c15010h4854l6012j66284D71195a90449P3666F8371L8606K48688
$$ -95733 30001 -315010 -84854 -120866 -287150 471195 -190449 -116783 68371 106977 355665
12739C55665A52660N2156J27737j54838n8057a16210g192C72391F84d2209j04438
$$ 355665 152660 204816 332553 177715 119658 -116210 -7192 372391 684 -42209 -146647
12728a46647F7655J68172b99555B53478D7703R4521F7348A7960c64720J62780
$$ -146647 67655 235827 -299555 253478 47703 142224 67348 17960 -364720 -201940
12718b01940R5021o1976c3080k56192A38606d8088H5333J00126J84718A0029L55405
$$ -201940 -106919 -168895 -33080 -289272 138606 -48088 85333 185459 370177 10029 365434
12707C65434A69795m4541j9721N36126B45036q8902N6306b433H609J39291A9734
$$ 365434 169795 125254 105533 641659 245036 156134 212440 -2433 8609 147900 19734
12695A24303D5607J2630L9147m391O0126E0125a05692b7149k25629a09421B55883
$$ 124303 45607 58237 97384 92993 153119 50125 -105692 -27149 -252778 -109421 255883
12683b2477E8564c8502D01423A0362R3855f6261B33854a8408k16630E456K50381
$$ -22477 58564 -38502 401423 10362 104217 -66261 233854 -18408 -235038 5456 255837
12672B55837r9568g2083B5349b66275A99022P4526a21266C92109I887J81124e370
$$ 255837 156269 -72083 25349 -266275 199022 273548 -121266 392109 9887 191011 -5370
12660D4622a16348F5480f2920I682M9042Q8152o0323a09584D45987f928j6286
$$ 44622 -116348 65480 -62920 9682 58724 146876 86553 -109584 445987 -6928 -23214
12649b3214k23510b7493I9488J31281B748J28209d404k30498J14063A61590d71248
$$ -23214 -246724 -27493 99488 230769 2748 130957 -4404 -234902 -120839 161590 -471248
12637B6577J2169j3839d0429A32792h8614C8165M154O7152Q7897R6495f5085A38829
$$ 26577 38746 24907 -40429 132792 -88614 38165 42319 109471 197368 293863 -65085 138829
12624I1011L54076D2905K02319B2338A41J65908a09411I7233O5827e5348A15734
$$ 91011 445087 42905 245224 22338 141 166049 -109411 97233 163060 -55348 115734
12612A99322F228j145a63771A52081C8705a50035e256A09532c01770A8016J16744
$$ 199322 6228 5083 -163771 152081 38705 -150035 -5256 109532 -301770 18016 134760
12601A34760h6593B38409h4465B63345F4663M9573c164F409e8605C65041m8658
$$ 134760 -86593 238409 -84465 263345 64663 114236 -3164 6409 -58605 365041 316383
12590C16383E7186J39779a8587C1571L11322H7578A0868K66447i5971B30791K1931
$$ 316383 57186 196965 -18587 31571 342893 87578 10868 277315 -95971 230791 252722
12579B52722p3484J25085C0496L1167K9572d3254A88492r579h5820c8489C2998
$$ 252722 179238 304323 30496 61663 91235 -43254 188492 178913 -85820 -38489 32998
12567B78892F1991J6620J293g709A61026n2189e6801j63195A51279b55611A75640
$$ 278892 61991 78611 79904 -7709 161026 108837 -56801 -219996 151279 -255611 175640
12555a21221C2576a18777E3976J1189a86489B2009f6534l1532G2322a9154j01135
$$ -121221 32576 -118777 53976 65165 -186489 22009 -66534 -98066 72322 -19154 -120289
12544a20289G451J2584Q5832a2319A69272g7188B75455a17202j8121m7081D0612
$$ -120289 7451 20035 105867 -12319 169272 -77188 275455 -117202 -135323 -182404 40612
12532B25284b61813d7773J9270j4645C8065Q0467A3029L5929N95Q2886b26056
$$ 225284 -261813 -47773 -28503 -43148 38065 118532 13029 48958 49553 132439 -226056
12520B79727a62466O6144a0444p8046q0040Q2542L2206h219l5697A59337b03185
$$ 279727 -162466 -96322 -10444 -88490 -168530 -85988 -53782 -8219 -43916 159337 -203185
12508g1094q3613D4403J13907G8302a94278D20929B6653J23180b11934K0660f132
$$ -71094 -154707 44403 158310 78302 -194278 420929 26653 149833 -211934 -191274 -6132
12496a44000A21465J41568d63985f4573A36439J47795k7322a58795A5982a61635
$$ -144000 121465 263033 -463985 -64573 136439 284234 256912 -158795 15982 -161635
12485I7585A0985K6654b16226a6919p5925o4847d7777G6447a71597A01306b43716
$$ 97585 10985 37639 -216226 -16919 -92844 -157691 -47777 76447 -171597 101306 -243716
12473g086A81498B114O1444K0139B3611b06504L5062H7156d7589A52483b97095
$$ -7086 181498 2114 63558 83697 23611 -206504 -171442 87156 -47589 152483 -297095
12461b62587G7123E209b5591B50235F5756K3387D3023b09260j2739h2293l9907
$$ -262587 77123 5209 -25591 250235 65756 89143 43023 -209260 -221999 -82293 -122200
12450a22200j65711c1468j23609H7980K20595f3394B19342d47268f4118m05040
$$ -122200 -287911 -31468 -155077 87980 308575 -63394 219342 -447268 -64118 -469158
12440d69158B18319a87241p7989C2104A0506L15686a95728B31933B3421d50560
$$ -469158 218319 -187241 -265230 32104 10506 326192 -195728 231933 23421 -450560
12429i5737B4112b791j84197A13577K05520J52462h4538q5968E4581A0066K9428
$$ -95737 24112 -2791 -186988 113577 319097 471559 -84538 -170506 54581 10066 39494
12418C9494c9995n0390j09371E2672K8950b4719k64355a7368k97977a41368B3997
$$ 39494 -39995 -90385 -199756 52672 81622 -24719 -289074 -17368 -315345 -141368 23997
12406B80910Q763e230A49960F9660a92164e7846m5646H362a11727k28248F305
$$ 280910 289673 -5230 149960 69660 -192164 -57846 -103492 8362 -111727 -339975 6305
12394c33507A4712b69891O4985C15299B3861L7694Q0868O6619b08729h6624b7643
$$ -333507 14712 -269891 -204906 315299 23861 61555 142423 209042 -208729 -86624 -27643
12382B5529K53225b80636j19746A33582D3539c8723j46748k4092f2295B42938
$$ 25529 278754 -280636 -400382 133582 43539 -38723 -185471 -209563 -62295 242938
12371A27897b7048I2386K49222H8679c0542k69334i573r0798I8404N2021K9286
$$ 127897 -27048 92386 341608 88679 -30542 -299876 -9573 -100371 98404 150425 179711
12360A79711L2677G060c637B3346e631j42990L8869n6086b6224j68613B04896
$$ 179711 212388 7060 -3637 23346 -5631 -148621 -109752 -165838 -26224 -194837 204896
12348G2398D391J74635J00755G3566J362C189J25443a67097I4436a19548j35082
$$ 72398 4391 179026 279781 73566 74928 3189 128632 -167097 94436 -119548 -254630
12337b54630B2138h4811A58534a51309O579O1551a1174A19559k5700d0158B4317
$$ -254630 22138 -84811 158534 -151309 -144730 -83179 -11174 119559 93859 -40158 24317
12325A00275J7990a91652A34422a74330c8359k9326E0563j8228b24622C85745
$$ 100275 118265 -191652 134422 -174330 -38359 -67685 50563 32335 -224622 385745
12314b45292I3227R22J51683p991b6626E0239p932M1312J59982E0228A5136g73
$$ -245292 93227 94149 245832 237841 -26626 50239 42307 83619 243601 50228 15136 -773
12301A30536j2389i0713n5976D41838A09313a78918N115O405i213A90482a31990
$$ 130536 118147 -90713 -146689 441838 109313 -178918 -173803 -167398 -9213 190482 -131990
12289A97810m0839R0103K1546a57266A68711a6742A84055d305r2316A23019c32690
$$ 197810 156971 247074 268620 -157266 168711 -16742 184055 -4305 -96621 123019 -332690
12277g245B38670a53098d8737A85304k2067J336M7744i7964C34651A08887L42273
$$ -7245 238670 -153098 -48737 185304 163237 164573 212317 -97964 334651 108887 451160
12266D51160H1777l2239N7855B8641J02041a035n3698D995J8563L43713j09848
$$ 451160 81777 49538 107393 28641 130682 -1035 -54733 4995 23558 367271 257423
12255B57423a42276B04824e7378B3918K48139a0186I6181B7334O0635a56064M0874
$$ 257423 -142276 204824 -57378 23918 272057 -10186 96181 27334 87969 -156064 -115190
12244a15190n1836C5159c8652m7017M954B20590b13793A52100n6550d0188B61086
$$ -115190 -167026 35159 -38652 -85669 -80715 220590 -213793 152100 95550 -40188 261086
12232a04985j41508B29028r2322J47414g0586B31369M1651q2475F4503K39868
$$ -104985 -246493 229028 136706 284120 -70586 231369 273020 190545 64503 304371
12222C04371D2095K50150j4428j17959P1315m5382h2603n361B78209G4149O2797
$$ 304371 42095 292245 277817 159858 231173 185791 -82603 -87964 278209 74149 136946
12211A36946a10999F3729g953I8869J82320r3764J01044H6998l0880K8013m0378
$$ 136946 -110999 63729 -7953 98869 281189 187425 288469 86998 56118 84131 43753
12200D3753b9248F483L43375C5034J58856C7076R8130O9506K6528m2094E1970
$$ 43753 -29248 6483 349858 35034 193890 37076 135206 204712 231240 189146 51970
12188d0599j03792N5354q7850E5026B1074N6938R9595R9434F734N5456K25117
$$ -40599 -144391 -89037 -176887 55026 21074 78012 177607 277041 6734 62190 287307
12177B87307a87896N8307G3436d1656B13291J2694c46142A70732D3969L35916
$$ 287307 -187896 -129589 73436 -41656 213291 225985 -346142 170732 43969 379885
12167C79885B0266J58600E5172j4772a3263l5009l02285A80440K09473E8227a60321
$$ 379885 20266 178866 55172 40400 -13263 -48272 -350557 180440 389913 58227 -160321
12155D032K02100o3609E5813a02095A68374J79593a46689I3789J09516l3055G1490
$$ 4032 206132 142523 55813 -102095 168374 347967 -146689 93789 203305 170250 71490
12143f7081A79881a35735N2312A07302h5634k39097f8794k10489K5290R1746A66187
$$ -67081 179881 -135735 -83423 107302 -85634 -324731 -68794 -279283 -253993 -162247 166187
12131C29123D7590N8715b24404L7442F0061A9147Q3345h8673D05611j63397B1186
$$ 329123 47590 106305 -224404 -186962 60061 19147 102492 -88673 405611 242214 21186
12119a4964j47717F01e126j6021j14473m4245A424J17832b28634D06426i8080
$$ -14964 -162681 601 -5126 -21147 -135620 -179865 1424 119256 -228634 406426 -98080
12107A56532b5390j75513a3112n9512C80349A02677a42107a5615m30190A30034
$$ 156532 -25390 -200903 -13112 -72624 380349 102677 -142107 -15615 -445805 130034
12096A77217J35397G7772k1807L5118h8700m455A9754a86715K9529C86211A18046
$$ 177217 312614 77772 55965 91083 -88700 -93155 19754 -186715 -157186 386211 118046
12084C6449i9123I2409d5951P791k40831a6086H3071a48892j79167a4287j53806
$$ 36449 -99123 92409 -45951 -38160 -278991 -16086 83071 -148892 -328059 -14287 -168093
12073a68093g6464D90494L70181O39385m03079I5928j1751c0301j71060C07917
$$ -168093 -76464 490494 860675 1500060 1096981 95928 84177 -30301 -201361 307917
12062D07622a25837A69461C0302C955a98847L4644N5955D9731a35161I4857g2074
$$ 407622 -125837 169461 30302 3955 -198847 -164203 -108248 49731 -135161 94857 -72074
12050A3214f875j4074B90122a87535Q4960G1859i4188q4854j24944A26095a99521
$$ 13214 -6875 -20949 290122 -187535 -102575 71859 -94188 -179042 -303986 126095 -199521
12038A0073a61918r1357A69432a45471A70863J2920c59985H5133J5234L7833Q9837
$$ 10073 -161918 -253275 169432 -145471 170863 183783 -359985 85133 100367 138200 228037
12027B28037r7238q62a10951B41787a72384B26893a29867j05786a724j2588n4281
$$ 228037 130799 129937 -110951 241787 -172384 226893 -129867 -235653 -1724 -14312 -68593
12016f8593A85041p3363g364F888K1371J87680G4742f4037C62394j73389J67235
$$ -68593 185041 111678 -7364 6888 28259 215939 74742 -64037 362394 189005 356240
12005C56240A4303M9687b28338k5944k3496A00049b00539k73914A06038E2086
$$ 356240 14303 63990 -228338 -254282 -277778 100049 -200539 -474453 106038 52086
11994c02249a35379F0083b5014k86169L3104J17072B82775c99833a99224i13j49060
$$ -302249 -135379 60083 -25014 -311183 -278079 -161007 282775 -399833 -199224 -913 -149973
11983a49973e3437j78371E2281j1274a07320B28184E2659a36888F5731d786j73432
$$ -149973 -53437 -231808 52281 41007 -107320 228184 52659 -136888 65731 -4786 -178218
11972a78218O7981C9106J40082a94884d0344o0062j20569P6826A19908L58607
$$ -178218 -110237 39106 179188 -194884 -40344 -100406 -220975 -144149 119908 478515
11962D78515b3863A56688a92296B39278a67044O7232M192j07783Q436j7736n7998
$$ 478515 -23863 156688 -192296 239278 -167044 -99812 -95620 -203403 -194967 -212703 -270701
11951b70701a17718B01567f5449H5194a67652A57315g8474k716L5046F4908e9494
$$ -270701 -117718 201567 -65449 85194 -167652 157315 -78474 -81190 -46144 64908 -59494
11939i1343d543m4475J3887l46424D27090a02066D3879K23443A5899a63059j2473
$$ -91343 -4543 -49018 -35131 -381555 427090 -102066 43879 267322 15899 -163059 -175532
11928a75532A19433H500i3727a5772r6514A77344o3710A4232J23193P8803H5909
$$ -175532 119433 8500 -93727 -15772 -112286 177344 113634 14232 137425 216228 85909
11916i1938k08018g4060o6487e6776D2409K94735A32646j565c96957a89734F202
$$ -91938 -299956 -74060 -140547 -56776 42409 337144 132646 131081 -396957 -189734 6202
11904a56573B2424b92033g3247k4804o7463B56988g3665D7182a77569D16963A26213
$$ -156573 22424 -292033 -73247 -98051 -165514 256988 -73665 47182 -177569 416963 126213
11892b05436j44180B5041a56986O4144n7614A41551D6657c23440b4145j13829
$$ -205436 -349616 25041 -156986 -92842 -150456 141551 46657 -323440 -24145 -137974
11882a37974B72775b19824E4859a00125a7411k20369a15170L8185K1783E3688
$$ -137974 272775 -219824 54859 -100125 -17411 -237780 -115170 -76985 -55202 53688
11871A55524c6779A27620Q2963a78737J3616q8248a1531j05571A99587a22249
$$ 155524 -36779 127620 210583 -178737 -165121 -253369 -11531 -117102 199587 -122249
11860g8436n4116o2398C58412a16048A27256b0817A34776K92273b96241F571g7040
$$ -78436 -132552 -194950 358412 -116048 127256 -20817 134776 427049 -296241 6571 -77040
11848d8454m2609A17701A4423a17360j2277B4340b85562h4466j3276k76297J4750
$$ -48454 -91063 117701 14423 -117360 -129637 24340 -285562 -84466 -97742 -374039 -359289
11837c59289B3902J03878A0360f3474j10658j6370j25588J44096f8804m9930C10955
$$ -359289 23902 127780 10360 -63474 -174132 -190502 -316090 -171994 -68804 -118734 310955
11825G1129a0908k43364a16487A68593h2448j60112A79580g1240G5309a29304
$$ 71129 -10908 -254272 -116487 168593 -82448 -242560 179580 -71240 75309 -129304
11814C1985J08856h5607j17762R6604k86831I2681M6445L8848e5478j28777A07710
$$ 31985 140841 -85607 -203369 -106765 -393596 92681 139126 177974 -55478 -184255 107710
11802C09545b69440c4348A26030J61121F8211b911B31466B7687J26172h8893p0101
$$ 309545 -269440 -34348 126030 287151 68211 -2911 231466 27687 153859 -88893 -158994
11791a58994E5903Q2872b132C055J82248b95819A08672c886H9945O9642a02312
$$ -158994 55903 138775 -2132 3055 185303 -295819 108672 -3886 89945 159587 -102312
11779A8167Q7418D2534K06696b62514B4892J22075A3705K19733c55314B02232
$$ 18167 105585 42534 249230 -262514 24892 146967 13705 233438 -355314 202232
11768a28786j52769H0433h827j43319B65617b70662e2913E7835a86773B66886
$$ -128786 -281555 80433 -8827 -152146 265617 -270662 -52913 57835 -186773 266886
11757A90445g3438C94442a37259B1435a13101a6345B23818d6315C3564a33476
$$ 190445 -73438 394442 -137259 21435 -113101 -16345 223818 -46315 33564 -133476
11746I9063N838a92096f4843B50907a44694k02504B37420c64898h9929h183A00794
$$ 99063 104901 -192096 -64843 250907 -144694 -347198 237420 -364898 -89929 -8183 100794
11734b14525C3942J94963J31645A08361Q1425a96096C16704a47548A48354a03851
$$ -214525 33942 228905 360550 108361 189786 -196096 316704 -147548 148354 -103851
11723a93326E3429C119K64600H2587K8676J127B3892J17592D6149j302a02891
$$ -193326 53429 3119 267719 82587 111263 112390 23892 141484 46149 44847 -102891
11711D2427L50631j11454B0764G851a73176A0688f5621C9630k174b96844A77293
$$ 42427 393058 281604 20764 7851 -173176 10688 -65621 39630 37456 -296844 177293
11699D82988b46519A39527l3999b47614Q0144D6419a84562o466E9986J2500b60369
$$ 482988 -246519 139527 105528 -247614 -167470 46419 -184562 -191028 59986 72486 -260369
11687C5267e1422C52393F9300J77331p5621b22550k42277F1479J63862a92476
$$ 35267 -51422 352393 69300 246631 171010 -222550 -464827 61479 225341 -192476
11676F0830J7090K39350a5782A45298B678J18114n3652a01182A12214K5319a05605
$$ 60830 77920 317270 -15782 145298 2678 120792 67140 -101182 112214 137533 -105605
11664a32100N3514A11145b372B71610a33996I650J19682c14689A6480R3203J40093
$$ -132100 -78586 111145 -2372 271610 -133996 9650 129332 -314689 16480 109683 249776
11653B49776h5457k3860k6724A18064h3537F8025L7248a29380F4938a30520I3911
$$ 249776 -85457 -109317 -136041 118064 -83537 68025 105273 -129380 64938 -130520 93911
11641d9544A92798C3644L478j6209h1351H7745a80981d4361l0685D1949J38437
$$ -49544 192798 33644 37122 20913 -81351 87745 -180981 -44361 -75046 41949 180386
11630A80386K1199g8030j21527q9872R0641h0602j60542e5681C08474k3191e4778
$$ 180386 201585 -78030 -199557 -289429 -198788 -80602 -241144 -55681 308474 285283 -54778
11618A09283b57509i9821b5247C55526G1882Q977a8121A90668b9899C87K38729
$$ 109283 -257509 -99821 -25247 355526 71882 80859 -18121 190668 -29899 387 239116
11607B39116G2688K26134C3705l232c526E41620E7713f1983A04758C4165K15301
$$ 239116 72688 298822 33705 30473 -3526 541620 57713 -61983 104758 34165 249466
11596B49466F1273a4952B96324A06890k7574h8990F3675h929j90651M5996a3381
$$ 249466 61273 -14952 296324 106890 79316 -88990 63675 -8929 -199580 -153584 -13381
11584B20146H7183g1523B1151N5958d13213B27530J62860A33415L8378l8497O8572
$$ 220146 87183 -71523 21151 77109 -413213 227530 390390 133415 171793 133296 201868
11573B01868n4038K99043j46055b45431D5315i2320D26325p5736a782r0206B62563
$$ 201868 147830 446873 300818 -245431 45315 -92320 426325 350589 -1782 -91988 262563
11561A39583a04931L6541k72052i6262f309B5793h9525A61677Q6122b80691A3282
$$ 139583 -104931 -68390 -340442 -96262 -6309 25793 -89525 161677 247799 -280691 13282
11549A15052J65769j9992j00023L56804B07308f1894m4097A28724g5089I510K52303
$$ 115052 280821 260829 160806 517610 207308 -61894 -105991 128724 -75089 9510 261813
11538B61813j24989J5469E83a45573K0812A32583P0656o5309J44506C9409a74639
$$ 261813 136824 152293 583 -145573 -124761 132583 203239 137930 282436 39409 -174639
11526E8970K5884J69416I6950O59704F6643O3055d4713A12954l0338K06220a33902
$$ 58970 84854 254270 96950 756654 66643 129698 -44713 112954 82616 288836 -133902
11514B05312A6502J52230a92008A05852K34641b033B81316b71407D36028A48812
$$ 205312 16502 168732 -192008 105852 340493 -2033 281316 -271407 436028 148812
11503A67521n3791a23263j30050J16498F6650J33880J84079A81486c57439B00453
$$ 167521 113730 -123263 -253313 -136815 66650 200530 384609 181486 -357439 200453
11492I2188k3628L019d568c37C24095p2737A18305a1478F0332J77081F1181J83866
$$ 92188 68560 71579 -4568 -337 324095 251358 118305 -11478 60332 237413 61181 245047
11480B45047J606G5897O6990K95901A46392P5389J9219K97553B04302q4936d3957
$$ 245047 246653 75897 142887 438788 146392 221781 241000 538553 204302 119366 -43957
11468E3962J80731G5351b13548c9257B42897E7233K9030b04530D2930f9139j41602
$$ 53962 234693 75351 -213548 -39257 242897 57233 86263 -204530 42930 -69139 -210741
11457b10741H4308h631I4308f9730J6095A85796l0772J6952G1663m983B9290J00279
$$ -210741 84308 -8631 94308 -69730 -53635 185796 155024 171976 71663 66680 29290 129569
11445A29569L930C0375L85987A49772a78291N2251O1301D3476d0650e17j44911
$$ 129569 133499 30375 416362 149772 -178291 -126040 -64739 43476 -40650 -517 -145428
11434a45428D8589a46595B2751e2108p0361n2854B80192a42737J0739j44811B19382
$$ -145428 48589 -146595 22751 -52108 -122469 -175323 280192 -142737 -131998 -276809 219382
11422i8522j07939A62112J209Q0734E8270K2346a48053A32414h6433b6312j04054
$$ -98522 -206461 162112 163321 244055 58270 80616 -148053 132414 -86433 -26312 -130366
11411a30366D49a46768D944N0385p015J64681a01879D54222H2421g807r4865A81255
$$ -130366 449 -146768 4944 55329 48314 212995 -101879 454222 82421 -7807 -102672 181255
11398a29235A43661b8527C27728A9194K02952a45509Q708A78944b05810C68056
$$ -129235 143661 -28527 327728 19194 222146 -145509 -136801 178944 -205810 368056
11387A24000m7288k501b89482A38909c93945B68950I447J68767a31228A38268
$$ 124000 76712 74211 -289482 138909 -393945 268950 9447 178214 -131228 138268
11376A16961a32248A5820J85357P5649k4445r292b25484D01814a40732A6985J03225
$$ 116961 -132248 15820 201177 276826 252381 243089 -225484 401814 -140732 16985 120210
11365A20210f9700J1958j26892j9736e32j04116j47714n5149b4853C8918j1580
$$ 120210 -69700 -57742 -184634 -204370 -532 -104648 -252362 -307511 -24853 38918 27338
11354B7338K7418a05616C35388G489a6969G7928b9292A42844f3603k27329F1374
$$ 27338 54756 -105616 335388 7489 -16969 77928 -29292 142844 -63603 -290932 61374
11342a23568F3312e5394E8074b99283e6628B38520a03927Q789d4144A09452g8079
$$ -123568 63312 -55394 58074 -299283 -56628 238520 -103927 -95138 -44144 109452 -78079
11330D3152K1917K07812A05811j0354a38715d5621F9344A0339b70200I3919B8286
$$ 43152 65069 272881 105811 95457 -138715 -45621 69344 10339 -270200 93919 28286
11318A61838p3692O6664B6612a18914L4141K8680b7032j60979b4745j72711C4611
$$ 161838 88146 154810 26612 -118914 -84773 -56093 -27032 -188011 -24745 -197456 34611
11306b28574A70055a47719d3314A5984a32414j50017B586M6449j5333J87538D3997
$$ -228574 170055 -147719 -43314 15984 -132414 -282431 2586 49035 33702 221240 43997
11294A16022a05965b6944q8573E1869a21374p3199R272B7808P2840J9828N1297
$$ 116022 -105965 -26944 -115517 51869 -121374 -194573 -185301 27808 100648 120476 171773
11283A71773m4585a03248D5245b94145a05474j2804d3448e47n307A8302e278q7132
$$ 171773 127188 -103248 45245 -294145 -105474 -118278 -43448 -547 -5854 18302 -5278 -92410
11271i2410b1038A0568a60144A56417c80754P6845B73241g4666B03289b78257
$$ -92410 -21038 10568 -160144 156417 -380754 -303909 273241 -74666 203289 -278257
11260e5287A10125a90624g5921A01534L5984a25239j47217I600b41848A84639
$$ -55287 110125 -190624 -75921 101534 137518 -125239 -272456 9600 -241848 184639
11249d7521B4339A1236K07141i2171B86511a07448e3622A56455p6227m386d77230
$$ -47521 24339 11236 218377 -92171 286511 -107448 -53622 156455 80228 75842 -477230
11237C08886b35238p9017a6009m8467F6282l2665Q4589a45859p6549e9033C8447
$$ 308886 -235238 -314255 -16009 -64476 66282 33617 118206 -145859 -222408 -59033 38447
11225A60037i4261C2986J62203b15997R0709A64916E9503a71438P5041K5436a1378
$$ 160037 -94261 32986 195189 -215997 -125288 164916 59503 -171438 -96397 -70961 -11378
11213F701e4974j43876B94660i1111B08335B0936a93042d3233H583a5548j97231
$$ 6701 -54974 -198850 294660 -91111 208335 20936 -193042 -43233 8583 -15548 -212779
11202b12779j54583a15249B1792a90733l2k8394A68086b48948d7016a9641j1972
$$ -212779 -367362 -115249 21792 -190733 -190765 -219159 168086 -248948 -47016 -19641 -31613
11191c1613q0410G9488l1358h9250K4630j03125b7688m2704A12810b13584E3006
$$ -31613 -112023 79488 48130 -89250 -64620 -167745 -27688 -70392 112810 -213584 53006
11179d50439a1962j65155k14607J48905o3827d365j63148j39446a17978A26066
$$ -450439 -11962 -177117 -391724 -242819 -306646 -4365 -167513 -306959 -117978 126066
11168a38801P914J3774m2810F779J0914a4872A22465C6983d4993B48299L1000
$$ -138801 -130887 -117113 -159923 6779 17693 -14872 122465 36983 -44993 248299 279299
11157B79299a54907d5902j34589a0785E7106K46944b26927h4178P916j75760M4695
$$ 279299 -154907 -45902 -180491 -10785 57106 304050 -226927 -84178 -76262 -252022 -207327
11146b07327I7589K868B9862a68692H8857a31731D8715b8473A38118a44407O5641
$$ -207327 97589 100457 29862 -168692 88857 -131731 48715 -28473 138118 -144407 -78766
11135g8766H8435M139J2020J5590Q9184r9517K44898H7219A3735K10713a1437
$$ -78766 88435 92574 104594 120184 209368 109851 354749 87219 13735 224448 -11437
11123H4345K01726A22063L809b25043N7390g36B08349l3718a32025q1779c0053
$$ 84345 286071 122063 125872 -225043 -167653 -736 208349 174631 -132025 -213804 -30053
11111e4365A00703J10055b03168B80979J70722i5850F2737D228K7239R5330E9244
$$ -54365 100703 210758 -203168 280979 451701 -95850 62737 4228 31467 126797 59244
11099B06443K3917K83708r8795A04307a63206A37767C8465M6288a29768C00003
$$ 206443 230360 514068 415273 104307 -163206 137767 38465 84753 -129768 300003
11088A11539l366L6427g3401C39456k3939A5145L19792j42924g1125D30391A73855
$$ 111539 108173 144600 -73401 339456 315517 15145 334937 192013 -71125 430391 173855
11076E25375A24553J54745J61803I9478K88520a1917C17064G3691K84089N2624
$$ 525375 124553 279298 441101 99478 387998 -11917 317064 73691 357780 410404
11066D10404J19924A86016J40278j58740j1757N2692J84083A56739K36994J69832
$$ 410404 530328 186016 326294 167554 155797 208489 392572 156739 393733 563565
11056E63565k2533j26684K50018j63961j7867L46002j17443j40133k55560O00403
$$ 563565 541032 414348 664366 500405 482538 828540 711097 570964 315404 915807
11046I15807j98902J14593j03342j75262L28837k03140M6293k55815L08000j94136
$$ 915807 716905 831498 728156 552894 881731 678591 724884 469069 777069 582933
11036E82933p6226K1905J85245j54598J65642r0236j10474j82426N08406l24897
$$ 582933 506707 528612 713857 559259 724901 634665 524191 341765 850171 525274
11026E25274K13678j34000J48743k7856j44840M8215l4257A67388K74296L76392
$$ 525274 738952 604952 753695 725839 580999 629214 594957 167388 441684 818076
11016H18076j98058R6617k46550K75128l67524M29036P132k2666k60729m5186
$$ 818076 620018 716635 470085 745213 377689 806725 813857 791191 530462 485276
11006D85276J14104L14867k28461k44371J10700M04349K6884D40388N01250m27817
$$ 485276 599380 914247 685786 441415 552115 956464 983348 440388 941638 513821
10996E13821P8530M0632R9218p8396j22427L24424J4421o4325L00522J55122J6717
$$ 513821 592351 632983 732201 653805 531378 855802 870223 805898 1106420 1261542 1278259
10985A278259n92623J99948M61773k37979J33501N5184K05709k6914j57507M85305
$$ 1278259 685636 885584 1347357 1109378 1242879 1298063 1503772 1476858 1319351 1804656
10975A804656J05076K04462R6671K99218L90679r735j10967k51894L6863l14854
$$ 1804656 1909732 2114194 2210865 2510083 2900762 2891027 2780060 2528166 2565029 2250175
10965B250175n0755j08378k50174J2906M895K04979K23130j48173l68107K29514
$$ 2250175 2199420 2091042 1840868 1853774 1858669 2063648 2286778 2138605 1770498 2000012
10955B000012J87020J6649n19778j42963k72696n69511m1009l7679K05883l19552
$$ 2000012 2187032 2203681 1683903 1540940 1268244 698733 657724 620045 825928 506376
10945E06376K42485B14490H4714K63822j11333L19521f193E15114B34665P1622
$$ 506376 748861 214490 84714 348536 237203 556724 -6193 515114 234665 306287
10935C06287m0422j19530J32658K40457B6947c3852B73515e6261A91621e9914
$$ 306287 265865 146335 278993 519450 26947 -33852 273515 -56261 191621 -59914
10924A06786L8072k0949K98902K4728a19059A26979g6190B12254a11597l6529
$$ 106786 144858 123909 422811 447539 -119059 126979 -76190 212254 -111597 -148126
10914a48126c6277B97235A21197c405j28951d0627k43711A19552R7736D851Q6620
$$ -148126 -36277 297235 121197 -3405 -132356 -40627 -284338 119552 217288 4851 91471
10903I1471b08345B93929j24200a75904E042a11343A55182P8036A13792f9658
$$ 91471 -208345 293929 169729 -175904 5042 -111343 155182 233218 113792 -69658
10892A9477a92645P4850j73748A66441a61282e4792j73836g255A74705c9658A31136
$$ 19477 -192645 -117795 -291543 166441 -161282 -54792 -228628 -7255 174705 -39658 131136
10880d6114A27109a04069G9405Q7129D7148J82840A613a81799L2549A61270b90056
$$ -46114 127109 -104069 79405 166534 47148 229988 1613 -181799 -149250 161270 -290056
10868a35287l0072M8095j3840j70014a13160D01914n5017A3635K0210N4422j4103
$$ -135287 -165359 -117264 -131104 -301118 -113160 401914 346897 13635 33845 88267 74164
10857G4164J9053e3455A32812g5168k2895m0817e927j53649g2130c5752l73514
$$ 74164 93217 -53455 132812 -75168 -98063 -138880 -5927 -159576 -72130 -35752 -409266
10846d09266A9030a46706B28469a68581F2817J86913p6264c20373J39232I1951
$$ -409266 19030 -146706 228469 -168581 62817 249730 173466 -320373 -181141 91951
10835A01110c2162A87757A8806b98743h3645B57078H2807a28298j69035a45700
$$ 101110 -32162 187757 18806 -298743 -83645 257078 82807 -128298 -297333 -145700
10824C2157f5928I2370a88850d0483l12703C5403b48320I9819a86180C6748K7204
$$ 32157 -65928 92370 -188850 -40483 -353186 35403 -248320 99819 -186180 36748 63952
10813F3952j0470c7842G3115a4948j3232E7387L73243F6113a75260A77051h0072
$$ 63952 53482 -37842 73115 -14948 -28180 57387 430630 66113 -175260 177051 -80072
10801c7225H4630A3959J93028b17009l904F3296d3121j1687G9198c643H6664a89735
$$ -37225 84630 13959 206987 -217009 -220913 63296 -43121 -54808 79198 -3643 86664 -189735
10788h9299j2106B3205h3510j43492c4180D2052i3218A95179f8009k20852I8889
$$ -89299 -101405 23205 -83510 -227002 -34180 42052 -93218 195179 -68009 -288861 98889
10776F678b0433j16468l58729J65456A73772d6581B7643J231J27459C7775e6951
$$ 6678 -20433 -136901 -495630 -330174 173772 -46581 27643 28874 156333 37775 -56951
10764A2217J41641k4111K46120A03672m5320c310k34832C14472a16709D6758Q2985
$$ 12217 153858 129747 375867 103672 58352 -3310 -238142 314472 -116709 46758 129743
10753A29743J24479c1666P365j46712K1013A21025a43138A22673C398J26449d7365
$$ 129743 254222 -31666 -24301 -171013 -150000 121025 -143138 122673 3398 129847 -47365
10741a05559M5740b5644C91599c95722a81061e7265j14905A30402b05123P5347
$$ -105559 -59819 -25644 391599 -395722 -181061 -57265 -172170 130402 -205123 -129776
10731a29776j13886l0323A37474i3687F8088C356e506k03182F4704B2340J08455
$$ -129776 -243662 -273985 137474 -93687 68088 3356 -5506 -208688 64704 22340 130795
10720A30795l2649Q7382a63320F410f2448A79331D0580b16778m4364J14318b0806
$$ 130795 98146 185528 -163320 6410 -62448 179331 40580 -216778 -261142 -146824 -20806
10708B07530b16948J02651B65154r6091a54084J6359B03854D7003b58823J07213
$$ 207530 -216948 -114297 265154 169063 -154084 -137725 203854 47003 -258823 -151610
10698a51610c2566j57058f7378A04947a16036n9949A56633a42550O2386k2270
$$ -151610 -32566 -189624 -67378 104947 -116036 -175985 156633 -142550 -80164 -102434
10688a02434D2032j5645g2706j9400k93394a74753A27792b01595c7838m6868e752
$$ -102434 42032 26387 -72706 -92106 -385500 -174753 127792 -201595 -37838 -84706 -5752
10676h4385B71897j21837f8432b7329B20914Q7543b04452D3485a99902A3555a2641
$$ -84385 271897 150060 -68432 -27329 220914 308457 -204452 43485 -199902 13555 -12641
10664b15208i128k96081B9821c72117f366l37898L2176i0344J7761l3963n2987
$$ -215208 -9128 -305209 29821 -372117 -6366 -344264 -312088 -90344 -72583 -106546 -159533
10653a59533A66140D0038f303j44947I6N6387a43664k047A24806d6835a1674k82788
$$ -159533 166140 40038 -6303 -151250 96 56483 -143664 -145711 124806 -46835 -11674 -294462
10641b94462A66913H139a16933c8450j90537O4952r8947C6486N6763J43682d2970
$$ -294462 166913 8139 -116933 -38450 -228987 -164035 -262982 36486 93249 236931 -42970
10629a87227D36386b01383l8267q1871J9081a31194m8698L0968r9053a12308k12726
$$ -187227 436386 -201383 -239650 -321521 -302440 -131194 -179892 -148924 -247977 -112308 -325034
10618c25034e3124i994j61454N5813G0195j8830c89953A23866E2563k1908K18757
$$ -325034 -53124 -9994 -171448 -115635 70195 51365 -389953 123866 52563 30655 249412
10607B49412D5374a7268G3464k5873c6201j38721M5003A7545a03823A21577a51716
$$ 249412 45374 -17268 73464 47591 -36201 -174922 -129919 17545 -103823 121577 -151716
10595i5154B02717a20514j18036D2420j8189c8922c652E0558a47888j08922A7856
$$ -95154 202717 -120514 -238550 42420 24231 -38922 -3652 50558 -147888 -256810 17856
10583c01559D529K21703n1441J27487G8006A1996D322L0004N4733J44014a20929
$$ -301559 4529 226232 174791 302278 78006 11996 4322 34326 89059 233073 -120929
10571a87899l01961A6606b95174a27170D0528a6261H51O3491d4299j40355c3269
$$ -187899 -489860 16606 -295174 -127170 40528 -16261 851 64342 -44299 -184654 -33269
10559g5014A6338M5827e4783j75303B33711a95579q2960b4319B95297e2138A56282
$$ -75014 16338 62165 -54783 -230086 233711 -195579 -278539 -24319 295297 -52138 156282
10547c10286A01069C8367e1606k07498R2389b2813D5447Q0064Q6252a97302i8424
$$ -310286 101069 38367 -51606 -259104 -166715 -22813 45447 125511 211763 -197302 -98424
10535c4841n29464h4483j58090N8470b713k35775C5960F515c18141B9716N5664
$$ -34841 -564305 -84483 -242573 -184103 -2713 -238488 35960 6515 -318141 29716 85380
10524H5380b0932A11336b47658B5187J34223K1996q2791a62590j50644h224l14427
$$ 85380 -20932 111336 -247658 25187 159410 181406 98615 -162590 -313234 -8224 -322651
10513c22651A51447a28235A57592J8037n4949L14911C1374a21700q243a4216l57371
$$ -322651 151447 -128235 157592 175629 120680 435591 31374 -121700 -129943 -14216 -371587
10502c71587e0385n4915d1662A71435a80691b8954l40935A97558b68194i6851
$$ -371587 -50385 -105300 -41662 171435 -180691 -28954 -369889 197558 -268194 -96851
10491d1233k01000F3894a19000j97955A93702a61393A14417l6166J10924o7021
$$ -41233 -242233 63894 -119000 -316955 193702 -161393 114417 78251 189175 122154
10481A22154P25495m02249K64203k74915Q6293c07943b8977j15815b109E7765
$$ 122154 847649 445400 709603 434688 520981 -307943 -28977 -144792 -2109 57765
10470d12811b06015d5884B11702B2079M510c39029B63008a4510o1127C127e0404
$$ -412811 -206015 -45884 211702 22079 26589 -339029 263008 -14510 -75637 3127 -50404
10458D1497a01484j33719e2268r0845B25982f9008j52482b4412k68451i9735j20085
$$ 41497 -101484 -235203 -52268 -143113 225982 -69008 -221490 -24412 -292863 -99735 -219820
10447b19820e4454J5983C47300K8716a49292j5143I5686F334a11073J9036D8749
$$ -219820 -54454 -38471 347300 376016 -149292 -164435 95686 6334 -111073 -92037 48749
10435d8973j0653A24292a33582j21154P5802A10998g6714j13718M8132C641a62967
$$ -48973 -59626 124292 -133582 -254736 -178934 110998 -76714 -190432 -142300 3641 -162967
10423B05026d0147D902g8143A83365p3934b46803I1142K46925N7731A35068b57890
$$ 205026 -40147 4902 -78143 183365 109431 -246803 91142 338067 395798 135068 -257890
10411b16453F4179k0401a07566A78530e515j68295c6884o588k756j45629A88754
$$ -216453 64179 43778 -107566 178530 -5515 -173810 -36884 -43472 -46228 -191857 188754
10399A1543P3321a01018o2337A82705h3892j1829A82242D9184Q627G453f4791
$$ 11543 84864 -101018 -163355 182705 -83892 -95721 182242 49184 57811 7453 -64791
10387A67309p8127J49167e7009j76465A57807A9413c7175l4966G5494J88155p9945
$$ 167309 89182 238349 -57009 -233474 157807 19413 -37175 -72141 75494 263649 183704
10376A83704d7761A49955M2020J44839H645N38309I9966R5758J97674k1494K71191
$$ 183704 -47761 149955 191975 336814 8645 546954 99966 195724 393398 371904 643095
10365F43095j17660j5809B46926L657M5561L03350p1201k06200E9003L64294A11692
$$ 643095 525435 509626 246926 250583 296144 599494 528293 322093 59003 423297 111692
10353E3745Q2980L6231K94243J7804N7337L4578A19155D4659J84382P3710J87368
$$ 53745 136725 172956 467199 485003 542340 576918 119155 44659 229041 302751 490119
10342D90119k43828L979O6232j25707n1496e5535B63990J64940A63306j7505k1575
$$ 490119 246291 250270 316502 190795 139299 -55535 263990 428930 163306 145801 124226
10331A24226i0441j86253H8003g9971A16830I074N5475L51654b4285B13608a50184
$$ 124226 -90441 -276694 88003 -79971 116830 9074 64549 416203 -24285 213608 -150184
10319G2939J46511e7966E91637B92698E2701J85701G8491a24540e4927G8345L7978
$$ 72939 219450 -57966 591637 292698 52701 238402 78491 -124540 -54927 78345 116323
10308A16323M8670J8229a12305r4244F6108M5124n398M2949a92096l1226A7064
$$ 116323 164993 183222 -112305 -206549 66108 111232 105834 148783 -192096 -223322 17064
10296e2824B58596a6387j25077A39995r193a0141k32558J9072C6671O8848C5114
$$ -52824 258596 -16387 -141464 139995 130802 -10141 -242699 -223627 36671 105519 35114
10284f7364n0937k85667B63362B0945J00735c03517A09603P692L1987C2731a007
$$ -67364 -118301 -403968 263362 20945 121680 -303517 109603 117295 149282 32731 -1007
10272H2586C44a75360E35761a8472p436q1515j8933A5591g3342B01799K7611R1819
$$ 82586 344 -175360 535761 -18472 -25908 -107423 -126356 15591 -73342 201799 229410 321229
10260C21229H4066N09874A06669h2622C19716A01163J34169a08642B21663r2232
$$ 321229 84066 593940 106669 -82622 319716 101163 235332 -108642 221663 129431
10250A29431J6501e1125j90654C60118h3075B47870g3855A42282n6118c4344a079
$$ 129431 145932 -51125 -241779 360118 -83075 247870 -73855 142282 86164 -34344 -1079
10238B57074H9338j4200A6269J56112J34812b37140A5158b91875A47827H046b5317
$$ 257074 89338 75138 16269 172381 307193 -237140 15158 -291875 147827 8046 -25317
10226b32957A50031b78971R6099l1853d9081B865P5873B7342d666C681a09190
$$ -232957 150031 -278971 -182872 -214725 -49081 2865 78738 27342 -4666 3681 -109190
10214C4014L5372g4097k624m0414j27198H2507a0134C2132d4486B6395L3149b0815
$$ 34014 69386 -74097 -76721 -117135 -244333 82507 -10134 32132 -44486 26395 59544 -20815
10201a07679N0205I1291c7125l5316L604A08569J7987o0019b48254a9607G0097
$$ -107679 -57474 91291 -37125 -72441 -68837 108569 126556 66537 -248254 -19607 70097
10189c6723k0309k94729A39863E1751l227a53223k87508J93066P4808j23227I8606
$$ -36723 -57032 -351761 139863 51751 48524 -153223 -440731 -247665 -172857 -296084 98606
10177b30794j36770F0124D268d59557i8651k85585a8073I9699O5743f5431k40262
$$ -230794 -367564 60124 4268 -459557 -98651 -384236 -18073 99699 165442 -65431 -305693
10166c05693d705B9991b77766a31310f2678k9815A99617r6884b1336k64676e9084
$$ -305693 -4705 29991 -277766 -131310 -62678 -92493 199617 102733 -21336 -286012 -59084
10154D95034a58809M354F1603e0534B3715r960b23918J02638j27082k74262a28390
$$ 495034 -158809 -154455 61603 -50534 23715 13755 -223918 -121280 -248362 -522624 -128390
10142b29112i5923A25426b19817p5171B09491a60489E0166a22585j99772J30459
$$ -229112 -95923 125426 -219817 -294988 209491 -160489 50166 -122585 -322357 -191898
10132a91898b8468j18603C67178a5741l04555B04234q3238q391B1767J18344E398
$$ -191898 -28468 -147071 367178 -15741 -320296 204234 120996 112605 21767 140111 5398
10120a38965j15298R5300A63291a8613j78437F7253c36981f6155l3485M1487n2220
$$ -138965 -254263 -158963 163291 -18613 -197050 67253 -336981 -66155 -99640 -58153 -110373
10109a10373D7466J3387q81b2072D14653a59230j39630Q2875c3574j38603M9539
$$ -110373 47466 60853 59972 -22072 414653 -159230 -298860 -215985 -33574 -172177 -122638
10098a22638j40637A66525f7337j39646C1087h7693I4950a736A22451b72471h5879
$$ -122638 -263275 166525 -67337 -206983 31087 -87693 94950 -1736 122451 -272471 -85879
10086B58990c56245e7878C12025I2340j3054a9167A11011J53114a26381m9826
$$ 258990 -356245 -57878 312025 92340 79286 -19167 111011 264125 -126381 -176207
10076a76207p3905B5854O8619J9324e9250p4493p1356Q3107K2308j58373A6565
$$ -176207 -250112 25854 94473 113797 -59250 -133743 -205099 -121992 -99684 -258057 16565
10064g5742A84324a12546D9154L407K27965A3227d5470k33458h8772E4886K1724
$$ -75742 184324 -112546 49154 52561 280526 13227 -45470 -278928 -88772 54886 76610
10053G6610h310k00696C06981H448L58797a97804f0247j14386B94843a90408Q0004
$$ 76610 -8310 -209006 306981 8448 367245 -197804 -60247 -174633 294843 -190408 -110404
10042a10404J332l4551e885A10414a21236I3805d80746e1779A9789a92014B223
$$ -110404 -109072 -143623 -5885 110414 -121236 93805 -480746 -51779 19789 -192014 2223
10030c98071A8951P4707c1869j87423B73587D1332c59333h5742E1634Q8562a47136
$$ -398071 18951 93658 -31869 -219292 273587 41332 -359333 -85742 51634 140196 -147136
10018a57219K7645A72912a20177I074R1246h871k31735O3355A09423g0470j56208
$$ -157219 -129574 172912 -120177 9074 100320 -8871 -240606 -177251 109423 -70470 -226678
10007b26678j67273E905O7498d5084p9850j10274L6465b4719B792K8483M22931
$$ -226678 -393951 5905 73403 -45084 -124934 -235208 -198743 -24719 2792 31275 454206
9996D54206b78567P0234n7434F4501k5822K10464A9043d29576a0471q1043j05972
$$ 454206 -278567 -208333 -265767 64501 38679 249143 19043 -429576 -10471 -91514 -197486
9985a97486l1313G3604d28371g5774C3382a84592l586k31259J71506m4655E9586
$$ -197486 -228799 73604 -428371 -75774 33382 -184592 -188178 -419437 -247931 -292586 59586
9973c42188a27419b4854m10202A85441b93973a8554k37883a06992k45081a19194
$$ -342188 -127419 -24854 -435056 185441 -293973 -18554 -256437 -106992 -352073 -119194
9962h9730o6524J012A65628b09169B59928E3248c32537G0354a03748k42505F8005
$$ -89730 -156254 -155242 165628 -209169 259928 53248 -332537 70354 -103748 -346253 68005
9950G2610a07071H849c22979p7453H6555a2275m08161H2442N8199i2950b5937
$$ 72610 -107071 8849 -322979 -400432 86555 -12275 -420436 82442 140641 -92950 -25937
9938a98397q0752b4186g444E5339i1520k4842H4589b50317J08561B51223D1048
$$ -198397 -279149 -24186 -7444 55339 -91520 -116362 84589 -250317 -141756 251223 41048
9926I6553K0778a50724A56263b972A16993b27326E5928c2164C9278b69781C065
$$ 96553 117331 -150724 156263 -2972 116993 -227326 55928 -32164 39278 -269781 3065
9914a92167k24299A3915c2938j54449e209C1625a42606B575J15072b94528h4107
$$ -192167 -416466 13915 -32938 -187387 -5209 31625 -142606 2575 117647 -294528 -84107
9902F8359J42174p7367O8655g9183A05054M7502J0064a06756L8117K9027k9050
$$ 68359 210533 133166 201821 -79183 105054 152556 162620 -106756 -68639 -39612 -68662
9891f8662j28986m2472a04751m10144g8815b5007B8439a32851l3883I0582F357
$$ -68662 -197648 -240120 -104751 -514895 -78815 -25007 28439 -132851 -166734 90582 6357
9879E2388a70874j14916n0353L2865k0514M1485B9943K7587a86902I9029M9708
$$ 52388 -170874 -285790 -336143 -303278 -323792 -282307 29943 57530 -186902 99029 148737
9868A48737k720a06797G1701K60223c32101a15992n3519I9418K025M7262B0035
$$ 148737 146017 -106797 71701 331924 -332101 -115992 -169511 99418 101443 148705 20035
9856C0290b12630n2394a12589A15270J59958E3193a85648N1237A04369e6258m39898
$$ 30290 -212630 -265024 -112589 115270 275228 53193 -185648 -134411 104369 -56258 -496156
9845d96156D1153Q1186b03495C07545G3481a04273k48626F1403J38991a40040
$$ -496156 41153 122339 -203495 307545 73481 -104273 -352899 61403 200394 -140040
9834B8212a91409j07073i6276I6889e677A9035a96322e4242m35824b0120A47336
$$ 28212 -191409 -298482 -96276 96889 -5677 19035 -196322 -54242 -490066 -20120 147336
9822c23434A00492b70924a04620l7862P0690I5821c95842A76592L3914A8526a57314
$$ -323434 100492 -270924 -104620 -142482 -71792 95821 -395842 176592 210506 18526 -157314
9810c73679H7463J34283B5964K4278a0355r0744E9818J91644I8598d0176n6267
$$ -373679 87463 221746 25964 50242 -10355 -101099 59818 251462 98598 -40176 -96443
9799i6443B2180c37424H8991a87452j20547D7574a41217j08602C1200J10529a83080
$$ -96443 22180 -337424 88991 -187452 -307999 47574 -141217 -249819 31200 141729 -183080
9787A24237c85404J81693A1349P8811J02901q6702b04212B23359f2029j24074
$$ 124237 -385404 -203711 11349 90160 193061 106359 -204212 223359 -62029 -186103
9777a86103b9466k37447E503c53116g7301q1513a1418C02912b47197d6596p5435
$$ -186103 -29466 -266913 5503 -353116 -77301 -158814 -11418 302912 -247197 -46596 -122031
9766a22031C2549i4578k7837j57156E4245J35845d9145G4687a59546j19824D80939
$$ -122031 32549 -94578 -122415 -279571 54245 190090 -49145 74687 -159546 -279370 480939
9754a11415c4941A26660a85227j64194d6295A80778E3705c12129h0070F7631i2254
$$ -111415 -34941 126660 -185227 -349421 -46295 180778 53705 -312129 -80070 67631 -92254
9742a87688O6517k38938a75402A43351e26220D98160B41438e2321B91313a8759
$$ -187688 -121171 -360109 -175402 143351 -526220 498160 241438 -52321 291313 -18759
9731D1321c9269r7874O3858k15853a27436k06449H1934b41820a00022j11976i3972
$$ 41321 -39269 -137143 -73285 -289138 -127436 -333885 81934 -241820 -100022 -211998 -93972
9719A45386b73620H6068J00978J6447c51021A07675a81943I8413a43711j04250
$$ 145386 -273620 86068 187046 203493 -351021 107675 -181943 98413 -143711 -247961
9709b47961i6418A9911a40086A70620A5275F565J88387b15916c1818J5253o4774
$$ -247961 -96418 19911 -140086 170620 15275 6565 194952 -215916 -31818 -16565 -81339
9698h1339n7958D9820a74059b2009K740H3072b83319J08868a077F4362c77440
$$ -81339 -139297 49820 -174059 -22009 -19269 83072 -283319 -174451 -1077 64362 -377440
9686a10779e2721k09314B770K090J44302d34951A58220g1444n3338B1530J15232
$$ -110779 -52721 -262035 2770 4860 149162 -434951 158220 -71444 -124782 21530 136762
9675A36762j7832E8791b63247B32974b69779m1225J17245j41242A45876b70693
$$ 136762 118930 58791 -263247 232974 -269779 -311004 -193759 -335001 145876 -270693
9664a20231B25486K0221p7551a8495k12509A24960b04371a7717l3690j15979F5749
$$ -120231 225486 245707 168156 -18495 -231004 124960 -204371 -17717 -51407 -167386 65749
9652b57575J09733q7139H7974e9131A56699f6788k34515a10855d9241K0841H2621
$$ -257575 -147842 -234981 87974 -59131 156699 -66788 -301303 -110855 -49241 -28400 82621
9640a22791A91019E3844O224k7784A3297J5862R4154c80333a12667j92869J33070
$$ -122791 191019 53844 60068 32284 13297 29159 123313 -380333 -112667 -305536 -172466
9629a72466D6605f0400j31033K1524b9219A24468b69397A3911Q6950B7681a30674
$$ -172466 46605 -60400 -191433 -169909 -29219 124468 -269397 13911 100861 27681 -130674
9617A73749k3680c20146B2722a36374C93827g30j57523j14145C4562b94632C5396
$$ 173749 150069 -320146 22722 -136374 393827 -730 -158253 -272398 34562 -294632 35396
9605b2686D74090B07835b38584D63815c05835R8873e6977A6159b39191g0843G7721
$$ -22686 474090 207835 -238584 463815 -305835 -206962 -56977 16159 -239191 -70843 77721
9593I7462R2972C1489d71791K09239a9598k30850c3749A75450a03874N0213j73281
$$ 97462 190434 31489 -471791 -262552 -19598 -250448 -33749 175450 -103874 -53661 -226942
9582b26942B1921a40651H6553a34604Q326n114n8923B81980A20556c9117l26765
$$ -226942 21921 -140651 86553 -134604 -126278 -131392 -190315 281980 120556 -39117 -365882
9571c65882i3584r2894j01278J26420O398N4192B83269A10103f5792A32578b15290
$$ -365882 -93584 -186478 -287756 -161336 -154938 -100746 283269 110103 -65792 132578 -215290
9559b79283E2995b216k78141B62229H7744K4254h7945B7606b85709F8350c5588
$$ -279283 52995 -2216 -280357 262229 87744 111998 -87945 27606 -285709 68350 -35588
9547a2829k58448d578l93348a24345p2449A25720d5678b917A92433c0953j28745
$$ -12829 -271277 -4578 -397926 -124345 -196794 125720 -45678 -2917 192433 -30953 -159698
9536a59698g2238o2811O3894q0484j07814K6866b8302B97783A39856e0242J5422
$$ -159698 -72238 -135049 -71155 -151639 -259453 -232587 -28302 297783 139856 -50242 -34820
9525c4820C16463c9961j61183N6731L3673j30604A77352i9726k80772H9637c31749
$$ -34820 316463 -39961 -201144 -144413 -110740 -241344 177352 -99726 -380498 89637 -331749
9513a57262o4798F4130J51311n9326a55041L7382a4968e709j0121j74217L341
$$ -157262 -222060 64130 215441 156115 -155041 -117659 -14968 -5709 -15830 -190047 -186706
9502a86706c0854J5360k65803R4501B57477I3397a4753A4628i893j25428D8939
$$ -186706 -30854 -15494 -281297 -186796 257477 93397 -14753 14628 -9893 -135321 48939
9490A39614b02479K4256f9374q4058j18473G7376a25652A02645r755a56689j52110
$$ 139614 -202479 -178223 -69374 -153432 -271905 77376 -125652 102645 92890 -156689 -308799
9479c08799A04833E181g1226A9206f6324B39882a2309L722B23732B0127a63267
$$ -308799 104833 5181 -71226 19206 -66324 239882 -12309 -8587 223732 20127 -163267
9467A30145b90971D08661a51665A16855a4059j15696r6673a09905k8350B914L07519
$$ 130145 -290971 408661 -151665 116855 -14059 -129755 -226428 -109905 -138255 2914 310433
9456C10433a67306H7639O1527F7615B6858a1646H365a80788B26509C0471a043
$$ 310433 -167306 87639 149166 67615 26858 -11646 8365 -180788 226509 30471 -1043
9444D29a00921o3426A77575b45232a00621j74486b7357B94058a06886l943q6901
$$ 429 -100921 -164347 177575 -245232 -100621 -275107 -27357 294058 -106886 -110829 -197730
9433a97730p1858h3913j47426l9419e1745F2042C904a72257I211f2851A94112
$$ -197730 -269588 -83913 -231339 -270758 -51745 62042 3904 -172257 9211 -62851 194112
9421I8938f4108j16819A4107a52920p1564L2530D17797b86847a4023j23045n2709
$$ 98938 -64108 -180927 14107 -152920 -224484 -191954 417797 -286847 -14023 -137068 -189777
9410a89777H6602c2573q7439k2621K3799j17071b0657H4764c1337j11432A42159
$$ -189777 86602 -32573 -120012 -142633 -118834 -235905 -20657 84764 -31337 -142769 142159
9398c9105B53617a37473j25009J09542k814H7581M6838c40055J37019C99793c09695
$$ -39105 253617 -137473 -262482 -152940 -155754 87581 134419 -340055 -203036 399793 -309695
9386c58644D4068g4906k39067d9668q4657j98109a9418n452A39809o622K94050
$$ -358644 44068 -74906 -313973 -49668 -134325 -332434 -19418 -24870 139809 133187 427237
9375D27237a30995r0453J05599r999G1528L7043d13910a15094O238J4672n8771
$$ 427237 -130995 -221448 -115849 -125848 71528 108571 -413910 -115094 -108856 -94184 -152955
9364a52955j34311C6623q900c4469n0516L0636K0046j32323b5736A11877a84534
$$ -152955 -287266 36623 27723 -34469 -84985 -54349 -34303 -166626 -25736 111877 -184534
9352G006a20541b6717j93717J9347e0524B4249K50621G3991M3313J2085m2436
$$ 7006 -120541 -26717 -220434 -201087 -50524 24249 274870 73991 117304 129389 86953
9341H6953a66679J0352D8703b96371a26437m6325j4345M9745A95533b49388m25
$$ 86953 -166679 -156327 48703 -296371 -126437 -172762 -187107 -137362 195533 -249388 -249813
9330b49813G699d60773a17316o6613e8179l43500e1764B06868a56919q7426G8003
$$ -249813 7699 -460773 -117316 -183929 -58179 -401679 -51764 206868 -156919 -244345 78003
9318f3874D30412b96726J32862A54618b03155Q2918j49332j9072E54283B27125
$$ -63874 430412 -296726 -163864 154618 -203155 -120237 -269569 -288641 554283 227125
9307c3396F880b1161A0750K97586b56977l2477A6690R0656c0609B6054f0805A06920
$$ -33396 6880 -21161 10750 308336 -256977 -289454 16690 107346 -30609 26054 -60805 106920
9294a06584m8787E4724c0538k3948a9950F0588K04802b07766L387A89896i2038
$$ -106584 -155371 54724 -30538 -54486 -19950 60588 265390 -207766 -204379 189896 -92038
9282e66020J44268C48623a71779j58853a49588B50758a34261K3601j00616E3226
$$ -566020 -421752 348623 -171779 -330632 -149588 250758 -134261 -110660 -211276 53226
9271A87077K34389G0792f3870C18664j30367a170o433B1315a91296E9270k4919
$$ 187077 421466 70792 -63870 318664 188297 -1170 -7603 21315 -191296 59270 34351
9260C4351a13882m1127C2900b95424g747D4041b34498A0106b55170d5503A28655
$$ 34351 -113882 -155009 32900 -295424 -7747 44041 -234498 10106 -255170 -45503 128655
9248C20421g706j41182j96576a14183c0399q7526l05947D8396f1052k05941G3368
$$ 320421 -7706 -148888 -345464 -114183 -30399 -117925 -423872 48396 -61052 -266993 73368
9236A68814a86012k40487h0306A66968K8753a06734j35943A77005J71172h5988
$$ 168814 -186012 -426499 -80306 166968 195721 -106734 -242677 177005 348177 -85988
9225A17456O5602N4862b19828a3223A20394b21690B71657A31799b54438c4811
$$ 117456 183058 237920 -219828 -13223 120394 -221690 271657 131799 -254438 -34811
9214b82055h6101o7623q5605I7571g2531k99447a68712E1463e0075K778A4465
$$ -282055 -86101 -153724 -239329 97571 -72531 -371978 -168712 51463 -50075 -47297 14465
9202a90904A01843h5775B1888g7815j63523b5619k94100B85288D9356K5743b81771
$$ -190904 101843 -85775 21888 -77815 -241338 -25619 -319719 285288 49356 75099 -281771
9190D7998r893L2511h6110c6146A37914A6421b8765D1571d76962B15957J27434
$$ 47998 38105 70616 -86110 -36146 137914 16421 -28765 41571 -476962 215957 343391
9179C43391c07897e7671b8092k95407f7584j6079L8685j52178A17986b26912i8698
$$ 343391 -307897 -57671 -28092 -323499 -67584 -83663 -44978 -197156 117986 -226912 -98698
9167a13381J2146p5208k507l249a3400I4690a30100o4612b7687k86509J50589
$$ -113381 -101235 -176443 -178950 -182199 -13400 94690 -130100 -194712 -27687 -314196 -163607
9156a63607g1761q9404M6953I3535m6255b47243K4085l322H2312i4483B86617
$$ -163607 -71761 -161165 -114212 93535 47280 -247243 -223158 -226480 82312 -94483 286617
9144e2396a9635j39565O5393j01139a9851A84811g6903D9416r156c48593A41616
$$ -52396 -19635 -159200 -93807 -194946 -19851 184811 -76903 49416 40260 -348593 141616
9132A39443D2909A6017g7767l51127a60468M8320j14251M6797r544f3989j47691
$$ 139443 42909 16017 -77767 -428894 -160468 -112148 -226399 -179602 -189146 -63989 -211680
9121b11680m5860E6834e1861a3299C1850a12106B29730a75797k74391J04891a43148
$$ -211680 -257540 56834 -51861 -13299 31850 -112106 229730 -175797 -450188 -345297 -143148
9109H9862b07401L1612D06450b19308B06125d79785b5181l88000h7701n8023B24014
$$ 89862 -207401 -175789 406450 -219308 206125 -479785 -25181 -413181 -87701 -145724 224014
9097i4916J7203j42259a3289n9802o069j94796a05765l47900d8756J4084C3054
$$ -94916 -77713 -219972 -13289 -73091 -79160 -273956 -105765 -453665 -48756 -34672 33054
9085a88432Q2692A47768g0302K6965j31686q5972A94039b3933k15516e6114p3462
$$ -188432 -105740 147768 -70302 -43337 -175023 -260995 194039 -23933 -239449 -56114 -129576
9074a29576A18263m9637R0185n5763D6518a03315E3120h9621G3762n32a37676
$$ -129576 118263 68626 158811 103048 46518 -103315 53120 -89621 73762 73230 -137676
9062C9585b22294G150c20449a13921B13200a23012A71608g1090E2838b07760F6762
$$ 39585 -222294 7150 -320449 -113921 213200 -123012 171608 -71090 52838 -207760 66762
9050b0881A24073J03062c81309C4652a08058C8236a79472B2868b72142j32332
$$ -20881 124073 227135 -381309 34652 -108058 38236 -179472 22868 -272142 -404474
9040d04474B44709E0142M2584D4448J03183b80196f3775q9461A04860e9067j19648
$$ -404474 244709 50142 92726 44448 147631 -280196 -63775 -153236 104860 -59067 -178715
9029a78715I9437i4289o5588o5283J8660e7511k05905A63036C8308Q9183C8846
$$ -178715 99437 -94289 -159877 -225160 -206500 -57511 -263416 163036 38308 127491 38846
9017F7673J9695K03875d9165m886B6422Q8305k7462m2919a2977n4634H1351a12696
$$ 67673 87368 291243 -49165 -54051 26422 114727 87265 44346 -12977 -67611 81351 -112696
9004g1149A39620a81767j04334D4363b16869A50907d11276K7066c1050n241j06800
$$ -71149 139620 -181767 -286101 44363 -216869 150907 -411276 -384210 -31050 -36291 -143091
8993a43091A52640d11886c1421C4110d0340B49149B0224b4235I4R9911B4652e5906
$$ -143091 152640 -411886 -31421 34110 -40340 249149 20224 -24235 94 100005 24652 -55906
8980a95380K3339D6721a37401A59263g4031n495b8126j03678m8126f7045j77260
$$ -195380 -172041 46721 -137401 159263 -74031 -79526 -28126 -131804 -179930 -67045 -244305
8969b44305a9387A51583d26630C04399c1333l07434J41354K1621O4616j45906
$$ -244305 -19387 151583 -426630 304399 -31333 -338767 -197413 -175792 -111176 -257082
8959b57082H4555a54466i701l11142i979k08882I413J52942D8803J30809a33350
$$ -257082 84555 -154466 -9701 -320843 -9979 -218861 9413 162355 48803 179612 -133350
8947b13813K3781E7635B0805d4025A36683p017a22378a6300B73914a74167k6526
$$ -213813 -190032 57635 20805 -44025 136683 129666 -122378 -16300 273914 -174167 -200693
8936b00693b9045A49565l5721c6140k61925A6641b1240k29452A50861J25101K68163
$$ -200693 -29045 149565 113844 -36140 -298065 16641 -21240 -250692 150861 275962 544125
8925E44125M42309M93125J593280M616663M247580C247550A177552B42333K53614
$$ 544125 986434 1479559 3072839 7689502 11937082 3247550 1177552 242333 495947
8916D95947D7491m500b80961J22001I6880P4506a58131a0382B87814O8558h1528
$$ 495947 47491 42991 -280961 -158960 96880 171386 -158131 -10382 287814 356372 -81528
8904C7316L25889A56746b59977D4899c04161N943a26923j35366A07168K30159
$$ 37316 363205 156746 -259977 44899 -304161 -298218 -126923 -262289 107168 337327
8894C37327A27892N1929b80467B0869a04685A12576b8870r4085D0361A5757b12968
$$ 337327 127892 179821 -280467 20869 -104685 112576 -28870 -122955 40361 15757 -212968
8882a3981k98019B75124g6489A4537J02524a69648k21295i0283j07175f7345q479
$$ -13981 -312000 275124 -76489 14537 117061 -169648 -390943 -90283 -197458 -67345 -75824
8871g5824A38715a31215N4407k52353d5331A7404a20918j6297a5039G0746a61035
$$ -75824 138715 -131215 -76808 -329161 -45331 17404 -120918 -137215 -15039 70746 -161035
8859a50197e6194A33079a65424C1408G960g4378c0526j56416R256A29138P9715
$$ -150197 -56194 133079 -165424 31408 7960 -74378 -30526 -186942 -177686 129138 208853
$$ [...]
##END NTUPLES=NMR SPECTRUM
##END=
