##TITLE=AC1612_BRAAN13342_8317078_1FAKSlUxmH
##JCAMPDX= 6.0         $$ Bruker NMR JCAMP-DX V2.0
##DATA TYPE= NMR SPECTRUM
##DATA CLASS= NTUPLES
##ORIGIN= BRUKER
##OWNER= Administrator
$$ 1.72 TOPSPIN		Version 2.1
$$ 2013-11-13 17:29:13.041 -0800  Administrator@X
$$ Compression mode = diff/dup
##.OBSERVE FREQUENCY= 400.02188249412
##.OBSERVE NUCLEUS= ^1H
##.ACQUISITION MODE= SIMULTANEOUS (DQD)
##.ACQUISITION SCHEME= undefined
##.AVERAGES= 8
##.DIGITISER RES= 22
##SPECTROMETER/DATA SYSTEM= spect
##.PULSE SEQUENCE= zg30
##.SOLVENT NAME= COFFEE_meoh
##.SHIFT REFERENCE= INTERNAL, COFFEE_meoh, 1, 14.98509
##AUDIT TRAIL= $$ (NUMBER, WHEN, WHO, WHERE, PROCESS, VERSION, WHAT)
$$ ##TITLE= Audit trail, TOPSPIN		Version 2.1
$$ ##JCAMPDX= 5.01
$$ ##ORIGIN= Bruker BioSpin GmbH
$$ ##OWNER= Administrator
$$ $$ E:\/data/COFFEE/nmr/AC1612_BRAAN13342_8317078_1FAKSlUxmH/10/pdata/1/auditp.txt
$$ ##AUDIT TRAIL=  $$ (NUMBER, WHEN, WHO, WHERE, PROCESS, VERSION, WHAT)
(   1,<2013-11-13 17:29:05.619 -0800>,<Administrator>,<X>,<go>,<TOPSPIN 2.1>,
      <created by zg
	started at 2013-11-13 17:27:59.963 -0800,
	POWCHK enabled, PULCHK disabled,
       configuration hash MD5:
       C8 4E 4E 5D D3 5C D8 9E 9F 52 82 E0 59 8A DE 15
       data hash MD5: 64K
       DC 32 EE 0F 19 8F AB 62 B8 57 D4 4A E8 1A 1B 09>)
(   2,<2013-11-13 17:29:08.806 -0800>,<Administrator>,<X>,<proc1d>,<TOPSPIN 2.1>,
      <Start of raw data processing
       efp LB = 0 FT_mod = 6 PKNL = 1 PHC0 = 0 PHC1 = 0 SI = 32K 
       data hash MD5: 32K
       F8 65 F6 6B 9B 0F E6 BE 24 17 45 07 29 0D 37 90>)
(   3,<2013-11-13 17:29:09.228 -0800>,<Administrator>,<X>,<proc1d>,<TOPSPIN 2.1>,
      <pk PHC0 = 95.64697 PHC1 = 0 
       data hash MD5: 32K
       D8 E3 8E CF DF EA 54 A8 92 49 34 35 CB 17 37 C8>)
(   4,<2013-11-13 17:29:09.478 -0800>,<Administrator>,<X>,<proc1d>,<TOPSPIN 2.1>,
      <abs ABSG = 1 
       data hash MD5: 32K
       9F EB B2 F6 65 5B 7E 61 8E 69 5C C7 EA A3 D8 AB>)
(   5,<2013-11-13 17:29:09.525 -0800>,<Administrator>,<X>,<proc1d>,<TOPSPIN 2.1>,
      <abs ABSG = 2 
       data hash MD5: 32K
       88 9D 7E B7 53 57 57 5A E7 53 3E 78 6B FA 53 4C>)
(   6,<2013-11-13 17:29:09.572 -0800>,<Administrator>,<X>,<proc1d>,<TOPSPIN 2.1>,
      <abs ABSG = 3 
       data hash MD5: 32K
       F0 9F 9E DB EF D5 B8 B0 B8 25 CF 5D 6A 78 40 15>)
(   7,<2013-11-13 17:29:09.650 -0800>,<Administrator>,<X>,<proc1d>,<TOPSPIN 2.1>,
      <abs ABSG = 4 
       data hash MD5: 32K
       CB 1E D0 11 21 56 A9 36 E3 90 4E AC 29 D4 3B 60>)
(   8,<2013-11-13 17:29:09.697 -0800>,<Administrator>,<X>,<proc1d>,<TOPSPIN 2.1>,
      <abs ABSG = 5 
       data hash MD5: 32K
       55 7A 2C 19 6C 5D F4 42 D5 E2 56 E8 39 5E EE 7A>)
$$ ##END=
$$ 
$$ $$ hash MD5
$$ $$ 71 83 31 79 38 77 1F 2A 97 47 21 35 26 1A 53 CE
##$RELAX= 
##$RELAX= 
##$RELAX= 
##$RELAX= 
##$RELAX= 
##$RELAX= 
##$RELAX= 
$$ Bruker specific parameters
$$ --------------------------
##$DU= <E:\>
##$EXPNO= 10
##$NAME= <AC1612_BRAAN13342_8317078_1FAKSlUxmH>
$$ [...]
##$TP= (0..7)
150 150 150 150 150 150 150 150
##$TP07= 0
##$TPNAME0= <>
##$TPNAME1= <>
##$TPNAME2= <>
##$TPNAME3= <>
##$TPNAME4= <>
##$TPNAME5= <>
##$TPNAME6= <>
##$TPNAME7= <>
##$TPOAL= (0..7)
0.5 0.5 0.5 0.5 0.5 0.5 0.5 0.5
##$TPOFFS= (0..7)
0 0 0 0 0 0 0 0
##$TUNHIN= 0
##$TUNHOUT= 0
##$TUNXOUT= 0
##$USERA1= <user>
##$USERA2= <user>
##$USERA3= <user>
##$USERA4= <user>
##$USERA5= <user>
##$V9= 5
##$VALIST= <valist>
##$VCLIST= <CCCCCCCCCCCCCCC>
##$VD= 0
##$VDLIST= <DDDDDDDDDDDDDDD>
##$VPLIST= <PPPPPPPPPPPPPPP>
##$VTLIST= <TTTTTTTTTTTTTTT>
##$WBST= 1024
##$WBSW= 4
##$XGAIN= (0..3)
0 0 0 0
##$XL= 0
##$YL= 0
##$YMAX_a= 654274
##$YMIN_a= -555464
##$ZGOPTNS= <>
##$ZL1= 120
##$ZL2= 120
##$ZL3= 120
##$ZL4= 120
##$ABSF1= 14.98509
##$ABSF2= -5.573092
##$ABSG= 5
##$ABSL= 3
##$ALPHA= 0
##$AQORDER= 0
##$ASSFAC= 0
##$ASSFACI= 0
##$ASSFACX= 0
##$ASSWID= 0
##$AUNMP= <proc_prof1d_extract_pilot.lims>
##$AXLEFT= 0
##$AXNAME= <>
##$AXNUC= <1H>
##$AXRIGHT= 0
##$AXTYPE= 0
##$AXUNIT= <>
##$AZFE= 0.1
##$AZFW= 0.1
##$BCFW= 0
##$BC_mod= 0
##$BYTORDP= 0
##$COROFFS= 0
##$CY= 15
##$DATMOD= 1
##$DC= 0
##$DFILT= <>
##$DTYPP= 0
##$F1P= 0
##$F2P= 0
##$FCOR= 0.5
##$FTSIZE= 32768
##$FT_mod= 6
##$GAMMA= 0
##$GB= 0
##$INTBC= 1
##$INTSCL= 1
##$ISEN= 128
##$LB= 0
##$LEV0= 0
##$LPBIN= 0
##$MAXI= 10000
##$MC2= 0
##$MEAN= 0
##$ME_mod= 0
##$MI= 0
##$NCOEF= 0
##$NC_proc= -8
##$NLEV= 6
##$NOISF1= 0
##$NOISF2= 0
##$NSP= 0
##$NTH_PI= 0
##$NZP= 0
##$OFFSET= 14.98509
##$PC= 1
##$PHC0= 95.64697
##$PHC1= 0
##$PH_mod= 1
##$PKNL= yes
##$PPARMOD= 0
##$PPDIAG= 0
##$PPIPTYP= 0
##$PPMPNUM= 2147483647
##$PPRESOL= 1
##$PSCAL= 4
##$PSIGN= 0
##$PYNMP= <proc.py>
##$REVERSE= no
##$SF= 400.02
##$SI= 32768
##$SIGF1= 0
##$SIGF2= 0
##$SINO= 400
##$SIOLD= 32768
##$SPECTYP= <>
##$SREGLST= <1H.CDCl3>
##$SSB= 0
##$STSI= 32768
##$STSR= 0
##$SW_p= 8223.68421052631
##$SYMM= 0
##$S_DEV= 0
##$TDeff= 65536
##$TDoff= 0
##$TI= <>
##$TILT= no
##$TM1= 0
##$TM2= 0
##$TOPLEV= 0
##$USERP1= <user>
##$USERP2= <user>
##$USERP3= <user>
##$USERP4= <user>
##$USERP5= <user>
##$WDW= 1
##$XDIM= 32768
##$YMAX_p= 459861197
##$YMIN_p= -705021
##$CURPLOT= <Network HP LaserJet P1505>
##$CURPRIN= <$Network HP LaserJet P1505>
##$DFORMAT= <normdp>
##$LAYOUT= <+/1D_H.xwp>
##$LFORMAT= <normlp>
##$PFORMAT= <normpl>
##$SURQMSG= 1
$$ End of Bruker specific parameters
$$ ---------------------------------
##NTUPLES= NMR SPECTRUM
##VAR_NAME=  FREQUENCY,     SPECTRUM/REAL,   SPECTRUM/IMAG
##SYMBOL=    X,             R,               I
##VAR_TYPE=  INDEPENDENT,   DEPENDENT,       DEPENDENT
##VAR_FORM=  AFFN,          ASDF,            ASDF
##VAR_DIM=   32768,         32768,           32768
##UNITS=     HZ,            ARBITRARY UNITS, ARBITRARY UNITS
##FACTOR=    0.250966925370066, 1,           1
##FIRST=     8223.43324360094, 211835,       149992
##LAST=      0,             24264,           6687
##MIN=       0,             -705021,         0
##MAX=       8223.43324360094, 459861197,    0
$$ Real data points
##PAGE= N=1
##DATA TABLE= (X++(R..R)), XYDATA
$$ [...]
23859 -349460 61907 -99008 -79266 -398621 22923 -154973 -35021 -121914 -105460 15616 -104330
23847 -9549 -79508 -529797 -192321 69758 -168580 -3467 -338917 48123 -236435 37802 -46558
23835 33041 276597 -69961 -29658 50824 -13022 5214 359407 -19920 -126818 -254965 -84254
23823 -10851 -279609 29109 84402 -34004 -81889 70096 -122104 98922 -177264 -250662 29454
23811 -138700 -182612 169767 295413 -232915 101042 -30346 53742 -371809 16884 -4518 128526
23799 174264 -310070 -216902 -71246 5773 95320 255531 -22817 -42564 -79191 -186362 65413
23787 -233568 112546 -59252 107732 27572 74178 -334483 220754 -58117 310869 91874
23776 213372 161669 -197153 -262735 375171 -70168 -41277 -157418 -148904 -75833 8369 125320
23765 125320 23280 17688 58498 83668 -4724 216190 186439 -184160 33918 205913 -34882
23753 -299295 -99891 -4818 110499 -164836 71950 -406822 -12655 -65005 -159009 266810 17136
23741 -109824 -115216 -24551 -390304 276077 -39285 389543 -345408 -538559 145487 -172435
23730 96145 -150163 -1574 -94219 -123172 -22243 306762 102904 -81970 -381587 -64251 147197
23718 -227898 376590 125971 -164296 -298975 435620 179480 -130396 24367 -4077 -60109
23708 -60109 251363 64294 28984 -411187 -19644 73053 178631 -105556 60114 -263561 -6795
23696 259513 276485 52049 -130258 -100228 -182462 137216 245268 155375 -53482 -144584 -35865
23684 -254324 124554 -107957 89636 68852 -146054 87284 341606 -88026 -237133 229061
23673 92665 -304930 -64167 70358 199876 -166303 118942 237194 -120629 -47177 -212150
23663 -212150 -190587 -31617 -210592 74918 -37315 -190655 280744 133290 119414 -95892 -27057
23651 -154773 108933 116226 -127497 -358658 -140569 -207670 -314604 -205968 33659 -137909
23640 40474 -254138 -105732 313390 73993 -79964 -91936 77141 -56818 242201 64651 40603
23629 40603 332334 -242730 202959 -37429 167903 147287 -151562 398183 153449 -197438
23618 -114407 -134732 -174445 -26443 236674 -347309 -250787 87680 80733 -281527 -4957 92017
23606 70543 79328 136332 -218338 -18914 -203950 -139737 -329057 96940 -15964 58181 -124719
23594 -433996 210109 48365 -37911 210987 -125365 -161525 62739 -119130 -101122 8110 4166
23583 4166 102332 82424 -251315 230894 -37852 363 -145264 32526 155149 247207 23794
23571 106729 -46308 -162765 -29692 15354 6979 -52155 183721 -166235 -251070 -120607 168433
23559 -285152 -153714 30254 107522 112082 81564 38263 22251 66326 145540 146522 -16089 -113975
23547 -113975 -102758 -71380 -12912 -198476 8066 307997 -104145 281782 -171904 -177299 42602
23535 118910 -2573 201180 188842 81465 -300178 19165 -11051 -313 218356 175459 36313
23523 -67263 -138458 -117946 -15826 100169 65147 -65852 37384 -45462 -231218 87400 -82708
23511 -78329 -81824 194247 32079 -63330 -10642 -132877 151987 42470 -17342 -126999 -203157
23500 -203157 183672 152787 -272695 -49199 -336241 8204 -244523 87005 86584 -239288 161529
23488 -9112 -74262 -139000 -164747 -189274 175957 6045 133921 23159 92294 50474 85007 -11884
23475 -187091 -335450 402084 268457 171224 124821 18072 -143608 -115583 37416 -223672
23464 -288232 -138425 -24513 -119982 -96762 -21469 -134211 -124323 -147473 77886 -74102 294783
23452 70573 187451 211560 29444 200849 -104962 77131 -212312 143049 -314576 -25360
23441 -290069 1687 235288 14120 126769 -15248 66843 116848 -40046 235290 -176002 154049
23429 20422 125448 155893 400914 -77384 355148 39268 -103823 43 -121516 -184986 -188356
23418 -188356 -12133 -169903 911 -372112 -28874 37532 70996 98106 165680 -244205 268729
23406 -38581 205524 54017 101110 -102211 -94378 -15034 -86739 -142096 -15899 113182 113654 800
23393 43727 64876 147566 -51018 -468450 -28733 -51698 -11656 -38971 -114711 16359 -177131
23381 -263868 14212 98189 -303967 12236 -141715 -121387 -187787 -32146 -28531 175778 34591
23369 -173404 -28788 -110260 -258591 276147 -277420 -15928 21320 195015 57823 -43255 -340061
23358 -340061 158047 252201 -117616 7170 -226970 -34071 58839 -286685 297861 -17952 -261197
23347 -261197 -54429 -180937 33664 -83550 -274391 -132702 267011 41757 52248 54285 -105316
23335 117476 -94017 102877 96973 -480786 -95346 -106082 -58530 -291213 3140 -16628 -97417
23324 -97417 -144765 31325 109157 -132884 -86306 147669 76852 46247 109859 -174161 -74806
23312 -34521 -369561 -310308 -18868 -23469 -172956 152220 -164931 -64927 -288431 56650 -39902
23300 -13690 108354 -70445 -73322 96695 -46253 -83957 285474 -113156 -214726 198299 -110431
23288 -24937 -123914 -426383 -87297 -192754 -507565 139254 -14055 -285509 188102 -86496
23277 -15805 -256701 265582 9580 158609 -103875 287421 -191663 73553 343888 -210950
23266 109982 -1197 209987 139701 -149467 12999 284540 46033 34857 -39709 -224813 284689
23254 -124762 138167 -22685 -101338 -72090 -42977 -56831 -46202 -55652 128599 266715 246274
23243 246274 197871 -41871 55785 -62186 15304 -168737 99390 -296563 -88548 102471 -82002
23231 -62998 147586 -269186 -92595 67551 156658 -236780 -122330 -155617 251658 -366089
23220 -264012 -8536 -54778 6188 -67437 -17859 -293601 -88643 -111526 414646 3651 -17535 118742
23207 -74276 -88828 -125704 -138149 -103093 80369 55375 115250 -348659 200290 -178932 -294541
23196 -294541 -67601 -126218 144638 -106241 -232876 -112636 -77201 -246607 -165002 180540
23185 -263800 99008 136801 -51805 -229798 -52671 68858 242978 -124106 -108715 131322 -57303
23173 53148 129402 -297493 253513 -72276 97886 153178 -115748 83579 207492 110980 -12014
23161 16426 439971 42798 159324 -103832 -75125 212645 -242755 -196736 -159878 -189665 100265
23149 -81039 138009 -16311 -108174 65260 -280780 -168308 167127 -150084 -244189 -137114
23139 -137114 138004 -219684 11562 417069 -154101 53777 90224 -112225 109752 92911
23129 92911 41177 222158 306141 72730 -63443 8387 103068 -140577 -78782 333674 -484948
23117 -75035 -313731 -322560 41094 -159815 -355975 -69608 -123015 198773 309953 138103 -152899
23105 206898 302065 -147070 -2262 -187207 -10323 -246657 113633 169106 153095 127049 237812
23094 237812 -107904 38831 43915 -70644 -289822 -313432 -307891 -406564 199187 -330003 -204419
23083 -204419 -200748 -25921 -18566 -155865 151345 -181169 -79682 410484 97344 246936 -196798
23071 118923 -62806 -193021 -110003 163545 184637 -376971 66953 247309 94061 -300280
23060 -145163 13009 -69546 109056 -112086 -251543 116770 29119 -137528 -66101 23813
23049 135921 82887 -126623 -7972 187074 133543 -27930 -306907 86479 -54425 200489 1345
23037 -53025 35822 -257456 87079 -478984 78240 -79979 88617 -23530 138196 -16301 94593
23025 -12348 -136963 30874 43043 -23285 -265836 106325 204637 222437 -102930 43431 -16936
23013 -64742 120423 -181762 21290 -129047 126712 -137393 -61327 83328 -84798 -24795 -145778
23002 -145778 -255061 -350228 118056 -48374 95220 178541 425390 -321351 262968 -86183
22991 101397 -120306 324272 -270519 -359525 -41463 177501 -39209 -219670 -172177 32841
22980 -84477 9318 -102975 -278613 -2906 -232879 369936 -203454 -33786 170588 118763 -27395
22968 236830 -87636 -182195 296578 247198 40120 -215512 -132497 -214782 137885 -105867 201321
22956 -164455 -253794 -188102 36427 172631 15744 189822 -64491 -131749 -128337 186950 -43046
22944 140695 245658 -56026 181700 127095 -147411 -7600 -243210 15831 -3474 -65824 -306451
22933 -306451 -234028 -72167 -44982 174738 11283 -200679 -107853 3634 -314997 -156714 -429370
22922 -429370 -111775 103533 147537 -217628 79005 -257801 -9468 24677 -70723 -135743 -7246
22910 -82841 181862 -314428 204525 221759 -102807 99237 -150773 -117077 -27977 -38562 320654
22898 -112207 -79955 231255 131895 -158831 157159 112215 229996 195667 48047 94338 232205
22887 232205 -107986 -6461 -251246 -302 -229809 -88020 -190084 -240014 -57860 193549 238200
22876 238200 83193 -129899 -19096 -189384 -39348 -202011 34720 184224 -11405 -279607
22866 -279607 -64271 81960 -198331 130776 -70621 -247230 -20538 55793 184038 31436 13103
22854 77560 -133985 -155566 15158 -236220 -82048 -374148 -50359 -142546 -46484 -221915 -158186
22843 -158186 -184730 -86924 -329836 13857 -257543 -396113 62132 78610 -137854 -85703 -11157
22831 -236871 -12420 194555 150433 230398 -19200 87011 121063 -210937 2528 -83628 -181867
22820 -181867 -108788 39209 64769 152857 -59760 -266327 123170 -8506 -336579 -215473 -179927
22809 -179927 -353146 111559 -38238 -257171 -33868 331672 122947 -109609 116521 111035
22799 111035 -13510 -41145 -134019 -395908 -221100 245672 146168 49343 174965 -343364
22788 -10263 249782 73769 90628 133578 226289 2449 182915 79627 -106045 76891 -204058
22776 -277827 16625 22192 376039 9462 -183516 165508 -72860 160414 -50373 244672 82946
22764 -18233 -277535 -198870 -88822 -13944 26928 191136 -189923 -143266 275759 -35322 -144649
22753 -144649 -160270 -161385 -18155 17167 73996 -111799 -143084 -242488 -45830 100814 -93557
22741 34756 120844 -146601 136930 -549753 -47659 15260 -153586 172049 47886 -39417 139596
22729 41394 -317195 -349625 -101165 24872 148967 73276 23516 -316632 -171979 83068 -153234
22717 -120499 -47753 -6298 175104 -187746 147486 -401896 270149 203949 143125 98374 -286072
22705 114632 -58996 -92049 271576 128024 -222754 -168236 97370 -285140 251005 30056
22694 -72700 113937 -119670 180259 -85034 -103178 -225952 55762 6910 358 90040 40487
22682 -174246 -32396 11147 -213223 -175271 123890 -203988 78429 61626 29656 -154686 -243835
22671 -243835 133411 35866 -184649 -350126 79089 146290 173880 -134575 299563 -3381 148448
22659 -266493 171740 -311590 123961 7436 106641 96588 -377317 -111034 -88390 80900 -60064
22647 -126834 -333886 2514 224032 -88002 168232 86984 -162445 -302664 301690 -279607
22636 -12579 140420 8574 146251 -305031 286469 -28180 289434 -179333 60392 -343577
22625 -463115 70907 9406 128478 -106598 257904 -237187 -95955 -147232 -346605 -112692
22614 111739 57358 -161382 117027 -102702 88393 303616 -120573 -2069 -214571 -68962
22603 -200551 -20925 -396356 334129 82826 250489 -134834 -379757 121253 -47640 -31890
22593 -31890 3162 262393 -167709 -18699 235893 40335 266715 -69672 159277 -106844 56190
22581 126071 -115001 -21802 -98324 166090 102050 -164843 -114578 36522 379964 77528 -111943
22569 -36216 124904 -7110 -172168 -21347 310223 -50931 39564 11724 38461 -15385 -19481
22558 -19481 -133331 -13345 88678 -39973 130642 49850 -34259 16948 96898 -189609 181281
22546 207202 -14962 -93302 -138134 169310 3757 -66630 -27718 -145380 -237657 -29136 -24449
22535 -24449 -161121 -190053 163254 -66255 -47369 -70893 4491 -277754 -329019 -235462 -182773
22524 -182773 37561 16549 240326 -145033 -76198 204691 68542 46289 -310031 263438
22513 -110170 228069 -167779 -1317 -107969 47889 -299518 194143 -196860 -119112 108814
22502 -53533 -160475 -101836 -338212 -193896 -232718 84934 -233348 241342 -26484 62467 -149614
22490 37647 195268 -43513 -105458 -466397 20942 -34172 -84772 -127912 -206365 -236667 -136549
22479 -136549 -135959 50800 -214574 48156 -42052 -387862 19421 20047 -513672 -280279 -76922
22467 -634105 152930 -186205 58385 -116721 -16766 -503994 -254514 100442 -240937 4157
22456 157124 249186 -209350 -214623 168106 -457353 -25400 -50768 149339 -199914 -157895 191210
22444 -280044 -306451 -112190 -335954 -84575 102418 -367461 -228150 13787 -5761 265760
22433 -130881 346121 -17079 -150261 -23797 20360 79675 -13188 -239039 360090 -52377 30823
22421 -199397 327747 76444 124722 277268 51004 -204009 12504 -257972 -170277 78899 144002
22410 144002 200757 -380976 -67321 170141 206893 69463 34798 -251183 73533 160396 -102273
22398 48674 76238 -194157 -18936 338991 5381 -15736 -251103 167056 -81980 -39987 119111
22386 93529 382098 -204158 -33828 165284 -263466 206505 -16380 -284888 116318 -131646
22375 -318194 86440 58113 92544 187408 -152299 44778 -86891 -125504 245157 65005 -51079
22363 268951 68233 -205255 65136 -118499 175238 -290075 201854 125518 -93527 -189359
22353 -189359 -60066 -42330 177318 39591 253599 -150380 72924 -16038 -159172 112225
22342 103569 -141265 -88175 274345 -201474 -150021 183632 -48323 -289889 -227869 68151
22331 95528 -167357 -111457 78667 -294012 99076 99137 345722 244443 16907 -3960 241930
22319 -84873 82527 -215158 -232625 -105751 -204686 386425 15471 -339622 -121468 -74813 -348451
22308 -348451 76886 -400038 189540 -14738 92041 -29854 -39791 115214 -378531 -42647 475133
22296 -151575 -276331 109857 316000 40545 -273077 -67328 -185781 55824 -349969 236686
22285 22892 7220 309745 121444 3825 -266569 361607 262322 -216673 71754 -155193 -186958
22274 -186958 -123755 -106750 -298564 -85755 162280 -312029 49397 -157367 196904 23635
22263 269880 149040 -93344 151862 108743 136282 112788 53810 -42629 256690 624574 -58354
22251 -372208 75728 159886 111153 53343 78128 21016 180559 -3529 -278014 33218 -80546
22239 84714 -47303 64310 74313 10643 -343451 79683 -95264 -357097 -379899 -175906 304491
22227 -33673 -279929 273181 27469 -166260 -6459 489241 -81095 -69498 81010 -261438 -31762
22215 150933 -44406 72320 -101949 -192205 -196749 36797 445741 16945 -153981 -346633 -304036
22204 -304036 2772 181178 116133 138355 41865 -239612 109916 59200 -49827 200696 -222208
22192 -211754 -45067 -11784 -115750 -76837 -167771 -443555 -213974 -148585 -218665 70445 -41975
22180 -32148 -458582 -175163 -137565 -165659 -82045 -291146 -2773 13540 159215 -209389 -391368
22169 -391368 -28105 -66529 134530 -230387 88324 -62844 -95841 -314165 -211794 -240714 103193
22157 -103169 29135 -266363 95058 -16786 95862 -218147 -347028 -104630 -153256 281983
22146 -249034 -298880 -37806 -189422 -195769 -179657 -153617 -159057 -547013 -248777 1646 207112
22135 207112 17869 -43219 -473943 -282845 171932 199399 -52176 -22759 -107112 -22685 241280
22123 24713 -14505 149225 -120333 -160380 16329 107493 28267 206966 89784 186865 13553
22111 -288315 81681 -285287 347308 -194026 265495 178562 -36060 -180891 57195 -25603
22100 -285905 109762 77072 302461 -185929 -68400 -192459 6556 -36305 295984 -85999 -163898
22089 -163898 -135110 91732 -172849 39715 -16471 8027 -190226 -340235 90180 -105943 -190061
22078 -190061 -202862 -323377 60234 -85657 107634 -19649 245070 77121 -105740 119857
22067 153612 -154959 -278100 -6416 -95394 -233218 212972 129530 -6639 350581 -355578 -298401
22056 -298401 -213618 -24605 42592 -31552 183449 -235693 -39179 94685 -355375 -29419 -457793
22045 -457793 -135365 127219 20586 103725 -81647 -110664 -56666 44805 -105457 -266352 -74232
22033 -158284 48527 1756 45840 -253507 100742 -89882 28979 -6739 106704 -524142 -313888
22022 -313888 -69049 -20472 7203 -37380 -10209 -26155 -184 106514 -4721 203190 -115427 -116726
22010 -116726 -58381 70163 -277709 178991 23132 70734 274825 234615 -237805 -311346 147513
21998 -514313 241692 -211010 -15384 119632 -378650 458536 160299 -181232 89386 5181
21987 -222149 157647 431156 103218 -46142 -112046 -159578 -218857 197647 -213922 -172419
21977 -172419 -98664 -102314 8101 -67482 -153523 24070 245023 -222774 98836 -194572 37178
21965 -59482 196819 36305 -67251 78603 179423 -58488 176188 12932 -57216 -189945 -9224
21953 328277 -79634 129633 -148433 -83773 135565 -101190 94895 -41330 -207800 -12974
21942 82488 47941 -299080 -251897 -116894 245902 -42263 -176862 -83660 264815 -93778 1097
21930 182735 -38924 -123314 -412714 -18359 -304758 265035 -182066 -85990 8297 130168 -12079
21918 -81921 -266375 -368191 51818 -115247 -235657 -120536 -403191 -143728 211636 -268112
21907 -232257 -263054 211496 20022 -197705 165400 -24148 113209 -219243 60198 -102495
21896 -87108 -198634 -132116 121202 169521 -93330 -77788 -367480 219882 -244570 160498
21885 159095 -24782 -8048 -165237 142916 -202738 -343826 -409830 -191758 -110829 131711
21874 -162849 -43079 328655 -53973 -73652 47623 -185076 24793 -113371 -193730 -331669 -123438
21862 145000 -91350 -144752 319935 -144400 -41158 -126820 -8670 -117806 -129147 207636 348412
21851 348412 -173239 -148960 -119864 193360 -148013 -177172 27774 85325 -190413 59931 -111045
21839 -141082 -297944 458801 164975 -351618 -60277 -51829 -116724 -166123 17065 53350 -176478
21827 -269176 -3321 -31569 -104808 12012 -200931 98945 -349361 99487 26041 -132507 192309
21815 -123265 -8709 -45832 -266231 67964 132678 -41664 792 79048 -7668 -166188 249637 169253
21803 169253 -106751 -3858 283728 -54657 -201199 165676 131815 -20433 2537 -43350 103251
21791 -320042 233847 -315462 -205249 102418 44614 87889 -74441 -74427 260255 314448 -12880
21779 -100126 41684 74815 -200528 188375 -58918 148281 35941 -22363 -1748 -146256 33908
21767 -5499 -256123 20883 -74061 58632 134645 84200 -42478 -82821 -68662 221765 112480
21756 112480 -106616 49570 65323 -9535 -122998 -97524 -6928 -8587 -145057 -56660 74354
21744 -52355 -182786 140655 115250 -11439 -155352 -301471 -201171 -225256 -28668 37077 185765
21733 185765 163932 -80468 -60785 -50564 -154708 -31438 -145374 27360 -120062 -179557 -66693
21721 5039 285760 -51777 -193129 -83184 70196 810 -67543 -8956 5244 -13828 -183451 89237
21708 -14407 -134730 13815 250288 -16518 63914 -46204 -242672 33165 -260821 -284982 66572
21696 -325973 49136 -159204 -8561 28682 -175108 -10079 137218 -298764 -262668 -148773 -28278
21684 -131201 -58756 -53257 -684 -49904 -355361 -102599 -78181 -41932 122532 184427 -8285 -562685
21672 -562685 -206855 -120692 -234348 -113016 48559 -30003 -206400 225976 -83899 -45247
21662 -45247 -111625 16904 -75040 -157001 279573 -231398 -219086 -205256 84211 365025 -20697
21650 109786 -97905 -192574 -213441 -224326 -179652 -154954 -276337 120707 63367 -373602 43035
21638 41510 -277342 -49580 144983 49672 99254 -479983 26861 -65661 -219770 80009 -162343
21626 -180814 -289089 107510 132357 304687 -87740 38926 -115024 103406 -127008 147625
21615 -9125 -217370 20857 -166740 -17943 -96890 104241 153967 -76823 -293358 -59644 296906
21603 -222821 82239 -208981 -143591 -202546 -248250 -184185 -54622 -112729 65722 199016 -96094
21591 -148523 -67257 180132 108267 -197361 -475571 -399008 -149389 164903 -474 35975 -101445
21579 -174990 -85722 -111594 66014 -108184 -169841 138857 -67617 -5964 226314 -13336 -87719
21568 -87719 56535 302641 272752 -13460 77527 78407 -91935 -25773 450897 -37067 127136
21556 -97929 -363 355833 -217297 129692 -30631 -107394 254516 94519 -80539 -438745 -41753
21544 -320238 46590 313958 -356094 -562204 68428 270247 -247231 -264153 -72170 -149453
21534 -149453 -110515 -508039 -141259 180713 113280 -265907 248855 255964 31424 108425 -170312
21522 -149224 -14465 297767 -310637 138153 17922 353749 59988 -289261 -109579 21556
21511 -70224 136809 -146899 185707 35518 100285 -165489 -8507 146554 -163784 -9135 -223889
21500 -223889 92339 -323473 -220598 -53665 -35703 83811 -164518 315759 -11629 126728
21489 -310094 -268421 -287648 -207492 249163 -45178 390347 -35729 91808 161028 33704 -274981
21477 149806 -134900 40148 181750 -48704 25087 -44249 -192825 281170 11364 -197820
21466 71595 -101377 -42669 103486 265432 16049 -45925 28767 88619 -245847 330978 -374812
21454 20460 -299472 -68246 64057 2390 -184690 -440184 -68705 296380 -314396 -69296 4420
21442 -146743 -172468 285088 -49198 221989 118540 452405 508192 527856 -4959 228813 199363
21431 199363 -54969 165027 151682 -52129 -67281 12879 -27697 -105467 -28911 83388 159638
21420 159638 -197395 143856 -124392 -280321 -88521 138763 193925 91196 -23865 -134678
21410 -134678 -125921 -32992 -125070 -307124 102091 -144572 -124558 46406 -22077 -23980 311951
21398 132702 -316393 182400 41235 -193059 -48020 -181422 -13735 -86284 -118899 231284
21387 105608 -23573 -128263 297097 72293 -81380 117776 4252 -106385 55945 332937 -73662
21375 -58041 16164 -88766 -204395 -432975 -160330 300683 -182271 23864 -170458 125196
21364 -488276 -59437 91324 -107678 124790 -130662 189571 -146125 33159 -131387 -218487
21354 -218487 342886 -21292 110067 -82731 -54373 190123 -210463 30922 25380 -111977 97394
21342 -275737 -115731 209941 -177944 54959 9909 -375285 31343 -210922 17438 131120
21332 131120 -51162 -62479 -153295 -351619 -285516 -180650 321777 -215225 47720 -137549
21321 25111 -224476 4232 3010 222485 -249869 -80640 -305068 10039 -59811 -48294 -138083
21310 -138083 69494 46444 -159212 240601 -114184 -239158 106242 -113948 90715 22 -358653
21298 -288031 146152 -238575 7702 350603 103846 -197201 -267713 -392673 58796 -31988
21287 126189 137246 34308 217754 -101462 21269 -160263 -294366 -118292 184257 -222406
21276 129982 -196525 41253 46690 34876 -173715 37102 50992 111911 -45395 -28644 -3264
21264 110053 -2548 191466 8829 -12597 -34688 -5492 -37292 -378325 -165140 -334256 -180615
21253 -180615 -111081 138420 -231013 157584 -81439 -380387 -291892 6482 241067 -11623 346172
21241 -111227 10546 -59519 -226651 -2854 -99567 -160747 -81049 260709 79619 96734 54724
21230 54724 44174 158299 -103565 50109 -23728 116159 -280777 -377954 -257488 238863
21219 -75774 63938 -78577 182034 213073 -116621 -221264 -404866 -117239 115126 -240832
21208 -201627 125137 59748 8143 -225739 -249838 29789 35514 -39625 -84437 143778 -150280
21196 -1342 -54211 -82914 -39904 -73955 -389195 -101033 -440756 128902 154723 32907 155336
21185 155336 -276798 -53957 -153096 -74492 -116850 74622 241051 260857 -137922 -125639 122234
21173 139108 -142262 46961 -143598 -148790 -243185 -94008 -108315 -76120 135985 265491 -269609
21161 144026 -2275 -37535 -10826 71054 189473 -198991 -49280 -295375 -270734 119171 242932
21150 242932 -67253 -175112 245628 93958 54553 -13584 -224171 -26046 -153883 -238353 22621
21138 26057 50728 215233 -37928 -13600 168727 106809 51526 -312718 -242100 -140051 -123771
21127 -123771 27686 68077 15408 -139438 -195663 -164953 37758 -136192 -300074 -27468 39693
21115 -11180 -200322 38125 288840 -147654 -253928 -255738 -145375 -5532 111881 -210184 -212255
21104 -212255 405113 75783 -86767 25515 125987 36832 -249536 307406 116363 -55459
21093 -96525 165550 -28284 -149013 -142626 -25701 39202 44189 -159321 192935 -168978 -137840
21082 -137840 158496 349056 -190078 -10144 -122250 -238469 -118350 -61236 -113903 -26825
21071 -134976 -82604 -359003 246835 153703 -118781 -170187 -238591 229778 1172 -70537 59858
21059 -206626 63091 76119 235015 -75886 10775 197480 -240659 -125081 -28100 -55083 271491
21047 -5171 158765 -54607 53722 -133293 -149206 99451 -82941 117498 -49112 -90767 -115390
21036 -115390 -300841 -83432 67049 -98775 9605 133465 -141209 -64373 276548 38165 -142709
21024 -71668 -310741 26135 365632 -273181 181743 -145070 -199951 122053 -238993 -45859
21013 166716 -67568 -8293 -297145 96509 -7032 -264776 -30469 47237 -2844 -404902 332921
21001 -339336 213993 305134 -371744 26032 -20564 38413 -109871 160922 -284312 -83869
20990 -152532 -259470 -9386 45107 41134 -142147 177453 31811 107121 65375 103994 98865
20979 98865 52229 -31224 23607 188763 -162261 222089 -28407 40256 -371395 17507 -116448
20967 95683 -130965 84807 -265526 -63584 -277880 304175 -202665 -387944 -131605 85832
20956 -66793 -17028 133853 -20481 -430165 166786 -502464 41982 -70866 275477 -148053
20945 183380 -26238 -16286 -176344 20995 -66627 39903 -49784 93662 77844 -19863 163359
20933 -187778 113170 -178853 -41751 -1024 -105154 181983 44641 171589 16566 -316672
20922 7290 -78084 -258768 192353 99470 165402 -190801 217152 86492 45246 -99000 -91013
20911 -91013 -115874 -78615 -109012 143855 2760 139053 85239 -9427 -108485 -61934 -74161 179255
20898 -125169 37622 -150803 -79085 101791 189994 -23063 -156755 33351 -146856 -362642
20888 -362642 -231574 144510 247551 -392663 -73991 -84042 -176088 -45378 -181519 90989
20877 -22005 -87526 -270252 -153976 -401917 -20837 178104 -130947 -324869 184809 371772
20867 371772 -94578 66259 -202733 29516 341410 315401 -115413 99420 -39105 -235602 -134300
20856 -134300 2062 301380 -26780 102312 8680 11043 182765 -282162 -244488 -209455 -69527
20844 33175 -34424 51278 -146663 -151058 -51078 11754 -226437 244119 200390 -340717 -261077
20833 -261077 -333913 -130273 -251156 -95063 -113142 -399438 -40752 59538 180339 116662 -348454
20821 -258372 -195814 345450 -282755 -122782 -52697 -21474 -27943 -63067 141808 -200095 193309
20809 182994 -191457 -41921 -220424 -94117 -84914 -193954 -14455 76764 -291782 24350 34147
20798 34147 -115193 -12089 20339 -117324 -32220 327888 216206 -179614 -265726 -53160 -298354
20787 -298354 -305397 -227809 -20330 -58365 120818 -136578 132119 70322 2224 148577 -94078
20775 -39635 42371 -34025 89454 -207271 140188 -177083 -124450 49850 -91512 139653 149421
20764 149421 136513 -64163 85991 -67018 8539 80528 148666 137281 168834 -238048 -15858
20752 -248337 185183 -355769 -105042 -223629 235225 188192 -68038 -212480 -167342 -58146
20741 -155899 -124902 -121436 -461017 2883 51042 -295265 -275086 -96975 -127008 12635 -233903
20729 -61490 -39493 109418 -206255 167182 -381124 -30200 -14697 -68533 224982 -272983
20718 77822 150810 -119427 160405 -375247 -379292 -204744 157312 155064 -122181 261557 -242244
20706 71067 61070 -303796 -214531 107339 -141790 -279532 386963 -140272 -255642 277614
20695 84865 142425 -187146 -80018 -129165 -39319 -69064 -16273 -107428 -258853 284459 141680
20683 -113183 -47746 234599 274640 -284929 -86047 -38360 208990 196191 54429 -24058 333227
20671 -323320 -38625 -136043 123615 -161331 -269610 -33412 -19981 -232816 -13027 -12218 184491
20659 -59953 -20546 179651 110876 122467 -149727 -265847 -331738 -380335 -214825 200143 65117
20647 305363 79130 -176315 147466 -80324 -9439 228245 -318084 19609 31876 -468301 265181
20635 -267031 155266 93646 -39863 4894 -47781 15452 -104032 62433 -9587 -7674 -264157
20624 -264157 229152 -75953 -222473 -94397 -225706 200458 -286449 68520 -272377 18391
20613 -86153 65575 -244606 212777 -61736 -179762 70141 -86500 -187306 8157 -78382 -111849
20602 -111849 -39619 168898 -170399 140307 224756 -132325 -161822 51051 187008 -161344
20591 -180832 139636 160789 -91024 -300282 169087 -67465 119088 -462 -185147 -73406 -236199
20580 -236199 76735 70669 19396 -134690 -92702 51497 -23326 153942 -14165 -57320 -49297
20569 -49297 -59793 -128931 325176 -287952 -136099 122521 -252613 -152590 133391 43765
20558 14028 160014 131817 -67605 -325798 -107919 63569 30216 52645 -131624 -115425 -56756
20546 88807 -99113 -62544 58701 225937 -143381 -244444 56467 86453 -291708 133374 2748
20534 -63955 79539 290105 -425940 175650 -371043 -355173 166945 -112698 -123607 -37246
20523 102394 -162473 379522 332067 -286242 -337072 60214 159629 117873 112949 194310 -176911
20511 28900 -232611 -294859 -179241 -186426 201975 -89547 -238455 -112788 -374896 98932 -14935
20499 87814 197767 189114 -78613 -244946 84130 -58361 -249554 193197 -387209 43157 -190057
20487 -22103 103701 -149778 -143915 -129096 -117568 220284 76101 -281048 -218549 181574 -49567
20475 51690 -148520 -321711 -117484 52276 -41417 -139313 -40651 11348 -15324 -44753 -36649
20464 -36649 -37248 -177217 40695 -45337 128162 110048 70774 -97862 -109039 -48364 265835
20452 -925 471784 121605 4295 -39853 -64837 64870 -225888 -17589 -265454 -50049 -247570
20441 -247570 -90062 -5668 -238990 -21579 -83937 -120105 -198420 -293030 289517 -254483 285602
20429 -116631 193583 -80641 198445 -85320 155699 -383316 -158423 -273367 -293536 -129738
20418 7940 -234739 -72924 18548 -305238 -260877 -156498 146331 -148975 -342907 209292
20407 -41238 -108578 -18248 150781 2787 -47790 -80707 -473242 -83818 -130646 -102684 203974
20395 110437 40193 -58258 9793 27938 36047 11410 203697 -25707 -246115 351929 195273
20384 195273 -203290 300101 350744 -1183 -187030 162179 98602 -135744 -257017 -196711
20374 -196711 -172571 -317256 -136819 201474 354919 -57737 223841 -205506 -187984 -32294
20363 -93114 192099 -63015 112483 -11089 -30101 -12612 147614 -300920 -305148 144462 332171
20352 332171 27431 278633 -342777 120832 -59728 -369858 262004 39635 -101345 -37118
20341 63306 325381 -219558 4673 -12966 23269 261787 -44655 -73825 80063 15058 -141775
20329 -41312 -292763 -365298 -114565 -160597 -144140 79346 -44098 -298623 -240086 -105899 -57490
20318 -57490 182442 -178834 -216728 196429 -223699 84357 -11678 -118027 -177609 85340 -11738
20306 286735 -144791 24416 36711 -115359 -303909 -50890 244556 188087 -85342 54871 -71828
20294 -1901 -72734 284468 -39591 37072 206880 -270402 -236807 -106381 -110504 -350201 193871
20282 -332204 -256898 59351 -9988 363057 -95440 -430679 -241673 -149229 -247276 -212637 -95767
20270 -152818 -313474 98694 35466 90885 -142036 -7002 5962 162816 -22595 -231762 -77577
20258 -335191 -210060 182994 -243054 16514 -385694 -61198 -265850 -26171 -332096 -11533
20247 -467397 -349294 1689 -143014 156804 114871 -307849 159991 95599 -12340 -122018
20237 -122018 -540960 -397313 -163831 -51772 -177612 -35510 -23491 -394151 -121487 -138511
20227 -138511 47916 13239 -93056 -188489 162084 -26552 97109 -101740 -62780 165717 20056
20215 273217 107647 84738 -40215 48289 -400521 85444 164370 130385 -239476 67722 23029
20203 -193743 98497 -153197 -192352 297365 -59411 -81132 -11350 63129 -142772 32257 103096
20192 103096 -150715 -314316 -9084 -208006 -321590 207202 -116350 40181 -34543 -1475 -32076
20181 -32076 256710 61558 67978 -130091 21872 47870 -83413 -62816 109325 2067 35128
20170 35128 180213 319649 -176526 422947 -255352 391762 -32348 -254355 -247610 -473138
20160 -473138 138823 3770 -234644 -114111 -255216 -280854 -54785 -45074 37362 -236045 -45289
20148 -173223 39768 -129904 233195 84685 266190 -167102 -3990 -9167 -20190 71593 -28608
20136 122765 294255 97739 -354320 5940 64948 -125231 -146392 -90528 322839 -17594 -92435
20125 -92435 -168379 -193646 -39594 -74690 65909 -187565 -165801 -168607 147859 92163 -207615
20113 -17393 -3268 12960 34305 207845 -353578 -56573 -222401 -183537 -129593 -20700 -194777
20102 -194777 -154587 -178006 -168930 -116786 241259 -103917 -102173 4745 -400146 86461 141174
20091 141174 -2588 -124044 -23581 99651 138920 -117507 123465 -86623 -96563 -118570 -152291
20080 -152291 -6746 223838 -226589 89133 -338119 67828 -53302 -101024 -275680 29302 -127870
20068 -306737 -446391 117796 -133157 -88782 -29354 177087 -217902 325797 -108609 -74178
20058 -74178 -223206 -358436 63090 -315761 -194841 23503 -89119 -213987 -139302 313193
20047 -120274 22623 -133558 227209 -3446 -178742 -41761 -18385 -8543 -64501 7105 -186239
20035 110138 55994 21913 -159482 28353 60974 -413414 -98808 110907 -230612 28572 -29985
20023 -216730 53192 126412 -232738 180039 310168 143160 -92996 61675 -184266 -26346
20012 -109595 -112875 -101986 -122250 -215463 198350 -284095 -264655 91227 142866 -8118 16422
20000 22349 201116 95694 36558 -170742 -243557 -176710 -62931 200642 338027 -220825 -259908
19989 -259908 -72347 484958 303787 -271039 -26744 -159272 77318 -51353 -48205 -196371 -398145
19978 -398145 -354439 -74047 90210 -72682 -106057 131828 -55369 -30062 90475 -189586 -102091
19967 -102091 69580 -152632 -114347 83375 166125 130904 112970 89315 -147825 -90714 111171
19955 72950 105155 151782 -134523 142365 -69472 9781 -155900 -203684 -349891 -238036 293912
19943 -79880 -121829 -2032 -10430 -178587 -254358 -299437 -144456 3189 128913 -3128 -198466 22137
19930 -83360 -128742 97532 13571 -53580 83749 -1659 122752 67549 -87771 -86546 -149113 -142086
19918 -142086 -53792 -103832 338312 -15433 157000 -342909 32690 -196597 -299267 -29774
19907 103005 122046 89758 -237086 -238670 -161246 -145343 75989 126791 138794 -188847 -31065
19895 -62918 -869 -172658 -102634 54599 -94008 -167033 -112786 33811 53406 -906 15489 -34496
19882 -220678 -157163 -594176 66870 -134738 183648 -182427 315211 -280016 -380064 -370779
19872 -370779 -64518 -151502 -43606 -266499 -254926 135821 -1081 -160041 61756 92294 -260637
19860 90800 -184574 -222167 -37614 -135907 -55538 93428 -126765 98489 50391 -162356 -14889
19848 22925 250279 -22782 -11013 16636 -371718 -184342 -200349 -194376 -2411 -182351 -176208
19837 -176208 -225693 23462 244657 -89292 16508 235446 -107590 -251591 47862 -86572 -284963
19826 -284963 -213797 -426354 -30833 -39487 -28162 38959 -105904 -197350 -313675 -80829 -283856
19815 -283856 -64516 -65665 107520 -362652 -93594 425258 46158 -32464 -164104 -121520 11594
19803 -483655 306488 -96128 52617 -75923 -3376 404545 -240018 16758 176144 -13710 -201015
19792 -201015 -155202 124791 6235 -181603 59352 -50270 28839 -83255 -6566 -77760 -56104
19781 -56104 -189025 167550 -132177 43755 -174628 65546 16066 -259279 -267375 43783 -86339
19769 -201724 -166921 99713 1427 -70465 -109911 -60204 -42916 219666 80867 -350546 -372056
19758 -372056 -200736 -89888 -23218 5473 -273894 53252 -172713 -72846 -8806 56587 177984
19747 177984 -184071 -11785 -305968 -188373 -52369 -173454 -10687 307327 -53049 -182958
19737 -182958 -13592 -107964 -4410 2387 -439135 106693 -94920 75588 13455 -159731 327060
19725 -63552 -146307 226090 95141 -194927 -9253 -704 149000 155259 12736 150750 -118400
19713 151466 -106620 -22440 -112552 158374 19752 233812 -304913 88467 175668 39815 -345142
19701 -21478 8268 -14138 30641 -301008 -26550 62054 5870 -116045 132410 -47959 -104223
19690 -104223 -30345 -10862 312861 110945 -4753 -215027 -299390 -315572 -115476 2655 -107577
19678 214196 202604 -238576 -58574 -96682 161188 -111276 28242 -257797 172483 -324622
19667 25468 -115493 162126 55149 -57284 71228 11569 -69752 143132 130656 264281 64036
19655 -34462 -187196 -142323 -323311 -186057 69302 -77578 133266 3947 124468 -42049 125818
19643 62454 -98236 47510 101033 121678 116 78650 318031 -24201 -169729 148556 4942 -226401
19630 62006 500749 -305583 -102154 284522 -161672 21075 -295967 1659 -346851 -142545
19619 225333 -69046 70299 246487 -26195 -218308 -15452 -160881 -202975 186749 -226655
19608 -179584 -481729 -313232 -61896 -153808 86049 -15595 63526 147718 235694 186610 47260
19596 -11418 -390632 -185391 -256882 -89624 -370274 -152414 -293169 313724 133785 155799
19586 155799 -119815 -56084 -103852 -191028 -205410 -95212 58745 -57738 110830 -389409 26846
19574 -275618 54073 -356838 -41990 -122822 7927 -118020 -299005 19007 188526 -56071 -56892
19563 -56892 97646 245520 -20681 -112998 -252346 -55416 -63995 79218 -3711 -269629 -94967
19551 -5662 -45858 114322 226181 59236 -71177 29262 28864 -38334 165133 98985 -250457
19539 -321965 199702 23955 -449852 -206943 -167150 56191 142132 313634 -245104 -89558
19528 243454 -295161 314523 75257 -77383 -112316 -39179 -79400 193403 -133282 -213462 -150710
19517 -150710 -214561 -86197 281969 196129 11460 -167208 -239934 -282036 -381888 120783 11767
19505 -53369 220756 44328 188288 -106120 -181532 -69422 22252 -79329 -20604 -141506 -66488
19493 -25474 -168236 -109400 -85398 -186529 60234 -119587 -200594 171582 176956 -175525 -73036
19481 -51248 180251 100194 -248808 72955 -133096 -98352 -111360 -37938 129498 -88641 -159847
19470 -159847 -272308 -208134 -81942 -168971 27261 -219159 21310 78570 -42858 -252927 -24068
19458 -191055 84221 -74321 291558 -118867 -213498 -119390 -60971 25374 241145 -19006 -351339
19447 -351339 -142915 -327537 -208965 178993 -550872 -232628 -137937 -125925 34154 48805
19437 48805 -121780 37562 -165544 143478 133490 -295542 -240875 -158691 -405119 119273 90031
19426 90031 78549 -102925 -232249 -405590 -121569 -321899 192487 319134 -403933 27352
19415 -33410 -121520 220829 -187138 426117 130076 50483 111432 137766 -490837 -355626
19405 -355626 -73881 -194463 -213062 190100 -101669 -215329 -46181 -215017 -105407 -88957
19395 -88957 -118789 -143816 -95533 -25231 -143146 70790 -146540 131447 -15743 246859 -255178
19383 67271 43023 61475 -108384 -261067 -20280 -140293 302466 -213498 -98791 -6739 163966
19371 -214143 4930 325504 204361 -12215 -63539 -131065 85686 -18344 -247752 18583 -44742
19359 -64096 17416 -100611 -1393 -34626 -563808 -42850 -238986 -189062 -77534 -143785 -102427
19348 -102427 -214022 39167 -171052 145557 46006 86822 149658 -172037 -168656 -181783 -222882
19337 -222882 100565 136956 91789 -89802 14338 -88286 70153 -47765 81780 -16289 -362205
19326 -362205 115418 -268921 -259299 -98366 -21176 120251 -121249 128690 -82087 49875 -127686
19314 -234083 -208978 -121791 -197157 129771 -53600 -117482 -340304 -365011 116899 -299597 162076
19302 -230328 -58512 45598 -56642 -227046 -44201 -143699 160145 122162 -36308 -83344 367482
19290 131690 209567 3498 151922 -175109 -3301 -106058 -212784 -63415 -73366 -273327 -250794
19279 -250794 -40193 -193145 -14205 -149765 -40049 145728 91524 -113711 -10428 -26498 151433
19267 -36896 -13157 -51554 -64728 44104 5768 327933 -19086 -130795 13047 -287507 191464
19255 -185260 -150817 -16755 38571 -53553 -240321 54116 230987 34826 194751 77771 -229495
19243 -66661 97132 -120160 -312483 -62924 -188305 163345 -372405 -154786 -125007 -396260
19233 -396260 -238718 -14392 -236437 -171376 -142362 101 -86629 -144766 67167 -113678 -369675
19222 -369675 60057 128227 -324342 -56833 116813 303020 26601 -298391 14636 35828 -685
19210 -351248 36291 -98903 -116619 -337318 -24357 145091 116963 71749 27407 184502 879
19198 255008 -146942 -339250 -36414 -131977 -158097 -73487 -79079 116335 199172 15027 248542
19187 248542 316352 -493438 -147831 -136984 -21714 31499 35341 -320728 -202675 30398 37445
19176 37445 -107070 -78819 -197649 18479 -207890 -176189 108911 -287805 -12071 76502 289076
19165 289076 16531 132797 -222283 -25880 43549 -93623 239696 -226018 -188781 95875 -199227
19153 -281551 -56045 998 -68441 64511 34899 2014 3435 -131130 -290311 -398380 -185383
19141 5962 -298512 27500 85410 53266 -228579 -432852 48297 -369866 177728 33560 -11765
19129 -18638 67956 -261987 194241 222582 -262994 -121110 -211817 23334 63708 184695 -124726
19117 154901 -74763 -310389 -191259 226135 -260474 22721 426067 -510111 144033 -182404
19106 -301953 -43375 -342962 -330106 20409 -35803 -28572 -274667 174107 212512 -69123 -47017
19095 -47017 80724 -114094 60634 -1137 -96392 172474 -304589 -374144 104785 166612 95763
19084 95763 80278 123945 -379652 87119 31606 -86174 -98342 -326254 -96716 179568 -20930
19072 -7727 -199110 117725 -8961 -131684 -213130 -72631 200203 -163275 137652 81892 -138405
19060 41619 -86257 -178895 -176571 84625 15743 124381 45803 221455 -430539 64506 -68096
19048 -46272 265720 -95296 -38636 66356 23618 -114059 125786 -202069 2085 -70787 32529
19036 114149 -138836 -217570 77885 55401 -63107 198846 297346 339604 21329 -60064 -20493
19024 -10381 -80503 88292 2767 -93022 42190 -21433 163563 113485 -44226 -236820 81827
19012 61783 -2988 254184 188206 142205 -34147 -58107 -37919 455 -26215 -94654 285471 -190440
18999 -216292 -343285 -37042 -27097 -308545 -41941 -110599 41777 146683 -111755 109099 140413
18988 140413 204556 -142329 -215044 82535 105673 -46551 -65791 14688 62757 -359423 -458267
18977 -458267 -396780 -14312 -25046 -352126 -198554 -242152 98629 -179112 170286 7092 228151
18966 228151 -336058 192677 -192828 -442538 119243 -102833 -143776 -30778 -227181 -92008
18955 -183368 -308288 -279118 60226 -120528 -74842 -239557 26278 -77040 83427 -12558 9446
18943 -21619 -114771 -9191 -74676 -339177 228605 -136547 114891 261272 -191058 57789 59163
18932 59163 108494 -272229 -232841 -83913 -220629 51858 88307 25915 -210555 -108933 -92387
18921 -92387 36028 -76156 98068 20644 -19417 10258 169661 -47724 -238278 12157 50776
18910 50776 -75314 245347 -170676 -77078 77986 316333 101323 52534 242094 -26413 -129108
18899 -129108 -115894 165694 -245615 -196289 110434 -71635 -178093 -40359 -106074 -226060
18889 -226060 -121626 -79973 -21466 89780 166391 -166640 21772 -152855 -6495 56957 92565
18878 92565 -76693 97218 -178950 -118614 -108846 -78643 -341049 41765 -45394 -264816 67883
18866 -7519 -56023 33686 -135016 -98831 147932 -253753 -171171 -62477 227286 -361141 -279924
18855 -279924 103457 -339569 -93952 -7849 34124 -89340 30629 31603 78859 41375 41367 -229951
18842 60192 53605 -123795 -68722 149639 -179601 -144890 78766 -318827 195188 -124361 27298
18830 -390287 9336 -34527 -29935 124454 34512 96407 257948 -78353 -20984 178144 59302
18818 61722 378462 -12469 56683 -14602 95925 -298440 -146414 -145320 417105 581777 285617
18806 -51526 152161 126995 -23188 -270112 -213692 159978 -256106 -51658 211833 -161441
18795 -110250 -1990 -379212 -226874 -28456 128526 17019 20053 -293790 -199574 190534 53502
18783 -190890 250768 864 -218431 188317 152123 94889 111569 -41036 -36006 -106262 -17375
18771 191469 24101 28861 2793 -51681 -254872 19503 -122471 -67718 -152360 -209808 -33215
18759 24012 -43875 -71968 -68406 164998 -147042 -79883 48676 -78491 87427 -34839 -150235
18748 -150235 -13254 -372714 -42713 -389605 178120 -145376 -124090 -222539 32915 49937 434043
18737 434043 189295 22712 -210351 -293640 -201459 -99337 -140184 -294308 -357309 -128539 146711
18725 -198451 78997 -108315 32099 -2323 50875 138210 -82658 -91638 59247 -518404 -166849
18713 43967 120998 -237025 -65698 -107135 227539 -38879 134130 -395473 -166223 -87619 87174
18701 -46590 388792 -213337 204482 131883 -49823 34987 116991 -155426 -295969 -51666 -39767
18690 -39767 127196 -169455 -28089 -69573 -179661 206155 -112143 -38211 -217959 -147780
18680 -147780 20053 -366350 -76836 47191 -40298 43089 -127247 -86322 45569 194038 10936
18668 4719 -238919 -27863 -23465 354275 -38802 -22643 -66 -95952 104692 -44621 -88116 -204733
18656 -204733 -243002 -297375 -209226 151529 148185 -237938 -206695 -129216 -427419 -56420 -76028
18645 -76028 17958 -222434 -3830 -387080 -164416 269701 -512732 21937 213380 -152153
18634 156766 -248021 -3987 123758 158383 -252656 260809 -521327 -122149 38620 -283873
18623 -296837 40550 151883 20691 -174272 146344 13482 22933 -55822 -93220 176742 -38401
18611 -157937 -70610 80590 -328680 -71968 -438201 -99193 -69779 -229915 -150366 175210 71116
18599 47477 85236 -3668 28452 27775 -297891 -168586 151834 -16021 -359988 -47822 -212940
18588 -212940 42138 34467 192985 -112864 -216214 -30764 -269016 111388 180598 5308 27493
18577 27493 -113315 286223 206915 -238461 -104676 -80647 82856 -69446 119235 -343510
18566 -191135 33145 -223356 -68528 -11566 -35151 144082 -47911 -66901 -100330 73992 23158
18554 215349 -154273 -375867 -46048 201943 205765 129188 124487 -245098 -286413 33474 -102631
18542 49740 -222466 295058 -65372 143640 -1935 -33937 -55118 185514 -195279 96161 -131617
18530 67405 -112129 -440328 -37309 117082 330172 -79328 66321 21104 -24724 34197 -351844
18518 -185657 40185 -55617 -187427 2407 -294516 5192 5631 -124225 -71152 -171649 93067
18506 27894 -305593 -109179 -341449 -83460 15548 61807 -237253 -52780 47081 224174 -64804
18494 -224041 -55993 1156 -106262 -123821 76404 -273284 -95972 99828 -284991 106453 -49502
18482 -122824 -302424 -259631 252412 76755 42355 -180903 -177194 -240492 -151044 106006 161427
18471 161427 66729 -148530 37165 -220242 -190244 89607 -202275 -2471 113987 157023 -130658
18459 11580 -383931 89806 -151225 -126640 -229612 -253389 -36784 -34621 -535414 215695 199937
18448 199937 -39357 -160519 -165745 -131037 -28162 146806 164214 56926 -38254 -76823 117465
18436 121479 -176820 -34311 -360553 273872 -347588 53149 61832 -30860 -259539 -174929 56484
18424 -188551 245453 -217853 -1656 94872 -4524 97142 -406372 286822 156128 28400 -33692
18412 438037 -122542 215436 -124927 -292946 27503 284014 107319 151880 118762 39026
18401 18980 -156604 -113985 171936 -306918 32148 -35422 126582 152267 -56967 162893 -143976
18389 -171183 278681 -170761 233622 187169 -102815 -65160 6152 -282207 110949 51902
18378 43224 -166790 61557 -212462 197564 -83944 70921 -70283 29717 -79330 -161597 -356489
18367 -356489 205310 78760 -97732 21655 41316 453822 -179617 -8734 78745 85835 -70354
18355 -144514 31716 -68781 179540 -527833 74943 -255539 -53364 -182258 -1042 152055 203056
18344 203056 101553 2532 48196 20107 -52152 -166653 213621 -81791 -84856 12851 -397776
18332 -159054 13086 -92436 229525 229997 7462 -77680 -209767 29571 327506 -132142 -130692
18321 -130692 -273359 -109654 20355 3206 -255897 -90490 -85778 85689 -56664 -223183 36236
18309 -298007 -198365 -224741 10833 -383153 47800 -27704 -88236 59619 -192841 -252704 46406
18297 -33820 216478 -94086 -207723 -64041 -204131 -58304 122378 -108782 168959 -249468
18286 -140927 -28640 170923 -33923 -325025 82975 84493 67250 -19565 -353662 -5903 -65271
18275 -65271 -35816 99170 -204226 -318453 -229993 -268597 -81996 -63175 -1674 110996 -126746
18263 2875 -73187 -31529 -119200 -252074 -246236 -18482 -19366 -68370 56415 -99949 -212939 -177564
18251 -177564 -58622 189892 -111666 128076 -271773 -50296 -23559 -355676 -45227 343378
18240 -31161 -96487 -79408 -101749 -33380 313158 262703 -168602 -38476 -273148 -47044 -200388
18229 -200388 -187423 232966 -208083 -153516 -16675 146799 246393 -109673 37428 1322 -143727
18217 -61482 -74757 -34375 -119920 -298749 -52634 -93893 -124860 -657158 -80747 -373008 -144554
18205 125347 17537 77315 -64224 -81667 -98276 -195702 1094 120703 -222420 11179 -69376
18193 -61352 54523 121216 -128474 17525 -189702 -82261 356255 -140844 209041 276884 119716
18181 227400 -232055 23286 -153466 -163068 290607 -40168 221650 33329 -59113 -259342 -244872
18170 -244872 -207656 -99474 -47201 -307814 -179504 -163357 437224 304742 63082 354544
18160 354544 -24437 -32678 179634 14827 -141712 -225713 157915 -77585 -138865 121565 -154605
18148 7868 21984 -159978 226046 119046 28164 16641 190849 -144005 21527 38447 79166
18137 79166 -543226 -139294 166112 -121600 -166318 -88439 9354 124296 -140633 11399 126405
18126 126405 -280208 89035 268165 -42742 16247 125751 -12085 42163 31405 20013 -255449
18114 -99616 -135411 -172131 -106738 -3214 -57741 -147508 -366085 52364 155386 138067 -31523
18102 31412 64848 -149220 90149 -341441 -141228 -94639 75360 -34007 15873 -38993 212924
18090 132266 -94821 148995 15081 -135472 -71737 -267512 -332627 296199 131923 105463
18080 105463 145369 139897 -15763 111397 69591 -9744 -177936 60393 -292638 -28372 102796
18068 -166794 114734 -53210 -132793 169551 203782 338613 -227056 46671 -105779 -119915
18058 -119915 -166375 -156872 -424848 153701 -142602 85718 75160 15235 5139 -35706 -328260
18047 -328260 118502 2986 56916 -75994 -13894 168291 61473 -27603 95020 -98741 142224
18035 3966 230578 -216598 -411144 -337837 -171462 -148123 236993 74580 -64438 190799 -385569
18023 421216 114584 218490 107809 -181519 265507 -117882 10475 -219040 107988 152536
18013 152536 -174781 -52729 237211 -442706 -75241 -192992 -124714 -221388 -369069 172880
18002 17343 -24814 -170584 101941 186114 105720 165123 -34733 148787 -116361 10808 33144
17991 33144 -264837 -23946 -276933 66814 173584 85543 -239722 -350290 -90514 132446
17980 88928 -26706 -128038 -28328 -397655 71390 113274 -282111 30861 64332 -158682 -88568
17969 -88568 117498 -320362 -70633 75585 -52332 -139105 114803 44202 37138 -213581 -147699
17958 -147699 -67283 -167743 -354257 -59584 22376 50100 211095 -77419 64835 -62226 -14186
17946 -67826 275923 -101850 131049 -513659 -29277 184653 -19821 -121636 21584 -1126 -7866
17935 -7866 203011 -47023 -93985 91647 59638 36381 -82401 -291256 140912 252234 -118598
17923 -182344 145168 -160476 12386 -227975 -27844 -78035 451330 -21425 107332 128283
17913 128283 -13736 -86118 -67808 250015 162334 86225 -204415 -444463 -296645 -62441 158575
17901 21132 75924 -219729 31812 344054 -103509 23651 62575 -213695 52619 -192337 826
17889 -58580 -284268 -133462 -69913 253718 -220202 105001 -21719 81487 -114824 103378
17878 -11792 -456561 -131264 24890 -131978 -148516 -105550 -4809 -24395 -299625 282316 306594
17867 306594 102669 34886 72099 46731 -147666 -115622 101475 126237 143883 -57844 293339
17855 68468 126341 39098 -202074 -33141 -349036 -126527 10606 -171308 -255320 23951 130236
17844 130236 -212744 15573 -62674 136963 -300780 -112581 334600 108043 -15946 -8270
17834 -8270 -229263 217684 182127 -104247 -182494 105548 157681 -392459 -177015 -162106 195232
17822 191019 -316732 86668 -137161 -53593 -94629 189308 92322 30385 92381 52122 -99445
17810 16634 171088 -38076 22860 59238 -83871 -80289 94610 -4497 4695 -418081 -184675 -193093
17798 -193093 60290 133311 -157822 38244 191975 80794 224545 -98219 -37827 -15078 -244261
17787 -244261 -140825 -1151 39592 -232389 123553 -46719 126377 78178 -271578 -71080 60610
17775 218987 34673 -45667 79682 -30300 -58940 -12752 266658 27658 46724 -245547 129115
17763 76273 190390 -56779 -202765 -62770 -24105 -13253 182232 207177 298955 43404 136260
17752 136260 133441 -3917 -111368 140359 -105601 -374424 74699 298175 -292006 -14119 1777
17740 41297 -364467 -189065 -101995 57023 143297 -74895 184264 41421 206441 178344 -95658
17728 139420 3016 132177 192833 35581 195765 -356716 6873 -14184 79717 -167574 -301657
17717 -301657 -18903 94922 -97061 205826 116388 -102214 218925 94060 195016 96495 -91824
17705 4374 -136033 21396 4957 79644 -3402 -33354 409529 -31495 93326 -139935 24822 -146192
17692 12692 -336251 150472 -160289 292316 56607 95433 -141217 -400790 -56239 -106312
17682 -106312 -128436 34513 57808 150976 -247396 12936 212250 131225 180122 -85501 98116
17670 301602 -109492 129032 295774 -131703 396175 35722 -31410 203923 54414 329520
17660 329520 189071 209429 -126237 229082 239582 87845 -39906 126023 292694 -72939
17649 288062 -112350 -257368 -128059 264340 -41769 81936 165524 -22245 -170110 -11120
17638 46625 23666 266440 -240137 97912 -66236 -145847 -258214 172699 -24096 -58600 64385
17626 -152651 202352 -86692 -160112 289587 -212749 67641 13226 266059 -250667 -192037
17616 -192037 -90606 10552 -148830 65713 280384 72655 -119589 328254 390788 -93847 -313423
17605 -313423 -445372 177030 82941 70581 148562 125531 -28106 -150481 129049 1178 -154088
17593 -22418 -20417 -352961 105997 181785 207735 60846 -248041 -25734 64667 -119215 185491
17581 -17978 -85203 -238060 156221 -102900 -23993 186500 48061 7114 53704 -437241 -336700
17570 -336700 -142725 -272923 -41595 -174813 -167691 353737 268103 487539 370572 161393
17559 335544 82844 122582 160763 -81289 330992 84089 85344 131853 -174077 6109 -131550
17547 99863 26998 73883 386338 221645 304928 147518 38286 121801 45776 24811 -225208
17535 150533 46267 -221697 -236488 -145357 31126 153301 314893 -209829 274125 48540
17524 225315 223371 -76338 172514 238756 240219 -147145 70346 248172 173903 71821 293556
17513 293556 39491 181049 31133 16479 36777 230562 143955 70300 -149112 9796 149083
17502 149083 -41435 62493 106383 411805 2103 53427 218149 140633 -169285 159156 228215
17491 228215 231978 -37099 180311 347722 70909 27820 -12749 -275994 -127720 410857 167972
17479 23319 269742 109095 53004 93207 239338 284812 84871 294394 159961 105636 74939
17468 74939 397249 -29336 184840 218975 107457 107555 71750 128231 53222 72328 41150 317410
17456 317410 168031 336594 242741 36674 21840 266088 258953 90252 419301 482785 298412
17445 298412 298413 629747 371414 -315543 433403 227945 344168 348373 -105588 259857 59177
17433 -41029 21427 259265 449641 236815 154651 202001 280689 179486 137574 70318 342812
17422 342812 142510 421045 142537 -88536 348787 397219 155071 143352 273087 85765
17411 353668 148183 91693 231579 230310 269797 -112766 197191 11796 410933 132985
17400 -225229 22986 277521 254587 358103 257653 108760 306973 236580 13990 263365
17390 263365 131345 -33497 147445 386495 -105903 278767 37450 476044 304271 46832
17379 59911 -64066 117784 121632 315362 -30252 359278 306479 260156 -151330 33011 288689
17368 288689 189171 75136 121082 -83794 -187852 7636 3257 -195151 478725 140067 99013
17357 99013 -39809 -20719 200324 149666 -367737 487534 165183 10940 213356 101490
17346 131564 378454 343196 428327 292092 176407 -67216 216013 -10866 141977 166592
17336 166592 193530 8870 154566 -24882 341595 -158774 -133732 13366 498921 418614 46019
17324 147495 402737 358053 269639 130969 -70708 299164 222209 164784 157056 177909 289477
17313 289477 242686 -9617 39188 156766 54850 231714 295677 264601 639638 141415 310893
17302 310893 119621 351826 -37130 234329 220039 243404 -103999 -19355 164684 -101799
17291 216629 307972 513490 341478 133088 249484 101595 471405 80419 -230812 166191
17280 249283 415731 187820 -62086 75385 131866 366038 408782 271317 24478 168953
17270 168953 -48431 146181 515868 249931 51527 247567 352234 419932 180301 193410
17260 193410 250541 108782 42020 483651 458957 391169 -28787 208233 189566 341951 38353
17248 328751 416570 173117 235138 -38935 4766 -17366 -38181 365886 76015 -145307 241120
17236 9481 353565 112539 212961 128982 208424 273120 123256 274434 344893 250343 154285
17225 154285 109832 326461 67951 304563 80657 60512 558671 177118 215689 533553
17215 533553 70641 233798 346861 101666 222982 335631 461952 392326 27204 306740
17205 306740 283357 246742 146288 215440 41649 659395 257748 339080 -45166 470910 -90929
17193 256435 216343 -5023 83202 315371 301492 269833 598553 169025 48632 405363 238253
17182 238253 408537 114002 356572 553441 538812 534075 230314 74176 301700 356468
17172 356468 209064 224946 386837 405881 185510 331911 215383 -71071 296827 145884
17161 232249 184689 360897 373251 210480 -75163 388320 331294 242603 160716 427183 493957
17150 493957 101649 403340 548917 -11968 102626 150636 84689 312332 743093 183134
17139 138787 423108 543672 214365 360767 168484 294086 584590 355798 720611 185932
17128 476014 592437 -125306 187387 543996 175657 368276 430439 93383 479668 499213
17118 499213 572522 399700 233136 280909 515182 481953 359129 447530 450155 300830 447997
17107 447997 536409 376022 154034 246592 607637 605043 535501 396122 549002 596807 166237
17095 417271 447432 304041 398838 488504 435742 -22782 458051 78110 609273 467696 491963
17084 491963 552970 706477 450477 580940 423980 258610 740202 328678 315782 392694
17074 392694 603916 155988 402766 348892 698823 655046 867244 721273 614178 874059
17064 874059 592065 835224 689083 524078 402475 411047 138751 377367 678251 639131
17054 639131 551820 735447 898663 480651 691820 435887 608950 392951 574582 554516
17044 554516 866695 479447 666068 637041 473068 698175 509842 688818 637804 553396
17034 553396 283994 622661 501285 1078184 1082828 778932 602978 531043 674247 290367
17023 708078 414270 959123 766941 745926 325462 884050 609345 388626 498173 579322
17013 579322 786994 638098 871858 665805 939202 867449 973612 958369 757957 1066427
17003 1066427 728378 1141914 808495 621997 678652 976889 1098273 553866 858572 603588
16993 603588 1059257 688564 988206 847435 714547 463452 1035389 1057530 860509 626540
16983 626540 543197 921007 797955 985611 824203 819787 1199541 940742 904590 903546 805859
16972 805859 811025 1290525 832594 932208 1024764 677413 1106314 996511 1070352 1027849 907723
16961 907723 859697 878579 977704 1381255 1122260 970020 975130 1059557 1134901 1103099 1121560
16950 1121560 1206178 1259573 1180915 1044648 1297347 1431485 1154972 1118227 1529203 972531
16940 972531 1178691 1137872 1371841 921740 1246470 1119794 1388076 1447502 1244843 1590361
16930 1590361 1335853 1584824 1474126 1578379 1665505 1343546 1682556 1465780 1416812 1326656
16920 1326656 1710955 1454522 1554677 1638643 1399948 1768427 1365080 1882957 1681737 1554652
16910 1554652 1859099 1631998 1584876 1503961 1672997 1831780 1729300 1622880 1851942 1939755
16900 1939755 2008172 1727407 1796310 1813833 1750328 2341842 2337999 1970321 2149260 2049607 2034369
16889 2034369 2139922 2215286 1875808 2303641 2292030 2329054 2126417 2513490 2272087 2254365
16879 2254365 2435391 2402779 2519403 2304552 2584335 2419584 2199420 2445741 2686030 2729734
16869 2729734 2826742 2754799 2763509 2571707 2541123 2942421 3017626 2743030 2909507 2954884 3082212
16858 3082212 3239393 3129121 3304697 3103351 3332727 3007479 3207356 3628988 3369492
16849 3369492 3907806 3692773 3559622 3693176 3695294 3951243 4360047 3963578 3850964 4199547
16839 4199547 3927626 4301282 4247976 4299678 4296066 4523983 4596877 4304279 4170458 4471957
16829 4471957 4887913 4938574 5098984 5025328 5409152 5407546 5370144 5393675 5659425 5955621
16819 5955621 5759702 5893518 5979906 6274664 6111037 6506199 6532415 6515154 6816369 6850915
16809 6850915 6960686 6975031 7261982 7538154 7400099 7719665 8125399 8111642 8147194 8293052
16799 8293052 8313296 8867257 9077904 9211891 9241755 9794440 10009685 10169245 10342137 10608199
16789 10608199 11068944 11159973 11474849 11440270 11761196 12006491 12894755 13145363 13431772 13953456
16779 13953456 13816826 14492648 15280182 15359895 15764541 16057428 16811700 17237858 18069052
16770 18069052 18169371 19184713 19674749 20129003 20921968 21598639 22441202 23162635 23948997
16761 23948997 24688683 25680963 26646160 27974380 28947567 30421541 31468799 32651044 34273375
16752 34273375 35684083 36802742 38893149 40582594 42572710 44262672 46294438 48968907
16744 48968907 51190510 53613340 56547477 59012006 62078100 65874973 69222938 72704650
16736 72704650 76953015 81230494 86042575 90446009 96088218 101260556 107290023 113065652
16728 113065652 119608422 126097022 132827862 139803726 146651653 153415782 160115507 166156811
16720 166156811 172408316 177558208 182490011 185833576 188465134 189775368 190087562 189107670
16712 189107670 187065124 183841459 179348398 174282196 168493786 162041702 155364227 148171284
16704 148171284 140929456 133538516 126585012 119695369 112651889 106778884 100331802 94491786
16696 94491786 89183964 83928518 79220539 74589715 70359525 66300661 62498634 59258594
16688 59258594 56076751 53047125 50390772 47647312 45231210 43048710 41270469 39102735
16680 39102735 37221675 35260103 33432454 32470562 30800677 29722391 28145044 27174354
16672 27174354 26079696 24663423 23848512 23343782 22324769 21171809 20534979 19840630 18772613
16663 18772613 18267613 17744694 17170729 16368169 15645564 15340473 14636100 14352868 13982277
16654 13982277 13448396 13109914 12695379 12328217 11689144 11600342 11428840 10984263 10488554
16645 10488554 10158572 9993713 9704318 9285315 9050909 8879877 8631007 8480788 8117377
16636 8117377 7794045 7751504 7552989 7537129 7266037 6894900 6680460 6653736 6443684 6372434
16626 6372434 6318292 6132494 5867605 5671658 5780989 5915931 5214827 5405658 5271472 5061548
16616 5061548 5286441 4830775 4336195 4806503 4831063 4431284 4605154 4206380 4228523 4160596
16606 4160596 3915990 4024336 3839340 3733405 3921258 3688284 3502165 3620470 3585538 3285613
16596 3285613 3288444 3334384 3352430 3251646 2968199 3447345 3135863 2938332 2925652 3106896
16586 3106896 2734738 2910695 2872130 3076884 2522835 2614824 2747582 2612386 2981683 2593851
16576 2593851 2517470 2666392 2073729 2433072 2111803 2181716 2054210 1914142 2340463 2184441
16566 2184441 2175120 2267742 2089060 2244341 2095745 2183127 2077984 2015987 1932022 1705881
16556 1705881 1902624 1860641 1770735 1679842 2005869 1938277 1698476 1440030 1553085 1694760
16546 1694760 1362150 1486663 1685614 1371387 1430130 1191969 1482371 1650213 1385397 1475634
16536 1475634 1718608 1497048 1230007 1476347 1051514 1158496 970596 1131634 1285667
16527 1285667 1445634 1348596 1321897 1352296 1288687 1254083 1064684 1185398 1260594 1223926 1108944
16516 1108944 1246435 1307417 1283059 802505 1159989 965145 1220926 760427 1179633 767273
16506 767273 755483 839842 970213 1089699 1179753 921651 1035119 1176443 802191 921954
16496 921954 1118215 832815 631073 853982 854697 840465 941482 873049 824876 800476 534614
16485 534614 515784 881409 1038200 673017 782144 621502 814365 837749 1025456 677744
16475 677744 557786 851671 817272 667599 511484 515994 674813 151498 605245 623461
16465 623461 259209 742240 612666 973729 715992 638914 498155 596598 578367 433933
16455 433933 407539 493024 361266 470319 570543 969910 591348 481906 295482 545211
16445 545211 509308 646398 734444 516630 345613 453439 439235 668490 276493 578713
16435 578713 537663 353747 724883 773894 436797 239507 517990 256280 301612 219276
16425 219276 407193 546128 684729 368311 583152 328465 444269 432986 731273 693997
16415 693997 607666 295317 222850 507630 388983 274941 188610 183820 435773 388477 505721
16404 505721 275802 341358 175011 529079 505787 501227 294237 329517 532293 126012
16393 330247 576325 532963 535894 656418 396652 369203 635321 586782 327992 291459 92094
16381 339608 488603 442721 315306 245892 278839 -123441 527893 341546 295507 116247
16370 141475 226698 306784 236213 502004 148194 50960 194118 263052 280024 -147650 -25786
16358 85808 264725 341125 284590 99170 462518 -47879 290638 414528 47780 341917 291566
16347 291566 682079 102044 354531 -32447 103485 53259 193475 -32089 183485 -28286
16336 159246 31420 338315 -8068 -75323 276483 492893 35778 72810 573099 180887 324010
16325 324010 310046 41567 393903 275711 519534 256289 164277 337393 43570 113331
16315 113331 193487 153512 342024 279885 -36964 192771 269329 229538 409089 504901 -75337
16303 50723 160489 311348 268066 145568 104147 54708 -366281 264429 -240077 199815
16292 223705 -63025 163502 136581 -147222 24704 170233 333732 665126 -38425 71145
16281 42419 164995 440090 -194192 59147 -251312 -51283 273334 197147 81839 48069 -73637
16269 282589 -165323 265256 -54203 171662 35940 291608 626259 -1849 140253 -68170
16258 44861 113796 -185544 137458 405604 44350 -155309 121443 54354 351865 -104088
16247 162295 38943 370575 343034 416990 187652 121931 207711 503672 106811 315487
16237 315487 50104 86646 121680 123125 -298283 15276 114906 302767 9049 -89315 239600
16225 -11910 219762 12799 95403 76872 204737 219574 167443 313335 328972 168594 -93632
16213 23624 -102314 -116082 53860 193768 147895 -272850 122693 51264 372779 139886
16202 162010 89628 -84332 114312 -62831 -172356 -74406 -301494 147520 51418 49137 -46951
16190 197770 -130951 -80109 186026 -296883 229183 148649 36272 -159750 312469 117512
16179 -96779 84953 131110 301109 -48799 43387 17214 77033 -97963 19505 177139 -174591
16167 84038 55835 -39785 -25452 150516 -329382 -305770 -157021 215933 84205 57578 104886
16156 104886 188288 59425 -16147 515789 -155094 -329342 419592 -134820 -145790 83378
16145 -8205 279082 409853 -114287 117784 -16592 -24092 -37572 254062 176971 -100960 -174528
16134 -174528 102741 -49353 129038 328827 46835 72537 -38586 66227 141257 107022 -154309
16122 -28074 97407 -168469 38146 135487 -310336 328529 -107171 272122 -316873 69735
16111 60051 -4170 8152 -209195 -345042 -168696 69959 138877 -152115 63411 -35665 190538
16099 107226 274776 164881 -244406 -90675 48341 315058 -169970 -163347 -189033 -86849 72934
16087 -234314 -91703 225733 87677 158139 361291 -237443 -98108 5546 29380 -170408 -130068
16076 -130068 35346 -30514 -5416 2810 -13925 114148 3261 -189723 -297473 -300006 -113302
16064 -235929 86698 63793 7845 83715 -48182 150956 31900 -53987 -101808 -175464 230426
16052 -8294 -25472 -141999 16792 141079 148891 -279752 -4094 207024 257610 -152906 -83752
16041 -83752 365659 111674 -107847 -202280 -33027 -116626 221166 50141 -142766 60452 -346683
16029 78017 -14494 -169125 26857 -339302 89333 114106 38411 -15137 67359 84885 138197
16018 138197 -4579 -52946 195629 152422 101752 -150187 -138232 171858 141124 28106 17166
16007 17166 78617 -111309 -155978 -200792 -210662 130644 49513 -148877 -164396 55945 385423
15996 385423 -151843 -13451 -383081 277531 -255199 -26428 -277212 -127355 -36326 -70879
15986 -70879 260794 180350 234886 20138 325285 568559 235754 227429 189178 -35476 211899
15974 -27782 385355 -6511 309318 256161 -165298 -98283 141536 -6435 141074 47279 -169070
15962 131025 458 46295 -31632 31674 152511 167711 -290808 -273960 227676 259587 3930
15950 -64449 -154321 1744 43068 -95400 -82801 89838 -134102 -281893 -23968 214409 -101639
15938 -164002 -229830 -37155 -27213 -63295 -30105 -87046 41712 133460 -173418 -76705 -41623
15927 -41623 -415751 111497 362134 28018 -96345 1034 -144191 62730 -217795 -85895 125374
15915 -240376 191199 -226501 150685 115302 -195488 34254 252442 -123246 5033 239115
15905 239115 -45796 -353715 -81652 121604 -132788 36179 -82900 83300 -143658 50488 137762
15894 137762 18680 -97307 -451695 147470 518157 -65217 54273 -29552 -156202 -91772 157630
15882 161063 18380 -62989 -28523 -50017 15139 -74855 109636 54068 -218689 -110961 131149
15870 -48360 87244 -184811 -497967 218425 79180 -99866 68643 -24445 -66713 -488956 -131514
15858 228023 -287816 -80273 -236892 -141921 -99698 -42030 102747 55416 48959 227221 183571
15847 183571 109030 61747 -174200 -201712 106515 -204439 -311865 -65066 -52610 -54295 68306
15835 -257112 -67577 167383 24122 -199791 -188427 -372954 -396731 -10449 -142313 -181804 49104
15823 -46575 39595 378513 -57299 48342 -17574 33931 112221 -6407 133950 -209361 -15686
15811 -61780 -12517 -83321 -277403 -289276 -151436 -409454 205562 54125 -27074 -19436 -104412
15800 -104412 -79624 -191384 74102 8240 -125872 119263 390711 -113287 -92996 -77242 -135062
15789 -135062 -6513 -102135 74066 153222 -321795 161229 -74870 -117876 24939 -60486 -436934
15778 -436934 -179364 263516 -73084 -91662 -11980 -19764 -60159 -186986 -112046 -74360 30493
15766 144008 60968 -193038 2344 264964 39724 217885 275128 -147733 -68253 13743 126445
15755 126445 169620 109618 -45728 -362091 79572 -380337 257782 109073 259285 114247
15744 26902 240051 -181900 37520 474003 225893 86699 -55613 -124983 264598 -14691 -155970
15733 -155970 48420 -203482 348226 -57663 39510 63291 -222385 -69496 -216581 161580
15722 367944 279366 18965 45353 196078 325640 -106492 -76614 85877 -4565 -180751 141928
15710 -129275 133126 -116525 -80126 69405 51091 -267300 12692 29682 -164939 -107768 192522
15698 337248 -612 -149167 -194669 39497 124467 137872 17622 142717 -70226 -79432 -199327
15687 -199327 -187959 93947 -171201 -196864 -268556 -397798 -57680 -131361 -227109 30789 -177153
15675 -139589 -100797 -26489 158012 56920 472028 151016 -107370 -121099 -55898 -123748 -186692
15664 -186692 -185384 -9960 -116065 -154298 79303 66240 -117607 -68407 -296164 -58821 27490
15652 51124 127952 -191448 -380973 -100974 415219 -155066 6720 -50347 131666 108969 229298
15641 229298 -13337 -52278 104443 62581 43227 -54255 -224237 -365892 115927 -42635 59089
15629 -109820 -484182 -295964 226146 353929 281411 -66005 748 237757 218809 265251 -344267
15617 274336 95611 -169317 243515 -174520 -103829 -7885 -277529 -205032 248190 -308996
15606 -122175 -42755 6034 -42650 -47996 -234732 57564 -236739 45125 480045 227826 -244468
15594 238204 75946 45250 184174 71099 25908 -48899 -127665 -143809 250094 54677 133707
15583 133707 -15521 11346 -1890 -46537 -67528 129428 -113695 99875 39513 191069 148782
15572 148782 -150770 80791 84358 59565 -180041 125453 154220 104420 -132571 13279 173383
15561 173383 262274 329897 154834 48434 -131245 189326 -145092 108624 1137 340277
15551 340277 -41456 147369 -55908 -129552 -50256 -342767 43075 -58878 -247885 221788 -196462
15539 23149 183006 -247594 -192455 -150575 -259739 187519 215353 -158175 108567 -125895
15528 26753 -87997 -108382 -226016 -60400 -114914 227085 -93618 -243538 -89863 395208 93311
15516 -77755 -250183 8003 -66579 -7242 -162512 181553 -234097 254976 345363 215387 -332356
15504 42545 115526 107385 -29692 -107341 100340 -18463 17425 389294 71658 120532 -264501
15492 40512 9246 -68366 -150592 179165 199051 -360253 -334987 39184 112869 118513 -32792 188333
15479 -98360 266135 -102105 73709 -69543 98965 -288608 136581 7032 -212674 89997 225338
15468 225338 257363 -36373 20344 84121 42233 274060 -111061 -65286 -199238 -43269 327283
15456 149249 63213 68383 327974 122977 -81837 -343497 -145891 6838 96433 -370082 -19119
15444 195405 -72228 -219073 -159892 270461 289395 147702 -31033 53218 21138 -129046 -159420
15433 -159420 35337 -41016 15747 -269172 236056 139813 -368762 -55791 166342 -154297
15422 17768 448138 -121473 -133268 196846 -169052 -57249 8164 67821 -56642 -92680 88778
15410 314299 32895 -22519 -388959 357182 -102733 237919 48689 11207 -357820 -99315
15399 -13840 134819 252848 249942 -93992 -85301 189075 89156 79694 338252 126716 147837
15388 147837 -32633 54497 -49890 35979 125105 -61335 34283 -241938 -155709 60266 348032
15377 348032 -10835 271003 -190347 -39713 89485 -106926 41329 -63674 -22990 215583 7364
15365 -170807 -103871 -189544 -19060 321585 -446796 61292 -319241 370004 -18992 42098 190152
15354 190152 -266919 -55427 19116 -139603 309301 270819 93643 361222 -69605 80851 67390
15343 67390 -46344 27419 -130556 190116 250403 -36582 20862 -345992 -40335 72535 53123
15332 53123 -173494 -311837 18817 -189878 408355 142927 110695 -81943 -135827 -33751 174806
15320 163107 116626 26672 152471 112000 121291 -65205 12272 126380 -140545 256342 157411
15309 157411 70999 -113018 40924 318346 -175016 197836 -85458 252031 230006 168965
15299 168965 130233 57647 30279 12683 124374 134426 -79218 182321 -66650 119126 120141
15288 120141 -73703 321665 201387 -132736 84243 158521 -166255 291762 88342 171577
15278 171577 187577 228395 -87345 2686 113180 212012 209138 -99235 130033 7628 -206381
15266 105186 190803 -240675 -267968 422635 75146 137385 -9665 226225 123217 -112166 239829
15254 257872 442249 -10245 97864 143344 358558 309949 1074358 1601883 1119981 1350495
15244 1350495 1162733 643243 40458 194086 26379 -76935 393281 -153623 122051 216193
15234 216193 7058 59833 160861 -159628 213516 -142262 389801 -114623 -287765 -131593
15223 -32679 -15932 24223 177521 -60285 -280176 47481 172611 163795 231822 340408 -44409
15211 362366 -354562 155067 13071 -161828 95696 443656 188670 140216 -184171 244336
15200 86210 -68276 18893 -46863 -71700 506287 26372 32358 280967 -309085 -8768 157331
15188 73682 -206808 4662 172815 -51312 76827 -85893 171279 194226 339357 159481 29515
15176 219757 304503 19188 88733 -316444 160320 -191036 265291 274890 71537 -80141 240708
15164 -22308 36074 528 -57045 464758 -86932 488135 -45047 -36638 -25855 473945 181270
15152 54266 79055 197465 438966 321354 180950 343865 159497 144934 -186233 20482
15141 -39123 428470 414630 177089 99440 41516 146211 155885 428307 292096 95044 483370
15130 483370 229509 54051 299834 -41242 269776 51313 -221321 -36706 363599 506127
15120 506127 10131 194569 200865 332202 320061 -171913 164191 490869 124934 -79871
15109 75443 -37065 191900 248042 37852 163854 425461 -33389 162294 60619 138997 179493
15098 179493 -32597 76530 242357 166820 199710 29479 283158 201101 -213917 -22664 157420
15086 130248 134778 230495 73767 197420 220905 175186 336075 -154387 75413 250202 496061
15075 496061 -60970 81765 -34779 242464 287686 -42661 205701 335324 235162 158940 361376
15064 361376 -417598 69241 -8087 221343 314353 222379 41834 384153 274952 378014 182317
15052 196294 450791 -124532 374521 236210 -50006 55162 107229 239135 244991 81121 145904
15041 145904 291781 119588 315700 239094 147257 75811 315457 503717 259174 49841
15030 -40503 374068 335791 496326 453554 162663 370508 354402 378016 486965 392787 283699
15019 283699 -29684 369597 224531 213205 51159 415115 396086 134460 206046 262657 88093
15007 273878 487347 237493 403194 67105 48502 183806 110875 362621 353009 115598
14996 259301 164626 90933 345146 400468 185676 62014 242268 433664 478943 92219 579940
14985 579940 71351 -19205 233719 443445 276152 267137 116476 377018 -194805 215234
14974 140248 175306 105388 91281 153556 474008 480521 399841 596038 419372 391296 330674
14963 330674 211117 258067 464403 596983 255284 749359 453953 572099 322910 61368
14952 219240 525832 430843 315023 232961 396484 139207 589160 228972 618335 107252
14941 84384 337329 359510 440147 622271 210139 191122 256258 128520 320618 488999
14931 488999 120806 683726 341354 273264 458434 368259 298864 87614 304609 186226
14921 186226 361446 221385 429059 200176 300101 19948 178756 304284 374383 189104
14911 189104 394699 528461 365672 452515 201124 375678 394328 450383 436923 327199
14901 327199 135038 378048 346657 -112034 109233 224280 531552 562618 296487 411495
14891 411495 295257 408733 211027 518785 538499 457418 336730 725615 175694 297195
14881 297195 364561 288297 368828 444002 287725 540692 313044 404250 421626 263728 530485
14870 530485 -69877 776207 240407 12259 462317 405299 673022 459733 351722 -54123
14859 600895 439380 268431 -101173 220255 347698 708313 966922 370514 575709 492779
14849 492779 625548 741660 523216 718879 688616 182769 530737 180552 455777 627026
14839 627026 175910 721478 385362 481792 372125 551396 570846 751959 450031 460843
14829 460843 598564 185600 416805 573264 547397 379184 619766 536330 727879 571319
14819 571319 737030 757313 668226 704708 511152 339582 645004 -10124 580777 629097
14809 629097 909220 573170 597195 384769 613354 390330 652729 479297 815415 603856
14799 603856 454301 680361 578589 599561 561292 479632 650117 449043 986359 638190
14789 638190 283912 831474 382376 412844 718191 681527 671620 982229 289096 504769
14779 504769 947845 650747 750419 598114 594336 827525 875342 971345 566308 904411
14769 904411 578616 423167 746604 787371 869849 851400 531478 467042 688439 695743 908788
14758 908788 678180 487452 722026 597979 814180 977482 436846 367948 485856 600345
14748 600345 750388 694724 762635 1038207 750162 842736 719221 883730 875757 566517
14738 566517 618598 711327 688692 559595 752688 919333 1047747 608621 536594 1124928
14728 1124928 547859 884867 1172238 1117943 830176 827396 812836 633173 997745 525698
14718 525698 1039649 733550 657137 595983 610288 936705 928123 567143 800091 862873 702128
14707 702128 1042287 1105980 1115122 1072360 1117433 946056 1055842 692430 817563 1124100
14697 1124100 897326 959236 1166481 1030549 978661 934979 877134 698699 1079082 1057865
14687 1057865 896898 1491394 1130995 1088677 1090519 1149329 1066180 931292 1015222 1285857
14677 1285857 1009061 960893 1187417 1041301 927734 1150347 1233697 1063077 1226836 1145929
14667 1145929 1020517 937080 1106906 1307703 1075110 1276681 1606935 972475 1098051 1226648
14657 1226648 1386834 807774 1460572 1351779 1472458 1221434 1306160 1533761 1520867 1251591
14647 1251591 1070215 1090506 1393700 1477306 1402562 1080997 1389644 1125833 1134148 1425200
14637 1425200 1296530 1373006 1483621 1093140 1334463 1250759 1482380 1367659 1433466 1451784
14627 1451784 1222876 1305455 1519333 1507787 1645776 1543559 1450741 1741253 1366493 1630388
14617 1630388 1989052 1497468 1790452 1596360 1498812 1424877 1600543 1687956 1641645 1683538
14607 1683538 1655959 1550921 1972818 1907876 1716259 1539539 1732809 1737424 1713212 1569883
14597 1569883 1713291 1779327 2013422 1858076 1808659 2079486 2076648 1650563 1859650 1866138
14587 1866138 1938493 1856200 1832138 2227918 2275505 2225007 2358074 2285391 2249551 2260604 2421110
14576 2421110 2253875 2308526 2292975 2344215 2471517 2271929 2376529 2570803 2555882 2541060
14566 2541060 2405809 2494420 2633440 2771215 3012420 2787006 3023218 2881265 3047831 2991029
14556 2991029 3551587 3950933 4027592 4225958 4318874 5313545 6327434 7920619 12202808
14547 12202808 22392328 39850061 41687864 20844520 11102579 5714086 3668058 2663634
14539 2663634 2313167 1901382 2238906 2498668 2251314 2136810 2039078 2256009 2190869 2420962
14529 2420962 2316465 2532024 2319799 2469323 2337691 2532031 2636861 2826865 2954657
14520 2954657 2944621 2613058 2952836 2978984 2885336 3338811 3172613 3131316 2825741 2767407
14510 2767407 3099996 3145051 3018345 3366005 3400084 3107812 3135420 3577158 3390898 3303874
14500 3303874 3470575 3533953 3427221 3235072 3817574 3714418 3487627 3362683 3650336 3650127
14490 3650127 3735667 4014320 4142778 4070894 3941802 4126764 4217813 3883582 4410072 4263542
14480 4263542 4400224 4138198 4071391 4507061 4364453 4522119 4371642 4588239 4328061 4767643
14470 4767643 4839870 4814788 4525810 4674560 5085303 4867579 4820774 4809961 5138288 5204399
14460 5204399 5704078 4790603 5338825 5362681 5676680 5502570 5707602 5597189 5936850 5611038
14450 5611038 5908267 5784412 5951458 5993341 6332473 6090971 6322489 6260730 6503632 6437652
14440 6437652 6673983 6463944 6984190 6810427 6801635 7120728 7143299 7335486 7323944 7132392
14430 7132392 7530945 7806823 7980317 7912445 7627477 8271134 8199271 8113252 8199368 8544257
14420 8544257 8625582 8991808 9173603 8816479 9177904 9262008 9370925 9458471 9473157 9741772
14410 9741772 10205524 10149924 10453724 10490375 10674625 10540755 11132806 11237623 11415785 11857568
14400 11857568 11672931 11917204 12158362 12470358 12575297 12602593 12964751 12815541 13305282
14391 13305282 13580770 13781627 13959461 14223436 14347624 14628166 14783539 15118247 15587917
14382 15587917 15713654 16030850 16421537 16888370 16772817 17273579 17848500 17739320 18073698
14373 18073698 18745811 18637405 19547173 19920700 19912088 20633455 20758091 21097834 21635771 22577228
14363 22577228 22568864 22787930 23390846 24377046 24662445 25159610 25678369 26352735 26842237 27232134
14353 27232134 27977253 28802677 29255770 29938126 31052090 31385653 32585990 33208436 34132781
14344 34132781 34925935 35733404 36891046 37500725 38784628 40196030 41278357 41930511 43315882
14335 43315882 44440220 46162705 47009597 48489574 49946167 51602666 53077123 54660852
14327 54660852 56119803 58086623 59977696 61712313 63925467 65933423 68306002 70601438
14319 70601438 73142114 75752088 78446723 81309225 84400883 87641397 90902316 94071170
14311 94071170 97807207 101657795 105689921 109830088 114719907 119115498 124282400 129823289
14303 129823289 135025684 141087947 147122047 154051530 160903530 168275512 176300797 184679849
14295 184679849 192880187 201766623 211905467 222271590 232854963 243863774 255505178
14288 255505178 267554132 280412166 293253223 306870771 320964470 334984980 349233965
14281 349233965 363778000 378203241 392182634 405926179 418739668 430386131 441204669
14274 441204669 450157670 456586823 459861197 458633778 457456873 455924529 452689126 447679330
14266 447679330 442256872 434414237 424691297 413313143 399822131 385601816 370599027
14259 370599027 355023865 339455766 324137608 308739470 294011861 280603765 266884490
14252 266884490 253765695 240950432 228961824 217438075 206901742 196545399 187178201
14245 187178201 178401516 169946390 161862226 154082944 146969929 140177620 134150920 128666199
14237 128666199 122908467 117498671 112505343 107903205 103383674 99589796 95545603 91747186
14229 91747186 88295423 84463582 81289940 78095777 75051034 72745512 70069948 67826990
14221 67826990 65398370 63263381 61122552 59022206 56847246 55023530 53284265 52032501
14213 52032501 50458663 48820119 47454838 45678480 44599008 43138126 42428003 41280878
14205 41280878 40311957 38961219 37624241 36603788 35573073 35199835 33935013 33026888
14197 33026888 32350241 31351290 30476715 29918045 29073536 28552042 27709648 26880730 26400617
14188 26400617 25922587 25009265 24385660 23989462 23459850 23175757 22351982 21856532 21361348
14179 21361348 20892926 20415430 20077171 19465525 19556560 19014073 18912653 18204986 17279398
14170 17279398 17209323 17390825 16587823 16632795 16056075 15991788 15468203 15078155 14724936 14570599
14160 14570599 14307466 13947311 14007169 13760215 13334401 13267807 13053628 12517129 12178710 12307828
14150 12307828 12080928 12137386 11945082 11664060 11775928 11237349 10973118 10956288 10579891 10285452
14140 10285452 10290013 10434319 10338723 10209050 9979535 9788175 9157580 9017364 9131218 9141691
14130 9141691 8759472 8868776 9033374 8518205 8393777 8484252 8031062 8130210 7860826 7839240
14120 7839240 7642210 7839544 7533940 7640846 7582748 7492978 7272198 7168160 6887815 7083363
14110 7083363 6722368 6814211 7076371 6277772 6649896 6185535 6394649 6416344 6409696 6205887
14100 6205887 6148955 6325123 5969837 5946317 5615782 6084061 5913387 6053133 5627575 5930217
14090 5930217 5372054 5520873 5505569 5139673 5007369 5219546 5101394 4950767 4865812 4974555
14080 4974555 4983774 5046182 4690829 4938968 4796767 5028560 4421419 4712251 4280199 4415276
14070 4415276 4228287 4046985 4353390 4538437 4111574 4227114 4095237 4389782 3932773
14061 3932773 4301137 4095138 4109531 4335776 4203324 4007283 4097356 3791798 3892359 3784670
14051 3784670 3897273 3471051 3797127 3844447 3375855 3330020 3554389 3583768 3524294 3258826
14041 3258826 3171446 2944006 3425198 3165810 3208912 3046453 3016369 3174381 3167045 3345990
14031 3345990 3078446 3172533 3106955 2739999 2805995 2917658 2742555 2796190 2806522 3023821
14021 3023821 2573338 2622424 2742846 2700512 2694173 3091904 2647890 2521247 2511129 2530659
14011 2530659 2198633 2332865 2634091 2440786 2052520 2484148 2450967 2374000 2051329 2382577
14001 2382577 2472100 2349547 2339534 2154930 2407099 2456285 2218569 2205803 2402629 2223207
13991 2223207 2605328 2506522 3897667 6689298 14934434 32864785 43626997 25312651
13983 25312651 13697210 8700542 6146401 4688933 3963765 3671981 3062415 2937307
13975 2937307 2975136 2988187 2681864 2485476 2407495 2534152 2192563 2471220 2464627 2287539
13965 2287539 2475927 2329161 2318041 2140508 2150091 2286248 2253307 2050315 2141615 2006611
13955 2006611 2002512 1647365 2077714 1908515 1947642 1753814 2024713 2152242 1849941 2096678
13945 2096678 2026722 1893458 1868372 1737686 1799888 1972788 1795761 2048793 1807250 1720764
13935 1720764 1882676 1953478 1670539 1857763 1679091 1699660 1909269 1721455 1522836 1503885
13925 1503885 1738848 1564837 1662184 1358257 1512757 1360520 1579474 1642690 1573503 1346114
13915 1346114 1303860 1313485 1258731 1722367 1595123 1626849 1326917 1620181 1382468 1402633
13905 1402633 1206038 1255096 1357494 1180482 1439851 1469217 948534 1362643 1575762 1403989
13895 1403989 1347845 1101521 1582362 1694398 1230628 1242609 1547428 1565110 1286318 1153882
13885 1153882 1510113 988985 1173074 1485174 1034607 1319225 971866 1229677 1123941
13876 1123941 1264675 1482374 1022876 1318500 1243038 1072210 1358217 1481952 1323336 1101769
13866 1101769 947005 807341 1142518 1054474 1208599 1090296 1001898 973570 1123653 1120748
13856 1120748 815239 1373287 1187721 1169347 1083893 777012 1139655 747292 841695 1237313
13846 1237313 1132156 933109 1011094 1019434 865429 697948 1068426 1049154 1041585 987419 920032
13835 920032 749744 1025914 971108 783448 850520 835881 774276 744524 925340 955895 962153
13824 962153 1045118 929761 815990 1254577 714193 1100943 867295 881364 894277 873079
13814 873079 1093754 707127 960322 667806 658516 1002221 701707 668156 585627 890995
13804 890995 1026514 889114 910474 906423 1041244 512462 844728 866344 845515 516707
13794 516707 789365 868943 1045004 1103093 1169698 815667 539067 1129295 920581 995254
13784 995254 1015326 432416 435057 938601 861891 377592 649387 734107 620198 800889
13774 800889 699899 809583 464100 837080 684399 752337 702215 832884 772048 638498
13764 638498 657214 351497 746351 707371 597891 643508 646651 421451 498300 515955 721770
13753 721770 624739 562116 1032596 575718 653777 811891 461281 889535 555936 571921
13743 571921 551451 776558 427886 458211 907743 415687 574975 566368 433597 772198
13733 772198 650124 590076 582387 652507 651974 690608 358382 451404 775731 505140 441111
13722 441111 303863 521053 738584 646300 523538 712436 806720 531203 562639 424266
13712 424266 672847 516232 511308 773641 361476 548102 417641 759997 451546 400681
13702 400681 657459 801216 400053 583125 686109 465014 357135 649720 388021 372905
13692 372905 363052 406380 456060 585724 276215 496225 927817 425365 229114 289121
13682 289121 242029 603801 274327 286267 772398 480127 392816 364731 267907 521496
13672 521496 332289 731083 666989 331772 434684 578632 458635 326890 540201 655686
13662 655686 563859 349073 -19100 467649 327549 715204 625323 771226 777994 286430
13651 551127 396363 402349 582637 426836 427130 462070 537235 468762 457305 715730 470758
13640 470758 273849 396517 643388 294114 757820 240345 710896 537084 111062 310784
13630 310784 564889 141380 268793 304815 472533 372941 540014 332850 367172 175655
13619 208788 191404 480949 476780 766199 524640 196477 186262 263009 235340 19571 482756
13608 482756 218833 419200 609103 508835 357644 274268 363332 433634 442661 385753 124820
13596 577956 151335 476134 274205 265516 532735 663181 284764 339703 513762 287915
13586 287915 394949 484449 71107 280161 303782 186327 415383 -6694 448284 213581
13575 389167 93198 248071 378254 414897 575893 505352 310766 615503 89510 176372
13565 176372 385742 104508 501557 416616 156645 94291 463592 154680 398119 56279
13554 225771 105101 187742 189270 351865 213612 433195 11364 68382 288366 408620
13544 408620 113722 609098 277617 462629 151784 344636 364422 146622 298905 216552
13534 216552 166034 -114315 314535 278163 261136 116495 87330 24897 530860 91768 152906
13523 152906 290070 521449 101563 281210 146035 376517 390964 442743 83078 233496
13513 233496 195125 118408 254637 307623 212452 324457 689759 256409 161354 -51051 131557
13501 512201 235760 -13070 617962 439422 189258 510718 494796 160107 469700 208420
13490 126477 319076 404079 309062 -8287 -52435 36964 260829 273884 425661 184185 465680
13479 465680 385589 455371 -43751 382713 391046 301077 356571 169450 184914 179560 358845
13468 358845 223480 440548 -86782 197894 271809 445615 -190388 324268 86547 267906
13458 267906 12722 526309 119854 468576 231080 63824 150245 -80017 -20971 200730
13447 281786 166464 443152 214071 29855 336493 162705 280435 281029 135016 508675
13437 508675 156495 217962 98328 -49830 -30392 126441 544414 -149273 331888 1747 104094
13426 104094 386981 205528 176987 -62077 356375 363263 18906 294591 57150 222108 228210
13415 228210 -1341 578299 138952 188155 181888 -115173 129674 329059 290063 121937 16515
13403 132242 55429 377872 227862 99443 142871 118598 243705 225720 313391 -49832 -33203
13392 -33203 297695 387537 349662 156945 -169719 -44432 250658 69251 -4498 288283 311663
13381 311663 106064 257632 115195 79489 327036 -241465 16248 454574 418311 147864
13370 198400 64711 151698 -154649 -59279 155391 101415 148645 170741 -85105 199120 92118
13358 119194 305904 356241 544576 242925 69963 37212 300102 54516 179854 455496
13348 455496 226777 176264 216842 114053 -35712 397480 479388 -91620 -16628 -160860 -47340
13336 526879 219798 -304284 396034 136807 113783 470631 207261 196223 428543 100995
13325 259552 299637 34167 192279 387770 143243 17784 28417 245800 342060 162325
13314 335321 -12387 418584 76454 314943 333039 322164 63855 -342018 34850 438629 225818
13303 225818 106947 77727 36467 54091 -91380 344576 181268 268142 156515 -70945 98272
13291 -48901 437372 236865 -12586 263275 154266 150483 80812 123018 109595 -5367 176729
13279 458488 119738 14027 302904 86805 194721 209691 -34041 121444 112361 77127 -44350
13267 35326 -44092 -302661 32121 284003 -68406 140319 208918 141328 19970 -18087 -245585
13256 -245585 396534 174277 394298 100249 -85118 138152 99117 -150587 26770 450463
13246 450463 333856 451660 104780 37804 -29591 254801 204283 9411 285085 507917
13236 507917 168745 121358 279594 -12800 92501 -70017 -33422 208341 125335 152137 -163431
13224 79804 -26998 233960 312460 -33066 126197 275220 97222 191391 271191 478179 201825
13212 362012 -74259 177861 6124 124192 56050 229769 -1292 79776 68193 40849 -44558
13200 -77418 174822 -118116 236942 197168 72800 -133532 -41870 330390 255533 -110414
13189 196197 -188413 60353 73489 2361 -88346 21582 -73853 -26836 86661 -143360 223495
13177 9287 415940 92900 31986 49109 111087 -146388 -302055 -25517 318964 -180615 270120
13165 -181456 -71208 96106 228482 61962 186576 117227 247687 87495 156925 -273319 39328
13153 -191713 83589 -61845 224064 48804 12082 392761 121663 191586 -43169 273550 -44622
13141 73454 -208501 325502 107260 118739 73414 34785 -44428 -7073 -25473 -175 -107392
13130 -107392 -358813 66906 229720 -67225 76027 -100221 -56725 -74482 -26306 104428 -41081
13118 133317 108341 33047 126711 -55232 -86560 -158589 94242 -235433 122650 -32762 -248397
13107 -248397 45597 15592 212646 31379 -70357 -144883 -342258 -105567 262537 -130172
13096 121515 2130 56329 297766 -348802 -242093 164675 4406 -29563 181915 36007 -149574
13084 476511 148453 60570 51886 -327323 -193755 320850 -14814 267122 365826 -268110
13073 496630 203441 274344 -88658 220472 287420 189309 -36695 24434 -81867 278506 150946
13062 150946 160739 -27384 -1270 329101 -6941 71380 25722 -145975 115601 233560 84239
13050 79172 -194903 277132 197678 356173 23715 319554 -150443 105465 299801 -54243
13039 -154866 81719 17240 147179 -202932 139670 31998 -217593 -110791 112093 156193
13029 156193 -237537 -250112 248538 231133 68034 159660 15035 230671 -4418 85632 -27912
13017 236358 161353 103710 134856 250427 210895 94760 101162 -160056 269100 110693 -69573
13005 63635 46796 159536 60224 78978 252658 131127 -6014 56420 -411869 275719 46151
12993 499911 257373 492875 -144443 -91398 -100994 329359 143214 124908 -4518 -193213 -20127
12981 325827 -143712 -83213 -56847 232841 104933 370769 1079 80208 263049 -89341 161863
12969 -208071 59922 -48494 170264 -134766 15286 179754 25450 188389 29859 178100
12959 178100 -46969 100672 -110741 -54922 115921 198207 131175 -27007 200883 172112 41090
12947 -146241 154276 -139068 163681 -133779 38512 -35854 123628 -45667 7392 -6731 40328
12935 452057 55574 263561 -202110 -42277 514230 -42019 127596 72971 141331 -353091
12924 26358 -29742 -201302 -230877 14140 310476 61307 227080 19825 54496 211029 44648
12912 -45701 -4893 -350653 251286 -86639 -1313 203685 -60015 -264890 189500 -239769 85310
12900 45755 228095 85337 124743 -22166 -97964 -144460 33896 -59070 -53967 95166 250971
12889 250971 -90929 84735 -72214 -55877 44274 208546 -23143 -28992 17679 -10140 -95860
12878 -95860 127010 -189174 70130 141412 166830 87923 -96274 -7356 -115832 101029 62281
12867 62281 -187871 120100 48761 258689 123449 -144224 226059 78176 62781 30974
12856 364032 -13929 162224 414024 -12688 -397187 -154206 189074 -457925 -196744 -22938
12845 217379 57733 -15384 83750 164728 -33939 -127671 94246 -206216 -108110 -143743 152230
12833 -70134 100713 -98069 201843 -70808 -247755 -123197 -184431 -253343 54659 351587 245176
12822 245176 -1872 42369 168202 14114 81415 -107348 -154038 28198 166583 259138 4284
12810 -113594 -12969 189161 148286 201726 -105564 -197138 69643 -48305 30661 75752 -41719
12798 -201722 -27784 71027 167647 96270 -350920 -48683 21744 137750 -133450 181785 65554
12786 -100902 197151 -65377 -133437 -70236 -115656 -224222 -119532 76175 -78708 -476399 -23327
12774 -186258 -18198 -117190 156343 277953 105785 -173527 94604 56037 129592 -275751
12763 -130126 -25139 -12235 90481 -112853 -29275 -251113 -241175 68778 -88793 133649 38492
12751 -313288 106325 159164 -24899 -20809 -10059 -5209 -263454 5380 19112 -152658 -341287
12740 -341287 58768 74715 -38155 97660 82042 409920 181144 466506 3599 -87927 175672
12728 101163 71518 -73937 236147 280223 179031 73983 27795 -119099 -74245 175144 98570
12717 98570 231629 159796 295439 -90647 -99762 -199034 16232 42378 -122553 99932 -77502
12705 478464 294251 -39924 149731 243815 255950 875 148518 352120 102791 356235 77410
12693 -27193 39163 486287 206857 50626 94799 109995 -86922 -168820 25926 203689 -237172
12681 377817 94551 105576 376545 241354 -103644 -87265 214895 -207702 47566 105351
12671 105351 98117 101084 -64690 42055 90243 125133 -85971 -160491 1005 68663 75792 111075
12659 111075 98234 34654 23571 -179206 -104035 147161 -142466 57748 139990 107922 71077
12648 71077 275439 30000 -11217 -77290 -475634 -39535 -18594 126742 -27835 38325 56868
12637 56868 71294 306848 -80678 -168438 397813 54194 113955 -145659 78761 36381 341345
12626 341345 67341 -37226 112887 244631 196756 295432 80572 -163320 -59482 -33213 -367849
12615 -367849 317217 -14718 -50668 235701 44423 44982 229254 46618 225168 -12337 63525
12603 -23146 226937 17732 200194 -173553 624402 -92524 -10337 189234 180497 221645 -283528
12591 168526 36003 193997 168978 -327400 -46913 -126721 76220 250991 -134521 -99149 78973
12579 93206 153756 194128 202529 285598 119979 -136458 49501 -87736 92355 58141 -21012
12567 -341606 48644 200344 500315 -65171 137253 59099 131849 7141 262603 -73265 -166807
12556 -166807 118163 325270 46927 266298 66439 -143319 21676 -13145 -155423 127015
12545 16942 313919 171804 207786 136301 -137204 -73196 110349 -77899 -17860 -133567 -146047
12534 -146047 -55158 -129533 174831 -135037 488210 20325 7758 -18885 -52719 -75815 78996
12522 80704 220761 126585 -179777 -9438 -147277 117442 -16492 -316215 -239736 10115 -435290
12510 15232 73969 77484 41271 112428 3098 -52498 180003 -91222 -235490 -40551 101107
12498 -210715 8793 286844 159879 103423 -164087 311414 -237353 104439 224360 -219951
12487 -54491 -59559 -120279 -147429 -165383 -324511 56194 212028 -53093 209586 34751 227873
12476 227873 38182 56069 135427 260133 45293 234389 157072 -38656 57710 -139943 373464
12464 -126017 -63666 204540 52269 -12715 -106289 236563 151225 -79430 172 76949 -133557
12452 -114217 -139513 3066 -68801 -64915 -30626 -143187 -67073 -331228 -78764 127744 -86589
12440 287865 3045 -421429 -117087 -11084 156482 180757 -11685 6860 149604 -269430 -212777
12429 -212777 270633 226262 -24332 223111 -65334 -276517 190059 57449 -62689 178799
12418 -28724 -25731 39461 139829 184170 -29024 211479 -133444 206011 119966 -91652 -43035
12406 9311 -254554 420789 161919 291947 81608 21467 -32297 -153343 40205 165546 70790
12394 -122945 -466606 -27140 -16201 138379 -5277 -56087 181586 -224614 153958 -506279
12383 -93542 -208728 91090 168524 51307 25507 -67889 47217 -32638 223278 -134482 -89823
12372 -89823 116176 -14471 -239667 -88121 92440 -33862 160363 271947 -216751 -443268
12362 -443268 37965 80678 36352 -16663 -515102 25099 -177371 -282687 85132 34981 -277923
12350 156200 13486 -337538 -97088 81195 29638 207358 -139078 383040 -232322 -229147 -56248
12338 52791 160455 -220090 -340404 224625 -211069 50080 -5661 75929 149222 -148247 57396
12326 -63881 -42667 -93912 29595 -123554 -207611 69193 257439 52021 -6585 404781 41086
12314 74789 65072 14390 -205009 -122434 -37869 -217986 -5854 139419 182864 -30082 -58364
12303 -58364 9541 -31761 -24440 50714 -308974 143346 -11735 -238887 -52112 206163 133066
12292 133066 -119945 -61643 -287755 363213 -123641 7296 -313900 242088 -8451 123493
12281 -57854 221961 -54750 223139 -270476 342294 277218 210076 196019 92084 177635 378131
12270 378131 -46251 287951 107793 165710 121517 134181 232382 -84519 211251 244201 288943
12259 288943 -36871 347543 365909 77857 -10075 91333 -97557 237728 -110968 80683 369037
12248 369037 -28325 277454 239991 -3148 -133420 -200142 177888 98901 304434 322548 -163781
12236 206367 -43438 123343 86158 158990 28342 217815 188272 -175253 301329 -29140 -79638
12225 -79638 6092 -155604 189340 225947 87075 122175 17406 27980 221544 -141849 355749
12213 156523 156574 485023 433969 83610 368677 84109 19289 55184 217852 12549 238582
12202 238582 -83305 -228589 322867 276983 -137368 151637 18816 144593 106970 -203438
12191 247541 369746 -107767 82426 -147 -182 -200681 273251 51953 204447 113202 -108770
12179 297101 12295 472194 -90910 -141710 303867 72209 108808 -104750 221217 137581 -103722
12167 188112 22034 75591 -3323 281928 96781 -136229 165417 -153318 240056 55410 41230
12156 41230 136601 35884 -307901 -80092 -247888 13891 1242 139017 -156866 -119501 51153
12144 199338 93634 -37617 222833 -54524 -167078 140121 -56021 -13612 19294 22436 182358
12133 182358 433716 -208527 102130 268644 18289 343222 -27022 -154541 -219154 -175972
12123 -175972 108199 25018 -140319 22379 -264034 -224639 206433 -65776 -139705 -128305 356438
12111 95417 159048 63702 62878 -212366 -28070 -189787 180758 140203 -369573 -6616 -170346
12100 -170346 127441 -30840 -281270 -42633 14234 -65876 59945 138794 98941 181585 -193158
12088 35193 -45196 -89026 123911 -122020 22947 80060 -100375 13136 402867 -159442 -61730
12076 12295 137466 55445 477148 1302847 1194759 703543 275432 141387 98130 -124061
12065 95783 -194802 86591 243892 -24756 -331878 58866 -79390 -24212 -232380 -134175 40239
12053 -122159 166317 34027 -126800 -413766 88371 -125817 201568 280926 -141629 242733
12042 143418 16377 -250490 -86147 -107323 126673 17371 110566 -50093 82062 -81779 -4290
12030 -56386 -605703 61475 35285 -155681 -66686 -25632 -16753 -143140 196091 -391492 217188
12018 45172 227757 -292031 144982 -193030 -124294 -128401 -132726 -214217 -297876 -328317 -108686
12006 -54639 100963 24739 154860 -108568 57038 -198058 -93084 -33156 135186 36453 3676
11994 -40841 160924 79740 53425 14674 -400680 241785 262975 -891 212790 -209497 252225
11982 -207293 -10164 -48560 99823 -197237 -116542 12626 160360 -183603 77059 207610 -22604
11970 15044 -173607 140874 -304408 311641 -322572 -87641 -143604 -289345 -58947 -57686 -193663
11959 -193663 -254547 -105896 -158189 -138947 -99134 234931 221840 79033 76786 576591 -70591
11947 -321459 -232134 15482 -142369 1956 -48401 -54596 395922 148005 -345043 -342725 100371
11935 86878 -238573 115364 -165340 -33820 -143259 25023 194334 107985 60426 103882 -56958
11923 -208559 276007 -112461 -215531 24006 -24867 -127901 -74932 -36897 6024 30318 -13528
11911 201485 -144508 332971 -247839 -92032 114628 84442 -158920 -214052 -16498 -82494
11901 -82494 181027 124223 -30514 251641 -227050 -48377 -214640 -214784 -114925 -158075 22366
11889 -5333 -213110 -251645 -218435 -81638 -346722 159567 -203255 -98202 29630 -278527 -160510
11878 -160510 9467 -440807 124233 76861 24690 -429359 35654 39986 204194 -69619 -72968
11867 -72968 -16925 -18370 -30287 24423 -240099 222022 -232625 171113 74663 -47523 -29059
11856 -29059 32282 60803 170036 47281 118335 46989 -114254 135069 140949 109880 195677
11845 195677 -292890 -237920 102958 328595 -304174 32617 -11568 554024 -24120 -11467
11834 59924 -22944 81123 15406 32591 -528778 126954 -158248 -514596 -23180 -155764 162859
11822 -342659 117108 29144 -16880 -267451 28433 -153543 -203934 52260 9152 -153686 84824
11810 -87173 -52039 -66537 -182694 -436114 -100728 -192690 -28202 -70530 -66563 -157867 63979
11798 53676 -124610 31595 -66460 -104038 -60628 362 -134052 -25230 -96030 -285266 70829
11786 -16359 -32597 -174387 95944 49556 -925 -26782 194255 57747 33507 36972 -164781 28922
11773 -88118 -83523 382781 167408 -69329 -111826 319764 61119 -86080 75776 165204 -221675
11761 -35994 -4593 188811 -238783 -75927 133780 -40173 -27699 -250394 337916 -72525 -213218
11750 -213218 77946 78987 64716 202243 160208 -66554 -106719 165285 -91578 -264437 -589958
11739 -589958 -62834 192514 -147871 51127 -84204 40039 2316 -310058 82076 188777 91146
11727 -183955 -125333 105672 -42961 -332716 -392705 52456 108356 18640 -389601 -281453 208582
11715 -134789 590775 61491 520106 519104 -4312 455834 358309 160081 14597 239942 275873
11704 275873 229691 167965 103646 -47071 -45608 -128278 131610 27834 16178 136122 -151407
11692 -129746 74738 -166788 -63185 293359 -88296 64095 258319 -406233 -9464 193643 -200832
11680 137155 -216050 191431 388212 270165 -143470 108067 -140508 12571 -128660 83270
11669 58910 293668 37287 174152 -64032 -149856 125034 178034 183336 97272 -181728 92815
11657 102986 417272 420855 197239 -111612 25046 135140 315498 110116 120623 38407
11646 288193 49178 92538 152158 294855 -198114 -244734 229807 141075 -293091 13236 271583
11635 271583 -142391 250893 -94983 149810 111622 -232443 301864 118775 -57280 421290
11624 174812 32964 25979 -22476 -6522 15446 -39054 110467 52960 85913 53791 -224776
11612 76466 138946 -252072 370020 32494 -122777 111123 -9600 -58867 15701 302407 73392
11600 63052 -66847 290654 -156033 -241214 -162856 516274 304122 -160129 14692 119027
11590 119027 327217 133001 267018 64279 -44844 283925 49625 -23776 -119446 7058 83907
11579 83907 259118 22171 236797 27110 -317375 -80158 119680 -5305 -3373 -119630 438419
11567 22204 54722 -96024 258664 -273012 124743 25820 392773 -115741 75435 228256
11557 228256 101809 -20232 21451 -150984 80827 172431 -7581 107052 109561 -8637 -39884
11546 -39884 94300 -37244 304109 -5359 8440 229580 139728 -167193 -38983 -6874 163740
11534 10493 100446 19650 -44065 179534 -120884 -11471 484608 163040 219891 -66141 38557
11522 166023 79506 249364 31812 59389 -112181 420689 26631 -133715 303460 -40146
11511 341872 315093 454947 232100 -288263 -50488 -64617 598713 30460 161221 302285
11501 302285 230814 -70544 346084 95624 -15832 138486 402354 161976 420641 -102072
11490 -80996 121134 -63414 -94464 66504 106026 372288 -131362 242308 274343 4031 199363
11479 199363 307001 364130 -26528 176914 196884 -15918 364921 137100 -57369 136425
11468 103449 197941 55896 174050 75741 85481 87332 277278 240238 -113883 124946 328675
11457 328675 97333 228223 124744 251582 134871 62124 -31034 104738 100507 -61594 -305169
11446 -305169 66138 52798 -9311 63035 -22790 524233 110762 207423 700296 4661 -32944
11434 220478 24898 153923 -217486 138940 220222 139170 -175766 184132 -50144 -99514
11424 -99514 168404 274988 -278721 -204866 -94498 -65410 41928 171358 -288152 -118142
11413 -163562 112931 -55842 79357 -142163 -98914 47247 59558 -149978 58001 79781 54205
11402 54205 -108279 285440 57781 103643 13151 -254221 438550 146923 100569 -95246 61031
11390 -184258 -81366 -77888 -75781 132329 -184946 -311944 -201692 41063 198537 -275444 47701
11378 29638 -188635 45148 114016 14885 97328 110093 286910 -176721 -76157 13452 22358
11367 22358 259634 -9441 54169 -94918 105658 -210262 279850 -80506 -235794 -111102 -147816
11356 -147816 -91827 -47486 16202 -93453 14731 -384260 5518 162048 298019 179895 240693
11345 240693 -226234 -139556 -101808 -3194 52099 -125330 -156574 -232870 -38406 -26977 -94728
11334 -94728 -52647 104632 -66507 39984 73248 -32275 29322 225739 -251605 -134385 -43396
11322 17264 -139439 22217 25510 161078 -160701 294974 174743 66816 -53315 252218 -207802
11310 410130 32940 73159 255581 255789 -517874 -89378 -212620 361864 -120840 -208055 151330
11298 -11381 59981 42388 -44060 -137753 215950 -37854 -6336 81663 -421325 107196 -375043
11286 -301001 -296386 -42160 8463 -200234 108350 275450 -217269 -234012 -142242 143349 -8241
11274 -241665 -126236 -24534 -78016 -180626 177796 253798 -333661 273762 -161977 -111505
11264 -111505 100614 -160253 12444 -128924 295299 -90443 42344 -107491 35978 -408957
11253 80576 147007 -93162 52931 9166 114620 89857 34894 64244 -155525 70209 -193203
11241 58154 -212733 -105414 -10144 -93028 -288724 156027 -243082 -148904 17713 364742
11231 364742 155429 -173510 352549 -33039 -271318 -131144 -64147 46856 -17819 -104620
11221 -104620 -198313 142 202831 92910 2908 -15317 158771 39926 -152866 69437 -44913
11209 269237 49780 -183642 134829 3690 30899 -6881 -52508 -273247 -122761 -317314 -299289
11198 -299289 -270916 68780 -23812 13916 -58618 -133036 -120633 -182855 -139357 108629 -234773
11186 -21626 -387882 -317623 -186890 -82086 214750 -11594 198984 -35448 209951 165364 -181
11174 -61331 -99152 -109412 8847 -78951 -422567 -259985 -14587 -130193 71252 -16811 -105048
11163 -105048 23150 -365212 115205 -200072 -675 -13334 -107809 378190 63918 -225934 -11385
11151 290534 -166263 37746 -92238 216810 -66269 -136521 -212303 -122490 164081 -180998 -167568
11140 -167568 379356 5125 269212 -53604 -75434 102875 257110 -75563 37457 -297071 85836
11128 -155605 77558 40335 288697 -4604 186280 179603 107557 24670 -154308 116828 49609
11116 -58801 -96526 -102981 191336 183259 45619 114347 59962 -299760 -60515 194627 281500
11105 281500 144649 -70600 46092 276710 87896 159193 181951 195040 238991 117255 -205086
11093 55439 474938 -160705 233942 227188 204638 115604 -78136 14037 404194 281845 266047
11082 266047 411304 179922 285630 575550 206506 532005 313758 437401 289353 407073
11072 407073 536664 -102117 85723 235840 294149 424291 588612 620373 562652 395506
11062 395506 456919 162180 777724 395350 739166 654450 756495 703030 700023 851835
11052 851835 509582 501032 411335 188746 418943 844257 677180 857177 698542 802347
11042 802347 807983 798046 620324 670456 490124 611005 825539 573318 707506 855386
11032 855386 760386 672821 484198 867649 733305 532239 606901 687520 630784 595676 734653
11021 734653 526427 551349 522984 720418 496367 474206 618834 333505 252228 416312
11011 416312 846650 738282 736581 895430 562449 845765 616730 769294 549908 519561
11001 519561 248466 569325 372187 916205 650068 276633 707374 693980 546975 556727
10991 556727 526360 807041 953768 713281 1100873 478689 875011 998089 1112267 1346771
10981 1346771 1322562 1123408 1275052 1398012 1860119 1856584 1873459 2145049 2503139 2620929
10971 2620929 2359492 2607929 2882950 2603704 2369812 2150083 1846493 2285804 1810802
10962 1810802 1903183 1848262 2064972 1877995 2031142 2430385 2244785 1995098 1837376 1545222
10952 1545222 1516225 1030123 1030491 959676 665498 425600 270158 366449 234870 489890
10942 489890 321764 210108 392590 194610 -54078 42946 336416 -50441 188954 -58871
10931 -227403 312947 227644 373537 88266 117656 26899 54338 -106875 32576 236295 153193
10920 153193 -90882 277680 -231682 154229 -315828 -297373 49012 46791 91557 22156 33420
10909 33420 194547 99973 -235793 -53262 108892 -27408 -42931 147472 -120298 -245207
10899 -245207 183956 -159904 161525 194006 -89358 4614 -52105 -31575 -364549 -27461 -151034
10888 -151034 198137 45766 416301 -145732 -76941 47828 -80788 109082 -482742 108270
10877 -140518 157460 86680 112900 286 -52409 255138 -175553 146647 -159455 -209542 169757
10865 256091 17731 -66136 -162547 240856 -178916 83227 -226752 -163094 254818 -137619
10854 178026 -335924 111815 58683 -113874 -20010 73362 83815 139901 151121 240458 53978
10842 -35004 61715 237308 -51168 -269788 105107 327796 -96518 214476 134271 -43246 -447773
10831 -447773 -611211 -362144 -153649 215267 4144 -10319 -81977 -52009 -398652 -134033
10820 -188609 -128311 -109068 66520 20799 28915 58808 -107994 -205047 -277130 -224634 -265890
10809 -265890 112908 133225 67820 -51547 70846 -83072 -73908 -155504 -491269 -67046 -36842
10798 -36842 -583732 122306 202066 -298763 -87674 -209932 -285000 189445 93310 27880 116938
10787 116938 -220216 77759 128736 23025 -192994 23284 591891 207643 135029 -467620
10776 -3347 -332365 -171200 42692 -90672 -2840 -118037 120474 205962 141418 237573 -188863
10764 -137018 -225162 -12817 -154185 -23253 -141126 -334089 73799 -447113 101209 -131264
10753 -44842 -89676 -118834 -104539 -235751 -68973 18457 77186 225930 25998 -206618 12896
10741 -78069 -64794 136477 -170528 147955 163030 -152122 -211748 50125 110186 -151122 40167
10729 14108 8523 12466 -132743 15110 1097 -146306 -11273 -284330 -171309 -98966 64 -127430
10716 -32675 -207132 313107 -168450 -104 -15684 -4234 -210832 2050 -146534 -122542 -44879
10704 -78582 -583507 -25052 -85601 118427 -153060 -208011 -297947 -13164 -37044 -71310 -37506
10693 -37506 -42996 1601 -337975 -178234 196197 -87682 98909 -298186 -244485 120458 57113
10681 -245506 -367268 -5963 -93205 53755 182131 -34794 -90380 49062 215202 94858 116495
10670 116495 20636 399573 48873 -273017 -3806 -12734 -128292 -200280 -458641 -232308 68553
10658 23167 147365 -8562 -6817 -190559 229075 -171849 -11796 -26180 31727 -42073 -314017
10647 -314017 47124 -37704 -68046 -21019 110810 -7724 -262163 -199581 -65968 -184396 -457767
10636 -457767 -198210 -17732 -55847 -234498 57284 -140784 26383 -296812 -82474 -345530
10626 -345530 -130896 -83738 -82436 214858 65541 -4728 77235 -15521 269204 -29718 132123
10614 30074 -439041 102225 53613 -90156 51203 -291199 -82600 -284412 -24450 210696 -24567
10602 103019 389704 151657 -205583 -218189 124576 78157 -162697 -216339 37662 237512
10592 237512 -108770 39515 -2313 -48954 -118007 121560 156526 271160 72242 119154 234462
10581 234462 -243800 4869 233547 -216098 229472 278079 -10311 -171517 -164200 -189369 82996
10569 -126158 -202425 -44793 -360223 -38158 174868 -10633 70708 143362 -15987 77187 -48018
10557 154082 -122293 -244177 -53390 -61404 -21303 -236700 417050 17662 251940 -390785
10546 -275532 116100 149232 -191422 -211603 132593 73736 -3837 50642 -12105 69085 -51628
10534 3191 -103680 217331 -236300 -242063 213515 -123974 -66929 -47650 -206328 -38806 229135
10522 -159713 -65790 150885 99747 134534 -71698 102904 43740 -500774 130182 16827 -65270
10510 55231 -57585 24897 -167270 116139 -322392 -195914 -346107 14087 -100605 181553
10499 -193879 91205 -17610 150426 -8060 -77859 -361494 75158 -168830 86415 -119669 137336
10487 -281834 -1878 -45554 -133687 90469 24503 -116605 44484 519488 316607 186188 88935
10475 -74208 -37082 242327 267460 158728 -41631 18000 150576 49565 62271 169016 51686
10463 19 -154450 41062 -56193 -103683 207508 163454 99711 -106104 4250 -384638 45149 -145615
10450 -119996 -239339 -81888 10095 79274 3887 -144073 -207801 -8902 -212885 68780 291855
10439 291855 -64370 54278 278927 175040 29273 54682 -145896 -79400 -48808 -195683 -41627
10427 -318792 81291 110390 98421 96189 3826 299364 -118963 -35842 164864 -140540 -454152
10416 -454152 -66220 -250211 45132 26346 -91189 -259014 416278 171034 -173408 -124937
10406 -124937 110814 -218396 155962 -21504 13787 -45829 10074 -191579 -91683 183028
10395 -271793 -63702 375832 242135 8425 97310 200361 22156 100284 -164582 31794 202171
10384 202171 249876 58860 59685 -221485 64477 287633 192634 242937 -19662 21935 416710
10373 416710 16652 135846 302201 344892 148083 40030 412176 503719 279737 611452
10363 611452 395380 24048 112958 470639 544276 -158451 312580 457403 212916 490205
10353 490205 292794 566770 633980 578546 741195 351699 346413 417428 199361 440656
10343 440656 439782 616624 204297 273698 22510 66376 546492 165907 -39618 151819 77727
10332 77727 -18387 -68967 115049 192344 -142312 154406 112726 153455 -46474 134780 310672
10321 310672 160017 110872 117041 -13952 98474 7591 283943 115515 203662 5140 88031
10310 88031 390054 1850 264231 -124890 -116423 -124412 -206113 -96006 174914 -126248 -106216
10299 -106216 -158766 -86425 -411814 -11452 -290937 240861 91221 -32742 342829 55564 -146363
10287 -180110 34546 -204842 -12374 -41555 -49397 -16103 -123059 -101773 -195876 -35526 -207906
10276 -207906 226862 239423 37094 -186292 -127361 285234 -88790 -55295 385052 -88148 1356
10264 190997 -200862 156119 177055 312218 161437 165335 364354 750160 358549 340969
10254 340969 342412 339235 35768 104363 60927 -23559 -379691 -199338 -102030 18127 -83948
10242 -14108 -125067 -675916 -38140 10303 -163977 -89709 -340019 -112359 -45160 -231790
10232 -231790 -137942 -1218 -64874 -159418 58250 125405 48134 159518 128142 -126635 62347
10220 -111522 -95805 79183 -352145 75864 -4066 43729 144527 -120315 88104 -135324 -61952
10208 -157453 29467 -167105 272634 -218044 160146 -167842 -105268 -261979 26943 10755
10197 -200892 33807 9700 -186307 -77911 -25760 -40274 108652 -29490 -135751 -199539 236048
10185 -251002 -112751 282082 267307 -33829 262616 -142565 358515 42853 -438232 -49886
10174 -37669 232095 -369089 -180165 -129829 -97854 -325749 -73636 -85714 -189411 210811
10163 169348 -210029 -172486 17361 138837 137320 73831 128993 39117 -183478 -289432 -184253
10152 -184253 142129 64335 -133999 95054 -273939 -368185 39710 125590 -295218 52274 -39963
10140 -579413 -43062 -158162 154994 42204 -223788 -6530 43920 187847 278655 -199856 95074
10128 -197516 -305404 193298 -252602 -284035 -126580 20302 -123138 -320986 181368 -254271
10117 -224030 -49956 -120286 -164512 143364 -415895 -32226 -217800 -232886 88611 -202948 -349032
10106 -349032 116964 -246583 87704 16151 -342222 6658 -225090 -123623 -15813 76687 120879
10095 120879 -244302 -59368 -175138 -133233 -332786 -75588 -316336 44729 179511 -204693
10084 -35503 -375400 -90952 78039 -112933 -64854 -241027 -25162 -10751 -117711 -122827 46649
10072 29788 -109893 -368890 -89995 -167955 57281 44088 95937 -180276 -68703 144887 -218150
10060 -85356 -18116 235115 -350347 246004 104838 -300100 97560 -158715 -170941 10503
10049 161641 -54287 -409097 154470 -51388 -160889 120019 14574 95940 -39540 49642 -161643
10037 140202 395356 -22888 121617 -406112 -260397 -345615 155321 126880 -264286 -147660
10027 -147660 -356293 165048 136933 -396095 -332483 55068 -120701 170698 -137521 -312869
10017 -312869 -335059 -141166 -27242 15337 -79100 -141981 20740 74840 58117 -337473 -60020
10005 -245913 3625 -94789 142818 -69450 273307 -50744 246979 230185 43470 -301740 -374858
9994 -374858 -100314 124817 -113975 15485 -117000 -404431 -307193 -73337 -13982 -279069
9984 -279069 49776 -511173 -260894 -67701 -10859 38490 -459565 -166487 -141463 -61028 174974
9972 -192981 -90026 -375881 -49697 -28737 -126080 55133 -289857 68908 -108744 -28310 239064
9960 -174882 118019 125410 -91879 -205731 -40903 220855 180602 -83041 -643330 -74806 -8131
9948 -125593 -333759 15550 -130325 -367958 -386705 11057 -13419 9265 149210 -130247 -397849
9937 -397849 28932 -171115 52541 -207972 196812 -115852 -321345 -6770 -399776 26186 183069
9926 183069 -58492 164475 -46793 211185 307995 -69577 -39297 -338316 -169245 78192 8286
9914 291981 38434 -179317 33489 25195 29442 127674 -6995 172065 -343706 -522199 -162161
9902 -259804 80736 85654 -184714 102372 -294574 -64602 -105889 -295371 -231992 -134907 -82891
9891 -82891 147678 -575904 -299326 86152 -217003 44020 6322 -109445 147268 133370 -338437
9879 -63021 -79801 -15283 -504851 19862 -18400 -257065 -68486 -259596 -407066 -84710 -215568
9868 -215568 121514 -160243 -160744 -219253 -327034 320152 -180972 110008 -127690 -118431 -335220
9857 -335220 -57192 -26083 -375097 -159038 -123149 -39045 -353045 -46519 30135 14593 -105846
9845 14772 -487582 89982 -15564 212051 232466 -147034 98951 -6447 -25807 -46641 10217
9833 -2250 -42709 264441 51920 -272178 -542689 89982 5008 26965 112667 -93721 -184091 46813
9820 -282599 -149077 107624 -181122 118585 -89055 -8335 -181836 -13628 -47895 220831 -235957
9808 16966 -196255 50038 -348346 -39760 -345418 -216832 30401 35036 252781 -66455 66916
9796 -204231 -117453 -74095 -83372 -138111 86304 -160676 232650 -219079 -60962 72653 -62863
9784 99632 -218928 -324773 -293774 42235 -317170 -283982 -514778 -11654 -27713 -191183 4573
9772 -150033 -267588 -145121 7262 39132 -225640 -24562 -20169 101349 -184152 -273899 25522
9760 -431281 -4600 -209402 -130744 -300421 82044 51441 146037 -159698 -37638 -338334 226185
9748 -124351 -53960 -271722 -244367 -271874 277439 -36954 38857 -19861 -42649 160480 75513
9736 -143623 -166301 -157749 20387 217162 -267030 159259 34292 -248786 -102754 257148 -235498
9724 -196517 -276592 -292582 -14997 120919 -279413 -220048 -88335 -82582 -38505 22522 221788
9713 221788 144303 -234726 163944 -446387 -36059 -280075 166236 -481701 -113279 -43151
9702 -91718 -386200 -159840 -163458 -49975 -194770 -206459 -14946 67720 -23232 -108167 -138827
9691 -138827 -29746 47885 -354242 -113895 -108959 144310 85667 496436 -152042 -135381 -12595
9679 -123625 238348 -251514 59366 -411691 139338 -62071 55021 232021 -427379 156381
9668 -335910 -307182 -116601 -234840 -157281 -247237 -252269 -138525 -75129 -84498 2865 -86905 -127666
9656 -127666 143839 -298987 20743 152984 -183798 108583 -54734 -44599 -206278 230726
9645 -297139 -221769 -71195 -193813 -128514 69413 -103559 17378 -392015 -152126 56005 254881
9634 254881 -94367 -66 -98873 -17874 -43786 -78409 -13455 -53761 -45519 93406 -437747 -204247
9621 -150889 -149731 251576 -100942 12337 -31063 150719 -251367 -248029 43637 -88262 -82295
9610 -82295 400363 94195 126140 235917 27745 -134999 -106706 -331477 -123649 82424 37997
9598 -190668 -211731 102600 95925 186877 -126666 46336 -14317 -114405 208603 -32767 40800
9586 -218378 -163253 37616 152328 -128207 6281 -244234 -163431 -50158 -68576 -170323 142438
9574 -96632 13880 -480090 39638 -187122 25360 -39224 -220723 -271782 -91710 315481 32161
9562 35163 -201600 -87753 409453 -64725 -245816 -31049 122302 150210 88447 -94055 -327290
9551 -327290 -10268 42600 100453 28946 -242106 -102163 99502 50979 -225041 262242 -9033
9539 -161175 -207794 157103 127682 87855 -259408 212152 82728 -87903 55209 -212733 -89107
9527 -163042 -502686 -54669 -346962 111279 -51365 61218 180777 -85148 -86206 119454 -255479
9515 213970 98217 -23954 236683 199294 31790 51113 23544 -281685 -171563 -139164 -18185
9503 -49607 111706 -182637 122185 -199312 -17280 -101954 -156172 -173075 -49198 -361257 79435
9491 126661 150542 211659 49114 96686 -251512 -22355 -181824 106408 89351 -80082 -121111
9480 -121111 -104143 132821 223123 71962 -336251 45876 -499510 227369 -268896 -474877
9470 -474877 63473 -175323 -334500 -38588 140440 54068 264671 259438 -288940 140670 181345
9459 181345 -230296 -30199 66820 157576 -47456 406109 -223950 184929 -121301 -297020
9449 -297020 -47895 -310877 -84083 24686 88883 -43100 -388503 62627 -165933 222649 85777
9437 -146048 -249954 180542 -147017 -47485 -21711 -30901 -205716 -57546 56407 -168744 -29669
9425 10412 -57370 -95162 -65108 18727 83838 15288 -181409 -314142 -5789 -130589 99106
9413 74275 -14113 90830 132682 -29850 14656 215571 -341878 -188436 -419987 144138 -3229
9401 -288150 28780 -159198 43243 -10908 70978 -14200 -91118 -55932 -243303 -334354 195522
9389 -55681 -315676 -195614 -8895 -125849 354930 69821 27580 -29153 248046 6995 -175897
9377 -94069 -101895 56362 -2716 232881 -185420 -201227 -182641 -154968 -107769 13392 47661 -138357
9364 -272466 -79828 12000 213007 -378971 -323974 -57559 -195842 -130872 -36512 -37812 -163226
9353 -163226 -157197 31688 -132410 391975 -121651 -67545 -80190 -86219 15427 186378 -77739
9341 -244188 -422384 -228830 -148467 -240868 -243603 -99068 8129 -164215 83349 56204 -37433
9329 -166547 -71327 -34867 -106307 73101 -216793 58356 -144007 97219 113901 97525 -452940
9317 -235821 8228 -137128 162346 -372296 154711 74872 35553 11575 -64267 -313929 28873
9305 -187915 150039 -173735 102138 -289493 -13287 -94034 -189 -78510 -101943 35985 -37714
9293 -135079 -1370 219334 -161529 95125 -283234 -16516 5119 -57097 -10126 -74094 17473
9281 -37566 -186825 -401512 -192128 -64048 261212 -189443 57096 -92134 249168 -53069 -23736
9269 140733 -248008 -132211 -9040 -150996 -173221 293621 -32014 341751 130173 -74819 158568
9257 -216409 230046 -397358 -661077 -357588 54513 397718 66134 -211406 127126 12568
9246 -168209 -126787 10369 181570 59288 -196824 -186406 -247612 -162839 191497 72401 -90561
9234 201641 -613870 207773 -302425 -168454 -123721 18667 121914 -134966 171104 -66302
9223 -109651 105601 -89836 -199698 148980 -106999 347710 -122666 4362 81250 266365
9213 266365 11077 13157 -125002 -120552 123801 -28106 -54842 -168361 -100842 -19986 -30108
9202 -30108 45338 -76072 -36503 -217179 -102690 -60237 -468243 -164233 242952 -47404 -295217
9191 -295217 -260677 -130449 8691 -188759 -384075 -199620 -304105 104853 147222 78417 -120309
9179 -162986 -72934 -116747 -84604 -166760 8188 124378 -235093 119692 -228655 80586 20877
9167 -108167 -144991 195485 32885 -11624 -315163 -114811 -6836 -234792 -44562 -124695 -132001
9156 -132001 -40460 229436 -254670 78069 -139798 -903 185136 -132587 58670 18882 115906
9145 115906 78926 -247977 -200040 -185324 -210582 -154228 -117000 56966 -41432 -160094 -238423
9134 -238423 -300895 -403749 -38281 -45003 -112092 231841 33977 51502 -219734 -51477 1572
9122 -29760 1777 -51177 -32174 -142498 -123613 -16423 149366 -94563 351727 -1704 -258212
9111 -258212 -259190 -135960 -138078 -176117 146766 -313325 99720 -122098 -34346 -366551 -84476
9099 -78513 14095 -496778 72416 25069 -101624 -245714 -35723 4772 -43874 -11750 -114757
9088 -114757 78967 -113143 121002 206 9132 134557 -381790 151670 -57710 6608 -32233
9076 31458 -80796 12160 -103863 185164 -86807 171846 -129323 -101489 -71790 90591 -81284
9064 -66163 -31198 -345601 -287779 -147447 -55112 -206216 -218235 -351482 261926 -187688 -8554
9052 -45487 -102471 -191937 -41982 -96540 -1561 -295281 -310052 -164262 -184456 -82228 65856 39893
9040 39893 -67229 -110154 -17555 -12683 341411 -105746 -352013 -28156 184726 -120943 -373693
9029 -373693 6307 -122200 -143443 -290369 233609 147235 240246 105419 -132490 123194 40564
9017 -97292 134615 -190564 -100036 171421 8280 18234 -56923 -85511 -219853 24384 149562
9006 149562 219110 -110312 4083 -109982 106327 346316 -297901 46480 1361 55254 45413
8995 45413 22779 81687 -17937 -173600 102762 -196581 126361 -12755 -145650 -129563 -305060
8984 -305060 -188562 -317377 18511 176266 203586 47661 -89347 -269637 102852 -5271 -77484
8973 -77484 -372666 -48808 17092 -291701 -174872 -117797 3912 -150440 73453 -74632 -50014
8962 -50014 -235443 240562 -112577 21623 -276089 -157594 -213903 69977 58607 -41550 -33087
8951 -33087 -10944 -34621 84413 -143251 197196 -99414 -504257 -201687 -483680 -20054 -127921
8940 -127921 -193143 -76827 137672 -90720 -12388 339193 245293 63391 -32203 392940 -97073
8928 130228 279906 41274 27329 30367 472653 1597196 4992496 10741948 4003092 1605234
8917 643342 431405 604213 395703 15470 -10257 -278601 129114 -54166 172888 297363
8907 297363 -283600 24956 73495 306508 48526 -93653 -199052 -207896 -108440 -118675 166236
8895 -335971 -98907 70565 -245651 105898 367489 -280409 -236037 -20925 -93587 466097 -38672
8883 -162649 -261744 206038 -225814 46367 -177584 -978 -131241 361869 3944 130984 -167949
8871 129029 -39314 241305 -25253 -395193 -4104 45618 159137 39404 -56237 86154 -64747
8859 354254 18342 -49986 -14703 -140217 88320 36602 3994 -60306 -56897 184887 -273481
8847 -297294 -232150 -56090 196670 -72875 9726 65977 -121943 -252207 61683 -277336 -60140
8835 -263088 -158119 164530 69065 3369 -153676 -105348 4610 -108627 -95208 182081 -20715
8823 -66038 -187201 75051 16810 -91011 -104274 44187 8409 -274211 -282797 45053 95471 -234116
8810 -169852 -35529 -13778 46120 -240570 -108529 -196901 -215443 304600 -123600 12136 -193125
8798 203847 -96703 121903 143863 6818 -127823 -164616 66683 -100436 35418 -85323 151303
8786 90583 -89988 84789 530211 -144490 -243366 179561 -297216 351326 88376 -160130 196734
8774 -130812 -209175 124745 -86170 106850 -174506 -347222 123729 -10830 -254758 -58515
8763 128860 -179406 -130780 -290183 29735 -191654 -191691 -75973 -40478 -177913 -4949 72229 -36022
8750 -155631 -125156 -59095 -95498 -180281 72722 118022 -82107 -219332 -169712 -70169 156954
8738 -78645 -268601 -395563 -173948 -239660 9544 209551 142369 -303999 24095 -100895 -263206
8727 -263206 340539 -123198 -268754 2998 36031 -193867 180637 31045 -227502 54793 14735
8715 126525 -194710 -319136 -48321 -163330 -212876 -97835 -45065 102111 -2270 -11297 379372
8703 -105890 143573 -286185 -287934 -195682 -129772 -28948 106368 -205360 44186 -111599 146060
8691 184084 204369 -362453 126502 -68038 -54894 -135974 -202447 309480 -35361 17517 -2606
8679 46174 84052 -49221 -71527 106984 -21823 89051 286069 -47817 248557 -171028 -117410
8668 -117410 -359527 -81970 32863 121465 -117245 -26908 -310941 245042 -268841 230878
8657 44610 213715 -170612 -283701 -237649 -532747 -147016 12285 -155376 93346 -58071 256628
8645 149148 -171008 -134824 -78384 49303 -201360 -226235 383976 105984 -122686 -164640 -288482
8634 -288482 -93318 80310 -163327 25031 -195463 -70221 -56827 282958 -192484 -153190 -108490
8623 -108490 -45750 61920 -390557 16788 -478629 120899 194055 -120003 -299091 -166422
8613 -166422 -126455 147059 -27899 185632 -213461 -46084 -3174 43451 62167 -162013 144911
8601 -207399 -238429 -252497 -264254 -106409 -24678 26090 245813 -390135 -126576 -309374 1653
8589 -51796 -177205 204871 14821 -388413 247535 -374800 -108105 -7954 47985 128393 131980
8578 131980 11671 60841 -317993 -38414 259773 -112257 -33103 87443 25508 -61876 185475
8566 198934 178734 188787 -412045 18913 45421 338999 46229 152964 -69592 -86044 -26250
8554 -100858 -1518 77436 291517 140674 206901 117811 -107261 -285209 -403384 162971 -170238
8542 -32177 -237028 -37294 -249652 17262 -46100 -159693 42107 -76336 111642 95065 -104466
8530 -28202 -125788 -253341 45477 -338010 -127432 -148898 -180636 241829 -85928 -259050 -11004
8518 122279 -184276 10667 22395 -33811 -144042 -108168 -57797 218770 -101173 -73512 9730
8506 -9555 -172664 -154249 -116815 21981 -46924 -243365 43409 -177436 258141 -127255 -175532
8495 -175532 -53535 36791 107947 -229539 -148701 231862 -80452 -145015 -148084 -102592 -359613
8484 -359613 -142941 -66106 -18672 59410 -118763 106887 -67892 53655 -376642 -492345 -129404
8472 109604 -139794 60782 -198265 -223159 51345 -204741 242158 43708 159763 -52332 -145825
8461 -145825 10425 95957 183120 -66096 -19710 122595 9936 -7127 -174021 148840 148247 -52330
8448 -127369 -251505 -76969 491474 -53044 -103377 -219115 74955 3032 63858 -178887 -49542
8436 194079 -251748 -202841 -17441 -9083 -44389 232582 -59144 -277730 -127927 17441 -175447
8424 544 78193 -104963 -181288 -8041 -285100 34415 -52573 -83426 104187 -68857 -172907 -123632
8412 -123632 113121 79609 -214664 -40350 -66303 -240019 20498 -329120 -36998 -7927 -141101
8401 -141101 80019 48696 -283139 -169228 -37869 -32794 210399 -60557 -159732 -329717 135751
8389 56283 -151539 -95978 -202806 -333042 6266 -54745 88893 -32497 -4338 302451 -197994
8377 -310491 -28489 185980 -29119 -70483 -67511 -155209 180300 -225381 -124850 109094 8287
8365 -186029 -56317 95658 255644 -450360 -332030 -131951 -189711 -399158 -102282 24436
8354 231055 -16947 -230493 5145 -132313 98922 -2654 -62753 112624 -70350 -119830 -233860
8343 -233860 133164 -68742 -127477 -52933 -81985 30562 151302 226444 -251533 -155557 -34726
8331 -286082 120053 -81222 83552 -7414 5994 -187174 211085 303131 149886 -348459 54828
8319 -349175 -380697 -133746 -5282 42533 178488 -47515 367049 29721 -315708 -42201 85682
8307 -49299 26430 -250245 207866 41718 79355 -156849 -209487 -155604 -212119 -109726 17879
8295 -95987 -143694 310043 63233 -147017 -91844 123180 -230884 116479 -49255 -249589 -63058
8283 -304489 -155682 99329 -34552 -8149 -52699 13193 55815 75830 -110708 1110 41504 47948
8271 47948 57710 -95276 296582 -156785 100279 -81596 -364574 -254918 242480 -5570 219805
8259 77692 11846 224606 46266 -100390 -171109 107423 -416170 -251043 223228 -91189 109497
8247 -184743 -33841 -204597 -253472 -240604 88188 206294 40814 58288 20489 117453 -323573
8235 197846 -313051 -54241 -221120 131765 238689 -100620 -11673 -46003 -51116 -95781 117295
8223 -210656 -51452 227367 -42799 -113060 244402 -7941 -49572 253018 -256843 79262 119014
8212 119014 42265 -237223 282634 -183911 117179 238915 -49341 16128 65958 -325416
8201 -9649 -127816 -298671 83518 -132094 -161687 59733 -303914 96694 -418518 -200533 168906
8189 -86701 -28084 -185019 1555 -316576 -35223 -30381 126895 11301 -63813 -252670 276966
8177 76646 30561 -254858 41327 247565 -164184 56273 -103016 -27838 -91851 -47296 -22470
8165 71847 -254458 54580 -74181 26712 145333 203986 -20802 -126143 -150719 -11845 -73935
8154 -73935 -71234 -168479 135551 -123399 -327142 -23236 60753 -76992 22483 52080 87263
8143 87263 -130640 -43605 -139091 297628 147634 -142049 -130709 48580 144096 -101859 149536
8131 19269 2596 -318142 212498 142624 -226459 -56138 3576 -10633 37856 -126734 -293338
8120 -293338 -263044 -114901 114663 -455125 73013 -86388 -248495 -375770 -30054 -6890 -26672
8109 -26672 131759 -257602 -381301 194200 -95097 16728 -36563 -209730 52169 -124774 -128003
8098 -128003 -19827 135334 41019 95918 -140552 183616 36924 225353 -112093 -141141 -280388
8087 -280388 -185101 235800 -65059 -185457 -58566 442439 36542 31664 18605 36684 -26976
8075 -256975 -51055 85875 390358 -131466 165882 383969 79052 361140 33579 204926
8065 204926 146363 -109294 259427 3064 104146 -181215 61785 -355311 -63491 -364631 65849
8053 -181161 50148 207503 113469 45492 19661 -95803 -19960 -180486 -420789 313233 159137
8042 159137 -200429 44371 19105 -157662 -50560 -32822 -137846 29243 -270029 -222622 -20286
8030 -38450 -237929 -135235 354864 -296402 -66002 -151069 23872 -21599 110156 -276111 -48540
8018 -150402 81676 12893 17349 -189694 82105 -298267 185288 -281527 128456 -215676 -62166
8006 245006 -244765 60452 358389 -249174 83693 51493 116216 47597 -176065 40442 -44663
7994 -39192 -59362 -312248 183926 -493475 -142091 -97875 20383 -255168 319534 -389441
7983 24156 -18859 41204 -136038 -176983 -107626 -307539 245244 38817 -205299 135163 72163
7972 72163 59664 44069 -78489 122139 183171 67643 -24293 -91077 49148 -53749 130699
7960 155279 80364 -297425 137150 286509 -268108 156083 156807 -75 -133543 -72902 -84138
7949 -84138 -66867 -252203 -207983 -255110 246037 -94755 -407139 147965 317649 -97714 -286931
7938 -286931 6808 -343912 137867 -350715 -158015 -417591 -72292 -550832 -35024 -312698
7928 -312698 -63612 -265512 145403 132686 92219 -52595 -53922 -202883 -60969 -299539 -71139
7916 -58456 48488 311553 -333730 -61781 298054 57666 23310 9450 205189 75065 232497
7905 232497 -87927 -289576 -60185 -65024 -20469 -140535 119106 207491 -152390 -60625 -240488
7894 -240488 161926 82142 -187491 53288 112589 124781 70476 96026 -80126 -75818 27022
7882 128381 71455 113625 116887 22523 -39850 131461 -194877 -162308 5008 -257238 67291
7870 148496 141625 -303763 325969 39723 -146929 39052 -33193 138191 144825 245563 -285419
7858 37432 -123291 -76552 101759 -57627 98355 -204814 86080 -117883 -71713 -41621 -144212
7847 -144212 -72162 -14434 -453973 -152701 -46670 -80903 -111559 -105934 96250 -138297 380376
7835 62168 156270 -332227 -39278 -328144 -103775 -301924 -327902 138977 195107 -97286 -413177
7824 -413177 18276 221604 -139282 25372 -312022 135872 -208421 -158035 10402 -40627 -128865
7813 -128865 -11773 -294292 20354 -157711 23073 -80350 -37271 120390 279374 402814 298038
7802 298038 82749 -309608 -117293 22866 133641 -211643 -138826 -126573 119745 -57735 -69005
7791 -69005 -76721 97797 -172487 109559 92088 -81530 59988 82639 -5270 141724 -168517
7779 166566 165282 -80008 193614 197175 155094 56486 -86575 165611 -146908 -166687 -93760
7768 -93760 -338126 -183481 -248993 312792 127927 -185804 -358207 27851 -154832 -267307
7758 -267307 -206177 245484 414405 -124205 202238 -104505 126152 -37883 -253293 -97243
7747 -89453 172815 -227529 -179067 -66269 159718 -143838 -146619 -277841 -54038 -32400 -534074
7736 -534074 51662 -91570 -92483 -29207 -42154 56454 198040 -49745 395402 -124966 -191573
7725 -191573 83664 -46363 -141973 -131516 -49392 99492 -143309 -424596 93753 -38253 -283296
7714 -283296 57930 -24321 196036 -85417 -134802 -96212 -213493 -206855 -95313 248365 186614
7703 186614 152866 195098 39432 -175220 146756 -165462 -149966 -217191 -61239 -152881 -13461
7691 -105464 105255 -311548 -171836 87634 -307992 64091 -331469 -303569 392760 29794
7680 -191689 174536 165764 -89352 105704 -179260 86797 128097 -171706 160173 -20037 -3562
7668 -38075 -186969 -77035 -90442 54965 77321 -61232 -143520 -22606 40269 -161660 78702
7656 4391 -91986 146813 -130504 -177169 -92446 -167881 30004 185788 -169251 22132 190903
7645 190903 -263564 188704 181298 -34810 10180 -180505 -341444 -13383 110030 -729 19968
7633 -146354 116709 239046 -8883 51515 13915 165467 -235378 -243170 307419 -238868 26793
7621 -151166 -73291 -276893 -183438 -178324 -10581 186885 -321983 -36533 -4105 -176401 -267351
7610 -267351 27964 -275757 -66515 -130145 -76666 211835 111930 -136532 137323 222405 -28152
7598 -176969 168779 -123236 280668 -112477 -25031 -74046 109601 -194945 175483 -401696
7587 57952 169148 -92573 -217869 91501 -80835 -53231 -90522 -182758 -136136 -203027 -43243
7575 -182339 12759 -266054 -269663 181587 -218782 -156801 -51235 20166 255044 193190 69705
7563 -325430 -764 128907 -391754 -268098 -243750 -124137 -87329 209685 -418339 172664 -354850
7551 190054 343402 -1881 -288697 -565547 -184984 55791 -181564 100759 51302 -409317
7540 -39759 -84600 -156427 -127237 -397855 130902 -60190 69401 141450 12318 299577 -325418
7528 -11567 45222 -212419 -185440 -121010 -56894 141064 -46046 -134976 -57278 181694 13061
7516 167581 -68025 -30563 -216429 -96816 -21413 -113421 -115396 211571 10738 189390 -103199
7504 161673 204404 144708 26591 -129305 13925 -432597 -22284 -287259 -57151 -107169 324931
7492 -40220 199873 -100560 -12897 -144755 75407 -17070 11655 112536 130908 159042 -273561
7480 172923 398989 44824 10634 -72018 -72044 -110680 15241 384428 -87712 -333796 -51534 -30528
7468 -30528 -107117 -140516 -350349 155131 -63308 287394 -22081 34484 -46292 -52398 12291
7456 -90439 -60918 22279 48967 -169399 118474 -14654 164338 73849 116379 -248231 79024
7444 66738 -159683 260472 -224444 -293657 -174112 -71229 10883 -109702 15689 -236768 -154413
7433 -154413 347684 66959 28635 13792 -136202 10071 -64435 30978 -189906 -9315 395003
7421 -317982 -30358 101956 297731 165247 -160689 -422155 84113 -131984 -18031 -84527
7411 -84527 17520 -310179 143015 -130708 -177611 -382597 -22158 -31605 -14433 -111801 -176783
7400 -176783 97215 -170235 80625 -9787 131674 198888 -22073 -13241 -344081 47803 -93271
7388 52972 34538 17750 -278247 -167249 125742 53103 -330387 338666 40917 4260 138117
7377 138117 -62281 -19176 311974 -235239 17455 -317523 -360667 17945 -159903 -73896 -146771
7366 -146771 174057 -108743 -205932 184331 248311 341256 -142695 86548 -165530 -144242 -134311
7355 -134311 -293604 337376 -305989 37521 224212 -78279 36434 -206087 80485 -2261 -2903
7344 -2903 -134178 -68962 73057 -312378 -79667 172130 -259162 131214 -188832 326592 149204
7332 201435 203059 38735 88442 68916 125231 -149175 290651 -75120 -172408 -138467 136185
7320 150247 -124158 -4437 140248 -101450 -187669 -232611 124548 -498025 254599 -147685
7309 -117195 147949 33316 200513 178040 -76872 19992 -95361 199179 45483 -15099 197723
7297 106216 -92107 64850 -154867 -122667 61385 -78446 -24157 138109 -325863 -374531 -120075
7285 386935 106950 67370 -5842 -130359 -211845 -115778 -154111 -201964 -30911 188422 -158785
7273 159880 -61136 42181 -369882 1737 -36319 84861 136579 109971 80231 309628 -14762
7261 -232907 -105343 -235354 -10965 244722 -50329 -233439 152151 -397755 252166 -73857
7250 -220369 -27036 123227 -20204 -521438 -43332 -160801 -39451 -231742 182224 28022 -32021
7238 8544 113166 26830 152369 -37615 -279301 -127441 49380 -265816 -82491 -134159 218543
7226 -230516 -30761 -94500 167328 -21923 323645 42209 -143222 -45950 138926 -132536 35150
7214 11423 75475 195477 -85096 95389 -250548 235068 -222587 -198771 -16026 67568 49794
7203 49794 -113313 -7938 204222 -58342 -289726 -190379 327279 8959 -384142 -108012 243618
7191 -269569 -183619 13318 93006 128614 103692 -133644 -85984 100488 -339678 178731 -199637
7179 340538 -67494 -176725 -155573 270916 -20060 112889 561881 -115436 -41900 341900
7168 229341 -336907 -135308 -101214 36317 -249907 -332947 63016 26577 -96355 1225 226719
7157 226719 174875 94113 -205490 -56173 -109691 93361 -71693 165145 57272 88492 428230
7146 428230 61136 64090 -115844 -11855 46060 -237582 15298 -218473 -506775 -3278 -172051
7135 -172051 -169641 -483966 3590 -360735 183192 -32075 -9578 -250966 118534 -60222 -30982
7124 -30982 -98138 275127 -183822 -215708 171885 123567 -50999 -23022 -221621 29115 -392475
7112 -221101 -11161 128885 -257145 -148392 247078 164747 -154954 -19851 -193975 -122281
7102 -122281 700 -71055 -17634 -106677 -80724 184492 113877 118636 231186 71000 180896 306418
7090 306418 169265 -33832 -182011 -29043 164931 -155418 -208104 245946 457388 277828
7080 277828 70780 -115242 155051 55139 -128088 -212788 442 110665 154245 -303768 -260130
7069 -260130 121525 -274155 411059 -136983 198182 37200 161061 16887 283466 -436866
7058 -110555 -27871 -4337 88436 -59138 -209288 -50662 -309220 5781 152715 -317521 256112
7046 6587 -141380 -158685 -120879 -11980 12460 119555 25675 168672 -298891 -218662 142134
7034 301181 109010 340735 71778 -2992 -22598 172092 209010 251665 -311222 -142704 69094
7022 -42348 125719 -111105 -46675 6249 33214 191553 -283774 35680 -134052 4627 -207366
7010 -64785 -74881 -333582 -52919 86097 -50305 -9612 -46871 49159 233129 -189237 -128701
6999 -128701 -176620 184629 -321699 -41134 -22225 -6941 -96894 206776 134470 302596 -103986
6987 134112 -259317 -151245 45491 171585 -287430 148005 -151051 -221050 16032 119190
6977 119190 10668 -330962 242264 -164050 -99067 -254932 -24747 -78815 -433539 108764
6966 -122791 -81270 -201275 -119689 78485 -134830 -503902 87530 -106322 -42081 62401 -376308
6954 47541 -122723 -158647 218886 20227 124554 8172 -23479 79476 -81696 68599 -5747 146171
6941 -74382 -163777 -105349 -90523 -587 -226031 15772 -10876 331357 -42034 60399 -236981 -344666
6929 -344666 44142 -287834 -22841 -78600 3529 101216 -268421 111105 118455 75700 5890 168316
6917 168316 130653 309156 62559 256669 99293 174387 -283164 -184891 -267255 118656 -203091
6905 -207329 -280359 -170131 200738 -55644 -15595 108483 -118539 -27910 -246815 -50537 -64720
6894 -64720 -117058 -342680 262908 109797 -119035 231764 -128610 -90407 -77312 -136588 -372391
6883 -372391 -67733 -302175 210222 -44449 34146 -38258 65355 50937 -121783 67175 -158594
6871 -42142 -147406 -17034 -103258 -19351 -130700 -223759 -10062 254187 56842 166308 190087
6860 190087 -377675 307104 -37335 95137 107594 132679 195053 -426589 -27692 96882 167432
6849 167432 -113893 -33103 -191735 -172972 -250548 -85646 86849 -87219 52567 -85578 74079
6837 -93224 38719 -137404 40425 -33251 -297876 110317 20433 -50684 -148920 -164488 2500
6825 -46232 -39414 -271116 -190222 113873 35456 -307817 89442 23126 185914 -7577 171579
6813 191357 190689 47608 162435 445377 2625 69459 17353 -201638 89024 68993 -129712
6801 -131539 -320364 371928 -12859 -85411 -257490 -48031 -5239 -68871 -114937 -106662 -499763
6790 -499763 -111183 -131403 -122172 35899 61417 -89023 166269 -82487 157635 -323364 124453
6778 -61962 64628 -239411 100454 -122025 -203352 -186249 -285482 6303 -140150 166822 -41758
6766 -35831 -80360 13809 164257 -97010 -194582 -334591 382351 -124768 106149 -96876 -28491
6754 157800 -347673 165439 -180804 158696 -131998 -167928 3684 -95609 29649 -31872 -195952
6743 -195952 10641 -74541 134487 24687 -128217 -156691 -383945 -53231 -46282 -48183 -145999
6732 -145999 24471 -58731 154191 279499 179779 -117463 -280133 426328 196480 -36822
6721 -54705 98835 143040 -266187 -98050 -363231 -117216 321861 17489 -320014 142464 -252670
6709 -291151 235886 -116183 78120 -72186 -4280 288256 -27485 56668 80393 -71020 -120128
6698 -120128 -90147 312110 172770 -522249 -32817 -8724 -86426 66723 120058 63976 253482
6687 253482 155795 -307800 -159803 167852 -85509 -71678 55112 -115632 -31778 -272463 -49442
6675 -81479 62124 -199107 -172485 108344 -53508 -43974 -169218 -229010 -376426 -175446 -387984
6664 -387984 -49724 201113 265125 418005 -361359 99404 -37810 -35047 68729 -23216 228522
6652 -18686 -25912 4025 -187405 86784 25962 50179 -210540 78710 201364 109091 -64765 -46574
6640 -46574 245243 62364 193518 -2106 154569 224340 146099 -13810 -341467 67190 -97472
6628 177157 146103 -208237 -26560 -138602 -69549 32705 -188754 -69218 34174 -141893 -134841
6617 -134841 -175661 369940 67817 154174 20867 -182898 162795 -164006 65762 126991 -367066
6605 -277418 8662 -240570 -39972 46087 -121470 282504 -119093 -200306 41174 232079 -66294
6593 125783 -157651 213494 14045 -167638 -49566 84889 -140322 -205371 147790 -129323
6582 -46943 -255111 -9613 -116398 -142668 190424 135962 -171301 107402 -116670 130642 -18671
6570 -55657 -123209 -44189 -41391 210719 -46974 27786 -55081 -56044 -596994 -161015 -267674 -139946
6558 -139946 130144 -544769 29907 -28597 62281 74942 -76089 -66350 102752 -96412 -18104
6546 -150928 222756 -287863 63776 402838 -66706 -217343 -249819 68136 505045 67825 208414
6535 208414 163103 253760 -15173 -104790 179774 51612 45429 -17200 37398 -233873 -151661
6524 -151661 -282077 241693 54518 76706 117793 294130 194020 -243053 9827 143921 -64151
6512 -329154 -46430 127154 166269 -1921 -67347 29449 212009 74101 22648 -260515 14864
6500 -136339 -362754 168797 -24062 -178429 -147700 57677 64048 -270778 7015 169089 170430
6489 170430 -294035 -85497 -38329 73325 -28069 189752 -74419 217557 -68928 130756 133567
6478 133567 165992 -52222 -149229 165685 281090 4664 148493 -198595 41807 164663 264498
6467 264498 -191877 49990 -269963 -34413 -262853 46524 -73084 -110460 90608 -64535 -91817
6456 -91817 -87114 -61521 72154 114552 -104574 -173297 -48975 -61783 37847 17896 -172424 -371499
6444 -371499 -72556 -29536 57824 67143 -183942 -96375 -31323 -293926 26150 -341009 78268
6432 -154514 530 -109556 -36840 -444918 19971 197258 15393 -64971 132239 138029 -10334
6420 -428904 393192 -45592 -118947 -178070 -277361 99180 29928 -226489 -71098 -90363 -78334
6409 -78334 35382 135101 86090 127565 166093 148388 -4255 275309 -23538 -162642 106915
6397 -5138 -190973 153794 62841 -214139 -56485 125213 -122116 -78700 -266309 -226711 -31370
6385 -337628 -294050 38521 -155243 246909 309638 56177 67666 17612 36146 44899 125427
6374 125427 1232 -322372 35099 527629 254283 4353 -130103 298607 -549 -65684 93578
6362 302521 241766 108125 98110 -129425 247916 -132392 -91344 -204814 -67344 92760 -376860
6350 -85644 -116151 189274 31912 -31592 -84558 317089 -101828 -171068 -381075 25545 52728
6339 52728 -52836 302615 64095 -41331 -97937 -162514 -43332 -222548 -373298 -33224 194755
6327 -7923 -259670 215692 81290 48738 -86098 247648 183481 228541 -225252 -83873 -17178
6315 -175141 -127390 238333 -341261 -203285 119459 214457 -74808 -174138 90775 13592 -66525
6303 132992 64565 -109442 203623 26766 63462 151527 88603 49519 -133965 -157313 -274503
6292 -274503 344463 -110872 -114824 156879 -186757 -317328 -114349 -147844 255135 26168
6281 -80759 45685 -76394 158230 55045 -22349 120334 145425 -85371 -42727 -266330 -200498
6270 -200498 221012 -66942 185954 -251075 -186024 1476 277094 57987 -118039 90110 70480
6259 70480 181810 249912 464412 -82664 -155809 -31521 60525 63097 -259517 4216 -71206 -130784
6247 -130784 220715 -54695 144600 102756 -37913 -80377 -268313 -27091 144900 -165473 101672
6235 81450 -181977 41471 -179377 -7247 -90182 -221810 -40277 18155 -103703 -270312 45160
6223 40099 -10920 -40783 -231047 -355107 32890 105256 65792 104322 -219357 -43663 96939
6211 -80734 122320 123942 18168 14572 -229438 184619 285138 -176698 100109 321512 -14830
6199 15499 135019 20623 -46648 -143558 116174 -161019 -19599 -133343 141567 -27653 25258
6187 -252204 226848 149616 140552 -183703 -23334 -48094 5592 -63776 -43804 76125 -72007 -185496
6175 -185496 -31463 -137950 335538 -216978 131744 64189 -34010 -129163 -28558 -123646 69300
6163 26196 -42702 -131364 -166102 266402 -4098 -274504 -137966 -203625 -91710 94241 68347
6152 68347 -116255 -162650 -20527 -95964 -325527 -192233 216411 -259153 197679 -182286
6141 -134327 71221 -229495 85009 -219006 3886 -286437 128339 -215879 -21422 -167691 -69428
6129 225840 13797 -22620 48022 -274726 -94832 126174 -55170 -97764 -116036 130302 -36881
6117 -184299 -187879 201271 78374 211822 -262241 294591 71117 -18356 17061 262835 88214
6105 -216303 -103960 101181 267805 187246 31461 -178876 -273823 169227 -49252 -110345 318730
6093 -156449 -48863 162248 -334868 269604 45656 83043 184365 168659 102566 -158877 366701
6081 -51143 -101883 84388 -402548 24613 2700 18284 430914 81920 35304 -258332 -256435 164871
6068 84281 -34125 80923 -371064 -136738 190798 -46202 250819 349501 507 -25049 -108541
6057 -108541 203486 14991 253859 80522 1813 92195 77958 -22248 -243913 57383 -171261
6045 -79600 156837 -160505 87130 190712 37589 289265 -183875 112798 101039 114702 4258
6033 -176688 -15940 -85231 -61531 -210623 -29716 -85298 295739 -149430 -30370 -156477 16965
6021 51921 -355375 -41968 -222056 33747 24516 144668 -181268 -63857 22725 -49466 132330
6009 62507 19625 25796 267987 115903 279701 -111466 187706 238775 305316 87073 -106999
5997 -215688 -452716 8496 -58251 150319 -212115 -132340 35812 -23157 55222 -174460 -26125
5985 81566 106536 26512 107252 97176 -124720 -160670 -100051 -15112 -105178 356526 -113389
5973 240249 -263654 22529 165107 21333 -104962 149436 -87696 -26517 119952 -132593
5962 153182 -64062 116146 136326 104941 -109268 -170775 -113415 -97003 90535 -9049 -182848
5951 -182848 -4873 -104550 -72952 77988 109378 -40291 138700 138576 51106 131327 -96012 -59639
5939 -59639 -78175 -145751 -105601 -58484 -8004 -19690 -36692 -189159 194489 -313930 -113502
5927 29153 -320986 334625 -60906 86718 -86738 -149678 54001 -169320 -84073 172264 229154
5916 229154 -50228 -202109 -132695 80610 -56152 46491 -262673 -534538 -223115 251688 -48077
5904 -46514 178945 -215098 309124 -144002 201991 -78691 170095 -151337 125263 -34360
5893 368258 162005 151946 -90227 -141388 -327812 -90394 18899 61994 274303 30673 240516
5882 240516 204232 -310463 154483 -215531 -249168 -165305 43876 -39536 -142113 262043 179331
5871 179331 -300440 65562 157476 214181 -7808 -73657 -120970 -301820 138250 -155292 370708
5859 40104 -29661 76202 -99210 -158493 -334545 12421 -13655 -173295 110732 240673 8055
5847 -45546 -47252 60492 108202 96560 -174321 232196 -154194 -145987 539154 33197 -102654
5835 -149319 -35193 67301 -195139 307488 -116144 179625 -89984 136735 143130 31500 114457
5824 114457 -4403 148416 302771 259943 110147 -143907 -338359 206697 -135724 -49848
5813 21198 356950 -95361 -101852 8369 249845 -227810 281207 95940 -60643 -133833 -279296
5802 -279296 47662 -104355 -170019 -82476 48466 404059 8669 22198 -20185 105466 58079
5791 58079 -35304 -231348 189021 268803 377049 27708 35355 84389 60038 -58693 362584
5779 -14221 -289774 -81475 -156834 -1684 180995 40670 -274781 75158 97088 474567 165026
5767 72888 384284 -407842 23699 288914 -127995 -242449 -44163 291067 -12607 10060 266666
5756 266666 202400 -101745 64439 -177030 182295 118375 -230874 -129076 -60828 124823
5745 -102974 -284436 1064 -21186 -77384 -72897 121170 -39107 122798 121338 -114076 -123523 -5010
5732 115886 -414142 87533 -101719 145049 -50411 188640 253952 174410 210821 77929 -155191
5720 17010 -105744 2464 329706 -151551 -897 -260619 97946 -53159 -119522 -31937 -57866 69070
5707 152254 -409154 -249662 11153 163277 117735 -240679 294741 -149960 -129625 147752
5696 -101063 74803 137184 -29069 27709 338267 -45581 -137382 -66134 -403373 64451 151451
5685 151451 -139442 -380513 -32601 20722 -165495 -192962 -52560 143665 25358 -261711 222358
5673 224208 24253 -111840 -120426 71305 215378 -192991 -21368 308566 171394 164699 -218975
5661 17463 54661 67537 -300260 -520744 80575 -58400 -110108 -132225 280391 -139607 74361
5649 -25090 138028 -132918 214168 128377 -32677 -141170 58149 147273 94708 -196363 -286493
5638 -286493 -8759 -3235 65308 134869 198567 -197536 29600 27349 53268 -326566 8439 81054
5626 81054 2539 -311120 151459 -78864 -15530 62109 140901 10870 17698 -110437 -196174 -22700
5613 -105831 -40579 341872 179023 -274833 -91077 -174173 232626 -154728 -95059 -69317 98110
5601 393804 -230618 279836 82790 -96164 -133470 177459 189182 -74939 116661 356318 66471
5589 -56515 67222 74045 -258656 45174 -10635 -30391 381235 36998 52110 -362287 -29624
5577 -209453 -147149 -96981 86125 57143 329077 -18808 -227095 104878 65949 -172392 -232099
5566 -232099 -111494 37946 75106 -63452 -269578 -504366 249745 -80172 -233621 17771 -113483
5554 -147634 -134460 -239975 -12596 62738 -43116 60462 55976 417896 76606 148594 160451
5543 160451 -329057 -162243 -355805 -182098 -136820 -20370 246924 271999 56058 27990 193352
5532 193352 105971 -41297 88062 -156917 58945 4045 -129453 176969 38800 -278351 69825
5520 -205563 -198824 -64500 44933 40663 -99088 -374729 106623 -206402 -57492 -50300 149586
5508 -269131 464369 97282 -29640 225219 126491 127049 81489 329864 343060 -158749 -286535
5497 -286535 -239723 280652 -60859 138624 143371 56840 302285 110104 170110 9151 -68782
5485 275194 -277 123848 92851 130961 -78532 -70594 107720 186997 104290 -161974 -235918 57255
5472 -244427 68879 -110340 180157 -387092 52457 197142 -95465 198804 206327 -378833 -173349
5460 -170472 120352 359412 -31162 130585 -152620 -74010 3440 146236 296733 -55205 136059
5448 -351510 -22503 -217321 -120533 -144223 -12431 -77592 31963 -53167 -237659 -197858 112732
5436 -31827 54591 -306052 435241 -98306 234911 360224 -188217 -112434 -216805 -85972 93080
5424 -25981 -238453 -47207 20528 209531 -249968 21054 106831 115103 -50745 -181287 -181466 112512
5411 154238 375151 -238600 33810 51432 400566 -233094 -119930 19099 245601 -24303
5400 -150378 -72435 -12268 57706 248913 160405 2273 102936 -45844 151305 75459 -368950
5388 86378 -228051 -115991 -54521 -113687 88344 -179868 -70760 -199958 153912 24875 114813
5377 114813 124825 93469 -29810 -338325 68723 -57980 -181838 54338 70323 21519 -99630
5365 -189586 159235 197877 -308726 -228341 96710 288666 -30042 34105 -215745 -265100 136935
5353 -10872 -8345 312892 -378803 -414186 108601 -54965 73761 -184129 -191493 -153559 -39917
5341 22930 -218483 -63523 -138991 -198625 -300295 -327340 -57227 -11026 55467 30048 -18341
5329 -175117 -166923 5021 -61528 -92601 437680 -160747 74818 100891 -48867 231716 -183186
5317 15170 -59616 -217751 -130837 -71380 -204282 -63471 9600 -110921 10231 214527 113213
5306 113213 740 -21975 13574 -59162 -64429 12062 -100322 -66998 147247 11666 208033 149743
5294 149743 -11297 384558 -48180 12018 176206 24334 -90215 198847 131058 114783 2114
5282 147637 -104459 -260149 -81748 34718 63417 215182 119302 350926 -58383 -69233 239529
5270 140872 -131812 -32781 40080 70771 148723 58868 -247682 -197474 215327 39701 52911
5259 52911 57711 75237 -33416 -178846 83367 -101601 -226818 34148 3308 -17337 -78120 212759
5246 -299063 381908 256207 121596 -235138 10893 181415 47121 135467 97164 12042 -11519
5234 74197 -95238 17168 -434131 146650 120440 269506 263895 -151730 -275914 -83234 -70159
5223 -70159 159173 214202 -98040 -181934 -36303 90854 52936 -109685 -70067 -58832 -231084
5212 -231084 -136974 134379 114230 112147 -74737 67954 -114261 180456 -23873 -234880 47492
5200 -19286 -15068 -75761 59040 -75266 77441 10719 -23939 95176 -190173 293999 62487 -79944
5187 -263210 180684 97035 -117226 -13187 -362512 -72465 -99455 -125819 -6373 -56954 -12917
5175 -54192 -98159 117748 215051 416331 173243 298372 -164417 15498 73893 -17064 -102500
5164 -102500 164784 17197 -122544 33609 5554 141478 110421 292850 213862 -43030 -136577
5153 -136577 176773 -120841 29310 -81692 64676 -346326 -149633 117636 525483 17069
5142 220536 -164237 33708 6423 307610 -38838 -23144 -85231 230135 233082 -13998 26121
5130 -245563 113312 -80148 -27246 330884 148840 8113 -125551 40678 -415658 -101889 -104824
5119 -104824 -23940 -163047 -165796 -55120 248329 -224502 -253193 -105920 -96521 134780 -7972
5107 -297136 84458 -236576 78594 81179 117533 -6774 -60635 -96908 -288016 -179501 -64228
5095 -181761 114851 -351726 -55941 65169 -57887 170394 -189846 3583 -127681 -207551 -78927
5083 86258 273227 58775 50642 -88484 -53432 -16756 -219138 -14710 -347301 -155412 -147101
5072 -147101 139199 171522 -5700 4508 -32467 214058 127584 200230 134720 296544 120933
5060 -1238 28636 99418 81533 22251 286316 -189703 -140653 83099 78009 54108 39119 263826
5048 263826 -70877 45628 47006 -134260 -142378 -57135 66527 -252039 210313 -110499 16349
5036 -74748 -216522 -73323 219215 -186839 -108818 -95972 -20128 153945 195185 -14936 55837
5024 9120 87404 137116 28254 -415698 -262723 -18973 -33223 -66317 -99449 139330 -315777
5012 145053 -95632 266854 113401 -74059 197273 277923 76416 228677 107616 84898 105210
5001 105210 6196 161361 108644 70672 -5758 354858 249937 43352 -69553 -156065 -224755
4990 -224755 215354 353165 132846 -17504 109698 166815 196468 1741 -108251 -88261 -383398
4979 -383398 -133645 57827 51376 20595 -16269 -193694 12350 276658 147021 -283260 -188047
4968 -188047 377620 48043 232852 77548 32044 -233993 126326 15513 101257 109990 172913
4957 172913 157208 91818 12620 79889 -103582 -238900 -13240 22548 124334 -72189 51098
4945 130029 190141 76096 -223018 237176 141122 116322 -2638 166441 -72437 22256 -186631
4933 151033 -46936 -34440 -136071 331214 -127036 -150505 -109146 113046 64358 -245055 -307722
4922 -307722 271597 176506 120140 -223499 211646 -59774 -23408 116165 -47034 -78466 -354910
4911 -354910 -4953 -79054 368123 102961 259148 127275 119831 132105 -196102 107610 -140395
4899 -204641 333009 67168 217875 120917 -119360 -269008 -75371 -242553 216070 -19544
4888 33094 26022 9313 39262 -94995 -175883 -97283 111449 -39065 97921 243572 29871 120560
4876 120560 138962 -223245 -286370 -168333 43547 284166 136694 -190 19170 -201813 97439
4864 51094 -190451 382386 76344 209553 -63819 225051 -19209 222349 -71907 43750 -53213
4852 43182 -94095 -77362 -32641 -8179 122579 202390 36251 168854 97418 -327207 29900
4840 -363117 -163951 146990 -85159 57172 94308 78460 -268828 75285 -274844 19912 -129543
4828 209663 -1843 116355 86899 -39902 -473323 -167321 12153 77663 141055 -138439 -40915
4816 248836 -164452 107483 301120 -38462 194406 37600 -263094 115674 -160890 68563
4805 227959 323872 -294320 -144605 -191063 -86120 62497 -1308 122427 60885 110443 32665
4793 86105 -17702 -58993 139135 -20706 159786 18316 -114888 -250005 -15793 -115118 -62948
4782 -62948 -5297 -1426 -128341 19684 -269165 53617 162133 65392 181094 -300185 38562
4770 -93748 37337 -156241 -173180 -34299 119695 218439 203819 -82655 -177400 39328 201142
4759 201142 49841 14779 -10575 127399 42931 180193 135565 163738 -105645 -3332 -396165
4748 -396165 -243101 146548 119146 -137042 120647 143825 -22195 -124994 342851 224967
4738 224967 -278382 -188868 -70627 152112 -10217 323049 -272791 -108160 47705 118900 -50688
4726 -170169 -275100 -230351 197201 78428 -167155 17449 -239335 226138 45541 1753 48345
4715 48345 -133222 -20288 152672 260760 162548 -113908 -283813 28670 -35107 74064 -63882
4703 36004 -56311 8603 -99888 -165820 106079 35909 118922 -156812 -228451 -119273 214046
4691 19305 5788 -61863 166476 -105372 -64039 340506 64707 -82968 192715 -142333 106416
4679 37933 247816 473707 64298 -43278 85494 48886 70401 38991 172412 -108694 80678
4667 203920 44198 -168450 -9006 -222304 69634 156251 -93949 -153100 96252 106603 -89548
4655 62519 93799 -118763 -91790 -26252 74277 -283317 187202 -16012 324300 186931 -170066
4643 -314659 -76044 45048 7730 122337 449185 166859 132614 -320979 152449 365276 130231
4631 97304 44689 31973 309102 106270 181206 199213 170254 -388061 104757 -377078 69059
4619 -16387 -170752 218121 42845 130512 172753 290078 123357 -238698 -9712 14328 -190472
4607 150082 -67952 61945 45759 168090 83533 -93977 240672 414755 -40796 -299898 132144
4595 354697 423886 403779 319782 -210384 196643 27372 62728 -78498 203081 -60066 44294
4583 -279695 -70957 89046 -140194 -306823 -50458 -161567 21957 173881 -50969 -147468 237129
4571 -481652 89809 90322 170286 213684 173438 -322809 61387 117672 -125460 87387 36629 -185534
4558 -52938 -17047 -505360 186469 -459869 -192215 10508 -292284 -149237 12539 28275 -58964
4546 -267161 103397 285360 -160921 210021 -130996 199324 154800 -97679 -424050 345738
4535 321683 90095 -182306 -108108 -193172 196633 141850 -28150 156379 29048 253856 141279
4524 141279 -173866 327 -11616 -161503 -60858 19286 172134 -26069 -47519 74765 -112799
4512 166843 127266 -121452 -162874 -20392 -57464 -76854 90048 -201690 81037 -267933 58442
4500 -227945 112507 94495 -179262 5562 11335 -55238 -147353 -295033 174843 -138034 -199732
4489 -199732 -109578 331250 11908 -5994 -21015 219845 204105 -263558 -231470 69468 -148033
$$ [...]
##END NTUPLES=NMR SPECTRUM
##END=
