##TITLE=AC1612_BRAAN13342_8317078_1FAKSlUxmH
##JCAMPDX= 6.0         $$ Bruker NMR JCAMP-DX V2.0
##DATA TYPE= NMR SPECTRUM
##DATA CLASS= NTUPLES
##ORIGIN= BRUKER
##OWNER= Administrator
$$ 1.72 TOPSPIN		Version 2.1
$$ 2013-11-13 17:42:12.449 -0800  Administrator@X
$$ Compression mode = diff/dup
##.OBSERVE FREQUENCY= 400.02188249412
##.OBSERVE NUCLEUS= ^1H
##.ACQUISITION MODE= SIMULTANEOUS (DQD)
##.ACQUISITION SCHEME= undefined
##.AVERAGES= 64
##.DIGITISER RES= 22
##SPECTROMETER/DATA SYSTEM= spect
##.PULSE SEQUENCE= noesygpps1d.comp
##.SOLVENT NAME= COFFEE_meoh
##.SHIFT REFERENCE= INTERNAL, COFFEE_meoh, 1, 14.96111
##AUDIT TRAIL= $$ (NUMBER, WHEN, WHO, WHERE, PROCESS, VERSION, WHAT)
$$ ##TITLE= Audit trail, TOPSPIN		Version 2.1
$$ ##JCAMPDX= 5.01
$$ ##ORIGIN= Bruker BioSpin GmbH
$$ ##OWNER= Administrator
$$ $$ E:\/data/COFFEE/nmr/AC1612_BRAAN13342_8317078_1FAKSlUxmH/12/pdata/1/auditp.txt
$$ ##AUDIT TRAIL=  $$ (NUMBER, WHEN, WHO, WHERE, PROCESS, VERSION, WHAT)
(   1,<2013-11-13 17:42:07.027 -0800>,<Administrator>,<X>,<go>,<TOPSPIN 2.1>,
      <created by zg
	started at 2013-11-13 17:30:37.463 -0800,
	POWCHK enabled, PULCHK disabled,
       configuration hash MD5:
       C8 4E 4E 5D D3 5C D8 9E 9F 52 82 E0 59 8A DE 15
       data hash MD5: 64K
       FB DA 58 78 32 81 6D 50 1B 92 28 A8 88 16 07 C1>)
(   2,<2013-11-13 17:42:10.058 -0800>,<Administrator>,<X>,<proc1d>,<TOPSPIN 2.1>,
      <Start of raw data processing
       efp LB = 0.3 FT_mod = 6 PKNL = 1 PHC0 = 0 PHC1 = 0 SI = 128K 
       data hash MD5: 128K
       D7 C1 99 56 CA 36 6A B7 EB 57 FD 88 DC 6D 27 02>)
(   3,<2013-11-13 17:42:11.230 -0800>,<Administrator>,<X>,<proc1d>,<TOPSPIN 2.1>,
      <pk PHC0 = -82.32056 PHC1 = 0 
       data hash MD5: 128K
       3B E6 DB 2A 7F 48 53 B3 59 84 33 69 A9 BC 06 E3>)
(   4,<2013-11-13 17:42:11.808 -0800>,<Administrator>,<X>,<proc1d>,<TOPSPIN 2.1>,
      <abs ABSG = 1 
       data hash MD5: 128K
       FE 20 A4 2E 8E D8 9A 84 9F C2 1D F8 38 E6 C9 AA>)
(   5,<2013-11-13 17:42:11.902 -0800>,<Administrator>,<X>,<proc1d>,<TOPSPIN 2.1>,
      <abs ABSG = 2 
       data hash MD5: 128K
       9D A8 04 54 3B 3B 4A F1 20 08 F7 11 2D 7F 48 C5>)
(   6,<2013-11-13 17:42:11.996 -0800>,<Administrator>,<X>,<proc1d>,<TOPSPIN 2.1>,
      <abs ABSG = 3 
       data hash MD5: 128K
       86 00 6F D6 FD 3F F9 FA 1F 90 AE 6A 85 48 47 87>)
(   7,<2013-11-13 17:42:12.058 -0800>,<Administrator>,<X>,<proc1d>,<TOPSPIN 2.1>,
      <abs ABSG = 4 
       data hash MD5: 128K
       14 1E C6 8D 56 AD 92 B0 5F 0F 94 B9 32 F3 1A A4>)
(   8,<2013-11-13 17:42:12.183 -0800>,<Administrator>,<X>,<proc1d>,<TOPSPIN 2.1>,
      <abs ABSG = 5 
       data hash MD5: 128K
       56 D2 24 39 02 46 9A 45 C5 89 F6 C6 75 54 90 23>)
$$ ##END=
$$ 
$$ $$ hash MD5
$$ $$ 4E F7 80 B3 23 85 92 39 B7 94 1E ED E4 50 B9 13
##$RELAX= 
##$RELAX= 
##$RELAX= 
##$RELAX= 
##$RELAX= 
##$RELAX= 
##$RELAX= 
##$RELAX= 
$$ Bruker specific parameters
$$ --------------------------
##$DU= <E:\>
##$EXPNO= 12
$$ [...]
##$TP07= 0
##$TPNAME0= <>
##$TPNAME1= <>
##$TPNAME2= <>
##$TPNAME3= <>
##$TPNAME4= <>
##$TPNAME5= <>
##$TPNAME6= <>
##$TPNAME7= <>
##$TPOAL= (0..7)
0.5 0.5 0.5 0.5 0.5 0.5 0.5 0.5
##$TPOFFS= (0..7)
0 0 0 0 0 0 0 0
##$TUNHIN= 0
##$TUNHOUT= 0
##$TUNXOUT= 0
##$USERA1= <user>
##$USERA2= <user>
##$USERA3= <user>
##$USERA4= <user>
##$USERA5= <user>
##$V9= 5
##$VALIST= <valist>
##$VCLIST= <CCCCCCCCCCCCCCC>
##$VD= 0
##$VDLIST= <DDDDDDDDDDDDDDD>
##$VPLIST= <PPPPPPPPPPPPPPP>
##$VTLIST= <TTTTTTTTTTTTTTT>
##$WBST= 1024
##$WBSW= 4
##$XGAIN= (0..3)
0 0 0 0
##$XL= 0
##$YL= 0
##$YMAX_a= 6783414
##$YMIN_a= -14071637
##$ZGOPTNS= <>
##$ZL1= 120
##$ZL2= 120
##$ZL3= 120
##$ZL4= 120
##$ABSF1= 14.96111
##$ABSF2= -5.597072
##$ABSG= 5
##$ABSL= 3
##$ALPHA= 0
##$AQORDER= 0
##$ASSFAC= 0
##$ASSFACI= 0
##$ASSFACX= 0
##$ASSWID= 0
##$AUNMP= <proc_prof1d_extract.lims>
##$AXLEFT= 0
##$AXNAME= <>
##$AXNUC= <1H>
##$AXRIGHT= 0
##$AXTYPE= 0
##$AXUNIT= <>
##$AZFE= 0.1
##$AZFW= 0.1
##$BCFW= 0
##$BC_mod= 0
##$BYTORDP= 0
##$COROFFS= 0
##$CY= 15
##$DATMOD= 1
##$DC= 0
##$DFILT= <>
##$DTYPP= 0
##$F1P= 0
##$F2P= 0
##$FCOR= 0.5
##$FTSIZE= 131072
##$FT_mod= 6
##$GAMMA= 0
##$GB= 0
##$INTBC= 1
##$INTSCL= 1
##$ISEN= 128
##$LB= 0.3
##$LEV0= 0
##$LPBIN= 0
##$MAXI= 10000
##$MC2= 0
##$MEAN= 0
##$ME_mod= 0
##$MI= 0
##$NCOEF= 0
##$NC_proc= -2
##$NLEV= 6
##$NOISF1= 0
##$NOISF2= 0
##$NSP= 0
##$NTH_PI= 0
##$NZP= 0
##$OFFSET= 14.96111
##$PC= 1
##$PHC0= -82.32056
##$PHC1= 0
##$PH_mod= 1
##$PKNL= yes
##$PPARMOD= 0
##$PPDIAG= 0
##$PPIPTYP= 0
##$PPMPNUM= 2147483647
##$PPRESOL= 1
##$PSCAL= 4
##$PSIGN= 0
##$PYNMP= <proc.py>
##$REVERSE= no
##$SF= 400.020009594579
##$SI= 131072
##$SIGF1= 0
##$SIGF2= 0
##$SINO= 400
##$SIOLD= 131072
##$SPECTYP= <>
##$SREGLST= <1H.CDCl3>
##$SSB= 0
##$STSI= 131072
##$STSR= 0
##$SW_p= 8223.68421052631
##$SYMM= 0
##$S_DEV= 0
##$TDeff= 65536
##$TDoff= 0
##$TI= <>
##$TILT= no
##$TM1= 0
##$TM2= 0
##$TOPLEV= 0
##$USERP1= <user>
##$USERP2= <user>
##$USERP3= <user>
##$USERP4= <user>
##$USERP5= <user>
##$WDW= 1
##$XDIM= 131072
##$YMAX_p= 394036841
##$YMIN_p= -11476
##$CURPLOT= <Network HP LaserJet P1505>
##$CURPRIN= <$Network HP LaserJet P1505>
##$DFORMAT= <normdp>
##$LAYOUT= <+/1D_H.xwp>
##$LFORMAT= <normlp>
##$PFORMAT= <normpl>
##$SURQMSG= 1
$$ End of Bruker specific parameters
$$ ---------------------------------
##NTUPLES= NMR SPECTRUM
##VAR_NAME=  FREQUENCY,     SPECTRUM/REAL,   SPECTRUM/IMAG
##SYMBOL=    X,             R,               I
##VAR_TYPE=  INDEPENDENT,   DEPENDENT,       DEPENDENT
##VAR_FORM=  AFFN,          ASDF,            ASDF
##VAR_DIM=   131072,        131072,          131072
##UNITS=     HZ,            ARBITRARY UNITS, ARBITRARY UNITS
##FACTOR=    0.0627417313425164, 1,          1
##FIRST=     8223.62146879497, -1102,        -65131
##LAST=      0,             993,             -65898
##MIN=       0,             -11476,          0
##MAX=       8223.62146879497, 394036841,    0
$$ Real data points
##PAGE= N=1
##DATA TABLE= (X++(R..R)), XYDATA
$$ [...]
65054 171732 174376 177261 179703 181288 182409 183633 184666 184531 182858 180499 178661 177770 177407 177043 176465
65039 176465 175653 174603 173320 171795 169935 167712 165407 163464 162009 160636 158858 156687 154619 153067
65025 153067 151952 150919 149795 148780 148207 148187 148470 148636 148444 147997 147583 147420 147582 148039 148625 149083 149412 150167
65007 150167 152092 155301 159028 162359 165056 167471 169871 172141 174119 175892 177617 179236 180480 181203
64993 181203 181643 182315 183527 184967 185995 186409 186783 187815 189510 191261 192672 194004 195785 198230 201087
64978 201087 203801 205711 206307 205520 203743 201509 199167 196815 194425 191958 189464 187108 185052 183307 181741
64963 181741 180173 178367 176119 173594 171508 170561 170570 170484 169506 167968 166848 166584 166661 166268 165030 163149 161165
64946 161165 159682 159035 159080 159435 159995 160965 162246 163125 162886 161628 160129 159012 158395 158268 158728 159674 160684
64929 160684 161471 162165 162904 163475 163689 163771 163923 163779 162897 161698 161221 161828 162731 162981 162480 161786 161447 161801 162981
64910 162981 164660 166128 167006 167689 168746 170193 171729 173375 175438 178011 181017 184582 188893 193780 198918
64895 198918 204407 210653 217606 224523 230637 235791 240305 244457 248199 251249 253490 255294 257292 259615
64881 259615 261619 262653 262806 262488 261577 259531 256203 251963 247095 241728 236325 231618 227946 225191 223312
64866 223312 222237 221255 219456 217050 215322 214821 214446 213004 210866 209147 207832 205811 202583 198876 195515
64851 195515 192541 189678 186969 184616 182640 180991 179667 178536 177355 176092 174928 173870 172713 171540
64837 171540 170876 171114 171990 172891 173488 173889 174299 174760 175183 175472 175624 175735 175921 176254 176840 177925 179711 182096
64819 182096 184732 187364 189982 192691 195696 199421 204344 210500 217339 224235 231066 238184 245911 254207
64805 254207 262734 271057 278799 285684 291453 295670 297723 297143 293977 288805 282392 275395 268319 261598
64791 261598 255536 250123 244987 239707 234323 229528 226180 224518 223881 223288 222243 220918 219674 218658 217900
64776 217900 217548 217752 218456 219630 221703 225396 230874 237323 243644 249496 255373 261721 268311 274595 280376
64761 280376 285942 291635 297416 302817 307343 311022 314473 318153 321577 323692 324121 323640 323162 322693 321699
64746 321699 320152 318546 316935 314580 310720 305240 298446 290682 282506 274788 268115 262230 256466 250687
64732 250687 245440 241244 238077 235570 233372 231218 229002 226973 225581 224960 224782 224816 225325 226553 228066
64717 228066 229128 229760 230957 233605 237450 241335 244261 246074 247339 248762 250547 252106 252513 251448 249484
64702 249484 247237 244488 240599 235644 230581 226225 222535 219125 216061 213777 212471 211947 211900 212012 211860
64687 211860 211133 210017 209122 208958 209634 211108 213370 216230 219179 221833 224501 228033 233090 239732 247700
64672 247700 256706 266234 275472 283911 291903 300054 307962 314124 317383 318064 317294 315532 312311 307258 300803
64657 300803 293826 287039 280774 274966 269171 262987 256643 250969 246633 243640 241696 240742 240906 242149 244276
64642 244276 247234 251160 256093 261787 267963 274824 283210 293907 306576 319628 331573 342345 352906
64629 352906 363685 374003 382964 390099 394880 396431 394385 389593 383283 375819 366865 356514 345488
64616 345488 334297 322897 311397 300519 291021 283022 276172 270242 265305 261543 259090 257933 257807
64603 257807 258256 258980 260026 261568 263539 265626 267552 269236 270692 271934 273117 274648 276878 279624 282152
64588 282152 283836 284692 285065 285039 284514 283794 283600 284330 285712 287313 288977 290498 291328 291076 290064 289021 288394
64571 288394 288290 288776 289715 290424 290021 288152 285002 280756 275550 269924 264670 259974 255183 249726 243899
64556 243899 238488 233902 230020 226571 223306 219936 216386 213133 210917 209971 209759 209551 209107 208621 208277 208159
64540 208159 208534 209784 211826 213875 215179 215892 216841 218393 219902 220475 219958 218928 217875 216700 214979
64525 214979 212591 210106 208534 208528 209785 211454 213130 215073 217362 219396 220690 221765 223646 226581 229812
64510 229812 232652 235293 238404 242279 246577 250741 254549 258335 262739 268243 274948 282692 291072 299357
64496 299357 306839 313543 320134 326712 332077 334775 334596 332519 329405 325414 320608 315341 309904 304357
64482 304357 298892 293909 289614 285936 282843 280252 277615 274232 270138 266131 262759 259802 256878 253944
64468 253944 250961 247758 244629 242487 241879 242314 243088 244333 246619 249789 252849 254997 256278 257236 258302
64453 258302 259532 260621 261201 261279 261331 261790 262593 263428 264251 265373 267124 269631 272800 276451 280580 285491
64437 285491 291302 297427 303070 308403 314653 322803 332825 344564 358553 375295 394488 415868 440276
64424 440276 468866 501635 538000 578715 625910 680990 743682 813489 890670 974775 1063120
64413 1063120 1151892 1238508 1322053 1401821 1476409 1544179 1603614 1652881 1689715 1712212 1719626
64402 1719626 1712455 1692138 1660632 1619618 1569642 1510233 1441175 1363667 1280297 1194161 1108082
64391 1108082 1024203 943857 867837 796960 732243 674317 622857 576947 536006 500070 469204
64380 469204 442942 420430 400925 384082 369935 358633 349931 342838 336068 329011 322030 315621 309591
64367 309591 303409 297090 291246 286261 281878 277711 273808 270475 267709 265034 261886 258214 254775 252760
64353 252760 252894 254851 257656 260565 263433 266480 270102 274786 280713 287319 293633 299106 303730 307333
64339 307333 309343 309506 308294 306261 303460 299969 296527 293997 292412 291166 290126 289957 291197 293447 295745
64324 295745 297534 299087 301002 303303 305105 305374 304041 302039 300075 297850 294903 291767 289523 288304
64310 288304 287032 284823 281933 279038 276191 273039 269643 266364 263054 258977 253792 248175 243207 239311
64296 239311 236081 233115 230658 229295 229146 229663 230154 230391 230642 231336 232776 235007 237826 240990 244488 248537
64280 248537 253304 258836 265214 272451 280086 287308 293750 299892 306342 313029 319488 325639 331682 337301
64266 337301 341685 344453 346013 346766 346491 344908 342500 340252 338648 337318 335806 334345 333570 333481 332978 330772
64250 330772 326698 321763 316802 311504 305117 297698 290137 283133 276786 271128 266362 262406 258790 255343
64236 255343 252517 250704 249562 248410 247069 245986 245719 246536 248316 250528 252450 253700 254520 255335 256119
64221 256119 256404 255877 254834 254039 254136 255044 255872 255615 254024 251617 248874 245818 242546 239737 238157 237814
64205 237814 237983 238085 238229 238899 240284 242020 243570 244847 246365 248608 251383 254140 256906 260315 264558
64190 264558 268965 273153 278044 285102 294790 306406 319201 332854 346814 360003 371455 380758 387631
64177 387631 391517 391957 389026 383181 374961 365081 354474 343868 333479 323294 313462 304154 295230
64164 295230 286339 277377 268754 261310 255913 252848 251462 250686 250024 249758 250110 250668 250957 251168 251821 252992
64148 252992 254386 256032 258323 261376 264871 268557 272407 276172 279342 281813 284090 286483 288481 289362
64134 289362 289088 288140 286697 284645 282314 280586 279995 280200 280591 281041 281708 282455 283045 283779 285410 288253 291837
64117 291837 295678 300001 305355 311796 318931 326707 335614 345932 357144 368343 378912 388579 397066
64104 397066 404156 410036 415083 419208 421848 422879 423327 424803 428258 433473 439656 446209 452811 459096
64090 459096 464555 468765 471559 472963 473058 471906 469522 465886 461087 455474 449457 443039 435711 427079 417556
64075 417556 408094 399257 390867 382712 375170 368794 363537 358842 354424 350531 347468 345233 343673 342578
64061 342578 341561 340297 339110 338895 340149 342415 344937 347520 350349 353360 356381 359718 363952 369147
64047 369147 374822 380800 387564 395561 404644 414599 425797 438835 453652 469413 485262 500857 516085
64034 516085 530506 543266 553537 560952 565632 567821 567625 565128 560660 554756 547875 540321 532432 524632
64020 524632 517243 510442 504491 499692 495903 492238 487548 481228 473481 464918 456073 447282 438772 430739
64006 430739 423393 416958 411569 407158 403463 400206 397233 394522 392056 389794 387850 386637 386613 387740 389389
63991 389389 390983 392642 394948 398203 402198 406680 411644 417059 422704 428485 434654 441478 448859 456528
63977 456528 464466 472942 482238 492493 503709 515780 528547 541913 555798 570034 584533 599636
63965 599636 616036 634197 654064 675474 698533 723486 750520 779930 812157 847442 885847
63954 885847 928015 975570 1030340 1093432 1165583 1248123 1342972 1451782 1575647 1715638 1872934
63943 1872934 2048290 2241800 2453210 2681830 2925913 3182608 3448701 3720943 3995441
63934 3995441 4267280 4531127 4781768 5013666 5220569 5396398 5536638 5638619 5700700 5721797
63924 5721797 5701752 5641629 5543307 5408984 5241336 5044174 4822842 4583776 4333346 4076745
63914 4076745 3817889 3560311 3307948 3064798 2833895 2616836 2414359 2227143 2055930
63905 2055930 1901023 1761929 1637589 1526905 1428978 1342820 1267014 1199909 1140259 1087609
63895 1087609 1041957 1003033 969848 940806 914222 888932 864580 841386 819591 799079 779439
63884 779439 760294 741569 723608 707085 692697 680831 671545 664805 660578 658694 658902 661200 665934
63871 665934 673260 682624 693062 704140 716385 730577 746730 763991 781536 799263 817408 835646
63859 835646 852981 868602 882487 894935 905757 914273 919964 922739 922566 919251 912769 903561 892272
63846 892272 879272 864532 847891 829415 809560 788963 767912 746115 723237 699613 676085
63835 676085 653057 630108 606711 582948 559260 535945 513415 492567 474202 457966 442536
63824 442536 427124 412315 399101 387488 376644 366152 356464 347999 340382 332973 325715 319057 313262
63811 313262 308320 304422 301890 300485 299309 297702 295874 294322 292997 291478 289719 288093 286799 285639
63797 285639 284319 282551 279988 276588 273070 270458 268967 267780 266038 263612 260712 257342 253595 250075
63783 250075 247436 245631 244069 242436 240989 240011 239392 238799 238068 237315 236795 236678 236848 236952 236702 236116 235386
63766 235386 234612 233741 232686 231444 230238 229557 229777 230658 231429 231630 231602 231929 232642 233326 233806 234256 234692 234846
63748 234846 234635 234377 234369 234573 234963 235863 237613 240027 242543 244954 247649 250967 254538 257625 260067 262477
63732 262477 265311 268095 270004 271050 272146 273994 276504 279488 283320 288337 293976 299152 303411 307219
63718 307219 311133 315265 319551 323948 328082 331229 333113 334388 335805 337036 336854 334629 331241 328206
63704 328206 326129 324366 322137 319537 317270 315732 314733 314014 313610 313615 313948 314565 315625 317220 319175 321381
63688 321381 324118 327633 331505 334833 337118 338617 339726 340372 340246 339421 338424 337740 337398 337075 336460 335519
63672 335519 334541 334027 334428 335828 337793 339630 340993 342229 343964 346320 348677 350279 350854 350526 349377
63657 349377 347367 344505 340793 336076 330317 323987 317921 312723 308574 305562 303736 302656 301388 299396
63643 299396 297281 296165 296372 297021 296969 295901 294447 293544 293831 295394 297811 300502 303242 306280 309830 313605
63627 313605 317155 320590 324577 329526 335091 340722 346457 352825 360177 368447 377520 387400 397938 408796
63613 408796 419901 431726 444867 459489 475414 492580 511150 531166 552348 574360 597059
63602 597059 620228 643065 664178 682296 696920 708127 715841 719716 719862 717341 713572 709409 705050
63589 705050 700604 696205 691612 686098 678843 669187 656589 640938 623082 604616 586852 570140 554285
63576 554285 539218 525096 512161 500790 491414 484082 478336 473760 470471 468851 469005 470629 473139
63563 473139 475821 478274 480940 484722 489719 494820 499008 502638 506823 511967 517763 524458 533178 544756
63549 544756 558905 574943 592857 613296 636789 663278 692181 722576 753254 782644 808774
63538 808774 829623 843987 852130 855404 855228 852620 848548 844189 840466 837453 834474 830771 826039 820232
63524 820232 812893 802816 788665 770044 747790 723177 697122 670224 643058 615993 589082 562629
63512 562629 537648 515227 495561 478071 462371 448589 436793 426664 417796 409896 402683 396014
63500 396014 390127 385304 381292 377488 373723 370324 367445 364934 362939 361934 361871 361898 361309 360347 359676 359477
63484 359477 359426 359259 359006 358966 359742 361973 365628 369774 373370 376149 378507 380832 383306 386141 389487 393005
63468 393005 395823 397038 396268 393772 390147 385894 381318 376838 373106 370472 368462 366243 363667 361435
63454 361435 360151 359690 359629 359832 360359 361233 362619 364873 368143 372179 376762 382011 388028 394642 401802 409825
63438 409825 418946 428920 439446 450718 463294 477738 494659 514539 536974 560300 582390 601640
63426 601640 617015 627858 634454 638434 641810 645627 650103 655831 663978 675229 689333 705926 725171
63413 725171 747272 771767 797577 823388 847748 869178 886558 899326 907273 910499 909802 906821
63401 906821 903390 900583 898292 895538 891198 884659 875918 865056 851706 835218 815332 792534 767841
63388 767841 742332 716705 691019 664986 638821 613680 590893 570866 553151 537513 524371
63377 524371 514037 506072 499655 494298 489975 486920 485573 486459 489728 494915 501347 508667 516811 525691
63363 525691 535172 545331 556484 568947 582865 598255 615180 633846 654491 677053 701039 725938
63351 725938 751672 778256 804917 829920 851538 868944 881996 890557 894603 894842 892588 888811 883660
63338 883660 877142 869849 862538 855037 846027 834098 818842 800817 780771 759218 736642 713604
63326 713604 690474 667418 644934 624169 606359 592009 580849 572447 566480 562351 558962 555057
63314 555057 549664 542170 532244 519922 505691 490389 474983 460423 447433 436291 426846 418773
63302 418773 411756 405486 399793 394862 391093 388554 386714 384851 382586 380002 377448 375345 373877 372595
63288 372595 370575 367329 363413 359807 356788 353833 350567 347357 344799 343057 341872 340871 339625 337807
63274 337807 335680 334120 333724 334002 333947 333285 332738 333008 334054 335526 337373 339634 341968 343899 345467 347270
63258 347270 349781 352850 355886 358439 360621 363082 366479 370882 375746 380515 385035 389318 393266 397043
63244 397043 401446 407412 415091 423799 432934 442595 453192 464836 477372 490803 505438 521648 539549
63231 539549 558897 579228 600169 621589 643477 665814 688662 712100 735810 758991 781111
63220 781111 802608 824412 846865 869583 892308 915289 938687 962149 985072 1006719 1025922
63209 1025922 1041317 1052302 1059269 1062602 1061937 1056797 1047399 1034259 1017501 997256 974489 950746
63197 950746 927136 904114 882121 861876 844093 829370 818277 811019 807086 805785 807143 811785
63185 811785 819916 831035 844767 861366 881077 903439 927653 953416 980995 1010500 1041267 1072015
63173 1072015 1101643 1130011 1157964 1186487 1215755 1244940 1272734 1297894 1319548 1337292 1350972
63162 1350972 1360112 1363668 1360532 1350229 1332929 1309021 1279058 1243988 1204964 1162911 1118597 1073094
63150 1073094 1027767 983740 941662 901978 865054 831029 799879 771636 746254 723288 702120
63139 702120 682610 665207 650368 638104 628035 619527 611809 604400 597575 592079 588314 586078 584992
63126 584992 584799 585264 586238 587845 590187 592966 595881 599276 603682 608775 613626 618060 622811 628010 632573
63111 632573 635713 638084 640551 642579 642970 641778 640336 639529 639042 638372 637604 636911 636058 634792 633236 631615
63095 631615 629960 628248 626500 624683 622927 621834 622016 623183 624223 624413 624082 623888 624006 624440 625549 627639
63079 627639 630364 633214 636416 640674 645928 651092 655321 659136 663906 670424 678325 686794 695474 704666
63065 704666 714886 726381 739014 752525 766939 782761 800714 821238 844190 869020 895324
63054 895324 923300 953698 987221 1023950 1063463 1105524 1150423 1198470 1249310 1302040 1355918
63043 1355918 1410603 1465737 1520722 1575149 1629144 1683052 1737019 1791128 1845616 1900557 1955444
63032 1955444 2009481 2062140 2113012 2161165 2205128 2243579 2275545 2299736 2314191 2317084 2307850 2287249
63020 2287249 2256452 2216383 2167989 2112854 2053246 1991474 1929375 1868552 1810904 1758395 1712085
63009 1712085 1671790 1637173 1608955 1588583 1576800 1573092 1576549 1586696 1603315 1626059 1654631 1688910
62997 1688910 1728515 1772442 1819518 1869024 1920622 1973914 2028457 2084069 2140728 2198153 2255644
62986 2255644 2312229 2366719 2417789 2464280 2505385 2540187 2567098 2584076 2589544 2582884 2564024 2532810
62974 2532810 2488998 2432854 2365660 2289566 2206885 2119522 2029118 1937577 1847103 1759513 1675790
62963 1675790 1596437 1521956 1452580 1387782 1326642 1268862 1215033 1165741 1120771 1079456 1041402
62952 1041402 1006401 973761 942444 912117 883626 857929 834765 812869 791443 770836 751589
62941 751589 733472 715960 699264 684161 670879 658809 647465 637161 628432 621190 614842 609057
62929 609057 604032 600047 597022 594548 592297 590297 588752 587534 586021 583629 580403 576826 573182 569435
62915 569435 565654 562023 558380 554275 549664 545054 540661 535944 530394 524473 519249 515312 512463 510300
62901 510300 508610 507206 505858 504480 503118 501666 499849 497538 494928 492440 490553 489609 489518 489633 489198
62886 489198 488002 486488 485277 484713 484776 485174 485437 485193 484574 484309 485165 487144 489261 490344 490161 489589 489579
62869 489579 490214 491028 491838 492753 493550 493756 493469 493381 493694 493630 492461 490563 488978 488291 488403 489050 490000 490920
62851 490920 491591 492166 492868 493549 493930 494092 494307 494577 494726 494821 495005 495050 494575 493640 492703 491983 491302 490526 489792
62832 489792 489266 489057 489323 490089 490985 491569 491929 492554 493604 494697 495490 496131 497053 498655 501177 504601 508606
62815 508606 512862 517266 521599 525243 527788 529854 532677 536789 541619 546449 551119 555725 560367 565511
62801 565511 571927 579752 588115 596210 604362 613487 623791 634603 645337 656115 667472 679964 694172
62788 694172 710700 729959 752052 776945 804774 836053 871625 912191 957755 1007699 1061595
62777 1061595 1119798 1183072 1251738 1325371 1403115 1483933 1566514 1649114 1729567 1805479 1874611
62766 1874611 1935290 1986395 2026876 2055458 2071014 2073120 2062031 2038262 2002504 1955926 1900214
62755 1900214 1837120 1768103 1694530 1618065 1540667 1464115 1389571 1317582 1248477 1182713 1120838
62744 1120838 1063208 1009835 960580 915380 874254 837110 803678 773665 746974 723726 703995
62733 703995 687517 673674 661870 651858 643686 637372 632659 629042 625959 623051 620426 618645 618337
62720 618337 619705 622454 626191 630898 637015 645085 655235 667063 680187 694932 712268 732939 756867
62707 756867 783594 813124 846063 883026 924210 969609 1019487 1074614 1136014 1204298 1279107
62696 1279107 1359420 1444607 1535001 1631173 1732862 1838775 1947030 2055225 2160269 2258881
62686 2258881 2348404 2426784 2491771 2540798 2571858 2584088 2577327 2551636 2507688 2447293 2373063
62675 2373063 2287618 2193306 2092472 1987665 1881529 1776502 1674404 1576163 1482087 1392539
62665 1392539 1308197 1229605 1156810 1089698 1028454 973371 924232 880130 839985 803158 769649
62654 769649 739715 713258 689562 667735 647374 628673 611866 596766 582846 569603 556818
62643 556818 544723 533940 525005 517870 512003 506987 502782 499393 496662 494491 492950 491999 491284 490332
62629 490332 488749 486238 482787 478904 475287 472126 469118 466303 464394 463976 464812 466309 468291 470861 473819
62614 473819 476765 479657 482826 486538 490839 495703 500920 506046 510949 516356 523325 532107 541966 552185
62600 552185 562817 574320 587000 601248 618015 638478 663110 691312 722047 754696 789227
62589 789227 825649 863559 902290 941334 980284 1018256 1053526 1083996 1108117 1125381 1135986
62578 1135986 1140115 1137571 1128099 1111960 1090038 1063277 1032285 997716 960856 923417 886690 851186
62566 851186 817032 784323 753069 723347 695763 671269 650152 631513 614159 597798 583035
62555 583035 570465 560130 551639 544316 537364 530376 523763 518337 514423 511662 509591 508059 507051 506454
62541 506454 506141 506092 506318 506804 507496 508284 509064 509967 511348 513335 515568 517725 520180 523750 528845 535241
62525 535241 542741 551637 562440 575478 590891 608709 628807 651118 676070 704515 737015 773415
62513 773415 813360 856963 904593 956101 1010692 1067637 1126715 1187617 1248967 1308308 1363274
62502 1363274 1412680 1456300 1493642 1523279 1543527 1553532 1553562 1544488 1527416 1503819 1475682 1445215
62490 1445215 1414365 1384541 1356701 1331716 1310688 1294807 1284817 1280768 1282445 1289852 1302971 1321142
62478 1321142 1343019 1367130 1392080 1416078 1436701 1451564 1459360 1460197 1454932 1444108 1427275 1403157
62466 1403157 1370587 1329556 1281579 1229141 1174696 1119916 1065574 1012010 959718 909523 862244
62455 862244 818464 778731 743707 713747 688398 666639 647661 631214 617331 606142 597939 592907
62443 592907 590507 589535 589167 589667 591643 594862 598400 601910 606132 611730 618038 623390 626674 628154 628680
62428 628680 628465 626933 623633 618876 613319 607160 599996 591411 581494 570812 560095 549971 540686 531928
62414 531928 523174 514389 506179 498963 492270 485312 478203 472020 467485 464067 460741 457211 453930 451260
62400 451260 449256 448106 448050 448726 449260 449294 449358 449921 450638 451016 451403 452670 455108 458145 461016 463270 464881
62383 464881 466433 469042 473447 479103 484679 489447 493735 498132 502916 508305 514525 521386 528379 535404
62369 535404 542871 550930 559245 567814 577298 588149 600087 612950 627437 644432 664050 686008
62357 686008 710497 738090 769171 803977 842698 884701 928091 970924 1012639 1053368 1092098
62346 1092098 1126627 1155457 1178709 1196871 1209645 1216565 1218033 1215031 1208126 1197197 1181949 1162393
62334 1162393 1139106 1113283 1086315 1059076 1031840 1004927 979045 954798 932274 911313 891838
62323 891838 873664 856357 839564 823150 806705 789293 770159 749564 728551 707976 688046
62312 688046 668682 650002 632394 616258 601696 588442 576187 564970 554994 546059 537619 529569
62300 529569 522612 517481 514070 511691 509965 509025 508964 509532 510455 511721 513439 515580 517948 520263 522325
62285 522325 524197 526190 528458 530679 532349 533412 534454 536193 538842 541996 545036 547688 550302 553585
62271 553585 557994 563441 569585 576271 583503 591166 599062 607261 616249 626718 639365 654849 673608
62258 673608 695552 720113 746929 776505 810099 848806 892688 940668 991139 1042593 1093748
62247 1093748 1143299 1189778 1231705 1267800 1297094 1319052 1333738 1341663 1343216 1338246 1326344 1307449
62235 1307449 1281965 1250343 1213003 1170869 1125732 1079697 1034278 990130 947408 906134 866356
62224 866356 828397 792992 760916 732406 707155 684818 665109 647470 631267 616573 604139
62213 604139 594126 585413 576799 568555 561964 557476 554151 550967 547859 545167 542909 541138 540429 541344
62199 541344 543590 546247 548770 551434 554871 559387 564648 569933 574912 580180 586691 594583 603027 611417
62185 611417 620052 629281 638694 647832 657178 667520 678535 688858 697546 704748 710889 715981 719959
62172 719959 723080 725695 728063 730739 734837 741609 751894 765922 783418 803858 826950 852913 881913
62159 881913 913218 945251 976521 1006102 1033158 1056547 1075247 1088930 1097914 1102706 1103734 1101189
62147 1101189 1094973 1084903 1071098 1054075 1034454 1012797 989656 965523 940779 916053 892592
62136 892592 871794 854254 839618 827455 817809 810648 805249 800555 796003 791713 788014 785037 782673
62123 782673 780715 779042 777752 777130 777536 779406 783167 788853 795821 803186 810540 817933 825135 831294 835434
62108 835434 837072 836329 833854 830767 828283 826993 826550 826083 824729 821859 817266 811416 805310 799811 795149
62093 795149 791073 787395 784366 782651 782809 784623 787101 789475 792036 795650 800630 806621 813462 821501
62079 821501 831008 841882 854040 867514 882038 897121 912672 928932 945667 962169 978271 994581
62067 994581 1011241 1027226 1041512 1054391 1066979 1079910 1093220 1107126 1122076 1138081 1154493
62056 1154493 1170358 1184540 1195819 1203529 1208120 1210658 1211739 1211090 1207989 1201635 1191368 1176982 1158827
62043 1158827 1137263 1112221 1083634 1052067 1018387 983056 946375 909373 873708 840428 809261
62032 809261 779415 750808 724280 700741 680389 662722 647190 633697 622379 613016 604900 597328
62020 597328 589946 582621 575315 568233 561698 555654 549686 543780 538647 534876 532039 529157 525888 522827
62006 522827 520669 519383 518254 516602 514559 513241 513907 516838 521260 526346 531792 537297 542207 546141
61992 546141 549435 552448 554879 556248 556561 555846 553535 548996 542392 534323 525009 514600 503933 494048
61978 494048 485146 476924 469692 464067 459593 454877 449420 444257 440369 437423 434675 432281 430907 430540
61964 430540 430441 430072 429456 428841 428472 428610 429368 430539 431742 432629 432865 432251 431076 430087 429852 430296 431081 432233
61946 432233 434174 437291 441633 446947 452922 459585 467408 476792 487399 498385 509382 520842 533254
61933 533254 546390 559584 572364 584522 595912 606557 616732 626525 635473 642978 648940 653588
61921 653588 656831 658207 657474 654884 650816 645588 639847 634724 631140 629038 627726 627084 628028 631528 637475
61906 637475 644935 653361 663008 674029 685702 696925 707122 716211 723881 729433 732431 733138 732148 729810
61892 729810 726111 721071 715186 709406 704522 700526 696797 692968 689312 686116 683108 679787 675921 671291
61878 671291 665322 657569 648377 638498 628230 617479 606517 595969 586039 576481 567465 559806 554060
61865 554060 549898 546656 544081 542304 541465 541664 542999 545450 548938 553553 559506 566871 575786 586799
61851 586799 600398 616119 632830 650113 668701 689196 710989 732886 754174 774503 793200
61840 793200 809492 823132 834182 842314 846971 848145 846472 842612 837055 830479 823690 817115 810875
61827 810875 805499 802097 801536 803797 808416 815223 824164 834472 844507 852647 858194 861243 861870 859780
61813 859780 854749 847036 837005 824519 809173 791260 772176 753587 736254 719851 703843 688242
61801 688242 673416 659351 645490 631430 617585 604843 593584 583393 573828 565061 557473 550945
61789 550945 544969 539267 533914 529022 524737 521457 519504 518526 517720 516747 515990 515794 515875 515707 515180 514649 514595
61772 514595 515299 516555 517616 517795 517268 517030 517971 520306 523869 528418 533437 538243 542668 547257 552434
61757 552434 557835 562934 567979 573803 580823 588603 596285 602995 607924 610484 610565 608493 604733 599736 593917
61742 593917 587523 580587 573230 565968 559490 554095 549496 545163 540734 536107 531311 526430 521702 517644
61728 517644 514888 513700 513711 514317 515301 516784 518628 520277 521385 522335 523937 526690 530334 533972 536734
61713 536734 538617 540644 543797 547711 550815 551859 550926 548861 546274 543320 540016 536293 532065 527568
61699 527568 523379 519816 516580 513229 509699 506085 502309 498392 494697 491484 488503 485513 482875 481043
61685 481043 479632 477651 474633 471013 467368 463859 460499 457457 454848 452605 450794 449710 449394 449292 448653
61670 448653 447172 445079 442751 440450 438327 436444 434743 433150 431803 431066 431206 432056 433149 434210 435386
61655 435386 436911 438726 440621 442594 444844 447485 450481 453717 456800 458949 459605 459232 459082 460013 461838
61640 461838 463830 465355 465960 465533 464722 464621 465530 466478 466497 465950 465915 466550 466888 466279 465216 464403 463561 461681
61622 461681 458360 454518 451633 450365 449979 449149 447251 444736 442358 440400 438741 437216 435575 433334 430097
61607 430097 426032 421765 417753 413879 409576 404309 398142 391954 386852 383112 379884 376164 371848 367613
61593 367613 363966 360795 357744 354647 351479 348126 344366 340129 335827 332316 330247 329417 328993 328449 327927
61578 327927 327579 327028 325855 324281 322948 322228 322087 322455 323323 324544 325860 327093 328109 328723 328819 328459 327759
61561 327759 326873 326283 326713 328380 330548 332239 333279 334336 335991 338085 339943 341078 341725 342720 344622
61546 344622 346822 347892 347061 345089 343467 343093 343978 345739 347891 349949 351779 353730 356125 358877 361876
61531 361876 365265 368886 371881 373497 373984 374059 373743 372494 370329 367973 365825 363501 360625 357490 354710
61516 354710 352576 350966 349590 348272 347188 346785 347206 347987 348609 349108 349710 350155 350044 349690 349903 350862 351821
61499 351821 352034 351536 350945 350970 352124 354402 357151 359650 361769 363748 365512 366797 367790 368941 370228 371293
61483 371293 372250 373568 375145 376349 377116 378057 379343 380466 381464 383293 386271 389122 390501 390755 391184 392063
61467 392063 392500 392038 391272 390786 390408 389780 388986 388197 387208 385734 383922 382253 381095 380516 380392 380505 380614
61450 380614 380601 380518 380461 380456 380516 380785 381529 382970 385144 387891 390931 393986 396880 399591 402165 404526 406509
61433 406509 408184 410040 412544 415616 418778 421786 424653 427071 428391 428455 427910 427366 426738 425834 425084 425011
61417 425011 425401 425690 425923 426565 427533 428198 428312 428181 427918 427266 426268 425354 424558 423279 421062 418070 414712
61400 414712 411411 408871 407766 407775 407525 405992 403532 401226 399652 398663 397915 397210 396635 396630 397574 399150 400551
61383 400551 401492 402487 403895 405395 406749 408435 410934 413996 417190 420663 424635 428585 431752 434250 436887
61368 436887 440045 443453 446951 450624 454107 456565 457718 458280 459028 459979 460921 462253 464635 467993 471568
61353 471568 475036 478991 483963 489411 494297 498466 502751 507571 512078 515160 516820 518002 519383 521039
61339 521039 523095 525855 529190 532488 535484 538550 541912 545136 547774 549994 552121 553896 554665 554105 552427
61324 552427 550103 547744 546020 545256 545178 545319 545589 546225 547320 548733 550471 552929 556698 562162 569205 577271
61308 577271 585823 594796 604534 615282 626869 638822 650543 661374 670793 678599 684788 689304 692103
61295 692103 693316 693033 691073 687371 682426 676868 670705 663620 655961 648691 642208 635943 629420 623072
61281 623072 617618 613119 609048 604952 600783 596944 594188 593053 593198 593742 594317 595234 596579 597925 599193
61266 599193 600942 603432 606224 609238 613356 619260 626447 634120 642317 651196 659790 666655 671482 675106
61252 675106 678094 680350 682091 684147 686961 689942 692064 692713 691881 690023 687796 685624 683489 681412 679852
61237 679852 679188 678997 678400 676963 674766 671853 668322 664914 662817 662752 664634 668022 672333 676769 680791
61222 680791 684758 689498 695114 700888 706430 712228 718775 725790 732737 739574 746441 752950 758431 762829
61208 762829 766865 771138 775350 778648 780637 781864 783277 785459 788627 793147 799478 807514 816495 825963
61194 825963 836436 848714 862715 877376 891540 904535 916039 925809 933551 938857 941394 941404 939829
61181 939829 937650 935189 932206 928375 923469 917456 910746 903999 897296 889879 881143 871441 861360 850675
61167 850675 838803 826003 813282 801213 789564 778063 766774 755703 744801 734388 724889 716079
61155 716079 707346 698893 691933 687344 684743 683212 682377 682390 683291 684799 686370 687057 685627 681300 674391
61140 674391 666090 657686 650032 643429 637828 633209 629775 627663 626667 626567 627613 630202 634155 638819 644013
61125 644013 650406 658792 669402 682030 696341 711786 727728 744071 761530 780921 802309 825083
61113 825083 848617 872515 896398 919861 942767 965339 987769 1009784 1030722 1050091 1067915
61102 1067915 1084288 1098625 1109646 1116301 1118509 1116865 1111909 1103953 1093339 1080429 1065411 1048422
61090 1048422 1029792 1009959 989260 968051 946816 925901 905306 885013 865317 846524 828604
61079 828604 811531 795690 781563 769237 758627 749868 742950 737331 732515 728729 726335 724814 723261
61066 723261 721822 721676 723419 726310 729449 732947 737513 743414 750293 757645 765165 772949 781611 791839
61052 791839 803694 816640 830361 845137 861284 878748 897472 917656 939269 961661 984141
61041 984141 1006840 1030679 1056499 1084371 1113734 1144092 1175478 1208097 1241661 1275499 1309532
61030 1309532 1344675 1381862 1421003 1461404 1502900 1545986 1591039 1637986 1686580 1736508 1787542
61019 1787542 1840265 1896428 1957848 2025152 2098322 2178187 2266468 2364532 2473167 2593703 2728569
61008 2728569 2881017 3055557 3258944 3500056 3789269 4139239 4565926 5087172 5720473
60999 5720473 6483970 7398668 8485421 9757843 11219687 12864990 14664224 16532323
60991 16532323 18310796 19805263 20871976 21489100 21754145 21818593 21823135 21872183 22025389
60982 22025389 22271840 22502399 22530832 22176916 21356483 20110597 18564023 16861044 15124981
60973 15124981 13447041 11886840 10475371 9222211 8125157 7175994 6361746 5666457
60965 5666457 5074770 4573496 4149991 3791027 3484243 3219857 2990426 2789821 2613032
60956 2613032 2456298 2316707 2191795 2079719 1979382 1889966 1810347 1739075 1674750 1616249
60946 1616249 1562486 1511981 1462943 1414243 1366248 1320168 1276487 1234536 1193748 1154573 1117750
60935 1117750 1083295 1050748 1019862 990474 962192 934855 908956 885019 862878 842070 822568
60924 822568 804526 787663 771547 756253 742136 729178 717129 706032 696066 687081 678836 671444
60912 671444 665079 659570 654823 651248 649071 647515 645455 642746 640183 638279 636774 635314 633889 632520
60898 632520 631052 629330 627228 624646 621797 619223 616999 614278 610296 605616 601647 599084 597464 596054
60884 596054 594377 592004 588679 584708 580519 575863 570264 564194 558875 554658 550448 545117 538817 532602
60870 532602 527304 523130 519784 516639 513213 509798 507246 505926 505296 504695 504075 503694 503579 503653 504057 504974
60854 504974 506319 507824 509223 510252 510751 510911 511154 511629 512102 512415 512717 513035 512942 511931 510012 507710 505536
60837 505536 503517 501175 497971 493840 489245 484667 480243 476005 472127 468691 465561 462882 461329 461260 461873
60822 461873 461858 460864 459671 458965 458567 457980 457044 455885 454701 453722 452922 451725 449550 446700 444104 442070
60806 442070 439975 437375 434693 432435 430424 428348 426455 425045 423642 421437 418399 415311 412700 410316
60792 410316 407742 405067 402654 400544 398459 396408 394957 394683 395377 396106 396172 395741 395269 394615 393257 391322
60776 391322 389790 389437 389964 390461 390509 390486 390886 391669 392388 392834 393332 394289 395596 396812 397922 399452 401608
60759 401608 403728 405039 405718 406703 408610 411257 414110 416707 418694 419980 420908 421913 422982 423785 424227
60744 424227 424491 424627 424550 424329 423977 423013 420827 417489 413695 409911 406122 402392 398964 395716 392196 388422
60728 388422 385006 382242 379697 377029 374589 372885 371972 371788 372455 373746 374745 374687 373861 373108 372667 372074 371053
60711 371053 370002 369539 369925 370866 371635 371522 370495 369382 369090 369706 370592 371303 372048 373190 374548 375465 375570
60694 375570 375328 375626 376822 378426 379854 381164 382668 384105 384846 384969 385501 387302 390123 393080 395648
60679 395648 397815 399584 400842 401720 402685 404130 406052 408254 410799 414025 417908 421510 423431 423088 421254
60664 421254 419103 417017 414721 412147 409518 406741 403496 399953 396749 394169 392051 390564 390336 391458
60650 391458 393072 394369 395418 396622 397868 398772 399349 399887 400433 400883 401347 401890 401989 400706 397526 392917
60634 392917 388124 384407 382217 381036 380185 379666 379832 380406 380565 380109 379762 380027 380532 380944 381715 383204 384719
60617 384719 385363 385343 385521 385975 385989 385416 384995 385132 385259 384787 384025 383724 384139 385031 386249 387811 389466 390590
60599 390590 390658 389797 388800 388544 389283 390515 391599 392436 393418 394812 396326 397360 397654 397691 398399 400270 402787
60582 402787 404917 406195 407071 408135 409443 410824 412413 414422 416626 418572 420267 422268 425178 429371
60568 429371 435140 442623 451447 460825 470270 480083 490925 502938 515319 526653 535685 541916 545635
60555 545635 547438 547737 546661 544294 540887 536883 532821 529222 526517 525035 524988 526345 528812 532094 536266
60540 536266 541787 549153 558576 569977 583094 597590 613192 629761 647135 664868 682133 697796
60528 697796 710563 719324 723639 723809 720343 713626 704392 694134 684400 675736 667738 660039 652664 645547
60514 645547 638434 631507 625523 621119 618365 617122 617321 618758 621175 624756 630024 637093 645609 655695
60500 655695 668254 683979 702702 724256 749405 779275 814121 853233 895733 940917 987959
60489 987959 1035662 1082476 1126568 1166208 1200280 1227990 1247899 1257909 1256779 1245119 1224331 1195037
60477 1195037 1157373 1112514 1063022 1011635 960282 910189 862240 817023 774994 736748 702905
60466 702905 673572 648135 625570 605005 586179 569506 555367 543237 531881 520608 509835
60455 509835 500127 491345 483235 476207 470695 466171 461683 457185 453469 450882 448946 447264 445938 444898
60441 444898 443559 441492 438956 436497 434398 432698 431420 430615 430374 430777 431535 431841 431054 429560 428484 428473
60425 428473 429166 429847 430142 429993 429404 428477 427450 426533 425854 425552 425662 426027 426546 427406 428696 429989 430775 431244
60407 431244 432158 433907 436131 438261 440006 441316 442392 443794 446001 448730 451123 452842 454531 457001
60393 457001 460257 463590 466320 468268 469783 471526 474054 477355 480833 483813 486055 487844 489753 492228
60379 492228 495173 497944 499918 501080 501974 503234 505212 507735 509992 511048 510877 510596 511290 512928 514886
60364 514886 516995 519290 521121 521585 520900 520348 520650 521280 521691 522268 523546 525236 526765 528265 530309 532929
60348 532929 535589 538093 540998 545047 550421 556436 561782 565182 566149 565180 563165 560733 558137 555424 552455
60333 552455 548980 544964 540773 536868 533406 530262 527346 524726 522397 520001 516895 512765 508287 504832
60319 504832 503174 502640 501948 500765 499922 500149 501229 502612 504302 506746 510179 514487 519557 525477 532469
60304 532469 540823 550866 562860 576854 592492 608825 624508 638483 650465 660405 667570 670591
60292 670591 668593 662014 652262 640836 628809 616761 604932 593533 582967 573668 565847 559523 554588
60279 554588 550549 546507 541898 537059 532583 528335 523788 519082 514868 511090 506957 502384 498440 495880
60265 495880 494078 492009 489485 486723 483514 479846 476788 475557 475826 476004 475226 474147 473635 473618 473621 473658 473990
60248 473990 474482 474806 475024 475453 476038 476387 476417 476552 477145 478001 478705 479192 479721 480394 481028 481548 482241 483499 485526
60229 485526 488418 492238 496754 501305 505328 509001 513040 517852 523090 528070 532406 536238 540112 544720
60215 544720 550559 557683 565782 574427 583184 591669 599738 607520 615134 622549 629966 637994 646997 656401
60201 656401 665154 672838 679855 686585 692917 698621 703686 708067 711577 714171 715945 716799 716527 715331 713691
60186 713691 711590 708475 704251 699711 695522 691277 686121 680012 673794 668181 663180 658475 653898 649439
60172 649439 645087 640869 636999 633864 631724 630304 628825 626726 624300 622304 620954 619689 618004 616064
60158 616064 614331 612994 612015 611376 610962 610494 609886 609569 610243 612361 615835 619979 623711 626201 627530 628489
60142 628489 629711 631336 633497 636502 640296 644261 647980 651821 656365 661585 666961 672191 677331 682447
60128 682447 687464 692290 696842 701028 704857 708427 711718 714627 717279 719987 722845 725736 728869 732795
60114 732795 737579 742388 746191 748578 749683 749830 749556 749423 749328 748359 745819 742020 737714 733240 728739 724654
60098 724654 721172 717550 712857 707313 702138 698111 694998 692385 690312 688865 687794 686896 686309 686128 686043
60083 686043 685592 684595 683204 681749 680560 679708 678831 677465 675522 673206 670466 666847 661960 655861 648968
60068 648968 641865 635114 628888 622772 616304 609758 603907 598828 593507 587083 580178 574416 570676 568312
60054 568312 566210 564125 562638 562074 561988 561789 561476 561537 562386 564193 567095 571205 576350 582033 587786 593432
60038 593432 599003 604577 610216 615896 621428 626425 630285 632293 632072 630123 627521 624715 621020 615765
60024 615765 609543 603563 598079 592353 586102 579877 573843 567360 560277 553621 548196 543269 537596 531163
60010 531163 524947 519312 513684 507779 502235 497821 494656 492391 490719 489542 488911 488911 489407 489995 490400 490786
59994 490786 491449 492419 493622 495211 497398 500177 503512 507531 512238 517297 522496 528090 534236 540347 545503
59979 545503 549232 551465 552050 550959 548729 546017 542842 538897 534466 530325 526756 523419 520256 517817
59965 517817 516445 515797 515432 515353 515704 516407 517470 519234 521939 525233 528408 530966 532810 534118 535213 536383
59949 536383 537579 538351 538231 537215 535909 535281 536119 538408 541148 542999 543252 542186 540510 538599 536310
59934 536310 533513 530712 528955 528913 530216 532050 534297 537507 541724 546089 550029 554199 559607 566327 573763
59919 573763 581790 590760 600444 609805 617955 624819 630738 635954 640590 644718 648306 651364 654163 656988
59905 656988 659778 662311 664636 666874 668645 669178 668052 665496 662031 658176 654461 651351 649062 647679
59891 647679 647283 647705 648436 649199 650360 652305 654687 656880 658995 661752 665446 669689 674154 678900 683891
59876 683891 688826 693538 698094 702446 706405 709879 712644 714077 713796 712421 710972 709618 707818 705578
59862 705578 703525 701701 699365 696297 693260 690748 688303 685616 683308 681866 680666 678945 677158 676483
59848 676483 677394 679518 682533 686362 690702 695057 699119 702589 704887 705652 705296 704444 703077 700940 698638
59833 698638 697430 697758 698607 698544 696949 694074 690405 686249 681744 677009 672319 668068 664397 661060 657917
59818 657917 655404 654048 653580 653014 651716 650004 648534 647534 646860 646453 646294 646052 645117 643079 640099 636798
59802 636798 633846 631538 629641 627712 625664 623925 622784 621689 619487 615553 610463 605435 601285 598121
59788 598121 595738 593820 591815 589174 585991 583034 580890 579333 577808 576227 574896 573931 573269 573129 573921
59773 573921 575561 577337 578681 579814 581399 583794 586856 590397 594506 599334 604683 610010 614989 619941
59759 619941 625580 632287 639831 647721 655588 663229 670657 678241 686462 695364 704529 713672 722822 731745
59745 731745 739716 746251 751585 756036 759373 761359 762421 763110 763214 762119 759816 756873 753568 749835 745956
59730 745956 742524 739651 736890 734082 731681 730100 729208 728585 727879 726946 726021 725644 725976 726380 726167 725529 725052
59713 725052 724640 723752 722545 721810 721842 722380 723679 726499 730728 735102 738795 742376 746706 751761 757162 763043
59697 763043 769628 776526 783119 789263 795106 800681 806169 812005 818144 823597 827290 829042 829357 828701 827492
59682 827492 826256 825140 823536 820741 816743 811953 806556 800604 794379 788075 781459 774352 767189 760496
59668 760496 754085 747381 740413 733901 728452 724171 721035 719182 718750 719802 722380 726369 731336 736775
59654 736775 742494 748602 755162 761982 768688 774885 780376 785181 789099 791290 790704 787001 780723 772491
59640 772491 762599 751474 739923 728517 717230 706013 695309 685681 677370 670574 665619 662339 659648
59627 659648 656255 651642 646059 639940 633646 627438 621254 614752 607838 600853 594056 587372 580882 575021
59613 575021 569964 565381 561190 557937 555955 554791 553985 553816 554591 555827 556875 557863 559203 560618 561534
59598 561534 562005 562358 562292 561319 559893 559089 559191 559547 559759 560059 560476 560566 560167 559566 558779 557439 555629 553987
59580 553987 552697 551140 548914 546444 544094 541335 537457 532701 528104 524433 521709 519622 517951 516634
59566 516634 515691 515097 514623 513984 513247 512871 513132 513679 513934 513809 513782 514223 514915 515373 515535 515937 517176 519347
59548 519347 522124 525235 528677 532526 536791 541396 546127 550771 555713 562235 571633 583966 598277 614111
59534 614111 631935 651513 670547 685738 695038 698529 697676 694452 690823 688009 685971 684013 681922
59521 681922 680134 678919 677964 676805 675206 672999 669937 665838 660643 654329 646967 638795 630026 620712
59507 620712 611092 601866 593734 586727 580397 574564 569508 565436 562185 559519 557427 555941 554853 553798
59493 553798 552673 551922 552222 553651 555319 556291 556832 558188 560955 564339 567358 570117 573329 577108 580985
59478 580985 584830 589014 593673 598374 602588 606194 609572 613382 617975 622825 626853 629544 631287 632377
59464 632377 632362 630991 629176 628187 628276 628883 629964 632282 636502 642622 650183 658323 665871 672177 677835 683918
59448 683918 690500 696629 701668 705876 709554 712334 713552 712827 710096 705518 699477 692366 684368 675810
59434 675810 667587 660737 655536 651463 647960 644845 642113 639847 638350 637945 638694 640646 644177 649653 656953
59419 656953 665746 676017 687832 700883 714790 729558 745143 760987 776755 793132 810747 828258
59407 828258 842442 850468 851538 846496 836946 825039 813232 803500 796950 794241 795811 801309 809017
59394 809017 815986 818866 815267 805083 790493 774145 757426 740770 724960 711107 699567 689908
59382 689908 681992 676206 672554 670419 669368 669477 670693 672656 675265 678705 682757 686800 690656 694749
59368 694749 699319 704186 709314 714865 720587 725953 731054 736544 742559 748531 754267 760375 767367 775154
59354 775154 783687 793220 803620 814281 825186 837226 850958 865708 880416 894782 909101 923497
59342 923497 937800 951795 965175 977528 988440 997306 1003163 1005451 1004935 1002991 999859 994489 986338
59329 986338 976345 965755 954945 943865 932695 921447 909713 897500 885638 874782 864645 854786
59317 854786 845483 837160 829598 822385 815641 809589 803884 798021 792060 786384 781109 776220 771886 768129
59303 768129 764627 761333 758916 758112 759045 761605 766057 772658 780930 789684 797472 802741 804071 800818 793328
59288 793328 782367 768822 754093 739956 727460 716464 706712 698729 693189 690051 689013 690249 693969
59275 693969 699713 706809 715189 725021 735822 746687 757304 768109 779427 790926 801902 811736
59263 811736 820097 826840 831649 833876 833133 830088 826059 821640 816367 809914 802859 795790 788400 780118
59249 780118 771182 762489 754736 748151 742636 737790 733243 729406 727347 727510 729080 731054 733298 736070
59235 736070 739140 742055 744751 747239 749213 750566 751801 753221 754135 753546 751209 747460 742557 736925 731531
59220 731531 727123 723367 719436 715168 710946 706807 702511 698321 694934 692648 691096 689707 688058 686043
59206 686043 684077 682767 682026 680999 679252 677390 675998 674758 673352 672419 672614 673366 673734 674073 675601 678593
59190 678593 682194 685955 690304 695355 700317 704399 707543 710089 712445 715231 719018 723713 728704 733661
59176 733661 738616 743315 747239 750360 753239 756244 759274 762365 765962 770402 775585 781337 787610 794163
59162 794163 800405 805719 809731 812290 813436 813302 811800 808561 803499 797228 790501 783469 775876 767754
59148 767754 759372 750738 741683 732376 723223 714316 705452 696606 688032 679955 672504 665775 659583 653446
59134 653446 647190 641355 636491 632345 628265 624234 620949 618990 618392 618910 620306 622509 625824 630806 637567
59119 637567 645466 653771 662307 671166 680322 689967 700682 712662 725146 737204 748688 759825 770330
59106 770330 779651 787716 794835 801186 806884 812042 816161 818115 817519 815542 813522 811487 808969 806443
59092 806443 804596 802743 799610 795538 792364 790991 790452 789565 788146 786200 783192 778806 773546 767955 761833
59077 761833 754648 746281 737173 728208 720435 714225 708720 702816 696620 691100 686342 681262 675241 669045
59063 669045 663719 659413 655709 652298 648845 644858 640217 635381 630739 626186 621614 617317 613628 610604
59049 610604 608306 606882 606101 605256 603833 602056 600607 600064 600543 601553 602236 602164 601852 602079 602927 603987 605274
59032 605274 607250 610020 613243 616867 621274 626697 633127 640844 650371 661782 674559 688153 702155
59019 702155 716037 729375 742303 755034 766922 776542 782743 785237 784459 781549 778103 775022 771665
59006 771665 767002 761459 756772 754127 753445 754421 757104 761285 766313 771769 777448 782544 785876 787273 787840
58991 787840 788508 789080 789032 788439 787717 787035 786241 784867 782187 777987 773297 769589 767207 765407 763942 763617
58975 763617 765151 768494 773517 780423 789193 799484 811295 824790 839251 853246 866191 878829
58963 878829 891804 904720 916923 928226 938403 946906 953576 958753 962222 962856 959782 953095 943176
58950 943176 930307 915407 900042 885053 870015 854628 839667 825895 813002 800450 788569
58939 788569 777917 768221 758847 749919 742252 736540 733056 731646 731499 731434 730875 730162 729639 729141 728627 728474
58923 728474 728643 728361 727221 725881 725129 724975 725155 725693 726296 726076 724774 723625 724154 726488 729507 732177
58907 732177 734179 735871 738365 743135 750735 760195 770184 780429 791487 803694 816938 830982 845372
58894 845372 859443 873009 886728 901320 916830 933069 950269 968754 988298 1008294 1028173
58883 1028173 1047351 1065203 1081419 1095895 1108131 1117422 1123884 1128365 1130875 1130062 1124954 1116448 1106298
58870 1106298 1095287 1083178 1069868 1055780 1041476 1027585 1014787 1003367 993058 983590 974872 966431
58858 966431 957472 947860 938190 928477 917834 906149 894984 885867 878513 871687 865014 858766 852464
58845 852464 844978 835811 825441 814578 803776 793398 783264 772732 761724 751135 741617 732654
58833 732654 723697 715442 708910 703771 698734 693337 688283 684218 681195 679248 678606 679236 680778 682920 685418
58818 685418 688036 690934 694703 699450 704290 708395 712098 716232 720794 725029 728495 731283 733464 735029
58804 735029 736129 736799 736693 735615 733850 731453 727808 722587 716567 710668 704725 698148 691405 685828 682073
58789 682073 679585 677518 675519 673804 673030 673869 676249 679351 682786 687179 693044 699758 706410 712914 719424
58774 719424 725278 729552 732147 733277 732426 728975 723500 717234 710491 702743 694166 685826 678317 671258
58760 671258 664392 658233 653324 649546 646463 643901 642042 641244 641690 642890 643817 643935 643797 644183 645066 645966
58744 645966 646911 648371 650575 653545 657493 662586 668573 675101 682035 689053 695451 700934 706046 711298
58730 711298 716460 721304 726254 731580 736677 740939 744587 747694 749249 748367 745861 743442 741886 741138 741688
58715 741688 744375 748986 754260 759269 763895 768141 771904 775224 777879 778920 777463 773653 768124 761014
58701 761014 752334 742659 732352 720654 706737 691248 675673 660622 645997 632359 620689 610983
58689 610983 602402 594644 587940 581939 575907 569906 564458 559189 553199 546776 541396 537891 535779 534436
58675 534436 533631 532864 531562 530305 530663 533384 537618 542251 547120 552690 559383 567539 577322 588320 599610
58660 599610 610164 618846 624464 626594 626103 624137 620934 616266 610462 604134 597439 590542 584156 578604
58646 578604 573039 566793 560796 556276 552757 548931 544935 542029 540432 539314 538711 539518 541596 543737 545637
58631 545637 548118 551175 553514 554418 554478 554187 553407 552568 552722 553895 554892 555306 556287 558755 562229 566033 570284
58614 570284 574978 579367 583123 587102 592171 598002 603594 608277 611770 614031 615514 616966 618656 620259
58600 620259 621490 622263 622441 622182 622201 622805 623091 622231 621110 621363 623215 625753 628929 633533 639366 645352
58584 645352 651573 659343 669014 679487 690191 701706 713940 725528 735722 745263 754693 763417 771227
58571 771227 779302 788731 799225 810094 821507 834202 848946 866729 888384 913474 940480 968302
58559 968302 996541 1024325 1050295 1073865 1094994 1112501 1124364 1130250 1132167 1132048 1130190 1126579 1122062
58546 1122062 1117318 1112037 1105901 1099137 1091443 1081595 1068786 1053234 1035093 1014104 990773 966538
58534 966538 942213 917639 893268 870574 850403 832374 816387 803120 792417 782838 773573 765383
58522 765383 758976 753880 749559 746147 743480 740912 738598 737328 736567 734517 730841 727459 725789 725040 724140
58507 724140 723415 723178 722511 720804 718960 717834 716930 715810 715218 715614 716057 715772 715410 715611 715868 716036 717377
58490 717377 720752 725220 729809 735257 742595 751409 760982 771916 785109 800252 816707 834780 854673
58477 854673 875217 894948 913496 930681 945259 955796 961938 963864 961550 955488 947041 937172 926065
58464 926065 914810 905803 900258 896816 893940 892326 893582 897886 904408 912864 923129 934299 945497
58451 945497 956764 968064 978309 986333 991730 993865 991432 984105 973481 961463 948888 936436
58439 936436 925212 915406 906011 896993 890079 886292 884426 883230 883374 885955 890724 897215 905917 916926
58425 916926 928998 941243 954070 967222 978885 988124 996115 1003335 1007692 1007395 1003690 998727 992673
58412 992673 985050 977007 969783 962441 953518 943719 934831 927256 920591 915275 911640 908664 905626 903633
58398 903633 903707 904917 906315 908966 913925 919913 925267 930560 936976 943770 949747 955698 962759 969797 975046
58383 975046 979036 983410 988125 992343 996765 1002480 1008679 1014030 1019192 1025506 1032435 1038862 1045706 1054620
58369 1054620 1065203 1076013 1087196 1099641 1112714 1125409 1138581 1153553 1169679 1185704 1202131
58358 1202131 1219617 1236459 1250514 1262351 1273716 1284199 1292357 1298794 1305065 1310693 1314410 1317360
58346 1317360 1321970 1328528 1335756 1343738 1353327 1363666 1373385 1383457 1395934 1410745 1426510 1443427
58334 1443427 1462405 1482361 1501453 1520026 1539456 1559110 1577340 1594321 1610978 1626384 1639229
58323 1639229 1650499 1661559 1671128 1677509 1682339 1688615 1696385 1703989 1712069 1722491 1734595 1746452 1758763
58310 1758763 1773572 1790281 1806896 1824158 1844355 1866977 1889578 1912052 1936107 1961402 1986219
58299 1986219 2011020 2037377 2064289 2089534 2113644 2138624 2163960 2188055 2212282 2239228 2268115
58288 2268115 2296358 2324415 2354647 2386760 2419002 2452546 2489835 2529865 2570014 2611184 2656137
58277 2656137 2704137 2752412 2801446 2853449 2907157 2959859 3013124 3070584 3131388 3191823 3252105
58266 3252105 3315301 3380961 3446364 3512832 3584037 3659048 3733880 3808812 3887188 3968108 4047708
58255 4047708 4126750 4209361 4295118 4380220 4465806 4557053 4654570 4754820 4858541 4970300 5089973
58244 5089973 5213213 5340167 5475213 5618463 5766447 5920811 6087091 6265150 6450256
58235 6450256 6643125 6849044 7067671 7294382 7531406 7786568 8061154 8350442 8656056
58226 8656056 8985668 9340429 9715422 10112925 10542188 11005823 11500279 12030177 12607572
58217 12607572 13236404 13913224 14644212 15445269 16324367 17281479 18327564 19485448 20770656
58208 20770656 22191625 23771452 25549199 27558648 29829891 32415917 35395055 38847845
58200 38847845 42863421 47577452 53180253 59891605 67967330 77734479 89575430 103865191
58192 103865191 120955960 141196169 164859326 191998982 222388791 255482394 290073315
58185 290073315 323698126 352520061 372347167 380344884 376167544 361739630 340121463
58178 340121463 314389516 286996646 259555179 232925429 207530748 183683894 161691721
58171 161691721 141768713 123977716 108277956 94574181 82711693 72485744 63692372
58164 63692372 56154228 49698864 44151451 39364565 35230590 31656253 28548750 25833854
58156 25833854 23462830 21390698 19565888 17947553 16513264 15241229 14101343 13070242
58148 13070242 12138956 11298728 10533683 9833347 9198123 8625954 8105950 7630179 7199225
58139 7199225 6810923 6455540 6127063 5827664 5555876 5301429 5057048 4825285 4608842
58130 4608842 4403979 4208257 4025302 3856808 3698317 3547280 3406989 3278429 3156468
58121 3156468 3038293 2927638 2826635 2731196 2638532 2551713 2472675 2397866 2324913 2256743 2195072
58110 2195072 2136367 2078139 2022937 1972358 1923235 1873605 1826484 1784027 1743516 1702762 1663999
58099 1663999 1628906 1595056 1560712 1528059 1498464 1469542 1440059 1412801 1389432 1367334 1344467
58088 1344467 1322451 1301895 1279744 1254528 1229520 1207352 1185978 1163157 1140510 1119801 1099393
58077 1099393 1077662 1056049 1035692 1014898 992896 972191 954258 936683 917523 898782 882667
58066 882667 868052 853590 840695 830466 821090 811151 802183 795177 787958 778931 770137 763605 757733
58053 757733 750142 741227 732235 722753 712725 704013 697312 690365 681800 673780 668344 664039 658834 653420
58039 653420 648913 644139 638031 632089 627626 623086 616832 610103 604519 599047 592141 584563 577438 569809
58025 569809 560802 552046 545255 539417 532894 526257 520556 514866 508120 501489 496491 492511 488475 485106
58011 485106 483224 481707 479406 477242 476198 475080 472577 469702 467964 466854 465288 463769 463008 462220 460875
57996 460875 460288 461425 463071 464283 466576 471347 477090 481561 484881 488037 490207 490238 489223 488988 489302
57981 489302 488899 487887 486839 484937 481388 477421 474638 472627 470301 468204 467289 466777 465493 464099 463851
57966 463851 464394 464825 465613 467308 468733 468661 468001 468137 468430 467626 466373 465943 465612 463825 460963 458533 456463
57949 456463 453574 450065 447315 445762 444940 444927 445957 447338 448523 450434 454088 458948 464255 470777 479320
57934 479320 488773 497651 506366 515863 525170 532547 537981 542350 545160 545464 544129 542720 540818 536781
57920 536781 530653 524124 518100 512383 507148 502642 497970 492301 486841 483645 482943 483587 485446 489253 494505
57905 494505 499625 504037 508197 511901 514343 515518 515914 515222 512996 510053 507556 505352 502882 500979 500898
57890 500898 502206 503530 504795 506784 509111 510608 511258 511837 512141 511467 510265 509382 508266 505966 503321
57875 503321 501978 501628 500407 497786 494967 492664 490544 488708 487696 487139 486324 485919 487238 490017 492839
57860 492839 495524 499126 503771 508561 513490 519438 526276 532896 539050 545260 551073 555409 558597 562032
57846 562032 565755 568298 568955 568321 566629 563599 559955 557064 554896 552262 549138 546755 545253 543294 540306
57831 540306 537155 534401 531808 529763 529123 529347 528818 527402 526723 527510 528678 529462 530367 531434 531660 530856
57815 530856 530183 530089 529607 528478 527994 528702 529069 527547 524480 520901 516916 512406 508024 504327 500948 497582
57799 497582 494799 493091 492054 491241 490918 491347 492275 493726 496357 500482 505540 510928 516455 521803 526599
57784 526599 531282 536718 542768 548491 553944 560303 567797 575099 581389 587601 594839 602808 610566 617596
57770 617596 623372 627027 628369 628365 627852 626609 624232 621035 617494 613691 609886 606748 604406 601986 598625
57755 598625 594334 589700 585485 582667 581905 582796 584502 587099 591174 596201 600782 604683 609053 614212 618769
57740 618769 621603 623392 625473 628429 632391 637456 643026 647858 651598 655238 659501 663830 667616 671254
57726 671254 675204 679046 682305 685360 688803 692631 696613 700649 704262 706659 707754 708296 708591 708142 706902
57711 706902 705732 705136 704610 703733 702741 701567 699592 696988 695045 694444 694377 694097 694113 695043 696458 697768 699277
57694 699277 701413 703839 706101 708277 710235 711233 711021 710360 709793 708910 707549 706598 706734 707515 708660 711210
57678 711210 716349 724070 734046 746911 763611 784276 808929 838613 874759 917883 967741 1024067
57666 1024067 1086087 1151550 1216663 1276252 1323652 1352020 1357550 1341512 1308778 1264994 1215379
57655 1215379 1164576 1115897 1070896 1030433 995586 966849 943302 923622 907331 894340 884076
57644 884076 876063 870659 868154 867682 867954 868583 869855 871772 874173 877214 880839 884277 886943 889381 892586
57629 892586 896821 901699 906803 911635 915639 918927 922227 925489 927477 927535 926845 927088 928716 931362 934865
57614 934865 938816 942119 944332 946621 950144 954217 957399 959630 961885 964418 966902 969872 974340 980114
57600 980114 985926 991244 996655 1002402 1007725 1011869 1014846 1017034 1018795 1020498 1022294 1023957 1025470 1027541
57586 1027541 1030939 1035630 1041132 1047211 1053574 1059432 1064230 1068436 1072878 1077789 1083171 1089379 1096325 1102689
57572 1102689 1107041 1109488 1111373 1113764 1117095 1121680 1127507 1133872 1140089 1146219 1152373 1158033 1163023 1168413
57558 1168413 1175308 1183330 1191447 1199647 1208465 1217532 1226136 1234764 1244491 1255070 1265185 1274494 1283894
57545 1283894 1293767 1303455 1312577 1321491 1330269 1338520 1346404 1354637 1363316 1371930 1380685 1390529 1401544 1412489
57531 1412489 1422329 1431239 1439806 1448306 1457093 1466698 1477056 1487402 1497324 1507266 1517774 1528903 1540539
57518 1540539 1552528 1564388 1575675 1586787 1598693 1611732 1625368 1639149 1653154 1667454 1681925
57507 1681925 1696648 1711694 1726431 1739844 1751713 1762762 1773621 1784403 1795311 1806750 1818636
57496 1818636 1830395 1841803 1853221 1864916 1876889 1889368 1902665 1916492 1930165 1943566 1957156
57485 1957156 1971005 1984699 1998299 2012515 2027697 2043375 2058953 2074177 2088832 2102732 2116232
57474 2116232 2130079 2144648 2159844 2175687 2192252 2209063 2225400 2241299 2257486 2274221 2290958
57463 2290958 2307279 2323466 2339995 2357114 2374945 2393395 2411927 2430044 2447944 2466102 2484426
57452 2484426 2502558 2520800 2539797 2559441 2579008 2598297 2617732 2637473 2657439 2678136 2700304
57441 2700304 2723633 2746903 2769589 2792343 2815753 2839630 2863728 2888152 2912784 2937193 2961423
57430 2961423 2986051 3011300 3036835 3062533 3088625 3115046 3141514 3168222 3195542 3223035 3249864
57419 3249864 3276141 3302776 3329971 3357031 3383746 3410719 3438211 3465961 3494293 3524025 3555009
57408 3555009 3586230 3617654 3650450 3684824 3719217 3752406 3784925 3817469 3849271 3879307 3908094
57397 3908094 3937173 3967544 3999456 4032895 4067304 4101527 4134972 4168255 4202065 4236191 4270330
57386 4270330 4304955 4340500 4376468 4412329 4448578 4485954 4524189 4562548 4601086 4640364 4680277
57375 4680277 4720070 4759310 4798162 4836928 4875885 4915233 4954655 4993344 5031081 5068896 5108101
57364 5108101 5148983 5190872 5233118 5275417 5317578 5359491 5401225 5442912 5484868 5527879 5572720
57353 5572720 5619157 5666073 5712841 5759889 5807657 5855726 5903374 5950297 5996487 6042207 6088321
57342 6088321 6135741 6184106 6232015 6279011 6326334 6375155 6425137 6475389 6525762 6576364 6626869
57331 6626869 6677238 6728262 6780373 6832802 6884833 6936955 6989642 7041926 7092646 7142512 7193437
57320 7193437 7246040 7299195 7351955 7404734 7458407 7513223 7568814 7624656 7680326 7735628 7790458
57309 7790458 7844473 7897413 7949941 8003357 8058017 8112798 8166762 8220537 8275225 8330770 8386424
57298 8386424 8442100 8498125 8554125 8609301 8663559 8717380 8770808 8823550 8875903 8928701 8982443
57287 8982443 9037159 9092882 9149493 9206365 9262845 9318888 9374653 9429864 9484278 9538315 9592451
57276 9592451 9646339 9699235 9750904 9801461 9850861 9899303 9947574 9996027 10043649 10089071 10132154
57265 10132154 10173737 10214246 10253461 10291253 10327559 10361933 10394037 10424354 10453637 10482079 10509817
57254 10509817 10537692 10566483 10595868 10625244 10655098 10686425 10719123 10752083 10784580 10816484 10847493
57243 10847493 10877403 10906848 10936487 10965607 10992767 11017627 11040867 11062466 11081444 11097286 11110200
57232 11110200 11119879 11125359 11126363 11123509 11116955 11106101 11090982 11072682 11051851 11027934 11000516 10970634
57220 10970634 10940172 10910606 10882699 10856760 10832717 10810282 10789267 10769472 10750496 10732237 10715311
57209 10715311 10700210 10686280 10672382 10658380 10645055 10632777 10621291 10610585 10600712 10590772 10579360
57198 10579360 10566241 10552429 10538409 10523363 10506381 10487292 10466073 10442510 10416704 10388813 10357961
57187 10357961 10322570 10282204 10238001 10190836 10140171 10085395 10027407 9968203 9909592 9852832 9798802
57176 9798802 9747893 9700105 9655540 9614318 9576030 9540078 9506751 9477097 9451414 9428619 9407422
57165 9407422 9387484 9369228 9353226 9339782 9328130 9315753 9299335 9276740 9247557 9211908 9169750
57154 9169750 9121318 9067051 9006762 8939874 8866698 8788585 8706806 8622499 8537819 8455667 8377706
57143 8377706 8303740 8233444 8167613 8107335 8053095 8005127 7963429 7926923 7893654 7862291 7832331
57132 7832331 7802586 7770754 7735037 7695120 7651270 7603904 7554424 7505118 7457783 7413816 7375867
57121 7375867 7347474 7330271 7323229 7325261 7336770 7358005 7388248 7428121 7480886 7550022 7637156 7743678
57109 7743678 7872588 8027270 8210271 8425182 8678461 8978168 9332956 9754255 10258099
57100 10258099 10863494 11591273 12466883 13522825 14796798 16329491 18165429 20351644
57092 20351644 22930328 25932079 29375451 33266605 37593552 42323006 47406616 52786712
57084 52786712 58393484 64146850 69970495 75785866 81451095 86681875 91052350 94120702
57076 94120702 95599323 95442715 93810099 90965135 87190319 82740171 77821806 72595505
57068 72595505 67191365 61727505 56315542 51055684 46032341 41312789 36945074 32956125
57060 32956125 29354005 26132686 23275018 20754460 18538824 16594882 14890375 13394128
57052 13394128 12077392 10915861 9889441 8980357 8172696 7453373 6811933 6238987 5725682
57043 5725682 5264530 4849618 4475784 4138361 3833699 3558997 3311451 3088283 2887543
57034 2887543 2708011 2548238 2406554 2282069 2174717 2084140 2009518 1950818 1909197 1885567
57024 1885567 1879451 1889277 1912015 1940844 1963873 1967393 1941941 1886104 1805573 1709456 1606651 1503557
57012 1503557 1403575 1308387 1219520 1138506 1065907 1001105 943297 892204 847688 809245 776251
57001 776251 748369 725453 707229 693167 682486 674355 668506 665631 666582 671036 677442 684516 692274
56988 692274 701298 711608 722744 734498 746801 758954 769494 776822 779549 776349 766108 748679
56976 748679 725383 698554 670486 642657 615699 589940 565937 544491 526256 511468 500018
56965 500018 491634 485993 482974 482964 486723 494761 506896 522419 540407 559615 578092 593096 601629
56952 601629 601474 592211 575486 554096 530582 506521 482851 460443 440249 423035 409142 398463
56940 398463 390808 386410 385877 389480 396766 407256 421264 439526 462184 488543 517383 546464 571795
56927 571795 588610 593841 587365 570872 546454 516592 484259 451851 420331 390126 362417 338673
56915 338673 319151 302745 288384 275945 265732 257625 250945 244877 239003 233624 229506 226981 225408
56902 225408 223792 221873 220388 220345 222270 226012 231009 236807 243529 251741 261742 273247 285935 300053
56888 300053 316148 334408 354414 375166 394976 411572 422819 427457 425172 416362 402211 384693
56876 384693 366025 348059 332198 319511 310524 305111 302918 303873 308290 316863 330730 351011 377870
56863 377870 410408 447836 490331 538162 590110 642934 691888 731432 756368 763807 754610 732662
56851 732662 702653 668593 633744 600824 571780 547632 528744 515320 507914 507721 516168 534053
56839 534053 561355 598090 644806 701815 768393 843062 923789 1006648 1084337 1147154 1186355
56828 1186355 1197244 1180127 1139489 1082227 1015511 945267 875967 811005 752575 701489 657940
56817 657940 622597 596592 580554 574257 577257 589426 610837 641484 681040 728440 781488 836743
56805 836743 889362 932894 960338 966862 952029 919165 872888 817734 758411 699639 644824 595288
56793 595288 551224 513045 481566 457236 439678 428109 422184 422362 429263 442576 460937 482995
56781 482995 508132 535558 562957 586416 601677 605475 596539 576212 547975 515628 481670 447346
56769 447346 413530 380936 349959 321139 295540 273989 256163 241082 228213 217343 207724 198376
56757 198376 189176 180878 173989 168353 163722 159978 156810 153877 151303 149328 147586 145477 143164 141405
56743 141405 140388 139501 138200 136407 134152 131643 129670 129016 129413 129882 130086 130415 130830 130726 130179 130242 131579
56726 131579 133636 135554 137105 138455 139748 141294 143410 145745 147479 148518 149745 151728 153917 155593
56712 155593 156862 158226 159701 160891 161494 161414 160783 160195 160455 161793 163667 165481 167063 168330 169081 169284
56696 169284 169081 168389 167019 165262 163770 162795 162129 161769 161889 162121 161733 160764 160128 160279 160527 160058 159034
56679 159034 158389 159023 161294 164671 167797 169547 170132 170497 170834 170647 170233 170791 172761 175168 177038 178440
56663 178440 179702 180723 181604 182927 184730 186120 186539 186585 186987 187638 188269 189141 190375 191370 191628 191453 191200
56646 191200 190530 189083 187187 185266 183329 181563 180639 180731 181072 181178 181585 182594 183244 182562 181069 179906
56630 179906 179100 177790 175764 173671 171958 170520 169226 168075 167027 166187 165828 165775 165302 164128 162845 161821
56614 161821 160529 158730 157424 157540 158389 158535 157726 156861 156456 156308 156419 157135 158392 159733 160963 162057
56598 162057 162655 162469 161998 162014 162509 162890 163047 163443 164308 165395 166382 166909 166547 165383 164328 164122 164391 164435
56580 164435 164541 165497 167057 167984 167721 167194 167750 169874 173072 176472 179436 181927 184355 186979 189722 192637
56564 192637 196016 199769 203449 207380 213002 221305 231415 241503 250588 258745 266016 272007 276252 278291
56550 278291 277713 274781 270624 266178 261481 256582 252370 249582 247667 245663 243667 242324 241378 239959 238014
56535 238014 236220 234601 232450 229624 226944 225171 224351 224151 224192 224180 224294 225147 226729 227903 227720 226674
56519 226674 225753 224892 223498 221956 221199 221048 220360 218698 216568 214163 211216 208147 205991 204964 204272 203537
56503 203537 203244 203554 203775 203362 202497 201451 200295 199429 199414 199969 200039 199184 198090 197418 196964 196309 195588 195250
56485 195250 195556 196597 198303 200321 202250 204003 205546 206545 206888 207276 208484 210205 211391 211610 211303 210921
56469 210921 210638 210755 211466 212327 212848 213427 214803 216712 218117 218651 218799 218700 217920 216549 215487 215399 216149 217382
56451 217382 218825 220017 220592 220859 221377 222040 222404 222705 223573 224891 225981 226751 227608 228313 228169 227381 227069
56434 227069 227776 229037 230450 232039 233442 233883 233189 231902 230258 228083 225708 223954 223060 222642 222684 223428
56418 223428 224294 224212 223226 222571 222923 223784 224722 225955 227422 228502 229078 229799 230965 232182 233328 234762 236323
56401 236323 237302 237673 238211 239121 239765 240021 240733 242365 244327 245945 247096 247648 247457 247160 247752 249134 250276
56384 250276 250997 252190 253965 255126 255081 254867 255587 257032 258484 259774 260915 261767 262548 263709 264901 265206
56368 265206 264698 264562 265305 266176 266756 267678 269241 270744 271828 273120 274907 276498 277564 278802 280682 282848
56352 282848 285294 288617 292377 294839 295261 295068 295805 297315 298856 300558 302710 304816 306475 308121 309978
56337 309978 311518 312818 315107 318924 323018 326145 328687 331415 334055 336391 339481 344276 349953 355001
56323 355001 359135 362854 365991 368033 369271 370444 371679 372658 373243 373339 372908 372627 373555 375585 377419 378615
56307 378615 380215 382706 385051 386728 389012 392934 397636 402174 407380 414205 421610 427955 433353 438828
56293 438828 444232 448879 453363 458791 464860 470505 475976 482504 490282 498369 506373 514822 524112 534258
56279 534258 545344 557125 568642 579325 589990 601759 614618 628047 642270 657761 674207
56268 674207 691181 709161 728795 749844 771943 795666 821806 850379 881325 915354 953115
56257 953115 994596 1040468 1092841 1153368 1221651 1296828 1379640 1471533 1572849 1683451 1804064
56246 1804064 1935401 2076805 2227179 2386083 2552308 2722457 2892712 3060924 3225170
56237 3225170 3381320 3524080 3649587 3755078 3837025 3892043 3919212 3919528 3893666 3842356 3768415
56226 3768415 3676095 3568493 3447432 3315575 3176612 3033468 2888013 2742392 2598950 2459075
56216 2459075 2323658 2194308 2072517 1958078 1849987 1748381 1653905 1565861 1483046 1405916
56206 1405916 1335814 1272365 1213774 1159516 1110559 1066916 1027055 990012 956272 926299 899738
56195 899738 876228 855534 836903 819620 804031 790690 778861 767386 756546 747370 739560 731959
56183 731959 724745 719194 715416 712196 709029 706565 705064 704115 703833 704697 706281 707718 709281 711940 715561
56168 715561 719178 722807 727332 732821 738544 744412 750774 757196 763189 769746 778348 788726 799453 810480
56154 810480 823225 838351 855250 873603 893785 916000 940657 969217 1002997 1041643 1084511
56143 1084511 1132969 1189473 1254911 1328808 1411345 1502802 1601360 1703654 1807188 1910174 2009475
56132 2009475 2101178 2183259 2255895 2319718 2375828 2426850 2475325 2520899 2560860 2592983 2616115
56121 2616115 2629093 2631714 2626112 2614674 2596996 2570993 2535939 2491701 2436138 2366646 2284035 2192118
56109 2192118 2094238 1993288 1894245 1802695 1720589 1646648 1580755 1524568 1477865 1438022 1403654
56098 1403654 1375529 1353497 1335735 1321530 1311748 1305997 1302243 1299647 1299025 1300240 1301972 1304261 1308468
56085 1308468 1314664 1321770 1330066 1340569 1352259 1363178 1373916 1386560 1400618 1413727 1426098 1440240
56073 1440240 1456441 1472674 1488970 1507520 1528199 1548448 1568063 1589685 1613941 1638508 1662663
56062 1662663 1688242 1715282 1741296 1765915 1791694 1819175 1845633 1869972 1894349 1919658 1943902
56051 1943902 1966530 1989912 2014963 2039683 2063587 2089200 2117485 2146050 2173531 2201610 2231243
56040 2231243 2261235 2292005 2326360 2364987 2405473 2447101 2492123 2541049 2591480 2642992 2698299
56029 2698299 2758136 2819906 2882684 2948280 3016003 3082005 3145585 3210572 3278701 3347403 3415976
56018 3415976 3487866 3564562 3643225 3722729 3806125 3894774 3986071 4079324 4177786 4282588 4390983
56007 4390983 4502774 4621742 4748410 4878461 5010873 5150323 5298982 5453630 5613697
55998 5613697 5783939 5965902 6155038 6349866 6555639 6775343 7005814 7246557 7503267
55989 7503267 7778586 8068894 8374564 8703409 9059244 9437366 9836409 10264086 10726059
55980 10726059 11220495 11749239 12322505 12946538 13619199 14344202 15136551 16007236 16957047
55971 16957047 17993263 19137367 20408309 21815030 23375410 25125972 27103811 29339185
55963 29339185 31878869 34798698 38184171 42125801 46752960 52254058 58855694 66816509
55955 66816509 76460132 88176862 102365817 119403143 139664209 163480745 190990587
55948 190990587 222034561 256131183 292226929 328086889 359926529 383138134 394036841
55941 394036841 391398070 376651443 352847937 323410994 291382868 259135249 228287566
55934 228287566 199772958 174038011 151237409 131322456 114088887 99259871 86558604
55927 86558604 75716960 66466123 58560163 51798369 46008683 41028264 36717309 32974039
55919 32974039 29718141 26872002 24369859 22168612 20233537 18523898 17003302 15650997
55911 15650997 14450477 13377572 12410257 11539169 10757590 10050630 9403988 8813798 8278137
55902 8278137 7787565 7333123 6915221 6535548 6187712 5864069 5564319 5289429 5034272
55893 5034272 4794017 4570861 4366914 4177122 3996500 3827818 3674746 3533669 3399632
55884 3399632 3274472 3161629 3058235 2959675 2867117 2783467 2706090 2630120 2555057 2482159 2409388
55873 2409388 2334810 2261191 2191545 2123768 2054820 1986334 1920941 1857021 1792458 1729886 1672917
55862 1672917 1620593 1570498 1523830 1482354 1443742 1405038 1367603 1333803 1302011 1269808 1239053
55851 1239053 1212720 1189367 1165552 1141101 1117360 1092798 1065213 1036171 1008763 982931 957083
55840 957083 932117 909675 888506 866696 845541 827276 810897 794109 777468 762788 749351
55829 749351 735488 722210 711561 702987 694729 687016 680486 673392 663896 653429 644358 636057 626651
55816 626651 616804 608290 600510 591922 583379 576651 571090 565119 559558 556224 554636 553434 553610 556948
55802 556948 562483 567749 572437 577790 583478 588130 591777 594789 595482 591814 584585 576243 567535 557920
55788 557920 548026 538898 529898 520116 510879 504257 500081 496742 493647 490410 485219 476878 467290 459216
55774 459216 452791 446817 442048 440253 441257 443830 448312 455341 462962 467882 468832 466164 459396 448046
55760 448046 433912 419598 405557 391169 377583 366591 357711 349385 342153 337731 335736 334270 332909
55747 332909 332198 331099 328063 323884 320374 316910 311540 304888 299573 296098 292725 289276 287564 287810 287891
55732 287891 286704 285321 284297 282558 279600 276301 272964 268857 264150 260116 256937 253409 249178 245342
55718 245342 242538 240395 239040 239131 240214 241004 241532 243128 246177 249746 253452 257731 262165 265480 267444
55703 267444 268919 269920 269388 266978 263319 258534 252274 245251 238935 233702 228966 225020 222901 222468 222451
55688 222451 222446 223095 224379 225544 226676 228539 230927 232957 234884 237785 241558 245069 248146 251489 254722
55673 254722 256537 256772 256443 255775 254194 252218 251275 251537 251855 251835 252035 252239 251757 251436 253012 256239 258932
55656 258932 260177 261214 262731 263618 263135 262073 260998 259275 256699 254207 252127 249417 245477 241144 237134
55641 237134 233008 228294 223176 217539 210880 203694 197391 192322 187450 182455 178447 175961 173926 171431
55627 171431 168988 167230 165768 164167 162760 161789 160876 159961 159585 159735 159586 158805 157925 157134 156017 154778
55611 154778 154201 154015 152884 150556 148475 147599 147072 145835 144182 142897 141996 141067 139919 138338 136193 134120
55595 134120 133055 132801 132193 130806 129196 127397 124794 121843 120178 120405 121326 121976 122880 124641 126777 128787
55579 128787 131013 133658 136169 138334 140847 144193 148120 152700 158607 165785 173181 180342 187901 195939
55565 195939 203301 209171 213839 217252 218416 217117 214675 211976 208171 202415 195608 189234 183587 178280
55551 178280 173420 169189 165133 160920 157034 153916 151266 148933 147501 147240 147468 147716 148463 149962 151409
55536 151409 152173 152793 153857 154887 155273 155346 155558 155525 154815 153816 152919 151658 149545 146972 144437 141693 138468
55519 138468 135211 132367 129733 127235 125392 124225 122706 120145 117212 114723 112364 109616 106938 104962
55505 104962 103301 101294 99260 98005 97634 97743 98155 98672 98721 98098 97443 97273 97250 97085 97253 97960 98304 97508
55487 97508 96194 95455 95325 95237 95294 96019 97303 98606 99767 100741 101017 100185 98694 97278 96094 95065 94496
55470 94496 94581 94790 94442 93436 91912 89943 88099 87416 88013 88594 88167 87424 87507 88316 89075 89734 90560 91030
55452 91030 90453 89290 88658 88828 89201 89415 89498 89350 89099 89519 91015 92526 92588 91276 90042 89799 90206 90692
55434 90692 91132 91421 91307 90853 90422 90091 89596 88806 87861 86967 86496 87000 88644 90773 92456 93221 93046 92143
55416 92143 91170 91082 92172 93688 94839 95669 96433 96766 96177 94953 93922 93591 93891 94320 94048 92552 90511
55399 90511 89279 89050 88513 86905 85305 85000 85676 86337 87062 88475 90163 91098 91246 91424 91809 91839 91472 91349
55381 91349 91674 91951 91860 91625 91505 91637 92214 93097 93483 92732 91317 90241 89720 89211 88514 88019 88038 88561 89511
55362 89511 90587 91093 90625 89721 89238 89356 89782 90490 91480 92195 92035 91258 90616 90318 90017 89488 88661 87314
55344 87314 85513 84050 83666 84066 84371 84226 83821 83268 82765 82974 84282 85939 86750 86479 85832 85363 85137 85175
55326 85175 85423 85510 85240 85050 85315 85595 85336 84885 84985 85654 86380 87010 87623 87927 87704 87451 87661 87959 87863 87841
55306 87841 88509 89298 89282 88947 89692 91660 93453 94090 93960 93680 93209 92440 91728 91468 91768 92582 93488 93523 92123
55287 92123 90085 88724 88259 87968 87647 87767 88333 88838 89438 90895 93186 95284 96563 97369 97974 98046 97520
55270 97520 96967 96712 96426 95907 95470 95238 94851 94176 93582 93312 93264 93515 94230 94915 94675 93477 92314 91860 91770
55251 91770 91567 91393 91521 91868 92359 93136 94094 94828 95265 95741 96302 96620 96710 97021 97574 97800 97450 96951 96556
55232 96556 95891 94640 93019 91284 89439 87731 86776 86815 87415 88173 89192 90530 91730 92283 92176 91737 91258
55215 91258 90915 90729 90589 90610 91248 92554 93594 93323 91922 90560 90020 90317 91385 93061 94446 94497 93450
55198 93450 92655 92806 93335 93700 94103 94572 94489 93632 92647 91952 91095 89897 89287 90164 92119 94092 95684 97019
55180 97019 97850 97729 96840 95935 95494 95478 95747 96276 96957 97497 97576 97094 96402 96157 96625 97249 97374 97252 97673 98642
55160 98642 99209 98812 98043 97784 98200 98931 99717 100408 100765 100600 99936 98904 97726 96719 95943 95057 93962 93314
55142 93314 93699 94589 94976 94903 95335 96553 97738 98281 98427 98395 97959 97228 96838 96945 96952 96620 96463 96673 96722 96517
55122 96517 96853 98040 99125 99297 99102 99376 99842 99791 99470 99666 100379 100925 101104 101291 101550 101521 101168 100957 101193
55103 101193 101638 101847 101605 101061 100628 100665 101217 102182 103591 105348 106895 107815 108608 110058 111832 112700 112282
55086 112282 111563 111372 111451 111416 111525 111832 111723 111079 110930 111943 113123 113105 112103 111492 111882 112643 113015 112750 111895
55067 111895 110759 109972 109947 110421 110982 111678 112609 113383 113622 113567 113600 113571 113196 112624 111983 110931 109402 108219 108098
55048 108098 108536 108603 108403 108780 109870 110953 111542 111686 111380 110622 109956 110022 110597 110898 110768 110690 110690 110218 109295 108854
55028 108854 109578 111045 112367 113118 113369 113317 113169 113050 112817 112224 111351 110552 110020 109730 109777 110347 111301 112165 112576
55009 112576 112525 112163 111661 111232 111035 111102 111488 112302 113396 114322 114856 115248 115657 115757 115348 114924 115062 115533 115647
54990 115647 115242 114703 114215 113679 113329 113699 114879 116324 117469 118063 117921 116888 115189 113409 112013 111196
54974 111196 111130 111910 113203 114335 114884 115022 115299 116230 117945 119952 121387 121786 121524 121244 121124 120991 120833
54957 120833 120701 120313 119345 118063 117189 117132 117739 118752 120020 121219 121835 121592 120737 119854 119562 120187 121419
54940 121419 122395 122518 122182 122394 123651 125420 126711 127015 126745 126864 127979 129702 131129 131951 132748 134112
54924 134112 136056 138542 142047 147050 153357 160378 167746 175259 182545 189263 195248 199994 202502 202361
54910 202361 200585 198566 196355 192770 187133 180151 173020 166412 160492 155381 151291 148416 146707 145633
54896 145633 144417 142886 141795 141802 142404 142468 141626 140531 139856 139753 140216 141305 142867 144643 146732 149496 152934
54879 152934 156706 160779 165523 171044 176913 182690 188318 193883 199319 204368 208456 210692 210465 208071
54865 208071 204298 199453 193350 186279 179252 173009 167353 161859 156792 152811 149976 147502 144615 141442
54851 141442 138908 137682 137256 136244 133758 130334 127325 125486 124380 123053 121059 118829 117175 116405 115996
54836 115996 115327 114595 114549 115331 116228 116749 117258 118147 119109 119833 120705 122081 123398 123883 123736 123704 123779 123271 122021
54817 122021 120632 119528 118645 118047 118005 118351 118524 118391 118361 118668 119180 119949 121142 122403 123065 123168 123516 124503
54799 124503 125633 126477 127369 128758 130417 131691 132105 131519 130162 128737 128041 128194 128624 128904 129140 129436 129583
54782 129583 129535 129650 130206 131127 132415 134310 136693 138842 140228 141282 143004 145950 149808 153795 157423
54767 157423 161068 165761 172116 179540 186881 193727 200499 207287 213346 217890 220697 221658 220396 216854
54753 216854 211771 206088 200148 193872 187441 181396 176104 171401 166795 161987 157287 153403 150667 148618
54739 148618 146642 144753 143299 142168 141001 140098 140279 141716 143637 145410 147189 149213 151209 153037 155328
54724 155328 158864 163645 169076 174755 180665 186765 192844 198637 203777 207712 209920 210122 208293 204657
54710 204657 199769 194324 188710 182880 176697 170229 163763 157811 153002 149588 147130 145058 143438 142627
54696 142627 142303 141572 140106 138495 137291 136410 135689 135274 135069 134483 133291 132210 132061 132669 133126 132840 131963
54679 131963 131000 130377 130135 129828 128976 127829 127260 127626 128198 128074 127254 126344 125604 124807 123823 122769 121709 120626
54661 120626 119628 118856 118249 117686 117258 117134 117282 117571 118012 118687 119534 120475 121613 123021 124409 125285 125503 125444
54643 125444 125584 125972 126262 126283 126437 127280 128752 130130 130862 131094 131128 130828 130039 129192 128839 128774 128299 127247 126139
54624 126139 125413 125159 125493 126426 127389 127682 127496 127663 128290 128551 128109 127828 128573 130036 131253 131675 131306 130433
54606 130433 129679 129706 130354 130624 130002 129174 128962 129172 129181 129036 129199 129543 129445 128707 127758 127068 126832 127078 127652 128218
54586 128218 128616 129067 129734 130390 130756 130885 130901 130779 130609 130623 130684 130275 129349 128586 128347 128079 127354 126808 127239 128333
54566 128333 129219 129857 130821 131953 132392 132021 131848 132636 133932 134837 135153 135350 135797 136377 136713 136547 136033 135682
54548 135682 135907 136653 137556 138293 138616 138410 138030 138346 139935 142344 144506 145796 146324 146361 145982 145284 144510 143852
54530 143852 143323 142797 142040 140895 139665 139013 139098 139097 138113 136466 135442 135694 136448 136474 135408 133866 132615 132042
54512 132042 132250 133195 134555 135745 136361 136564 136773 136990 136795 136142 135662 135761 135813 134943 133368 132236 132149 132665
54494 132665 133338 134328 135655 136673 136889 136707 136819 137294 137743 137953 137878 137446 136900 136947 138038 139787 141472 142796
54476 142796 143809 144499 144885 145169 145414 145493 145663 146631 148619 150905 152749 154158 155248 155594 154991 154187 153998
54459 153998 154169 154011 153650 153663 153835 153450 152620 152221 152513 152791 152542 151954 151164 149852 147962 146126 145041 144861
54441 144861 145313 145925 146084 145414 144243 143280 142836 142775 143086 143852 144691 144949 144590 144296 144522 144995 145355 145733 146412
54422 146412 147322 148163 148799 149371 150158 151370 152901 154343 155359 155901 155891 155082 153607 152266 151775 151990 152368
54405 152368 152842 153637 154537 155128 155605 156545 157915 159019 159427 159264 158658 157635 156639 156356 156843 157461 157825 158207
54387 158207 158820 159366 159597 159832 160538 161636 162448 162206 160750 158952 158222 159173 160962 162362 163122 163741 164321
54370 164321 164524 164423 164447 164490 164044 163320 163363 164809 167244 169979 172712 175296 177636 180086 183227 187028 190799
54353 190799 194126 197134 199714 201350 201941 201972 201572 200238 197874 195198 192612 189498 185329 180794 177088
54338 177088 174589 172869 171578 170599 169661 168512 167371 166726 166719 167016 167153 166824 166067 165308 164896 164501 163461
54321 163461 161862 160683 160546 160926 161014 160826 160921 161439 161983 162160 161733 160482 158450 156248 154699 154157 154357
54304 154357 154770 154944 154713 154297 154068 154094 154081 153809 153386 153093 153274 154280 155999 157518 157896 157386 157164 157690
54286 157690 158071 157437 156165 155213 154905 155029 155607 156827 158469 160073 161486 162768 163753 164219 164343 164510 164758
54269 164758 164786 164483 164178 164360 165246 166461 167179 166925 166288 166374 167402 168435 168723 168646 168955 169786 170960 172666
54251 172666 175028 177403 178940 179660 180283 181055 181414 180765 179024 176401 173237 170166 167932 166790 166339 166036
54235 166036 165657 165243 164903 164790 165098 165968 167331 168787 169704 169665 168909 168114 167684 167518 167486 167707 168173 168498 168385
54216 168385 168038 167808 167716 167620 167578 167688 167727 167325 166452 165485 164816 164485 164144 163381 162217 161221 160865 160916 160826 160551
54196 160551 160447 160484 160345 160333 161212 162828 163839 163378 162173 161365 160963 160310 159484 159237 159851 160971 162390 164178
54178 164178 166079 167554 168490 169282 170213 171174 171929 172169 171450 169618 167315 165540 164723 164530 164448 164145 163442
54161 163442 162493 161908 162175 162955 163367 162967 162040 161009 160017 159133 158568 158597 159379 160742 162062 162703 162917 163839
54143 163839 166066 168559 169686 169109 167925 167050 166303 165254 164190 163828 164495 165926 167585 168990 169959 170715
54127 170715 171609 172685 173688 174446 174993 175336 175348 174887 173839 172199 170306 168877 168451 168954 170038 171677
54111 171677 174016 176790 179341 181202 182309 182795 182943 183211 183825 184375 184305 183743 183379 183511 183728 183617 183304
54094 183304 183160 183367 184000 185184 186942 189074 191339 193676 196211 199152 202641 206617 210901 215508 220562
54079 220562 225694 229814 231981 232356 231962 231592 231317 230846 229876 228163 225778 223322 221486 220393 219685 219201
54063 219201 219070 219229 219413 219743 220788 222738 224862 226035 225703 224274 222813 222375 223316 225089 226856 228307
54047 228307 229770 231666 234129 237150 240739 244904 249669 255115 261180 267431 273327 278771 284320 290873
54033 290873 299156 309252 320411 331519 341916 351617 360660 368706 375545 381463 386636 390586 392855
54020 392855 393851 394336 394352 393454 391836 390320 389085 387198 383724 378740 372978 366889 360374 353153 345168
54005 345168 336778 328577 320924 313762 307051 301035 295745 290636 285331 280358 276471 273456 270405 267102
53991 267102 264264 262331 260751 258693 255836 252395 248914 246131 244361 243009 241289 239427 238303 237945
53977 237945 237331 235875 234148 232779 231673 230799 230761 231836 233192 233848 233834 233728 233658 233504 233599 234355 235514 236566
53959 236566 237641 239235 241261 243115 244666 246435 248778 251508 254447 257779 261646 265800 269959 274257
53945 274257 279120 284801 291211 298256 306240 315777 327174 340104 354115 369198 385278 401169 414636
53932 414636 423841 428425 429165 427169 423627 419662 415885 412371 409373 407665 407868 409884 413280 417740 422797
53917 422797 427821 432852 438889 446589 455205 463590 471887 481188 491741 502501 512472 521497 529484 535787
53903 535787 539842 541786 542035 540783 538375 535591 532958 530078 526177 521124 515400 509239 502344 494511
53889 494511 485984 477019 467449 456986 445747 434213 422817 411836 401562 392198 383520 375016 366518
53876 366518 358438 351162 344487 337993 331724 326094 321153 316420 311501 306492 301702 297278 293185 289254
53862 289254 285206 280920 276735 273145 270138 267175 263921 260607 257585 254967 252786 251003 249135 246456
53848 246456 242941 239613 237506 236644 236421 236565 237110 237736 237787 237022 235917 235135 234951 235125 235144 234689 234030 233775
53830 233775 234102 234572 234892 235401 236423 237562 238196 238359 238555 238961 239462 240239 241581 243138 244114 244363 244703
53813 244703 245970 248252 251159 254329 257492 260540 263806 267870 272884 278421 284155 290281 297025 304154
53799 304154 311276 318288 325280 332261 339255 346339 353326 359711 365229 370137 374612 378223 380529 381999
53785 381999 383756 386325 389051 390846 391214 390396 388800 386487 383121 378348 372255 365421 358433 351440 344320
53770 344320 337098 329962 322985 316145 309581 303478 297724 292083 286769 282381 279007 275834 271995 267524
53756 267524 263105 259160 255676 252697 250430 248838 247673 246893 246514 246004 244458 241722 238812 236862 236039
53741 236039 235807 235766 235705 235248 234146 232800 231876 231477 231281 231390 232316 234005 235545 236200 236242 236416 237021 237923
53723 237923 239087 240532 241914 242670 242624 242149 241695 241429 241428 241881 242875 244070 244858 244993 244976 245629 247306 249679
53705 249679 252383 255567 259469 263631 267045 269213 270703 272361 274268 275846 276968 278488 281365 285432
53691 285432 289427 292340 294403 296438 298584 300280 301418 302665 304293 305431 305142 303778 302509 301826 301317
53676 301317 300787 300651 301070 301515 301458 300910 300056 298951 297886 297453 297813 298303 298126 297138 295724 294314 293265
53659 293265 292826 292885 293057 293217 293567 294059 294277 294161 294221 294659 294848 294253 293385 293204 293938 295113 296421 297837
53641 297837 299052 299542 299307 298981 299182 300130 301880 304404 307377 310244 312631 314453 315688 316354 316713 317147
53625 317147 317823 318708 319913 321722 324287 327497 331137 334936 338537 341709 344570 347436 350515 353961 358044
53610 358044 362904 368152 373106 377459 381486 385510 389465 393090 396325 399279 401897 403905 405198 406172
53596 406172 407447 409148 410648 411237 410872 410019 408966 407745 406589 405870 405540 405225 404938 405049 405347 404939 403460
53579 403460 401695 400484 399687 398836 398116 397856 397536 396329 394390 392681 391586 390544 389107 387580 386473
53564 386473 385928 385852 386090 386346 386396 386357 386393 386265 385745 385268 385498 386247 386598 386190 385661 385708 386454 387916 390249 393116
53544 393116 395537 397033 398417 400894 404643 408719 412111 414496 416210 417955 420441 423984 428452 433703
53530 433703 439844 446884 454446 462089 469735 477582 485795 494582 504328 515291 527196 539379 551412
53517 551412 563423 575850 589000 602871 617368 632634 648964 666318 684125 701909 720034
53506 720034 739452 760678 783368 806877 830789 854729 878179 900847 922975 944934 966658
53495 966658 987720 1007819 1026909 1045036 1062314 1078991 1095297 1111310 1127180 1143380 1160403
53484 1160403 1178106 1195672 1212387 1228385 1244459 1261206 1278574 1296266 1314235 1332420 1350147
53473 1350147 1366274 1380154 1392084 1402572 1411407 1417799 1421193 1421617 1419362 1414758 1408228 1400199 1390914
53460 1390914 1380561 1369535 1358266 1346845 1335096 1322955 1310458 1297483 1283900 1269870 1255595
53449 1255595 1240860 1225318 1209189 1193065 1177006 1160475 1143369 1126427 1110306 1094919 1080174
53438 1080174 1066760 1055434 1045891 1037164 1029018 1022162 1016967 1012726 1008606 1004822 1002353 1001714 1002497 1004102
53424 1004102 1006403 1009542 1013412 1017760 1022676 1028631 1036000 1044800 1055011 1066849 1080556 1096122 1113438
53411 1113438 1132540 1153470 1175972 1199596 1224075 1249440 1275855 1303537 1332763 1363671 1396041
53400 1396041 1429407 1463521 1498686 1535670 1575183 1617168 1660635 1704586 1749181 1795563 1844352
53389 1844352 1894789 1945658 1996469 2047257 2097782 2147627 2196695 2244858 2291410 2335786 2378579
53378 2378579 2420867 2462483 2501887 2537869 2570470 2599950 2625859 2647610 2665242 2679024 2688839
53367 2688839 2694391 2695462 2691528 2681625 2665191 2642661 2614901 2582557 2546373 2507514 2466839 2424268
53355 2424268 2379604 2333726 2288200 2243858 2200436 2157576 2115530 2074796 2035649 1998218 1962491
53344 1962491 1927927 1893383 1857744 1820598 1782272 1743420 1704699 1666719 1630057 1595161 1562150
53333 1562150 1530834 1501163 1473605 1448771 1426543 1405953 1386176 1367286 1349614 1332629 1315101
53322 1315101 1296429 1277310 1258831 1241313 1224439 1208238 1193350 1180128 1167959 1155914 1143898
53311 1143898 1132666 1122756 1113978 1106211 1100039 1096101 1094222 1093817 1094897 1097875 1102459 1107580 1112704 1118622
53297 1118622 1126627 1137281 1150223 1164744 1180280 1196704 1214383 1233733 1254680 1276889 1300416
53286 1300416 1325439 1351228 1376133 1399028 1420211 1440486 1459972 1478278 1495247 1510797 1524397
53275 1524397 1535384 1543667 1549568 1553178 1554361 1553176 1549748 1543911 1535515 1524919 1512654 1498664 1482441
53262 1482441 1463889 1443574 1422160 1400033 1377429 1354389 1330621 1305900 1280725 1256061 1232319
53251 1232319 1209045 1185784 1162788 1140576 1119103 1097746 1075959 1053713 1031305 1008901 986302
53240 986302 963136 939288 915111 891110 867531 844466 822298 801758 783366 766916 751624
53229 751624 736779 722271 708556 696191 685338 675627 666345 656777 646552 635794 624810 613451
53217 613451 600968 586807 571409 555884 540959 526635 512818 499708 487457 475978 465388
53206 465388 456114 448216 440960 433478 425587 417612 409734 401845 393836 385710 377605 369985 363452 358048
53192 358048 353034 347723 342223 337019 332174 327489 323157 319609 316809 314252 311578 308738 305640 302187
53178 302187 298735 296000 294333 293414 292705 291907 290859 289366 287273 284642 281799 279296 277618 276757 276237
53163 276237 275765 275592 275910 276167 275517 273864 271946 270369 268974 267282 265193 263154 261813 261435 261476 260865
53147 260865 259149 257239 256527 257293 258460 258984 258979 259253 260201 261552 262887 263971 264657 264810 264527 264288 264639
53130 264639 265593 266473 266592 266193 266389 267980 270536 272872 274226 274734 274989 275535 276617 278038 279271 280081
53114 280081 280957 282585 284948 287299 288986 289870 289944 289034 287153 284831 282818 281517 280784 280172 279336 278326
53098 278326 277511 277144 277039 276819 276384 275952 275677 275414 274873 273826 272189 270093 267883 265951 264562 263754 263294
53081 263294 262689 261513 259791 257884 256029 254359 253396 253890 255814 258012 259343 259835 260237 260799 261098 260855
53065 260855 260317 259853 259618 259511 259103 257817 255663 253560 252472 252429 252938 253972 255785 257897 259188 259179 258528
53048 258528 258112 258210 258754 259716 260922 261945 262467 262471 262015 261229 260509 260216 260115 259687 259109 259269 260594 262396
53030 262396 263668 263994 263471 262315 260990 260221 260315 260773 260950 260853 260922 261334 261963 262832 264099 265590 266706 266929
53012 266929 266318 265484 265118 265470 266262 267142 268101 269279 270491 271281 271477 271377 271347 271521 271910 272477 272979 273058 272665
52993 272665 272209 272218 272948 274331 276105 277976 279825 281683 283348 284334 284568 284895 286366 289089 292286 295314
52977 295314 298085 300550 302503 304025 305487 306922 307941 308435 308818 309337 309699 309584 309072 308309 307327 306443
52961 306443 306296 307119 308395 309463 310092 310215 309650 308375 306668 304689 302367 299927 297957 296610 295359
52946 295359 293924 292851 292609 292686 292291 291529 291152 291377 291683 291707 291662 291808 292002 291875 291192 290035 288861 288226
52928 288226 288183 288111 287422 286279 285301 284740 284338 283821 283182 282558 282179 282352 283125 284014 284327 283779 282602 281161
52910 281161 279713 278470 277620 277242 277337 277883 278788 279851 280894 281830 282516 282733 282420 281805 281221 280915 281045 281558
52892 281558 282046 282040 281567 281122 281010 281087 281228 281582 282155 282555 282507 282265 282190 282194 281893 281085 279908 278802 278420 279138
52872 279138 280429 281235 281292 281613 283261 286110 289211 291875 293846 294932 295226 295426 296254 297674 299196 300689
52856 300689 302297 303734 304383 304027 302890 301023 298285 294951 291650 288565 285247 281371 277219 273250 269699
52841 269699 266785 264809 263661 262584 260866 258669 256855 255972 255637 255006 253707 252132 250796 249723 248735
52826 248735 248176 248691 250160 251390 251329 250283 249455 249497 249945 250020 249487 248734 248327 248587 249428 250582 251991 253782
52808 253782 255800 257493 258545 259285 260182 261139 261665 261510 260763 259537 257964 256361 255042 253969 252900 251742
52792 251742 250562 249456 248681 248660 249473 250548 251216 251398 251431 251551 251907 252778 254162 255411 255927 256096 256880 258447
52774 258447 259831 260069 259178 257836 256555 255411 254253 252976 251714 250837 250648 251146 252177 253594 255062
52759 255062 256027 256260 256266 256646 257206 257131 255990 254179 252469 251525 251757 253096 254884 256361 257371 258319 259607
52742 259607 261398 263746 266449 268935 270740 272052 273350 274683 275837 277042 278850 281296 283807 286040
52728 286040 288196 290350 292018 292664 292298 291388 290479 289962 289890 289930 289693 289090 288083 286366 283755 280814 278491
52711 278491 277177 276581 276428 276666 277026 277054 276744 276619 277046 277968 279278 280846 282144 282501 281944 281215 280794 280473
52693 280473 280029 279677 279601 279600 279480 279335 279252 279231 279486 280220 280958 280915 280255 280179 281270 282484 282408 280912 278916 277052
52673 277052 275342 273816 272638 271652 270473 269106 268109 268067 269147 271051 273227 275211 276925 278500 279824
52658 279824 280575 280790 280917 281143 281223 281249 281998 284048 286961 289864 292430 294695 296308 296706 295998 295015 294382
52641 294382 293974 293376 292481 291521 290728 290123 289545 288855 288113 287447 286754 285810 284733 284053 284126 284725 285366 285790 285993
52622 285993 286080 286303 286923 287792 288338 288177 287498 286691 285928 285303 285009 285055 285151 285116 285123 285292 285408 285309 285190 285240 285419
52601 285419 285873 287093 289195 291508 293339 294724 295953 296822 296996 296720 296460 296136 295446 294699 294558 295083 295817
52584 295817 296730 298254 300265 301799 302089 301410 300695 300723 301754 303475 305159 306239 306809 307244 307432 306846 305375
52567 305375 303558 302021 301141 301131 301752 301917 300504 297813 295498 294657 294684 294472 293965 293741 293623 292697 290683
52550 290683 288480 287141 286790 286734 286347 285714 285537 286437 288196 289764 290183 289424 288201 287164 286586 286608 287270
52533 287270 288257 289041 289474 289917 290643 291417 291913 292286 292979 294059 295058 295532 295553 295585 296029 296951 298140 299371
52515 299371 300682 302400 304851 308057 311786 315802 319807 323261 325702 327376 329155 331483 333674 334596
52501 334596 333840 331791 328870 325325 321739 318955 317188 315630 313349 310275 307095 304475 302664 301565
52487 301565 300820 299975 298863 297721 296824 296253 296208 297073 298766 300334 300782 300188 299529 299529 300189 301309 302791 304297
52469 304297 305300 305864 306901 309214 312470 315596 318044 320228 322732 325470 327842 329506 330672 331598 332019
52454 332019 331305 329181 326097 322752 319460 316166 312932 310056 307700 305695 303886 302434 301511 300835 299780
52439 299780 298032 295944 294169 293059 292580 292721 293728 295768 298384 300500 301145 300304 299030 298581 299288 300335
52423 300335 300736 300456 300267 300606 301034 301061 301052 301801 303425 305225 306593 307574 308563 309986 312382 316198 321174
52406 321174 326395 331322 336456 342616 349842 357380 364547 371121 376886 381155 382900 381415 376979 370928
52392 370928 364823 359375 354302 349278 344599 340748 337702 335123 333002 331704 331435 331978 332922 333928 334918
52377 334918 336229 338383 341476 345004 348539 352327 356849 362047 367367 372404 377074 381324 385152 388743
52363 388743 392086 394561 395487 395052 394137 393225 392184 391184 391006 391987 393291 393866 393771 393954 394957 396420 397808
52346 397808 399051 400377 401986 404080 406841 410174 413754 417549 422015 427441 433304 438719 443494 448335
52332 448335 453966 460571 468254 477419 488157 499696 511223 523147 536792 552789 570439 588824
52320 588824 607795 627490 647541 667308 686516 705184 723373 741443 760092 779483 798718
52309 798718 816917 834628 853348 873718 894915 915852 936183 955932 974922 993013 1010478
52298 1010478 1027657 1044419 1060228 1074499 1086718 1096422 1103287 1107177 1108121 1106481 1103055 1098606 1093178
52285 1093178 1086302 1078048 1069457 1061672 1054916 1048672 1042685 1037449 1033729 1031841 1031472 1032111 1033588 1036131
52271 1036131 1039927 1044842 1050759 1057959 1066765 1076905 1087619 1098460 1109641 1121557 1134367 1148118
52259 1148118 1162863 1178412 1194314 1210341 1226660 1243288 1259682 1275236 1289993 1304494 1318978
52248 1318978 1332981 1345653 1356160 1363818 1368246 1369670 1368971 1367159 1364670 1361232 1356493 1350661 1344291
52235 1344291 1337581 1330246 1322219 1314056 1306328 1298949 1291554 1284261 1277541 1271528 1266065 1261345 1257784 1255199
52221 1255199 1252835 1250460 1248751 1248247 1248528 1248968 1249719 1251354 1253921 1257067 1260923 1266134 1272950 1280788 1288841
52206 1288841 1296775 1304737 1312972 1321405 1329467 1336437 1342252 1347857 1354346 1361840 1369635 1377334 1385352 1394175
52192 1394175 1403663 1413255 1422471 1430958 1438474 1445123 1451216 1456500 1459891 1460474 1458600 1455416 1451388 1445904
52178 1445904 1438383 1429199 1419166 1408658 1397673 1386497 1375812 1366183 1357757 1350382 1343745 1337517 1331689
52165 1331689 1326723 1323121 1320970 1320127 1320603 1322318 1324630 1326738 1328496 1330219 1331610 1331648 1329920 1327420 1325530
52150 1325530 1324593 1323951 1322972 1321480 1319550 1317530 1316158 1316040 1316977 1318130 1318750 1318444 1316995 1314492 1311568 1309043
52134 1309043 1307301 1306316 1306086 1306591 1307596 1309158 1312268 1318315 1327781 1340024 1354380 1370849 1389508 1409941
52120 1409941 1431653 1454597 1478880 1504183 1529803 1555097 1579738 1603815 1627797 1652106 1676484
52109 1676484 1700002 1721800 1741609 1759524 1775678 1790313 1803837 1816565 1828564 1839837 1850398
52098 1850398 1860109 1868739 1876258 1882703 1887631 1890082 1889198 1884591 1876163 1864098 1849167 1832467 1814620
52085 1814620 1795775 1776600 1758563 1742726 1728824 1716159 1704916 1695851 1689000 1683527 1678880 1675421
52073 1675421 1673792 1674184 1676393 1680150 1685241 1691612 1699533 1709403 1721258 1734663 1749171 1764624 1780821
52060 1780821 1797129 1812765 1827513 1841946 1856742 1871802 1886238 1899165 1910273 1919476 1926417 1930680
52048 1930680 1932205 1930984 1926480 1918016 1905807 1891049 1874698 1856702 1836747 1815300 1793490 1772186
52036 1772186 1751468 1730776 1709454 1687519 1666062 1646380 1628452 1610873 1592743 1574980 1559142
52025 1559142 1545387 1532484 1519571 1506953 1495111 1483777 1472367 1460787 1449438 1438643 1428319
52014 1428319 1418078 1407543 1396658 1385643 1374500 1362730 1349789 1335646 1320590 1304601 1287313
52003 1287313 1268507 1248219 1226461 1203259 1178960 1154112 1129077 1104246 1080545 1059057 1039859
51992 1039859 1021760 1003565 985274 967687 951138 935031 918479 901007 882679 863903 845208
51981 845208 827000 809344 791982 774563 756923 739250 722070 705957 691147 677427 664525
51970 664525 652710 642954 636316 632999 632036 632133 632885 634983 639136 645045 651589 657770 663071 667053 669119
51955 669119 668912 666627 662664 657133 649996 641697 633374 626294 621149 617933 616389 616336 617624 620073 623696
51940 623696 628821 635746 644323 654103 664821 676466 688862 701469 713635 724785 734320 741629 746344
51927 746344 748335 747488 743841 738096 731616 725575 720263 715295 710274 705102 699992 695398 691583 688042
51913 688042 683646 677621 670074 661359 651381 640065 628185 617147 607975 600824 595297 590832 586937
51900 586937 583546 581125 580008 579606 578615 576004 571498 565129 556737 546141 533705 520610 508413 498013
51886 498013 489012 480490 472510 466327 462799 461248 460540 460743 462877 467335 473500 480824 489242 498405 507453
51871 507453 515902 523916 531277 536822 539496 539478 537763 535088 531827 528461 525368 522323 518866 515182 512129
51856 512129 510359 509881 510526 512323 515095 517966 519754 519858 518596 516600 514069 510731 506394 501252 495593
51841 495593 489476 482922 476235 469871 464067 458797 454100 450215 447495 446336 447039 449389 452360 454655
51827 454655 455745 456173 456746 457579 458043 457506 455954 453918 451909 450017 448148 446501 445475 445047 444644 443899
51811 443899 443195 443079 443444 443757 443859 443972 444027 443660 442894 442220 441807 441182 439961 438508 437619 437868 439320 441475
51793 441475 443298 443762 442675 440719 438610 436571 434683 433111 431717 430054 428201 427077 427336 428303 428661
51778 428661 428004 427104 426819 427377 428712 430797 433504 436715 440815 446549 454024 462238 470122 477819 486427
51763 486427 496423 506778 515761 522289 526288 528077 527849 525714 521783 516030 508416 499425 490184 481656
51749 481656 473729 465471 456357 447024 438778 432581 428558 426182 424746 423813 423390 423694 424795 426623 429299
51734 429299 433206 438649 445458 452935 460022 465605 469030 470510 470952 471285 471977 473080 474429 475769 476928
51719 476928 477969 478930 479366 478492 476003 472565 469222 466448 463992 461486 458887 456295 453639 450729 447562
51704 447562 444488 442088 440867 440947 441915 443004 443578 443578 443473 443688 444123 444339 444097 443555 442965 442516 442446 442894 443434
51685 443434 443092 441143 437724 433489 428985 424615 420861 418041 415985 414370 413240 412864 413223 414090 415476
51670 415476 417499 419886 422180 424505 427682 432378 438434 445093 451720 458302 465356 473079 480341 484991
51656 484991 485808 483902 481488 479521 477419 474985 473365 473655 475478 477613 479364 480611 480959 479584 475911
51641 475911 470045 462669 454627 446400 437906 429117 420940 414881 411532 409928 408720 407426 406215 405102
51627 405102 404009 403234 403194 403894 405138 406978 409445 412080 414283 415997 417548 418938 419786 419810 418930 417003
51611 417003 413940 410103 406225 402904 400392 398693 397551 396504 395326 394368 394167 394896 396519 399183 402980
51596 402980 407415 411709 415769 420522 427123 435978 446439 457097 466333 472870 476042 475722 472277 466685
51582 466685 460295 454120 448536 443854 440827 440151 441744 445067 450066 457292 467056 478936 492162 506157
51568 506157 520698 535943 552398 570439 589694 609153 628088 646821 666494 688272 712736
51557 712736 739845 769191 800174 831912 863090 892053 917022 936176 947831 951073 946279 934580
51545 934580 916732 893066 864583 833321 801013 767958 733928 699866 667975 640117 616615
51534 616615 596460 578270 561204 545475 531964 521084 512217 504584 498219 493555 490416 488141 486430
51521 486430 485374 484792 484313 484014 484155 484311 483557 481595 478902 475700 471701 467065 462657 458892 455123 450703
51505 450703 445949 441506 437382 433317 429585 426611 424159 421611 418939 416724 415280 414338 413573 412930 412384
51490 412384 411860 411425 411172 410890 410221 409251 408560 408503 408715 408496 407498 405900 404100 402415 400950 399526 397813
51473 397813 395667 393399 391576 390487 389830 388913 387200 384762 382283 380551 379731 379085 377630 375201 372686
51458 372686 370988 370008 369007 367812 367088 367335 368263 369428 370934 372977 375160 376916 378466 380736 384349
51443 384349 389201 395040 401936 410047 419347 429675 440600 451084 459699 465490 468488 469363 468877 467756
51429 467756 466565 465342 463507 460440 456070 450801 445139 439608 434789 431019 428068 425386 422790 420725
51415 420725 419745 419798 420154 420078 419464 418759 418331 418124 417935 417739 417593 417418 417150 416941 416986 417265 417732 418654 420435
51396 420435 423029 425830 428224 430171 432195 434922 438670 443423 449221 456515 465886 477362 490377 504697
51382 504697 521154 541143 565594 594664 628114 665469 705946 748727 793314 839216 885280
51371 885280 929627 970105 1004497 1030549 1046547 1052057 1047721 1034262 1012171 982351 946500 906586
51359 906586 864291 821054 778187 736629 696844 659226 624422 593154 565901 542785 523487
51348 523487 507227 493116 480605 469370 458904 448644 438562 429178 420881 413576 407142 401786
51336 401786 397660 394430 391464 388267 384660 380826 377311 374775 373463 372967 372524 371526 369936 368385 367698
51321 367698 368053 368808 369435 370254 371805 373839 375671 377270 379217 381629 383979 386061 388292 390893 393457
51306 393457 395548 397045 397715 397198 395681 393899 392199 390275 387995 385713 383493 380900 377906 375067 372409
51291 372409 369165 365214 361792 359953 359254 358843 358881 359756 360767 361060 361402 363550 367906 373133 378079 382865
51275 382865 387863 392712 396765 399693 401347 401782 401710 402160 403320 404350 404691 404999 406335 408882 411900 414584
51259 414584 416619 418003 418642 418153 416135 412805 409226 406499 404814 403620 402602 401950 401652 401100 399568
51244 399568 396745 392710 387879 383090 379261 376656 374732 372829 370788 368863 367416 366806 367201 368239 369138
51229 369138 369337 368895 368221 367658 367382 367435 367719 368128 368729 369622 370680 371707 372867 374606 377060 379797 382245
51212 382245 384136 385523 386629 387780 389280 391257 393711 396537 399349 401533 402877 403958 405482 407384
51198 407384 409135 410700 412427 413968 414272 413009 411249 410187 409814 409393 408691 407955 407035 405422 403213 401328
51182 401328 400562 400845 401567 402188 402404 402134 401679 401600 402108 402717 402814 402482 402439 403162 404353 405322 405632 405234 404348
51163 404348 403507 403488 404718 406771 408848 410767 413070 416091 419381 422304 424751 426965 428930 430340 430934
51148 430934 430528 428881 425946 422213 418488 415312 412710 410376 407995 405554 403448 402004 400871 399353
51134 399353 397573 396649 397278 398701 399723 400232 400882 401731 402272 402706 404082 406939 410662 414447 418120 421696
51118 421696 424867 427464 429911 432733 435920 439068 441843 444128 446016 447828 449785 451560 452576 452818
51104 452818 452888 453187 453627 454220 455297 456896 458538 459877 460931 461473 460929 459375 457840 457064 456556 455525
51088 455525 454129 453045 452345 451682 451237 451508 452303 452877 453070 453546 454732 456281 457770 459281 460934 462369
51072 462369 463164 463523 464228 465990 468993 472911 477184 481338 485209 489066 493609 499779 508145 518290 529096
51057 529096 539992 551660 565031 579702 593882 606026 616128 625309 634534 644110 654186 665124
51045 665124 676998 688910 699259 706980 712225 715488 716308 713500 706754 697388 687242 677314 667802
51032 667802 658885 650742 643029 634948 625956 616147 606022 596222 587333 579684 573414 568872 566605 566688
51018 566688 568386 570853 573833 577319 581027 584839 589369 595270 602177 609138 616008 623583 632288 641600
51004 641600 650993 660725 671260 682516 694015 705312 715951 725426 733542 740543 746658 751870 756267
50991 756267 760196 763835 766973 769414 771200 772290 772549 772360 772783 774794 778726 784756 793383 804908 818836
50976 818836 834260 850602 867604 884999 902690 920962 940097 960160 981709 1006269 1035351
50965 1035351 1069149 1106966 1148661 1194845 1245648 1300307 1358243 1419662 1484616 1552050 1620369
50954 1620369 1688467 1755638 1820834 1882730 1940468 1993907 2043105 2087938 2128297 2164350 2196542
50943 2196542 2225551 2252314 2277945 2303471 2329537 2356204 2382891 2408527 2431960 2452349 2469266
50932 2469266 2482482 2491660 2496193 2495387 2488854 2476570 2458305 2433154 2400017 2358599 2309559 2253588
50920 2253588 2190879 2121827 2047850 1971026 1893149 1815571 1739661 1666688 1597243 1531391 1469521
50909 1469521 1412461 1360524 1313011 1269103 1228837 1192675 1160389 1130943 1103491 1078093 1055363
50898 1055363 1035667 1018696 1003593 989519 976344 964740 955384 948083 941940 936347 931454 927639
50886 927639 924902 922952 921599 920821 920695 921525 923786 927639 932575 937876 943366 949506 956787 965331 975043
50871 975043 985783 997235 1008928 1020703 1033116 1047161 1063514 1082055 1102096 1123068 1145096
50860 1145096 1169092 1196302 1227640 1263285 1302776 1345490 1391178 1440342 1494288 1554757 1623219
50849 1623219 1700239 1785433 1878083 1977906 2085302 2200835 2324474 2455357 2592289 2734345
50839 2734345 2880824 3030550 3181272 3329811 3472851 3607620 3731931 3843830 3941595 4024295
50829 4024295 4092254 4146714 4189078 4220794 4244075 4262301 4279218 4297696 4319548 4346359 4379838
50818 4379838 4420844 4468220 4518866 4568875 4614397 4651607 4676390 4684456 4671933 4636114 4576049
50807 4576049 4492493 4387026 4261055 4115830 3953508 3777883 3593784 3405917 3218455 3035347
50797 3035347 2860193 2695410 2541855 2399640 2269253 2151658 2047413 1956042 1876424 1807633
50787 1807633 1749179 1700452 1660190 1626700 1598643 1575389 1556541 1541342 1528820 1518321 1509518
50776 1509518 1501818 1494194 1485819 1476574 1466645 1455903 1444004 1430949 1417085 1402563 1387133 1370553
50764 1370553 1352900 1334394 1315200 1295563 1275906 1256642 1238053 1220463 1204350 1190088 1177682
50753 1177682 1166948 1157907 1150841 1146020 1143475 1143017 1144414 1147577 1152711 1160300 1170908 1185011 1202969
50740 1202969 1225093 1251665 1282991 1319357 1360786 1406835 1456922 1511001 1569626 1633099 1700739
50729 1700739 1771328 1844072 1918664 1994413 2069993 2144401 2217786 2290750 2362939 2432784 2498586
50718 2498586 2559353 2614364 2662439 2702089 2732226 2752351 2762330 2762646 2755013 2742203 2726916 2711109
50706 2711109 2696628 2685940 2681524 2684514 2694475 2710546 2732261 2758932 2788635 2818234 2844335 2863980
50694 2863980 2874537 2873338 2857698 2825427 2775583 2708999 2628111 2536132 2436276 2331617 2225312
50683 2225312 2120546 2020143 1926311 1840626 1763954 1696323 1637193 1586162 1543377 1509126 1483178
50672 1483178 1464805 1453394 1448665 1450141 1456706 1467059 1480454 1496616 1514942 1534187 1553129 1571254
50660 1571254 1588499 1604527 1618616 1630315 1640014 1648848 1657996 1667861 1677751 1686543 1693940 1700976 1709072
50647 1709072 1718726 1729433 1740732 1752941 1766856 1783235 1802717 1825820 1852707 1883106 1916588
50636 1916588 1952740 1990939 2030297 2070110 2110219 2150720 2191378 2231406 2269764 2305774 2339726
50625 2339726 2372856 2406024 2437956 2465019 2483156 2490022 2485379 2470361 2447327 2420071 2392815 2368268
50613 2368268 2346999 2328873 2314432 2304323 2297985 2293816 2290637 2288298 2286589 2284135 2278757 2268657 2252951
50600 2252951 2231276 2203371 2169016 2128024 2080259 2026053 1966728 1904411 1841052 1777833 1715588
50589 1715588 1655383 1598282 1544798 1495015 1449051 1406940 1368174 1331972 1298071 1266718 1237840
50578 1237840 1210859 1185703 1163423 1145261 1131317 1120531 1111814 1104886 1100254 1098660 1100394 1104803
50566 1104803 1110747 1117791 1126657 1138088 1151656 1166309 1181883 1199390 1219740 1242764 1267515 1292998
50554 1292998 1318517 1343906 1369654 1396342 1423726 1450777 1476788 1501976 1526767 1551063 1574602
50543 1574602 1597594 1620503 1643546 1666956 1691505 1718261 1747902 1780711 1817103 1857671 1902742
50532 1902742 1952275 2006126 2063947 2124884 2187993 2253229 2321634 2394361 2471811 2553733 2639650
50521 2639650 2728827 2820158 2912459 3004619 3095146 3181738 3261711 3332775 3393230 3441689 3477083
50510 3477083 3498803 3506426 3499363 3477271 3440911 3392207 3333353 3266214 3192729 3115453 3037425 2961703
50498 2961703 2891238 2828756 2776302 2734870 2704691 2685825 2678305 2681845 2695580 2717907 2746358 2777630
50486 2777630 2807941 2833272 2849445 2852556 2839938 2810642 2764819 2703011 2626543 2538290 2442164
50475 2442164 2341583 2238809 2135789 2034894 1938361 1847388 1762305 1683491 1611705 1547504
50465 1547504 1490640 1440263 1395621 1356405 1322370 1292846 1267007 1244684 1226423 1212409 1201696
50454 1201696 1193022 1186134 1181768 1180516 1182394 1187408 1195685 1206809 1219785 1233981 1249614 1267042 1286227
50441 1286227 1307174 1330084 1354432 1378403 1399939 1418078 1432834 1444277 1452461 1457996 1461905 1464923
50429 1464923 1467396 1469721 1472330 1475358 1478811 1482990 1488280 1494637 1501720 1509376 1517607 1526327 1535720 1546658
50415 1546658 1560103 1576201 1594661 1615955 1641376 1671730 1706547 1744674 1785066 1826883 1869531
50404 1869531 1912945 1957292 2001979 2045333 2085541 2121612 2153188 2179810 2200722 2215130 2222360
50393 2222360 2221886 2213423 2196852 2171952 2138402 2096250 2046391 1990664 1931569 1871708 1813125 1757226
50381 1757226 1705425 1659407 1620308 1588039 1562230 1543609 1533417 1531403 1535457 1543572 1555154 1569768
50369 1569768 1585437 1599061 1608032 1610803 1606430 1594547 1575666 1550710 1520265 1484780 1445404 1403972
50357 1403972 1362076 1320570 1279915 1240560 1202884 1167164 1133679 1102673 1074215 1048338 1025261
50346 1025261 1005338 988915 976347 967914 963457 962387 964296 969206 976769 985481 993238 998623 1001338
50333 1001338 1001639 1000001 997239 994379 992158 990876 990633 991365 992829 995099 998969 1005290 1013849 1023505 1033520
50318 1033520 1044139 1055671 1067597 1079009 1089411 1098680 1106658 1113255 1118735 1123433 1127389 1130637 1133693
50305 1133693 1137285 1141698 1146832 1152831 1160154 1168934 1178795 1189609 1202039 1216858 1233941 1252494 1272412
50292 1272412 1294959 1321756 1353290 1388780 1427322 1468462 1511171 1552379 1586938 1609337 1615900
50281 1615900 1606102 1582528 1549766 1512822 1475858 1441691 1411834 1386692 1365914 1348993 1335679
50270 1335679 1325740 1318478 1312828 1307935 1303357 1298692 1293447 1287529 1281529 1276146 1271432 1266972 1262717 1259265
50256 1259265 1257235 1256687 1257296 1258854 1261382 1265014 1270093 1277325 1287463 1300696 1316472 1333944 1352356
50243 1352356 1371038 1389366 1407075 1424455 1442083 1460400 1479621 1499723 1520105 1539372 1555862
50232 1555862 1568456 1576642 1579890 1577474 1569087 1555269 1537075 1515586 1491932 1467335 1442750 1418649
50220 1418649 1395385 1373450 1352883 1332663 1311238 1287741 1262324 1235333 1206728 1176598 1145817
50209 1145817 1115750 1087356 1060872 1036327 1014030 994408 977479 962658 949168 936651 925379
50198 925379 915785 907758 900475 893065 885472 878529 873001 868625 864212 858770 852334 845667 839323 833243
50184 833243 827124 820901 814792 809018 803547 798061 792177 785786 779105 772364 765615 759015 753022 748030
50170 748030 743969 740617 738126 736706 735903 734793 733057 731309 730211 729778 729798 730339 731480 733038 735044
50155 735044 738086 742671 748560 755140 762122 769374 776491 783218 790036 797603 805733 813613 820925 828045
50141 828045 835200 842312 849833 858904 870305 883933 899749 918592 941532 968885 1000372 1035753
50129 1035753 1074520 1115267 1156266 1196770 1237204 1277965 1318632 1358600 1397944 1437174 1476328
50118 1476328 1514634 1550815 1583311 1610306 1630124 1641878 1645582 1641516 1629781 1610642 1585040 1554427
50106 1554427 1520280 1484035 1447218 1411076 1376089 1342336 1310329 1280878 1253972 1228473 1203423
50095 1203423 1179106 1156265 1134764 1113849 1093574 1075116 1059532 1046861 1036699 1029078 1024358 1022563
50083 1022563 1023208 1025736 1029885 1035599 1042644 1050410 1058246 1066108 1074629 1084205 1094207 1103449 1111364 1118293
50069 1118293 1124682 1130449 1135239 1138827 1141108 1141976 1141413 1139469 1136175 1131757 1126837 1121987 1116980 1110972
50055 1110972 1103576 1095360 1087199 1079591 1072752 1066796 1061558 1056741 1052570 1049848 1048960 1049349 1050448 1052664
50041 1052664 1056791 1062841 1070202 1078775 1089109 1101316 1114544 1127821 1140924 1154190 1167815 1181609
50029 1181609 1195180 1208144 1220304 1231730 1242440 1251907 1259158 1263574 1265486 1265858 1265553 1265067 1264794 1265179
50015 1265179 1266499 1268622 1271135 1273757 1276568 1279837 1283699 1288072 1292886 1298231 1304228 1310883 1318171 1326156
50001 1326156 1334995 1344899 1356119 1368748 1382278 1395398 1406343 1413442 1415410 1411409 1401180 1385123
49989 1385123 1364060 1338834 1310141 1278595 1244822 1209560 1173762 1138418 1104129 1070972 1038969
49978 1038969 1008546 980325 954545 930949 909170 889030 870602 854192 840175 828500 818348
49967 818348 808627 798878 789455 780873 773346 767023 762132 758529 755405 751956 748278 745262 743581 743098
49953 743098 743370 744423 746785 750901 756730 763864 771728 779604 786736 792684 797511 801405 804274 806002
49939 806002 807044 808281 810004 811329 810890 807886 802177 793768 782783 769901 756262 742702 729411
49926 729411 716464 704274 693321 683714 675310 668042 661887 656704 652360 648926 646533 645162 644742 645279
49912 645279 646655 648482 650446 652665 655404 658574 661938 665847 671325 679128 688920 699586 710215 720649
49898 720649 731212 742075 752876 762892 771603 779047 785454 790570 793611 793990 791867 787815 782100
49885 782100 774558 765085 754025 742074 729948 718134 706787 695836 685235 675126 665711 657117
49873 657117 649454 642904 637579 633382 630104 627543 625434 623488 621766 620891 621565 623931 627692 632737 639186
49858 639186 646788 654779 662583 670376 678776 688260 698989 710832 723202 735089 745608 754470 761766
49845 761766 767553 771894 775055 777235 778152 777205 774044 768771 761692 753118 743402 732934 722192 711987
49831 711987 703438 697348 693576 691276 689617 688070 686257 684123 682234 681393 681792 682949 684567 687047 690985
49816 690985 696609 703925 712940 723344 734223 744549 753834 762107 769423 775751 781208 786027 790293
49803 790293 793918 796802 798836 799749 799222 797157 793695 789061 783487 777209 770268 762355 753135 742813
49789 742813 732214 722222 713204 704989 697249 689887 683160 677560 673457 670753 668866 667133 665289 663617
49775 663617 662611 662512 663151 664233 665695 667741 670674 674800 680323 687037 694124 700557 705921 710658 715393
49760 715393 720183 724583 728237 731137 733324 734599 734637 733169 730003 724947 717956 709467 700506 692240 685253
49745 685253 679348 674105 669454 665464 661849 658172 654634 652118 651217 651547 652291 653087 653992 654951 655933 657469
49729 657469 660413 664947 670237 675263 679676 683677 687503 691466 696261 702724 711205 721395 732773 744985
49715 744985 757752 770700 783373 795146 804968 811469 813741 812051 807575 801470 794381 786806 779432
49702 779432 772866 767247 762408 758362 755413 753801 753343 753342 752811 750998 747906 744211 740549 737100 734060
49687 734060 732188 732418 735017 739496 745269 751949 759175 766788 775415 786348 800475 817608 837034
49674 837034 858344 881437 905915 930678 953836 972853 985293 990041 987897 980950 971593 962111
49662 962111 954508 950013 948822 950678 955502 962937 971324 977635 978736 972782 959780 941292 919605
49649 919605 896710 873765 851456 830556 811848 795629 781700 769897 760285 752856 747354 743483
49637 743483 741041 739716 738994 738403 737670 736555 734604 731218 726075 719613 713035 707448 702847 698211 692790
49622 692790 686919 681245 675645 669583 663260 657585 653019 649228 646076 644135 643799 644449 645067 645276 645282 645154
49606 645154 644805 644532 644919 646096 647501 648524 649109 649595 650231 650969 651621 652068 652393 652835 653559 654439 655125 655360
49588 655360 655236 655165 655628 656894 658856 661141 663393 665460 667361 669143 670777 672095 672849 672977 672865 673220
49572 673220 674593 677123 680752 685480 691285 698008 705654 714687 725683 738531 752187 765390 777502
49559 777502 788465 798119 805831 810926 813242 813088 810784 806518 800689 794129 787770 782171 777520 773994
49545 773994 771811 770890 770665 770486 770159 769974 770184 770616 770859 770758 770628 771043 772527 775460 780068 786324 793982
49528 793982 802921 813462 826160 841249 858475 877524 898359 920945 944771 968780 991636 1011921
49516 1011921 1028310 1040027 1047358 1051601 1054343 1056738 1059393 1062733 1067253 1073252 1080318 1087251 1092670
49503 1092670 1095653 1095595 1091601 1082540 1068058 1049345 1028603 1007739 987663 968576 950510 933641
49491 933641 918372 905173 894118 884558 875616 867103 859694 854026 849842 846311 843121 840913 840466 841616
49477 841616 843198 844064 844012 843680 843737 844342 845236 846073 846696 847372 848777 851478 855309 859497 863387 866790 869606
49460 869606 871669 873198 874915 877230 879629 881348 882414 883456 884568 884925 883652 880681 876626 872154
49446 872154 867663 863298 859030 854741 850312 845716 841177 837366 835234 835410 837757 841567 846075 850789
49432 850789 855800 862015 870673 882169 895671 910312 926384 944697 965046 986133 1006989 1027806
49420 1027806 1049360 1072293 1096827 1122110 1145406 1162886 1172073 1173369 1169022 1161203 1151539 1141742
49408 1141742 1133576 1128148 1125761 1126522 1130697 1138413 1149350 1162795 1177906 1193979 1210681 1227989 1245798
49395 1245798 1263683 1281091 1297585 1312841 1326616 1338827 1349419 1358084 1364287 1367648 1367970 1364903
49383 1364903 1358091 1347908 1335517 1321866 1307046 1291107 1275036 1260195 1246921 1234367 1221865
49372 1221865 1209992 1200094 1193075 1188789 1186374 1184977 1184202 1184013 1184293 1184621 1184465 1183368 1180922 1176775 1170839
49357 1170839 1163309 1154403 1144345 1133654 1123132 1113300 1104130 1095502 1087570 1080384 1073536 1066627 1059927
49344 1059927 1054162 1049831 1046976 1045339 1044305 1042893 1040317 1036535 1032027 1027223 1022445 1018008 1013817 1009159
49330 1009159 1003604 998012 993948 992058 991665 991914 992589 993666 994922 996452 998961 1003046 1008583 1015213 1023000
49315 1023000 1032171 1042590 1054038 1066767 1081186 1097062 1113435 1129211 1143443 1155152 1163455 1168005
49303 1168005 1169023 1166840 1161732 1154212 1145130 1135356 1125643 1116895 1110131 1105815 1103357 1101652 1100082 1098850
49289 1098850 1098409 1098909 1100205 1102044 1103983 1105267 1105099 1103104 1099514 1094949 1090081 1085435 1081371 1078297 1076860
49274 1076860 1077702 1080803 1085263 1090110 1095298 1101507 1108957 1116867 1124252 1130765 1136383 1140636 1142762 1142566
49260 1142566 1140681 1137948 1134850 1131609 1128483 1125917 1124689 1125879 1130258 1137509 1146403 1155934 1165876 1175904
49246 1175904 1184533 1189628 1190079 1186460 1179880 1170654 1158615 1144483 1130216 1117696 1107374 1098507 1090492
49233 1090492 1083593 1078485 1075606 1075081 1076909 1080906 1086612 1093474 1101106 1109367 1118316 1128105 1138647 1149300
49219 1149300 1159193 1168042 1176329 1184480 1192288 1199580 1206982 1215289 1224171 1232277 1238806 1244373 1250059 1256260
49205 1256260 1263010 1270954 1281179 1293990 1308449 1323360 1338410 1354080 1370739 1388122 1405671 1423047
49193 1423047 1440231 1457317 1474340 1491128 1507180 1521866 1534982 1547050 1558750 1570159 1580891
49182 1580891 1591077 1601752 1614004 1628146 1644091 1662188 1683156 1707311 1734407 1764306 1797268
49171 1797268 1833495 1872855 1915233 1960597 2008104 2055214 2098110 2133212 2158521 2173969 2181024
49160 2181024 2182034 2179610 2176126 2173335 2172060 2172104 2172654 2172978 2172804 2172149 2171068 2169757 2168731 2168697 2170217 2173601
49144 2173601 2179040 2186653 2196388 2207971 2221098 2235727 2252169 2270695 2290969 2311977 2332765 2353191
49132 2353191 2373662 2394260 2414590 2434668 2455448 2477994 2502346 2527569 2552746 2577467 2601523
49121 2601523 2624780 2647531 2670519 2694401 2719537 2746455 2776054 2808981 2845261 2885068 2929665
49110 2929665 2981085 3040955 3110152 3189611 3280850 3385253 3502598 3629733 3760225 3886261
49100 3886261 4002953 4111753 4218111 4323401 4418447 4486242 4512611 4495391 4444481 4373973
49090 4373973 4293700 4206039 4108515 3998926 3879050 3754774 3633444 3520995 3420761 3333756
49080 3333756 3259349 3195952 3141795 3095525 3056212 3022949 2994598 2969846 2947404 2926269 2905996
49069 2905996 2886741 2868982 2853128 2839244 2826881 2815161 2803309 2791285 2779730 2769121 2759198
49058 2759198 2749418 2739776 2730828 2722936 2715805 2708919 2702215 2696144 2691013 2686475 2681899 2677288 2673562 2671716
49044 2671716 2671833 2673208 2675321 2678312 2682533 2688039 2694559 2701571 2708251 2713788 2717975 2721180 2723606 2725009
49030 2725009 2725330 2725110 2724792 2723999 2721950 2718343 2713339 2706940 2699030 2689992 2680739 2672006 2663926 2656371 2649275
49015 2649275 2642483 2635654 2628700 2622241 2617324 2614563 2613549 2613259 2613091 2613397 2614902 2617820 2621849 2626772 2632473
49000 2632473 2638382 2643536 2647493 2650619 2653191 2654853 2655388 2655451 2655886 2656704 2657329 2657428 2656835 2655038 2651679 2647455
48984 2647455 2643661 2640699 2637695 2633750 2629018 2624373 2620496 2617426 2614650 2611524 2607896 2604273 2601085 2598020
48970 2598020 2594551 2590890 2587748 2585248 2582832 2580335 2578415 2577735 2578321 2579959 2582604 2586186 2590534 2595766
48956 2595766 2602294 2610202 2619076 2628665 2639245 2651149 2664436 2679187 2695532 2713074 2730835 2748188
48944 2748188 2765390 2782914 2800720 2818553 2836479 2854735 2873544 2893569 2916152 2942466 2972583
48933 2972583 3005793 3041599 3080025 3121194 3165095 3211678 3260806 3312206 3365719 3421487 3479620
48922 3479620 3539869 3601859 3665479 3730766 3797580 3865588 3934392 4003419 4071845 4138785 4203483
48911 4203483 4265339 4324154 4380429 4434866 4487341 4536877 4582919 4626049 4666874 4704848 4738972
48900 4738972 4769382 4797382 4823957 4848932 4871662 4891944 4910070 4926444 4941343 4954679 4965777
48889 4965777 4973725 4978182 4979812 4979776 4978722 4976100 4970428 4960516 4946616 4930227 4912588 4893649 4872651
48876 4872651 4849232 4823470 4795219 4764047 4729778 4692499 4652115 4608473 4561982 4513509 4463471
48865 4463471 4411516 4357415 4301957 4246655 4192735 4140518 4089582 4039296 3989427 3940471 3893386
48854 3893386 3848891 3807015 3767322 3729418 3693199 3658722 3626047 3595290 3566876 3541605 3520254
48843 3520254 3502956 3489012 3477381 3467358 3458900 3452541 3449039 3448776 3451359 3456020 3462545 3471531 3483511
48830 3483511 3498099 3514274 3531247 3548720 3566568 3584737 3603383 3622722 3642680 3662953 3683293
48819 3683293 3703486 3723201 3742248 3760944 3779825 3798950 3817822 3836021 3853636 3871026 3888441
48808 3888441 3905928 3923367 3940565 3957539 3974721 3992653 4011479 4030980 4051069 4071932 4093577
48797 4093577 4115536 4137163 4158088 4178304 4197920 4216901 4234911 4251443 4266170 4279136 4290445
48786 4290445 4299951 4307537 4313557 4318558 4322470 4324373 4323163 4318186 4309182 4296055 4279040 4258876 4236418
48773 4236418 4211985 4185297 4156073 4124565 4091368 4056771 4020422 3981816 3941102 3899199 3857064
48762 3857064 3815001 3772869 3730771 3689239 3648812 3609820 3572559 3537339 3504134 3472470 3441951
48751 3441951 3412861 3385985 3361808 3340052 3320093 3301696 3285173 3270852 3258699 3248605 3240870
48740 3240870 3236073 3234512 3235952 3239800 3245187 3250939 3256064 3260459 3264790 3269403 3273731 3277151 3280033 3283352
48726 3283352 3287446 3291750 3295873 3300386 3306212 3313438 3321040 3327757 3333073 3337310 3340860 3343496 3344529 3343541
48712 3343541 3340830 3337248 3333783 3331159 3329487 3328268 3327081 3326271 3326583 3328133 3330250 3332450 3334955 3337971
48698 3337971 3341089 3343824 3346206 3348341 3349935 3350851 3351735 3353322 3355375 3356893 3357145 3355903 3353100 3349079 3344933
48683 3344933 3341690 3339204 3336616 3333795 3331378 3329498 3327606 3325732 3324798 3325192 3326060 3326679 3327701 3330313 3334843
48668 3334843 3340961 3348586 3357458 3366089 3372073 3373441 3368930 3357085 3336174 3305517 3266367 3221029 3171357
48655 3171357 3118339 3062765 3005896 2949496 2895394 2844858 2798210 2755086 2715225 2678886 2646381
48644 2646381 2617348 2590812 2565949 2542509 2520341 2498862 2477381 2455859 2434900 2414846 2395224
48633 2395224 2375251 2354652 2333736 2312820 2291866 2270587 2248793 2226720 2205090 2184560 2164903
48622 2164903 2145107 2124687 2104662 2086714 2071554 2058631 2047391 2038091 2031127 2026129 2022223 2018963
48610 2018963 2016594 2015422 2015121 2014744 2013302 2010402 2006378 2001854 1997302 1993045 1989461 1986916 1985507 1985065 1985289
48595 1985289 1985689 1985607 1984676 1983178 1981539 1979476 1976053 1970702 1963812 1956151 1948013 1939137 1929237 1918319 1906555
48580 1906555 1894038 1880783 1867017 1853419 1840876 1829854 1820199 1811774 1805046 1800642 1798429 1797443 1796868
48567 1796868 1796819 1798178 1801834 1807935 1815540 1822930 1828568 1831806 1832536 1830421 1824939 1816170 1805111 1793106
48553 1793106 1781155 1769723 1758796 1748103 1737554 1727434 1717914 1708521 1698514 1687654 1676104 1663724
48541 1663724 1650073 1635223 1619993 1605255 1591532 1579252 1568702 1559444 1550481 1541499 1533488 1527670
48529 1527670 1524181 1522329 1521850 1523342 1527512 1534487 1543961 1555671 1569384 1584296 1598468 1609109 1613769
48516 1613769 1611441 1602622 1588674 1571420 1553062 1535671 1520410 1507444 1496699 1488501 1483418 1481784
48504 1481784 1483397 1487570 1493592 1501402 1511609 1524531 1539449 1555167 1570816 1585279 1596157 1600519
48492 1600519 1597055 1586774 1571480 1552398 1530583 1507583 1484835 1462812 1441358 1420493 1400441
48481 1400441 1381321 1363296 1346738 1331845 1318383 1306182 1295512 1286635 1279276 1272950 1267475 1262823
48469 1262823 1258778 1255142 1252036 1249711 1248283 1247912 1248897 1251280 1254602 1258327 1262330 1266747 1271601 1276749
48455 1276749 1281947 1286810 1290911 1293896 1295323 1294620 1291805 1288045 1284708 1281834 1278316 1273590 1268090 1261931
48441 1261931 1254401 1245325 1235758 1226521 1217048 1206622 1195808 1185634 1176057 1166414 1156869 1148215 1140587
48428 1140587 1133453 1126643 1120366 1114440 1108582 1103392 1099950 1098269 1096944 1094470 1090295 1084659 1078197 1071773
48414 1071773 1065932 1060354 1054412 1048220 1042527 1037613 1033054 1028621 1024675 1021434 1018496 1015342 1011845 1008068
48400 1008068 1003954 999449 994662 989818 985299 981586 978767 976178 972940 968805 964086 958900 953085 946874
48386 946874 941116 936625 933596 931630 930044 928202 925950 923760 922182 921212 920451 919733 919242 919114 919262 919487
48370 919487 919492 918980 918032 917208 916980 917335 918139 919487 921306 923132 924873 927414 931816 938131 945486 953047
48354 953047 960377 967310 974186 981935 991231 1001746 1012893 1024920 1038556 1053873 1070315 1087554
48342 1087554 1105287 1122238 1136471 1147129 1155262 1162704 1170564 1178893 1187406 1196319 1206680 1219791
48330 1219791 1236226 1255677 1277827 1302783 1330495 1360642 1393640 1430887 1473284 1520265 1571086
48319 1571086 1626235 1686701 1752812 1824905 1904412 1993184 2092615 2204756 2333575 2483999 2660708
48308 2660708 2869340 3118161 3417585 3779716 4220095 4758211 5414137 6206052 7152244
48299 7152244 8271068 9573403 11055714 12700460 14469229 16272426 17938350 19233103
48291 19233103 19945079 19977215 19375712 18285198 16880378 15320438 13731293 12200992 10782089
48282 10782089 9500611 8366040 7376835 6523533 5793001 5171807 4646304 4202098 3825742
48273 3825742 3506547 3235820 3005424 2808201 2638913 2493528 2368074 2258960 2163789 2080873
48263 2080873 2008313 1944227 1887553 1838012 1795359 1758903 1727407 1699276 1673210 1648887 1626643
48252 1626643 1606515 1588067 1571034 1555476 1541282 1528278 1516858 1507753 1501028 1496033 1492448 1490594
48240 1490594 1490532 1491619 1493078 1494185 1493721 1490225 1483285 1473865 1462987 1450816 1437370 1423279 1409166
48227 1409166 1394894 1380082 1364929 1349987 1335507 1321407 1307511 1293387 1278364 1262177 1245319
48216 1245319 1228410 1211566 1194660 1177743 1160706 1142851 1123270 1101631 1078398 1054570 1031333
48205 1031333 1009618 989607 970810 952755 935362 918622 902367 886572 871486 857260 843859
48194 843859 831544 820942 812239 804660 797111 789124 780971 773188 766243 760333 755180 750295 745647 741711
48180 741711 738601 735646 732231 728694 725884 724013 722452 720535 718152 715594 713143 710913 708907 707166
48166 707166 705811 704825 703840 702499 701037 700180 700337 701240 702420 703548 704174 703751 702374 701032 700621 700978
48150 700978 701323 701360 701460 701984 702902 703999 705043 705849 706493 707331 708546 709886 711108 712356 713716 714823
48134 714823 715466 716250 717909 720142 721935 723062 724411 726623 729242 731643 734069 737073 740471 743619 746525
48119 746525 749895 754060 758549 762923 767486 772718 778386 783707 788311 792638 797310 802490 808064 814189
48105 814189 821268 829408 838236 847466 857374 868461 880659 893237 905584 917832 930455 943462
48093 943462 956423 969316 982917 997910 1013845 1029356 1043460 1056286 1068531 1080617 1092611
48082 1092611 1104545 1116354 1127681 1138175 1148018 1157808 1167823 1177635 1186551 1194275 1201080 1207444 1213571
48069 1213571 1219244 1224244 1228950 1234283 1240781 1247921 1254719 1260897 1266974 1273238 1279177 1284177 1288272 1291830
48055 1291830 1294814 1296781 1297397 1296546 1293998 1289389 1282628 1274084 1264276 1253552 1242102 1230115 1217810
48042 1217810 1205368 1192893 1180358 1167516 1153913 1139078 1122887 1105778 1088532 1071637 1054873
48031 1054873 1037708 1020087 1002564 985570 968871 951972 934800 917649 900666 883865 867567
48020 867567 852335 838348 825293 813047 802004 792395 783698 775193 766831 759026 751755 744599 737654
48007 737654 731666 726969 722950 719010 715491 712957 710991 708552 705402 702353 699967 697823 695466 693441
47993 693441 692808 693853 695743 697291 697815 697401 696680 696277 696260 696154 695619 694920 694577 694730 695063 695217 694993 694267
47975 694267 692949 691085 688916 686839 685212 684037 682858 681247 679405 677923 676938 675958 674605 673058 671557
47960 671557 669972 668177 666388 664753 663119 661634 661147 662355 664849 667586 670064 672576 675589 679498
47946 679498 684676 691024 697598 703467 708840 714694 721334 728103 734639 741654 750116 760123 770787 780853
47932 780853 789427 796607 803452 810872 818500 825178 830447 834862 838774 841688 843100 843150 842032 839463 835320
47917 835320 830303 825355 820747 816140 811194 805654 799211 791793 783862 776013 768479 761244 754388 748042
47903 748042 742281 737337 733591 731035 729031 726970 724978 723712 723696 725052 727568 730754 734151 737855 742335
47888 742335 747513 752540 756895 761208 766416 772582 779208 786316 794316 802937 811176 818477 825263 832042
47874 832042 838574 844259 848924 852843 856206 858874 860530 860889 859798 857243 853259 847855 841145 833495
47860 833495 825330 816751 807470 797214 786205 775198 764987 755837 747384 739192 731280 723965 717377
47847 717377 711468 706327 701971 697812 693071 688007 684118 682593 682996 683996 684998 686393 688513 691125
47833 691125 693945 696961 700094 703042 705675 708243 711089 714391 718156 722200 726166 729893 733685 737875
47819 737875 742264 746449 750665 755726 762069 769405 777442 786384 796402 807168 818369 830383 843981
47806 843981 859481 876538 894596 913167 931749 949907 967467 984334 999989 1013420 1023793
47795 1023793 1031099 1035952 1038792 1039414 1037354 1032553 1025514 1016886 1007153 996749 986259 976261 967049 958670
47781 958670 951205 944863 939703 935324 930938 925923 920427 915332 911375 908284 905055 901109 896874 893107
47767 893107 889957 886984 883834 880479 876891 872865 868220 862923 856991 850472 843592 836763 830381 824711
47753 824711 819899 815909 812464 809263 806327 804029 802725 802388 802624 803036 803575 804637 806828 810650 816339
47738 816339 823726 832137 840703 849229 858650 870137 883668 897968 911925 925501 939052 952500
47726 952500 965702 979056 992940 1006769 1019327 1029985 1038986 1046584 1052461 1056056 1057017 1055336 1051402
47713 1051402 1045885 1039119 1030650 1019871 1007034 993159 979029 964805 950532 936317 922004 907510
47701 907510 893675 881905 872558 864427 856403 848957 843274 839510 836877 835161 835126 837217 840669 844326
47687 844326 847851 851810 856921 863611 872093 882401 894251 907078 920352 933844 947598 961697
47675 961697 976079 990517 1004630 1017870 1029584 1039364 1047357 1054045 1059563 1063345 1064674 1063495 1060474
47662 1060474 1056235 1050776 1043730 1034999 1024918 1013927 1002283 990072 977251 963617 949031 933841
47650 933841 918945 905166 892704 881372 871277 862902 856498 851732 848059 845235 843355 842572 842889
47637 842889 844055 845624 847307 849304 852103 856035 861352 868682 878786 891696 906557 922606 939849
47624 939849 958574 978824 1000771 1024863 1050813 1076865 1100940 1122347 1141664 1159172 1174212
47613 1174212 1185997 1194096 1197972 1196894 1190657 1179816 1164925 1146099 1123565 1098081 1070514 1041409
47601 1041409 1011232 980566 949840 919313 889544 861397 835374 811395 789471 769961 752843
47590 752843 737355 722881 709717 698472 689116 681162 674373 668667 663577 658415 652878 647056 641072
47577 641072 635224 630255 626789 624431 621957 618470 614071 609445 605233 601817 599259 597269 595466 593665
47563 593665 591768 589503 586669 583556 580720 578347 576179 573981 571687 569105 566004 562580 559406 556743
47549 556743 554345 552114 550409 549346 548209 546102 543089 540212 538379 537660 537782 538838 541058 543980 546362
47534 546362 547212 546798 546340 546731 547861 549245 550873 553088 555796 558272 559818 560325 560094 559426 558587 557987
47518 557987 558047 558823 559861 560529 560532 560186 560182 561030 562672 564638 566526 568295 570131 572147 574250 576249 578064
47501 578064 579787 581509 583095 584187 584513 584171 583629 583478 584067 585201 586181 586344 585707 584921 584575 584762 585402
47484 585402 586634 588591 591011 593476 595938 598670 601808 605355 609578 614834 620809 626412 630806 634258
47470 634258 637629 641329 645188 649138 653360 657676 661346 663853 665547 667170 668961 670615 672008 673448
47456 673448 675057 676339 676686 676128 675358 675110 675723 677195 679367 682115 685585 690231 696379 703846 712281
47441 712281 721833 733065 746116 760422 775540 791866 810061 829976 850700 871648 893155 915767
47429 915767 939186 962168 983366 1002151 1018691 1033359 1046168 1056758 1064869 1070564 1073920 1074751
47417 1074751 1072891 1068644 1062550 1054748 1044920 1033016 1019698 1005842 991775 977256 962060 946360
47405 946360 930623 915326 900727 886736 873097 859867 847646 836998 827747 819191 811126 804210
47393 804210 799080 795464 792601 790317 789202 789791 792030 795655 800581 806678 813554 820943 829122 838622
47379 838622 849562 861470 873650 885531 896839 907724 918585 929488 939773 948545 955467 960829
47367 960829 964891 967480 968204 966649 962348 954980 944787 932548 918977 904342 888743 872361 855327
47354 855327 837673 819640 801768 784443 767591 751101 735327 720864 707948 696378 685908
47343 685908 676334 667283 658286 649301 640962 634138 629200 625770 623181 621097 619591 618655 618000 617592 618085
47328 618085 620117 623175 625878 627642 629411 632259 635860 639050 641529 644077 647218 650576 653762 656998
47314 656998 660385 663267 664931 665561 665836 665814 664867 662626 659337 655280 650501 645341 640567 636577 632894
47299 632894 629090 625882 624576 625406 627101 628350 629143 630329 632416 635401 639391 644594 650687 656896 662934
47284 662934 669351 676687 684722 692913 701219 710131 720033 730858 742211 753597 764653 775404 786137
47271 786137 796860 807163 816893 826773 837831 850246 863074 875177 886179 896487 906606 916417
47259 916417 924866 930350 931682 928837 922710 914217 903820 891785 878582 864889 851422 838814 827438
47246 827438 817242 807919 799347 791746 785358 780191 776216 773618 772669 773320 775045 777106 779026 780971
47232 780971 783803 788627 795988 805355 815489 825481 835520 846516 859001 872553 886421 900453
47220 900453 915149 930906 947541 964527 981278 997065 1011073 1022832 1032395 1039850 1044958 1047525
47208 1047525 1047864 1046407 1043024 1037155 1028654 1018170 1006646 994762 982948 971556 960755 950310
47196 950310 939668 928447 916989 906409 897841 891504 886723 882979 880639 880390 882302 885879 890809
47183 890809 897179 905062 914411 925336 938010 952304 968013 985452 1005217 1027212 1050403 1073772
47171 1073772 1097042 1120223 1142977 1164835 1185622 1205196 1223098 1238904 1252715 1264793 1274825
47160 1274825 1282028 1285997 1287047 1285725 1282277 1276638 1268618 1258128 1245481 1231566 1217388 1203282 1188740
47147 1188740 1173175 1156736 1140288 1124705 1110333 1097069 1084822 1073816 1064468 1056990 1051147 1046386
47135 1046386 1042203 1038478 1035609 1034310 1035090 1037830 1041995 1047258 1053684 1061162 1068885 1075695 1080869 1084395
47121 1084395 1086563 1087529 1087272 1085654 1082441 1077425 1070704 1062768 1054192 1045220 1035594 1024855 1012913 1000436
47107 1000436 988476 977470 966719 955183 942789 930595 919526 909332 899042 888179 877101
47096 877101 866300 855791 845253 834506 823773 813712 805215 798852 794358 790885 787856 785350 783633
47083 783633 782717 782626 783709 786144 789332 792314 794803 797377 800549 804098 807496 810626 813792 817198 820645
47068 820645 823626 825636 826569 826935 827478 828481 829621 830527 831140 831415 831131 830352 829748 830059 831365 833190 835150
47051 835150 837152 839199 841474 844546 849012 854834 861329 867851 874221 880550 886996 893715 900729 907797
47037 907797 914654 921405 928395 935746 943344 951256 959714 968569 977197 985166 992736 1000513 1008841 1017631
47023 1017631 1026518 1035029 1042877 1050209 1057258 1063690 1068711 1072030 1074246 1075872 1076413 1074972 1071564 1067231
47009 1067231 1062867 1058483 1053749 1048767 1043961 1039525 1035295 1031130 1027128 1023446 1020018 1016571 1012983 1009611
46995 1009611 1007208 1006323 1006837 1008176 1009970 1012300 1015341 1019030 1023259 1028171 1033995 1040700 1048044 1055884
46981 1055884 1064107 1072336 1080215 1088236 1097784 1109822 1123719 1137794 1150902 1163036 1174560 1185640
46969 1185640 1196568 1207911 1219798 1231509 1242199 1251718 1260329 1267995 1274470 1279814 1284269 1287778 1290227
46956 1290227 1292054 1294036 1296429 1298752 1300439 1301258 1301176 1300384 1299533 1299420 1300274 1301772 1303898 1307305 1312529 1319183
46940 1319183 1326189 1332669 1338573 1344654 1351780 1359999 1368360 1376012 1383364 1391649 1401394 1411954 1422578
46927 1422578 1433194 1443955 1454627 1464779 1474052 1481983 1488120 1492539 1495637 1497124 1495936 1491592 1484902
46914 1484902 1476752 1466894 1454706 1440641 1426009 1411638 1397576 1383903 1370987 1358996 1347870 1337771
46902 1337771 1329014 1321641 1315683 1311741 1310618 1312419 1316613 1323018 1331986 1343619 1357470 1373263 1391289
46889 1391289 1411822 1434568 1458865 1484034 1509382 1534312 1558537 1581892 1603966 1624449 1643696
46878 1643696 1662231 1679554 1694236 1705561 1714404 1722084 1728960 1734724 1739506 1744004 1748751 1753853 1759327
46865 1759327 1765156 1771188 1777463 1784628 1793603 1804787 1817891 1832530 1848576 1865866 1883840 1901714
46853 1901714 1918950 1935501 1951526 1966859 1980874 1993058 2003603 2013107 2021649 2028565 2033241 2035731
46841 2035731 2036381 2035330 2032790 2029409 2025718 2021400 2015708 2008686 2001483 1995366 1990809 1987649 1985688 1984879
46827 1984879 1985217 1986817 1990050 1995374 2003000 2012768 2024411 2037833 2053056 2069823 2087354 2104718 2121444
46814 2121444 2137452 2152315 2165102 2175412 2184218 2192934 2201611 2208739 2213051 2214884 2215366 2214805 2212623
46801 2212623 2208608 2203413 2197702 2191425 2184263 2176343 2168132 2159909 2151835 2144420 2138436 2134283 2131787 2130730
46787 2130730 2131180 2133022 2135506 2137789 2139890 2142652 2146639 2151431 2156275 2161100 2166478 2172695 2179316 2185739
46773 2185739 2191778 2197508 2202847 2207709 2212496 2218123 2225377 2234358 2244577 2255511 2267003 2279262 2292593
46760 2292593 2307120 2322723 2339209 2356552 2374971 2394778 2416232 2439451 2464307 2490279 2516534
46749 2516534 2542298 2567213 2591303 2614644 2637132 2658415 2677848 2694565 2707982 2718513 2727557
46738 2727557 2736385 2744896 2751705 2755601 2756791 2756595 2756107 2755428 2754116 2752074 2749893 2748512 2748698 2750674 2754086
46723 2754086 2758445 2763743 2770511 2779084 2788867 2798526 2806895 2813609 2819004 2823615 2827633 2830499 2831074 2828535
46709 2828535 2823072 2815342 2805301 2792132 2775423 2755764 2733844 2709575 2682624 2653320 2622353 2589929
46697 2589929 2555978 2521008 2485910 2450902 2415399 2379106 2342549 2306390 2270921 2236498 2203791
46686 2203791 2173075 2143818 2115463 2088208 2062584 2038615 2015950 1994507 1974469 1955859 1938599
46675 1938599 1922785 1908397 1894870 1881484 1868160 1855434 1843724 1833135 1823914 1816485 1810848 1806409
46663 1806409 1802699 1800000 1799042 1800223 1803302 1807678 1812849 1818649 1825153 1832347 1839894 1847270 1854027 1859880
46649 1859880 1864685 1868451 1871229 1872873 1873137 1872156 1870483 1868381 1865430 1861328 1856845 1853428 1851948 1852373 1854581
46634 1854581 1858834 1865366 1874108 1885134 1898907 1915793 1935624 1957929 1982169 2007512 2032768 2056910
46622 2056910 2079483 2100330 2119216 2135905 2150173 2161400 2168472 2170574 2167917 2161492 2152294 2141046
46610 2141046 2128190 2113581 2096459 2076434 2054481 2032382 2011118 1990390 1969869 1950224 1932440
46599 1932440 1916559 1901703 1887202 1873137 1859816 1847274 1835543 1825008 1816072 1808514 1801464 1794047
46587 1794047 1785915 1777183 1768092 1758825 1749467 1739956 1730196 1720366 1711097 1703124 1696664 1691162 1685733 1679886
46573 1679886 1673908 1668634 1664786 1662460 1661225 1660691 1660853 1661813 1663351 1665025 1666682 1668674 1671510 1675385 1680076
46558 1680076 1685135 1690159 1695009 1699904 1705262 1711394 1718340 1725899 1733750 1741642 1749681 1758446 1768609 1780322
46544 1780322 1793109 1806426 1820152 1834418 1849113 1863920 1878961 1895169 1913737 1935059 1958335
46533 1958335 1982257 2006046 2029813 2054166 2079748 2107063 2136423 2167915 2201581 2237540 2275685
46522 2275685 2315254 2355170 2394978 2435072 2475720 2516289 2555802 2593918 2630733 2665845 2698259
46511 2698259 2727321 2753169 2776079 2795846 2812084 2824832 2834555 2841737 2846661 2849450 2850089 2848478 2844713
46498 2844713 2839319 2833148 2826905 2820651 2813795 2805722 2796477 2786576 2776132 2764608 2751667 2737755 2723221
46485 2723221 2707261 2688518 2666681 2642661 2617074 2589326 2558541 2524719 2488501 2450294 2410144
46474 2410144 2368217 2324903 2280622 2235892 2191482 2148209 2106708 2067518 2031094 1997513 1966477
46463 1966477 1937937 1912577 1891340 1874706 1862658 1855098 1851909 1852776 1857279 1865151 1876186 1890003
46451 1890003 1906144 1924290 1944142 1965207 1986930 2008895 2030640 2051363 2070096 2086128 2099196
46440 2099196 2109484 2117556 2123910 2128263 2129562 2127192 2122001 2115644 2109021 2101860 2093763 2084973 2075906 2066519
$$ [...]
##END NTUPLES=NMR SPECTRUM
##END=
