##TITLE=AC1613_BRAAN13343_8317232_K7zRmm9ZwH
##JCAMPDX= 6.0         $$ Bruker NMR JCAMP-DX V2.0
##DATA TYPE= NMR SPECTRUM
##DATA CLASS= NTUPLES
##ORIGIN= BRUKER
##OWNER= Administrator
$$ 1.72 TOPSPIN		Version 2.1
$$ 2013-11-13 18:43:58.376 -0800  Administrator@X
$$ Compression mode = diff/dup
##.OBSERVE FREQUENCY= 400.02188249412
##.OBSERVE NUCLEUS= ^1H
##.ACQUISITION MODE= SIMULTANEOUS (DQD)
##.ACQUISITION SCHEME= undefined
##.AVERAGES= 8
##.DIGITISER RES= 22
##SPECTROMETER/DATA SYSTEM= spect
##.PULSE SEQUENCE= zg30
##.SOLVENT NAME= COFFEE_meoh
##.SHIFT REFERENCE= INTERNAL, COFFEE_meoh, 1, 14.98509
##AUDIT TRAIL= $$ (NUMBER, WHEN, WHO, WHERE, PROCESS, VERSION, WHAT)
$$ ##TITLE= Audit trail, TOPSPIN		Version 2.1
$$ ##JCAMPDX= 5.01
$$ ##ORIGIN= Bruker BioSpin GmbH
$$ ##OWNER= Administrator
$$ $$ E:\/data/COFFEE/nmr/AC1613_BRAAN13343_8317232_K7zRmm9ZwH/10/pdata/1/auditp.txt
$$ ##AUDIT TRAIL=  $$ (NUMBER, WHEN, WHO, WHERE, PROCESS, VERSION, WHAT)
(   1,<2013-11-13 18:43:51.220 -0800>,<Administrator>,<X>,<go>,<TOPSPIN 2.1>,
      <created by zg
	started at 2013-11-13 18:42:45.032 -0800,
	POWCHK enabled, PULCHK disabled,
       configuration hash MD5:
       C8 4E 4E 5D D3 5C D8 9E 9F 52 82 E0 59 8A DE 15
       data hash MD5: 64K
       32 F6 4F 5D 05 A3 BB A3 D1 E5 23 9E 75 15 00 E0>)
(   2,<2013-11-13 18:43:54.376 -0800>,<Administrator>,<X>,<proc1d>,<TOPSPIN 2.1>,
      <Start of raw data processing
       efp LB = 0 FT_mod = 6 PKNL = 1 PHC0 = 0 PHC1 = 0 SI = 32K 
       data hash MD5: 32K
       73 61 30 25 AB 45 F3 9F A5 F0 F3 1B AA AF 5D 85>)
(   3,<2013-11-13 18:43:54.845 -0800>,<Administrator>,<X>,<proc1d>,<TOPSPIN 2.1>,
      <pk PHC0 = 92.20276 PHC1 = 0 
       data hash MD5: 32K
       FD 73 4F 49 12 42 81 0B 42 C8 77 CA 9F C0 52 B8>)
(   4,<2013-11-13 18:43:55.079 -0800>,<Administrator>,<X>,<proc1d>,<TOPSPIN 2.1>,
      <abs ABSG = 1 
       data hash MD5: 32K
       5E AC 0F 7B F9 13 99 BB B5 FD 39 B9 98 A6 77 36>)
(   5,<2013-11-13 18:43:55.157 -0800>,<Administrator>,<X>,<proc1d>,<TOPSPIN 2.1>,
      <abs ABSG = 2 
       data hash MD5: 32K
       40 95 F6 9F 5B 4F 9E F7 50 7E 1A EE 93 43 3C ED>)
(   6,<2013-11-13 18:43:55.220 -0800>,<Administrator>,<X>,<proc1d>,<TOPSPIN 2.1>,
      <abs ABSG = 3 
       data hash MD5: 32K
       BB 03 76 C3 75 D7 A4 D8 C8 8C AD B2 23 BD B2 17>)
(   7,<2013-11-13 18:43:55.266 -0800>,<Administrator>,<X>,<proc1d>,<TOPSPIN 2.1>,
      <abs ABSG = 4 
       data hash MD5: 32K
       5F BF 55 4D D3 72 5E F4 D5 69 B4 78 63 0B CC D3>)
(   8,<2013-11-13 18:43:55.313 -0800>,<Administrator>,<X>,<proc1d>,<TOPSPIN 2.1>,
      <abs ABSG = 5 
       data hash MD5: 32K
       1A 93 2A 01 55 6D 58 8B CC 9A 0B 91 23 EC C2 3B>)
$$ ##END=
$$ 
$$ $$ hash MD5
$$ $$ CD 56 EA 47 C8 9A 68 1B 6E 08 47 1A CA A0 B7 32
##$RELAX= 
##$RELAX= 
##$RELAX= 
##$RELAX= 
##$RELAX= 
##$RELAX= 
##$RELAX= 
$$ Bruker specific parameters
$$ --------------------------
##$DU= <E:\>
##$EXPNO= 10
##$NAME= <AC1613_BRAAN13343_8317232_K7zRmm9ZwH>
$$ [...]
##$TP= (0..7)
150 150 150 150 150 150 150 150
##$TP07= 0
##$TPNAME0= <>
##$TPNAME1= <>
##$TPNAME2= <>
##$TPNAME3= <>
##$TPNAME4= <>
##$TPNAME5= <>
##$TPNAME6= <>
##$TPNAME7= <>
##$TPOAL= (0..7)
0.5 0.5 0.5 0.5 0.5 0.5 0.5 0.5
##$TPOFFS= (0..7)
0 0 0 0 0 0 0 0
##$TUNHIN= 0
##$TUNHOUT= 0
##$TUNXOUT= 0
##$USERA1= <user>
##$USERA2= <user>
##$USERA3= <user>
##$USERA4= <user>
##$USERA5= <user>
##$V9= 5
##$VALIST= <valist>
##$VCLIST= <CCCCCCCCCCCCCCC>
##$VD= 0
##$VDLIST= <DDDDDDDDDDDDDDD>
##$VPLIST= <PPPPPPPPPPPPPPP>
##$VTLIST= <TTTTTTTTTTTTTTT>
##$WBST= 1024
##$WBSW= 4
##$XGAIN= (0..3)
0 0 0 0
##$XL= 0
##$YL= 0
##$YMAX_a= 621940
##$YMIN_a= -530883
##$ZGOPTNS= <>
##$ZL1= 120
##$ZL2= 120
##$ZL3= 120
##$ZL4= 120
##$ABSF1= 14.98509
##$ABSF2= -5.573092
##$ABSG= 5
##$ABSL= 3
##$ALPHA= 0
##$AQORDER= 0
##$ASSFAC= 0
##$ASSFACI= 0
##$ASSFACX= 0
##$ASSWID= 0
##$AUNMP= <proc_prof1d_extract_pilot.lims>
##$AXLEFT= 0
##$AXNAME= <>
##$AXNUC= <1H>
##$AXRIGHT= 0
##$AXTYPE= 0
##$AXUNIT= <>
##$AZFE= 0.1
##$AZFW= 0.1
##$BCFW= 0
##$BC_mod= 0
##$BYTORDP= 0
##$COROFFS= 0
##$CY= 15
##$DATMOD= 1
##$DC= 0
##$DFILT= <>
##$DTYPP= 0
##$F1P= 0
##$F2P= 0
##$FCOR= 0.5
##$FTSIZE= 32768
##$FT_mod= 6
##$GAMMA= 0
##$GB= 0
##$INTBC= 1
##$INTSCL= 1
##$ISEN= 128
##$LB= 0
##$LEV0= 0
##$LPBIN= 0
##$MAXI= 10000
##$MC2= 0
##$MEAN= 0
##$ME_mod= 0
##$MI= 0
##$NCOEF= 0
##$NC_proc= -8
##$NLEV= 6
##$NOISF1= 0
##$NOISF2= 0
##$NSP= 0
##$NTH_PI= 0
##$NZP= 0
##$OFFSET= 14.98509
##$PC= 1
##$PHC0= 92.20276
##$PHC1= 0
##$PH_mod= 1
##$PKNL= yes
##$PPARMOD= 0
##$PPDIAG= 0
##$PPIPTYP= 0
##$PPMPNUM= 2147483647
##$PPRESOL= 1
##$PSCAL= 4
##$PSIGN= 0
##$PYNMP= <proc.py>
##$REVERSE= no
##$SF= 400.02
##$SI= 32768
##$SIGF1= 0
##$SIGF2= 0
##$SINO= 400
##$SIOLD= 32768
##$SPECTYP= <>
##$SREGLST= <1H.CDCl3>
##$SSB= 0
##$STSI= 32768
##$STSR= 0
##$SW_p= 8223.68421052631
##$SYMM= 0
##$S_DEV= 0
##$TDeff= 65536
##$TDoff= 0
##$TI= <>
##$TILT= no
##$TM1= 0
##$TM2= 0
##$TOPLEV= 0
##$USERP1= <user>
##$USERP2= <user>
##$USERP3= <user>
##$USERP4= <user>
##$USERP5= <user>
##$WDW= 1
##$XDIM= 32768
##$YMAX_p= 465618020
##$YMIN_p= -676121
##$CURPLOT= <Network HP LaserJet P1505>
##$CURPRIN= <$Network HP LaserJet P1505>
##$DFORMAT= <normdp>
##$LAYOUT= <+/1D_H.xwp>
##$LFORMAT= <normlp>
##$PFORMAT= <normpl>
##$SURQMSG= 1
$$ End of Bruker specific parameters
$$ ---------------------------------
##NTUPLES= NMR SPECTRUM
##VAR_NAME=  FREQUENCY,     SPECTRUM/REAL,   SPECTRUM/IMAG
##SYMBOL=    X,             R,               I
##VAR_TYPE=  INDEPENDENT,   DEPENDENT,       DEPENDENT
##VAR_FORM=  AFFN,          ASDF,            ASDF
##VAR_DIM=   32768,         32768,           32768
##UNITS=     HZ,            ARBITRARY UNITS, ARBITRARY UNITS
##FACTOR=    0.250966925370066, 1,           1
##FIRST=     8223.43324360094, -206584,      -42345
##LAST=      0,             -147317,         -57129
##MIN=       0,             -676121,         0
##MAX=       8223.43324360094, 465618020,    0
$$ Real data points
##PAGE= N=1
##DATA TABLE= (X++(R..R)), XYDATA
$$ [...]
$$ plain form
19567 -23793 -187420 33469 9077 -264249 -93896 115625 30156 -526947 -341453 -376834 103782
19555 195448 1421 -362911 -46528 -114627 239377 -9930 -162288 -409513 -248822 -199670 -92886
19543 -209429 55352 41799 -28399 -110326 -522493 -9610 -90442 84318 -47900 -311139 140036
19531 -175896 -131126 52471 281464 64591 101330 327382 -73418 47658 -83611 106768 -291566
19519 -280001 -188893 75923 16528 -2645 190761 -128472 89722 -266305 -30401 -140683 -80347
19508 -80347 153862 182702 48670 251247 -54982 352199 -219857 -183039 -162411 -298167 4798
19496 -218392 287497 -208794 118868 256760 -16589 -178277 -256877 219224 -112178 -156502
19486 -156502 170066 -54057 -61811 -158467 1459 -216514 -221505 169609 -10650 93344 -20613
$$ packed form
19567b3793j63627C3469I077b64249i3896A15625C0156e26947J85494l5381A03782
19555A95448A421c62911d6528o8099B39377i930j52358k47225J60691M9152i2886
19543b09429E5352j3553b8399q1927m12167i610q0832H4318d7900k63239A40036
19531a75896M4770E2471K28993F4591L6739K26052g3418D7658h3611A06768b91566
19519b80001R1108G5923A6528b645A90761a28472H9722b66305c0401j10282O0336
19508h0347A53862K8840D8670K02577e4982C52199b19857L6818K0628j35756D798
19496b18392B87497b08794A18868J37892a6589j61688p8600B19224a12178m4324
19486a56502A70066e4057p754r6656A459b16514m991A69609a0650I3344b0613
$$ plain form
19474 -186455 124089 -51167 -121821 -70680 159675 -252161 -127554 68677 -132719 -408426
19464 -408426 -87955 75226 -191553 201504 -290127 36405 274483 -112419 -338187 -196750
19454 -196750 -105136 -158546 215205 9272 -62953 42622 197214 -40453 -223268 -24804 75232
19442 136539 -182956 -60090 -297466 -45160 -9364 97085 -161585 -33869 -110033 186888 -89364
19430 -223397 214412 137018 -38761 -183621 37793 -236419 -135480 22097 -56483 -72505 92684
19418 -100158 49072 -251051 -331387 -45895 85985 22784 -113161 41274 -311827 28063 -228447
19406 135442 -9142 -129150 -230609 -169001 -13018 -152091 -241657 -165987 -52168 -156955 79097
19394 -7459 -266614 -55164 -221609 -168807 -77462 -248502 -232931 -14798 138852 299814 144766
$$ packed form
19474a86455A24089e1167p0654N1141A59675b52161J24607F8677a32719k75707
19464d08426h7955G5226a91553B01504b90127C6405K38078a12419k25768J41437
19454a96750R1614n3410B15205I272f2953D2622J54592d0453j82815b4804G5232
19442A36539a82956f0090k37376d5160i364I7085a61585c3869p6164A86888h9364
19430b23397B14412p7394c8761j44860C7793b36419J00939B2097e6483j6022I2684
19418a00158D9072b51051q0336d5895H5985B2784a13161D1274c11827B8063b28447
19406A35442i142j20008j01459O1608a3018j39073q9566P5670e2168j04787G9097
19394g459k59155e5164j66445N2802g7462j71040J5571a4798A38852J60962A44766
$$ plain form
19382 107139 -274007 79159 -85098 93749 -477236 -218899 -464999 -20257 -151271 213807
19371 76161 -387487 144093 -257765 -140291 -4357 -309507 -98992 -106575 -13281 -89178 -76154
19360 -76154 22190 7431 -42461 -53260 49538 -334558 -89695 -26583 -47830 48341 -186733
19348 -47992 94259 -171244 -34736 -65052 49642 -283500 -130541 8339 -157351 -314511 86130
19336 140945 -83925 -136965 -71559 -37818 -338 -101826 -2538 -364815 108868 -211832 -83170
19324 -149811 112313 118424 -140043 -95989 -83871 -107732 -1163 -115562 -97375 372533 -250343
19312 -167579 -77351 100100 -370235 -19063 -158907 -366562 -165042 -38088 -41098 31833 -178590
19300 220199 -114389 157760 -236904 92749 -31430 67028 -193079 -12750 -85747 -261511
$$ packed form
19382A07139b74007G9159h5098I3749d77236b18899k46100b0257j31014B13807
19371G6161c87487A44093b57765J17474d357l05150i8992p583a3281p5897J3024
19360g6154B2190G431d2461j0799D9538c34558h9695b6583k1247D8341a86733
19348d7992I4259a71244c4736l0316D9642b83500a30541H339a57351j57160H6130
19336A40945h3925n3040O5406L3741c38j01488b538l62277A08868b11832h3170
19324a49811A12313O111a40043M4054J2118k3861a163j14399J8187C72533b50343
19312a67579g7351A00100c70235a9063j39844k07655a65042c8088l010C1833a78590
19300B20199a14389A57760b36904I2749c1430F7028a93079a2750p2997j75764
$$ plain form
19290 -261511 -129274 5488 -186499 130171 172596 240169 -171728 -31261 -50363 -313010 59322
19278 164565 -264900 -302342 230704 -50096 283077 232318 -297100 107538 -118100 91495
19267 79465 -93569 -61799 -37096 -182740 -208569 -181231 -194761 1142 -154597 -36450 71232
19255 -158669 -203299 -75448 121975 -371034 24231 -99552 -68337 242541 -176144 -311977
19245 -311977 105553 355726 52359 -282114 -91520 -27494 -239781 -87836 -93421 -87746 19288
19233 -174273 193793 287507 25678 -153533 -120693 -360229 -116238 -258255 -20023 -2716 -233499
19222 -233499 -50271 257970 -274485 13160 109187 -281387 -214648 105742 278039 53261
19211 -18363 -163084 -180220 260786 350 -11335 -323305 113207 -130352 -469818 -58354 -200922
$$ packed form
19290b61511a29274E488a86499A30171M2425O7573a71728c1261j9102k62647E9322
19278A64565b64900l7442B30704e0096B83077n0759b97100A07538a18100I1495
19267G9465i3569L1770K4703j45644k5829K7338j3530A142a54597c6450G1232
19255a58669m4630g5448A21975c71034B4231i9552L1215B42541a76144j35833
19245c11977A05553K50173E2359b82114i1520b7494k12287h7836n585N675A9288
19233a74273A93793R3714B5678a53533L2840k39536a16238j42017b0023b716k30783
19222b33499e0271B57970b74485A3160R6027b81387O6739A05742J72297E3261
19211a8363j44721j7136B60786C50a1335l11970A13207a30352l39466e8354j42568
$$ plain form
19200 -200922 -180143 35834 256843 150025 22532 73812 49691 -193357 -218737 -69710 -99591
19189 -99591 -306550 -87004 222324 42175 -102372 35009 -17077 -46630 395939 55655 -176138
19177 266604 -174446 -133937 -291161 -169040 -53986 -44586 -162777 -79687 298319 -28324 -161984
19166 -161984 464 -91496 -108539 21752 147535 -55336 257861 -249981 176748 -151095 -221688
19155 -221688 -406693 46357 -342689 -221830 187414 -11066 79651 -250388 37109 -420221
19144 -1167 -266831 -179324 -61880 321835 85392 -139361 -227600 71987 102556 -64019 191795
19132 -147796 -122125 -142557 -89222 -80655 111332 -320187 137162 -29868 -170132 -227037 2818
19120 -129405 -125129 -136398 -423827 -344997 62335 -156727 -344804 153811 -236843 -108588
$$ packed form
19200b00922K0779C5834K21009j06818B2532N1280k4121a93357k5380f9710k9881
19189i9591k06959h7004B22324D2175a02372C5009a7077k9553C95939E5655a76138
19177B66604a74446M0509j57224J22121e3986R400j18191g9687B98319b8324j33660
19166a61984D64i1496j7043B1752J25783e5336B57861b49981A76748a51095p0593
19155b21688j85005D6357c42689J20859A87414a1066G9651b50388C7109d20221
19144a167k65664Q7507f1880C21835H5392a39361q8239G1987L0569f4019A91795
19132a47796K5671k0432N3335Q567A11332c20187A37162b9868j40264n6905B818
19120a29405M276j1269k87429P8830F2335a56727j88077A53811b36843a08588
$$ plain form
19109 -462607 -289885 -334768 -505133 254482 -91991 155295 158942 -198872 -402777 106934
19098 -9090 -77996 134509 -246345 185116 -142867 -263994 -80842 319513 -119913 -65696
19088 -65696 265017 111498 -135773 107900 113987 -202478 250770 -291828 -38877 -201481
19078 -201481 -29712 142055 34031 -48998 -79351 13161 -96412 73852 -79921 43280 -168362
19066 126943 120002 -75620 -162490 -56118 -128145 -79732 -136091 5164 -22246 -151955 -119895 186807
19053 -31569 -74586 -412701 -56506 -80824 -316615 -44494 -74853 -192889 -157004 291504 -63251
19041 66422 34760 -210988 65081 -580441 1547 72725 172904 -43406 240906 -10419 -107486
19030 -107486 335820 201019 32622 192342 -304267 80146 -71915 397385 61342 69437 236444
$$ packed form
19109d62607J72722m4883j70365B54482i1991A55295L647a98872k03905A06934
19098i090o8906A34509b46345A85116a42867j21127h0842C19513a19913N4217
19088f5696B65017A11498a35773A07900O087b02478B50770b91828c8877j62604
19078b01481b9712A42055C4031d8998l0353A3161i6412G3852g9921D3280a68362
19066A26943o941g5620q6870e6118p2027M8413n6359E164b2246j29709L2060A86807
19053c1569m3017l38115e6506k4318k35791d4494l0359j18036L5885B91504f3251
19041F6422l1662b10988F5081e80441A547P1178J00179d3406B40906a0419r7067
19030a07486C35820j34801C2622J59720c04267H0146g1915C97385F1342Q095J67007
$$ plain form
19019 236444 -185564 71988 83144 301837 134265 -96919 -301140 45916 64980 -44855 88170
19007 -12507 -168547 -277941 -140670 -272311 -141140 -54412 58679 -121719 -91023 -12327
18996 -308669 -130988 -75524 5306 -278763 -435787 -145969 -81599 -299946 -209482 -314146
18986 -314146 -218788 -372275 -27014 -2706 -164409 193197 -232282 -202930 50168 28450 -103064
18974 2552 62008 208357 176210 -70326 -11202 84438 52343 -301044 314563 -107788 64391
18962 258065 -5900 -178106 121386 -123233 258541 79888 -136980 -168344 -253114 21556 -101163
18950 -54860 -210136 -54193 104043 -128320 -106879 -319521 474975 100591 -159726 -224699
18940 -224699 -416824 -122396 -269228 -353898 205731 19425 -306433 -64376 152546 156008
$$ packed form
19019B36444a85564G1988J1156K18693A34265i6919k04221D5916J9064d4855H8170
19007a2507j56040j09394J37271j31641J31171e4412E8679a21719L0696a2327
18996c08669a30988N5464E306b78763j57024a45969O4370k18347R0464j04664
18986c14146R5358j53487b7014b706j61703A93197b32282K9352E0168k1718a03064
18974B552N9456J46349l2147g0326a1202H4438l2095c01044C14563a07788F4391
18962B58065e900j72206A21386a23233B58541G9888a36980l1364q4770B1556a01163
18950e4860j55276e4193A04043a28320K1441k12642D74975A00591a59726o4973
18940b24699j92125a22396j46832q4670B05731A9425c06433f4376A52546L462
$$ plain form
18930 156008 -143844 83298 196894 98528 2610 277597 -179818 -69238 -143889 -230598 140693
18918 120864 -40824 244279 179701 -45484 244362 -44383 55116 80097 337176 -147713 -63378
18906 -23750 -131721 -230189 -237721 13484 238171 -9382 -119466 -183840 -287018 83079 75094
18895 75094 -2730 -236909 -7739 -71877 177562 181461 -133942 -340740 127195 214804 -186962
18883 -17899 -261442 -185173 -76495 75097 40127 -69129 -90263 -181619 69317 -316074 56453
18871 -46807 175185 3006 51136 -131367 -212618 -146880 187586 -277215 3640 -181298 -22985
18859 161839 -45823 -122174 -134626 -264954 -126166 204285 -178453 -226552 -85035 186197
18848 114402 71181 -212364 -209164 -271111 166115 138542 -259322 163432 172813 266845 -246809
$$ packed form
18930A56008a43844H3298J13596r8366B610K74987a79818f9238p4651q6709A40693
18918A20864d0824B44279o4578d5484B44362d4383E5116K4981K57079a47713f3378
18906b3750j07971r8468p532A3484K24687i382j10084o4374j03178H3079p985
18895G5094b730k34179g739o4138A77562L899a33942k06798A27195Q7609a86962
18883a7899k43543P6269g6495G5097l4970f9129k1134r1356F9317c16074E6453
18871d6807A75185C006M8130a31367q1251O5738A87586b77215C640a81298b2985
18859A61839d5823p6351j2452j30328a26166B04285a78453m8099h5035A86197
18848A14402m3221b12364L200o1947A66115k7573b59322A63432R381R4032b46809
$$ plain form
18836 -101528 -26813 38537 -492743 6263 -115061 -26021 -17891 -110842 201422 113325 -170696
18824 44267 -261981 147988 -243973 -275590 -26717 -311751 14397 -133057 140773 -93102
18813 307754 -396887 153844 77819 175346 241025 331541 165257 -40207 197444 -443778
18802 -61165 40604 445948 -76094 657 -320081 -80102 61327 212611 7519 -9016 68862 -112882
18789 95231 131058 -234096 -358002 -214001 104165 -146545 71264 -256521 -420406 44499
18778 154503 -45786 -151765 197105 171916 26817 -39905 -302592 57494 246528 -201056
18767 -290843 129527 30244 325715 107661 87559 -49884 -88243 -409574 215262 -4651 19035
18755 -46055 -346362 -160132 -41680 -36234 314514 -47993 -175779 15750 -48063 18924 39156
$$ packed form
18836a01528b6813C8537d92743F263a15061b6021Q130r2951B01422q8097a70696
18824D4267b61981A47988b43973l1617b6717k85034A4397a33057A40773i3102
18813C07754c96887A53844p6025R7527O5679R0516A65257d0207A97444d43778
18802f1165D0604M05344g6094F57c20081h0102F1327J51284G519i016F8862a12882
18789I5231L5827b34096j23906J44001A04165a46545G1264b56521j63885D4499
18778A54503d5786j05979A97105k5189B6817c9905k62687E7494J89034b01056
18767b90843A29527C0244K95471A07661k0102d9884l8359l21331B15262d651A9035
18755d6055l00307a60132d1680N446C14514d7993j27786A5750d8063A8924K0232
$$ plain form
18744 39156 -338912 56334 -290391 -192798 -64256 -200869 -105382 -106923 -292154 -443403 41264
18732 -63698 -58410 -5801 25642 -358552 -127308 -70991 -129681 4108 -105929 -223706 -304742
18721 -304742 191509 -190726 -148075 -217942 -90241 -86431 -38193 21867 -217377 29894 -445711
18709 -34385 -237690 115127 120588 -56441 -347667 -145060 -305368 -336690 -332022 -155354 178419
18697 178556 -33060 -123865 -84732 -54148 -113138 53219 40425 -240138 -154608 -242493 -260337
18686 -260337 95446 -253545 76127 1229 61227 144588 158997 233054 -3221 -74337 -167362 3424
18673 -161135 -100542 -82873 77105 71745 109829 54558 -130300 -14464 67885 -241587 -151316
18662 -151316 -160511 -47948 116547 -121869 -57285 186768 -114788 87167 131572 -179564 21428
$$ packed form
18744C9156c38912E6334b90391R7593f4256j36613R5487j541j85231j51249D1264
18732f3698N288e801B5642c58552a27308N6317n8690D108a05929j17777q1036
18721c04742A91509a90726M2651o9867i0241L810c8193B1867b17377B9894d45711
18709c4385k03305A15127N461e6441k91226a45060j60308l1322M668a55354A78419
18697A78556c3060r0805L9133L0584n8990E3219j2794b40138Q5530q7885j7844
18686b60337I5446b53545G6127A229N9998Q3361J4409P4057c221p1116r3025C424
18673a61135O0593J7669G7105n360L8084E4558a30300a4464F7885b41587R0271
18662a51316r195d7948A16547a21869e7285A86768a14788H7167M4405a79564B1428
$$ plain form
18650 -324897 -171630 -61430 -40990 93783 98925 -203196 -426862 -219530 287230 -206229
18639 10475 288207 56600 -304493 -3198 -3256 147850 -67924 -261793 -229339 97807 -50858 -122060
18627 -122060 -13720 -41365 -88927 56372 -35668 11291 -88529 49298 -11052 11728 225997
18616 225997 21872 -109792 -320733 -173176 157519 -184673 54945 -68589 -138110 -39383
18605 -133732 -171682 63764 -200554 63451 235718 -235345 147543 54519 8447 -39775 -50302
18594 -50302 -217875 228425 1512 3424 -127491 -46482 -201415 22118 -98047 -245571 117120
18582 -24375 -45760 106591 47194 47121 -61880 100408 -12003 -37008 -146444 10461 -61210 95205
18569 -116117 226320 -16987 -93332 109657 21030 -6728 -298494 -85301 -251546 266937 -72647
$$ packed form
18650c24897J53267f1430K0440I3783N142b03196k23666K07332B87230b06229
18639A0475K77732E6600c04493c198n8A47850f7924j93869L2454I7807e0858p1202
18627a22060a3720k7645m7562E6372c5668A1291h8529D9298a1052A1728K14269
18616B25997B1872a09792k10941J47557A57519a84673E4945f8589o9521c9383
18605a33732l7950F3764b00554F3451J72267b35345A47543E4519H447c9775j0527
18594e0302j67573B28425A512J912a27491d6482j54933B2118i8047j47524A17120
18582b4375k1385A06591D7194p3f1880A00408a2003k5005j09436A0461f1210I5205
18569a16117B26320a6987p6345A09657B1030f728k91766h5301j66245B66937g2647
$$ plain form
18557 66397 105957 247006 -221396 -97521 -41429 -166684 36090 -170875 -139705 281777 -172627
18545 -44077 -16542 185364 -63388 -451327 89193 -238659 -34318 498266 118013 -227692
18534 -26802 -89200 -204694 175909 29752 -300591 -231225 -240141 -275709 41881 -146154 -359923
18523 -359923 28820 -105707 -66258 -32683 476173 -242662 -20310 -283420 -129706 -61869
18512 -191611 -191086 -356263 -124320 158102 155685 -213382 137093 53819 -84464 187609 109993
18501 109993 109434 14999 -186208 -222453 -121426 126551 -23522 80694 117097 -245255 -19778
18489 -394998 -239711 -105841 -146715 -198160 228576 -56413 136544 50452 172982 -173518
18478 1684 -101661 -75670 -209053 20222 -15192 -189255 -63877 57714 -127983 -276149 -323325
$$ packed form
18557F6397L9560J41049b21396i7521d1429j25255C6090a70875L1170B81777a72627
18545d4077a6542A85364f3388l87939H9193b38659c4318D98266A18013b27692
18534b6802o2398j15494A75909B9752c00591O9366q916l5568D1881a46154k13769
18523c59923B8820a05707L9449c2683D76173b42662b0310k63110a29706f1869
18512a91611N25j65177a24320A58102k417b13382A37093E3819h4464A87609p7616
18501A09993n59A4999a86208l6245J01027A26551b3522H0694L6403b45255a9778
18489c94998J55287a05841m0874n1445B28576e6413A36544E0452J22530a73518
18478A684a01661K5991j33383B0222a5192j74063f3877E7714a27983j48166m7176
$$ plain form
18467 -323325 -283732 -180067 320795 80366 -42989 59520 54622 -165104 -153064 33519 28725
18456 28725 -109989 -329268 70150 -148338 -380916 -30938 142463 100551 56351 -136044
18445 -191740 -74312 -63617 -9822 79758 270770 77541 -240048 31931 107476 -27875 47987
18433 -224127 -76038 242075 -13939 113343 -100387 -174404 -162093 -81159 -90119 408293 25457
18421 -36714 -90091 70903 -141029 188358 17310 -172725 -268863 -156367 -61054 170226 -166617
18409 153668 60250 116090 17878 3893 212436 -101709 57378 -151008 -169189 123142 -79659
18397 -253838 -68381 401021 -128681 -98118 -95735 71678 268796 -152657 82668 -33090 -19974
18386 -19974 268484 -265954 200724 -162993 -115382 47430 7369 -136872 1875 64342 -157708
$$ packed form
18467c23325L9593J03665C20795H0366d2989E9520m898a65104J2040C3519m794
18456B8725a09989k19279G0150a48338k32578c0938A42463m1912m4200a36044
18445a91740g4312J0695i822G9758J91012G7541b40048C1931P5545b7875D7987
18433b24127g6038B42075a3939A13343a00387p4017J2311Q0934q960D08293B5457
18421c6714n3377G0903a41029A88358A7310a72725r6138J12496f1054A70226a66617
18409A53668F0250N5840A7878C893K08543a01709E7378a51008j8181A23142g9659
18397b53838f8381D01021a28681L0563K383G1678J97118a52657H2668c3090J3116
18386a9974B68484b65954B00724a62993M7611D7430G369a36872A875O2467a57708
$$ plain form
18374 17190 238436 35705 -236088 -283139 148709 38412 75661 -13724 -70505 31698 341244
18363 341244 -134203 378921 23335 100282 117784 -216812 -82198 -473549 -409374 63612 -182884
18351 -258022 102295 73964 138333 118705 200256 -8999 123285 119132 -201885 -235234 -13709
18339 -246852 139945 125918 104473 160338 -104098 -489909 607634 -225173 -68469 87667
18328 -31616 -5618 -36912 -14968 -186045 -63219 25692 79080 166436 -167058 -210554 -1003 -185012
18316 -185012 -55446 -9146 -308742 -198843 228635 -162009 -247836 -19830 58025 -218433 -121507
18305 -121507 -317749 -11584 -170088 124353 -272293 -309052 184599 286839 -102914 172660
18294 -206861 -120192 -102513 -9876 -220758 253230 38215 -129614 -127622 -182313 90655 213123
$$ packed form
18374A7190K21246C5705b36088m7051A48709C8412L7249a3724n6781C1698L09546
18363C41244a34203C78921B3335P6947J7502b16812h2198l91351O4175F3612a82884
18351b58022A02295k8331O4369j9628Q1551h999A23285m153b01885l3349a3709
18339b46852A39945j4027k1445N5865a04098l85811F07634b25173f8469H7667
18328c1616e618l1294a4968j71077f3219B5692N3388Q7356a67058m3496a003j84009
18316a85012e5446i146k99596J09899B28635a62009q5827a9830E8025b18433R6926
18305a21507j96242a1584j58504A24353b72293l6759A84599J02240a02914A72660
18294b06861Q6669J7679i876k10882B53230C8215a29614J992n4691I0655J22468
$$ plain form
18283 213123 -5692 -117027 115216 -56044 -98685 39801 222751 16193 -132610 -234328 -104119
18271 -107932 69701 -32569 -280545 -171580 74780 -49570 216094 158812 -58261 -244777 193650
18259 -110604 -93522 59355 -198875 -286009 -409537 -43669 -50815 -8221 -245290 20417 -3324
18247 -168765 165319 -23790 95239 -197601 -5765 -196095 135455 -209256 272034 -405428
18236 35116 218771 -177212 97775 79374 -223865 -243295 127890 -64895 -114011 -160978 -267465
18225 -267465 -90386 152634 251693 -7975 70340 -88960 -10429 -133167 -128369 271279 35952
18213 -36829 -98233 -190336 12170 145770 -184451 135228 249799 -14535 -51550 -67660 -36772
18202 -36772 -289668 -78880 -404191 -216894 -94782 -46114 -400470 -133754 -333136 -254091
$$ packed form
18283B13123e692j11335A15216e6044m2641C9801J82950A6193a32610j01718a04119
18271a07932F9701c2569k47976J08965G4780d9570B16094n7282e8261j86516A93650
18259a10604J7082E9355a98875q7134j23528d3669p146h221k37069B0417c324
18247a68765A65319b3790I5239a97601e765j90330A35455b09256B72034d05428
18236C5116J83655a77212I7775j8401b23865j9430A27890f4895m9116m6967j06487
18225b67465i0386A52634R9059g975G0340h8960a0429j22738M798B71279C5952
18213c6829o1404r2103A2170J33600a84451A35228J14571a4535l7015j6110L0888
18202c6772k52896g8880l25311J87297i4782d6114l54356a33754j99382P9045
$$ plain form
18192 -254091 -19363 207115 -47883 -242416 -28966 -240106 -147748 114708 -298341 29753
18181 -383201 -270277 -84787 -60644 -30885 -1052 24735 14379 213958 -239365 -124801 129626
18169 -244986 21257 296429 140893 234594 -118761 -267515 44384 73120 79258 4634 -81199
18157 5938 -170548 -162703 209224 -189997 -378389 120991 -190274 -182371 -7588 142408 128928
18146 128928 260317 -252321 142906 -53818 101269 -182294 -25301 -214110 -125132 -151347
18136 -151347 227203 29869 29381 34914 -255190 -57048 -87002 -97493 15423 -92898 28527 71321
18124 71321 -312146 140368 -214293 182525 6972 -58744 87916 -302703 -269552 139678 -30414
18112 -72972 312402 -332163 32431 -312157 305754 -340849 -58103 -654 -36853 230443 -113510
$$ packed form
18192b54091a9363B07115d7883j94533b8966k11140R2358A14708b98341B9753
18181c83201J12924h4787K4143K9759a052B4735j0356J99579b39365J14564A29626
18169b44986B1257K75172A40893R3701a18761j48754D4384K8736O138D634h1199
18157E938a70548P845B09224a89997j88392A20991a90274P903g588A42408j3480
18146A28928J31389b52321A42906e3818A01269a82294b5301j88809Q8978k6215
18136a51347B27203B9869m88N533b55190e7048k9954j0491A5423i2898B8527M2794
18124G1321c12146A40368b14293A82525F972e8744H7916c02703L3151A39678c0414
18112g2972C12402c32163C2431c12157C05754c40849e8103f54l6199B30443a13510
$$ plain form
18100 -372144 -90306 -20971 189439 -8125 -23340 22282 59552 -134169 -9827 26675 -51681
18088 134129 87628 -44542 35823 -5104 -139929 160602 -93185 327421 -126636 -3719 138387
18076 48598 -144860 -244790 103321 -379257 -225730 -55218 -90767 61890 -183161 92281 142082
18065 142082 -193425 -99639 -255986 -236883 263842 93993 -135979 -196066 -367732 37390
18054 279103 203938 -84919 -279053 -80378 30229 -358884 -11489 -73381 -102377 36681 279560
18043 279560 -432028 193879 -268459 -320578 -143676 78318 182627 105984 25510 -43675
18032 -86628 -48468 -214950 -142271 49639 -121129 -203008 52061 72765 66024 68632 129159 -119465
18019 6333 -220081 42037 -195624 -93797 -52613 250302 -19725 -267058 395076 128338 -403194
$$ packed form
18100c72144i0306b0971A89439h125j5215B2282L7270a34169i827B6675e1681
18088A34129m6501d4542C5823e104j34825A60602i3185C27421a26636c719A38387
18076D8598a44860r9930A03321c79257J53527e5218l5549F1890a83161I2281M9801
18065A42082a93425R3786j56347J9103B63842I3993a35979o0087j71666C7390
18054B79103p5165h4919j94134h0378C0229c58884a1489o1892k8996C6681K42879
18043B79560d32028A93879b68459n2119a43676G8318J04309p6643B5510d3675
18032h6628L8160j66482P2679D9639a21129q1879E2061K0704o741K608O0527a19465
18019F333b20081D2037a95624i3797M1184B50302a9725k47333C95076A28338d03194
$$ plain form
18007 115099 130370 20801 -284312 15891 -44833 455335 -139884 -427665 -140359 -127783
17997 -127783 171829 -76521 -202444 -276444 -41169 -298477 -137061 -11548 2518 -127021 -165463
17986 -165463 246870 39067 51572 -323534 137927 87654 408048 81929 -163631 -182954
17976 -182954 -65666 -141445 -111701 116748 -147655 -336395 -110257 -235724 268317 -175229
17965 146831 -120443 443809 -128168 -142688 78927 -7051 106560 56272 107351 57405 -75408
17953 43190 -49016 -137858 -70720 -296715 -375160 24274 -14144 35613 -316153 13033 -293538
17941 -278615 -253516 6115 -286070 161538 -37807 199064 72747 -20782 224826 -478999 -30047
17929 -95899 104691 -278728 -225655 -402975 -146085 -260507 -142527 385137 -118352 -127023
$$ packed form
18007A15099J5271B0801b84312A5891d4833D55335a39884k87781a40359J2576
17997a27783A71829g6521j25923p4000d1169k57308a37061a1548B518a27021l8442
17986a65463B46870C9067J2505c23534A37927n0273L20394H1929a63631j9323
17976a82954f5666p5779K9744A16748a47655j88740a10257j25467B68317a75229
17965A46831a20443D43809a28168j4520G8927g051A06560n0288N1079m9946g5408
17953D3190d9016q8842O7138k25995p8445B4274a4144C5613c16153A3033b93538
17941b78615K5099F115b86070A61538c7807A99064G2747b0782B24826d78999c0047
17929i5899A04691b78728N3073j77320a46085j14422J17980C85137a18352q671
$$ plain form
17919 -127023 102857 99747 -86130 182145 -256885 -274326 -16090 63722 21688 -405781 -124201
17907 -208814 -394396 73402 -290549 189619 6893 20649 150546 143276 29843 -293044 77464
17895 178375 -84648 -130126 229776 -65500 7715 -406431 -278273 -136615 -149169 -46465 170580
17883 -56521 -36806 -39072 -259316 -257080 76962 -43368 203475 53523 76224 64800 22612 116234
17871 116234 110213 39022 -276180 198625 207811 33794 143846 127349 86786 -54587 91682
17859 524808 -53235 162900 65603 -34848 -434686 40342 -100545 -61212 -283470 -54251 -106401
17848 -106401 -175119 198400 -157214 201 22287 -291779 77755 12776 188671 -126494 -243297
17837 -243297 101361 -366383 276487 277286 49929 -359607 -45941 -106444 -110589 -107282 -201335
$$ packed form
17919a27023A02857l110h6130A82145b56885j7441a6090F3722B1688d05781a24201
17907b08814j85582G3402b90549A89619F893J3756J29897p270B9843b93044G7464
17895A78375h4648m5478B29776f5500G715d06431J28158a36615j2554d6465A70580
17883e6521J9715k266k20244K236G6962d3368B03475E3523K2701j1424B2612R3622
17871A16234o021C9022b76180A98625R186C3794J10052j6497m0563e4587I1682
17859E24808e3235A62900F5603c4848l99838D0342a00545L9333k22258e4251n2150
17848a06401o8718A98400a57214B01K2086b91779G7755A2776J75895a26494j16803
17837b43297A01361c66383B76487P99D9929c59607d5941o0503m145L307r4053
$$ plain form
17826 -201335 -165230 57853 -110731 38754 259427 -182834 -397399 172522 134963 -112902
17815 3096 -97542 57757 -246044 234030 309283 -237970 183416 83283 -39554 -170459 23470
17803 72783 -81823 -76285 -103051 11152 -141576 -60813 -241908 176368 16878 -89051 195281
17791 -82267 176010 -416976 -147316 -158118 103700 -189943 -21466 -231426 -185344 -10411
17780 -150170 146419 40562 -301787 25933 40552 -191839 208853 118925 140032 110697 95459
17769 95459 -149591 32221 156945 -258081 71377 386124 -29508 -5593 7734 -124144 -98445
17758 -98445 60161 443190 -94331 -177708 149383 -95867 296629 -147223 -226911 -261505 16496
17746 -108314 -52977 413607 88403 -44450 -53730 -226593 -302621 -180372 -14698 105318 8091
$$ packed form
17826b01335L6105E7853a10731C8754K20673a82834k14565A72522l7559a12902
17815C096i7542E7757b46044B34030P5253b37970A83416H3283c9554j30905B3470
17803G2783h1823N538k6766A1152a41576f0813j81095A76368A6878h9051A95281
17791h2267A76010d16976a47316j0802A03700a89943b1466k09960M6082a0411
17780a50170A46419D0562c01787B5933J4619a91839B08853q9928K1107k9335j5238
17769I5459a49591C2221J24724b58081G1377L14747b9508e593G734a24144K5699
17758i8445F0161L83029i4331q3377A49383i5867B96629a47223p9688l4594A6496
17746a08314e2977D13607H8403d4450r280j72863p6028J22249a4698A05318H091
$$ plain form
17734 238165 34928 -185478 -80789 119646 -215035 213840 207407 53763 4246 83719 -98434
17722 -721 182547 413015 8423 -109376 78753 -181101 -49572 120642 117636 -13686 122841
17710 57758 -38527 -283826 66374 -155624 86249 61024 115681 275212 414846 154321 153552
17699 153552 -156370 224950 -175082 -5116 127563 -330554 376161 -88161 -54676 299548
17688 72665 -289615 69946 -196623 -107265 37663 36574 10195 -198936 31895 -39396 169765
17676 -18866 209051 -200439 -117904 255578 100396 -68821 -184978 -197642 -214803 -48557 -112563
17665 -112563 117769 332484 58115 -223445 183618 247390 59718 -221783 -1445 -17927 177176
17653 -100418 -178499 -2017 66076 30711 -100737 3721 122147 -105729 -351647 -248743 52677
$$ packed form
17734B38165C4928a85478h0789A19646b15035B13840o433E3763D246P9473i8434
17722g21A82547K30468H423a09376G8753a81101d9572A20642l006a3686A22841
17710E7758c8527k45299F6374a55624H6249k5225N4657J59531J39634A54321p69
17699A53552a56370B24950a75082e116A27563c30554C76161h8161L3485B99548
17688G2665b89615F9946a96623Q9358C7663j089A0195a98936C1895c9396A69765
17676a8866B09051b00439Q2535B55578A00396f8821j16157j2664j7161d8557o4006
17665a12563A17769K14715E8115b23445A83618O3772E9718b21783a445j6482A77176
17653a00418p8081b017F6076C0711a00737C721J18426a05729k45918J02904E2677
$$ plain form
17641 106078 228630 -240231 369955 61167 174377 15078 -176059 -130314 -305225 2954
17630 -267844 -109712 -106834 198417 -122024 -20649 50897 97790 -22304 267267 54172 -137794
17618 -52817 -267428 42707 154072 -160461 20989 484999 276682 -375748 143799 76184
17608 76184 20203 -47315 99795 -44599 292629 282465 -272936 65729 -77309 -150207 510301
17596 124267 -32866 249370 54910 116777 -81575 382385 323964 165969 79985 -63958 -40547
17585 -40547 29610 275007 59891 33225 -203320 -179038 -67985 -11498 141818 -215325 255693
17573 -113364 -249496 78058 347662 67211 -232031 -9415 30867 -326656 -141001 -136916 62439
17561 182577 -236004 222148 154021 283871 390796 139774 31367 -137505 -38298 -151847
$$ packed form
17641A06078J22552b40231C69955F1167J13210A5078a76059M5745j74911B954
17630b67844a09712K878A98417a22024b0649E0897M6893b2304B67267E4172a37794
17618e2817k14611D2707J11365a60461B0989M64010k08317c75748A43799o7615
17608G6184B0203d7315I9795d4599B92629j0164b72936F5729g7309p2898E10301
17596A24267c2866B49370E4910O1867h1575C82385n8421j57995G9985f3958K3411
17585d0547B9610K45397E9891k6666b03320K4282f7985a1498A41818b15325B55693
17573a13364j36132G8058K69604F7211b32031i415C0867c26656a41001M085F2439
17561A82577b36004B22148o8127J29850J06925A39774C1367a37505c8298j13549
$$ plain form
17551 -151847 264459 -31100 -51047 236 48927 -30894 527912 76656 4724 90433 81732 26598
17538 -9236 -25143 87072 73500 -5952 -255148 -258676 315009 260609 229303 -318231 313368
17526 -226160 252687 -81178 249624 1504 -154084 -7689 227095 138650 295906 165190 -294335
17514 -185297 14371 179153 293125 111002 67331 -228307 -47679 19264 225299 103515
17503 45082 -202359 162917 91084 -229692 35709 295736 -138738 -467972 296987 293746
17493 293746 268638 -229934 240020 -143077 -211085 248555 -31923 -204300 254636 313502
17483 313502 254026 260182 163072 -30943 -10527 412137 -7777 445735 -6280 121432 141586
17472 141586 -34089 229145 335913 201616 -62921 116978 238288 -70731 146919 300808
$$ packed form
17551a51847B64459c1100j9947B36M8691c0894E27912G6656D724Q5709q701B6598
17538i236j5907H7072j3572e952k49196l528C15009n4400l1306c18231C13368
17526b26160B52687h1178B49624A504a54084g689B27095q8445J57256j30716b94335
17514a85297A4371J64782J13972A11002m3671b28307d7679A9264K06035A03515
17503D5082b02359A62917p1833b29692C5709K60027a38738l29234B96987l241
17493B93746k5108b29934B40020a43077o8008B48555c1923j72377B54636N8866
17483C13502n9476O156r7110c0943a0527D12137g777D45735f280A21432K0154
17472A41586c4089B29145J06768j34297f2921A16978J21310g0731A46919J53889
$$ plain form
17462 300808 220307 -56161 2474 21854 92219 -111186 107876 -122027 54000 313792 -61529
17450 206504 -97867 821396 23914 447965 80589 143658 379977 290620 294594 110161 204890
17439 204890 462620 255185 207570 223782 296743 209368 304994 29761 149086 621469 -57280
17427 230579 13044 304796 189842 397382 227641 232193 -22250 -79994 350169 417173 309906
17416 309906 251942 415460 275663 526451 11994 69227 -111396 -111135 -90146 235499 329451
17405 329451 134323 130818 382380 191886 24275 201097 -119839 69799 154653 20419 134989
17394 134989 226493 -232460 93016 43807 -16325 132528 262795 -34891 338704 -93652 182571
17382 49432 202960 -65310 389890 162005 -73895 426320 146516 -69321 248251 215418
$$ packed form
17462C00808q0501e6161B474J9380P0365a11186A07876a22027E4000K59792f1529
17450B06504i7867H21396B3914M24051H0589O3069K36319q9357L974A10161R4729
17439B04890K57730k07435m7615J6212P2961q7375R5626B9761J19325M72383e7280
17427B30579A3044K91752j14954K07540j69741M552b2250n7744C50169O7004j07267
17416C09906n7964J63518j39797K50788A1994N7233a11396K61K0989B35499R3952
17405C29451A34323l505K51562j90494B4275J76822a19839F9799Q4854B0419J14570
17394A34989R1504b32460I3016D3807a6325A32528J30267c4891C38704i3652A82571
17382D9432J53528f5310C89890A62005g3895D26320A46516f9321B48251l2833
$$ plain form
17372 215418 -331244 231894 63063 267204 243726 -280503 144381 -11289 283389 -18396
17361 -76390 146911 -156990 -136988 93946 9821 64132 -8727 -29728 14575 48932 317305
17350 317305 136880 162920 88759 -22523 158255 -284642 153928 184325 231697 383641
17340 383641 -169273 -21320 310727 59759 -14389 75883 485444 -60339 219509 79173 208682
17329 208682 -103911 38892 241452 267948 278603 362688 -78533 330445 -84797 163114 221065
17318 221065 269434 266370 -54183 30243 135491 115857 74680 194019 313868 -17266 64898
17306 280925 142380 225092 134493 34295 189764 434092 44365 -66503 -162257 -59484 236174
17294 313456 49691 132221 321642 -177787 -20684 201165 91649 -149996 169272 107166
$$ packed form
17372B15418c31244B31894F3063K04141k3478b80503A44381a1289B83389a8396
17361g6390A46911a56990K0002I3946I821N4311h727k1001A4575L4357K68373
17350C17305A36880K6040p4161b2523A58255b84642A53928L0397M7372J51944
17340C83641a69273b1320C10727E9759a4389G5883M09561f0339B19509G9173J29509
17329B08682a03911C8892K02560K6496J0655Q4085g8533C30445h4797A63114N7951
17318B21065M8369l064e4183C0243J05248j9634m1177J19339J19849a7266F4898
17306B80925j38545Q2712r0599C4295J55469K44328D4365f6503r5754e9484B36174
17294C13456D9691Q2530J89421a77787b0684B01165I1649a49996A69272o2106
$$ plain form
17284 107166 169268 160301 125290 208534 471403 -58103 301320 432636 294287 7942 32678
17273 32678 301470 86530 125372 251095 133174 19548 239421 120776 49076 115449 -145729
17261 -2569 220805 348653 451905 -20829 -152568 356614 186947 66211 237237 -73167
17250 249448 158389 331301 -74099 100309 77743 305362 160917 54620 21721 -46679 -140609
17239 -140609 388391 260990 211243 198944 227993 375009 -10781 61062 120310 -84191 648426
17227 243230 325406 -247877 133969 242218 235647 146455 185719 107616 298327 186457 58634
17215 104801 224796 241231 -72265 -162638 135316 245386 440742 270124 570518 425726
17205 425726 -55628 15393 166260 -25841 341801 289737 238662 319981 488227 429285 360395
$$ packed form
17284A07166O2102q967l5011Q3244K62869e8103C01320J31316j38349G942K4736
17273C2678K68792H6530L8842J25723j17921A9548K19873j18645D9076O6373a45729
17261b569B20805J27848J03252b0829j31739C56614j69667F6211J71026g3167
17250B49448r1059J72912g4099A00309k2566K27619j44445E4620B1721d6679r3930
17239a40609C88391j27401m9747j2299K9049J47016a0781F1062N9248h4191F48426
17227B43230Q2176b47877A33969J08249o571q9192L9264p8103J90711j11870E8634
17215A04801J19995J6435g2265r0373A35316J10070J95356j70618L00394j44792
17205D25726e5628A5393J50867b5841C41801n2064n1075Q1319J68246n8942o8890
$$ plain form
17194 360395 197268 204662 149158 -55300 505142 208311 303418 174785 289757 293603 659802
17183 659802 361725 65987 46262 321527 484359 311334 36441 -147323 111716 115031
17173 115031 319844 342479 214802 315834 180382 174597 308735 -33442 418411 295983
17163 295983 452584 240370 245408 276332 156030 317019 221069 360061 594864 739214
17153 739214 293278 -57698 371218 189719 47150 93105 328033 415117 380756 386243 294152
17142 294152 423462 87878 80325 120550 399712 344189 401663 691085 575010 -7219 182588
17130 360261 191608 303542 255012 -3991 412674 88469 619900 215133 256566 380309
17120 380309 499248 442686 302362 211863 217224 513487 271069 289414 94270 332176 483323
$$ packed form
17194C60395j63127P394n5504e5300E05142B08311R5107j28633J14972L846L66199
17183F59802k98077F5987j9725K75265J62832j73025C6441a47323A11716L315
17173A15031K04813K2635j27677J01032j35452n785J34138c3442D18411j22428
17163B95983J56601k12214N038L0924j20302J60989r5950J38992K34803J44350
17153G39214B93278e7698C71218j81499D7150M5955K34928Q7084l4361N487r2091
17142B94152J29310H7878p553M0225K79162n5523N7474K89422j16075g219A82588
17130C60261j68653J11934m8530c991D12674H8469N31431B15133M1433J23743
17120C80309J18939n6562j40324r0499N361K96263k42418J8345I4270K37906J51147
$$ plain form
17109 483323 441066 432992 38688 56853 364727 452041 612034 228930 240893 211676 396355
17098 396355 249705 272882 390026 356901 461445 189508 238207 285649 325426 555438
17088 555438 358583 483911 464164 190657 608846 229272 442309 139581 296080 304382
17078 304382 249791 136362 427206 333095 829592 389584 765769 233784 37869 433649
17068 433649 383164 236900 615655 330743 447000 919036 260581 298903 463195 380732
17058 380732 553551 454870 483203 397276 638350 415793 338420 421986 703350 411121
17048 411121 445854 444650 704688 471068 846929 493502 363766 373619 463068 480903 674898
17037 674898 898291 841294 571437 342608 583694 195243 560269 731162 938268 446169
$$ packed form
17109D83323m2257q074C8688J8165L07874Q7314J59993B28930J1963k9217J84679
17098C96355j46650K3177J17144l3125J04544A89508M8699M7442L9777K30012
17088E55438j96855J25328j9747A90657M18189B29272K13037A39581J56499Q302
17078C04382n4591j13429K90844r4111M96497C89584L76185B33784C7869L95780
17068D33649n0485j46264L78755k84912J16257M72036B60581L8322J64292q2463
17058C80732J72819r8681K8333q5927K41074k22557p7373Q3566K81364k92229
17048D11121L4733j204K60038k33620L75861l53427j29736R853Q9449J7835J93995
17037F74898K23393n6997k69857k28829K41086A95243L65026J70893K07106D46169
$$ plain form
17026 572900 52055 500531 430908 708065 528105 510931 392649 664523 383299 709276
17016 709276 330497 422873 580624 848354 554294 510634 564937 780382 954970 791622
17006 791622 248448 647074 272475 331550 427153 568296 665639 620673 834337 561677
16996 561677 867272 511927 800978 1172099 670314 850719 674319 363576 586071 731390
16986 731390 681782 751515 1017296 886970 430315 619774 1218410 712823 674526 795607
16976 795607 1106401 856728 343986 645603 925221 594838 769974 746585 641945 894769
16966 894769 786489 712516 728454 782768 845669 1132359 888264 1238942 997664 743136
16956 743136 1237173 927532 1074608 830739 973823 980020 1056862 1216070 714426 756786
$$ packed form
17026E72900E2055M48476o9623K77157j79960j7174j18282K71874k81224L25977
17016G09276C30497R2376J57751K67730k94060m3660N4303K15445J74588j63348
17006G91622B48448L98626B72475N9075R5603J41143R7343m4966K13664k72660
16996E61677L05595l55345K89051L71121n01785J80405j76400l10743K22495J45319
16986G31390m9608O9733K65781j30326D30315J89459N98636n05587l8297J21081
16976G95607L10794k49673C43986L01617K79618l30383J75136k3389j04640K52824
16966H94769j08280p3973J5938N4314O2901K86690k44095L50678k41278k54528
16956G43136M94037l09641J47076k43869J43084O197P6842J59208n01644M2360
$$ plain form
16946 756786 1027748 1037199 1052344 1091782 910588 1121624 1105222 879358 1200430 1143972 1159430
16935 1159430 1426122 922500 1103189 1133997 1020729 1289036 1310839 1352160 1533005 1470718
16925 1470718 1477715 1276290 1626914 1174105 1350047 1176733 1403272 1095973 1385579 943001
16915 943001 1155218 1439010 1611010 1334372 1305797 1362315 1521071 1439067 1809539 1363900
16905 1363900 1106889 1650986 1491046 1600658 1653682 1546582 1424097 1529259 1603918 1543724
16895 1543724 1545176 1950552 1979026 1808726 1559317 1876773 1810734 1859193 1814417 2011443
16885 2011443 1856050 2109453 1912553 1976645 1860356 1810274 1888999 1851376 1981470 2121379
16875 2121379 2085118 1959508 2258330 2052644 2444439 1966932 2371003 2402814 2435543 2438108
$$ packed form
16946G56786K70962R451J5145L9438j81194K11036j6402k25864L21072n6458J5458
16935A159430K66692n03622J80689L0808j13268K68307K1803M1321J80845o2287
16925A470718O997k01425L50624m52809J75942j73314K26539l07299K89606m42578
16915I43001K12217K83792J72000k76638k8575N6518J58756q2004L70472m45639
16905A363900k57011N44097j59940J09612N3024j07100j22485J05162P4659o0194
16895A543724J452M05376K8474j70300k49409L17456o6039M8459m4776J97026
16885B011443j55393K53403j96900O4092j16289n0082P8725l7623J30094J39909
16875B121379l6261j25610K98822k05686L91795m77507M04071L1811L2729K565
$$ plain form
16865 2438108 2549620 2639313 2481809 1957102 2464478 2684254 2683055 2485382 2779155 2850194
16855 2850194 2789237 2718103 2852127 2884549 2686049 2902474 2856517 3070228 3068688 3129246 3221374
16844 3221374 3072115 3240189 3271871 3376026 3387424 3364810 3708771 3585728 3701016 3876220
16834 3876220 3908705 3856369 4133788 3924196 3940252 4113329 4153814 4505362 4567957 4363749
16824 4363749 4323091 4705968 4825387 4392725 4854574 4754280 4921168 4930598 5338508 5126249
16814 5126249 5404418 5282629 5503345 5393183 5663030 6009032 5710140 6157533 5997704
16805 5997704 6196594 6189213 6687586 6760028 7281872 7098043 7107706 7530956 7788628 7955488
16795 7955488 7693394 7936772 8222636 8418592 8859093 8772602 8959767 9335136 9019883 9864521
$$ packed form
16865B438108J11512Q9693j57504n24707N07376K19776j199j97673K93773P1039
16855B850194o0957p1134J34024L2422j98500K16425m5957K13711j540O0558R2128
16844C221374j49259J68074L1682J04155J1398k2614L43961j23043J15288J75204
16834C876220L2485n2336K77419k09592J6056J73077M0485L51548O2595k04208
16824D363749m0658L82877J19419m32662M61849j00294J66888R430M07910k12259
16814E126249K78169j21789K20716j10162K69847L46002k98892M47393j59829
16805E997704J98890p381M98373P2442N21844j83829R663M23250K57672J66860
16795G955488k62094K43378K85864J95956M40501q6491J87165L75369l15253Q44638
$$ plain form
16785 9864521 9940646 10316582 10701581 10769929 11097399 11725251 11436228 12392655 12326005 12807897
16775 12807897 13331126 13382430 13792867 14277707 14868709 15174251 15635525 16082118 16872083
16766 16872083 17399088 17950984 18476328 19104256 20014414 20615883 21474026 22129149 23237985
16757 23237985 24253063 25109687 26035731 27191166 28244737 29655337 30591748 32043255
16749 32043255 33225434 35057813 36504760 37971547 40415947 42167626 44247554 46187409
16741 46187409 48871295 51380034 54041713 56736533 60063966 63229764 66833423 70466573
16733 70466573 74833014 78937990 83370874 88558264 93732854 99246796 105310737 111001697
16725 111001697 117405936 124232675 131107747 138105593 145156350 151937985 158513694 164813975
$$ packed form
16785I864521P6125L75936L84999O8348L27470O27852k89023R56427o6650M81892
16775A2807897N23229N1304M10437M84840N91002L05542M61274M46593P89965
16766A6872083N27005N51896N25344O27928R10158O01469Q58143O55123J108836
16757B3237985J015078Q56624R26044J155435J053571J410600R36411J451507
16749C2043255J182179J832379J446947J466787K444400J751679K079928J939855
16741D6187409K683886K508739K661679K694820L327433L165798L603659L633150
16733G0466573M366441M104976M432884N187390N174590N513942O063941N690960
16725A11001697O404239O826739O875072O997846P050757O781635O575709O300281
$$ plain form
16717 164813975 170584504 176061377 180164895 183121953 185426319 186513768 186299800 184508885
16709 184508885 181724346 178230771 173465696 168341124 162334354 155834794 149064987 141577318
16701 141577318 134633604 127918043 121054676 114307752 107705170 101914292 95591036 90188846
16693 90188846 84985821 80115091 75612773 71351608 67103966 63503623 59984003 56650582
16685 56650582 53513419 50648790 48413724 45877983 43205308 41178627 39204563 37215051
16677 37215051 35678755 33803267 32647856 31000623 29605167 28474787 27010812 26205896
16669 26205896 24982067 23823629 22906581 21914437 21363352 20283896 19870913 18464862 18284595
16660 18284595 17562900 17076139 16248046 15966392 15174683 15083222 14294458 13628084 13471158
$$ packed form
16717A64813975N770529N476873M103518K957058K304366J087449k13968j790915
16709A84508885k784539l493575m765075n124572o006770o499560o769807p487669
16701A41577318o943714o715561o863367o746924o602582n790878o323256n402190
16693I0188846n203025m870730m502318m261165m247642l600343l519620l333421
16685E6650582l137163k864629k235066k535741k672675k026681j974064j989512
16677C7215051j536296j875488j155411j647233j395456j130380j463975q04916
16669B6205896j223829j158438r17048r92144n51085j079456m12983j406051j80267
16660A8284595p21695m86761q28093k81654p91709r1461p88764o66374j56926
$$ plain form
16651 13471158 13061542 12739249 12372793 12075752 11584786 11269678 10931600 10348143 10564605
16642 10564605 10100943 9680852 9220950 9176574 8801293 8315009 8333241 8353663 7753747 7767135
16632 7767135 7468031 7349878 7195137 7191478 6844552 6376964 6527985 6192783 6795977 6195060
16622 6195060 5847630 5850208 5646356 5920643 5644070 5639058 5366507 4986732 5167067 4871507
16612 4871507 4887810 4739645 4497194 4517650 4439412 4395263 4174589 4308408 4456576 4172556
16602 4172556 4176214 3953087 3804066 3762565 4012834 3640798 3561511 3437237 3553337 3487293
16592 3487293 3370348 3039934 3428848 3577763 2901863 2916064 2929058 2939104 2732782 3123636
16582 3123636 3015111 3000395 2741026 2429624 2423790 2380222 2393548 2489587 2658360 2590126 2300959
$$ packed form
16651A3471158m09616l22293l66456k97041m90966l15108l38078n83457K16462
16642A0564605m63662m20091m59902m4376l75281m86284J8232K0422n99916J3388
16632G767135k99104j18153j54741l659l46926m67588J51021l35202O03194o00917
16622F195060l47430K578k03852K74287k76573n012k72551l79775J80335k95560
16612D871507J6303j48165k42451K0456p8238m4149k20674J33819J48168k84020
16602D172556L658k23127j49021m1501K50269l72036p9287j24274J16100o6044
16592C487293j16945l30414L88914J48915o75900J4201J2994J0046k06322L90854
16582C123636j08525j4716k59369l11402n834m3568J3326R6039J68773o8234k89167
$$ plain form
16571 2300959 2273825 2262292 2325715 2308845 2292837 2192637 2194160 2143054 1889823 2260122 1919709
16560 1919709 2107467 1989705 1964524 1702417 2066017 1832019 1928744 1500046 1722728 1693092
16550 1693092 1927950 2009371 1656115 1711338 1626173 1472668 1661192 1724859 1521391 1594423
16540 1594423 1627111 1554080 1559311 1350877 1633532 1353777 1403523 1516645 1357519 1505203
16530 1505203 1337056 1303875 1268495 918805 1564203 1371414 1159770 1314647 1143035 1377967
16520 1377967 958945 1130936 1262176 1211194 1010303 1110416 1479019 855810 852395 1164011
16510 1164011 1117502 802378 913966 717862 1124711 1083614 916646 1360191 1104382 776034
16500 776034 676656 1127440 944462 971447 688528 905812 1024445 943804 845846 789118
$$ packed form
16571B300959k7134j1533O3423j6870j6008j00200J523n1106k53231L70299l40413
16560A919709J87758j17762k5181k62107L63600k33998R6725m28698K22682k9636
16550A693092K34858Q1421l53256N5223q5165j53505J88524O3667k03468P3032
16540A594423L2688p3031N231k08434K82655k79755M9746J13122j59126J47684
16530A505203j68147l3181l5380l49690O45398j92789k11644J54877j71612K34932
16520A377967m19022J71991J31240n0982k00891J00113L68603o23209l415L11616
16510A164011m6509l15124J11588j96104M06849m1097j66968M43545k55809l28348
16500G76034r9378M50784j82978K6985k82919K17284J18633q0641r7958n6728
$$ plain form
16490 789118 832240 959400 905774 852058 849253 784123 888838 686937 901743 947001 739986
16479 739986 764801 733188 526764 952905 964425 957725 775089 356191 846750 802380 437814
16468 437814 1184869 449238 567207 729502 749681 535254 674966 882291 627181 646303
16458 646303 382988 716605 462699 609910 662728 546546 550446 474171 571085 673634
16448 673634 585467 870886 610420 708230 593197 522925 694951 721743 558836 509010
16438 509010 546903 480799 491038 650363 413732 312578 566097 471774 170115 570528
16428 570528 532666 706239 505882 434390 294560 287559 307418 582050 471456 423048 559693
16417 559693 567122 578284 510700 234298 138600 402997 134685 514835 544655 588902 290852
$$ packed form
16490G89118M3122J27160n3626n3716k805o5130J04715k01901K14806M5258k07015
16479G39986K4815l1613k06424M26141J1520o700j82636C56191M90559m4370l64566
16468D37814P47055D49238J17969J62295K0179k14427J39712K07325k55110J9122
16458F46303k63315L33617k53906J47211N2818j16182L900p6275R6914J02549
16448F73634q8167K85419k60466R7810j15033p0272J72026K6792j62907m9826
16438E09010L7893o6104J0239J59325k36631j01154K53519r4323A70115M00413
16428E70528l7862J73573k00357p1492j39830p001J9859K74632j10594m8408J36645
16417E59693P429J1162o7584B34298r5698K64397A34685L80150K9820M4247B90852
$$ plain form
16405 293140 280593 264453 364721 452377 383337 511280 533683 201568 280884 175146 521629
16394 521629 351062 470400 82475 329196 458778 348758 90243 78168 285695 497822
16384 497822 161352 235822 438145 105725 732174 298493 440211 378701 248743 251608
16374 251608 -83333 695498 13184 423761 81354 389096 237366 483461 377044 253127
16364 253127 192021 76741 591936 193299 374149 273845 223644 37683 77343 160493 130863
16353 130863 375668 377437 564584 41991 231377 485049 85561 64628 101441 192403 364932
16342 364932 117198 246468 512772 322013 211820 132414 136619 -219289 294489 320362
16332 320362 243971 28389 370851 291906 63020 160634 -309700 323707 6587 476358 153951
$$ packed form
16405B93140j2547j6140J00268Q7656o9040J27943K2403B01568P9316j05738L46483
16394E21629j70567J19338H2475K46721J29582j10020I0243j2075K07527K12127
16384D97822A61352P4470K02323A05725O26449B98493J41718o1510j29958K865
16374B51608h3333F95498A3184M10577H1354L07742j51730K46095j06417j23917
16364B53127o1106G6741N15195A93299J80850j00304n0201C7683L9660Q3150k9630
16353A30863K44805J769J87147D1991J89386K53672H5561k0933L6813R0962J72529
16342C64932A17198J29270K66304j90759j10193p9406M205b19289B94489K5873
16332C20362p6391B8389L42462p8945F3020R7614c09700C23707F587M69771A53951
$$ plain form
16320 149060 124616 36485 257255 73377 60442 -132537 284824 -187156 250508 295297
16310 295297 -76408 -4759 242501 59612 39329 406363 228735 3093 57287 391416 11701
16298 88717 233305 66455 374988 -7426 54651 424801 288545 214258 293221 227038 384310
16287 384310 289954 -126913 73372 4693 148513 399469 177696 315887 334672 -202126
16276 25927 50565 312299 -337346 -135034 275426 -87695 291540 247217 179644 90790 285532
16265 285532 89343 -20827 395392 -4600 14980 341004 -30088 28623 279169 -223283 255956
16253 -359764 -257697 85756 -30686 312937 116901 226856 203310 58953 90319 147522 -48871
16241 -37797 172963 195484 55144 308175 -100263 -33252 66339 173906 278517 72681 146331
$$ packed form
16320A49060k4444C6485K20770G3377j2935a32537B84824a87156B50508M4789
16310B95297g6408d759B42501E9612k0283L67034j77628C093N4194L34129A1701
16298H8717J44588F6455L08533g426E4651L70150j36256p4287P8963o6183J57272
16287C84310r4356a26913G3372D693J43820K50956A77696J38191J8785b02126
16276B5927K4638K61734c37346a35034B75426h7695B91540m4323o7573q8854J94742
16265B85532H9343b0827C95392d600A4980L26024c0088B8623K50546b23283B55956
16253c59764J02067H5756c0686C12937A16901J09955k3546E8953L1366N7203d8871
16241c7797A72963K2521E5144K53031a00263c3252F6339J07567J04611G2681P3650
$$ plain form
16230 146331 -43775 425407 -65753 353263 -197973 97361 146543 5478 104634 -28852 124125
16218 235211 3604 162662 410702 -51195 167654 25673 43955 -470029 49081 21706 -252216
16206 244299 70090 242823 -311933 45057 79502 202530 -86150 256437 323437 219369
16196 219369 44349 16062 246579 318333 597 -136005 136101 -155133 456813 271986 -161584
16184 80520 -33577 -9806 267177 99287 130191 235925 553374 -82038 182382 -229282 -265194
16173 -265194 351063 284565 27923 115055 -133160 7467 189568 -110815 132394 236287
16163 236287 181662 -62200 156935 -10704 -61580 -117776 121163 44433 -56508 -410923 -100076
16151 -153622 56733 297486 66771 15650 196292 109674 211615 339851 -300226 38029
$$ packed form
16230A46331d3775D25407f5753C53263a97973I7361M9182E478R9156b8852A24125
16218B35211C604J59058K48040e1195A67654B5673J8282d70029D9081B1706b52216
16206B44299G0090J72733c11933D5057L4445J23028h6150B56437O7000j04068
16196B19369D4349A6062K30517P1754E97a36005A36101a55133D56813j84827a61584
16184H0520c3577i806B67177I9287L0904J05734L17449h2038A82382b29282l5912
16173b65194C51063o6498B7923Q7132a33160G467J82101a10815A32394J03893
16163B36287n4625f2200A56935a0704n0876n6196A21163D4433e6508l54415a00076
16151a53622E6733K40753F6771A5650J80642q6618J01941J28236c00226C8029
$$ plain form
16140 -90924 -265867 215852 126778 -30472 -133911 -78812 -61704 300339 305950 -168842 -182906
16129 -182906 369894 219818 -200005 379284 -90867 18981 37504 10939 7600 5695 40518
16118 40518 -124906 -74632 189370 -119851 -111319 -158501 -32802 23737 46569 325917 460053
16107 460053 89881 -88242 -169070 39811 130470 136998 91793 349411 266134 7512 74890 55609
16095 55609 -25779 -285106 -59931 -10319 157970 65012 275490 -53724 111281 60086 459
16083 -153894 -238656 -99518 -24461 -268206 73150 -92286 -188140 -70268 99673 128778 211003
16072 211003 -3611 352475 84708 78483 -191406 -125141 270930 -75763 11919 24085 -125113
16060 -107162 -70635 -198341 38723 351528 -113476 -400265 -111357 -226501 186101 203125
$$ packed form
16140i0924j74943B15852q9074c0472j03439N5099J7108C00339N611a68842j4064
16129a82906C69894j50076b00005C79284i0867A8981J8523A0939l339j905L4823
16118D0518a24906N0274A89370a19851Q532m7182c2802B3737K2832K79348J34136
16107D60053H9881h8242q0828C9811R0659O528m5205K57618q3277G512O7378j9281
16095E5609b5779k59327e9931a0319A57970F5012K10478e3724A11281n1195D59
16083a53894q4762i9518b4461k43745G3150i2286r5854g0268I9673K9105Q2225
16072B11003c611C52475H4708o225a91406O6265B70930g5763A1919J2166a25113
16060a07162L6527j27706C8723L12805a13476k86789a11357j15144A86101J7024
$$ plain form
16050 203125 122339 -301443 85277 178146 261804 296280 89245 -222859 -143717 342441 -11826
16038 -64434 175509 -218420 -358751 -27997 -88389 -21720 -51262 -63682 -101928 27291 168759
16027 168759 40951 102741 66890 93091 -152049 -75997 -71409 155806 -47135 -114619 9676
16015 -178381 145310 -28606 223511 -40953 120772 -93828 -159576 -88392 -201636 -92592 -98790
16004 -98790 -252850 -38799 -53232 -103430 -89537 -133697 -14007 -30775 -210747 -64897 -22144
15992 -89453 -169558 -98377 -99914 -36703 -341998 131182 191310 37665 341614 101521 222543
15981 222543 543481 63469 47 91993 422088 -175734 -99627 -292839 79529 -339419 -181797
15970 -181797 -11052 151332 -122871 162094 -115090 -281226 76240 158671 101173 -83914
$$ packed form
16050B03125q0786c01443H5277R2869Q3658L4476H9245b22859P9142C42441a1826
16038f4434A75509b18420j40331b7997o0392b1720k9542j2420l8246B7291J41468
16027A68759D0951O1790l5851K6201a52049g5997M588A55806d7135o7484I676
16015a78381A45310b8606B23511d0953A20772i3828o5748P1184j13244i2592o198
16004i8790j54060c8799j4433n0198J3893m4160a4007j6768j79972f4897b2144
15992h9453q0105P1181j537c6703l05295A31182O0128C7665L03949A01521J21022
15981B22543L20938F3469D7R1946L30095a75734P6107j93212G9529c39419J57622
15970a81797a1052A51332a22871A62094a15090j66136G6240Q2431n7498h3914
$$ plain form
15959 457410 364874 36774 -391389 48991 -182039 11207 -764 -287699 -156761 -282744 73140
15947 78757 82838 142522 42883 269267 5223 -40024 -140870 -184057 34527 305866 119130
15935 27609 -171419 61667 67850 144426 226282 -62796 -160849 -113954 96359 -244573 -60985
15923 -156008 -89753 21210 -203370 -49509 20753 169778 -10219 -40380 -171154 96663 -350832
15911 44098 -125010 -10964 -184281 53906 -76820 -278859 136077 10148 -237398 6915 85767
15900 85767 61473 -75697 -87449 -145966 24777 -88997 -170078 -22530 97342 217213 83413
15888 -207217 76592 365623 154115 -33261 331436 -69638 112110 -151702 197461 -149127
15877 -5613 179340 -97948 175684 -174049 -133195 -76621 279197 -63124 15989 -154654 -52775
$$ packed form
15959D57410r2536C6774c91389D8991a82039A1207g64k86935J30938j25983G3140
15947G8757M081N9684D2883K26384E223d0024j00846m3187C4527K71339A19130
15935B7609a71419F1667O183P6576Q1856f2796r8053M6895I6359b44573f0985
15923a56008O6255B1210b03370d9509B0753J49025a0219l0161j30774I6663c50832
15911D4098a25010a0964j73317E3906g6820k02039A36077A0148b37398F915P8852
15900H5767k4294g5697j1752n8517B4777h8997q1081b2530I7342J19871H3413
15888b07217G6592K89031A54115c3261C31436f9638A12110a51702A97461a49127
15877e613A79340i7948A75684a74049M0854N6574B79197f3124A5989a54654e2775
$$ plain form
15865 -131951 1249 418237 -96778 147053 -130193 189532 175115 69463 85178 -237794 -162377
15854 -162377 -50565 1602 -118471 -53076 -58836 -44447 -139540 -170885 271808 399494 -49334
15842 -28376 -29753 1524 70435 134392 43113 26201 117546 175675 -203979 2953 244083 147525
15830 147525 52087 -190955 156321 -85649 183670 210496 -9408 30860 36524 -265850 162388
15818 -88253 -113294 74069 -118742 -9637 -240454 -364005 -180592 167079 -225374 91187 -139433
15806 -327444 29811 -146746 13209 154206 -203182 -289392 102171 310971 -143370 -172114
15796 -172114 -135548 -204754 103403 5216 99851 142276 -26163 -233486 -251777 224507 -309476
15784 111498 -182867 263407 -11278 -46834 65773 -141142 -27185 -315122 -77351 -136569 639
$$ packed form
15865a31951A249M16988i6778A47053a30193A89532j4417F9463J5715b37794P5417
15854a62377e0565A602a18471e3076n760J4389r5093l1345B71808J27686d9334
15842b8376j377A524O8911O3957D3113j6912R1345N8129b03979B953K41130r6558
15830A47525E2087a90955A56321h5649A83670K6826i408C0860N664b65850A62388
15818h8253k5041G4069a18742i637k30817j23551a80592A67079b25374I1187a39433
15806c27444B9811a46746A3209J40997b03182q6210A02171K08800a43370k8744
15796a72114L6566o9206A03403E216R4635M2425b6163k07323j8291B24507c09476
15784A11498a82867B63407a1278l5556F5773a41142b7185k87937g7351n9218F39
$$ plain form
15772 -16531 169544 28092 -41832 -221528 -38894 44920 -79739 64552 -201052 15087 -412958
15760 -75097 -142287 -186507 155112 212487 -39395 144346 252460 163494 -245092 10152 175497
15749 175497 -164211 27801 -103601 -104259 -191614 -85631 90264 248379 -15266 86772 -66625
15737 -86168 -322859 38387 -78360 -100961 -192441 -110921 -34791 190375 -57507 -382463 108777
15725 -93486 76395 -128018 83870 150710 -259582 -70929 109244 -79221 -164286 -450081 -155978
15713 76514 184711 345937 296572 -179525 -259941 -7761 -200578 -216804 -172501 -209517 -39283
15701 -176116 -100112 -439386 -72549 -65869 25329 197700 207926 -47823 44015 -72653 216055
15689 -1041 434109 156538 -204868 46069 -234237 -183479 130820 166564 -138663 -35639 68705
$$ packed form
15772a6531A69544B8092d1832j79696c8894D4920g9739F4552b01052A5087d12958
15760g5097o7190m4220A55112N7375c9395A44346J08114q8966b45092A0152J65345
15749A75497a64211B7801a03601o58q7355h5631I0264J58115a5266H6772f6625
15737h6168k36691C8387g8360k2601r1480Q1520c4791A90375e7507l24956A08777
15725i3486G6395a28018H3870O6840b59582g0929A09244g9221q5065k85795a55978
15713G6514J08197J61226m9365a79525q0416g761j92817j6226M4303l7016c9283
15701a76116P6004l39274g2549O680B5329J72371J0226d7823D4015g2653B16055
15689a041D34109A56538b04868D6069b34237N0758A30820L5744a38663c5639F8705
$$ plain form
15677 60373 -55530 191758 -110947 -487838 168110 -59211 -249529 82941 270726 -77518
15666 73112 -171070 120146 -106833 159884 -231220 -99318 -152518 309917 -179877 -143 -64187
15655 -64187 86341 -12467 -21469 93041 -117649 -102816 -466862 89291 -91301 55588 -2847 85787
15642 -191562 296781 -49887 -104193 -183724 88246 151620 -157167 -341499 -216032 142162
15631 10051 137943 -180145 -413857 106421 -166486 93022 -70465 -236267 89644 -96565
15620 -176672 -68836 -49080 -55477 -220773 -25338 59232 -449627 -61123 199209 74590 -71514
15608 74388 -86576 -106780 -105138 -271408 -294489 -259884 22612 82822 98253 62130 290777
15597 290777 55143 -66674 -135500 -23387 -112298 100615 180619 43995 42283 -12776 86261
$$ packed form
15677F0373e5530A91758a10947l76891A68110e9211j90318H2941J87785g7518
15666G3112a71070A20146a06833A59884b31220i9318n3200C09917a79877a43o4044
15655f4187H6341a2467r002I3041a17649J4833l64046H9291i1301E5588b847H5787
15642a91562B96781d9887n4306p9531H8246O3374a57167j84332J25467A42162
15631A0051J27892a80145k33712A06421a66486I3022g0465j65802H9644i6565
15620a76672f8836J9756o397j65296b5338E9232d49627f1123A99209G4590g1514
15608G4388h6576k0204J642j66270k3081L4605B2612O0210J5431l6123K28647
15597B90777E5143f6674o8826b3387q8911A00615Q0004D3995j712a2776H6261
$$ plain form
15585 17619 65750 94716 53981 -53530 -108516 -175921 -81159 98935 -429170 -164631 -305337
15574 -305337 -416548 -12170 238551 310321 -60705 -90964 3197 -179270 -166484 65697 38944
15563 38944 10405 201317 40122 -8939 -113622 372397 100852 40241 -119648 -163357 29223
15551 -237475 327261 277749 -98233 -189866 -261381 229965 54162 -20340 165463 -108184 83054
15539 -112846 58326 -37446 4190 -115201 255786 -270372 -420941 100970 82580 110521 -188840
15527 227227 -70444 -5770 55899 243629 204464 -338102 -41773 -82568 108080 -179092 169342
15515 151587 114773 -84762 229587 970 -195054 -233798 -132003 -298074 -432288 71212 -36883
15503 340689 -38885 143681 -504132 66576 -36717 -424822 11014 134250 153256 -137407
$$ packed form
15585A7619M8131K8966m0735e3530n4986o7405h1159I8935d29170a64631j40706
15574c05337j11211a2170B38551P1770f0705l0259C197a79270J2786F5697k6753
15563C8944A0405J90912D0122h939j04683C72397A00852D0241a19648m3709B9223
15551b37475C27261m9512i8233r1633p1515B29965E4162b0340A65463a08184H3054
15539a12846E8326c7446D190a15201B55786b70372j50569A00970j8390K7941a88840
15527B27227g0444e770E5899J87730l9165c38102d1773m0795A08080a79092A69342
15515A51587l6814h4762B29587I70a95054l8744J01795j66071j34214G1212c6883
15503C40689c8885A43681e04132F6576c6717l88105A1014J23236J9006a37407
$$ plain form
15492 111393 -279226 305091 104015 -304946 -32454 -181861 -216623 142740 1189 12270
15482 12270 125861 458708 201357 -45441 -48525 -201140 26291 188567 22839 84753 -52592
15470 28453 105557 208389 159211 -46294 -156096 -349197 -97446 177713 -134060 -356291
15460 -356291 -37160 63625 -177025 5983 121670 95892 34590 88616 -132913 85320 -62440
15448 -108293 -161413 140379 -168891 215907 -312576 -129701 348602 196109 -474964 114314
15437 8902 -49881 291308 -21145 202848 -130456 75731 -143345 -157750 109271 -209345 138735
15425 96325 134869 -348843 133853 -89548 112536 -82382 -290200 -73097 -17322 -52535 -177494
15414 -177494 -222187 -88893 -4312 -16523 -143173 -232096 -218367 6229 -18187 -45881 259738
$$ packed form
15492A11393b79226C05091A04015c04946c2454j49407l4762A42740A189J1081
15482A2270J13591L32847B01357d5441l084j52615B6291J62276B2839O1914e2592
15470B8453P7104J02832m9178d6294j09802j93101i7446A77713a34060k22231
15460c56291c7160F3625a77025E983J15687k5778C4590N4026a32913H5320f2440
15448a08293n3120A40379a68891B15907c12576a29701C48602j52493d74964A14314
15437H902d9881B91308b1145B02848a30456G5731a43345j4405A09271b09345A38735
15425I6325L8544c48843A33853h9548A12536h2382k07818g3097a7322l5213j24959
15414a77494m4693h8893d312j2211j26650q8923J3729F229a8187k7694B59738
$$ plain form
15402 161925 130533 -71745 76048 -335088 -35186 105493 149121 297057 152131 -66721 -106382
15391 -106382 -63427 309834 261202 -49328 -208605 -197682 -223662 94635 -120138 132614 -124722
15379 -67102 -48917 69090 -24467 -166898 151752 36828 -143113 -114389 -211862 -159448 -6303
15367 -22905 -130461 -172489 133310 -100880 -231225 130693 115894 -165799 -137080 57778
15356 43412 37084 -196493 139431 -96955 83708 -72604 -185287 60931 -350176 -272588 -38082
15344 -3115 -68773 -271914 -150293 -36705 18645 31458 70998 352399 200756 -148033 -2258
15332 425825 41980 -69108 239972 -209873 274311 -9363 109295 -50171 149639 67522 -86590
15320 -180010 213385 65859 -224025 119446 -114523 64298 3384 148108 110753 351605
$$ packed form
15402A61925l1392g1745G6048c35088c5186A05493M3628J47936j44926f6721l9661
15391a06382M2955C09834m8632d9328j59277J0923k5980I4635a20138A32614a24722
15379f7102J8185F9090b4467j42431A51752C6828a43113K8724r7473N2414f303
15367b2905j07556m2028A33310a00880j30345A30693j4799a65799K8719E7778
15356D3412o328a96493A39431i6955H3708g2604j12683F0931c50176P7588c8082
15344c115o5658k03141J21621c6705A8645J2813L9540K81401j51643a48033b258
15332D25825D1980f9108B39972b09873B74311i363A09295e0171A49639F7522h6590
15320a80010B13385F5859b24025A19446a14523F4298C384J44724l7355K40852
$$ plain form
15310 351605 164074 30003 73029 -58065 191635 -138199 -281072 -21142 137339 9584 -135447
15298 195343 171147 -213499 -9758 42122 -183703 110213 -25278 34389 39731 157938 -159919
15286 -65473 117239 -120254 65108 -3640 -156379 -2315 -14302 213251 12789 60155 -166168
15274 74294 10672 132040 45182 -113086 -108122 86131 -73646 -25411 11987 -65303 -90901
15263 -90901 -60953 119979 -164528 182943 -82732 -4849 417384 27546 -145897 4069 33284
15252 33284 187855 376490 91137 468375 1187571 1555527 1358211 1416854 1669927 477822
15241 17713 71510 449827 85541 103559 248666 85511 515720 -80668 -283133 -239912 219413
15229 492287 78883 195416 22692 -205654 123248 370252 40575 112130 323674 47224
$$ packed form
15310C51605A64074C0003M3026e8065A91635a38199j42873b1142A37339I584a35447
15298A95343k4196b13499i758D2122a83703A10213b5278C4389N342J18207a59919
15286f5473A17239a20254F5108c640j52739b315j1987B13251A2789M7366a66168
15274G4294A0672J21368D5182a13086M964H6131g3646b5411A1987f5303k5598
15263i0901K9948A19979a64528A82943h2732d849D17384B7546a45897D069K9215
15252C3284J54571J88635I1137L77238P19196L67956j97316N8643K53073D77822
15241A7713N3797L78317H5541J8018J45107H5511M30209h0668k02465M3221B19413
15229D92287G8883J16533B2692b05654A23248K47004D0575P1555K11544D7224
$$ plain form
15218 313264 -128514 -109513 179465 49614 -271907 -196462 -13831 209958 56847 8934 35924
15207 35924 -524689 254355 28024 10202 30333 -101794 110829 -149182 -56187 -44437 -36175
15196 -36175 54202 233409 272847 250203 -191707 -127328 105343 -24322 19999 -228003 -82802
15184 51179 -14236 189241 -1769 -300527 -132834 39813 -299366 252709 -109643 396253
15173 -321885 -98755 -87758 109670 -287327 -103943 294728 224758 56151 -118972 65939
15162 382789 -44614 41801 163111 475619 -121553 -267774 86982 247918 -136003 318263
15151 -185642 144182 -172204 177669 -13348 438683 268625 1233 175469 79303 -59591
15140 253766 -62421 -189478 126807 -146308 -93230 -58451 156918 91787 198244 -139522
$$ packed form
15218C13264a28514J9001A79465D9614b71907P5445a3831B09958E6847H934K6990
15207C5924e24689B54355B8024A0202K0131a01794A10829a49182e6187J1750Q262
15196c6175E4202J79207L9438k2644a91707O4379A05343b4322A9999b28003h2802
15184E1179a4236A89241a769k98758a32834C9813b99366B52709a09643C96253
15173c21885i8755J0997A09670b87327a03943B94728o9970E6151a18972F5939
15162C82789d4614D1801J21310L12508a21553j46221H6982J60936a36003C18263
15151a85642A44182a72204A77669a3348D38683j70058A233J74236G9303e9591
15140B53766f2421j27057A26807a46308N3078L4779A56918o5131J06457a39522
$$ plain form
15129 272893 -39927 91149 265523 102352 184391 87313 34488 -37843 98603 50711 102926
15118 102926 -2803 96160 10751 21746 -78867 200588 153228 205751 245081 -78741 -87386 19130
15105 529169 200699 93661 272480 74658 -17279 -97877 201282 376121 26880 231687
15095 231687 212844 -189128 225471 16073 5829 235415 -10919 -122301 -59873 188079 236434
15084 236434 -167876 -90709 207188 84060 179738 -87155 123012 270326 443995 293418
15074 293418 5855 168419 174735 15138 101202 87288 313924 76375 180250 189214 233404
15063 233404 437141 145240 199041 181614 197039 229507 35371 208478 316685 248998 202973
15052 202973 73382 405821 -65878 102349 39700 11374 212488 292721 -57928 -41838 280051
$$ packed form
15129B72893c9927I1149J74374A02352Q2039H7313C4488c7843I8603m7892N2215
15118A02926b803I6160A0751J0995g8867B00588m7360N2523L9330g8741q645A9130
15105E29169B00699I3661J78819G4658a7279q0598B01282J74839B6880K04807
15095B31687j8843a89128B25471A6073E829K29586a0919j11382e9873A88079M8355
15084B36434a67876P7167B07188H4060R5678h7155A23012J47314J73669j50577
15074B93418E855J62564O316A5138Q6064j3914K26636G6375J03875Q964M4190
15063B33404K03737A45240N3801j7427J5425L2468C5371J73107J08207o7687m6025
15052B02973G3382L32439f5878A02349C9700A1374K01114Q0233e7928J6090B80051
$$ plain form
15040 -18574 414354 61485 46709 125491 -267043 386345 172331 378498 152206 214624
15030 214624 212762 359422 86615 -251385 277604 226179 74370 289375 -7839 286472 229811
15019 229811 174312 107117 183078 134913 147650 26188 11216 524118 163411 464314 508437
15008 508437 240545 42649 261598 264253 116301 -118343 20283 317337 127293 197905
14998 197905 82409 119701 463202 240263 -150192 131772 25328 132202 -148354 -94815
14988 -94815 226726 226513 195664 325514 293911 -79467 157337 264785 53471 -16425 152517
14976 247823 -42655 539573 210680 120404 -38655 234957 181635 448659 204457 160412
14966 160412 85031 -61210 163319 345148 252272 229585 195085 50913 121097 178034 509335
$$ packed form
15040a8574D14354F1485j4776P8782b67043C86345A72331K06167A52206O2418
15030B14624j862J46660H6615b51385B77604n1425G4370K15005g839B86472n6661
15019B29811n5499o7195P5961m8165J2737B6188A1216N12902A63411L00903M4123
15008E08437B40545D2649K18949K655A16301a18343B0283K97054A27293P0612
14998A97905H2409L7292L43501k22939a50192A31772B5328J06874a48354N3539
14988i4815B26726k13l0849J29850l1603g9467A57337J07448E3471a6425A52517
14976B47823d2655E39573B10680r0276c8655B34957n3322K67024B04457m4045
14966A60412p5381f1210A63319J81829r2876k2687l4500E0913P0184N6937L31301
$$ plain form
14955 509335 273027 -77602 588480 -149886 44872 -11429 196853 187398 121853 270666 -121967
14943 178677 132278 208831 202074 -71836 224668 50690 393716 136344 388712 306924 478918
14932 478918 115209 581931 -110080 217131 186723 114507 245898 228314 629382 370484
14922 370484 118183 101946 199856 242653 150597 375218 66346 472313 504213 -56146 320971
14910 323320 -85251 319028 360980 218353 266800 320540 269139 213803 593033 272569 209941
14899 209941 -20056 433478 -105136 250668 311640 357969 307789 305622 288244 412097 271783
14888 271783 135468 504915 522533 393985 520358 547943 262683 247472 245889 478655
14878 478655 232386 515887 326815 295535 325656 458587 245864 466040 -22523 439567
$$ packed form
14955E09335k36308g7602E88480a49886D4872a1429A96853r455o5545J48813a21967
14943A78677m6399P6553o757g1836B24668E0690L43026A36344K52368q1788J71994
14932D78918A15209M66722a10080B17131l0408p2216J31391j7584M01068k58898
14922C70484A18183j6237R7910M2797r2056K24621F6346M05967L1900e6146C20971
14910C23320h5251C19028M1952j42627M8447N3740n1401n5336L79230B72569o2628
14899B09941b0056D33478a05136B50668O0972M6329n0180k167j7378J23853j40314
14888B71783A35468L69447J7618j28548J26373K7585B62683j5211j583K32766
14878D78655B32386K83501j89072l1280L0121J32931k12723K20176b2523D39567
$$ plain form
14867 202641 -130001 623456 127517 338488 390399 232671 151240 569010 475481 137796
14856 176764 320423 176203 556555 367940 662439 198996 390540 337101 28771 444773
14846 444773 246773 348967 218587 270287 284010 288262 167173 269448 857351 356186
14835 184978 448528 134456 443147 448191 174062 337491 363382 121159 236350 95506
14824 497374 267472 789018 458305 280146 372334 585227 480714 379725 384632 355311
14814 355311 36794 197876 452372 260868 409734 504445 352679 633605 476530 257590
14804 257590 652708 428201 451840 680851 165558 682936 639610 325504 101401 652736
14794 652736 211065 709610 583166 366890 575950 450281 573993 193496 289422 407989
$$ packed form
14867B02641a30001F23456A27517K10971N1911j57728q1431M17770r3529A37796
14856A76764J43659j44220L80352j88615K94499A98996J91544n3439B8771M16002
14846D44773j98000J02194j30380N1700J3723M252j21089J02275N87903C56186
14835A84978K63550A34456L08691N044A74062J63429K5891A21159J15191I5506
14824D97374k29902N21546l30713j78159R2188K12893j04513j00989M907k9321
14814C55311C6794J61082K54496j91504J48866R4711j51766K80926j57075k18940
14804B57590L95118k24507K3639K29011A65558N17378m3326l14106A01401N51335
14794F52736B11065M98545j26444k16276K09060j25669J23712A93496R5926J18567
$$ plain form
14784 407989 286032 662559 723527 530332 683125 489600 214873 470569 567636 476133
14774 476133 523946 608391 628343 601571 680843 731889 326304 538543 114186 648782 592210
14763 592210 545132 653431 672926 818149 600750 346098 346379 719396 460829 374795 572490
14752 572490 519764 474854 580350 823695 440722 424335 520551 599648 869150 641093
14742 641093 511868 844794 601176 514657 593222 587361 717458 716905 411944 626169 880690
14731 880690 562032 637875 623548 737299 629864 513804 840315 621695 795327 890667
14721 890667 754965 569433 666972 524376 725434 497217 847796 534539 660157 854343
14711 854343 800483 915944 899578 1123348 777611 738226 733522 765209 542834 565930 797511
$$ packed form
14784D07989j21957L76527O0968j93195J52793j93525B14873K55696R7067r1503
14774D76133M7813Q4445J9952k6772P9272N1046C26304K12239A14186N34596n6572
14763E92210m7078J08299J9495J45223k17399k54652K81L73017k58567q6034J97695
14752E72490n2726m4910J05496K43345l82973j6387R6216P9097K69502k28057
14742F41093j29225L32926k43618q6519P8565n861J30097n53l04961K14225K54521
14731H80690l18658P5843j4327J13751j07435j16060L26511k18620J73632R5340
14721H90667j35702j85532R7539j42596K01058k28217L50579l13257J25618J94186
14711H54343n3860J15461j6366K23770l45737l9385m704L1687k22375K3096K31581
$$ plain form
14700 797511 1182414 733481 482682 609389 536218 1057994 954374 958468 1018424 806432
14690 806432 1045303 709806 727204 980296 954938 1053088 1076777 835915 687938 716955
14680 716955 715408 1033466 628542 1130216 1061093 776136 1234515 1273576 893566 1024427
14670 1024427 547276 1177905 614093 917694 1085466 959982 1046748 1245388 892078 766984
14660 766984 1022778 1318482 988450 1006008 1168322 1078960 797948 1013309 876131 794134
14650 794134 1018528 1050998 691044 1263934 1033390 871355 1115837 818035 913918 1122353
14640 1122353 1010167 1496513 1197242 1382557 1136273 960471 1246340 1322179 1039143 1146086
14630 1146086 1231039 1453008 1246739 1458007 1292866 1256550 1151197 1335337 1231017 1256766
$$ packed form
14700G97511L84903m48933k50799J26707p3171N21776j03620M094N9956k11992
14690H06432K38871l35497J7398K53092k5358R8150K3689k40862j47977K9017
14680G16955j547L18058m04924N01674o9123k84957M58379L9061l80010J30861
14670A024427m77151O30629n63812L03601J67772j25484Q6766J98640l53310j25094
14660G66984K55794K95704l30032J7558J62314q9362k81012K15361j37178q1997
14650G94134K24394L2470l59954N72890k30544j62035K44482k97802R5883K08435
14640A122353j12186M86346k99271J85315k46284j75802K85869P5839k83036J06943
14630A146086Q4953K21969k06269K11268j65141l6316j05353J84140j04320K5749
$$ plain form
14620 1256766 941413 1104346 1558801 1499569 1247808 1593867 908609 1565630 1178416 1293560
14610 1293560 1407862 1282398 1392958 1394848 1189636 1527193 1693589 1599946 1352118 1798491
14600 1798491 1552973 1354678 1399271 1728414 1481882 1500571 1300936 1263457 1398759 1466541
14590 1466541 1996273 1865394 1602827 1679763 1638586 1631712 1963823 1622727 1980088 1837995
14580 1837995 1814905 1886211 1897714 1621567 1828777 1849430 2054048 2076412 1709063 1974878
14570 1974878 1941183 2004266 2341727 2077695 1941489 2168319 2308191 2290425 2353288 2613671
14560 2613671 2459373 2433705 2633953 2626634 2872813 3286722 2975236 3637050 3928578 4085923
14550 4085923 5340865 7214217 12052874 23348210 38173552 38292119 20820228 11943806
$$ packed form
14620A256766l15353J62933M54455n9232k51761L46059o85258O57021l87214J15144
14610A293560J14302j25464J10560J890k05212L37557J66396r3643k47828M46373
14600A798491k45518j98295M4593L29143k46532J8689j99635l7479J35302O7782
14590A466541N29732j30879k62567P6936m1177o874L32111l41096L57361j42093
14580A837995k3090P1306J1503k76147K07210K0653K04618K2364l67349K65815
14570A974878l3695O3083L37461k64032j36206K26830J39872j7766O2863K60383
14560B613671j54298k5668K00248p319K46179M13909l11486O61814K91528J57345
14550D085923J254942J873352M838657J1295336J4825342J18567j7471891q876422
$$ plain form
14542 11943806 6204056 3848805 2598166 2729125 1933922 1939605 1710293 1607822 2171682
14533 2171682 2146424 1969019 1955232 2307763 2177477 2108416 2285301 1702269 2212537 2111058
14523 2111058 2074289 2131391 2102910 2378211 2197666 2510853 2622060 2315647 2268948 2370033
14513 2370033 2822042 2702030 2442016 2358700 2722132 2876606 2679376 3033788 2513707 2671410
14503 2671410 2797712 2689970 2936282 2875342 2639961 3049457 3128453 3142884 3246362 2714487
14493 2714487 3051420 3056521 3270517 3097112 3230549 3388822 3281114 3298710 3211761 3279780
14483 3279780 3368571 3670119 3401921 3827433 3707014 3746220 3873781 3851783 3908580 3702291
14473 3702291 3680666 4015428 3922682 3517525 4170090 3950665 4127583 3876107 4092312 4394554
$$ packed form
14542A1943806n739750k355251j250639J30959p95203N683k29312j02471N63860
14533B171682k5258j77405j3787L52531j30286o9061J76885n83032N10268j01479
14523B111058l6769N7102k8481K75301j80545L13187J11207l06413m6699J01085
14513B370033M52009j20012k60014q3316L63432J54474j97230L54412n20081J57703
14503B671410J26302j07742K46312o0940k35381M09496P8996J4431J03478n31875
14493B714487L36933N101K13996j73405J33437J58273j07708J7596q6949O8019
14483C279780Q8791L01548k68198M25512j20419L9206J27561k1998N6797k06289
14473C702291k1625L34762r2746m05157O52565k19425J76918k51476K16205L02242
$$ plain form
14463 4394554 4395098 4188961 4153650 4216109 5182730 4747844 4943521 4795008 4814042 4995377
14453 4995377 4893916 4985208 5024502 4903774 5570690 5045256 5099716 5473836 4976192 5704049
14443 5704049 5498739 5687488 5803436 5671430 5765252 5726161 5993164 6010197 6058971 6128373
14433 6128373 6074652 6431081 6445088 6454686 6669317 6748756 6878049 6879825 7050970 7108567 6950165
14422 6950165 7132055 7518667 7528241 7755624 7855893 8399949 8095885 8251269 8053321 8246466
14412 8246466 8188513 8356137 8479693 8848033 8639386 8790921 9244700 9165564 9496247 9274540
14402 9274540 9715079 9663731 9791051 10233021 10075078 10408304 10696063 10844853 10727254 11210654
14392 11210654 11298402 11409053 11914735 11753838 12014799 12312338 12697316 12982228 12966895 13263025
$$ packed form
14463D394554N44k06137l5311O2459R66621m34886J95677j48513J9034J81335
14453D995377j01461R1292L9294j20728O66916n25434N4460L74120m97644P27857
14443E704049k05310J88749J15948j32006R3822l9091K67003J7033M8774O9402
14433F128373n3721L56429J4007R598K14631P9439J29293J776J71145N7597j58402
14422F950165J81890L86612R574K27383J00269N44056l04064J55384j97948J93145
14412H246466n7953J67624J23556L68340k08647J51535M53779p9136L30683k21707
14402I274540M40539n1348J27320M41970j57943L33226K87759J48790j17599M83400
14392A1210654Q7748J10651N05682j60897K60961K97539L84978K84912j5333K96130
$$ plain form
14382 13263025 13539110 13761304 13891800 14158545 14746338 14806643 15148909 15846224 15710289
14373 15710289 16021928 16606398 16781892 17066516 17165328 17822498 17946305 18466856 18963585
14364 18963585 19613896 19827435 20237672 20463259 21385947 21438645 22051744 22665383 22925964
14355 22925964 23567266 24070978 24780203 25384409 25689165 26884686 27400807 27787513 28196166
14346 28196166 29436512 30216609 31014932 31606832 32443991 33327464 34139519 35138925 36253791
14337 36253791 37323731 38024254 39651892 40377457 41522378 42586667 44175029 45774139
14329 45774139 47157069 48559816 50511470 51938345 53614726 55653655 57652549 59432837
14321 59432837 61789012 63829669 66178747 68812843 71351770 74075516 76990419 80052764
$$ packed form
14382A3263025K76085K22194J30496K66745N87793O0305L42266O97315j35935
14373A5710289L11639N84470J75494K84624R8812O57170J23807N20551M96729
14364A8963585O50311K13539M10237K25587R22688N2698O13099O13639K60581
14355B2925964O41302N03712P09225O04206L04756J195521N16121L86706M08653
14346B8196166J240346P80097P98323N91900Q37159Q83473Q12055R99406J114866
14337C6253791J069940P00523J627638P25565J144921J064289J588362J599110
14329D5774139J382930J402747J951654J426875J676381K038929J998894J780288
14321E9432837K356175K040657K349078K634096K538927K723746K914903L062345
$$ plain form
14313 80052764 83202712 86547850 90303764 93633994 97854764 102151590 106668558 111362600
14305 111362600 116020121 121619992 127699796 133638053 140284064 146723589 154382689 161794768
14297 161794768 170061917 178297535 187360083 196886356 207038447 217931787 229040355
14290 229040355 240926387 253852465 266904299 280600453 294677336 309447176 324383952
14283 324383952 339690064 355352870 370881541 386589795 401438041 415408043 429017179
14276 429017179 440886544 451469217 460041830 465371804 465618020 460315878 456708453 453867266
14268 453867266 447782279 442902577 435098874 425420716 414942961 403464685 390182053
14261 390182053 375624423 360176736 344524931 328788541 312913176 297719308 282222586
$$ packed form
14313H0052764L149948L345138L755914L330230M220770M296826M516968M694042
14305A11362600M657521N599871O079804N938257O646011O439525P659100P412079
14297A61794768Q267149Q235618R062548R526273J0152091J0893340J1108568
14290B29040355J1886032J2926078J3051834J3696154J4076883J4769840J4936776
14283C24383952J5306112J5662806J5528671J5708254J4848246J3970002J3609136
14276D29017179J1869365J0582673Q572613N329974K46216n302142l607425k841187
14268D53867266o084987m879702p803703r678158j0477755j1478276j3282632
14261C90182053j4557630j5447687j5651805j5736390j5875365j5193868j5496722
$$ plain form
14254 282222586 268699955 255076733 241804589 229531218 217390250 206449696 196069501
14247 196069501 186131621 176685804 168029709 160036306 152379534 145129493 138126559 131892188
14239 131892188 125723177 120722697 115283774 110110748 105405749 100753498 96556167 92779207
14231 92779207 89308806 85666005 82129408 78937873 76169609 73109108 70447831 68055358
14223 68055358 65492939 63160417 60927045 59099568 57060618 54832690 53126085 51102616
14215 51102616 50019927 48344231 47518551 45866877 44199580 43158683 41715289 40361481
14207 40361481 39818699 39071149 37484341 36055080 35204363 34323812 33682315 33264526 32214009
14198 32214009 30794282 30502790 29448877 28724048 27931287 27413282 26921977 26067396 25344815
$$ packed form
14254B82222586j3522631j3623222j3272144j2273371j2140968j0940554j0380195
14247A96069501r937880r445817q656095p993403p656772p250041p002934o234371
14239A31892188o169011n000480n438923n173026m704999m652251m197331l776960
14231I2779207l470401l642801l536597l191535k768264l060501k661277k392473
14223F8055358k562419k332522k233372j827477k038950k227928j706605k023469
14215E1102616j082689j675696q25680j651674j667297j040897j443394j353808
14207D0361481n42782p47550j586808j429261q50717q80551o41497m17789j050517
14198C2214009j419727k91492j053913p24829p92761n18005m91305q54581p22581
$$ plain form
14189 25344815 24832742 24183497 23410673 22849057 22403470 21953301 21726518 21269921 20537848
14180 20537848 19875357 19641647 19290895 19097899 18960628 18193499 17766919 17357029 17147955
14171 17147955 16846363 16472971 16297519 15798157 15774404 15198166 14974887 14743424 14476214
14162 14476214 14025746 14333893 13753930 13637426 13032610 12955963 12953774 12429476 12587380 12288420
14152 12288420 12143002 11850319 11334667 11560210 11218082 11161525 11025041 10868450 10684949
14143 10684949 10239812 10214798 10085417 9708608 9943278 9656646 9525919 9134357 9488735
14134 9488735 9162091 8944835 8967988 8915742 8427514 8314215 8495291 8139872 8120314 7956038
14124 7956038 7995591 7851494 7638213 7175636 7461902 7501773 7447185 7075943 6845804 7066611
$$ packed form
14189B5344815n12073o49245p72824n61616m45587m50169k26783m56597p32073
14180B0537848o62491k33710l50752j92996j37271p67129m26580m09890k09074
14171A7147955l01592l73392j75452m99362k3753n76238k23279k31463k67210
14162A4476214m50468L08147n79963j16504o04816p6647k189n24298J57904k98960
14152A2288420j45418k92683n15652K25543l42128n6557j36484j56591j83501
14143A0684949m45137k5014j29381l76809K34670k86632j30727l91562L54378
14134I488735l26644k17256K3153n2246m88228j13299J81076l55419j9558j64276
14124G956038L9553j44097k13281m62577K86266L9871n4588l71242k30139K20807
$$ plain form
14114 7066611 6736534 6710398 6417878 6369615 6899582 6420355 6294670 6244829 6307467 6392165
14104 6392165 5881393 5932442 6029418 5888640 5658389 5613699 5770618 5858870 5151990 5499024
14094 5499024 5353659 5143903 5550376 5204953 4985241 5080832 5070515 5139230 5074994 4898251
14084 4898251 4890160 4796094 4762415 4808407 5058813 4656244 4795468 4614877 4551274 4547423 4508107
14073 4508107 4324776 4606554 4335087 4230761 4318312 3966107 4060416 4154306 4263238 3773567
14063 3773567 4151173 4015534 4052849 3934720 3748185 4287267 3855422 3715480 3863631 3852885
14053 3852885 3692248 3696835 3366546 3493706 3653366 3330992 3604937 3536761 3239787 3098295
14043 3098295 3548299 3518900 3412000 2733702 2978510 2881741 3279815 3374822 3046644 3255471
$$ packed form
14114G066611l30077k6136k92520m8263N29967m79227j25685m9841O2638Q4698
14104F392165n10772N1049R6976j40778k30251m4690J56919Q8252p06880L47034
14094E499024j45365k09756M06473l45423k19712R5591j0317O8715o4236j76743
14084D898251q091r4066l3679M5992K50406m02569J39224j80591o3603l851l9316
14073D508107j83331K81778k71467j04326Q7551l52205R4309R3890J08932m89671
14063C773567L77606j35639L7315j18129j86535N39082m31845j39942J48151j0746
14053C852885j60637M587l30289J27160J59660l22374K73945o8176k96974j41492
14043C098295M50004k9399j06900o78298K44808r6769L98074R5007l28178K08827
$$ plain form
14033 3255471 3324624 3406520 3202069 3185135 2756551 3032584 2650874 2675267 2865459 2725291
14023 2725291 2599717 2560160 2978592 2674206 2614934 2553029 2644767 2742080 2843139 2719294
14013 2719294 2219956 2424836 2335671 2473346 2111324 2413666 2349648 2369419 2045839 2277992
14003 2277992 2447053 1890694 2091501 1958904 1801445 2190029 1957940 2438176 1580694
13994 1580694 2072895 2016095 1919300 1954943 2731685 3433894 6713296 16190296 32654745
13985 32654745 39470142 24369937 13952949 8387099 6295773 4807803 4327889 3708390
13977 3708390 3437294 3362584 2881291 2825175 2560449 2790961 2758257 2869645 2328867 2115396
13967 2115396 2299921 2077080 2324446 2317164 2180298 2414122 2185319 1974931 2353223 1968214
$$ packed form
14033C255471O9153Q1896k04451j6934m28584K76033l81710K4393J90192j40168
14023B725291j25574l9557M18432l04386n9272o1905R1738R7313J01059j23845
14013B719294m99338K04880q9165J37675l62022L02342o4018J9771l23580K32153
14003B277992J69061n56359K00807j32597j57459L88584k32089M80236q57482
13994A580694M92201n6800r6795L5643P76742P02209L279402R477000J6464449
13985C2654745O815397j5100205j0416988n565850k091326j487970m79914o19499
13977C708390k71096p4710m81293n6116k64726K30512l2704J11388n40778k13471
13967B115396J84525k22841K47366p282j36866K33824k28803k10388L78292l85009
$$ plain form
13957 1968214 1859871 2000151 1766940 2091684 1859530 1861052 1948441 2107683 1562895 1817143
13947 1817143 1824336 2030682 1680330 2038059 2103870 1716735 1624637 1903943 1745054 1514816
13937 1514816 1571733 1638975 1695412 1584646 1503807 1652134 1702051 1642928 1792320 1370501
13927 1370501 1285937 1479950 1575203 1421224 1514950 1347769 1610162 1524814 1603186 1650001
13917 1650001 1760916 1474113 1156879 1083128 1522915 1536567 1676588 1235462 1439463 1224481
13907 1224481 1411832 1319937 1233676 1507751 1416646 1385191 1058486 1091225 1425789 920546
13897 920546 1279556 1221680 1091654 1396849 1408043 1334237 1374666 1372947 910558 1432179 1275498
13886 1275498 1259617 1385646 1536239 975335 1009677 1286376 1296682 1184893 858323 1001490
$$ packed form
13957A968214j08343J40280k33211L24744k32154J522Q7389J59242n44788K54248
13947A817143P193K06346l50352L57729O5811l87135r2098K79306j58889k30238
13937A514816N6917O7242N6437j10766q0839J48327M9917n9123J49392m21819
13927A370501q4564J94013R5253j53979R3726j67181K62393q5348P8372M6815
13917A650001J10915k86803l17234p3751M39787J3652J40021m41126K04001k14982
13907A224481J87351r1895q6261K74075r1105l1455l26705L2739L34564n05243
13897I20546L59010n7876j30026L05195J1194p3806M0429j719m62389N21621j56681
13886A275498j5881J26029J50593n60904L4342K76699J0306j11789l26570J43167
$$ plain form
13876 1001490 1134708 1139554 1225976 870721 982132 1449934 763372 892009 1015698 910602
13866 910602 1120474 1101027 1121301 971106 1250436 1282834 1141671 1004332 1246932 1056440
13856 1056440 1140292 966977 1323672 965828 797541 833632 993812 1161133 1348736 1136695
13846 1136695 663589 905080 999628 922382 672677 1132769 878921 1039615 930495 879793
13836 879793 1159948 906304 656331 755908 660316 848105 1130252 901630 1010587 899648
13826 899648 880709 922372 802924 919825 890844 1082359 807383 1039630 1151731 1054374
13816 1054374 902624 854989 1124902 727158 896428 700881 466470 779092 495303 1117457
13806 1117457 976731 885301 824521 728998 829750 637584 837931 724697 689220 915771
$$ packed form
13876A001490J33218M846Q6422l55255J11411M67802o86562J28637J23689j05096
13866I10602K09872j9447K0274j50195K79330L2398j41163j37339K42600j90492
13856A056440Q3852j73315L56695l57844j68287L6091J60180J67321J87603k12041
13846A136695m73106K41491R4548p7246k49705M60092k53848J60694j09120n0702
13836H79793K80155k53644k49973R9577r5592J87789K82147k28622J08957j10939
13826H99648j8939M1663j19448J16901k8981J91515k74976K32247J12101r7357
13816A054374j51750m7635K69913l97744J69270j95547k34411L12622k83789O22154
13806A117457j40726r1430o0780r5523J00752j92166K00347j13234l5477K26551
$$ plain form
13796 915771 749718 803259 725692 743405 511563 967316 846211 715283 791844 675461
13786 675461 611977 767263 797684 755437 552339 579200 741403 711807 712890 843892 714313
13775 714313 771550 654722 693892 898845 670805 563879 472134 416942 750059 625384
13765 625384 843974 548817 839437 533721 925830 534221 596106 480520 306209 768420
13755 768420 435622 637747 555008 413088 758156 401374 548192 702007 603505 612884
13745 612884 705974 458381 318346 572888 548791 502356 567285 540174 903226 819334 389760
13733 519747 574393 800896 826099 703218 612128 1043381 577250 710892 600737 578312
13723 578312 403737 525147 694463 615725 872753 297998 574018 619927 379019 542536
$$ packed form
13796I15771j66053N3541p7567J7713k31842M55753j21105j30928P6561j16383
13786F75461o3484J55286L0421m2247k03098K6861J62203k9596J083J31002j29579
13775G14313N7237j16828L9170K04953k28040j06926r1745n5192L33117j24675
13765F25384K18590k95157K90620l05716L92109l91609O1885j15586j74311M62211
13755G68420l32798K02125q2739j41920L45068l56782J46818J53815r8502R379
13745F12884R3090k47593j40035K54542k4097m6435O4929k7111L63052q3892C89760
13733E19747N4646K26503K5203j22881r1090M31253m66131J33642j10155k2425
13723E78312j74575J21410J69316p8738K57028B97998K76020M5909k40908J63517
$$ plain form
13713 542536 377408 457022 463119 551456 750753 346231 499111 575409 243306 570606
13703 570606 391684 670552 385921 514389 490459 274876 460658 577354 307881 633763
13693 633763 725834 156223 600286 578886 414143 271487 514740 439605 153648 536698
13683 536698 730301 302719 609722 717682 616336 608858 379976 367684 292088 352561
13673 352561 574013 700239 659169 728822 632049 449636 801976 396452 540535 662511
13663 662511 375644 314487 423823 469400 483470 238327 215058 566289 469472 348588
13653 348588 509303 498673 251643 333516 287858 310484 435292 540227 239261 363670
13643 363670 105042 528058 752753 251434 544952 577191 132498 100397 375664 491669
$$ packed form
13713E42536j65128P9614O097Q8337J99297C46231J52880P6298B43306L27300
13703E70606j78922K78868k84631J28468k3930k15583J85782J16696k69473L25882
13693F33763R2071A56223M44063k1400j64743j42656K43253p5135A53648L83050
13683E36698J93603C02719L07003J07960j01346p478k28882j2292p5596O0473
13673C52561K21452J26226m1070O9653r6773j82413L52340C96452J44083J21976
13663F62511k86867o1157J09336M5577J4070B38327k3269L51231r6817j20884
13653C48588J60715j0630k47030Q1873m5658K2626J24808J04935B39261J24409
13643C63670A05042M23016K24695B51434K93518L2239A32498l2101K75267J16005
$$ plain form
13633 491669 562624 523483 463543 748936 340243 396760 306036 539394 245946 418340
13623 418340 365931 238459 357949 370232 522389 315147 418867 242177 237250 343367
13613 343367 400529 509424 317255 417550 441049 303529 227239 357998 350689 224107
13603 224107 307736 560622 90092 484377 333760 382766 401862 146143 564573 422020
13593 422020 348615 634 332028 622605 578897 31414 330348 261210 543419 317444 137326
13581 295988 428020 291971 212986 217359 163078 229858 471329 357904 236484 285642 238368
13570 238368 391358 363536 587570 405549 443551 554674 122639 339968 416463 202357
13559 333299 141669 392469 616912 366206 244162 177147 161921 -5013 390988 316301
$$ packed form
13633D91669P0955l9141n9940K85393C40243N6517r0724K33358B45946J72394
13623D18340n2409j27472J19490J2283J52157k07242J03720j76690m927J06117
13613C43367N7162J08895j92169J00295K3499j37520p6290J30759p309j26582
13603B24107Q3629K52886I0092L94285j50617M9006J9096A46143M18430j42553
13593D22020p3405F34L31394K90577m3708C1414K98934o9138K82209k25975A37326
13581B95988J32032j36049p8985M373n4281O6780K41471j13425j21420M9158m7274
13570B38368J52990k7822K24034j82021L8002J11123A22639K17329P6495B02357
13559C33299A41669K50800K24443k50706j22044o7015j5226e013C90988p4687
$$ plain form
13549 316301 307450 328274 438325 213264 73784 666099 307879 608295 283731 337374
13539 337374 403040 388913 379554 302889 317597 370692 200088 505511 240589 487617 249771
13528 249771 386020 421984 70482 177267 205913 304312 430096 283241 -10642 240924
13517 405036 342930 173532 317849 257069 190700 143033 314177 111258 331188 210873
13507 210873 98256 431711 225794 299562 200387 315286 575955 377895 257661 244698
13497 244698 95083 20042 -35749 154702 181150 404330 -267406 93820 370790 264623
13487 264623 526029 336736 376459 352497 491248 -53779 -54018 176513 -39283 94524 231427
13476 231427 196042 74961 171338 264413 401065 168508 542902 271591 264847 161482 184928
$$ packed form
13549C16301q851K0824J10051B13264G3784N92315C07879L00416B83731N3643
13539C37374O5666j4127r359p6665J4708N3095j70604L05423B40589K47028k37846
13528B49771J36249L5964G0482J06785K8646R8399J25784j46855a0642B40924
13517D05036o2106j69398J44317o0780o6369m7667J71144A11258K19930j20315
13507B10873I8256L33455k05917P3768r9175J14899K60669j98060j20234j2963
13497B44698I5083B0042c5749A54702K6448K23180b67406I3820K76970j06167
13487B64623K61406j89293L9723k3962J38751e3779k39A76513c9283I4524J36903
13476B31427l5385G4961R6377R3075J36652A68508L74394k71311o744j03365K3446
$$ plain form
13465 184928 309667 328424 206075 213073 452074 -110584 191094 -34372 216224 225873 168175
13454 168175 222698 148565 118034 258790 275204 163277 352415 215287 449019 331377
13444 331377 218689 209222 164676 -184439 414652 -86038 141606 16569 469232 232907
13433 92375 284118 346410 393343 332607 118158 388550 196327 535269 139532 -56338
13422 460143 501825 309403 44081 396763 297807 405405 265865 70153 222682 325894
13412 325894 81904 398964 31559 89050 235611 362898 216335 98321 512964 354896
13402 354896 345347 489735 141511 383280 362449 220813 205249 323373 249472 527116
13392 527116 354721 382526 256817 227256 156970 145399 387906 270891 -60646 195794
$$ packed form
13465A84928J24739J8757j22349O998K39001a10584A91094c4372B16224R649n7698
13454A68175N4523p4133l0531J40756J6414j11927J89138j37128K33732j17642
13444C31377j12688r467m4546a84439D14652h6038A41606A6569M52663B32907
13433I2375J91743O2292M6933o0736A18158K70392j92223L38942A39532e6338
13422D60143M1682j92422D4081L52682r8956J07598j39540G0153J52529J03212
13412C25894H1904L17060C1559N7491J46561J27287j46563I8321M14643j58068
13402C54896r549J44388A41511K41769k0831j41636j5564J18124p3901K77644
13392E27116j72395K7805j25709k9561p0286j1571K42507j17015f0646A95794
$$ plain form
13381 176710 588454 -179341 -281456 345891 211482 -35382 214397 212425 165562 -35022
13370 285937 138067 358976 286233 386294 328162 44402 65894 531977 -52067 525498
13359 324178 309356 156977 183392 285643 268870 194597 87599 174067 286639 319679 226945
13348 226945 278195 171976 219375 -74621 46044 326818 175060 119702 353830 -45225 10641
13336 19341 122710 663829 357695 209115 372807 339776 370566 452356 9111 264388 268157
13325 268157 64916 398843 115214 311549 371830 190997 206598 -110081 152072 20644
13314 26340 -21722 287603 38018 10294 248465 166570 217265 323022 477898 2376 262912
13303 262912 146312 212747 305688 52656 168941 162743 184287 276552 -15925 342346 99616
$$ packed form
13381A76710M11744a79341j02115C45891j34409c5382B14397j972m6863c5022
13370B85937A38067K20909p2743J00061n8132D4402K1492M66083e2067E25498
13359C24178j4822j52379K6415J02251j6773p4273H7599Q6468J12572L3040r2734
13348B26945N1250j06219M7399g4621D6044K80774j51758n5358K34128d5225A0641
13336A9341J03369N41119l06134j48580J63692l3031L0790Q1790I111K55277L769
13325B68157F4916L33927A15214J96335O0281j80833J5601a10081A52072B0644
13314B6340b1722B87603C8018A0294K38171q1895N0695J05757J54876B376K60536
13303B62912j16600O6435R2941E2656J16285o198K1544R2265a5925C42346I9616
$$ plain form
13291 164777 -307484 232948 -16513 -104495 -55375 137298 42015 46525 -30452 214020 46457
13279 -54402 -197345 339102 130853 173942 -256088 23402 188552 243384 161073 -63587 334280
13267 -169033 231891 253003 182538 403539 293513 309594 -27969 132675 320574 -63293
13256 160157 699721 69723 136854 151959 -17602 9416 344761 269376 210048 169901 -42614
13244 326486 10879 245410 -128303 98591 333925 232498 364945 320712 180397 23388
13233 233786 77118 18550 208150 242038 122053 205170 136294 72143 124442 -66057 -47325
13222 -47325 50825 261696 85730 164475 -14340 201431 211798 183161 289382 19748 -157858
13210 290730 166953 124671 -88877 249527 139887 79386 214129 22360 291238 -62155
$$ packed form
13291A64777c07484B32948a6513q7982M9120A37298D2015M510c0452B14020D6457
13279e4402j42943C39102A30853M3089b56088B3402J65150N4832q2311f3587C34280
13267a69033B31891K1112p0465K21001j10026J6081b7969A32675J87899f3293
13256A60157N39564F9723O7131J5105a7602I416L35345p5385n9328m0147d2614
13244C26486A0879K34531a28303I8591K35334j01427J32447m4233j40315B3388
13233B33786G7118A8550J89600L3888j19985Q3117o8876o4151N2299f6057J8732
13222d7325E0825K10871H5730P8745a4340B01431J0367k8637J06221A9748a57858
13210B90730j23777m2282h8877B49527j09640o0501J34743B2360K68878f2155
$$ plain form
13199 110761 65291 122908 -69176 74739 204779 410386 261154 138527 363817 383004
13189 383004 -84993 306263 155054 -216900 -229537 59954 195700 -8367 304312 168757
13179 168757 118021 136244 136423 -167428 -100629 245215 85151 237305 -14541 126774 101028
13168 101028 89386 375996 232600 402508 -144902 238816 157894 -63745 145528 155897
13158 155897 69352 220826 71562 163094 98985 335660 204134 70969 28465 130631 119636
13147 119636 -52880 82737 -1850 -13593 -103945 139852 110975 89130 144055 -30240 135360
13135 97735 -137989 52008 51858 94106 -35008 89887 -12175 199554 27496 -145193 -518 120729
13122 149200 -194924 -13091 -122818 95880 164998 -90290 -134746 233233 272060 -68405 -170845
$$ packed form
13199A10761m5470N7617f9176G4739J30040K05607j49232j22627K25290J9187
13189C83004h4993C06263j51209b16900j2637E9954J35746h367C04312j35555
13179A68757n0736J8223J79a67428O6799B45215H5151J52154a4541A26774k5746
13168A01028j1642K86610j43396J69908a44902B38816q0922f3745A45528J0369
13158A55897F9352J51474G1562R1532o4109K36675j31526G0969B8465J02166j0995
13147A19636e2880H2737a850j1743r0352A39852k8877k1845N4925c0240A35360
13135I7735a37989E2008j50M2248c5008H9887a2175A99554B7496a45193e18A20729
13122A49200a94924a3091j09727I5880O9118i0290m4456B33233L8827f8405j02440
$$ plain form
13111 -170845 73035 244956 -109614 67203 206206 1124 -913 -275492 -125799 552608 110698
13099 -208631 505724 78254 290675 106582 12343 134337 70163 245752 68943 58225
13089 58225 53545 14797 188282 -35622 216989 154621 258882 85796 5351 -206304 13500
13077 80422 94751 385854 177710 172327 -17250 44388 -48263 267659 137201 336301 -176448
13065 102061 -217174 130742 193469 280339 121174 88143 -98551 8365 120108 162865 -68804
13053 243045 91074 194376 95691 12625 283485 128702 -10482 315785 -17802 230356
13042 316879 83238 -320761 329404 258737 299733 353557 165895 17107 56959 98597 120130
13031 120130 440306 -28443 178619 190938 304484 -55008 207988 118066 168243 209411 -80876
$$ packed form
13111a70845G3035J71921a09614F7203J39003A124i13k74579a25799E52608A10698
13099b08631E05724G8254K12421A06582A2343J21994o4174J75589F8943j0718
13089E8225m680A4797J73485c5622B16989o2368J04261H5796E351b06304A3500
13077H0422J4329K91103A77710n383a7250D4388d8263B67659j30458J99100a76448
13065A02061b17174A30742O2727Q6870A21174l3031i8551H365J11743M2757f8804
13053B43045I1074J03302I5691A2625K70860A28702a0482C15785a7802B30356
13042C16879H3238c20761C29404p0667M0996N3824A65895A7107L9852M1638K1533
13031A20130L20176b8443A78619J2319J13546e5008B07988q9922N0177M1168h0876
$$ plain form
13019 -56141 275359 363244 -86997 109804 121494 340936 124493 227913 -70262 165412
13008 66195 -68816 -57940 285665 177216 286848 -77081 241547 862 371227 195684 38266
12996 175046 316806 126812 48920 26630 239438 133711 190794 150257 -247999 -20015
12985 392059 101236 397112 75882 -185771 -27918 140444 76366 -266718 165964 19696
12974 -167946 109995 -22768 6422 -7052 186952 209550 -1339 98840 -71306 28735 160226
12963 160226 -14066 140975 43192 138454 -68324 -210834 114176 37770 -86655 -78904 -56239
12952 -56239 248764 64749 74899 36925 324810 -81568 -277436 277352 167113 53963 -139306
12940 -19998 194888 11448 3470 -5555 -90377 216098 -216352 -134592 89765 -176512 -153207
$$ packed form
13019e6141B75359Q7885h6997A09804J1690K19442A24493J03420g0262A65412
13008F6195f8816J0876B85665j08449J09632g7081B41547H62L70365j75543C8266
12996A75046J41760A26812D8920k2290K12808j05727N7083m0537b47999b0015
12985C92059A01236K95876G5882a85771b7918A40444o4078b66718A65964A9696
12974a67946A09995b2768F422g052A86952K2598a339I8840g1306B8735J31491
12963A60226a4066A40975D3192R5262f8324j42510A14176C7770h6655P751K2665
12952e6239B48764F4749J0150C6925K87885h1568j95868B77352j10239E3963a39306
12940a9998A94888A1448C470e555q4822B16098b16352Q1760H9765a76512K3305
$$ plain form
12929 -153207 136419 62683 48569 52110 84221 392641 344987 -152287 251285 -86254 340850
12917 -179127 102234 130075 88438 -120786 128037 21162 76348 207666 -79091 -228157
12907 -228157 -257315 107667 250117 -50443 33554 13704 290437 -75645 -243788 -95506 -118836
12896 -118836 -27688 43261 120197 290879 184017 -310799 221556 145697 402877 258762
12886 258762 -40227 -78041 -166801 93381 -258869 -226587 -104506 -51797 -272341 253464 163273
12875 163273 -19027 -4177 -87266 173451 63731 -98346 -117353 -25425 253086 -140012 56861
12863 24862 -37973 -18897 21751 149328 -118324 57062 278845 -184111 -244843 81714 25576
12851 4791 401284 -330711 -58498 -562606 -151661 -185487 -98950 57689 138865 55075 320367
$$ packed form
12929a53207A36419F2683j4114L541L2111L08420m7654a52287B51285h6254C40850
12917a79127A02234K7841m1637a20786A28037B1162N5186J31318g9091j49066
12907b28157k9158A07667J42450e0443C3554A3704K76733g5645j68143i5506k3330
12896a18836b7688D3261P6936J70682j06862c10799B21556p5859K57180j44115
12886B58762d0227l7814q8760I3381b58869L2282a04506e1797k20544B53464r0191
12875A63273a9027d177q3089A73451F3731i8346j9007b5425B53086a40012E6861
12863B4862c7973a8897B1751J27577a18324E7062K21783a84111o0732H1714B5576
12851D791L96493c30711e8498n04108a51661l3826Q6537E7689Q1176E5075K65292
$$ plain form
12840 320367 206588 219866 184223 -73514 49178 -78364 212087 242492 -112487 63250 3257
12828 163626 98200 35425 335698 -203332 221983 -290170 243909 79286 -120579 -11024
12817 122924 -64250 -25272 298366 -18991 273979 170466 47777 266287 -172595 -138151
12807 -138151 112135 266384 25153 422273 264365 -29098 -86062 185194 -46839 -81164
12797 -81164 49219 50500 55702 140105 -135520 -82315 -10750 208468 -177587 372996 -466802
12785 206418 280441 92760 -43389 148196 3040 -7063 384767 -35689 -267539 -169146 22335
12773 -109278 -102154 51969 -155799 -222586 -201469 -161189 -178605 -25641 -231384 8891 -407730
12761 -210848 209795 -72729 -334009 77764 -119221 32060 28331 98495 176242 73747 -170231
$$ packed form
12840C20367j13779J3278l5643g3514D9178g8364B12087L0405a12487F3250C257
12828A63626o5426C5425L00273b03332B21983b90170B43909G9286a20579a1024
12817A22924f4250b5272B98366a8991B73979j03513D7777K18510a72595L4444
12807a38151A12135J54249B5153L97120j57908b9098n6964A85194d6839l4325
12797h1164D9219J281N202Q4403a35520N3205a0750B08468a77587C72996d66802
12785B06418P4023I2760d3389A48196C040g063C84767c5689k31850R8393B2335
12773a09278P124E1969a55799o6787K1117M0280j7416b5641k05743H891d07730
12761b10848B09795g2729k61280G7764a19221C2060l729P0164P7747G3747a70231
$$ plain form
12749 -222512 -275316 -78606 -60598 -127463 -129140 -3963 22844 78656 113110 383140 328447 230796
12737 230796 -272549 206950 -150454 375863 -76685 37090 165960 115018 -67868 -73752 -148071
12726 -148071 121315 -42571 73523 -2473 -11502 220266 217151 127526 445753 -102953 -99949
12715 -99949 116171 -3893 319206 135673 395053 138517 7385 119835 54700 315417 36169
12703 8910 369299 -126459 266066 7474 221190 236182 -16663 -37674 275365 263509 152668
12692 152668 336863 363166 -46573 -60445 275529 470999 279068 55333 -10301 263835
12681 -172864 11285 -8469 -202274 -39715 214693 109375 122953 55230 154385 555560 139482
12669 -42470 33416 -40461 59965 -70771 163482 238803 -228750 14020 -71703 152547 73839
$$ packed form
12749b22512n2804g8606J8008o6865j677c963B2844N5812L4454K70030n4693r7651
12737B30796b72549B06950a50454C75863g6685C7090J28870n0942f7868n884p4319
12726a48071A21315d2571G3523b473r029B20266l115q9625L18227a02953L004
12715i9949A16171c893C19206A35673K59380A38517G385J12450E4700K60717C6169
12703H910L60389a26459B66066G474K13716J4992a6663k1011B75365j1856j10841
12692A52668J84195K6303d6573j3872B75529J95470j91931E5333a0301B63835
12681a72864A1285h469j93805c9715B14693j05318J3578E5230R9155M01175A39482
12669d2470C3416d0461E9965g0771A63482P5321b28750A4020g1703A52547G3839
$$ plain form
12657 270023 107300 68763 -42390 -98754 312229 229508 92355 109891 197629 -18420 103564
12645 90818 242677 -132695 66033 -8785 -20622 47799 180913 104435 183086 207834 -24541
12633 -260886 -17160 94511 61192 -19129 353716 -90416 333147 113576 324792 41829 -167123
12621 96923 62733 -121037 92205 26121 61369 150454 48726 6011 -229129 -177866 250807
12609 90157 3344 204540 204265 -166856 -207207 -95939 -8850 -169726 -53765 -328510 123297
12597 -309973 -31065 179556 -110324 -51551 82746 -9242 -14119 233960 147300 -156859 380000
12585 71434 -158165 7350 16150 226889 -38866 50685 -144558 63851 -14972 98781 10533
12573 354312 -98375 144512 -132320 106959 -247545 259147 157593 97415 -21192 -60814
$$ packed form
12657B70023A07300l8537d2390n6364C12229q2721I2355J7536Q7738a8420A03564
12645I0818J51859a32695F6033h785j1837D7799J33114p6478P8651K4748b4541
12633b60886a7160I4511l3319a9129C53716i0416C33147A13576K11216D1829a67123
12621I6923l4190a21037I2205B6121L5248Q9085D8726F011b29129N1263B50807
12609I0157C344K01196k75a66856m0351i5939h850j60876e3765k74745A23297
12597c09973c1065A79556a10324e1551H2746i242m877B33960q6660a56859C80000
12585G1434a58165G350Q800K10739c8866E0685a44558F3851a4972I8781A0533
12573C54312i8375A44512a32320A06959b47545B59147j01554o0178b1192l9622
$$ plain form
12563 -60814 -58067 -285606 49639 55532 99588 -253099 -3342 -32144 -26476 256669 -195960 550778
12550 99850 -186096 94274 152759 -56905 -38648 53802 58679 126754 -196052 -65574 307991
12538 -35668 115824 264640 -366686 -8418 -203602 241835 265130 -49226 220651 157033 -177486
12526 -331505 127839 343000 -53948 156058 111613 -169333 409871 39321 77890 23424
12515 -135363 56891 142979 62713 -100881 -159385 404046 -169170 -109952 49925 19991 -30323
12503 132832 27327 106139 159115 -99600 -163875 385044 72392 -560 100100 -24665 -28485 -144931
12491 -144931 128966 53133 68702 79634 362862 -35363 180621 183424 77195 -238049 -203724
12480 -203724 -185712 205289 -128135 -140853 17115 -59402 -65524 123944 -52258 -254206 55099
$$ packed form
12563f0814K747k27539D9639N893M4056b53099c342k8802N668B56669a95960E50778
12550I9850a86096I4274N8485e6905J8257E3802M877O8075a96052f5574C07991
12538c5668A15824J48816c66686h418j95184B41835K3295d9226B20651o3618a77486
12526c31505A27839K15161e3948A56058m4445a69333D09871C9321L8569B3424
12515a35363E6891Q6088F2713a00881n8504D04046a69170N9218D9925A9991c0323
12503A32832B7327P8812N2976i9600o4275C85044G2392e60A00100b4665l820j16446
12491a44931A28966E3133J5569J0932K83228c5363A80621K803G7195b38049L4325
12480b03724J8012B05289a28135j2718A7115e9402o122A23944e2258k01948E5099
$$ plain form
12468 298264 265895 -2691 37914 176263 29609 -14877 -140969 111398 73435 246502 -112150
12456 138377 -329989 -101412 -101614 297527 75927 -94634 -63079 6282 -19416 79973 -70129
12444 -142056 -81912 -391524 117064 -265379 -3784 71561 323673 14670 -140774 84047 -232977
12432 -338747 281623 433777 25984 -151192 393876 190234 212320 -200307 -231699 -189709
12422 -189709 -396878 -269023 -180643 -62260 -57117 49466 30474 -93736 88173 -99816 -315937
12411 -315937 101533 -177850 136716 34963 2541 -24303 -290 -126410 -25773 212887 -28991
12399 10297 45357 74120 245357 -19316 100142 -17883 -52312 -15284 128823 -102874 -64155
12388 -64155 145498 -260116 -332015 -282685 260951 288653 107505 -58871 -37384 315644 -40037
$$ packed form
12468B98264l2369b691C7914J38349B9609a4877j26092A11398l7963J73067a12150
12456A38377c29989a01412k02B97527G5927i4634L1555F282a9416G9973g0129
12444a42056O0144l09612A17064b65379c784G1561K52112A4670a40774H4047b32977
12432c38747B81623J52154B5984a51192C93876A90234K2086b00307l1392M1990
12422a89709k07169J27855Q8380f2260N143D9466j8992i3736H8173i9816k16121
12411c15937A01533a77850A36716C4963B541b4303b90j26120b5773B12887b8991
12399A0297L5060K8763J71237a9316A00142a7883l4429a5284A28823a02874L8719
12388f4155A45498b60116p1899M9330B60951K7702A07505e8871K1487C15644d0037
$$ plain form
12376 -127352 245097 -28386 144819 250876 -56435 49924 124818 -184003 310250 326715
12366 326715 50417 10288 29846 -21693 -50338 184775 260467 50950 124451 44352 70940
12355 70940 -35879 -183295 185255 -48365 18789 200087 200548 -122211 228175 166473 -63585
12343 204804 -44201 -360006 -117534 -152623 83092 54790 -198064 180953 -138865 -51457
12332 -191254 347494 -341230 -195703 103757 -35876 -163026 -156847 -74706 40076 -59190 -135804
12321 -135804 -210355 17886 62317 146767 -82204 -4153 -62628 257100 -166565 455875 214046
12309 -124621 -11476 28088 -252582 -123921 -9023 -179499 -15842 177566 80497 11955 80443
12298 80443 -19964 5252 62192 193475 56350 225049 136514 230177 -329768 -114569 40287
$$ packed form
12376a27352B45097b8386A44819J06057e6435D9924P4894a84003C10250J6465
12366C26715E0417A0288J9558b1693k8645A84775P5692E0950P3501D4352K6588
12355G0940c5879j47416A85255d8365A8789J81298M61a22211B28175o1702f3585
12343B04804d4201l15805a17534l5089H3092k8302a98064A80953a38865e1457
12332a91254C47494c41230J45527A03757c5876j27150O179g4706D0076e9190p6614
12321a35804p4551A7886M4431Q4450h2204d153n8475B57100a66565D55875B14046
12309a24621a1476B8088b52582a23921i023j70476a5842A77566H0497A1955O8488
12298H0443a9964E252N6940J31283E6350J68699q8535R3663c29768a14569D0287
$$ plain form
12286 28684 -122035 -125839 -10943 78131 -83521 38081 -180857 -85099 -97975 -53150 119239
12274 -13824 76347 249655 402369 -282519 224324 371881 442875 77490 122796 223552
12264 223552 -182759 -39179 239231 195893 -108057 134706 -122416 459932 153028 230087
12254 230087 299157 -26215 325854 286961 103756 188077 35787 71273 -153260 19391 90207
12243 90207 518903 124125 229636 4044 -121956 -93207 107539 -47559 116437 -159162
12232 143828 174840 145793 12833 31900 410827 -67102 33219 79321 347259 414237 346774
12221 346774 -77218 320851 37541 331666 107618 -176394 -65332 -161920 337247 109463
12210 51109 -185629 -67799 121124 -232924 182796 48305 81347 87674 419340 74373 249721
$$ packed form
12286B8684a22035l804a0943G8131h3521C8081a80857h5099j2876M4825A19239
12274a3824G6347J73308J52714b82519B24324J47557P0994G7490M5306J00756
12264B23552a82759c9179B39231m3338a08057A34706a22416D59932A53028P7059
12254B30087O9070b6215C25854l8893A03756Q4321C5787L5486a53260A9391P0816
12243I0207M28696A24125J05511D044a21956K8749A07539d7559A16437a59162
12232A43828L1012k9047A2833J9067L78927f7102C3219M6102K67938O6978o7463
12221C46774g7218C20851C7541K94125A07618a76394f5332r6588C37247A09463
12210E1109a85629f7799A21124b32924A82796D8305L3042O327L31666G4373J75348
$$ plain form
12199 249721 196327 618111 127152 236131 172646 181534 -40461 140466 275153 189038 -233323
12187 311356 -101149 226107 109752 -73249 518023 169506 -26699 14485 -20234 104925
12176 113916 -145180 28660 215369 -197742 178257 253430 418874 393642 32288 21868
12166 21868 221590 91716 -17849 -120098 -88034 1506 197666 45377 93097 128443 -204350
12154 238116 172818 270466 71470 218821 220658 149896 -117131 -64319 -31243 277783 232720
12143 232720 28670 -73532 66917 -58140 11499 253547 2646 146648 -337654 104883 9640
12131 91333 -91776 -53941 163472 -415997 195443 71088 99610 77687 113200 161582 -166680
12119 -35749 66658 -96390 -75080 -21161 -43782 -26791 51611 -227087 218623 -103960 129995
$$ packed form
12199B49721n3394M21784A27152J08979o3485Q888d0461A40466J34687q6115b33323
12187C11356a01149B26107A09752g3249E18023A69506b6699A4485b0234A04925
12176A13916a45180B8660J86709a97742A78257P5173J65444k5232C2288j0420
12166B1868J99722I1716a7849j02249L2064A506J96160D5377M7720L5346b04350
12154B38116o5298R7648G1470J47351J837p0762a17131N2812c1243B77783m5063
12143B32720B8670g3532F6917e8140A1499K42048B646J44002c37654A04883I640
12131I1333i1776L7835A63472d15997A95443G1088K8522k1923L5513M8382a66680
12119c5749F6658i6390K1310b1161k2621J6991E1611b27087B18623a03960A29995
$$ plain form
12107 47112 -72581 -4282 -230805 93775 44345 -207761 -84534 73853 151371 -122838 16624
12095 -128634 95143 -138285 54183 -71699 177467 -90095 81524 85320 351749 -73960 -324713
12084 -324713 -89723 -54973 -93122 48877 -36840 -335205 22300 -230431 183325 437162 1720013
12073 1720013 1402162 442154 227222 -8732 205539 -136347 231053 25648 -175137 133821
12062 39909 -368925 225481 252110 84017 234762 239664 182114 -3589 446422 243936 106457
12050 276630 128730 -37245 -35718 -196 52975 67211 -433115 21368 150279 -27293 -124399
12039 -124399 18305 -13368 128775 200328 198680 -143382 -314216 164031 -50529 -168275 -334182
12028 -334182 237252 111032 -28749 7284 215696 -10259 -307427 188809 -132268 -178419
$$ packed form
12107D7112g2581d282k26523I3775D4345b07761h4534G3853P7518a22838A6624
12095a28634I5143a38285E4183g1699A77467i0095H1524L796K66429g3960k50753
12084c24713h9723L4750l8149D8877c6840k98365B2300b30431A83325K53837J282851
12073A720013l17851D42154k14932h732B05539a36347B31053B5648a75137A33821
12062C9909c68925B25481K6629H4017J50745M902n7550c589D46422k02486A06457
12050B76630A28730c7245J527a96E2975J4236d33115B1368J28911b7293r7106
12039a24399A8305a3368A28775P1553j648a43382j70834A64031e0529j17746j65907
12028c34182B37252A11032b8749G284K08412a0259k97168A88809a32268m6151
$$ plain form
12018 -178419 -75056 -74679 -337705 220512 206079 12635 170264 -379621 -132310 -47184 46234
12006 242147 -568 193131 -54060 -193667 199267 22601 -226528 74133 -211320 -299939 -267696
11995 -267696 -187397 -177287 -50053 177579 213904 -297097 -107220 134786 -12450 -260052
11985 -260052 48629 -101980 172792 -17141 -110951 43685 -176291 49704 114241 -4911 158469
11973 131344 139356 9650 77265 -87773 46493 -264095 -57071 -105777 184996 11619 -19017
11961 -190233 39699 41358 2831 363610 136401 -18860 255988 -102615 -212015 -172648 -44525
11949 62284 204303 -12473 -96346 -21661 118377 -119498 -24893 137140 -276704 121846
11938 29532 176438 -389298 -226033 -21397 -115007 36921 -88642 49008 213106 143377 289784
$$ packed form
12018a78419g5056L77k63026B20512j4433A2635J57629c79621a32310d7184D6234
12006B42147e68A93131e4060j39607A99267B2601b26528G4133b11320q8619L2243
11995b67696Q0299J0110e0053A77579L6325b97097a07220A34786a2450k47602
11985b60052D8629a01980A72792a7141r3810D3685a76291D9704O4537d911A58469
11973A31344Q012I650O7615h7773D6493b64095e7071m8706A84996A1619a9017
11961a90233C9699J659B831L60779A36401a8860B55988a02615j09400L9367d4525
11949F2284J42019a2473q3873b1661A18377a19498b4893A37140b76704A21846
11938B9532J46906c89298J63265b1397r3610C6921h8642D9008J64098o9729J46407
$$ plain form
11927 289784 150901 -110192 -80540 -232522 -143013 -93758 7168 -119683 608370 108200
11916 -7250 125469 28952 148472 -87898 -202653 102627 -214425 136895 89261 27759 -136444
11904 -335867 -176748 66126 185987 -88812 -59977 -1349 -102686 -124619 360264 -44099 345402
11892 -264005 -28598 -194703 43826 234349 -105690 -350865 6068 -285635 23537 286008
11882 286008 -145027 12534 -257418 123318 -147137 -119853 -365824 116103 -215272 -157455
11872 -157455 26494 112566 739 -172214 251311 -145044 -294299 -36115 -67990 -73750 -9412
11860 -152376 49705 -131861 25017 41064 205740 -217408 469064 224582 -232751 170036
11849 137301 -169937 -300188 -5736 62435 -50961 -133513 -27053 251326 -151456 -73872 -98616
$$ packed form
11927B89784j38883a10192K9652j51982Q9509M9255G168a19683F08370A08200
11916g250A25469B8952J19520h7898j14755A02627b14425A36895m7634B7759a36444
11904c35867J59119F6126J19861h8812K8835a349j01337k1933C60264d4099C45402
11892b64005b8598j66105D3826J90523a05690k45175F068b85635B3537K62471
11882B86008a45027A2534b57418A23318a47137K7284k45971A16103b15272N7817
11872a57455B6494Q6072G39a72214B51311a45044j49255c6115l1875n760i412
11860a52376D9705a31861B5017J6047J64676b17408D69064B24582b32751A70036
11849A37301a69937j30251e736F2435e0961q2552b7053B51326a51456g3872k4744
$$ plain form
11838 -98616 142870 -167751 -74923 -266812 66306 -2058 -312930 38579 -67147 43435 -102430
11826 7830 -89159 -89107 -34532 163376 -400639 -78657 68010 41391 180844 -338904 103367
11814 -94479 183391 -51865 -224831 -277425 -282275 9287 -145762 112201 -327253 -37166 -58212
11803 -58212 -38406 -169639 72475 211824 -235579 -31008 75148 -59696 -71239 -444780 -150339
11791 -53972 213944 -175964 -95452 -164566 171047 151780 -75324 134235 174299 -701 211421
11779 74422 433883 -176167 258825 222789 -43821 402787 158280 266 -83723 152209 -173365
11767 95934 179893 318643 86117 79484 178843 94759 81565 -195199 53825 342782 -47725
11755 97504 -222920 33261 186179 117558 111175 -253484 -185227 54024 107319 210653 374054
$$ packed form
11838i8616A42870a67751g4923j91889F6306b058l10872C8579f7147D3435a02430
11826G830h9159N2c4532A63376d00639g8657F8010k6619J39453c38904A03367
11814i4479A83391e1865j72966n2594m850I287a45762A12201c27253c7166k1046
11803e8212J9806j31233G2475J39349b35579c1008G5148e9696j1543l73541a50339
11791e3972B13944a75964Q0512o9114A71047j9267g5324A34235M0064g01B11421
11779G4422L59461a76167B58825l6036d3821D02787A58280B66h3723A52209a73365
11767I5934Q3959J38750H6117o633R9359q4084j3194a95199E3825K88957d7725
11755I7504b22920C3261J52918o8621o383b53484O8257E4024N3295J03334J63401
$$ plain form
11744 374054 211198 18758 93660 246494 202369 81029 -230179 197971 235299 -6442 -3265
11733 -3265 -145587 -5134 197731 -172920 -69816 -111224 351 -110144 100608 -167616 -48271
11721 380072 99704 -297883 336140 -276877 108882 -121219 -161277 -55248 112840 186093
11711 186093 -125107 -52529 485716 -232842 5120 280712 -229124 -138771 77055 62018 -159611
11699 127781 10508 134912 290780 539662 -92765 225076 72310 123813 306339 -414515
11688 14699 -5711 -83143 128022 358159 -2266 -152986 314203 318987 41485 228110 456533
11677 456533 18780 58932 97946 69069 146741 168607 -111919 -314226 -15778 74561 -182634
11665 43092 67806 488598 465805 222698 -317159 20111 -19273 193534 23324 74351 292609
$$ packed form
11744C74054j62856A8758P4902J52834m4125H1029b30179A97971L7328f442L177
11733c265j42322e134A97731a72920f9816m1408C51a10144A00608a67616d8271
11721C80072I9704b97883C36140b76877A08882a21219m0058e5248A12840P3253
11711A86093a25107e2529D85716b32842E120K75592b29124R0353G7055j5037a59611
11699A27781A0508J24404J55868K48882i2765B25076G2310N1503J82526d14515
11688A4699e711p7432A28022K30137b266j50720C14203M784D1485J86625K28423
11677D56533A8780M0152L9014k8877P7672K1866a11919k02307a5778G4561a82634
11665D3092K4714M20792k2793B22698c17159B0111a9273A93534B3324N1027K18258
$$ plain form
11654 292609 238318 118691 -179455 248298 67028 -50201 -59124 -12426 171231 -295156 3977
11642 153005 -41485 -225133 65381 380667 16983 329651 -46219 -387119 -429687 6955 285537
11631 285537 -93924 -135154 -33097 66799 418581 319065 133890 342354 49888 -68706 143985
11619 177977 -20218 -29176 52420 134068 -188270 -148258 -119629 -227759 -102429 124117 -41348
11607 293785 -170577 38132 13065 -41813 -57423 -27609 172478 39684 -17546 -100306 184598
11595 -71681 -51667 97828 154931 129114 764 7538 181199 224315 -26643 24561 307527 36518
11582 9258 -92169 233120 -137120 325763 132815 61190 -47742 28740 52961 -114045 260395
11570 343092 84658 -24497 109570 252231 171938 184085 221750 -51368 65923 -25575 15399
$$ packed form
11654B92609n4291A18691a79455B48298F7028e0201q923a2426A71231b95156C977
11642A53005d1485j83648F5381L15286A6983L12668d6219l40900m2568F955K78582
11631B85537i3924m1230c3097F6799L51782r9516A33890K08464D9888f8706A43985
11619A77977b0218q958E2420Q1648a88270M0012K8629j08130a02429A24117d1348
11607B93785a70577C8132A3065d1813j5610b7609A72478C9684a7546q2760A84598
11595g1681K0014I7828N7103k5817G64O774J73661M3116b6643B4561K82966C6518
11582I258i2169B33120a37120C25763A32815F1190d7742B8740K4221a14045B60395
11570C43092H4658b4497A09570J42661q0293J2147L7665e1368F5923b5575A5399
$$ plain form
11558 265622 46639 136246 199905 252571 100891 -216033 -79723 232046 47216 -119516 -7776
11546 36864 43517 -239660 173102 -40518 80411 -108395 306289 231417 63770 31728 144344
11535 144344 73761 41181 4692 -49400 111508 46300 184962 -49705 -290261 -197581 28044
11523 -247187 377875 126748 109097 -16603 207207 -107886 114477 260487 188503 -250582
11512 -130274 14636 32456 195650 130400 127950 194795 247703 168072 186589 200165 234337
11501 234337 317932 406494 -72010 -161232 -73967 51930 211755 178899 -363057 -100004 72368
11489 -226414 315056 206265 271330 85444 209740 -123499 96900 344985 -445847 62390
11478 99027 167227 -80592 40970 2786 327758 156782 374623 555332 627472 66211 270641
$$ packed form
11558B65622D6639Q9607O3659N2666A00891b16033g9723B32046D7216a19516g776
11546C6864O653b39660A73102d0518H0411a08395C06289p4872F3770C1728J12616
11535A44344p0583l2580D692d9400A11508D6300J38662d9705k40556R2680B8044
11523b47187C77875A26748j7651a6603B07207a07886A14477J46010p1984b50582
11512a30274A4636J7820J63194o5250k450O6845N2908p9631J8517J3576L4172
11501B34337Q3595Q8562g2010q9222g3967E1930J59825l2856c63057a00004G2368
11489b26414C15056j08791O5065H5444J24296a23499I6900K48085d45847F2390
11478I9027O8200h0592D0970B786L24972A56782K17841J80709P2140F6211K04430
$$ plain form
11467 270641 117060 62701 247630 139816 -106285 -111436 241749 248633 396495 160925
11456 569293 -23975 124124 158336 269413 344259 203498 386551 -92487 182903 43774
11445 37605 85229 169629 155194 270265 -349096 190113 98427 -201043 -234408 -113748 77294
11433 -3481 361527 275722 -207207 161925 56030 221635 89851 23614 134527 208621 161082
11422 161082 151421 -127932 45410 311785 266985 -76554 258839 172260 99927 98850 230829
11411 230829 89829 381065 6016 44791 168904 -29069 361648 40343 -204994 238075 -46451
11399 19689 126910 -19732 83062 176864 176905 167615 141856 -89160 110594 56895 69521 -314157
11386 141657 202112 -132292 166617 -16351 322796 53186 39450 251675 34095 109910 221591
$$ packed form
11467B70641A17060n4359J84929j07814a06285n151B41749O884J47862A60925
11456E69293b3975A24124L4212J11077P4846j40761J83053i2487A82903D3774
11445C7605M7624Q4400j4435J15071c49096A90113r1686b01043l3365a13748G7294
11433c481C61527q5805b07207A61925E6030J65605H9851B3614J10913P4094m7539
11422A61082r661a27932D5410K66375m4800g6554B58839q6579p2333j077J31979
11411B30829H9829K91236F016L8775J24113b9069C61648D0343b04994B38075d6451
11399A9689J07221a9732H3062R3802M1r290k5759h9160A10594n3699J2626c14157
11386A41657O0455a32292A66617a6351C22796E3186j3736K12225C4095P5815J11681
$$ plain form
11375 221591 234841 244265 333025 233397 56884 114732 128861 -57088 172773 79286 167562
11364 167562 -23475 222793 145236 -122300 -231158 13388 292782 -103672 87327 -110525
11353 -196114 49740 -299302 79137 -396032 -114594 -148664 -214279 399773 120872 113147 203976
11342 203976 -236910 61345 -213558 -276563 7756 -24678 -132574 112991 -93616 190696 -77507
11330 -196687 171625 434760 -69353 171388 -28509 81055 26056 -312479 311429 -118969
11319 -85536 -152619 -109326 -57306 -32734 -279008 229049 91354 112903 46523 223036 85740
11307 -216436 154735 -250920 77195 -6416 -45485 -31782 -39722 -234172 -29517 -13975 -266441
11296 -266441 -146554 -68983 -62920 181322 161830 -217460 -5740 90226 21987 25685 -75598
$$ packed form
11375B21591J3250R424Q8760r9628E6884N7848J4129e7088A72773G9286Q8276
11364A67562b3475B22793p7557a22300j08858A3388K79394a03672H7327a10525
11353a96114D9740b99302G9137c96032a14594l4070o5615C99773A20872p725R0829
11342B03976b36910F1345b13558o3005G756b4678j07896A12991i3616A90696g7507
11330a96687A71625K63135f9353A71388b8509H1055B6056c12479C11429a18969
11319h5536o7083M3293N2020K4572k46274B29049I1354K1549D6523J76513H5740
11307b16436A54735b50920G7195f416l9069J3703p940j94450b9517a3975k52466
11296b66441J19887f8983O063A81322j9492b17460e740I0226B1987L698g5598
$$ plain form
11284 -172360 -72149 86201 23650 -107844 -159122 -289299 -187147 194262 -45593 -110005 -240410
11273 -240410 11803 224459 -27883 -260274 11485 21825 50809 -146703 189411 93419 6958
11261 -29902 150132 16093 -86023 68921 212197 -46389 -199600 -242323 27993 -321171 -199046
11250 -199046 -72409 -159022 52695 53643 250917 33830 131483 -153814 161012 -44673 -19202
11238 -76451 -117993 -227519 -97988 18610 219286 232701 -112792 -34299 44735 -119485 15677
11226 -76533 -22833 -288897 -270102 -153489 -12013 -203909 186051 -139692 -380065 -156654
11215 -563831 173613 -85906 38001 208155 257055 5511 -165656 97175 26322 208669 146062
11204 146062 35386 -73472 -152530 -181696 35404 -27382 15017 -92801 -328500 -239057 133787
$$ packed form
11284a72360g2149H6201B3650a07844n1278j30177J02152A94262d5593o4412j30405
11273b40410A1803K12656b7883k32391A1485J0340K8984a46703A89411I3419F958
11261b9902A50132A6093h6023F8921J43276d6389j53211m2723B7993c21171J22125
11250a99046g2409q6613E2695R48J97274C3830R7653a53814A61012d4673a9202
11238g6451m1542j09526i7988A8610K00676J3415a12792c4299D4735a19485A5677
11226g6533b2833k66064J8795J16613a2013j91896A86051a39692k40373a56654
11215e63831A73613h5906C8001J70154M8900E511a65656I7175B6322J82347o2607
11204A46062C5386g3472p9058k9166C5404b7382A5017i2801k35699Q9443A33787
$$ plain form
11192 52983 -137139 162248 -175786 -237590 36320 -156867 -35275 -106407 -163922 232841 94616
11180 32497 -205288 -192844 255058 -244747 103139 -165248 -21272 198282 54546 156392
11170 156392 -74317 35771 -13322 4006 -93446 -49952 -21080 -95632 -156151 -198112 184956
11158 -213576 108797 388683 241947 -43171 261609 -248771 29021 160212 -291983 -235131
11148 -235131 -63262 218596 -74209 -20103 92401 78522 -50380 -140209 3865 160168 -354998
11136 88906 211381 47741 71119 -107420 -128443 226355 241543 -195496 158154 191970 -203580
11124 -3488 -120671 189555 240366 243764 -40202 -40239 -95232 -194624 158945 -151566 88011 464869
11112 464869 38105 75992 -123862 266975 163425 396951 259069 132862 42125 86436
$$ packed form
11192E2983a37139A62248a75786o1804C6320a56867c5275p1132n7515B32841I4616
11180C2497b05288J2444B55058b44747A03139a65248b1272A98282E4546J01846
11170A56392g4317C5771a3322D006i3446M3494b1080p4552o0519m1961A84956
11158b13576A08797K79886j46736d3171B61609b48771B9021J31191b91983N6852
11148b35131f3262B18596g4209b0103I2401j3879e0380q9829C865J56303c54998
11136H8906J22475D7741K3378a07420k1023B26355J5188a95496A58154L3816b03580
11124c488j17183A89555N0811L398d0202l7n4993r9392A58945a51566H8011L76858
11112D64869C8105L7887a23862B66975j03550K33526j37882j26207D2125M4311
$$ plain form
11102 86436 -49603 30865 -361593 306166 -92311 -42085 21568 -71086 130243 -6314 117468
11090 270743 167432 203482 390099 344667 610644 260616 102277 392413 778124 61206
11079 355058 406272 224134 343423 386569 276342 258836 237758 16670 510337 283645
11069 283645 245645 453018 346871 675596 529392 575582 500389 394232 585061 486308
11059 486308 730096 520692 752421 688417 467880 825578 691007 662343 736101 535431
11049 535431 1125917 763386 881638 859316 799009 637780 765239 633529 855785 763151
11039 763151 557252 724818 922645 1077329 752072 642882 710072 686187 561130 485674
11029 485674 865578 595992 682850 702767 785535 820054 772114 591967 670913 647714 518966
$$ packed form
11102H6436d9603C0865c61593C06166i2311d2085B1568g1086A30243f314A17468
11090B70743j03311L6050J86617m5432K65977B60616A02277K90136L85711F1206
11079C55058N1214j82138J19289M3146j10227j7506k1078A6670M93667k26692
11069B83645l8000K07373j06147L28725j46204M6190p5193j06157J90829r8753
11059D86308K43788k09404K31729o4004k20537L57698j34571k8664P3758k00670
11049E35431N90486l62531J18252k2322o0307j61229J27459j31710K22256r2634
11039G63151k05899J67566J97827J54684l25257j09190O7190k3885j25057p5456
11029D85674L79904k69586Q6858J9917Q2768L4519m7940j80147P8946k3199j28748
$$ plain form
11018 518966 851787 498224 605726 633362 418556 789791 537431 440026 556576 664077
11008 664077 290931 528533 776575 609234 744461 551647 698155 708831 394393 935823
10998 935823 701222 761497 628623 629878 745780 597920 822104 778284 815979 807301 1187500
10987 1187500 749147 923913 858143 1017352 1113442 717197 1252863 1239235 1257772 1504751
10977 1504751 1969873 1844797 2000178 2427501 2532864 2651354 2973468 2715857 2926301
10968 2926301 2522990 2669717 2047742 1878670 1770267 1918891 1644488 1746331 2030524
10959 2030524 1886693 1837139 2006544 1849272 1960930 1939383 1416399 1427216 1373137 884469
10949 884469 599653 785596 306048 385704 415276 186694 293257 327176 279330 142825
$$ packed form
11018E18966L32821l53563J07502K7636k14806L71235k52360r7405J16550J07501
11008F64077B90931K37602K48042j67341J35227j92814J46508J0676l14438N41430
10998I35823k34601O0275j32874J255J15902j47860K24184m3820L7695q678L80199
10987A187500m38353J74766o5770J59209R6090l96245N35666j3628J8537K46979
10977A504751M65122j25076J55381M27323J05363J18490L22114k57611K10444
10968B926301m03311J46727o21975j69072j08403J48624k74403J01843K84193
10959B030524j43831m9554J69405j57272J11658k1547n22984J0817n4079m88668
10949H84469k84816J85943C06048P9656K9572A86694J06563L3919m7846j36505
$$ plain form
10939 142825 185263 148600 102300 269316 -218209 455594 15159 194275 155416 439504
10929 439504 -35333 145914 186324 50964 234385 56114 -299913 215187 -224970 83227
10918 -206292 219737 83879 -54980 -13129 133042 43476 13841 20058 -7481 216045 267628
10907 267628 -5951 -122946 67944 -204886 -294403 -235263 265709 166261 73638 -259238 310631
10895 -155756 96097 277339 -7768 -11807 -199929 -108605 21524 161048 -92805 -74490 -234056
10884 -234056 -43168 106838 -53320 -88980 -66806 -133164 -89301 -215117 78954 -186011 -293415
10873 -293415 82146 -77388 -363305 -278262 -47805 9139 -158965 -385993 -291734 -154150 -64522
10861 -171369 -3316 -407445 31314 -50520 -93024 -126081 -192792 229614 232938 111327 193019
$$ packed form
10939A42825M2438l6663m6300J67016b18209D55594A5159J79116l8859K84088
10929D39504c5333A45914M0410E0964J83421E6114b99913B15187b24970H3227
10918b06292B19737H3879e4980a3129A33042D3476A3841O217g481B16045N1583
10907B67628e951j16995F7944b04886q9517N9140B65709r9448G3638b59238C10631
10895a55756I6097J81242g768m039j88122R1324B1524J39524i2805J8315j59566
10884b34056d3168A06838e3320l5660K2174o6358M3863j25816G8954a86011j07404
10873b93415H2146g7388k85917Q5043d7805I139a58965k27028R4259J37584f4522
10861a71369c316m04129C1314e0520m2504l3057o6711B29614L324A11327Q1692
$$ plain form
10850 193019 18076 -94778 -66211 -95678 110733 105847 172149 22619 68414 77761 79961 78719
10838 78719 -44640 46397 -226160 -25053 -22657 38712 16353 77962 -15423 -194961 184669
10826 148003 -179135 -188647 -47680 -114426 66928 302451 370586 170914 -144226 -212173 -519538
10815 -519538 -155231 -35682 129878 -187244 -511367 -98281 46122 -2792 -77807 -382872 -119842
10803 105880 -93762 -57362 -51424 -71783 215298 129712 -48934 -30683 131340 -140911 -179118
10792 -179118 -39571 -189315 116183 187162 -32467 -196620 119343 -126443 -177465 -288439
10782 -288439 -118368 -41677 -70592 190815 -51803 192144 -135247 138285 -23170 -504212
10772 -504212 -269145 114473 122701 -98576 -121326 25726 -56312 110797 -96840 -142168 176995
$$ packed form
10850A93019A8076i4778K8567k9467A10733m886O6302B2619M5795R347K200j242
10838G8719d4640D6397b26160b5053K396C8712A6353O1609a5423j79538A84669
10826A48003a79135r512d7680o6746F6928K35523O8135A70914a44226o7947l07365
10815e19538a55231c5682A29878a87244l24123i8281D6122b792p5015l05065a19842
10803A05880i3762L6400N938k0359B15298q5586d8934J8251A31340a40911l8207
10792a79118c9571j49744A16183P0979c2467j64153A19343a26443n1022j10974
10782b88439a18368d1677k8915A90815e1803A92144a35247A38285b3170m81042
10772e04212K35067A14473Q228i8576k2750B5726e6312A10797i6840m5328A76995
$$ plain form
10760 -199397 40330 113817 272625 -11106 108044 -157360 -223133 -348204 -15513 235943
10749 271311 -143876 -161225 -34745 -216850 -339820 40074 189799 5932 -151087 -149018 -88553
10738 -88553 -274433 -19433 115063 5247 44047 -315508 -4681 11413 -67113 145960 -130 -12395
10726 -12395 -226805 256229 5924 157447 119383 -30564 44044 -361984 -121105 -229086 -26796
10714 50939 254924 114359 160756 -248873 201632 97315 -55571 -27433 -237308 -36665 156883
10702 118735 -23123 53411 -79466 121509 164597 117875 82579 42746 -114446 -187289 99898
10690 180373 28784 127027 240597 -246523 -54662 30457 189631 -300722 -118076 -61813
10680 -61813 -66447 86695 -255438 3959 -166731 55239 -49494 31335 -14266 25221 140597
$$ packed form
10760a99397D0330P3487J58808a1106A08044a57360o5773j25071a5513B35943
10749B71311a43876j7349c4745j82105j22970D0074J49725E932a51087K069O0465
10738h8553j85880a9433A15063E247L8800c15508d681A1413f7113A45960a30j2265
10726a2395k14410B56229E924J51523l8064c0564D4044c61984a21105j07981b6796
10714E0939K03985A14359M6397b48873B01632I7315e5571b7433k09875c6665A56883
10702A18735b3123E3411g9466A21509M3088m6722l5296l9833a14446p2843I9898
10690A80373B8784R8243J13570b46523e4662C0457J59174c00722a18076N6263
10680f1813m634H6695b55438C959a66731E5239d9494C1335a4266B5221J15376
$$ plain form
10669 140597 -158274 -56096 93693 -202829 -244927 23752 32955 -104983 87428 2412 -44622
10657 -14244 24722 -215546 -11152 -12774 -350843 133398 -3383 -204857 -226407 -213193 -257785
10646 -257785 -55709 -313554 113038 -45220 -307860 -133056 -58065 -310862 131725 91997
10636 91997 -27180 -192075 -53301 -93647 -139895 -233656 -402631 42095 -369691 -26628 -47055
10625 -47055 -32004 -211196 -30873 -195231 -218827 91758 -92153 -103784 -148246 -425578 -60569
10613 -409004 27693 26493 -86401 62589 80457 99779 -104263 -217499 191084 -231791 273856
10601 -80083 53351 -91865 150088 -310019 433200 -23224 346152 -17533 -143745 48270 358222
10590 358222 199728 -20698 -210698 -104843 -58377 36794 -40340 163620 3846 37844 -104940
$$ packed form
10669A40597a58274e6096I3693b02829m2098B3752R203a04983H7428B412d4622
10657a4244B4722b15546a1152j622l38069A33398c383k01474k1550J3214m4592
10646b57785e5709k57845A13038d5220k62640a33056e8065k52797A31725l9728
10636I1997b7180j64895e3301m0346m6248r3761j68975D2095c69691b6628k0427
10625d7055J5051j79192c0873j64358k3596I1758i2153j1631m4462k77332f0569
10613d09004B7693j200h6401F2589J7868J9322a04263j13236A91084b31791B73856
10601h0083E3351i1865A50088c10019D33200b3224C46152a7533j26212D8270L09952
10590C58222j58494b0698j90000a04843M6466C6794d0340A63620C846L3998a04940
$$ plain form
10578 -190501 -39165 -195520 -324954 267582 104072 -192708 -45755 -159221 -3130 -103484
10568 -103484 57629 -358309 -208751 -195260 -60507 123521 -324846 -136624 105317 31881
10557 -149800 143263 -67950 203953 -339658 -236936 55186 -424381 -180157 200215 95233
10546 -350613 294317 -68925 -160492 -13286 71053 13154 196391 82716 -107041 -180846 -57692
10534 -120888 -210637 401002 74710 107972 -23225 -116100 23428 9835 109999 9161 66154
10523 66154 104298 -293124 -156303 -74935 -96594 35660 -22494 -174155 -520535 -82841 -117173
10512 -117173 -109850 -115374 250198 296088 35298 110303 42968 -143224 -193381 83243 -89870
10500 -215496 614 -128189 191424 -388497 -91238 38350 381930 75905 20110 43262 -545621
$$ packed form
10578a90501c9165j56355j29434B67582A04072a92708d5755j13466c130j00354
10568a03484E7629c58309J49558J3491f0507A23521c24846a36624A05317C1881
10557a49800A43263f7950B03953c39658J02722E5186d24381a80157B00215I5233
10546c50613B94317f8925r1567a3286G1053A3154J83237H2716a07041p3805e7692
10534a20888q9749D01002G4710L3262b3225r2875B3428I835J00164I161N6993
10523F6154L8144b93124J36821g4935k1659C5660b2494j51661l46380h2841l4332
10512a17173P323n524B50198M5890C5298P5005D2968a43224n0157H3243h9870
10500b15496F14a28189A91424c88497i1238C8350L43580G5905B0110K3152e45621
$$ plain form
10488 191790 135027 149672 385639 89066 -39165 82480 -16376 637819 536598 845761 356789
10476 626724 46938 238764 201963 52068 25999 -37501 101021 -243271 19050 163013 263909
10465 263909 317324 323821 192845 235978 -147074 2443 189603 47933 32922 -222629 12814
10453 -245384 -277572 -62310 120931 -73532 192661 -186148 -264705 -69444 196604 -181191
10442 -46407 12159 -64155 -98521 156770 186277 -259017 -54733 202246 -313776 -221936 378585
10430 -95317 275359 -51290 101289 173674 269474 159170 -348353 -13401 272649 -53958 69034
10418 439574 -457257 -34073 176702 251746 -98156 46477 44698 -211361 -22306 -1833 -75353
10407 -75353 -210371 -152805 -18643 -34242 -22059 206802 69020 -50309 158500 -66159 3700
$$ packed form
10488A91790n6763J4645K35967H9066c9165H2480a6376F37819j01221L09163C56789
10476F26724D6938J91826l6801E2068B5999c7501A01021b43271A9050J43963J00896
10465B63909N3415O497j30976M3133a47074B443J87160D7933j5011b22629A2814
10453b45384l2188f2310A20931g3532A92661a86148p8557f9444A96604a81191
10442d6407A2159f4155l4366A56770K9507b59017e4733B02246c13776R1840C78585
10430i5317B75359e1290A01289P2385R5800j10304c48353a3401B72649e3958F9034
10418D39574d57257c4073A76702P5044i8156D6477j779b11361b2306a833p3520
10407g5353j35018N7566a8643j5599J2183B06802F9020e0309A58500f6159C700
$$ plain form
10395 216828 -170244 -78356 187851 40442 -52748 -82976 152373 155705 -91931 -127745 65583
10383 99284 51276 222438 279369 475085 532959 164311 151559 404590 414066 398516 412244
10372 412244 264783 49933 166300 264417 39482 392758 177413 148632 334771 211070
10362 211070 373119 199504 226272 274640 326111 -156209 242807 97785 198504 -22728
10351 216361 712646 471683 279826 131838 307335 231756 297021 343402 434984 473815
10341 473815 288715 214364 813 258752 376184 70698 150615 187518 -147848 138570 8719
10329 224983 186767 -76397 192213 129187 34599 99748 420055 151819 145845 395373 215876
10318 215876 88505 192462 -42737 -74113 212980 -2016 281792 -43645 126220 51577 227005
$$ packed form
10395B16828a70244g8356A87851D0442e2748l0228A52373L332i1931l5814F5583
10383I9284m8008J71162N6931J95716N7874A64311j2752K53031R476j5550J3728
10372D12244j47461D9933J16367R8117C9482L53276A77413k8781J86139j23701
10362B11070J62049j73615K6768M8368N1471a56209B42807I7785J00719b2728
10351B16361M96285k40963j91857A31838J75497p5579O5265M6381R1582L8831
10341D73815j85100p4351H13K57939J17432G0698P9917L6903a47848A38570H719
10329B24983l8216g6397A92213o3026C4599O5149L20307A51819n974K49528j79497
10318B15876H8505J03957d2737l1376B12980b016B81792d3645A26220E1577J75428
$$ plain form
10307 227005 -71465 67690 -64908 319586 -23367 198021 219389 -155867 -63460 -411680 27380
10295 24649 181344 -223745 -61227 344369 216798 86522 -159358 -50885 -135352 -246991
10285 -246991 -20636 56725 -229384 317463 -29696 34007 -11998 -217875 209970 -92709 45132
10273 -84634 -77018 -147468 31147 217925 -179946 -133755 8975 -38245 6487 -60445 133452 188841
10261 188841 13609 61110 87169 136902 584191 176016 259001 245342 214038 -29443 253561
10249 -113356 89709 -168350 -302254 185406 108389 -29455 -217044 6929 170257 53583 15226
10237 -96685 -351899 -254136 -45940 -429345 -102809 33161 -150134 97011 -623263 93573 119308
10226 119308 32236 -295923 -140695 -28084 255880 -136301 -184303 -206957 -30278 -423478
$$ packed form
10307B27005g1465F7690f4908C19586b3367A98021K1368a55867f3460l48220B7380
10295B4649J56695b23745f1227C44369j27571H6522a59358e0885q4467j11639
10285b46991b0636E6725b29384C17463b9696C4007a1998k05877B09970i2709D5132
10273h4634P616p0450C1147J86778a79946M6191H975c8245F487f0445A33452N5389
10261A88841A3609M7501K6059M9733M47289A76016Q2985j3659l1304b9443B53561
10249a13356H9709a68350j33904A85406p7017b9455j87589F929J63328E3583A5226
10237i6685k55214R7763d5940l83405a02809C3161a50134I7011f23263I3573K5735
10226A19308C2236b95923a40695b8084B55880a36301m8002k2654c0278l93200
$$ plain form
10216 -423478 -114390 34043 -414765 -37609 -197067 428207 30002 -80740 104730 -174970
10205 -60401 142589 -405688 98582 30139 -156470 -99433 208144 123690 -94308 180096 -39375
10193 -302104 30614 -38718 72817 -77012 -313559 126334 277525 -336286 -327723 270639 152940
10182 152940 -99947 115852 76861 75927 -518864 -52586 -39180 89255 -213760 230518 16954
10170 -21079 32116 -304400 -114815 -220484 -405613 136517 66305 35440 183346 -122239
10159 207103 -240117 51016 -373441 -19793 -324151 -1459 -247835 113801 -67355 -184910
10149 -184910 -95708 -215258 -121213 -24541 -52709 24905 -376941 -132898 588 -40074 60627
10137 -275209 -469368 125267 -103483 34893 -123519 91626 196490 -183858 -10904 -20158
$$ packed form
10216d23478a14390C4043d14765c7609j59458D28207C0002h0740A04730a74970
10205f0401A42589d05688I8582C0139a56470N7037B08144q4454i4308A80096c9375
10193c02104C0614c8718G2817g7012k36547A26334J51191c36286Q563B70639j17699
10182A52940i9947A15852l8991r34e18864e2586J3406H9255b13760B30518A6954
10170b1079C2116c04400a14815j05669j85129A36517F6305l0865J47906a22239
10159B07103b40117E1016c73441a9793l04358a459k46376A13801f7355j17555
10149a84910Q9202j19550R4045b4541k8168B4905c76941a32898E88d0074F0627
10137b75209j94159A25267a03483C4893a23519I1626J04864a83858a0904r254
$$ plain form
10127 -20158 228690 -208671 -157994 223321 72971 -81293 43167 -181988 -11206 -129443 381208
10115 -252755 -43685 133629 19949 -287253 39235 20720 -221004 113538 -24114 -227509
10105 -227509 173375 -85280 47623 206696 -132932 -137927 -178511 102719 -150239 -19253 -26156
10094 -26156 26481 355259 258854 171513 -144902 7650 25817 -31655 33951 -206797 -141221
10083 -141221 118839 -58381 144298 -8999 -170107 282313 -132887 5443 -254445 -194713 -81596
10071 138688 166295 -110389 373134 -320404 -275876 -25090 -143434 -207164 9631 -46765 -43392
10060 -43392 74505 -42801 30263 26664 -501630 240574 -74873 25714 -51638 51576 -111003
10048 -45768 -22036 -12885 -362037 370698 -157531 151506 -249266 -130918 -36671 213780
$$ packed form
10127b0158B28690b08671N0677B23321G2971h1293D3167a81988a1206j18237C81208
10115b52755d3685A33629A9949b87253C9235j8515b21004A13538b4114k03395
10105b27509A73375h5280D7623J59073a32932m995m0584A02719a50239a9253o903
10094b6156B6481L28778r6405q7341a44902G650J8167c1655C3951b06797O5576
10083a41221A18839e8381A44298h999j61108B82313a32887E443b54445N9732h1596
10071A38688K7607a10389C73134c20404M4528b5090j18344o3730I631d6765L373
10060d3392G4505d2801C0263l599e01630B40574g4873B5714e1638E1576a11003
10048d5768b2036R151l49152C70698a57531A51506b49266J18348c6671B13780
$$ plain form
10037 17879 -280525 4876 57513 62821 4159 -121096 -65073 -90277 256875 72020 -117162
10025 -47359 44741 -285591 -53900 -64362 -150258 -350472 151887 -93159 12038 -187181 -102779
10014 -102779 -55034 -183349 -450288 -191016 -160707 44428 -120580 78945 -347006 -223672
10004 -223672 79085 -77229 310962 -58038 -224777 -329525 -71889 93944 -6049 -33012 -127361
9993 -127361 -166624 11671 137252 -163715 101351 -483944 -235147 49102 131422 32942 -217830
9981 -127757 -250353 -131562 -154455 249599 173118 -541026 -288295 -101628 -123248 210323
9970 -317557 19719 -229711 -332079 -23919 -488547 -244499 8430 -34016 -318359 -171879 66931
9958 -234738 -124355 -25451 47597 83167 15296 -256040 -80556 -167411 -79413 133527 129562
$$ packed form
10037A7879b80525D876N2637N308D159a21096N6023k5204B56875G2020a17162
10025d7359D4741b85591e3900j0462q5896k00214A51887i3159A2038a87181Q4402
10014a02779M7745j28315k66939a91016L0309D4428a20580G8945c47006J23334
10004b23672G9085g7229C10962e8038j66739j04748g1889I3944f049k6963r4349
9993a27361l9263A1671J25581a63715A01351d83944b35147D9102Q2320C2942b17830
9981a27757j22596J18791k2893B49599p6481e41026K52731a01628k1620B10323
9970c17557A9719b29711j02368b3919m64628K44048H430c4016k84343J46480F6931
9958b34738J10383b5451D7597L5570A5296b56040h0556q6855g9413A33527l965
$$ plain form
9947 129562 -115067 -160840 6639 -264657 53009 51898 130278 114363 -220678 109858 296174
9936 296174 59765 -153329 -201249 117966 -433112 127247 -160459 -123422 -68238 221023
9925 178442 112242 -191440 -235442 -174687 -23063 24257 50234 176959 -215505 -171996 -112587
9914 -112587 -138364 -198770 -50424 -26523 -259046 122099 -191691 327 -274060 -130057 -92891
9903 -92891 82662 -64495 -487861 -19800 -247975 80218 90058 51968 -47224 -35704 -326309
9892 -326309 178861 -113750 -284835 -83376 -157270 407496 196669 52207 -17468 -388413
9882 -388413 -104433 -186750 209591 -10855 109249 -193325 -267699 -104663 -161151 -205748 122360
9870 252420 -20233 -260186 -193245 70454 -151890 -173493 -310089 309502 -29642 261307 307534
$$ packed form
9947A29562a15067m5773F639b64657E3009j111P8380j5915b20678A09858J86316
9936B96174E9765a53329m7920A17966d33112A27247a60459L7037N5184B21023
9925A78442o6200a91440m4002O0755b3063B4257K5977J26725b15505M3509N9409
9914a12587k5777o0406e0424K3901k32523A22099a91691C27b74060a30057L7166
9903i2891H2662f4495m23366a9800k28175H0218R840l8090d7224J1520k90605
9892c26309A78861a13750j71085h3376p3894D07496A96669E2207a7468l70945
9882c88413a04433q2317B09591a0855A09249a93325p4374a04663n6488m4597A22360
9870B52420b0233k39953O6941G0454a51890k1603j36596C09502b9642B61307M6227
$$ plain form
9859 307534 45574 -175506 -136823 74022 136661 -240568 21010 -135641 -160961 -225463 -162144
9848 -162144 57335 -135655 182601 -329268 -312308 -4457 -77012 -262970 -146531 -124241 59619
9836 -219414 -154072 -223409 -420378 -54157 -161090 -142731 130165 69107 -56265 301168 95153
9824 85173 -63520 4388 -142077 204457 146004 -76931 -304196 -160105 -78851 -44340 143121
9812 160599 -316726 -101977 18636 -23778 133964 -225897 133671 160357 152345 -131053 -386305
9801 -386305 -135009 -11088 -194276 25408 -94481 -197129 -208609 -268421 -365953 -122941 -219920
9790 -219920 -178091 313891 -10896 266307 89424 126255 45102 215880 16551 -284114 103915
9778 318642 -129576 55124 -359410 -78492 -55174 74405 -26606 -10060 -129280 -205978 138541
$$ packed form
9859C07534D5574a75506L8683G4022O2639b40568B1010a35641k5320o4502O3319
9848a62144E7335a35655A82601c29268J6960d457p2555j85958J16439K2290E9619
9836b19414O5342o9337j96969e4157j06933J8359A30165o1058e6265C01168I5153
9824H5173f3520D388a42077B04457n8453g6931k27265J44091g8851L4511A43121
9812A60599c16726a01977A8636b3778A33964b25897A33671K6686q012a31053k55252
9801c86305a35009a1088j83188B5408i4481j02648j1480n9812r7532a22941r6979
9790b19920M1829C13891a0896B66307H9424L6831D5102J70778A6551b84114A03915
9778C18642a29576E5124c59410g8492K3318G4405b6606a0060j19220p6698A38541
$$ plain form
9766 -326928 -221140 225441 72593 69438 -34354 -242332 74618 70609 -219272 -235080 -395325
9755 -395325 -31871 121849 20160 -15355 26313 261882 -184838 -345243 63228 -120106 202344
9743 169196 280246 -171681 -301658 -240907 -128045 302734 -351120 -292378 -136925 159462
9732 105354 182123 64280 -270393 -301154 156263 214138 153475 -305488 -48110 -156401 48518
9720 -136363 204075 -84034 100660 184999 -551283 -187885 -13453 248916 -291070 33953
9709 -160738 -108866 255876 9756 54819 -67601 -251778 -11906 10397 262063 247929 132541
9698 132541 -25426 59108 -315161 -99137 151198 -420366 -283297 -43753 18168 79786 -62766
9686 -147812 281728 -130677 -68803 -143819 -16428 121782 -257000 -87569 -218053 -66915 -13134
$$ packed form
9766c26928J05788B25441G2593l155c4354k07978G4618m009b19272j5808j60245
9755c95325c1871A21849B0160a5355B6313K35569a84838j60405F3228a20106B02344
9743A69196J11050a71681j29977O0751J12862C02734c51120N8742a36925A59462
9732A05354P6769F4280b70393l0761A56263N7875o0663c05488d8110j08291D8518
9720a36363B04075h4034A00660Q4339e51283a87885a3453B48916b91070C3953
9709a60738N1872B55876I756M5063f7601j84177a1906A0397K51666j4134j15388
9698A32541b5426E9108c15161i9137A51198d20366J37069d3753A8168O1618f2766
9686a47812B81728a30677O1874p5016a6428A21782b57000h7569j30484f6915a3134
$$ plain form
9674 -8798 16097 -53909 -50436 299056 -87617 171308 218928 -453869 -109450 154356 123998
9663 123998 -28841 -137975 -56358 233610 148943 77394 27907 13246 -56612 -216192 -12451
9651 -125316 305272 -417509 -20457 227800 12087 -3579 -32743 103734 -236358 61628 96461
9640 96461 -85314 8131 192089 -498796 -14646 63449 17962 -353981 -247216 -278509 -406643
9629 -406643 -84744 28966 -23623 -247430 -43697 -94463 92329 -274056 -101073 -156040 -373623
9618 -373623 -177085 -25211 -156641 44040 -256584 112523 -219999 -157646 -347551 19419
9607 240675 -4788 316418 24069 287982 136388 61180 240 -20994 114343 13117 4525 -228249
9594 69675 -25416 -366586 279408 -169486 87365 -179343 -217462 -90266 -314869 -355883 78498
$$ packed form
9674h798A6097e3909L473B99056h7617A71308M7620d53869a09450A54356l0358
9663A23998b8841j09134e6358B33610q4667p1549B7907A3246e6612j59580a2451
9651a25316C05272d17509b0457B27800A2087c579k9164A03734b36358F1628L4833
9640I6461h5314H131J83958d98796a4646F3449A7962c53981J06765l1293j28134
9629d06643h4744B8966b3623k23807d3697n0766I2329b74056a01073n4967k17583
9618c73623a77085b5211j31430D4040b56584A12523b19999O2353j89905A9419
9607B40675d788C16418B4069K63913A36388F1180B40b0994A14343A3117D525b28249
9594F9675b5416l41170B79408a69486H7365a79343l8119i0266k24603m1014G8498
$$ plain form
9582 -19274 -150121 -314769 -13786 -26888 -18876 -132228 31951 -179857 198191 -342413 -126908
9570 -194979 -329577 -129443 -158955 -123179 -141989 -108035 -299058 -216279 89356 -55863 58632
9558 -415024 135161 35727 -166702 -17260 107484 24747 126423 -93152 203446 -107963
9547 231520 -4997 -114378 139848 -155089 -217116 160712 -4744 -258406 5546 -12060 64964
9535 -310845 120518 -470426 3921 -313782 -273608 -262567 349109 88269 -47086 -3145 -247764
9524 -247764 -119971 -182871 155034 133281 -181728 -242533 107459 -159546 -14464 -259631
9514 -259631 350074 -460128 -80344 -23925 251331 -349747 227760 39784 -119552 -205754
9504 -205754 -64046 -143072 85865 202315 20516 -360827 17885 -25429 -101117 -388950 -201619
$$ packed form
9582a9274j30847j64648a3786j3102Q012j13352C1951a79857A98191c42413a26908
9570a94979j34598a29443k9512L5776j8810L3954j91023Q2779H9356e5863E8632
9558d15024A35161C5727a66702a7260A07484B4747J01676i3152B03446a07963
9547B31520d997j09381A39848a55089o2027A60712d744k53662E546a2060F4964
9535c10845A20518d70426C921c13782M0174J1041C49109H8269d7086c145k44619
9524b47764a19971o2900A55034k1753a81728o0805A07459a59546a4464k45167
9514b59631C50074d60128h0344b3925B51331c49747B27760C9784a19552q6202
9504b05754f4046p9026H5865J16450B0516c60827A7885b5429p5688k87833J87331
$$ plain form
9493 -201619 234896 -230707 224800 146727 -173126 -66568 -285114 -433162 -3890 -109609
9483 -109609 271654 -76190 -233571 -98751 144557 -149316 -40636 -290533 50071 -133848
9472 -412835 44521 134346 -330454 -208095 -156675 -7836 -115060 63971 95077 35697 238615
9461 238615 -75909 152465 -188948 25891 -131269 -303682 -116635 -90004 145192 -597004
9450 4232 -68067 -77295 -137727 301626 -1047 -84220 -166789 -350100 -171576 -7881 127035 -329277
9437 -55635 -133650 -225594 221503 167228 -169558 147349 173023 113980 30694 89148 209668
9426 209668 -33442 46441 123627 -74189 -104602 -188217 -153212 -153456 -131124 128746 -38234 -213281
9414 -213281 -252941 -189367 -177895 46763 130703 -128740 -169120 -143916 -223400 178331 -334973
$$ packed form
9493b01619B34896b30707B24800p8073a73126f6568k18546j48048c890j05719
9483a09609B71654g6190j57381i8751A44557a49316d0636k49897E0071a33848
9472d12835D4521Q9825c30454J22359N1420g836j07224F3971L1106C5697K02918
9461B38615g5909A52465a88948B5891a31269j72413a16635K6631A45192e97004
9450D232f8067r228o0432C01626a047q3173q2569j83311a71576g881A27035c29277
9437e5635p8015r1944B21503n4275a69558A47349K5674n9043C0694N8454J20520
9426B09668c3442D6441P7186g4189l0413q3615L5005k44K2332A28746c8234j75047
9414b13281l9660O3574J1472D6763Q3940a28740m0380K5204p9484A78331c34973
$$ plain form
9402 -114250 -159621 -84079 347822 -273746 41359 -181361 -140768 -130502 -141688 -207900 -106068
9391 -106068 -244667 -135647 -340884 77903 -34496 -120547 -162784 -117377 -28980 -51407 152032
9379 24659 25770 -155549 16843 -213503 292239 -115828 217118 176684 95936 24372 -121922
9367 77442 79031 154215 -109151 -7872 -17481 -297127 107081 10865 -28835 -24996 -41483 -155911
9355 -155911 -55113 63499 -60141 -154723 235885 -245679 -196340 167971 -134229 -38786 267466
9343 -80117 -193180 108836 -441437 145754 229623 148498 -86502 -346735 -220403 -262566 1401
9331 -65730 42931 73575 -40733 304961 -59960 203745 -26857 99589 30646 -362399 3558
9319 -46779 -157185 -246484 -49836 -10954 -140078 -154477 113609 -387549 337332 -36326 -176312
$$ packed form
9402a14250m5371P5542C47822b73746D1359a81361M0593J0266j1186o6212J01832
9391a06068j38599J09020k05237G7903c4496q6051m2237M5407b8980k2427A52032
9379B4659J111a55549A6843b13503B92239a15828B17118m0434q0748B4372a21922
9367G7442J589P5184a09151g872r609k79646A07081A0865b8835L839j6487j14428
9355a55911e5113F3499f0141r4582B35885b45679M9339A67971a34229c8786B67466
9343h0117j13063A08836d41437A45754Q3869q1125h6502k60233J26332m2163A401
9331f5730D2931L0644d0733C04961e9960B03745b6857I9589C0646c62399C558
9319d6779j10406q9299d9836a0954j29124j4399A13609c87549C37332c6326j39986
$$ plain form
9308 -176312 -119219 380258 -170409 -17175 7555 -10218 382605 -147129 91393 -308040 264148
9296 106470 261424 132915 -103628 32806 -157774 81077 -296309 -301143 -387402 -76688 -292718
9285 -292718 -159750 -90549 -109370 -170186 -247559 -191090 -157163 -168186 -136857 -577175 113760
9273 267502 -305906 -28919 -98996 -22125 49588 -262077 -57648 -143074 -302340 111562 32378
9261 148162 -236742 58762 -135621 24697 2326 -143375 -136739 -295209 -477852 175422 87146
9249 -108448 23400 -170705 -54210 39217 -379294 49013 -120106 103554 70557 70604 48295
9238 48295 -237347 18562 257375 119284 -49994 -35408 32620 64251 -11952 -165997 111739
9226 -149151 -240604 -77764 105039 -65027 11004 83751 8309 -144790 -24259 -40595 155303
$$ packed form
9308a76312N7093C80258a70409a7175G555a0218C82605a47129I1393c08040B64148
9296A06470J54954j28509a03628C2806a57774H1077b96309m834q6259g6688k16030
9285b92718J32968O9201j8821o0816p7373N6469L3927j1023L1329m40318A13760
9273B67502c05906b8919p0077b2125D9588b62077e7648q5426j59266A11562C2378
9261A48162b36742E8762a35621B4697B326a43375O636j58470j82643A75422H7146
9249a08448B3400a70705e4210C9217c79294D9013a20106A03554l2997M7k2309
9238D8295b37347A8562K38813A19284d9994J4586C2620L1631a1952j54045A11739
9226a49151r1453g7764A05039f5027A1004P2747H309a44790b4259j6336A55303
$$ plain form
9214 82239 241015 -46691 -138219 31497 -417931 -178270 -157273 24467 -194637 73970 -210001
9202 -146344 51865 28447 -257133 -243249 -265376 -157905 -71235 109965 -69373 235858 -378414
9190 -220746 408972 -221963 -256226 114934 -276173 -239987 19729 181916 -11656 -144524
9180 -144524 -28699 63340 -433328 -154456 -84121 27976 -3659 31147 33467 -105631 -181791
9169 -181791 -9222 99040 -264006 -84548 -187227 -84621 -124516 -329428 240336 -165088 318521
9157 -466729 130474 -62170 9099 -111237 -121049 -45318 -5258 -11074 -529091 -91899 -30427 159667
9144 -28722 -124059 43846 15039 66635 234319 -288897 125224 -14325 194064 -240624 -301524
9133 -301524 -134048 304582 -463257 -226321 196275 -48051 -7567 109016 -18490 205702
$$ packed form
9214H2239J58776d6691r1528C1497d17931a78270K0997B4467a94637G3970b10001
9202a46344E1865k3418b57133J3884k2127J07471g1235A09965f9373B35858c78414
9190b20746D08972b21963l4263A14934b76173L6186A9729J62187a1656j32868
9180a44524b8699F3340d33328a54456P0335B7976c659C1147K320a05631p6160
9169a81791i222I9040b64006h4548j02679h4621l9895k04912B40336a65088C18521
9157d66729A30474f2170I099a11237r812d5318e258n816n18017i1899c0427A59667
9144b8722r5337D3846A5039N1596J67684b88897A25224a4325A94064b40624o0900
9133c01524a34048C04582d63257b26321A96275d8051g567A09016a8490B05702
$$ plain form
9122 -24520 -119406 107730 24654 -107756 86113 35758 -181200 -112501 -25953 -320008 -117524
9110 20269 -127493 162184 -72271 -193212 -280545 108015 -96711 3783 155081 93406 -43784
9098 -381476 -121756 -127348 196137 -81349 34950 -107514 244624 -224859 -161061 185358 -193237
9086 -178783 -212711 82625 -60594 -142523 -8422 -56366 59132 65275 56536 68201 -357164 -148836
9073 148196 -125918 -84738 -31305 -166712 -140454 26465 -84267 -442710 90684 -50051 132437
9061 -65932 64419 -39514 78126 101028 -46492 -68912 -68589 -105869 -81200 -376496 138156 57702
9048 -264944 115561 -60768 -80781 -162423 100849 141904 -147345 -278129 5514 -80907 39887
9036 2537 222168 -198335 209430 -80366 -154370 -250349 -309410 87868 224863 160830 -284012
$$ packed form
9122b4520r4886A07730B4654a07756H6113C5758a81200O8699b5953k94055a17524
9110B0269a27493A62184g2271j20941q7333A08015i6711C783J51298o1675d3784
9098c81476a21756n592A96137h1349C4950a07514B44624b24859O3798A85358a93237
9086a78783l3928H2625f0594q1929h422m7944E9132O143q739J1665c57164a48836
9073A48196a25918M1180c1305j35407K6258B6465h4267l58443I0684e0051A32437
9061f5932F4419c9514G8126K2902d6492k2420L23l7280K4669k95296A38156E7702
9048b64944A15561f0768k0013q1642A00849M1055a47345j30784E514h0907C9887
9036B537K19631a98335B09430h0366p4004r5979n9061H7868J36995o4033b84012
$$ plain form
9024 47318 -199600 -36871 -238731 174559 -505138 -227455 -22708 -214141 -80870 -313520
9014 -313520 -270803 16032 -43886 -109974 -140920 -140374 -66367 121186 -219533 13783 65504 -104459
9001 92041 -114437 -42045 317900 -278089 -140266 156935 -8657 -16709 -102915 -114441 -183817
8990 -183817 -179492 296561 -117476 -5626 118438 -108129 151285 -15752 -315311 -52523 259701
8978 -20035 -205328 24719 -92277 111590 -587019 -27319 -212425 -44639 -184926 -84563 -194286
8967 -194286 -112480 -176077 -95488 -38565 2294 -225180 -192420 -103558 42905 -202141 -63449
8955 178333 -195420 76298 -174612 204176 199983 -167734 -214518 109494 -106755 44181 -151628
8943 -104041 415907 -74960 62453 55018 -245927 129337 -81169 250983 350793 6095 -19292
$$ packed form
9024D7318a99600c6871k01860A74559e05138b27455b2708j91433h0870k32650
9014c13520M2717A6032d3886o6088l0946N46f6367A21186b19533A3783N1721a04459
9001I2041a14437d2045C17900b78089J37823A56935h657q052q6206j1526o9376
8990a83817M325B96561a17476e626A18438a08129A51285a5752k99559e2523B59701
8978b0035j85293B4719i2277A11590e87019b7319j85106d4639j40287h4563j09723
8967a94286Q1806o3597Q0589c8565B294b25180L2760Q8862D2905b02141f3449
8955A78333a95420G6298a74612B04176m193a67734m6784A09494a06755D4181a51628
8943a04041D15907g4960F2453p435b45927A29337h1169B50983R9810F095a9292
$$ plain form
8931 34952 -38420 29549 41616 106973 199903 365481 882596 1709418 5545880 12059182
8921 12059182 7933205 2898798 1417574 575460 554927 179757 307646 140269 -170167
8911 -8998 32436 195717 153032 251652 246375 287678 162904 -65858 -183766 69982 -10877 -426371
8899 -426371 -165621 -272611 258341 -183917 126428 -136502 -166166 -194608 -245513 70421
8888 49385 80528 101509 -121130 -194534 -62416 -67682 -291284 226907 -39699 -22597 6796 -419591
$$ packed form
8931C4952c8420B9549J2067O5357R2930J65578N17115Q26822L836462O513302
8921A2059182m125977B898798A417574E75460k0533A79757J27889A40269a70167
8911h998C2436J63281m2685R8620n277M1303j24774f5858j17908F9982a0877m15494
8899d26371a65621j06990B58341a83917A26428a36502k9664k8442n0905G0421
8888D9385L1143K0981a21130p3404f2416n266k23602B26907c9699J7102F796d19591
$$ [...]
##END NTUPLES=NMR SPECTRUM
##END=
