##TITLE=AC1614_BRAAN13344_8317279_I8KFlJ24um
##JCAMPDX= 6.0         $$ Bruker NMR JCAMP-DX V2.0
##DATA TYPE= NMR SPECTRUM
##DATA CLASS= NTUPLES
##ORIGIN= BRUKER
##OWNER= Administrator
$$ 1.72 TOPSPIN		Version 2.1
$$ 2013-11-13 19:57:10.286 -0800  Administrator@X
$$ Compression mode = diff/dup
##.OBSERVE FREQUENCY= 400.02188249412
##.OBSERVE NUCLEUS= ^1H
##.ACQUISITION MODE= SIMULTANEOUS (DQD)
##.ACQUISITION SCHEME= undefined
##.AVERAGES= 8
##.DIGITISER RES= 22
##SPECTROMETER/DATA SYSTEM= spect
##.PULSE SEQUENCE= zg30
##.SOLVENT NAME= COFFEE_meoh
##.SHIFT REFERENCE= INTERNAL, COFFEE_meoh, 1, 14.98509
##AUDIT TRAIL= $$ (NUMBER, WHEN, WHO, WHERE, PROCESS, VERSION, WHAT)
$$ ##TITLE= Audit trail, TOPSPIN		Version 2.1
$$ ##JCAMPDX= 5.01
$$ ##ORIGIN= Bruker BioSpin GmbH
$$ ##OWNER= Administrator
$$ $$ E:\/data/COFFEE/nmr/AC1614_BRAAN13344_8317279_I8KFlJ24um/10/pdata/1/auditp.txt
$$ ##AUDIT TRAIL=  $$ (NUMBER, WHEN, WHO, WHERE, PROCESS, VERSION, WHAT)
(   1,<2013-11-13 19:57:03.332 -0800>,<Administrator>,<X>,<go>,<TOPSPIN 2.1>,
      <created by zg
	started at 2013-11-13 19:55:57.820 -0800,
	POWCHK enabled, PULCHK disabled,
       configuration hash MD5:
       C8 4E 4E 5D D3 5C D8 9E 9F 52 82 E0 59 8A DE 15
       data hash MD5: 64K
       8D 0C 54 1F 83 7C C3 1E CD E2 DC 19 C9 90 95 69>)
(   2,<2013-11-13 19:57:06.348 -0800>,<Administrator>,<X>,<proc1d>,<TOPSPIN 2.1>,
      <Start of raw data processing
       efp LB = 0 FT_mod = 6 PKNL = 1 PHC0 = 0 PHC1 = 0 SI = 32K 
       data hash MD5: 32K
       B9 2E FA E0 27 47 83 A2 9F 9F BE DB 09 41 BA 99>)
(   3,<2013-11-13 19:57:06.754 -0800>,<Administrator>,<X>,<proc1d>,<TOPSPIN 2.1>,
      <pk PHC0 = 92.83447 PHC1 = 0 
       data hash MD5: 32K
       E9 00 5C 5D B4 BA 08 79 15 BE 8A C1 49 B2 CD A9>)
(   4,<2013-11-13 19:57:06.957 -0800>,<Administrator>,<X>,<proc1d>,<TOPSPIN 2.1>,
      <abs ABSG = 1 
       data hash MD5: 32K
       23 58 E8 26 B3 28 05 E3 EB 15 F7 36 76 94 49 DA>)
(   5,<2013-11-13 19:57:07.098 -0800>,<Administrator>,<X>,<proc1d>,<TOPSPIN 2.1>,
      <abs ABSG = 2 
       data hash MD5: 32K
       28 CE C9 4E 42 96 4C A7 52 48 64 80 83 59 F2 D6>)
(   6,<2013-11-13 19:57:07.207 -0800>,<Administrator>,<X>,<proc1d>,<TOPSPIN 2.1>,
      <abs ABSG = 3 
       data hash MD5: 32K
       F7 B3 0E E8 6F 1B 2B 8F F2 5E A9 43 45 14 82 DB>)
(   7,<2013-11-13 19:57:07.254 -0800>,<Administrator>,<X>,<proc1d>,<TOPSPIN 2.1>,
      <abs ABSG = 4 
       data hash MD5: 32K
       3B B2 16 E6 80 44 D1 9B 31 AD 3C 45 5F 9D 8F A7>)
(   8,<2013-11-13 19:57:07.332 -0800>,<Administrator>,<X>,<proc1d>,<TOPSPIN 2.1>,
      <abs ABSG = 5 
       data hash MD5: 32K
       36 93 A6 2F F2 60 A9 0F 32 F2 2C B6 A6 16 6A 8E>)
$$ ##END=
$$ 
$$ $$ hash MD5
$$ $$ A5 23 AD 34 11 16 F9 8C D6 BD 13 7A AE DF 81 5D
##$RELAX= 
##$RELAX= 
##$RELAX= 
##$RELAX= 
##$RELAX= 
##$RELAX= 
##$RELAX= 
$$ Bruker specific parameters
$$ --------------------------
##$DU= <E:\>
##$EXPNO= 10
##$NAME= <AC1614_BRAAN13344_8317279_I8KFlJ24um>
$$ [...]
150 150 150 150 150 150 150 150
##$TP07= 0
##$TPNAME0= <>
##$TPNAME1= <>
##$TPNAME2= <>
##$TPNAME3= <>
##$TPNAME4= <>
##$TPNAME5= <>
##$TPNAME6= <>
##$TPNAME7= <>
##$TPOAL= (0..7)
0.5 0.5 0.5 0.5 0.5 0.5 0.5 0.5
##$TPOFFS= (0..7)
0 0 0 0 0 0 0 0
##$TUNHIN= 0
##$TUNHOUT= 0
##$TUNXOUT= 0
##$USERA1= <user>
##$USERA2= <user>
##$USERA3= <user>
##$USERA4= <user>
##$USERA5= <user>
##$V9= 5
##$VALIST= <valist>
##$VCLIST= <CCCCCCCCCCCCCCC>
##$VD= 0
##$VDLIST= <DDDDDDDDDDDDDDD>
##$VPLIST= <PPPPPPPPPPPPPPP>
##$VTLIST= <TTTTTTTTTTTTTTT>
##$WBST= 1024
##$WBSW= 4
##$XGAIN= (0..3)
0 0 0 0
##$XL= 0
##$YL= 0
##$YMAX_a= 633637
##$YMIN_a= -538931
##$ZGOPTNS= <>
##$ZL1= 120
##$ZL2= 120
##$ZL3= 120
##$ZL4= 120
##$ABSF1= 14.98509
##$ABSF2= -5.573092
##$ABSG= 5
##$ABSL= 3
##$ALPHA= 0
##$AQORDER= 0
##$ASSFAC= 0
##$ASSFACI= 0
##$ASSFACX= 0
##$ASSWID= 0
##$AUNMP= <proc_prof1d_extract_pilot.lims>
##$AXLEFT= 0
##$AXNAME= <>
##$AXNUC= <1H>
##$AXRIGHT= 0
##$AXTYPE= 0
##$AXUNIT= <>
##$AZFE= 0.1
##$AZFW= 0.1
##$BCFW= 0
##$BC_mod= 0
##$BYTORDP= 0
##$COROFFS= 0
##$CY= 15
##$DATMOD= 1
##$DC= 0
##$DFILT= <>
##$DTYPP= 0
##$F1P= 0
##$F2P= 0
##$FCOR= 0.5
##$FTSIZE= 32768
##$FT_mod= 6
##$GAMMA= 0
##$GB= 0
##$INTBC= 1
##$INTSCL= 1
##$ISEN= 128
##$LB= 0
##$LEV0= 0
##$LPBIN= 0
##$MAXI= 10000
##$MC2= 0
##$MEAN= 0
##$ME_mod= 0
##$MI= 0
##$NCOEF= 0
##$NC_proc= -8
##$NLEV= 6
##$NOISF1= 0
##$NOISF2= 0
##$NSP= 0
##$NTH_PI= 0
##$NZP= 0
##$OFFSET= 14.98509
##$PC= 1
##$PHC0= 92.83447
##$PHC1= 0
##$PH_mod= 1
##$PKNL= yes
##$PPARMOD= 0
##$PPDIAG= 0
##$PPIPTYP= 0
##$PPMPNUM= 2147483647
##$PPRESOL= 1
##$PSCAL= 4
##$PSIGN= 0
##$PYNMP= <proc.py>
##$REVERSE= no
##$SF= 400.02
##$SI= 32768
##$SIGF1= 0
##$SIGF2= 0
##$SINO= 400
##$SIOLD= 32768
##$SPECTYP= <>
##$SREGLST= <1H.CDCl3>
##$SSB= 0
##$STSI= 32768
##$STSR= 0
##$SW_p= 8223.68421052631
##$SYMM= 0
##$S_DEV= 0
##$TDeff= 65536
##$TDoff= 0
##$TI= <>
##$TILT= no
##$TM1= 0
##$TM2= 0
##$TOPLEV= 0
##$USERP1= <user>
##$USERP2= <user>
##$USERP3= <user>
##$USERP4= <user>
##$USERP5= <user>
##$WDW= 1
##$XDIM= 32768
##$YMAX_p= 464929324
##$YMIN_p= -787156
##$CURPLOT= <Network HP LaserJet P1505>
##$CURPRIN= <$Network HP LaserJet P1505>
##$DFORMAT= <normdp>
##$LAYOUT= <+/1D_H.xwp>
##$LFORMAT= <normlp>
##$PFORMAT= <normpl>
##$SURQMSG= 1
$$ End of Bruker specific parameters
$$ ---------------------------------
##NTUPLES= NMR SPECTRUM
##VAR_NAME=  FREQUENCY,     SPECTRUM/REAL,   SPECTRUM/IMAG
##SYMBOL=    X,             R,               I
##VAR_TYPE=  INDEPENDENT,   DEPENDENT,       DEPENDENT
##VAR_FORM=  AFFN,          ASDF,            ASDF
##VAR_DIM=   32768,         32768,           32768
##UNITS=     HZ,            ARBITRARY UNITS, ARBITRARY UNITS
##FACTOR=    0.250966925370066, 1,           1
##FIRST=     8223.43324360094, -165251,      -125740
##LAST=      0,             -12058,          -186282
##MIN=       0,             -787156,         0
##MAX=       8223.43324360094, 464929324,    0
$$ Real data points
##PAGE= N=1
##DATA TABLE= (X++(R..R)), XYDATA
$$ [...]
23853 -205664 -89639 108254 230280 111235 181147 29635 131287 -81087 -25315 -9953 -179683
23842 -179683 -220958 -33335 -119314 13590 43869 121939 104450 33464 -14534 -191893 -233129
23831 -233129 -118934 -119245 -64183 30299 108284 -416821 -162154 -156665 -195077 -161171 -397543
23820 -397543 -657445 -70797 -53800 -332319 -22831 22002 -351969 -167761 -247433 -10518 49255
23808 -288601 -352718 417091 -57531 79441 265858 89421 271223 -142382 -68398 223168
23797 15734 -230513 -103827 -78429 -164101 -118957 21857 -16071 -375287 124315 132419 -234622
23785 130050 -2086 -199798 70688 90740 168415 88042 56617 -20260 42161 -65583 220940
23773 2132 21368 48804 191864 -78908 163454 48531 59755 -44121 -159720 203711 -127915
23761 -115384 36339 83562 -151297 34883 -56046 48707 -110109 -72262 -63206 196137 -23818
23749 24703 -44172 -47906 -261054 -122485 -184814 187202 93846 249086 -62144 -355232 378683
23737 145118 -151989 -213594 -16767 -112650 -191500 -145833 -143836 -525453 29097 -52125 23838
23725 -2686 -85231 184911 -63717 132437 -5713 48763 192624 -18242 79104 293139 -181854
23713 239033 -141319 -98921 66706 288856 -195843 -290345 79776 -95616 -257884 -202590 -83809
23701 -150467 -322154 21609 -321389 184613 159008 7073 -181710 -129694 111771 268034
23691 268034 -35962 -144189 -162317 310672 -163115 11923 78183 -135500 -68762 -131653 -313731
23680 -313731 -234070 32404 -205084 336180 -199271 100631 -183279 -426013 -49853 -220320
23670 -220320 65447 218057 117869 -123900 57833 -77806 48031 -30359 -16292 -95281 11266
23658 -58251 66500 -22509 -145399 14272 -23970 -319325 190817 -47034 -158441 906 -174163
23646 124715 160082 27854 -169339 -72715 135908 43408 -209263 14743 -163936 -143259 -227006
23635 -227006 -45915 164256 203104 -313782 132270 9224 121757 -204780 -34009 -179603
23625 -179603 -27962 -289241 135852 2941 -35701 17789 -186610 136285 -6377 59391 -194956
23613 3716 -131370 -155364 -247794 115656 -173452 86685 -27199 389921 104720 1965 40524
23602 40524 -87436 257050 -76772 34613 193402 -137973 -201157 -353970 -25005 133172 453429
23591 453429 209155 -131178 155492 -153975 -302360 -127939 185369 162791 147645 -146336
23580 -14042 227032 -2052 126803 -64880 -66853 -98795 -189435 -45664 -204308 -191251 -35105
23568 -41717 -49664 77188 -836 -99434 -10985 -461502 -128610 45623 2875 -40524 34917 -191097
23555 186159 287388 80723 -9401 -312574 -135979 -196178 179248 -107558 -46299 21580 -111749
23543 141472 -364362 -28315 207830 -402696 198268 302921 220388 -238495 177489 -73746
23532 223606 66471 63374 -139904 -242491 123676 -284 48145 -11914 -43109 -164765 -276331
23521 -276331 -89814 116183 -99997 33852 35203 26305 -215962 -116865 277841 52253 131163
23510 131163 -148880 43289 262654 -114186 162696 172814 -168955 66463 20882 -113397
23499 17166 -125315 -30157 23312 -177839 32393 -22052 -51158 -116438 170829 10122 -102629
23487 148407 -69374 -47412 15570 -26738 4432 32348 -108664 -81880 203248 189132 -340032
23475 263377 -248074 135808 -192438 39836 -378631 -165852 -74139 -110667 296094 -133741
23464 80357 -75544 -30790 -139579 -111964 55656 -57181 -304177 67955 -107235 -201785 -145511
23453 -145511 -41966 -118761 498751 -16449 267444 95794 199098 -40694 -184261 54682 -78951
23441 -251132 -16830 -116237 -118540 -19810 -78668 -367129 115817 -224430 -112908 304773 297531
23430 297531 -180476 -300541 96332 127440 -89496 -19388 51269 -406326 338187 99241 170479
23419 170479 183030 166119 137594 21758 -177072 -66705 98244 -42640 -234923 -178591 283504
23407 10342 -47235 -93149 -380444 111226 275931 74773 156387 -50664 71001 79177 -80084
23395 -229635 -230608 -132027 -47956 -104777 688 -135769 92944 -248025 -233732 -397136 -135508
23383 -325343 107539 -131165 -10223 -5637 -97571 2450 78513 163680 -234522 -135093 239204
23371 76782 -25172 27087 11166 265554 93767 55552 -199556 47810 -155099 43873 -24075
23359 -94321 -41660 -231287 -485917 44371 -111382 193192 39603 396258 -140126 310016
23348 19414 10968 87714 -285176 183281 302385 -30938 -269602 -147649 -77254 244588 161564
23337 161564 16022 55545 27231 -105839 273162 -297440 -46600 148475 123113 141402 -208095
23325 -71370 -18167 -66255 125335 -75571 125090 348351 183854 -266653 -61319 136356
23314 -89501 4193 -32126 -129940 -262348 142461 -41352 21018 -352942 -235077 152807 25912
23302 118091 138966 101759 -371087 75026 -186450 -23806 75203 166996 -51172 -78921 109895
23290 -153095 -111607 -204548 -50425 250062 93069 136773 104885 -182376 28268 -62365 49830
23278 -99691 -219853 -131667 25932 -106356 -43820 -425 11107 -71020 171795 37953 -65897
23266 978 -53594 -274788 76321 -43633 66842 -81132 237107 -114733 -35369 251138 -37773
23254 28513 -427603 -26358 163560 131760 -132018 -114819 94823 -31600 -19818 -227071 -88730
23242 24811 -354380 -130684 -210165 -25863 172756 -111400 -114560 -171696 -22038 -167366 149836
23230 -379149 107918 -51016 -289162 249991 -269568 -29294 -62465 151034 216061 -104515
23219 170024 -226924 -161252 69131 213806 50764 -21151 157346 -128826 -45748 295632
23208 -20244 -93260 95877 -18327 359068 146354 -359252 -55084 93892 233287 37202 -152891
23196 296357 -47839 -94694 -73134 -22132 -219487 -35301 204520 -355215 -284144 -13240 -251990
23185 -251990 -86372 -113884 85229 -79554 -58506 16801 78757 26430 -29040 -305229 115662
23173 61433 68359 279057 17563 199246 -155918 -19950 -47622 101634 145390 -153012 -361376
23162 -361376 52729 -190965 -69779 -190415 46327 -136401 -60109 43212 -305267 -458116
23152 -458116 230016 101698 76078 7718 -37429 196476 51488 76763 99169 -396184 94948
23140 116383 135622 -7949 51254 183056 29601 -56728 182941 74364 211352 57623 -166714
23128 80012 161104 10800 -265851 98141 144532 161669 -201290 -38664 -286618 128337 44400
23116 -41907 -56003 -303121 80144 219164 218885 26511 222269 90667 -48636 63546 -6132 -196877
23104 -196877 83606 225780 184970 -9330 79281 94469 68332 241390 99033 18050 60242
23093 60242 -35017 -117619 -39047 -67384 145 164041 -58092 -61480 -187590 -225400 136399 112595
23081 112595 -59721 -8452 -88995 301380 -149997 -11319 46873 -333119 13689 7149 -14828
23069 312057 206250 -226968 -262584 -10133 -296756 -106700 -73121 135229 -30177 46860
23058 -107714 160624 -160221 159059 69905 -52920 -129209 61195 -405582 292564 105115
23047 97987 403105 -147792 -295363 -89846 329610 -34911 158459 -150802 188781 -86666
23036 442438 -84995 36602 121946 69023 -45933 -198971 -67963 -2023 94907 -11485 6220 -266084
23023 287404 184433 -110287 -2946 25814 -12794 -203890 -451009 -117934 -202729 20049 207220
23012 207220 -185957 72468 19266 106093 28727 -356126 -164041 105646 -239202 148746
23001 95527 -128133 37518 -10211 -199970 270227 -84960 -198206 -6699 152839 62499 345711
22990 345711 -59212 -73609 47518 -295605 -296015 -16683 -137266 -159249 -188001 213481 -40025
22978 -180000 -200622 -205748 -23620 -258622 -53032 88083 213185 -22050 -329220 -221510 -289409
22967 -289409 77169 -353176 73484 -151190 182705 193295 -402841 142383 -17041 84508
22956 -374360 -153709 54708 -342276 31479 -358759 49492 -100592 -56127 313555 191020
22946 191020 56452 -163204 89955 -191441 35126 61552 114381 201337 -362773 -45804 106236
22934 187780 -176943 -248547 348022 4156 415679 183988 79115 -1357 -107802 170426 33913
22922 9458 -211922 -47426 151942 36119 -32323 -127728 -150983 -75412 -140453 -100869 276832
22910 80755 -3331 -216706 -162988 -400113 96642 -313326 -213620 45142 12115 -169059 205418
22898 -112869 17040 -212365 -431548 28488 -1279 -32186 16996 282695 -176787 64479 37203
22887 37203 -91928 600899 81052 -98174 42808 -25644 77408 -92636 119252 -177096 102243
22875 2092 -88696 166801 -53424 48373 -176887 -104254 -203407 -249871 -184967 -152201 -241603
22864 -241603 -23868 -407734 -71365 -229527 246204 38892 104307 129092 209656 -19010 -263215
22853 -263215 -182849 98685 -211633 3741 -331544 199385 -251896 54574 46997 41601 -230614
22841 -103388 204735 -148348 81909 195997 282964 -144593 -918 214851 36064 -37622 -158436
22830 -158436 -55641 -246946 149400 -152488 184507 -63888 -68847 -215509 -47468 127813
22819 201583 5865 -16657 -97737 -231609 72122 -23257 71632 -333580 -298428 198457 -83510
22807 99628 153277 58839 45007 -459537 -146383 -71366 -95420 -212872 58434 152076 -205111
22795 31780 -84919 -2667 -550546 234278 291276 -270206 -240528 -137223 -174975 7229 207459
22784 207459 -75062 -117043 148342 88540 -254797 206132 -59189 -210460 -65120 136025
22773 428307 230311 123581 -191709 -107565 78024 81537 -122652 200234 18495 52821 41954
22762 41954 224209 -135291 192459 -101265 -85533 154177 123243 -77436 25406 197200
22752 197200 -30678 -226370 -240524 -81007 -14463 -244587 123617 -35641 -241646 135911
22741 -299061 40238 -4551 -165173 19681 -74621 277904 -114179 5144 -153880 -158964 10425
22729 -66704 -282268 198492 121793 35119 -200411 165694 -102590 -211467 12153 -161843
22718 -166662 -119228 86976 184010 -18212 20607 278774 -89041 -145376 161133 -293267 -103589
22706 -118636 432485 240597 60473 -226759 255693 -10816 79165 52931 -485761 -184708
22695 -220558 -235564 116117 -121472 220947 -54372 -140321 112476 55162 -242227 -163221
22685 -163221 -62916 87781 361771 -219356 -76776 -52310 -363188 21772 196395 200517 -109927
22673 -241663 41536 -52696 -64194 195115 -112345 149458 -164968 -252386 -73125 328274
22662 20737 292459 -44376 -242425 -86795 -169819 -148983 161709 -29006 46240 -268229 86620
22650 -15121 168371 -184052 299575 240938 -50583 -175314 -121820 -80479 116955 133556 117987
22639 117987 129096 -235379 -57606 155151 48229 -106578 -161474 -359670 -37417 -100410 44537
22627 -149339 12675 -44030 -63454 -213685 155520 -79145 -99218 -89825 -29133 135329 -279814
22615 -79079 -387393 -22231 403323 -261129 49013 67565 -76672 69306 -20821 -26881 67343
22603 -117677 -165267 256985 -228287 118702 50269 -120593 -226594 -190973 -148621 -169598
22593 -169598 186942 121171 -89788 -6922 141134 43066 153151 27127 -86930 -400117 -49372
22581 -37593 38742 231293 59188 -260311 20838 168643 116588 200217 -14238 -259652 -143740
22570 -143740 -44405 8513 200340 -261688 -139097 355014 -51627 97747 -75407 154095 -139655
22558 53661 -57859 336696 182595 87019 -143686 -134888 88397 -31751 -46366 65473 143324
22547 143324 -201957 -50807 10408 -171318 -83088 -327748 1096 -82089 -27039 -56171 263613
22535 285405 -141527 -136111 -40427 -146856 109852 -92954 -95424 -59551 181207 107195 -59087
22523 -118770 -313262 59976 -126731 -60234 -30111 30321 -52041 -9933 -170924 -390837 -87136
22511 243476 72232 227842 171373 161889 17494 -206217 -159107 14292 256891 -82185 79200
22499 153416 -176951 28288 496743 89701 -36779 -146629 72114 103035 43440 -121471 -73237
22488 -73237 -117697 -136445 -232773 -108353 -188007 -40898 -47733 -90399 166909 -115885 -143610
22477 -143610 -18813 214068 175563 -312883 83164 234700 178140 -133044 -233415 108137
22466 -370569 -13589 74247 -149123 -248296 -96490 -214775 -121951 -172286 46214 -226894 -128726
22455 -128726 112533 -1107 19390 -57929 -4984 -109236 -71927 -233926 -99696 -64823 34122
22443 44021 -216094 -189828 63902 -65001 -169009 -121421 143082 -180165 -116607 -200199 22694
22431 -175697 -171424 47511 313472 270354 -532154 -360450 -25510 -34516 68684 86170 -68740
22419 252136 236000 121712 -4619 -132289 85410 299917 -158242 30769 19266 -51444 -179471
22408 -179471 40888 119305 -65093 96570 -200722 6039 -200922 -201852 -443523 16655 252815
22397 252815 -45987 157834 185664 112485 -56553 -78727 -141049 -31725 -160849 -311101 153600
22385 -181087 -20425 188382 -179875 -43131 -3171 -194265 166104 -78144 105277 -221228
22374 61748 38231 -297854 -86936 -468028 235529 80307 -111112 15896 56662 59656 327077
22363 327077 193076 81631 110863 -227395 -34238 -94648 -370030 -19159 -515579 138898
22352 21930 -216040 -32486 -276552 5303 83218 -463993 -240858 -179298 44688 -132825 239484
22340 136702 123183 -46922 310112 501246 -534410 -781 2796 55435 -423582 -77524 -100935
22329 -100935 314611 -114262 261474 -412379 -212404 70279 39667 -34131 205668 -166086
22318 29699 -78483 51262 -107208 -144597 -222893 -41342 166321 191531 -190060 148249 -207128
22306 132424 127493 -125218 -8191 -197031 -281159 -46717 91527 -241438 -176151 74267 -218624
22294 -80476 -54829 -196045 27109 180841 -37730 -521612 -518967 178913 -33195 -140996 30873
22282 113377 319398 -17403 -186213 288962 -38333 -153953 18963 96509 187847 -82930 -258308
22271 -258308 7287 -106279 -61942 -107569 89740 150660 -158297 -348331 -182304 -295674 -3452
22259 68266 -194642 -11873 -247466 -238318 -84751 89592 335304 -61966 104620 -436473 -229411
22248 -229411 37398 -116735 115387 143831 108580 8246 78629 -84122 -144501 3349 22519
22237 22519 -168480 155631 212483 64207 -35507 -173107 -101667 31597 103087 -348934 -173305
22225 28945 99106 323244 -200846 -149169 -198197 45775 -180668 -280353 228715 -46063 -157990
22214 -157990 -177556 -310432 18865 -113294 -140565 35230 76645 162838 177387 94863 51706
22203 51706 -3577 -234053 228400 -30126 -256365 183418 -166328 29826 -124186 -421644
22193 -421644 -269911 -90384 -250949 63137 -107167 -108282 -138385 -79935 191816 -112779 255801
22181 -105329 -148524 -277664 -203231 99466 -198687 -175019 -64968 19447 -133786 -101387 -156543
22170 -156543 17905 -68601 103293 -218183 397980 143294 182922 -30071 -241885 -106326
22159 -222192 98180 115933 -27619 107884 17594 94452 -27243 190018 63079 -132609 -62729
22147 122459 -26812 -230359 -37452 148048 -119868 337283 -227413 -228199 -252666 -134553 -32734
22135 309189 -167003 -110099 149949 148278 -398091 -123004 -183606 -27827 -1536 -5791 -293234
22124 -293234 165043 -81066 -109893 187473 18875 -254301 82253 -162696 242618 -61258
22113 101785 -97087 278352 -75342 -1738 -119388 127411 262065 -233693 181309 -189527
22102 172711 -45237 398767 85231 -29694 2266 -399634 64838 -56685 87914 -301652 -339933
22091 -339933 122135 195976 -229106 -14157 -319405 47983 -46427 108890 35091 -289026
22080 -62410 -128169 -123665 -113143 -239459 101670 73203 132041 -54765 142581 -454047 182
22068 -223686 -458864 -81692 345658 -117633 -187545 -192348 -68167 -68755 87666 102112 -86672
22056 -310553 -226054 -12819 -335263 71364 -238628 -93314 137727 -42046 13072 72797 128244
22045 128244 -320738 153412 149036 -463597 -180024 -158610 -132730 180419 222476 82244 87089
22034 87089 -210375 1995 180918 158726 6525 -233545 129845 35142 -156413 -284287 -273007
22023 -273007 -265132 -18887 -209147 -78192 154613 -144307 -106178 166245 -52396 -264271 25439
22011 -352230 213732 81713 218852 -27735 -127534 -441178 -59828 -40380 -69341 187770 -155623
21999 22784 55278 151868 137031 39758 -30067 -165530 -58254 257579 -479797 73028 22667
21987 -107607 -104324 88578 -145203 -163444 142856 -81370 -69012 -104135 -180126 -292927 208285
21975 46700 -68280 65184 -101067 -1968 -196452 -125070 -69426 -28363 -234494 76037 -392176
21963 786 16102 -143614 159913 -28194 -78009 119911 -112011 -236922 -205291 -29245 -274314
21952 -274314 27740 -32639 -1570 -125085 316663 -16857 162913 -357813 -242622 -258510 227391
21940 -31855 120496 -214145 -6023 -226427 102205 -121513 -112459 -236108 84664 -143737 -232604
21929 -232604 -465636 -257546 24154 -166437 -173731 -49257 151827 238087 -191069 196490
21918 95668 -70445 -240214 45750 2408 -63302 -138911 -237305 199831 -97936 -61973 37710
21906 96012 -128606 -99014 16800 -419829 -30468 -199328 -191988 122548 112008 -35099 -108309
21895 -108309 -153285 63041 -53008 -165877 -221687 -2100 -327627 -121677 -38974 208213 -64119
21883 283113 -27841 244984 224701 176904 -38259 9977 -81191 146305 -76809 8510 -15349
21871 -26048 -84483 279804 -409159 -95418 183308 -70242 -69204 134038 109613 -62879 -30399
21859 -157296 13274 -256628 -5889 -289937 -20172 4189 -129012 -66159 -156405 -379818 -288224
21848 -288224 201539 110471 317794 -157376 238976 -75360 235486 134530 143700 330621
21838 330621 149803 -107257 -69586 -421347 -147526 -10528 21456 -254331 18758 91216
21828 91216 165880 104560 -4666 173252 -133303 186072 -42899 -181844 -222662 3477 50756
21817 50756 -101888 -135730 10633 56307 201295 144676 55832 103447 -49560 -138831 -187262
21806 -187262 -207225 157481 -73444 67269 -106972 160430 -137724 217476 -96690 107031
21795 144604 218843 -314622 -229395 -193599 112145 -1479 -64796 -247643 -85739 -215111 21213
21783 -153623 -493296 -73849 -31846 13995 168806 -157438 265057 140479 -5811 -475789
21773 -475789 -141087 -188637 232442 -187703 232678 230794 -175443 -107500 -163175 -134149 98056
21761 326516 127970 -194174 -11132 110715 317657 -118309 -121304 -271844 -90493 -102434
21751 -102434 381339 270946 -11075 -186592 68224 138747 -137686 -289909 190799 118718
21741 118718 117972 -8344 -286240 8464 275628 40382 303276 18619 -114297 130237 -297810
21729 43202 105357 -260513 85301 -81761 144752 -225431 -82648 -61946 316607 -147023 104573
21717 231052 -32380 -16320 -28428 -98952 -111755 54693 -204024 131325 -274568 -168271 -79126
21705 10019 275257 -137226 247570 192 82397 -85108 -38885 -41768 -160810 -189348 -67006
21693 76362 -176279 -419591 194113 -103183 1782 88396 -96389 -256336 -187326 -19419 122365
21681 -53460 -14418 -307075 -255839 -185663 -127166 -94211 -187568 -176783 -68270 -25088 45603
21669 92992 -199595 -47915 20554 6482 -98077 -139515 259845 219690 -251146 22426 149497
21658 149497 70415 33818 -192651 -121283 -111419 -5445 -270656 18854 25819 -248291 -90942
21646 39727 -62173 -254061 -2457 -410448 -67744 -199182 317511 190794 68204 -57334 30103
21634 -299403 -52497 -66491 -199660 -122465 -327504 -165726 -33111 56871 265165 -135336
21623 -182360 134030 -40666 -206402 -91880 -17692 -83749 -248532 163160 31053 317058
21613 317058 -35216 -202576 -44673 -371793 179492 78222 92745 -179106 -189748 40836 -48434
21601 141603 110733 -189458 69833 -89905 -147561 111542 175188 21610 -130582 -17440 228254
21589 -250616 -959 -236272 -256732 -25614 124488 -228476 -224869 157346 -31647 68293 -32018
21577 50873 361990 -210352 114263 -83829 -345750 -91664 84467 -154323 -371783 -179660
21566 -219859 24011 -126989 -114022 -122109 -54983 -446837 -159707 22991 177744 13970 -148334
21554 88130 16238 -24088 -98596 60324 -1016 -240959 -135158 334739 98255 -5697 -92174
21543 -92174 218355 55596 327086 -254771 -32922 -336824 115564 -80843 68113 4853 81012
21532 81012 123441 315833 88488 -165564 -26767 238950 -203932 94352 127799 -16739 -651978
21521 -651978 172543 -33273 63784 250474 52887 -26589 -275802 -123640 390878 -221433
21510 69410 -174495 -149614 296746 -238666 303536 54636 -15785 95392 -5 132573 -175630
21498 -208203 -172696 -103711 -247703 -95601 -598342 -266218 -70266 -60306 120332 -105284 153406
21486 126315 150930 -228530 -176856 190288 -200733 157 -317386 -181362 -237824 -166072 -4485
21474 -179361 -54384 -42913 70728 -797 -217413 -35549 113140 -244606 -15552 -137865 216049
21462 -203405 -154029 -74273 69406 54306 56173 -151959 237210 -154199 32661 104952 -199786
21450 189086 -72525 -6321 25471 -93435 12743 -75182 -121398 77701 65924 -6677 147798 211978
21438 211978 304808 -91355 626632 368568 309318 11881 8750 -29271 139176 -28822 -180365
21427 -180365 -244366 -223426 181145 29885 -95628 276689 290668 183343 -203230 -233708 -210138
21416 -210138 207539 -12637 -284495 71243 -189028 105185 153214 119343 -296874 -248500
21406 -248500 16076 137724 136507 -151072 61683 61589 -88205 -4114 428021 100243 34496 -59041
21393 -320769 -69458 -111562 7216 -55977 36156 135274 -178670 -289703 -233234 -107005 175166
21381 -68926 75094 -102796 99769 -26729 -217288 -72479 -270750 95398 292618 100997 229427
21370 229427 162076 151445 -64039 74983 417127 -86094 -201811 248719 -253686 32384 -397159
21358 230560 3781 64559 -138669 86920 -129103 -113439 12834 22517 246315 -169806 -180669
21347 -180669 255842 337254 -242596 -32202 188031 -265371 113986 -182381 -147188 188237
21336 -329268 -186754 76625 225792 167644 -143900 148396 41066 57301 -297772 -141689
21325 193708 -175454 39404 311876 176662 -143791 174757 120974 31345 -116347 -100079
21315 -100079 344441 -162184 -93904 -75655 -121557 -2231 1661 408962 -210328 25916 65157
21304 65157 -297381 31115 -1094 -373124 -282944 157314 -144099 84371 -172748 -23116 -129701
21293 -129701 97677 -69295 -182104 -299492 -370559 66358 -378960 16439 276190 -343603
21282 -73332 -41148 113391 114760 -59287 203317 -65723 68266 95333 49995 468943 -137365
21270 118086 -146568 -123003 -67755 130357 -26213 -160029 -1993 243719 -253408 249982
21259 -69442 -200111 23664 -35544 -157431 -126273 -186532 -4351 -165097 -373536 7269 -10069
21247 61191 120536 274135 137689 31703 -61963 45385 -16094 212901 89693 -384703 553152
21235 -58426 -7050 -600000 -110180 -60518 -317969 40560 -109538 -236683 -135326 125076
21224 -152287 466 80143 -110833 -169042 -100473 -17334 -160890 187864 -70334 -39661 186433
21212 -136583 -31113 -288503 2287 -210863 -31232 -101097 -2326 -333931 -112590 -263885 -169984
21201 -169984 50424 -59046 -153390 -324754 -87091 -187120 -74035 -229783 253616 378866
21191 378866 -71816 -287917 -365212 -204899 -182691 -75332 142762 -369802 -129247 45285
21180 -209899 246162 -21351 -52836 54208 17832 -179693 -124725 81704 -157990 -319969 165781
21168 964 102873 -97215 -166176 -95610 106735 25681 99032 -183374 -14368 51127 -299936
21156 -365676 111102 -396877 164085 380435 -70767 -55652 303771 259126 -241927 37324
21145 -80869 4246 295145 -143638 -128263 279980 -77618 -204474 212474 -275622 -151434
21135 -151434 -237329 27312 -368140 290502 116755 11691 -87970 -145078 20970 219982 29299
21123 -16850 -131154 22647 -339600 247470 114874 -172409 20297 152514 47560 -304085
21112 136699 36479 237084 131843 -214323 -81428 -337498 337908 107232 211239 -121930
21101 -132914 -12167 237830 -36898 -145139 273472 115628 118987 -313222 -119799 -92790
21091 -92790 -94068 17579 -38632 214598 512862 -240391 -307488 -190733 93045 -217288 185368
21079 98601 -44871 -154005 -102945 83283 -106034 22576 -395864 -150527 99488 -164585 -22546
21067 -77950 -111574 -31342 139408 -91848 -172854 9893 43461 -133704 -73691 -107348 -112479 69586
21054 74232 58171 -174485 -428221 -250059 263137 -132622 -305570 -110762 127502 47495
21043 -2767 -490806 -17352 12167 -302134 -91550 -230834 -92261 -120161 -44480 -98041 -106507
21032 -106507 -116325 240579 92522 59595 -157957 200779 -388543 -74908 46194 79183 41199
21021 41199 14879 -64254 -15211 -280332 -8652 272294 -5295 -32347 -146537 -268575 -315020
21010 -315020 56593 -27825 -5756 -166775 -29142 -267416 -301653 -202131 396201 330171 -106807
20998 -73919 -88539 -71805 -62655 338052 -292407 -140316 156990 5144 -246675 153837 -82749
20986 -228965 -268823 -98998 365198 -428646 1673 23839 -156245 -265136 -134489 -122946 -216296
20975 -216296 -340453 -173376 -124237 83626 -157588 -217109 -349167 -322884 84345 -48125 -76259
20964 -76259 -148570 116806 89510 -143564 -49053 -37889 11016 11114 -215450 -164632 -203883 -369429
20952 -369429 -119947 -38483 62334 -122045 127408 299676 108238 -152026 -49781 -145445
20942 -145445 155371 -219078 102044 29485 -93348 -157238 67894 23112 -69042 -258958 -226969
20931 -226969 55187 -16669 -389888 -3178 -118976 -83461 -299427 -267548 172492 -205936 213451
20919 28258 -84844 229965 -127853 -61845 49710 5197 -11171 -211525 -192220 72005 -433997
20907 -215908 -377045 -18036 -35478 -263494 -148309 -123150 149322 -133655 14449 85983
20897 85983 -83624 -76867 111215 128712 135654 -236226 -87639 137276 -57041 209603 -118150
20885 -461258 -225440 188171 -59257 143767 -72262 252072 189766 242750 -212598 -196857
20875 -196857 -103001 115016 -326152 -453515 96532 -239489 5418 -17238 -34972 -287520 17022
20863 -136271 -201433 95031 -103306 114585 -210336 -19748 176629 -230286 26706 226854
20853 226854 14225 18612 292865 -167554 -75832 -137454 -21588 -334468 22308 -36689 68637
20841 102260 -74257 -136769 219504 -15004 -138471 20633 -225858 36933 -221136 -316793 -68108
20829 222420 -401359 -340977 -50731 -63418 214631 175868 74161 -40099 -47495 67782 134647
20818 134647 -246512 -267023 26808 119804 -11689 -202158 20709 100472 34047 -242463 -241713
20807 -241713 -35780 -164304 -50280 -89696 12122 167736 -171102 -437495 -264883 -87846
20796 109187 56456 318469 261837 32001 -60551 -237179 66038 134164 -210106 -139510 148710
20784 127486 186852 -333127 315635 79708 -183551 291377 -106689 -204807 -34097 -60530
20774 -60530 4943 -142877 -59183 213580 91251 34756 -19547 -67952 -34574 343674 -68316
20762 -16251 138053 -272451 169590 -22533 -4329 -158059 -240490 -24620 -357682 -253525 292668
20750 -189564 44155 68329 -62843 -48847 -176660 -312110 243497 -145592 134657 -96895
20739 141656 -75301 -173480 41678 -135857 -1490 125317 -371964 -257637 -234438 -111749 -251650
20728 -251650 -138020 54225 155133 269290 -176818 -87403 -87797 -10270 -420955 -428731 280569
20716 -364266 -87130 -48537 136412 -338361 113324 -9657 450513 -145972 -80060 4952 -39353
20704 -6087 -151366 69646 114727 296077 244652 166714 -256386 -29315 -42933 288004 -108466
20692 104369 284233 -338635 1651 57002 -84419 4295 -11799 -93913 173205 -150043 -375982
20681 -375982 -264628 157611 -328759 75033 -294831 -160981 222066 83483 -42747 -61319
20671 -61319 -90715 -185466 -392666 -61465 -484495 -129699 227391 84367 11915 9528 -561781
20659 -181215 -37562 285604 -172563 46577 -297694 -203922 -113913 -324045 -282005 -45993 -79431
20648 -79431 55720 109584 39317 -6885 20019 21984 -60590 -195279 -91009 -543936 112267
20636 -100532 -74042 -40105 77335 342325 97453 34497 -517747 -187479 -113486 -101244 9948
20624 -18547 -109507 -149162 82120 114140 -86785 -118088 -75167 8691 12622 269077 4451 -80045
20611 -341495 -167601 -95533 -148771 -332076 -210331 -126494 -167375 6899 -48271 -390415 -90208
20599 111461 -196762 -17848 -51747 -298649 -303874 139308 -14017 188267 -44587 57988 -515096
20587 206201 -174637 190976 -225085 378668 151805 67390 136588 101404 196939 119144
20577 119144 203828 241905 -172900 213555 140920 -164303 -375678 -158023 -53556 -21434
20566 178227 86785 63356 481813 -167958 20309 82054 26222 -100063 -332590 8183 -197895
20554 84462 -212215 -81162 182059 6776 550 -27434 -156809 -200987 -212428 -221747 204548 -116559
20541 13172 -237330 78164 -103917 -160337 -162029 138333 -28606 -54067 -287993 146723 -2320
20529 79358 -96218 109975 251065 228224 -102899 28442 -104567 37490 -46518 -78547 -66957
20518 -66957 56283 396022 -105724 53419 141646 -240080 -80580 -151204 -468308 -65131 -67421
20507 -67421 24223 -99068 -233326 -191814 -225529 -261934 -254500 -64609 -83434 -88812 274460 179068
20495 179068 -228688 -183574 -102467 -13475 72211 -85277 -272915 -18332 230067 -66727 24599
20483 -241413 -187718 -354356 -12238 -216687 -95317 62648 -11611 185014 -304876 -27478 -37852
20472 -37852 71514 -163475 -300455 309167 -107737 96339 -47890 -164793 -273447 -41359
20461 120695 -63796 177447 -58191 261876 395060 197654 -68893 -284140 19341 72319
20451 72319 62753 -284446 -169728 -44804 216170 -131763 -50322 10980 -87323 94564 -74403
20439 -225636 -88192 170594 20277 -102996 184876 184746 -177624 -73875 -59896 55503 98980
20428 98980 50334 -260916 -331790 -9026 -130438 -31256 64984 -134815 26719 -82465 206332
20416 -249395 223421 79263 -77849 -131973 35423 348732 197191 -441726 -66824 -167564
20406 -167564 -326211 65578 -168027 59582 33890 -61751 86780 -14953 -121405 -87835 -45430
20395 -45430 -75345 -127478 105885 34626 -21583 -132851 -296387 -234687 -80247 185558 169072
20384 169072 -141760 -205565 -36177 -21908 -55398 40107 -27469 81478 -122083 58535 -33554
20372 -293574 -69991 -149667 -396565 -95394 -72531 68715 16626 11714 -226041 174004 -13768
20360 -142210 -51836 -136704 -56294 -206834 -84999 -278571 -243702 -157939 -94922 -301210 176450
20348 -41609 -299302 -170415 -219766 77306 102452 -342094 74772 -33129 70373 68322 -80871
20336 -36760 100890 -58709 -50047 117256 -434661 -56305 -35090 -158939 -74353 -56333 57650
20324 57687 -268357 284611 -299437 248775 -145695 105141 -52966 -382240 -41949 -229248
20314 -229248 -27401 -89623 -75418 -381152 121922 51127 50071 -79912 -318737 -342804 -84188
20302 46722 -244257 24345 85671 -199945 157450 -80419 89239 -280421 116351 57283 162970
20291 162970 176419 -205733 122413 153527 -80017 56176 124113 236668 -138919 -98002 -329077
20280 -329077 -119151 -319132 -183757 -168541 -38642 -281856 154184 -196803 182165 -151241
20269 -329619 191335 -110066 32018 -264490 -157733 -19252 71775 -479449 -260216 120065
20258 87203 15129 -300876 -240425 23509 -141778 -259475 172387 -43721 -107243 51644 -395516
20246 118011 65524 8387 -45408 -151828 -42788 83626 -30014 156012 36599 13637 125257
20235 125257 97388 108569 -43933 15865 -34844 59924 59230 97474 114580 -117684 47591 77317
20223 77317 -98525 -97654 -45377 -279336 -254022 43290 114844 137077 -83366 211864 86035 -160442
20210 -259198 61382 -38718 -419072 56354 -168428 -173966 -277996 144909 41283 -328353 -24431
20198 94304 5965 -200817 172635 -135532 -21956 107971 -269678 -195052 40202 162484 -190790
20186 93689 18192 36743 -16842 156180 22792 -225872 14560 -361285 153554 -118524 251480
20174 -88795 883 147400 -49879 70529 21056 -17579 -91552 202119 37257 -108860 43947
20162 -11543 287183 -213086 107046 -218405 153321 -187256 194755 -27216 -308214 2736
20151 114001 -294811 -99875 126561 59458 -48722 -116943 -200214 -8254 -35599 71766 26493
20139 -266059 148302 50927 -202251 239782 55016 71726 61339 -730 59121 -6916 -282470
20128 -282470 -135597 -627466 -113711 -180893 -85221 -259041 -75989 -78435 160209 12484 -293910
20116 -138757 -198277 -215646 73936 186652 -37815 -130140 -44149 -86524 -231341 233167 -163979
20104 32763 -78262 -118649 -154390 -39829 48481 -159840 96602 -391200 -258654 89998 -80391
20092 -294894 1948 -73430 -136306 -207517 -115250 -57300 97606 -18911 -287536 -26267 -17427 -57706
20080 -57706 -283131 -65743 305543 -121034 212834 71075 -212931 -7658 -185089 -326069
20070 -326069 -150428 3496 -40885 -118452 -92877 -156288 -21683 -210996 105784 69426 280204
20059 280204 239156 -228947 190401 -20415 76514 890 16313 -370247 -241239 -37610 -275319
20048 -275319 227529 -327436 -104647 155141 -205646 64393 -127015 -121196 -7236 31904 -30232
20036 66841 -15199 137791 -390332 87191 -108813 -172544 -123740 -101073 -186810 98797 171071
20025 171071 -200060 -40294 -418192 -234205 -20933 -139672 -586574 91743 -56316 -174028
20015 -174028 36590 -137480 -159565 -137185 346682 -51776 -95240 -88749 189177 126099 -100332
20003 -382805 -226610 -81632 133949 -53538 -124353 236957 114038 -19744 114144 -186451
19992 -63315 -140415 -239139 -298584 -261552 -466084 144733 32592 -36796 265642 -74785 17416
19980 -288640 -105103 -118434 240782 -228791 -264618 -381723 -100465 -156294 -105561 91277
19969 -55180 -328946 -464585 -295825 -351780 -327314 173155 -88236 104394 -211541 -209443 172603
19957 89172 -110639 -256408 -271779 26846 -18775 105094 262459 -268928 97581 -347606
19946 -117895 -25002 -351907 38351 8721 40064 38752 -143491 -120523 -168106 19549 -94500
19934 -62011 79846 270315 -46418 -531934 94767 -205815 114295 -137545 -306727 228174
19923 9207 323798 132304 9430 14484 -251107 351230 -154511 -150747 -266407 173617 -39146
19911 -117367 -95674 -39180 -196652 -160385 -79704 24420 241101 -15550 -66337 -224881 -192382
19900 -192382 -115112 -8524 202140 -276961 -74989 -221811 177804 16636 -32015 97846 -3647
19888 -260782 -74164 -110321 54247 -85413 131638 303944 -328782 -8636 151132 -234771 -119686
19877 -119686 84334 95640 -106042 391503 1540 -77599 -48482 -94757 16539 247081 58977
19865 134837 7135 -145548 163236 -42391 -233679 -66223 -137835 -344564 -138955 -227388 116962
19853 -100747 -116390 -181725 114197 -90262 23829 -215462 -233544 147964 -119507 31036 -167055
19841 140255 -19412 53039 -227266 -12512 211415 97564 184267 -227376 -75575 -194488 54703
19829 126774 -233126 -119735 -86518 -160484 -258319 -1385 -36451 -87509 -125683 292108 -188094
19817 168633 -286456 66270 67193 -25530 26500 81182 -130177 -50542 75899 16553 -212461
19805 -59357 -273707 61710 -203574 -30143 -367491 -86285 127179 196385 -13941 -41 74993
19793 -29791 -16912 85220 6849 106424 -97205 -215102 -192632 -192109 -127564 113210 -36595 3652
19780 29007 29507 14902 18901 -192591 -49774 108657 -157901 -76919 -166735 -403143 -73995
19768 -266762 -128125 -103472 -214971 236606 142647 -95414 103774 177461 -328774 32720
19757 7921 -205905 -48945 209451 144578 -239649 -359896 -361249 -218121 -143089 -195876 21200
19745 -1479 139915 52144 -358368 -58670 -165302 -568329 -376514 81380 -251362 -121305
19734 -210883 159614 239 -14316 148209 100343 -71449 175905 132580 -8842 -160184 139864
19722 -365148 2546 42173 -183534 -291221 59640 32811 141994 160786 273584 49832 -100464
19710 -32001 -66630 -246077 12197 -279589 -92581 -192003 -230641 -97364 -83380 41871 -212569
19698 70042 -331522 74055 211335 28873 248090 25128 241021 -180386 139214 96491
19688 96491 12092 208600 -191411 -147168 15467 338149 -24246 -259397 122131 -113704
19677 1535 -90728 -420259 -98422 -264985 74459 -208974 -98393 32236 50610 -314396 -18332
19665 -250016 190821 -9262 -158499 81067 327488 -49524 -255061 -77712 289007 122248
19654 16561 -88494 156407 -80725 -272593 198045 -480478 -206775 88602 -106885 -54808
19644 -54808 -195862 177434 -75236 118674 201149 29473 -471366 -109366 119171 10520
19633 -84560 -410357 9139 -105155 -181056 -16394 -228820 215936 -105755 -295760 -113389
19622 110927 -166015 -219402 -211796 -187575 558719 -99651 167881 -64152 -243829 -123946 13111
19610 -425997 251669 -28648 -162237 -171393 -249122 -11480 -130727 -538761 111119 -260439
19599 -183215 167801 122553 -159655 -118547 -292437 -118103 -214601 -280364 131125 -199662
19588 -156367 170198 -161832 37134 -281004 -5998 -20988 196912 -149667 -256532 -12637
19577 -280242 -201423 -412618 -108858 -51708 69068 -118650 -48140 -76904 -20452 -216151 187860
19565 -21810 253450 -41377 53741 -388772 -254806 -243304 -36630 -29791 264626 -79392 68605
19553 -23722 276958 -68229 -309998 119336 -12533 -271488 -30724 83320 251903 -194407
19542 -776 103321 -89996 21193 -95920 -33869 11135 -18596 -750 -146057 138519 237036 3730
19529 -257814 -372982 -33982 -225680 -74917 1705 108099 -138460 -192750 -229394 155476 -157509
19517 -22339 -141136 -60800 10052 1172 108592 -169736 202920 122558 -65712 59000 -83445
19505 -196502 -321446 -241746 -100173 401510 -208560 -86352 -140756 -364471 -456662 -18349
19494 -158656 242587 -65874 -140304 -290960 -85504 -231778 -200762 95679 390934 -186855
19483 -232691 38746 -77419 -188081 -225344 -145710 44579 -46615 -152704 -62364 204283 -280678
19471 -43884 -52322 -141163 -103755 -80640 -149707 -159213 -7172 52563 -220841 -200016 243072 22409
19458 50723 116708 -412273 -325838 -127522 -32220 415282 -120548 -199881 -49564 13203 45127
19447 45127 -109453 179977 -175565 198423 35522 338734 286387 77128 186877 238118
19437 238118 78780 -163441 -88376 139044 261024 316787 -75229 42591 74910 29375 -291154
19425 -25619 109191 -267421 31162 15727 -327156 -244400 18101 70424 80222 -308038 -100509
19413 39762 152402 16215 86668 170448 23392 -237883 -138925 492497 -333257 -113865 82671
19401 -120544 127220 -37223 -236009 -25752 280425 -140625 132222 -122343 -326262 -49724
19390 106813 -95559 198134 29509 -92566 -223020 73475 -77067 -140345 237320 -84786 -55136
19379 -55136 183571 -189296 -122646 -296219 -48844 -74347 -119374 17738 -193582 14165 329955
19368 329955 -354955 22117 60757 -170413 -40336 209966 191801 -282863 -23694 -197259
19358 -197259 130391 141978 -324090 -132783 74027 28924 -624785 -67038 -92841 22091 -225672
19346 -293517 -315781 -224464 -118921 -243202 -37040 -200526 197025 34429 -19546 -38803 -270770
19335 -270770 -363276 -32292 -29982 53716 67100 -1340 129280 -183054 -26103 45721 -38668
19323 -15971 -63422 -383902 70357 -269396 57346 -202058 9721 19459 -240133 -131235 -19449
19311 -96309 -65718 192696 -44706 88836 11225 -283990 102738 140300 42363 55869 134834
19300 134834 9528 94649 -130355 -245427 -205621 -285123 -140462 148260 -33372 -274574 -461848
19289 -461848 81849 113528 -36934 425564 97688 -363390 87972 95755 -137187 -161174 -84960
19278 -84960 -87705 -123128 -113255 -132171 -105909 -110428 -7096 -28916 -62789 -31096 -53186 -115385
19266 -115385 -75559 -91659 90007 -155133 -58677 -248510 -168790 95865 -122581 -147919 2889
19254 -433914 7304 160987 -82844 5441 99162 -47881 24246 15734 -332238 68042 148444 -223849
19241 -201099 -126636 -197478 38790 -378237 -166584 -205619 -328729 -128663 291379 268314
19231 268314 -122583 63570 -74306 47951 455891 297437 240389 -70974 -224293 -38838 -313345
19220 -313345 130338 -25781 -40562 -305558 314 -128727 -283062 -28976 -162098 -7782 -188529
19209 -188529 -25189 -210031 -37102 -225426 301436 -161798 -264845 9072 9292 -223571 30843
19197 14578 26558 -52018 -128145 102580 4559 -132533 247222 -105190 265970 235912 -258565
19185 -142050 84323 -554133 -87274 -306897 -229106 -216946 -129341 8924 -419046 -178321 46678
19173 -120192 215518 -190355 -2717 6680 -241080 136129 34270 -57205 430817 -266973 -224757
19162 -224757 -21688 182991 22658 -154754 -79051 -190930 -378419 -329877 -271528 106149
19151 -101857 -230462 51365 191680 -238449 45584 -345744 17373 -176831 -70152 73280
19140 -158851 181411 -77891 90379 -203069 260773 -153859 -144720 -80917 -27679 -89736 124225
19128 -150396 338318 -37964 -102972 118790 -66241 274452 105430 459737 -166280 -22389
19117 15754 -124060 -196736 -61851 153163 -190636 48531 15894 216571 238936 168530 -171108
19105 -124012 -110996 191144 22734 -123251 130597 23936 -258265 -131816 -209928 7901 -46229
19093 -193994 -87212 -125299 266231 -374848 -1364 -223306 295030 90815 37266 -75046 258390
19081 20179 -75092 69629 245731 -102357 -167451 226028 -91310 -168622 -18365 -133780 422247
19069 -263498 -271916 -24604 -124900 -277583 -86151 -236560 -52915 -154346 160760 -36043 -175633
19058 -175633 -67682 -72744 -244038 198116 -178329 -240773 -180278 -100144 -302530 -279382 -164829
19047 -164829 -410138 81066 -44499 -90373 -67821 -88891 34276 281501 -119247 55427 -17765
19035 -295533 62903 -93552 131502 -194082 71263 -179569 22476 -15283 105375 190391 299251
19024 299251 98125 151129 -184946 25725 203057 -175522 70911 139376 -300068 -297287 306450
19012 -153874 -152370 -63081 151255 149902 -187661 -55073 2742 -69508 -124773 -245774 -8047 941
18999 116604 37078 -238706 18202 -104452 -227167 -14239 -298617 36096 99964 -101526
18988 355755 -108553 295710 -113085 8191 110762 -214865 45339 -178950 -356704 -375921
18978 -375921 -133456 107807 -116967 -119120 -116521 144294 8250 29706 -75078 88594 -273354
18966 -48508 105640 13246 -116189 49958 7439 -67959 -281568 43536 -23935 -41431 161762
18954 -217127 -95809 -210905 -317816 185918 -376128 -480 143598 -47779 -392421 -21655 -190952
18943 -190952 -52692 -140827 121555 153100 -139141 -54248 255191 -299428 170633 -2162 148085
18931 -261484 56561 -27923 63737 -129261 98285 67178 1255 -9742 -130309 -164158 131650
18919 -118766 202435 -300314 -76828 119179 141795 -42571 -45766 165164 -48245 17334 -266411
18907 20280 -62870 236497 -172427 -187723 -207876 67034 -8169 -53472 106912 173821 -346138
18895 40114 -163379 229453 -135819 -355989 104038 -31857 28421 -586055 89159 -228629
18884 -133667 -73159 254910 -160225 13105 28812 265100 -133373 -145935 232707 65525
18873 29437 -198507 15329 -119182 -232270 -49333 -61762 325910 336223 63275 -309980 10397
18861 -174439 -160769 256442 -276874 257947 -56213 -228618 -149526 -107165 173918 -136025
18850 -28017 84392 -112069 168116 117714 127151 -61951 -241092 -56649 199024 213822 -79065
18838 -119623 203165 -124930 -203717 -100807 -219845 -452509 57667 -108257 79109 -256619
18827 -75527 152682 -31611 109773 -359644 85006 -84404 -118492 -24497 25799 48837 271684
18816 271684 -238314 64991 -265703 -160841 216708 -56676 159771 312120 -98638 -121607
18806 -121607 255615 -102664 -187004 57361 -393066 -60047 192116 -311918 -17209 -131142
18796 -131142 -68417 -3923 -92942 166724 112875 -561101 162263 -72658 180413 270047 109648
18784 -100451 -69531 -174160 -17554 -171096 -296224 159726 11781 98048 303893 -27705
18773 -284377 -74758 -13700 -18536 -58679 81012 -134293 161841 -264944 -389239 12028 138539
18762 138539 135874 -88381 4429 -42460 -98249 -147638 -252766 121061 99077 -38908 -31016 -155070
18750 -155070 84655 -243734 99968 -54822 177280 -10637 -221555 -13812 -259099 -249367 -19721
18738 203593 -31670 41147 -93095 -4857 -220146 233327 21852 36733 -38600 15489 72958
18727 72958 36632 -42454 -89684 -36958 -145663 10581 122779 -123112 -315695 -376967 -45786
18715 -123471 -102662 274527 263900 -227764 107206 -134551 100444 218136 -99587 -123350
18705 -123350 -172636 91845 172223 7674 -77589 4720 97270 103621 60058 -46059 36466 -189674
18692 -239348 -453961 -467729 -476739 -145073 -362705 109522 289841 143512 -135656 -55386
18681 15724 153107 -62281 -121906 102102 -321356 295134 -3332 -124285 -236812 129813
18670 -105616 111578 -179036 -197072 58910 -63852 -81124 3411 -167873 20257 38531 48004
18659 48004 -181329 10174 -115121 -185968 -149663 289540 155906 123862 338738 -200121
18648 -104231 -12996 -209711 64211 -4497 211237 -240185 47255 -28436 193436 -180533 115322
18636 -8703 38399 -146716 140537 -233593 -195908 -132718 -149321 51557 -109759 -249401 162059
18624 -36089 153576 -363240 -154735 27117 -116387 -161306 216485 415166 -37432 312236
18613 -198174 -178718 -147935 19306 -142863 -351869 -42745 -129432 -439457 -2534 -188810 -296422
18602 -296422 -294579 -125772 72205 -77361 -236617 336397 -7688 2832 -246942 14109 -248086
18590 -95747 -81102 -175676 -161441 -346747 -120441 -7312 -160059 -26278 -49330 3153 -124790
18578 -227968 165268 -285134 110355 -15113 -207226 -72389 -534279 166595 171692 48982
18567 22327 -134 -112812 -135615 161801 -194446 -85841 15391 -139483 -88196 -69979 76041
18555 109464 -62287 121295 47997 -61817 -103101 -339591 84896 -54837 -350171 -222519 102628
18543 33281 330045 -47562 47381 -91254 -103496 161593 -187671 -54053 -195215 -144768 -318794
18532 -318794 85002 -304762 20700 -26899 -40282 35974 -82098 94527 -60551 -308105 166456
18520 141232 -145822 104546 -284548 28147 -182435 12713 18828 -214408 158771 -130629
18509 178704 -209493 -124456 -133136 308912 -341105 -117478 -59916 44466 -275586 -254511 188177
18497 -177378 -212107 -132269 375368 -383751 -44698 -228011 -260120 277973 307176 85897 31029
18485 -11314 -379464 55221 190268 -12468 -67429 -169952 15723 -84333 -48438 -51163 -53773
18474 -53773 -132992 -55367 -138392 113561 96262 -59039 23824 -98269 -112475 -27358 -240149
18463 -240149 -316148 253740 -178723 -3927 -50097 -216646 98856 -443680 267069 -243655
18452 -73559 -92105 -37804 -230467 -396572 40621 40821 -339739 102936 -81063 -60210 -218157
18441 -218157 189675 -130297 -294803 23582 50403 -218229 -137030 -113051 10191 -123159
18430 27111 91482 35740 173928 -179843 222454 -80006 -116595 -18992 -70444 28995 139718
18419 139718 -197861 -101964 -294492 207756 50196 315084 107948 177450 -69068 244542
18408 -33685 284458 -99840 66093 215507 -63705 -172273 164935 47843 151298 -401943
18397 -117372 9439 -187315 223278 -219063 25961 -175214 43571 216671 -48142 -83865 -49086
18386 -49086 -352467 -99507 -24459 41600 -113250 61276 242721 -636 2318 -190045 -173086
18375 -173086 41104 234981 255239 -26637 149510 61799 -65553 90405 -181220 8254 -149501
18363 238410 -223086 121699 244066 103396 68636 -308483 -64867 658 -324779 145157
18352 -145508 -207079 95399 -122119 -76869 -147459 -48393 111853 -47965 -200140 298249 -154141
18340 -50267 318815 89266 251408 -139657 -91005 8262 -210650 -114417 113282 81916 -117105
18328 121045 -241518 7545 -215562 -177874 81056 -360674 -59950 -133294 -76880 -71077 -183914
18317 -183914 -229643 27992 107404 -138744 -135500 -259328 -238506 -181193 -314286 203260 -204398
18305 -62906 86120 -83595 -14711 107517 -175610 -67126 -125385 148571 -227386 -63722 154878
18293 -93284 27909 -131184 -179901 -23073 261524 -230453 217573 112618 11775 -524342
18282 -16716 -229066 -63573 -261436 -87159 -73952 60739 171377 -219246 21009 109667 -30652
18270 -38456 -138432 33047 -148646 -53467 116671 177498 -76934 168974 26035 127762 -279137
18258 24577 79993 117737 115168 -53470 -195680 56107 -152410 -263656 116623 -29448 146076
18246 199984 167467 23538 -139382 179407 128559 -61068 -57114 -356462 -144972 -1760 -207543
18235 -207543 -91437 46080 152199 -14781 168313 -37995 121665 -166564 -51627 -68968 -125030
18224 -125030 -246405 -107033 -308379 293213 -176686 -102941 -159217 -12259 71025 128901
18214 128901 339734 93450 -268995 85420 -63202 -396853 -78267 -430690 -60439 -101096 180808
18202 94933 -143585 -159586 75636 96011 118135 -56435 -114907 -375164 90285 -28193 -280126
18191 -280126 -169499 -152147 -41593 -238014 128059 -99901 56023 -244761 -68736 -19120 63150
18179 -261483 -49090 -275738 -87372 -70906 -256447 -116462 -205933 -214213 -296783 -148694 -73799
18167 98174 126863 -163954 -395397 134518 110218 117126 69709 7988 2472 53130 2326 79171
18155 79171 -251180 60128 68626 76751 126589 -63385 -285945 -337186 -36246 -82324 -179030 102443
18142 -164459 -27265 78089 -113344 97328 133541 37164 8719 -290224 -238108 -467224 -323932
18131 -323932 253331 64584 -263611 209552 221668 184666 -106730 50849 -385716 86802
18120 -143920 -127454 74220 -170665 -174613 -61285 224386 -18897 -259849 19065 -171068 -17920
18108 56666 228007 -162641 -82472 -126618 -264449 -174488 34256 -89316 -74178 52322 38989
18097 38989 161420 213402 7653 178731 127841 48171 -267821 -75535 81990 -279075 -175952
18086 -175952 -21743 52502 -140785 -135778 -83909 -51969 -10481 -47373 122805 232075 -57031
18074 26399 -181416 212337 129068 4579 -380528 -122967 -144585 -173847 114729 -787156 -259646
18062 73653 29707 293866 83696 12212 46426 10482 256827 -215114 308228 157887 -251860
18050 156823 -107416 -74488 95784 -137010 -90272 117458 152936 -56728 -310893 174134
18039 -33452 -99722 4982 -10227 -21427 113144 45694 -349565 -20292 74369 90674 50123
18028 50123 96688 -296436 -1506 127499 -92658 72160 -49511 148947 -190303 -42498 76249
18016 -15245 -49930 111809 -276732 -13789 169135 -3188 -17019 120045 131938 -33910 -399899
18005 -399899 198246 -105183 -171455 119852 -174156 13641 -25240 -256116 -99615 21112
17994 -36107 -86204 -104052 -222637 -89269 -132173 -47172 -68078 -6802 9510 65260 91003 13072
17981 71586 -130664 -31625 -89160 5674 -43804 -129063 17905 -124815 -232741 -55800 311561
17969 -81100 -88193 236496 99204 102695 -251865 -133124 97861 68571 -133552 -298830 -152339
17958 -152339 207063 135929 -235437 -274911 146292 -352554 -195545 -180231 35099 -148480
17947 -49528 -121360 -180802 -322659 -179356 -30320 -227113 -186482 657 -215234 102342 -62356
17935 -26350 -230733 221695 -237089 -238345 -306091 -80788 145232 -274269 -117128 -261637
17925 -261637 -16287 -142287 230605 -199539 201211 66877 -122007 179906 15549 -152309
17914 -250595 -71332 -164151 -181423 169610 8662 130543 361454 -21022 -48803 348464 -329010
17902 -63018 -3289 79668 -237703 -24379 -130125 90599 -250990 -273820 -60478 203551 85572
17890 23738 40085 177634 -175083 -114943 171699 46617 -254184 -101549 -83797 61396 74782
17879 74782 35566 -49097 -27496 -90020 85851 -59887 -4839 60459 245112 204343 19724 -106834
17866 4763 132926 25533 -200087 -14501 -83969 -104099 18312 -173003 -207903 89435 269760
17855 269760 75877 -41895 -30373 -55810 113886 94835 13799 6009 -85526 208973 -168404
17843 -484338 205830 -79215 33004 113655 -102064 -85947 53769 -160074 46737 307653 -146620
17831 181089 14713 -6762 149153 -127958 -111061 -23234 24354 204278 7078 -117553 -110664
17820 -110664 -75880 56360 -126496 -16796 -100897 -203402 149120 -247823 -138370 185660
17809 -97317 -111453 16996 45311 86422 -127211 1904 29757 137134 294933 -212700 -44889
17797 -24184 10518 431294 72312 48925 4182 -58744 208407 293733 -31406 113575 -200352
17785 -153857 -15630 -86561 -322905 -114691 -167093 -290425 -181600 20191 97162 37145 -40180
17773 -126131 -110493 -209663 155500 122136 86263 98632 -92341 -43477 334554 75614 -187299
17761 -49321 -141009 443646 -12302 -107232 -119211 -43618 -252281 11063 429867 -85403 52290
17749 52882 400837 137864 -200181 50434 120261 -291384 -203711 -330404 -141585 -277961
17739 -277961 -91501 178510 48839 -274636 -33762 -282294 194864 285503 235850 -227638
17728 8336 -50367 324850 303588 4012 308285 -212116 43926 155562 -84588 -143873 31988
17716 -157363 123543 270581 182862 146732 -89249 174939 259912 152975 -152705 144167
17705 -9866 143026 61502 70567 -191316 -72048 -88749 42232 -19294 -8166 7043 382858 -142913
17692 15662 -46877 -162207 352156 386187 -152790 141063 -183568 74371 36109 -127864
17681 26185 -173933 -138487 -297378 -153013 -87371 220829 -64806 -185560 134305 -111676
17670 -103206 -156186 24810 -24838 -30736 -594932 90955 112175 -269699 17582 115250 51078
17658 252872 154913 -211927 -14453 -160712 11080 70664 -146621 85620 -76147 -32047 285536
17646 -226484 -180400 259418 -48601 189660 -38641 -43573 298953 2965 150692 206758 -63531
17634 -34461 16664 -123716 66584 159425 297574 2314 -53083 247299 89237 -75934 270237
17622 -103457 -217 -55431 -42152 118777 112521 117200 -171341 35545 -93581 -193608 359865
17610 117948 134922 80650 -92375 -130747 -59093 -340349 -25513 28919 49520 227137 13866
17598 -581 -34187 178612 -536379 -118656 7558 148506 48435 65036 -1632 -115649 363448
17586 232579 -9104 -33726 -195005 -61220 181068 -163078 149319 -261687 103409 -322651
17575 75534 -276899 54226 204833 167373 105754 284423 -83129 -24239 -141273 -169445 74256
17563 -232242 353137 138880 -190879 -254226 155496 322296 -162431 -74731 74405 236521
17553 236521 146030 -162667 257357 -15311 -25848 141963 58770 -131746 241357 172889
17543 172889 -146024 -42307 -16919 261060 -412123 274096 -31353 173512 279172 180867
17533 180867 -159313 -84221 172233 -261625 -183947 293146 177449 -134120 242829 13838
17522 292729 12480 -55903 238899 372420 19470 -81643 56276 -13818 444017 237005 264361
17511 264361 27392 299263 47166 5742 103102 324243 222358 190700 34363 10617 248737
17500 248737 -66188 131276 144126 53374 75406 177306 -166177 57402 -113264 238212
17489 150128 206193 -123265 -59102 -57013 -157872 -85357 -111199 146088 46664 158463 112895
17478 112895 64771 -173257 286062 74544 -75561 248235 159588 93670 491658 250288
17468 250288 56587 -120558 -110274 376675 129391 -546506 -89762 227396 79409 -170815
17457 164144 76080 44910 187424 224586 198810 373395 270200 491972 94345 161657 173579
17446 173579 290930 348365 113664 362344 206169 55728 258042 123505 165691 395492
17436 395492 350824 403337 265235 62359 204788 160176 5734 179348 266810 414377 58231
17424 376461 457662 105921 175049 -104582 278945 39209 588966 366716 -24585 155903
17413 501811 559596 137073 183422 49056 199288 -42221 169919 278948 89612 61869 265511
17402 265511 147983 -25392 146431 239304 -299197 301861 272953 202219 -58378 212491
17391 51680 549305 49763 206910 183427 316674 311632 157482 272484 158164 311331
17381 311331 -97469 -258667 -7790 262004 326698 121916 66292 190001 410430 -28311 121302
17369 19861 -232126 262961 276957 31045 -35624 251664 216226 -93508 -50453 30058 140102
17358 140102 38931 -170690 324072 250318 253035 225155 -30985 131491 228271 841 183966
17347 183966 -152719 23386 130670 471132 148694 481711 255071 52386 123285 146962
17337 146962 231187 51633 48480 -195883 95520 -301721 -45312 453051 236911 199149 85087
17325 134135 104301 -181103 -104239 -30149 264073 74579 302630 369948 -326008 325551
17314 341204 112247 -45479 -44230 54763 269500 210690 161007 144002 172087 138538 236075
17303 236075 -110478 301851 -92208 323997 -138510 354842 77758 385086 193394 -135397
17292 423043 425090 9569 96989 202271 270543 29583 251459 116778 1605 28596 201768
17281 201768 164285 305842 85965 332361 235320 324504 219534 -47758 -44229 -44204 288820
17269 193696 -276015 256962 -34241 376451 12063 72267 411039 -10614 -115743 469027
17258 -67866 137188 -113440 221831 -134520 19850 167426 102876 118583 43501 126896 -70467
17246 469104 40973 -378192 228773 103906 147581 33092 505707 234422 197761 82231
17235 287924 -128552 339610 258437 125376 253271 123735 198226 223641 163027 -48471
17224 168151 92502 323624 237381 -35376 57847 391143 214293 140357 110441 253577 94638
17212 310870 235461 208108 157971 437817 34557 433717 353641 538384 193287 92476 208027
17201 208027 255189 362483 396966 208832 435638 314115 104714 355944 342625 133595
17190 256554 228145 161640 94944 142876 199683 56380 101055 461053 389073 168414 195573
17179 195573 290251 449557 370893 425083 277142 108737 534890 451157 355310 462483
17169 462483 152922 244795 487524 491113 719327 204420 134963 -1483 392572 172964 200253
17158 200253 216740 453497 520636 49578 221050 137560 679245 125902 254295 583253
17148 583253 673 -124632 383006 441581 229182 -58121 188265 416639 246093 252988 331653
17137 331653 275670 115587 30512 493713 3463 269604 107756 111870 506443 485643 707697
17126 707697 -71763 352494 432598 494229 355562 160165 310341 111739 515904 215259
17115 358102 87968 363023 326088 357011 228419 -107624 219248 437714 246960 15811
17104 77132 278766 415182 452652 335675 626741 437191 589941 528866 186935 469579
17094 469579 -121383 260101 213000 17963 590479 735886 454682 346403 95320 439551
17084 439551 561549 514485 250872 333770 279830 306548 592061 286743 350459 269177 345589
17073 345589 279918 394463 643960 505310 455297 348875 288755 338820 398945 169484
17062 541106 560276 730443 314366 445369 348062 337150 682412 448205 219053 677755
17052 677755 427222 495592 761711 453084 510588 589333 426621 644186 443822 511282
17042 511282 617758 546818 674492 291705 630536 626660 640775 833977 708071 452475
17032 452475 510150 495203 551552 595265 694587 448432 364926 870844 809209 301637 555923
17021 555923 657473 490172 580405 626397 146649 722214 644065 369104 679328 326689
17010 814272 590910 640988 431330 802349 840453 608704 512268 625942 515911 563905
17000 563905 493987 1023287 685648 717258 418755 570259 568767 579857 541340 1031312 667418
16989 667418 778039 675966 748783 443219 564704 540133 788468 649160 555681 745016
16979 745016 454326 462923 691595 823577 646492 849440 912072 809164 768737 481877
16969 481877 843116 751524 754403 1052064 674291 945825 855641 756715 628884 1034008
16959 1034008 1332028 654743 975932 822225 807545 801186 861122 719678 970692 717358
16949 717358 1274872 880670 743492 882581 669909 1194611 1018208 1268737 1342451 876907
16939 876907 807452 1212074 920854 966194 960697 1051488 828641 1013916 1315035 1221881 1243531
16928 1243531 919739 1279818 1115449 856023 1490235 1422951 1209140 1278993 1015263 1408809
16918 1408809 1110857 1299770 1449868 1484413 1174745 1314817 1203782 1491232 1713545 1707505
16908 1707505 1343955 1382842 1546467 1739720 1653378 1408992 1542462 1747389 1883690 1247652
16898 1247652 1687648 1708387 1304881 1867362 1639524 1543155 1897772 1666501 1693287 1701080
16888 1701080 1972805 1643726 1687370 1955214 1915268 1989621 2169756 1986248 2099437 1854694
16878 1854694 2015351 1959667 2171720 2130908 2448156 2349924 2331364 2477784 2179755 2553232
16868 2553232 2112788 2421876 2157300 2454144 2611591 2590878 2242283 2803380 2583850 2519031
16858 2519031 2803182 2890809 2666084 2443139 2837604 2908909 2942483 3128450 2701073 2823443
16848 2823443 3085575 3069678 2799735 3099785 3129143 3234508 3520523 3380152 3560631 3347288
16838 3347288 3486709 3337975 3476906 3422037 3869438 3754985 4015406 3901041 4024211 3775099
16828 3775099 3753044 4097380 4530744 4142715 4296650 4162973 4488201 4996979 4669410 4551708
16818 4551708 4915379 5296269 5140708 5127063 5272271 5342770 5423492 5483613 5531271 5816900
16808 5816900 5777687 5912829 6079490 5865612 6401366 6184742 6719344 6765079 6945822 7071926
16798 7071926 7068153 7410676 7211936 7695711 8066429 8150810 8292660 8378950 8759819 8907095
16788 8907095 9080260 9484117 9536436 9723922 10663380 10398611 10580418 10925292 11387616 11631802
16778 11631802 12107250 12493635 13003303 13103628 13487819 13752779 14564554 14640053 14962790
16769 14962790 15837901 16244220 16893726 17749814 18211910 18488628 19434688 19878759 20937610
16760 20937610 21651125 22404396 23527239 24264299 24998323 26469264 27128867 28471496 29726082
16751 29726082 31271790 32743324 34494525 36006960 37535254 39526874 41662603 43857178
16743 43857178 46009047 48542029 51025121 53649796 56953437 60185559 63663940 67432008
16735 67432008 71345329 75691120 80512145 85794956 90843084 96588901 102708440 109267895
16727 109267895 115893247 123415616 130626654 138413803 146319993 154442545 162330345 169736967
16719 169736967 176842856 183601210 188830734 193516004 196984355 199117635 199984624 199237534
16711 199237534 197068557 193949713 189200233 183095293 176916546 169734667 162094002 154072251
16703 154072251 146096155 137767124 130011170 122104332 114638326 107821719 101009060 95016836
16695 95016836 89317955 83875525 78534368 74036660 69537641 65304742 61678723 58118042
16687 58118042 54827708 51830091 49083693 46336597 44142128 41871764 39812739 37805627
16679 37805627 36101160 34218870 32521524 30633309 29795992 27960457 27148482 25618400
16671 25618400 24959334 23438746 22688968 21723023 21228438 20338828 19419297 18708171 17845755
16662 17845755 17387158 16766166 15995721 15850323 15039703 14428343 14099346 13189235 12671906
16653 12671906 13249851 12529516 11823032 11740926 11195357 10916924 10587874 10240677 9838543
16644 9838543 9631037 9673760 9179722 8959859 8790597 8755488 8212773 8079021 7983556 7370255
16634 7370255 7395920 7288658 7080263 6940081 6402073 6622612 6434053 6180714 5948902 6154546
16624 6154546 5980711 5720407 5597074 5412448 5419768 5317204 4975121 4726736 5071714 4618858
16614 4618858 4579552 4190387 4329351 4593713 4322393 4423367 4005026 4094933 3798122 4154829
16604 4154829 3856911 3810361 3477087 3387222 3498604 3480460 3263161 3154371 3348117 3232601
16594 3232601 3201201 2570987 3211205 3140289 2615487 2828537 2754500 2726959 2858451 2653223
16584 2653223 2727922 2620486 2362722 2583501 2460811 2250794 2345449 2538216 2134529 2302038
16574 2302038 2450851 2128200 2240788 2105355 2104899 1908554 2145800 1902644 2189978 2055979
16564 2055979 2113338 1913739 1974453 1543034 1890478 1943715 1379913 1554193 1595146 1989096
16554 1989096 1859874 1552531 1406416 1609466 1464713 1737157 1227433 1401967 1518179
16545 1518179 1409910 1536488 1480015 1422646 1080382 1228431 1344733 1544376 1332027 1428078
16535 1428078 1562127 1067654 1611533 1185333 1079225 946967 1233924 1557814 1379483
16526 1379483 835642 1048292 1064846 863852 1374984 1024962 1227117 1270067 1363176 1097124
16516 1097124 1220994 1086523 992073 995515 1240311 959573 1162710 910323 1190520 849971
16506 849971 1072148 906857 1022654 938095 955969 796813 1103755 757508 814346 1133567
16496 1133567 1027143 957480 1137766 809898 688349 672846 775054 712582 501103 714349
16486 714349 503555 816018 639913 1047983 560496 693728 513252 500150 597763 889093
16476 889093 811803 788426 493383 727364 670719 623320 791518 444896 866367 474241
16466 474241 632219 592722 770004 637588 500801 733598 703905 641336 661236 699454
16456 699454 329634 412399 778077 579544 798552 548066 516313 468967 774739 440805
16446 440805 379293 680901 503320 368700 319514 366293 759840 597185 194226 527112
16436 527112 329560 517003 549209 499984 715942 531817 600825 232847 604636 601952
16426 601952 453575 413192 508345 302214 416788 726675 -40963 757126 823790 450914
16416 450914 195870 148419 161829 339194 533023 97133 311404 532573 214818 247290
16406 247290 300908 453104 399089 308874 239585 430627 245135 435479 294422 530053
16396 530053 259495 442554 517912 225219 78531 405000 327589 304911 348377 456843
16386 456843 126855 655939 428258 216033 326291 262138 340911 212797 440992 34358
16375 374975 439423 95226 245100 210581 107056 398956 131853 368149 -5660 206359
16364 10820 374064 -5252 372519 53568 161338 438681 88798 -172696 183215 375689
16354 375689 569143 -250280 202791 270444 121178 164451 299458 373850 417347 92360
16343 69814 153889 463038 -4205 110760 273326 144012 149784 284798 486252 266141 145246
16332 145246 -161779 48004 -253288 238682 -13877 -35763 121323 107627 270699 -101760
16321 433718 -299683 216520 -73434 143051 126089 265230 363023 178908 196408 104783
16311 104783 -72697 28457 192930 111770 -111689 -149446 -37389 122804 221907 246928 -31796
16299 -388567 276323 163920 81886 3154 124231 278066 64710 253583 81848 -150448
16288 -189885 101208 -23257 2723 184984 264162 -231467 191715 152698 240179 124557 -52488
16276 185711 342616 127834 82240 66568 181098 350231 188928 48770 -2923 322958
16265 144462 86739 -177001 143073 128448 134194 39569 275401 171395 -113026 -74508 -173518
16254 -173518 273140 179359 -73987 24609 307787 -75469 370887 -16703 -21084 -140853 125341
16242 351811 186629 4835 207353 80031 -2147 414893 167901 220170 4080 47147 150629
16231 150629 -105709 -136669 -3714 42744 -143879 -73667 -29 -105893 42163 538351 91263
16219 173206 36269 291269 -24491 -62185 -43223 16838 172723 166115 172419 72267 181 298947
16207 298947 -87648 32498 -24845 -238703 307105 231896 138687 229974 -37746 -231396 -82509
16195 49944 203039 68305 -48621 -135604 14642 -181976 -8184 209838 29560 -88858 20038
16183 97970 209152 -405337 197363 -104413 -244727 301979 39490 188624 -171306 24578
16172 367202 -11352 19091 208521 -46486 59742 -76297 84516 41197 -475080 -236784 -33982
16160 96794 -263085 21092 97544 104312 -1134 163828 182262 152029 45595 313305 232620
16149 232620 195483 280623 -74656 -355597 100024 146262 -21358 -103227 228768 -158479 8345
16137 32789 112035 -17320 62602 -160444 -161670 -199541 -139326 102389 -407597 129031 307117
16126 307117 -168601 49522 75448 -166553 84300 -61646 -1878 -306726 -125801 244350 20171
16114 54451 -164558 -54660 -109435 -181875 18671 -39926 -1283 -83459 71392 30406 75245 -268999
16101 184812 -76947 15323 -67330 50545 -88196 132460 238886 116784 -34998 -219252 -265441
16090 -265441 -202825 -34898 274356 -119954 -213594 -376089 33628 -212473 -216693 -208815 191332
16078 133281 121903 123069 -71027 -125628 -63280 66449 12836 -74475 139389 189786 109969
16067 109969 -125522 -120010 153184 241913 98439 -167858 -132311 -179658 114159 446767 56758
16055 4885 144284 -33821 -89165 -64658 47301 -33352 132509 154332 48165 4299 -28797 31153
16042 -141614 53046 -265139 -27977 252521 -377356 -101886 -2674 91749 -26209 -304440 -59919
16030 -126084 153401 -171196 262519 146578 187854 -162883 109805 40245 151153 -198755
16019 7502 327492 -21004 -16187 123933 -353190 -10865 -143454 -30377 184994 -20107 -159558
16008 -159558 -4252 32587 49250 -260719 -29550 209313 239831 -326390 41003 276504 42351
15996 -121716 -100431 187677 106841 93152 -415890 264625 -54140 -447249 -152551 -69823
15985 75201 12254 290470 67395 456140 -16664 292144 106044 25472 97471 15425 -330996
15973 46458 101932 -346166 67036 4274 -49392 78811 -74487 -112873 -364543 -12280 -106952
15962 -106952 -5397 -251555 233529 -462377 -185699 -154443 -101984 244545 -306682 -142635
15951 137628 -11918 211058 -46399 -418830 -156171 178786 -173896 -233696 13583 29667
15941 29667 -182862 -174149 280116 -10735 -215732 150171 -43605 -175630 301880 -190521
15930 7828 45316 -90005 -67996 -138226 252760 -218758 156232 -263753 -66422 -257476 -256560
15919 -256560 111667 251982 -276535 -324473 -60266 -339524 55556 32698 -380183 -61805
15908 -264494 -33565 -52711 220337 146529 -34483 -64665 -285394 78144 684 -12279 -991 28170
15895 132832 -170163 -133987 13445 -21065 150578 -271385 -128326 2811 -355972 -257401 130037
15883 -34584 232358 632 -206418 165380 -40894 -86969 -244772 61844 -122682 -339469 41454
15871 -145689 -78374 54485 -80989 -128690 100539 131696 -156240 213744 246111 -97934 -129930
15860 -129930 18745 44359 30216 -451951 -105724 148864 -85326 -60686 -352659 27799 -121145
15848 -145588 -132083 -112259 -93426 -78912 2011 216489 165882 95546 -235905 -27612 -221988
15837 -221988 80416 -63175 295301 374024 -153561 213824 -309909 -29263 -405279 268298
15826 19855 62987 345384 -180513 139923 408928 270790 59058 133347 -48958 -260482
15816 -260482 98177 -10434 25545 -37522 -149193 -217243 303964 252528 147762 -122689 60804
15804 -191758 58602 -112398 -189678 -90052 -327312 -68289 -89669 15041 67443 444503 55667
15792 247291 -46627 -25659 281989 9012 -301171 -52444 1456 -214323 184535 -104261 -137236
15781 -137236 -133834 -403296 -275215 -205126 6638 16350 -175047 -102140 -227405 -211753 220328
15769 -226071 -99603 -183177 123122 50315 -42996 -27841 222270 -300583 194928 -29397 135730
15757 -240109 19402 61168 -79074 -42839 84030 347528 -12676 8965 67126 -39327 35878
15745 -122114 88326 -3946 -4871 27194 -63323 -31435 -43856 272492 -38275 -68153 226249 117266
15733 117266 -150641 7013 -76004 88788 -169198 105267 -6786 57794 -100278 212894 -1356
15721 -317405 -61247 -277485 -225206 -136908 -499520 -361515 -428769 22218 -423061 5453 72970
15710 72970 -69802 33412 -9911 -99637 -90056 111192 -248579 -131934 -134454 -242265 309820
15698 -143238 -99967 -313091 118505 -107751 251825 146500 8611 18861 184831 -30637
15687 30927 -2866 53141 -282044 55119 42844 26909 -168749 154881 35400 160450 14824
15675 35941 -2214 -384015 238998 -61107 -85620 -31714 -143611 174290 415424 -43034 151899
15663 44016 -145966 154798 4326 -58592 278722 144447 -97361 -84586 71832 -72513 25511
15651 -7918 -166751 36559 -18681 39964 319285 206929 -197325 10270 16404 -14978 -135067
15640 -135067 -327527 10459 -219345 -4127 -18388 118907 -214222 222188 126718 -148224
15629 -225370 248631 110885 395547 70927 185019 -73168 82877 -34953 -114954 -402872
15619 -402872 -127301 -198377 173621 98515 10391 126178 -256719 26218 -77205 -200104
15609 -200104 108745 -256885 -169875 -273912 -21691 -32364 -332866 -15155 -81470 -396703
15599 -396703 62283 55588 118085 28080 -24768 224719 121690 192640 -166566 -195750 146913
15587 37657 -95376 93296 -276297 -110201 311102 -227985 -93364 346737 -133236 -167662
15577 -167662 -70175 -282848 98209 -190676 -38308 122029 -232592 -310164 -161039 -34357
15566 44285 -7315 -29126 26361 -154924 -30499 152758 575041 113445 50587 -141238 -195863
15555 -195863 -18572 -259914 160047 286575 -168421 -158901 -129674 -43994 53170 -10107 -62624
15544 -62624 -38 -139701 193049 143345 -146765 118917 -14550 361817 11093 -15317 -74277
15533 -74277 -144322 -185412 -160593 -191455 -6486 65201 -242077 -177430 188063 56497 -258571
15521 166132 137123 -139320 -7134 173636 179102 -120529 10606 -278447 -191150 230350 81456
15509 353820 -254054 -527486 -12257 -151477 26140 231254 18035 -248108 -298360 -67358
15498 97467 36034 372012 57034 -77795 -105075 -243009 -178948 255428 -169413 -17627 113548
15486 85939 -123768 -55132 -303949 -128621 198829 149373 44281 192931 104938 96483 32155
15474 -4491 -99692 160653 125091 125307 -19179 291268 -218612 -306856 -41130 88160 -11820 226768
15461 -626 -490577 160675 -349756 58975 -14131 168719 -162440 40938 100228 -193581 136781
15449 162167 -97507 211530 -33866 -103884 49276 24205 -265284 -25637 -84775 170846 126607
15438 126607 -154067 133858 382 91901 -215777 310548 104874 -164170 230385 -162607
15427 198009 -211479 2511 10867 265029 -68763 -77010 45048 -148096 -110139 -16064 63055
15415 124415 -153185 56449 120011 284115 -113694 267411 -319887 -11454 -21856 -303846
15405 -303846 22447 -66594 -166234 129427 142165 -312235 -114063 254515 54478 -108509
15394 -105268 -268385 182567 -57883 141666 -38213 82497 -199280 -175754 -262077 392758
15383 -43943 258596 -394199 63539 -155827 109234 114145 198 -177808 -206158 -68907 167154
15371 188822 64722 -48978 160180 48763 195347 46882 -129100 61235 361337 -278152
15360 -102521 -72285 161139 -173543 49904 113315 193707 57867 -93688 -207149 1869 -104599
15348 -196054 362642 150548 -32949 -253396 229570 94880 -102101 94920 -129566 -53185
15337 348633 142036 -175917 -102478 -129874 -89063 -233419 272114 45433 -6176 117541 402163
15326 402163 445092 -95876 -54154 -100168 141105 -169303 42277 203202 -78949 115390 47351
15314 -113322 -169536 129495 22100 111847 -49820 145020 -252987 -225017 93207 -3347 174246
15302 14200 311335 -90342 84601 211561 -42329 122153 151228 49514 -68343 -24538 94792
15290 303455 -149836 -479817 -143614 -48544 -224067 249112 -267378 39021 -75749 40438
15279 -28893 379274 169081 -5069 251146 160279 -109324 212228 137862 69465 -259494 -149181
15268 -149181 198919 158864 210677 -32781 14535 30309 254004 -120698 -45607 -72799 -28508
15256 259572 63845 84976 382392 -16130 70708 -229658 259082 538986 1361147 1674568
15246 1674568 1244286 1244913 1276116 632411 25572 442817 -176853 67916 133707 145282 95898
15235 95898 206846 -51450 -143687 34964 -95410 359644 -183811 95730 59613 80185 20477
15223 62178 43275 69902 202162 -2597 -32295 100531 333083 216846 115465 299184 -11395
15211 228468 214197 132490 -87231 -107552 139519 162756 -57273 -16472 -108665 -409785 122566
15199 -142649 -39011 57230 342225 142078 75215 -84400 -419628 36628 252929 -39823 -296127
15188 -296127 18202 186539 -188423 -236692 232423 -55786 161245 -140951 110858 155105
15178 155105 -50016 202144 50314 -51244 194317 -63142 279328 -10140 180528 81604 -145793
15166 133097 205964 -239705 30640 -150216 365061 2771 69238 -186251 -193988 75339 91824
15155 91824 208560 18496 170027 271692 210812 -52869 -260462 -19474 14978 -74819 -276808
15144 -276808 119769 -87944 -48422 567246 57499 117433 336481 -321682 116458 190873
15134 190873 232012 -20770 351174 -287 70662 37923 73045 97861 26329 -73026 87537 6316
15121 148825 232465 347944 93839 56925 454863 461185 66005 250870 309666 -58381 -91774
15110 -91774 78212 -139593 340254 284671 114825 52515 -171533 -212549 25424 146179 286290
15099 286290 95076 -34464 291584 429404 38639 -201468 174956 131492 305392 235506
15089 235506 472437 -215342 -226256 51737 -137881 160436 240161 180516 67555 227965
15079 227965 204032 251849 -24751 25029 78734 36595 250729 178971 285601 361129 441872
15068 441872 -13099 79175 203438 -91879 138829 38898 168365 -96059 178663 282641
15058 282641 336207 90265 -31609 81967 7431 158475 135976 306665 133987 306666 141604
15046 456351 195520 -39897 258332 314781 -44144 407945 -200275 309835 311731 -48911 310195
15034 13476 205561 238676 244221 186944 479848 455226 189157 402 -77378 171245 403573
15023 403573 572785 271946 54394 -54227 -168942 424893 288742 439223 420936 173397
15012 352356 -141417 300215 278171 222983 224540 292736 -20967 45282 201598 -31718 345465
15000 351732 104149 287262 474813 180732 271349 300723 -20675 93247 404067 118669
14989 286741 485616 149543 267652 26639 121148 369984 181701 234763 252626 162675
14979 162675 226788 359503 259990 -196912 110832 95251 -23391 422045 146316 252527
14969 252527 328769 168895 -7459 457249 30261 75816 102422 392051 496738 825670 257616
14957 35840 193301 36002 251628 274942 -26127 108446 175326 351384 222234 110937
14946 306387 266275 -74388 454619 106173 472854 284377 290656 160769 32617 560197
14936 560197 246896 -32259 138990 334997 118432 193013 226443 218300 114912 107358 296166
14925 296166 300910 646227 341468 163462 324465 415826 58615 181174 191649 242013 298804
14914 298804 655326 352597 592733 178178 -79112 322189 497610 99910 235033 457622
14904 457622 293590 574033 542944 424796 372628 350866 100649 193863 256630 175599 531835
14893 531835 464602 320760 365325 489320 182018 189496 356264 63894 496426 323498
14883 323498 556933 100884 392069 294212 448417 69131 580385 453789 277817 141153
14873 141153 233496 355582 175549 254242 327140 499345 7705 596797 620435 373398 145407
14861 167369 22302 462557 522628 350730 488901 338058 345538 266404 241664 183704 675189
14850 675189 343366 491381 505576 548658 353190 433472 289763 553662 354280 135675
14839 701367 269555 584792 595124 151781 491897 388564 464622 323382 758675 318161
14828 646491 402322 413961 602494 544968 619209 322673 786733 348573 507701 327767
14818 327767 582858 344491 305892 530522 612976 442450 401210 475837 380599 626752
14808 626752 754055 278566 214129 696304 513457 751852 409753 170703 452304 686281
14798 686281 460977 777391 472931 593995 624208 526118 718056 114948 914454 459275
14788 459275 553867 414955 334238 722552 493597 810181 686752 348146 708196 276634
14777 888579 481150 501155 573338 584786 473430 665889 917711 676907 606388 764556
14767 764556 472001 891094 694503 473331 620277 504054 315495 425442 552404 728014
14757 728014 445327 380119 806403 521169 587892 943389 541379 829486 516719 1052637
14747 1052637 550599 843176 711211 660334 549302 882794 655120 308973 653276 787046
14737 787046 614157 628366 697185 967294 482390 604686 371718 866095 713272 661878
14727 661878 752752 796726 899753 871288 773122 755633 703526 989204 837845 636919 857879
14716 857879 573084 593813 807014 919228 1097375 989263 1094585 1000208 568560 926960
14706 926960 798850 454948 1138071 632699 995588 763468 692682 944743 791988 853435
14696 853435 816032 791278 996361 906463 681531 1105589 604277 796391 860701 1155648
14686 1155648 884943 535581 1025967 1112257 959803 940155 1023319 1046174 992065 908546
14676 908546 961327 827596 963717 1023163 756298 1015048 744616 1014522 1094126 884609
14666 884609 765709 1125248 1231208 1007484 1178359 1229042 995424 856657 873182 1147476
14656 1147476 1527646 1237838 1026073 962561 1132630 1177966 894575 1178613 1003982 1216733
14646 1216733 1066548 1067586 832779 997918 1370092 1231538 1022979 1412872 1402340 1002033
14636 1002033 1123538 1126543 1315698 1090913 1300970 1323038 1386385 1276990 1137707 1528441
14626 1528441 1486091 1415135 1504085 1357723 1379236 1683244 1422565 1107287 1292079 1543633
14616 1543633 1469021 1560605 1532030 1503156 1503061 1439592 1718262 1470432 1571264 1314215 1534578
14605 1534578 1334538 1489544 1526438 1739484 1718188 1347386 1656239 1299950 1525981 2056200
14595 2056200 1708357 1556628 1736391 1558135 1551301 1694399 1755043 1757161 1731762 1580565
14585 1580565 1475437 1834554 1843608 2006580 1832857 2110335 2187175 2092925 2049623 1910531
14575 1910531 1790705 1951646 2039007 2099021 2099601 2191081 2128861 2343677 2006802 1822891 2299580
14564 2299580 2343577 2697709 2645462 2480075 2643200 2754853 2713128 2824775 3309025 3310279
14554 3310279 3433732 3661851 3906182 4539168 5953777 8159589 14810745 26261003 36180867
14545 36180867 40843464 21701659 9959840 4481196 2669043 2287892 2162100 1975814
14537 1975814 1769682 1944476 1964697 1796504 2168800 2298208 1994101 1971792 2186599 2196713
14527 2196713 2103713 2485870 2332742 2430266 2311155 2526203 2686809 2697657 2460825 2441737
14517 2441737 2481218 2414931 2673949 2888705 2847530 2652379 2743453 2783918 3026109 2710567
14507 2710567 2592064 3016606 3040144 3179058 2913595 3039526 2820397 2821820 3160956 3246383
14497 3246383 3454320 3496124 3336177 2940042 3346871 3374882 3498198 3295291 3799933 3288736
14487 3288736 3169851 3391435 3586047 3745436 3603132 3534345 3597298 3519726 4165732 3824565
14477 3824565 3676327 3885741 3880106 3984992 4106433 4172190 3963491 4121476 4342820 4343305
14467 4343305 4375249 4451766 4645174 4458890 4547006 4661997 4757091 5111162 4282228 4852936
14457 4852936 4816772 4970461 4972342 4948079 5222720 5398268 5695666 5379043 5462708 5641563
14447 5641563 5527512 5274920 5824994 5911154 5603916 6211283 6139947 6264780 6219717 6229627
14437 6229627 6133580 6434017 6222877 6452246 6407604 6805217 6629769 6797181 6943549 7087588
14427 7087588 6907829 7138130 7618707 7376939 7476623 7697648 7863563 8140893 8029420 7921831
14417 7921831 8219609 8648129 8454671 8907935 8627602 8475497 8984906 9152334 9004246
14408 9004246 9684615 9426672 9659296 9595416 9849545 10290509 10441493 10410341 10299202 10753925
14398 10753925 10661580 10994239 10912020 11233227 11744512 11425813 11730104 12141387 12072609 12484903
14388 12484903 12855068 13084838 13018688 13135109 13714386 13805496 14291567 14348680 14709415 14606181
14378 14606181 15058948 15356964 15831784 15995495 16329169 16711189 16968882 17155449 17709860
14369 17709860 18066118 18304322 18431089 19247623 19548599 20000827 20599247 20782731 20958730
14360 20958730 21925371 22312708 22655370 23172537 23727593 24427371 25026300 25558746 26258343
14351 26258343 26682761 27431774 27749866 28617735 29195807 30528633 31183342 31585788 32841917
14342 32841917 33478060 34352603 35219143 36495035 37654355 38550823 39887763 40668118 42279615
14333 42279615 43245921 44626582 46132502 47368436 49115365 50279144 52015029 53547974
14325 53547974 55331337 57605193 59863183 61713067 63897890 66021940 68520502 70996798
14317 70996798 73679345 76880953 79114536 82720174 85908484 89444761 93027522 97166333
14309 97166333 101136610 105492530 110248708 115127189 120325166 125891773 131788630 138270098
14301 138270098 144707204 151656417 158907043 167631838 175606939 184517455 194062516 204420513
14293 204420513 214471034 226000400 237606543 250027593 262873765 276288674 290174687
14286 290174687 305009687 320094347 335102615 350501917 365681865 381257357 395891628
14279 395891628 410275363 423310530 435710016 446349396 455081110 461951475 464929324
14272 464929324 463289271 458511832 454543195 452413191 452020419 448800927 440280558 429538360
14264 429538360 416794599 403376449 388967573 373826381 357812862 341960001 325977789
14257 325977789 310484745 295527820 280876885 267685917 254575791 241556254 229353669
14250 229353669 217926497 207065174 196878953 186857789 178026028 169363943 161503871
14243 161503871 153845776 146254725 139626850 133364961 127164986 122151861 116869282 111698789
14235 111698789 106718135 102044617 98304492 94553944 90863383 87128408 83843422 80499649
14227 80499649 77767885 74615513 72190071 69213081 66769815 64168236 62622986 60300515
14219 60300515 58602103 56035340 54658952 52714671 51041882 49586662 48188562 46777675
14211 46777675 45171954 43595825 42686927 41480683 40553693 39503214 38319172 37152395
14203 37152395 35996481 34954081 34367319 33970505 32715344 31945797 30960512 30062476 29403082
14194 29403082 29154962 28117342 27582116 26570459 26215770 25526880 25126779 24201494 23985547
14185 23985547 23389770 22242405 22098926 21753701 21233023 20550242 19899714 19849661 19379742
14176 19379742 18960408 18451932 18194323 18005200 17784132 17253131 17096423 16768369 16273122
14167 16273122 15952473 15336805 15387585 15452085 15110612 14294219 14295025 14067697 13811182 13637303
14157 13637303 13381865 12844221 12818367 12924858 12399361 11966898 12088969 11733169 11461220
14148 11461220 11378367 11586014 11057076 10949450 10923083 10689209 10638178 10018962 10467310 10083122
14138 10083122 9799441 9693030 9322198 9483422 8936745 8973832 8888198 8579649 8476499 8538497
14128 8538497 8660124 8309175 8439253 7914001 8253250 7807776 7565164 7657752 7724941 7364917
14118 7364917 7491011 7134036 7146552 7088608 7080741 7170348 6750878 6775893 6551713 6476306 6078660
14107 6078660 6290404 6574108 6086333 6539746 6338388 5920773 5785341 5720154 5757784 5820457
14097 5820457 5662700 5543321 5660057 5560045 5594692 5488656 5454348 4899410 5382008 5255750
14087 5255750 4990243 5157728 5073992 4925877 5072348 5068773 4861869 4534385 4765709 4677293
14077 4677293 4698225 4728549 4744143 4405409 4450414 4412049 4111067 4492483 4226402 4356099
14067 4356099 3936091 4008226 3879441 4293659 4377388 4111369 4223231 4340599 3986967 4066146
14057 4066146 4277999 4178720 4061152 3929914 3579238 3546456 3522731 3410262 3643435 3373027
14047 3373027 3355453 3277026 3513974 3461104 3644615 3678607 3385932 3216311 3077635 3011891
14037 3011891 3075949 2950050 3214227 3155772 3188830 2846609 3138187 3065759 3038676 2789064
14027 2789064 2696023 3038939 2674430 2760109 2837178 2724736 2702141 2781127 2530912 2513116
14017 2513116 2768741 2372029 2564094 2309088 2528648 2546043 2436320 2567651 2757507 2709288
14007 2709288 2036359 2261249 2276272 2523457 1963929 2361653 1942050 2181934 2079842 1826513
13997 1826513 1909035 2216001 1823467 1934195 2161853 2397920 2293701 2481159 3722788
13988 3722788 8683891 19993080 31782746 40577799 25456127 12511637 7536038 5714266
13980 5714266 4627978 3772154 3680988 3217031 2945600 2888472 2869318 2639126 2539666 2291206
13970 2291206 2497797 2147432 2512689 2360535 2057001 2142018 2067052 2161896 2405604 2071772
13960 2071772 2212014 1924837 1857714 1799576 2039091 1742978 2002488 1788107 1945704 2157596
13950 2157596 1960430 1954862 1719924 1625710 1885606 1678209 1892455 1429702 2103040 1717894
13940 1717894 1593078 1574529 1667686 1745388 1581960 1470311 1642218 1519660 1854555 1579539
13930 1579539 1625417 1816766 1163299 1561429 1600765 1611639 1681852 1643213 1763023 1560297
13920 1560297 1566876 1382911 1466168 1336631 1611529 1635890 1353172 1299486 1745979 1244638
13910 1244638 1584750 1419622 1513717 1230232 1591413 1616474 1406006 1557420 1451277 1586570
13900 1586570 1401661 1224298 1040668 1425644 1340053 1224831 1333900 1260398 1367101 1375492
13890 1375492 1470748 1257752 1220132 1529148 1488402 1002412 1425266 1158859 1295356 1243306
13880 1243306 1363774 1115138 1308609 1185033 1173299 1201962 1366556 907102 1194219 1444064
13870 1444064 1046045 1173784 1215735 966355 966826 953319 1229422 1183451 1064701 1040522 1174150
13859 1174150 1308025 829762 1135498 962636 1096218 1112264 1166212 1168313 1174213 1227642 864883
13848 864883 1033314 674803 1153716 1064401 1216724 1127616 843928 959457 1003324 1312505
13838 1312505 1175351 890748 1305985 1114198 796516 859444 598033 1058846 833724 899447
13828 899447 1140645 1314192 1155215 863180 996733 727339 914002 635566 931476 800672
13818 800672 801109 784606 1016609 965376 905251 860320 840085 943957 539824 835013 956451
13807 956451 815076 691980 1091957 898657 908237 713114 506684 1001482 809445 719285
13797 719285 801645 890655 811916 730030 1055471 495887 774933 1153082 874302 859616
13787 859616 775098 763193 750150 773339 719489 217266 893949 506485 762889 680323 476693
13776 476693 772371 734973 528607 495659 955226 712749 677207 837466 683230 912354
13766 912354 744839 1060151 606057 844965 598848 546625 573464 768980 687383 626518
13756 626518 515590 574652 994632 394003 411321 769732 649294 670179 368705 742465
13746 742465 890311 413104 435665 577472 628081 547101 496299 221205 249888 493483
13736 493483 577371 497983 330315 642006 184122 370409 463781 592374 797475 602078
13726 602078 400188 560451 429353 444534 399459 962361 523403 486596 702223 443883
13716 443883 501361 600006 852779 837439 642657 502539 690220 474984 548099 297913
13706 297913 660333 750445 456469 342063 565363 519684 381954 501960 345768 484078
13696 484078 79012 566069 628597 330188 660931 656340 511540 549229 568302 372153 278861
13685 278861 449944 390985 473849 615214 555691 634529 393107 640754 601097 811378
13675 811378 323759 399906 618884 345049 219562 710787 320034 188772 225714 402133
13665 402133 401140 628611 544911 568989 592907 436714 399812 538566 638385 372131 420474
13654 420474 710036 569431 500210 470591 385432 421723 444628 324191 578586 508528 306102
13643 306102 655183 -30524 736873 308413 182497 344866 341069 199793 396962 71030
13632 315022 437172 509029 360581 626460 403155 237510 400817 488256 501564 296485
13622 296485 588641 322544 295684 405188 239946 319254 369290 430060 475453 500808 264960
13611 264960 215798 468395 444647 277118 372022 378230 561145 249999 475987 274167
13601 274167 442750 479717 649534 -44594 705048 323619 356395 382701 228613 193685
13591 193685 67594 335825 160391 430731 513027 301724 316162 405069 463754 522789 504867
13580 504867 412939 581748 120353 565072 391217 -38393 305112 141668 111439 397091
13570 397091 336584 223664 123814 385264 196610 464462 313071 424576 400940 356306
13560 356306 279395 183053 338331 275082 303504 491387 267556 235326 222899 463544 165663
13548 278626 329882 -91731 464426 362597 225405 195154 157290 394657 539179 137641
13537 254434 326731 422471 249188 300028 185577 98382 431159 181529 281010 391765
13527 391765 153224 283079 258088 314346 438956 221825 355443 267540 223563 495201
13517 495201 33344 323028 229796 418607 -43143 286401 -33013 283428 387471 73266
13506 229528 44772 385256 275295 469514 25010 450113 478538 403155 254269 115838
13495 151015 490647 223577 92356 360772 298773 203878 -9291 330545 282539 136595 500707
13484 500707 -11648 -56436 -114438 300414 -56992 -74787 505215 397621 69549 93878 237491
13473 237491 315280 232465 54806 270445 230809 263281 383667 193480 215553 -27866 377473
13461 -60678 82472 439670 438337 221476 610588 208572 340027 217604 103120 439216
13451 439216 447722 114488 240521 277862 -170288 73785 221719 571597 384110 401402
13441 401402 -9382 410204 348413 252296 406009 269897 461574 -41159 188916 207595 109047
13430 109047 146992 357551 122206 -22727 340829 482787 -94713 90928 -85782 -368 77174
13418 173117 129728 418152 24936 -13353 79963 -6473 72568 325247 128369 172522 128511
13407 128511 153257 104776 185330 349666 96661 107870 222284 -69377 4563 3295 83113
13396 83113 249757 328773 91269 350415 -46389 -168749 40945 -30171 491829 465061 16201
13384 52537 74787 219581 -29246 188862 205175 37241 485695 412739 268934 -52363 156278
13372 84291 180833 308908 497768 73128 -75658 496339 398496 228959 658590 208587
13361 207433 168042 -58071 146735 147439 184693 24740 698442 73198 368993 56178 58609
13350 58609 67824 237283 188262 223368 483842 210759 150883 430988 663791 14347 508254
13339 508254 283985 418475 503020 346009 212771 180779 302717 12659 37928 210678
13329 210678 -9706 -109552 -189693 457006 44516 200681 -73146 354748 41650 149238 172241
13318 172241 412702 172819 42403 517865 358269 -168449 321109 277344 53447 360223
13308 360223 36775 244251 311508 232857 253097 77308 -133593 411856 269281 228091 200561
13297 200561 92475 13335 238603 455638 328944 79999 191482 369104 221361 329669
13287 329669 311655 232259 187290 88289 -11779 215998 105958 271522 70100 154368 6039
13275 166111 272219 -46939 56667 431501 -114798 253122 323330 297100 319905 393648 -250138
13263 -66647 162070 -12822 148690 367457 275330 314378 136828 164011 241797 35956 -78500
13251 -84188 89295 -1049 -55032 -154517 73135 334373 204264 38154 178176 31318 133187
13240 133187 -173075 79396 485411 65320 151671 -269166 153117 603221 67889 -38342
13229 88282 194514 116162 -188955 134601 205632 303696 51706 567430 -45176 -76096 95493
13217 -135035 140361 28532 118735 220755 65459 114820 249666 250810 290162 151570 34672
13205 75058 -751644 333590 378229 68693 157252 -36259 167196 -191274 -104973 241049 -77957
13193 343686 91480 247807 4247 -125289 179497 180551 -110925 77432 214019 -139089 -201430
13182 -201430 25857 -126932 17005 218287 45855 201345 145478 157130 278240 251000 -140795
13170 113970 4628 467110 -110033 -29988 474933 -162185 -97291 -225847 210891 65204
13159 282022 -108568 124162 210039 173367 114604 328558 7621 -12432 301866 -125456 -2445
13147 150068 5583 219038 -104098 -80066 169689 -67970 156809 -260657 23403 96700 18621
13135 66886 -113988 -1917 -150331 -235599 196871 280038 132121 15570 124280 191701 150278
13124 150278 451616 91637 395412 178640 -181432 30438 -7881 106208 425885 84458
13113 204378 -27088 204536 73922 -110 -62770 97526 -75923 -186194 -20727 -50749 108469
13101 -79682 303314 -147952 -137796 267517 176194 -18028 -154664 192321 274681 81628 -216294
13089 26907 90903 284999 149677 143282 118904 61350 -964 129772 -147673 142205 -54270
13077 367741 91283 -246870 223254 64645 468649 -233935 58246 593393 113938 -24651
13066 -103378 -66116 391575 11592 115912 238917 -164092 72215 449747 -121333 -250185
13056 -250185 285939 44412 71440 -85362 -76289 314731 -149049 -99971 31610 72198 58221
13045 58221 2159 359191 -44133 154403 28784 30282 47861 -73 235828 227813 -122658 -99353
13033 -99353 270394 -29808 -51759 -417246 -46339 327128 298960 196180 -149360 134299
13022 43405 82565 -46461 59307 168408 -40869 -147826 24728 61385 124877 144397 -17651
13010 417857 115900 214430 51144 167716 -217277 337129 40321 155450 236217 23980
12999 -72106 82197 59393 13120 351607 -27895 131851 36864 205420 84099 -118531 356274
12987 161744 221423 257848 -76924 23712 -4594 139748 204302 137051 -62226 6839 489081
12976 489081 -105979 -188608 177082 232395 -41471 97709 60848 255199 184221 10820 -189472
12964 250530 148628 -178697 107197 -71201 140150 -44425 -11212 132931 -117200 240262
12953 284671 104157 20490 99642 194340 11147 43218 173676 41146 75323 110954 207939
12942 207939 -279782 -162891 88624 -105289 57521 150560 -18847 89948 -123281 190749
12931 76896 -86529 213283 127732 402333 49923 -302168 201300 283588 -25659 -308166 151418
12919 36088 210740 101031 102263 127747 136743 80463 -51787 -142326 -12976 -57355 124459
12907 170148 -133581 298901 112336 -411577 95424 -142866 -112261 325906 64346 -284816
12896 -286292 -88560 163112 172586 40514 -66008 -1753 168966 -139852 -355177 -150405 208310
12884 65773 125608 286486 116334 227385 205712 -201819 -71599 -199962 -10473 17720 5962
12872 182507 112953 -186785 66059 -27666 -351612 500636 18861 -438779 313496 -203094
12861 143972 202772 70057 99758 24322 23886 -87570 -112279 -40387 271409 -25065 216773
12849 -2399 -75521 -114 41926 -219928 -61133 59735 35090 -9109 -131774 272533 -218378 118152
12836 375402 -232441 150620 120875 -22822 141805 -57508 296985 92880 -35794 -122502 -269903
12825 -269903 88803 166640 -10503 -250500 -400173 444984 30359 340488 -61111 -113257 284434
12813 -179853 -190969 -168416 95764 201687 -60491 117004 -137177 -39299 146498 -324751
12802 -47434 468076 -269054 212861 38359 316514 -170867 -152378 -78920 156364 -86510
12791 291183 -1103 219585 43583 -128258 244818 -90986 -38987 -84932 178740 41161 38549
12780 38549 121085 -56295 263534 -300519 71994 183189 14347 282146 -33257 -245752 303062
12768 -47582 174931 268467 -81276 464986 108465 205981 26445 -7524 -92197 -321435 42468
12756 -87975 -178781 -200179 -139617 63594 168224 -3736 249857 -274021 -286475 -82486 -167099
12745 -167099 -83940 53489 87554 328801 106435 47624 41511 125088 101940 61054 263885
12734 263885 372276 383293 -536 -238152 -250544 347152 -136942 -60139 50638 -69983 -79599
12723 -79599 183101 -221980 -162067 5542 67322 199236 -267407 -198293 -116854 -130174 -41747
12711 90660 8165 273646 287072 415949 -188454 281815 278407 101050 235669 333369 356239
12700 356239 74425 -46751 464084 109592 197289 -35684 -102085 -153771 -26099 11675 20628
12689 20628 -182732 56308 -167041 -64738 315872 123720 -262730 287460 -64275 221004
12678 213165 57758 297138 -143023 191300 -16042 -34357 91693 -107878 225997 106566
12667 -54743 178740 136046 191016 129055 -167846 249978 228050 7967 81989 102095 275228
12656 275228 353357 11345 263942 262188 104908 242887 39936 180179 113993 85957 42902
12644 -308214 32328 62293 308395 122368 -67212 -9668 -291672 70146 -201588 259850 234913
12633 234913 320512 15802 301016 365179 238872 78910 161799 431862 167466 244613 -11693
12621 211585 -53012 319120 -4047 -170364 67019 9310 152724 -173006 -142650 285588 72129
12609 16613 -86153 148594 105089 -36408 -268443 -27706 145663 -54126 213989 -315424 -281505
12598 -281505 -71871 129554 110023 -186090 72776 -345421 -11944 185348 -141550 -340648
12588 -340648 26242 215721 214291 -394025 270677 60613 -225873 344471 -199478 -377619
12578 -377619 -311250 -16148 -62818 139181 -155156 -135649 104758 9005 368901 322561 219512
12567 219512 -188039 179430 129497 136666 -316214 259740 12089 203614 204231 -41638 201938
12555 -356265 -191499 158333 300276 -129999 81913 145977 311203 -53817 -63237 284988
12544 34616 231553 163315 145078 -104387 -173711 14530 25976 82564 120510 -105829 -66784
12533 -66784 -131111 72753 269994 157385 87634 -18667 149702 96426 191541 267271 -92883
12521 -64989 241478 -485202 -38920 247163 168635 -95667 95208 199748 10092 -228747 126493
12509 12278 -109905 130792 21968 -82864 -40495 121298 51051 -19800 -164150 -30716 119007
12497 418420 96901 62850 38096 12481 205697 -126333 -110879 -51443 -47752 -31840 -221095
12486 -221095 -193384 72542 -214185 26140 -20678 240610 10616 -144446 -32541 7790 235479
12475 235479 -123721 -33873 -107004 -228126 278848 -192547 180882 -79923 111641 -160762
12464 187041 -167055 200966 164531 58004 159689 -13093 -89692 104631 -143872 201041
12453 91740 -122733 -53091 133201 121495 377678 282333 182910 123278 -33216 -139692 263025
12441 188650 72732 165532 191062 114546 -84969 33678 -378171 -259523 -78735 -7147 -39347
12430 -39347 72814 255089 -85451 -199483 88560 -130041 111653 108419 -16247 82585 339587
12419 339587 -161815 37596 203519 136072 102831 -133692 140921 -96166 75869 -10606 101173
12407 -164105 10677 -70805 142993 26285 22629 378718 -89845 33348 9144 -99866 -114893
12396 -114893 -108016 223004 89862 -711 198174 -24840 282462 -32864 -199250 -120837 182200
12384 47030 144557 -92831 265935 -16645 -94806 194008 -76146 -31276 -133978 41682 148323
12373 148323 -30069 -80139 142923 67716 -69088 191712 359080 -93688 96057 154795 3531
12361 -244338 -107553 -143624 -128097 26965 13825 84146 -36450 -82499 74736 125912 -47363
12349 -334173 -121470 -95474 -69970 104874 34516 -250285 -165168 211673 239527 -293593
12338 -85078 -134175 90433 290348 -90757 147680 -21891 -144650 193438 -320222 88531 31998
12326 250671 -64137 59738 48854 197545 41180 -95050 -120518 -151618 -73446 280848 -79703
12314 41997 293911 -111994 -22320 177607 -120620 119561 -128750 102431 135345 -171666
12303 -159217 28033 86657 -173470 96360 146157 -222005 59748 -148702 -25793 211847 347508
12292 347508 127725 231418 105724 190176 -21663 -205647 -104606 115331 -44895 39025
12281 -44805 79895 -102274 80910 164299 -115372 27471 57442 103058 227840 374858 102056
12269 46988 -343736 40230 8181 123202 231566 -50230 315948 -86997 163875 27938 -55782
12257 353147 371769 -151846 320700 -125184 378505 -29759 -213632 73361 43222 73961
12247 73961 123275 16828 159979 -56518 7386 286202 164753 160921 145381 107980 -202275
12235 -305588 192524 191058 138882 55172 107431 -31412 263632 -33381 -4837 156944 348932
12224 348932 308733 42089 250968 76620 211391 -23007 184863 157835 -81793 66583 -20917
12212 33288 380805 -196410 139129 -47335 -263709 184858 42571 223438 409227 237003
12202 237003 -21896 221470 445465 96181 333296 198407 151338 15072 317909 145485
12191 175704 244967 530071 -435766 -148337 96006 -27523 -63962 341279 191019 270210
12181 270210 261451 -114997 82360 74528 286852 -56340 259158 168954 38248 263865 3386
12169 5481 130900 139270 -210868 303334 105345 80465 180108 107877 -144613 98159 -82321
12157 216928 30700 103308 -126328 99100 217882 237303 119557 371218 185653 -31454
12146 -83859 -17411 63235 301964 -92544 -72652 76254 -91036 224888 80685 -131410 3934
12134 115865 -239505 -56250 127708 -19571 -333556 -235080 50993 -54266 -40334 -159338 -152567
12123 -152567 22402 19642 51716 -20806 337878 -195453 50679 -232633 36321 357693 47491
12111 228380 176825 -50315 175539 -111764 -74769 165026 -27131 26306 171013 -51208 -133137
12100 -133137 -293428 -83412 118169 -48404 -8286 219428 -86363 42427 400621 82435 42037
12089 42037 53602 -537388 51731 91091 -52324 -41021 -233918 8629 56901 -49677 163529
12077 -24782 275996 39944 -6619 10281 516710 878282 1127428 1152718 825722 121506 233984
12066 233984 -55502 29236 219415 -292341 -32189 71030 182455 119135 -195203 -88689 147662
12054 272171 -308493 131221 246862 207655 15214 236068 -46784 78043 87273 265670 -126246
12042 110842 -72775 84617 49603 -180967 209329 228650 240458 160768 -158108 45921 -318472
12030 166875 -25741 -44987 -285751 178639 -116672 5056 98476 -110176 1143 -102274 -158189
12019 -158189 321527 -4440 138912 -180434 260307 169933 131118 -30240 -45416 180072 27841
12007 104275 122319 107821 72572 160797 -85627 41888 84963 3065 -269693 183900 42351
11995 43670 -89941 84952 140237 -267515 -34477 22151 -106562 -139641 -283044 -252201 104072
11983 -96910 -49200 262212 -157333 215629 41244 303935 215320 -87187 68000 64713 -3909
11971 -285794 115195 -324079 -256791 2173 -268686 30274 -199890 37632 -379791 -72383 -31237
11959 -437307 53111 -29896 -136617 292627 -117909 185923 -236877 -221194 65600 -29267
11948 138056 -228345 38716 7964 -71362 -1953 -124697 234383 218162 69099 60172 225965
11937 225965 -105065 18454 131498 -54265 146336 7346 195404 239832 -202420 181670
11926 -87673 -260988 -19314 -132963 127803 -235934 -123076 -371044 -507107 -199858 93409
11915 238968 271861 79150 21210 285763 10537 270741 322841 -155742 -17127 -163298 -26835
11903 -37355 47846 93380 23322 -113774 66615 -129470 -225172 -30467 -17300 194740 -764
11891 -157486 213357 -3121 -276857 -67477 49252 -80359 -50198 154325 164261 -147099 174356
11879 -91631 308020 83023 -222273 -46467 -292471 52118 -276284 -118495 107656 -8031 287141
11867 124025 -101104 -176555 -249290 -35787 -90229 -113236 105726 131764 -130198 -81363 -217206
11856 -217206 7197 -10254 -280086 -200911 88290 -45203 -196705 -218334 -365942 334084 -260635
11844 -89133 338317 -44348 218980 211754 -277759 -39938 79033 -76812 86449 -257798 -32119
11832 -177557 -11593 -49357 3509 39717 79224 -152026 -16192 142868 -98936 -157601 -78028
11820 333991 -27788 -46017 -267351 -394906 -245504 188963 -131795 -164299 -74198 -151378
11810 -151378 -131483 -86300 101981 22082 -226303 -197201 -231944 -157937 -238471 50484 254313
11799 254313 -99888 -182960 133269 82092 167370 -180407 424404 175693 -83399 -117115 -154201
11788 -154201 80543 -158743 119618 75262 10501 -294814 -172083 -100350 -96829 -13820 -324556
11777 -324556 -12156 17300 241849 38999 34190 28790 -54155 -62547 -145627 -39365 10291 -136134
11764 20650 -223664 126268 -17831 206825 -141860 -100820 245013 72234 -115036 50671
11753 -397459 -19271 843 14579 116274 -121601 146653 -96024 -79704 -25498 -54330 -109718
11742 -109718 -167659 -21111 -43654 -169646 79372 144250 -145815 79037 75546 5074 -202334
11730 136182 87767 -31903 271201 -526845 59595 -14986 -161134 130783 246330 -3314 -120319
11719 -120319 -106635 53658 21987 70301 353085 -8873 62550 48667 51255 45929 119208 -101432
11706 -151055 258616 -125103 -38920 60633 -46227 118109 -16915 241717 149616 278319
11696 278319 222743 14311 178139 67773 -10506 -47708 -39272 79824 -231515 -114916 -271366
11685 -271366 218096 143873 109774 -4734 -197205 80435 -82218 20875 308492 167654 314900
11674 314900 140908 73524 -145293 232599 62194 -51426 142166 -12582 40098 -110374
11663 -300087 61693 59684 -32873 -175166 11920 110491 -205797 -174719 255097 -104869 325541
11651 -85585 111652 73139 -178400 77265 -308888 69339 53683 -34382 -264807 341415 -79779
11639 -79493 -108922 -78840 -282405 177734 -96668 336681 -173405 -165704 18683 220693 263154
11628 263154 -623 152540 78206 202204 96764 166402 13640 182804 5383 -106487 -13453
11616 78317 -336090 -96894 123258 99458 -25239 49952 -75810 22212 -195127 163554 70543
11604 162209 -88406 433559 136848 -83799 147731 161176 -133111 131652 88736 321525
11594 321525 151277 145263 441207 114281 -117916 43403 7776 335163 396426 59234 150916
11583 150916 4263 -31699 301522 2727 -117811 146015 -131825 146835 99627 230296 45678
11571 -16936 199778 184706 285967 108697 -10400 99667 237275 36712 -1074 102018 9332
11559 -116287 235266 101129 131773 65157 86034 -268118 -84587 -174709 153330 208694 -172384
11547 -283580 33317 195235 176079 -173635 18576 262832 255952 290839 -74730 -85288 102345
11535 55731 349177 152033 323062 131114 59031 -88518 46832 -54858 309450 141871
11524 226403 79139 88827 -221823 95281 322474 -83581 100039 86890 328693 -9725 -190730
11513 -190730 -109194 -159703 263844 237458 226969 124171 -122407 -24314 18837 283361 280448
11502 280448 254666 -96269 -112202 -117869 -95711 251796 116371 -229653 -370432 369210 133543
11490 -71546 -106438 187614 -16180 353810 156157 57550 189167 318626 213442 16963
11479 35945 356910 -9481 63824 278733 -22703 182535 314174 464500 186670 139570 287467
11468 287467 9733 106988 92153 423199 147443 146409 -174262 234010 125844 66275 -467643
11456 136278 -149334 212135 -131754 -256950 -165659 36600 -10980 74732 -121018 254032
11445 273641 317386 39160 -104695 366925 263951 264878 146333 188658 285224 -141009 -200510
11434 -200510 -625203 170870 75777 200030 -138004 317616 117077 163480 -40098 47907
11423 44191 80054 -161317 -274657 469936 -199268 27187 66093 -262315 -102311 172244
11412 172373 -482 -102284 196128 -154278 36557 -258666 -107293 -270538 -170866 232306
11401 -75077 -147350 46304 -58048 -158869 299101 -86955 -24932 -124040 -67079 -2045 -152223
11390 -152223 217327 92242 100279 -39570 -71144 -139296 -34619 92244 -85279 -121600 17936
11378 -375760 -47205 360353 -195773 -35400 100547 122345 41018 -135719 94598 -81230 93984
11366 290016 -192270 6170 398604 22 -63918 167194 11406 -335416 -212015 89 -106300 -304704
11354 -304704 161623 -144776 -20311 18322 66092 -119495 -121248 -2758 47412 341513 -83480
11342 29851 55496 -90008 351214 329664 351174 -90889 192649 -198927 39734 -422686 154199
11330 -104820 -189745 -24585 56745 77293 36858 -114437 203471 145295 97843 -239304 201101
11318 -13434 -189972 86322 97699 -293649 150543 303717 -58417 130996 3270 -123183 134844
11306 -41667 -272691 53161 143294 -95412 72864 -72142 -162139 -178243 21176 -102642 -44545
11294 -157261 -13062 -322162 -96862 3979 -40387 9526 -139476 -289874 78734 197653 259781
11283 259781 37914 91012 -241795 -66748 -30549 162012 -406344 106702 -34194 58528 -218158
11271 20284 71530 -101954 -180610 14627 47221 -198617 -214483 99975 163799 -138638 -144720
11260 -144720 5055 40869 393558 -178874 -336372 -129245 12965 -53844 282525 68002 151142
11249 151142 17843 120927 -94944 310774 35889 196243 31912 -45923 4861 128268 109409
11238 109409 63103 -190380 -320778 -96007 44872 32127 -466790 -232016 -61538 -48155 -144395
11227 -144395 66746 92622 -31359 -148982 -166480 18171 -126253 -61120 266613 143307 -396602
11215 222371 -414444 -54629 -136860 -245318 -167991 -124420 -248491 -55182 453252 25918 31811
11204 31811 -314719 57509 -54518 -52060 -280707 -197261 -22588 -185690 92303 -133870 -40420
11192 -12221 -121286 129729 -121959 -51050 -93483 -359548 -413502 118691 -50460 -46016 87747
11180 58648 197835 -42821 197636 128305 -336302 -97051 -110872 -347102 -140353 212963
11169 -194947 -81929 97142 180610 136454 -225872 218105 94238 -7851 33903 149983 -165422
11157 -240202 19351 -468867 -176370 -6823 -472330 120572 167947 183416 137895 18780 -38609
11145 -43235 -118204 -190261 -288500 -145806 54652 106982 3561 113406 337165 176709 -68342
11133 -15292 -90183 -153637 248453 28199 62308 -237449 116810 247933 111363 -142478
11122 171479 -35216 157580 38199 18220 -42297 -182124 175190 -84975 -126758 -41539 -173338
11111 -173338 236704 127294 155668 222862 360377 23707 184448 5673 283061 -186037
11100 313589 213908 91506 383179 11012 185134 91053 209294 169643 46277 189526 461030
11089 461030 133911 137737 25327 71558 283169 213445 387242 -12974 321042 182046 93204
11078 93204 439626 300545 37903 67626 357743 387854 300148 409396 167411 150222 295711
11067 295711 11438 376343 408716 122434 536825 548279 592604 700261 359308 302157
11057 302157 524361 615541 499290 366487 774665 888890 610824 980625 612390 850656
11047 850656 434471 570898 932085 789585 774331 409292 458146 606627 383771 506881
11037 506881 575705 797235 595099 723348 639086 634269 647591 306009 483557 330130
11027 330130 513274 795763 720655 875915 523375 687863 805766 850676 516978 459046
11017 459046 585515 475124 698780 598800 491307 737326 460563 736663 468162 663040
11007 663040 417026 593967 866804 278842 -101138 717374 732015 568198 703140 680814
10997 680814 510919 515337 701523 564970 553141 543125 961416 764684 735758 874215
10987 874215 866752 1117920 955422 1124104 1012381 635643 943681 1064611 1344872 1511662
10977 1511662 1518791 1753273 1868078 1797319 2364750 2404167 2650587 2443112 2277387 2127448
10967 2127448 2114715 2188007 2020479 1533348 1541864 1763138 2226578 1877058 1993779 1758629
10957 1758629 2188099 2080043 1748447 1621423 1735477 1514776 1248078 598582 404134
10948 404134 642612 275712 641351 245270 288501 328660 127335 335435 -188613 205649
10937 275283 181605 -35829 122925 -11097 82093 121687 76219 282798 282355 126680 407502
10926 407502 40754 84311 -198432 107800 166276 -19581 52199 303365 165993 103578 -105495
10914 112191 82737 1002 -58399 18164 65042 -357198 13718 150363 -70589 395498 54198
10902 -183002 -334366 -114108 -328022 245476 24988 -51502 137937 339860 159616 39399
10891 230017 -151469 -187766 322057 -16194 -78066 -10812 -41507 246956 -196235 -131355 -4872
10879 -310443 -163521 -105360 -214084 81890 76499 -123006 164784 -215172 -153792 -134316 -53951
10867 11983 -73096 -177439 -254570 130027 -155901 32707 -70613 149325 -132837 63881 -94650
10855 104713 20457 -27929 -159951 192770 49918 -82217 -195093 220380 -960 43924 -227744
10843 -217286 -108425 -13929 -164721 -117498 70647 -152686 166506 -95244 -244096 -24913
10832 -48396 152134 -86898 -47328 203689 -29075 -154996 -5379 -116382 93789 11034 147345
10821 147345 200382 -163126 5542 -50753 -210315 209863 -108909 126339 14784 99775 195365
10810 195365 -52377 -448482 -153898 70443 -105279 1369 -437799 14613 48878 -239915 -259780
10799 -259780 80626 -140914 -53416 15021 113847 352875 -102907 -87450 -108260 49955 -3462
10787 115942 -289607 -126875 232617 -75950 3080 69834 -144654 -244984 58079 -145127
10776 75049 5589 -153791 -371231 -14945 -161402 324852 28659 116920 -355931 -214204 -39088
10764 -175038 10413 -230512 8694 330345 221019 -398499 -59991 69222 336500 -155828
10753 -254905 -196919 319987 47370 345628 -151389 -276475 19340 158543 -143748 -25011
10742 -206412 159299 63772 199542 132615 -136827 -55735 -166865 -12479 -157669 -55223
10731 116623 -286324 -115835 -250835 -108713 -234623 11565 -29654 -262655 -66757 -147432
10721 -147432 143193 -196330 87549 -277519 -93352 -193298 6939 -122000 192355 -234295
10710 -226188 120252 -351362 -48945 229849 -14195 -176127 68079 165580 -32758 -53752 266951
10698 -150656 -243803 -142112 -218479 -84587 103850 -65371 -216103 -5672 -54799 -144441 -285272
10687 -285272 87760 99774 213671 75356 263194 260418 285114 -81887 206328 -151142 165485
10675 98922 -89731 1928 38703 43550 117065 21140 -9932 -184827 -159902 97247 -66016 -113053
10663 -113053 -225266 -92488 96602 -93435 -143481 25642 70405 102533 182742 -381497 -135974
10651 -238184 -83831 -550630 -120683 151891 -130465 19078 284814 -7002 -59342 -32197 -171643
10640 -171643 56080 -133886 -31727 -230142 -243614 -160019 -173882 26522 -131856 -9035 -36123
10629 -36123 403807 -104009 -17471 130996 -144189 294103 63256 -55482 188516 56051
10618 102083 48575 -142626 -101859 84532 -77507 218425 99292 -85779 -69956 52510 -65182
10606 291757 -32731 7540 27235 102179 120898 -178697 -95984 -53598 70111 76761 -316327
10594 -138598 195857 -358739 4459 -212517 127001 -471716 18648 -294344 -141282 102063
10583 -71928 -95775 -24960 40082 -53199 -53454 -95126 -9019 -270745 222833 -264467 -150071
10572 -150071 -148219 -190569 -84840 -168325 -474247 -231071 -39297 -164892 94053 -195958 27162
10560 148445 -329797 27036 68418 -3092 82924 186214 222078 171191 -6474 -1645 -38570 -318343
10548 -318343 105417 -18240 72159 -57035 38122 -95090 -68723 -65303 -127721 -349542 -111367
10536 184656 10912 24762 -276662 225368 -38106 -151817 -133860 -97923 32597 -271388 -11258
10524 -8002 167534 -116310 147904 -116757 -53502 -201611 145441 -41566 -215047 397257
10513 -36308 -165974 -161632 37661 56629 -150607 -105749 75964 145161 325074 135677 -126841
10501 -165797 203016 -38949 -165903 -223089 -183834 -60208 -24138 29830 -170265 -317585 -221910
10490 -221910 -310111 -144523 234673 207900 309240 125196 17384 269111 512011 90397
10479 474579 497165 129331 160296 238752 51311 53772 -43062 128974 189648 190372 -435410
10467 -70676 -133469 -104075 -297825 -134974 -282499 -236203 336990 29414 24510 267199 -40249
10455 -53942 64462 -419928 154932 250214 50171 27367 -140890 -40623 -362815 277339 -103179
10443 -157317 -21695 10104 -50318 107687 109242 37438 -109557 -45637 -7327 95342 44981
10431 -105617 -287695 -27091 14083 -212922 -188901 3372 23972 254324 -84408 55839 10089
10419 -160912 297153 -278665 -330859 -180694 39057 -136489 -24565 -168860 21808 170958
10409 170958 38616 33148 -105729 -134341 -140093 -116740 -112964 62034 -254444 309822 -53663
10397 91865 138174 41139 -113223 -13317 -43331 173183 11943 -81419 37292 117330 284360
10386 284360 -131870 128039 146723 259295 98570 71067 -288244 412435 123987 439505
10376 439505 268780 -88496 195245 134786 103692 259883 241352 130912 248103 164095
10366 164095 361294 313881 49513 -58353 441978 515342 214819 108291 140034 -113219
10355 498389 181590 106477 -146600 169897 705125 305348 406554 375895 204237 365287
10345 365287 361899 416427 613416 266735 147852 459750 351747 296194 -84135 149061
10334 173802 351584 277066 64078 -45192 -269169 328456 210089 217209 112725 41966 70916
10323 70916 85790 346091 70054 -32429 312792 187774 -148522 213401 235976 72786 110449
10312 110449 -28867 141030 -100042 3786 -52577 52796 -57606 296094 -115153 -71741 276336
10300 100368 101885 176759 72632 54806 -80303 -119626 -288354 -274470 57130 32724 -435300
10288 49563 -130844 -195962 -113211 -58025 -335806 -167377 -39886 135274 -245124 55684 -59440
10276 126797 -151996 232821 -177128 -142448 76992 182888 -229715 -67640 -153214 -57903
10265 233141 21313 43002 34169 83332 359645 578624 538373 589068 121280 280280 473358
10254 473358 242472 39461 -18174 191025 333391 -143753 74367 530407 215693 117159
10244 117159 -182387 -33833 275631 -129510 182494 -35537 207956 -4950 81618 -52916 110298
10232 -226364 -56743 8720 -337149 -67341 -129168 -207790 -192098 -364813 -118635 -468664 -437063
10221 -437063 161782 -26556 -178061 -60575 40654 -42774 180539 78193 -90608 24612 -269710
10209 -191924 -53 93703 -95294 11365 284932 -247901 -81133 -160275 462522 -51095 -275232
10198 -275232 -189022 99579 -19095 -267481 -145804 128975 261200 149193 -110656 -189231
10188 -189231 -39687 42952 -272152 25749 99435 -382517 -201607 73016 101000 -377438 245123
10176 103351 -322245 185236 -183517 -165504 275168 -240713 -126655 -48127 -127587 -86177
10166 -86177 204849 -91674 -181320 -76657 6862 -7010 -51335 -70540 151480 -367607 64148
10154 -29706 -247519 12128 -33126 -17660 115878 -278667 351826 -108969 -243293 64107
10143 -531753 112877 34830 -55824 -357309 90943 271030 112576 -387110 -17805 -173297
10133 -173297 -80171 -73994 -202395 -48029 86679 1678 316977 -178335 -152736 -58860 -94675
10122 -94675 -441820 -221712 -67350 -40355 -185306 -183315 256574 138115 -230979 76970 -355224
10110 21253 151173 -140349 -4625 -53210 -84136 -304371 104767 -178294 -59524 -50387 64772
10098 183004 -177461 -56543 113425 65361 -63935 -295233 -118647 -99247 -70133 89918 -1081
10086 -254856 -98840 -57483 188115 -151277 11125 -386045 -72890 48895 9172 -453270 23856
10074 -40587 -3747 -133769 225644 31784 -45752 -27601 154885 39571 -486477 -76569 -253469
10063 -253469 -6189 -160402 95976 -382913 -184003 -167704 222550 88332 126061 -185071 -138016
10052 -138016 260693 -160474 292164 -100022 109223 92446 141310 -318543 -341257 -39899
10041 -26314 -6458 -112307 -123587 115702 -199918 -131643 -257892 -189396 -78935 10092 -557908
10029 -303213 253720 -3725 -268657 -130856 -309371 -357595 -145468 11716 -306790 -20708
10018 -78976 -510945 -25754 -147981 27696 317951 -307439 244765 47210 -89700 82665 391494
10007 391494 91225 -196196 -236457 398884 31502 173539 -3548 -88410 -125040 -161582 -29675
9995 39951 -411629 -13086 -262688 -322359 -147462 -42032 217928 -112138 -39268 -200579 281197
9983 -29862 64656 -149315 -157753 -39520 122443 -54933 -510511 -51594 117081 -27262 -311211
9972 -311211 56242 -66735 -286939 -62098 -333014 -140115 41807 -99801 54199 -272839 -202893
9961 -202893 -55430 176062 122426 -122626 -114127 89833 188335 -108940 -217082 81846 246366
9950 246366 395735 96454 -86364 -203166 57126 66467 24751 -87947 -53054 -253104 384233
9938 -150347 -54503 220812 -18984 157484 11939 -154818 137377 18712 -241804 -64490 4705
9926 -35205 -213080 -30057 -35777 8747 -232975 -83245 -304894 -326416 -138541 -208926 -117973
9915 -117973 -22710 -71083 37531 257834 -429128 -137784 -40977 -13269 42167 -237872 -178754
9904 -178754 -366629 87507 100985 -101120 -73821 -204400 111415 -78966 -409406 -128244
9893 138202 42677 -219796 62 82216 84297 -148454 -194311 -263441 -167302 -171417 -66310 -61321
9881 -61321 135723 122758 -131411 219030 -84588 138887 25821 -69534 87710 181129 -18883
9869 -108594 6664 -81374 129520 -217586 -35967 -146540 -163176 172723 85811 -225041 -160204
9858 -160204 -99913 -10616 35521 -243436 -36514 112147 -223301 26497 -307179 -44724 -18019
9846 32669 -333503 53374 60083 -136569 113458 131823 53929 29538 231801 -354629 132352
9834 -131115 105900 -93460 -235635 -181206 -106250 -403486 -76712 -71324 -295354 90150 173557
9823 173557 -49482 -278093 -93067 -60077 -120982 -77699 267649 -121752 -288969 -371168 62685
9811 178508 -38634 -140280 -60413 108198 60584 -184936 68975 204930 -140348 211876
9800 44250 -102413 3236 250618 -112549 -249210 -4036 -322934 -235983 -94296 29878 157874
9789 157874 127951 -87357 -340333 8234 63098 -415655 -15969 -460499 -13090 -233332 111075
9777 -421373 -34555 -126709 81625 -77247 3024 -149586 168157 179715 -419839 -110328 85511
9765 -100815 -285284 -132679 -70804 132506 -98146 60921 16811 -110157 -52590 -480071 -137456
9753 -264182 -22584 -43586 359844 -251856 -97327 -210295 65761 139787 -123743 -100465 222590
9741 -198676 39187 -378831 -18629 -159800 63676 -209500 -258212 -240781 -68583 93254 -98875
9729 -189428 93320 -52134 -106476 -391093 39803 -202392 317176 -261440 -247642 -254502 -383444
9718 -383444 -50299 76267 174835 -110652 -191871 -112304 -318647 -10143 -216168 -174878 -196498
9707 -196498 99744 195145 351111 -72636 -286496 151634 -251696 -198679 -28427 -60861 -98217
9696 -98217 283457 83988 458127 -359213 -462952 18268 27100 8003 -82226 39904 -246863
9684 61609 -13256 9736 -19839 67648 -475463 -272055 -226523 -214452 -228474 13447 -238903
9672 -154145 -217229 -234081 192097 60896 -89569 -218849 95094 -423928 -118140 -11396 -256103
9661 -256103 -71215 -400908 121084 58745 126647 13293 -57879 -42447 -81003 -233772 69198
9649 28504 -10138 33351 -81707 323715 191043 -22918 -292058 33231 47504 -29158 -144050
9638 -144050 -43410 -327939 27527 -168197 148427 119735 -259686 231998 154948 -17326 47012
9626 -68178 27646 -208422 38899 218915 124635 -180986 4173 16684 -13984 121483 -41738
9614 46488 -19629 -170925 -27783 -3306 65572 64801 -147625 -18941 192299 -15918 32513 567773
9602 567773 -344394 4077 71090 -50952 87038 -387582 53934 383316 372325 -292326 62006
9590 -189697 -107060 4099 -106293 -56804 -172447 -83342 -240199 -384377 99303 64922 -103903
9578 100655 -321277 16302 143910 137378 228247 -333166 52680 -505036 -106003 -180073 -348463
9567 -348463 -33979 -71277 -324421 207713 223973 -16001 -273704 -148253 -51185 -83809 123568
9555 -46539 -184983 -50464 -19522 -33733 -98172 -299041 -203106 -40202 -318932 19448 -58694
9543 -105926 -138659 96856 38897 -225083 191164 166314 81157 93336 -11174 -178365 161532
9531 7653 130886 -66506 -246812 -169303 -247690 -159450 -283855 2869 116476 -46600 -126809
9520 -126809 -168283 -69251 -191474 -292082 41160 314392 -14664 -116624 2286 189022 -245380
9508 -154534 -2866 200938 -241448 -62737 -216998 63053 -30414 -63736 -17394 -275130 -402553
9497 -402553 -88283 223538 -166921 248043 -153963 -46598 51993 49920 245095 -49366 -110243
9486 -110243 17066 -167756 -108526 119385 143179 -124127 204559 245441 12726 -152080 -184590
9475 -184590 -79568 173060 -29347 162928 224861 -122843 15780 187612 -165596 138259
9464 -255465 79284 -149767 -451734 -175203 -135090 -23145 -82003 -139151 -44454 163748 173019
9453 173019 235312 88959 105255 -187203 65121 -249086 -44944 62278 -245021 -305443 -305837
9442 -305837 -244751 -100437 -2967 -174770 67163 -47089 131282 -246684 -186595 -122657 -371274
9431 -371274 -93549 168436 -392827 -1903 -324830 54320 -63999 -278469 -414430 -44835 142868
9419 166300 -429499 6645 101820 -1517 506135 -35194 -73980 -198031 -354451 -120424 -83627
9408 -83627 -177675 202211 389609 -168363 69701 -3045 -204541 -86668 20743 -251874 -171600
9397 -171600 -146582 -151757 -177795 -242974 -524134 252123 -519734 168292 48594 125953 -67589
9385 -99409 -221737 -52864 -271898 -107457 -96687 -44754 -5652 -31197 -351266 -49871 -38699
9374 -38699 1777 -56916 16966 234440 56107 164477 91164 90672 8434 31401 232463 157608
9362 157608 106405 -187497 -311856 -575576 -111204 -212578 -182797 115152 -6323 -17080 -133014
9351 -133014 135845 -16358 -75751 -251800 -224413 -62258 -289997 -55541 128810 -65217 -78115
9340 -78115 -51917 50665 28676 180002 -51674 -264071 82385 -78293 9662 -287994 -468254
9329 -468254 -217545 -300528 173445 161882 -95431 144929 -245053 -82634 87594 -187320 -37389
9317 111663 142324 69631 85790 61109 182349 78416 -76655 290366 -89441 -12564 -47461
9306 -47461 47352 -378179 -118622 -203656 10096 62672 -86655 -48899 -47987 -75528 334292 -161449
9293 11005 -107864 130517 -60135 89988 34502 -165414 -411577 -170301 421834 175491
9282 118877 -117554 157972 -176130 -275108 265429 -67516 -87050 -89956 144824 49376 -75224
9270 -243610 196297 -91891 130082 -163962 -22739 9887 -469420 119924 32005 -43462 -129565
9259 -129565 107399 -200468 -139106 49721 60244 -135142 -132965 184100 -170221 -264782 -201657
9248 -201657 118746 -33303 103454 98420 -208060 76755 -206754 21838 46151 -226793 -465822
9237 -465822 -224391 232636 92815 10916 -404675 -290036 -227939 66240 -86108 26151 -250020
9225 -179619 64962 -33266 -215614 171703 -35776 -279824 -155367 -8250 -140679 20373 -128800
9213 74496 -284196 -97103 -46506 -181615 -330583 -8869 -23089 -19182 -106980 91680 163691 -342077
9200 79474 75261 -270822 -168239 -67389 223279 -263141 -78868 41999 -19614 -156573 27833
9188 -249825 78587 -57449 -154762 86942 -155925 66666 108042 -241238 -105096 111270 -214339
9176 -198757 87990 -143690 6691 -146282 35464 -122048 189715 -308210 -49434 103441 78210
9165 78210 140368 -38256 -245312 28140 -230202 -153314 159871 12341 -171425 273148 -23558
9153 -20344 113727 42258 44567 -56730 -166992 -11663 -6152 -219834 49671 -86263 117758
9141 44627 111305 -296743 237164 -124850 -211575 99806 -157968 95302 -244507 -86220 116007
9129 -224439 -145366 -132935 -80076 234443 -347514 269341 22735 46488 -146302 -176272 41080
9117 149890 -151401 -185670 20165 211529 -102665 33444 50852 -118993 98012 -90611 -54559
9106 -54559 144870 -40146 18568 238114 267377 -222161 -492489 85464 50851 -42798 -470849
9095 -470849 -397688 37733 30461 35054 238578 -344273 103689 -132608 -51015 -187445 -46036
9083 -56750 -174748 -130638 96017 -224533 -139142 103253 -66408 -70768 -54956 111895 -264681
9071 -245697 45107 -43898 -172775 -178410 22882 -117669 130801 -191416 28556 108264 -270537
9059 -30279 -286330 -227325 -13000 -204151 -116779 -224182 70959 -130080 -201035 -376219 157677
9047 -170261 8522 -22063 -220852 -257020 157301 -236391 -359742 -149162 -246036 247240 175441
9036 175441 48207 261850 -54351 -109293 -22255 -134345 -236317 73043 -34406 70719 -261457
9024 -203647 176845 197002 -132326 209485 -78080 -262373 110586 22526 -223152 -78914
9013 186110 108261 181610 -27096 -85146 -100099 -200305 -218358 -377769 51109 60884 -303226
9001 -86140 8302 -97003 28865 -146506 -115323 -233389 -131768 -45033 -124251 -161499 236389
8989 114893 267623 -66238 56869 9111 -122259 -375290 -142863 87900 -330669 -150944 -70179
8977 -92991 -402408 216264 -67992 12962 -152693 -171429 33866 235623 48853 -200484 -162328
8966 -162328 -132925 524567 -85440 56547 298631 -35141 -296779 61536 154894 54682 101608
8955 101608 -477340 -152042 64844 24233 -151105 -24632 -128100 -102171 -70175 -123164 -215316
8944 -215316 -6645 44811 -184698 78506 -27593 -346918 130536 115637 177369 174463 189878
8933 189878 -163227 55243 -57000 -166161 58320 -51036 223143 336345 568784 1934996
8923 1934996 5981256 8316648 10460819 2843224 822739 255455 247261 634722 112034
8913 131253 -1956 126009 -52710 315817 352558 227458 30154 131070 34175 19814 -252692
8901 -185550 199972 185368 137675 79400 -44120 202360 -7056 139633 106104 265551 34282
8889 -368954 -50556 -324465 -71375 -33805 -24310 22544 225400 -192170 -77280 118979 -130479
8877 -31562 -88136 -136110 230427 -279917 -47833 -50276 -483798 -104216 117542 469027 111048
8865 -190608 -355083 69507 49808 -204844 -48442 77051 7395 67056 93932 130887 -183072
8853 127343 -133124 73422 -183602 -61178 -256646 -19348 -401659 -321525 -141328 -520328
8843 -520328 67687 -163910 -120277 -28880 59724 -70316 -393741 -3903 -22648 -70142 142791
8831 -53394 8983 -33983 18363 -384530 -146843 7241 -301001 20817 -254599 -379568 240288
8819 100830 -93045 65463 -96514 90566 147849 108017 -295337 -170874 -103737 2915 -246533
8807 -75211 -251281 -205887 -127835 111138 -35158 45382 -276555 -380930 -263723 -102089 -180494
8796 -180494 -359717 -98108 -166731 -80120 -148634 -112774 241038 191740 -96553 -174465 147217
8784 -343753 320834 -315902 45333 -45803 -56588 -135978 -221082 -352816 -159155 139880 226641
8773 226641 -14841 -124430 57688 13612 124151 207449 -19465 -353305 67395 -26837 -153252
8762 -153252 -174560 75103 -58698 179774 74327 197245 -2945 8530 -191425 -69002 -138502
8751 -138502 -126022 239140 65461 -388574 212734 78522 -14650 7921 252940 378029 -259275
8739 -468658 -284159 -48047 180325 231854 -310686 200286 -126966 -122481 -229932 -116799
8729 -116799 1856 -124882 -51440 -285680 -195844 191459 24624 -100811 -193760 58659 57932
8718 57932 -38177 -241651 209377 -357017 -239061 -4864 324577 99307 -153260 -329930 41545
8706 -74491 -94204 -169417 -9508 -103591 -244472 -145230 -141370 -117059 -273389 -269998 -126175 180437
8693 76411 66096 -29335 -112393 -65307 62974 28461 -13347 172812 -346110 -22301 7386 -40132
8680 -24180 17082 3818 15968 169961 -261416 209651 -372803 -81144 10358 -75676 -48754
8669 -48754 -232626 -35803 19568 111428 -256694 -134831 156277 -77709 -245113 -79119 106283
8657 113117 33582 166667 -197676 -16257 167788 -56275 -335046 -56006 -199463 5445 149518
8646 149518 205636 131948 -296495 31067 -60097 -29552 -29081 138839 -323158 12278 -79460
8634 50384 -89803 107806 -85315 -125416 -96688 -143040 2164 -15584 106465 -24643 11912 250543
8622 250543 -1275 152836 -130580 -237207 -1233 -133542 140329 -67353 -29209 -219311 -5852
8610 16654 -308784 -129047 -140893 -397576 -109116 -65041 158217 -322654 -204232 -27792
8599 -192758 -113701 -101831 -202149 -72215 -1819 34904 -1072 82146 -185429 -241204 -202851 149223
8586 189477 118968 -481374 -181255 93651 -75882 103839 317156 -305312 114897 -99651
8575 -92655 -27716 93629 -239849 -340438 9431 79136 -181445 187 -240919 -202128 166307
8563 90434 -306287 -168254 -230303 -176089 -87764 -156238 -60785 184466 -107286 225062 -253724
8551 -10533 -33754 264700 -15850 -56844 28281 89254 -92518 -54098 -121014 96224 -205720
8539 -64373 -379855 -376021 -74812 101006 214252 129994 -93393 134426 -23620 -21084 84762
8527 13599 -464539 -114269 -132144 -232432 -511934 56571 182998 317806 -127277 45713
8516 -71506 -151228 102178 10317 -33134 -3817 -180585 62840 -9221 -164225 -191135 -412845
8505 -412845 173439 -113652 -86679 -151880 340667 -123770 208280 -47062 278957 -405387
8494 34899 28918 50858 65837 -185473 -138667 71496 -238369 11761 -35165 -125573 -74245 -173058
8482 -173058 -121946 -259026 -33877 -236443 -270550 -342577 -83788 34734 58283 -171902 -329692
8471 -329692 -120836 354080 41027 -104388 -378803 -94435 187846 94607 -736908 -119576
8460 -126288 -251439 -59602 -225327 -31852 -97020 247702 -18272 268706 -90254 -32014 -56816
8449 -56816 -187406 -49863 774 50574 -223436 219242 214227 -415274 -342815 -15500 61297 148004
8437 148004 186843 147822 -168585 -78523 177088 -180706 -79950 286469 -510693 -182917
8426 -65063 101210 119735 241563 23778 -298157 166193 10188 -7468 5667 -173833 -274551
8415 -274551 7589 -228397 107081 105660 24454 -107108 -452037 -2612 -253757 -189088 -120705
8404 -120705 135600 98039 -45051 65374 4335 -27901 -261151 66951 167573 -292333 170787
8392 106990 -358754 -290436 70466 -134829 -88359 -37658 -113528 302785 -114023 -20890 106839
8380 -184749 -444051 280334 126372 -12959 -43986 -139468 79182 322820 -9298 -12968 -190338
8369 -190338 90934 5548 91590 -200937 24532 39676 -306052 1596 24823 208796 -64668
8357 22033 -279505 -89117 -39341 -31919 -171725 6015 126077 2705 -158814 136279 -123331
8345 100998 -275033 12683 -154273 -52012 -284267 -197891 27081 -176341 29687 7935 -115543
8333 -70506 -131216 -347850 67312 -54647 -248599 -30650 -42352 199388 -4144 -300289 38112
8321 64115 -21539 -433201 -83550 -441121 265709 94427 115305 -233193 93692 -164746 -101938
8310 -101938 -175560 243047 159121 228331 -144893 286472 -15925 -255573 -194556 165281 -4973
8298 -308398 10116 -22020 -2518 -54969 -37143 118436 222297 -82542 124305 -74668 -59320
8287 -59320 147384 -175173 115069 130594 -392817 -158734 -183878 -151586 -54527 -213914 -38025
8275 -56366 -232855 -99334 -135183 -171074 37591 132680 148065 -463512 178242 94267 -1192
8263 -59978 301332 -203559 -359431 -259431 -85685 100392 132631 177300 -100392 -375726
8253 -375726 -233463 -207356 5416 -5386 4397 -100845 -48024 -71258 -17017 62510 -178523 253406
8240 -39687 -190886 -129538 106593 -85924 -18084 -222963 -99504 134506 -93579 -254690 97395
8228 28939 -52914 37920 -244307 138146 -96331 -25678 -210017 -420594 -269884 37682 45435
8217 45435 -272763 128589 -57109 -192170 -82534 -48388 -308391 213248 -3081 -140149 -125377
8206 -125377 -68277 79282 141150 -3947 -401898 96487 308376 248027 133813 112995 -6675
8194 -1355 -1468 -140194 158611 79049 -90166 134227 -57140 -9020 -179272 -106819 -244384 -88462
8181 -335645 -313569 48813 -185674 153864 30692 35673 153099 -378497 -52313 -66584 117260
8169 -18313 221998 286490 167063 171324 -49140 -398370 92541 -154875 -198877 -244541 360804
8157 58405 275134 35100 -189864 -63245 -38877 55578 -243836 -242275 6084 -65605 105547
8145 148240 -227608 -233745 99156 63303 196976 136231 -71988 23657 -258939 3652 -61486
8133 -955 -160170 -36098 -518764 22251 -177663 34825 178862 -55792 15099 -215835 219931
8121 -258888 -98805 56242 224986 -475728 -114494 -179030 -138698 48939 158742 -137145 -172343
8110 -172343 46236 20511 -255147 -154189 -79725 619 -167015 -205692 197689 -13119 37048
8098 -514640 -20511 22385 142534 -211841 83768 -180418 -43367 95395 -50850 152293 -249560
8086 -129752 809 -168841 117124 -151342 -370022 37725 231301 -188558 -233934 -578382 -68610
8074 -98189 595944 -64871 51594 -105498 412747 160249 -186899 -102707 -140691 -10719 -183853
8063 -183853 -228989 -579089 -45018 -144759 -365905 -29331 -94727 -263139 -51076 251081 -275377
8051 -169527 -21333 -5138 -69536 30247 -236232 -250291 103879 -301363 -38008 52093 -82951
8039 151048 200896 -214807 -151796 -138465 -163428 58848 -147296 272465 95824 52132 -314083
8027 -303368 -152574 -413346 -29759 109615 139532 86734 -247490 -219730 -61141 -40229 -52318
8016 -52318 -136851 -149738 314182 44161 74685 239296 30688 66408 -257581 -116033 -406378
8005 -406378 25211 -27583 61627 242115 73551 -54359 113393 -155916 -39130 148117 -179771
7993 -269827 -336012 144632 -162501 -176735 -68155 53909 -6310 22508 -191815 -139841 303960
7981 -184697 -252555 -79901 236195 -124992 74393 -172211 -241434 -3941 -95922 -149026 7559
7969 -161578 255854 37512 20730 251799 556 -416784 -228345 88199 195136 -394930 190284
7957 282948 -170328 -73616 29961 15273 -144882 236331 188823 -139538 57714 -173129 126295
7945 -170788 24499 47518 108444 -383737 -101630 35838 349525 -269175 155911 116516 123061
7934 123061 -214444 233830 -31262 77013 396851 -2482 -117368 -41866 -275391 -399876 -107895
7922 154480 -51389 361252 -73518 -25155 -113521 -159493 -101606 -84080 39462 -47030 -149790
7911 -149790 7863 2356 -59553 16656 -90290 30744 -220016 75691 -423803 -146377 -103624
7900 -103624 69648 -80316 56491 322990 -196885 36393 23677 -24276 124559 -8376 -167211
7889 -167211 -162679 46567 -155833 170520 13858 264442 -9318 76508 155026 -469882 31506
7877 40162 -348116 90124 -189847 -9078 -49198 19459 405069 66762 -203434 19150 -18862
7865 75249 -378497 -423953 -213885 -359547 96420 -285438 43297 -225301 -173698 64648 123337
7854 123337 -50369 64189 161026 -83173 187848 164672 -69266 -117131 194462 73078 -233401
7842 -59596 18919 -209958 129964 340319 -197432 -348462 -79430 -145016 255253 -251239
7831 7396 34760 -6379 214495 231671 -43269 -26167 -29476 -195612 22038 130967 14135 202355
7819 202355 -189618 -134097 -4655 58703 -177968 156740 181904 -36493 -2925 158771 240806
7808 240806 79449 -117766 28008 92330 -118885 -70709 -104121 32550 31327 73601 -93871
7796 -260543 -191555 25709 -131052 58341 -59758 14562 -34050 -197386 -472717 -82731 -99083
7785 -99083 42238 -169052 -76889 129855 -110205 85524 107676 227058 -108459 32808 -144905
7773 -56961 -189203 -45611 -83741 42496 -44795 65183 -86258 89926 -25915 -48049 76530 86069
7761 86069 -62570 -26385 131544 -84285 71956 -135161 -287997 68201 -732 -1364 -28385 83538
7748 -13133 -77302 -141143 -240960 149039 -268568 -175197 102038 52554 -458987 334573 283383
7737 283383 105361 -109262 141602 98939 51245 -177187 -40264 56239 -66160 -124691 -12917
7725 157939 35144 -74980 -41976 -103357 -110525 -22728 -212493 -93279 -133672 77535 145999 55060
7712 225159 35369 -413283 -373764 -144198 -232671 -57514 -229912 78348 -269794 42616 111572
7701 111572 -130773 -195854 -66628 37558 -91974 -165313 242062 17221 68291 -15667 -239181
7690 -239181 -95017 13865 53044 -7102 117324 42432 -154391 -347798 283052 -113426 91430
7678 -65393 343254 296960 -94535 155559 319853 -17048 135004 -390444 142057 -166938
7667 28350 39236 56859 114331 5720 -70005 81686 -101630 -383611 -231758 73878 122692
7656 122692 -227939 -27255 22104 -279986 449518 -221589 -60029 314913 -364357 -165140
7645 122179 -84379 188077 -53463 290910 103291 -10711 188084 131953 299483 -126063
7634 -287684 -273663 12142 6875 -560133 -70463 -242178 -386085 92362 195494 304614 -156503
7622 354655 -280548 20311 -365836 -336400 -151957 94889 445376 -61639 -21187 14892 60781
7611 60781 -297601 -6141 225000 99288 -170885 118454 17624 -131945 -84553 -357984 118363
7599 -143369 137199 64580 67696 -118268 -23087 -351440 -442716 31563 46950 -46520 -118175
7588 -118175 -188873 -129655 -33964 -41396 -198705 -234500 -337046 -223668 217368 -88752 -142285
7577 -142285 -152986 -169 -79591 -221442 54584 -215516 -259824 -57909 -22646 42054 251039
7566 251039 89181 -48778 -174036 13703 89550 74000 -92634 -192478 -196832 30903 115817 -225395
7553 58680 -356671 -300823 -136130 36122 266017 -182999 174463 40847 36840 -247478 -18729
7541 -39806 -22913 40330 -186515 60464 -283103 -36561 151778 -558333 67376 -297902 242050
7529 45716 -324005 -130455 -4319 -64892 -392623 66939 -172508 -61249 -96468 285048 219888
7518 219888 167800 196129 -253587 -355720 117679 120715 36242 128582 -180165 -90202 292315
7506 -42803 -81052 98353 -343741 58860 53863 220053 -110552 251818 49005 18049 -214670
7494 159238 7854 -65866 -97047 -226908 -212602 -67489 -76456 277287 -213669 -48256 -38266 -72359
7482 -72359 -46948 151100 -68274 68300 -44606 89126 -931 -84392 -115259 82125 112768 30189
7469 83217 37793 -1622 -18030 10105 -105891 -51811 23548 67628 -289760 98500 3738 311144
7457 311144 177156 -265118 15870 122306 -109488 -167795 39221 116874 -108001 63305 -187766
7445 -68047 52187 -118902 -103417 35573 -217448 1696 -59605 -112406 137925 194701 210862
7434 210862 -292320 -117817 191996 51169 -191124 -151151 130209 -120633 542953 -115274
7423 110226 30538 -153287 -94093 242311 -75685 -95695 215447 -28546 -319594 -159297 40074
7411 43616 138598 49191 -303902 -264930 123316 -113313 -44268 63170 -54411 -172169 220133
7399 262648 -55350 223522 14770 -72552 -106152 -152020 -305331 22420 -172945 -54156 -459030
7388 -459030 -239278 -228279 -63587 274174 -100812 -60007 -280614 -45089 437289 -178378
7377 -39336 -11436 -109236 77595 -51591 -288939 -227473 -132595 -243606 205 -189799 -87255 -4448
7364 -225698 58995 61590 504998 -3137 140605 -190254 -394451 -54089 274229 -30812 -149863
7353 -149863 -28831 292944 21418 -7954 -82028 -105798 -90054 260569 -260941 -158426 -328064
7342 -328064 -190968 -212212 -19967 47399 62850 -122277 -80665 -76676 135469 167622 500015
7331 500015 -241694 276949 116629 -88821 283867 -375055 -53765 129446 157265 103567
7321 103567 83905 25062 -79925 16656 150543 71700 -280696 -22055 -32464 -27572 50127
7309 87993 -67414 205918 53411 -17915 -104366 61906 314011 2641 -19753 258849 -106511
7297 37496 -128054 -42504 -53122 3553 -39916 -162090 -27464 -135669 -29650 -660339 -64239
7285 -114375 43386 195495 -129235 52156 -132314 24167 -125513 50063 -155870 -127192 -314856
7274 -314856 248801 94013 -152810 267863 -110074 -107383 -56062 -144914 -322446 -37488 231033
7262 190437 -192751 23990 -68011 -225369 31430 -421757 -413928 550683 -29297 -332392 -184665
7251 -184665 -197477 -395248 190751 -172350 4766 134799 -69850 137169 -47267 176865 159149
7240 159149 174615 160463 -67429 49787 83251 -47304 -51900 -409246 -293408 -189846 23261
7228 -130782 -38081 174665 -199438 -221656 -9539 -213684 98541 -294061 -252628 -176312 147461
7216 45271 -230512 -29053 -123773 -266813 139592 -128613 230392 42854 -45927 82564 -206545
7204 -61234 51777 -114313 -5108 127374 -118271 -94552 48496 30499 200491 -87293 56532
7192 176210 33341 30065 109326 -137604 15996 -249796 -136394 -113836 101178 177392 -152771
7180 -130745 197338 -104269 -180316 26825 -12257 -158388 -86367 -54908 -100693 -20423 215813
7168 -11808 -58610 53692 -389840 -142686 77221 -208222 -59913 106742 -72468 -256877 188791
7156 -36756 -63929 -340804 -277556 -58774 -76447 -145664 -154714 -374770 -128693 -178972 57120
7144 -239004 284209 276234 235024 -72328 -278249 165879 154493 290789 123739 -158652 -86679
7133 -86679 -1534 -229686 -149766 -125967 -27633 18331 216314 -6460 -34179 -205313 157538
7121 -100712 191657 79855 252162 -128713 311647 -51533 118370 1344 -229971 10091 -46506
7109 -185340 204440 45277 -119544 76164 -218724 25862 -127429 233880 37375 141424
7099 141424 -67450 -34 -86723 382727 155393 -313429 15176 103019 304821 18239 -108162
7087 79522 28404 196734 158089 -267125 -43650 -70558 42568 -137537 177097 -163664 -62591
7075 272214 240312 93517 -164733 22118 119558 205751 -236576 -147774 -61636 209360 -16170
7063 111881 -438777 29182 -53862 -97735 -369738 154878 -219213 74105 155876 -67847 24709
7051 -202956 -50614 134715 -73559 8559 -18027 36777 48726 303113 103464 281200 106279
7039 -78849 -93265 -200227 78639 -117105 -376067 -178744 -382971 265735 -33092 -344183
7029 -344183 188990 -17454 -61733 -46129 -178041 -362041 -38461 197215 -86448 114640 326280
7018 326280 -292083 99242 157435 84694 509253 216806 -297123 -360590 -322569 -53770 192831
7006 -58768 -5381 -78443 34199 -47173 -122481 177275 -45713 -8165 5058 47635 59492 -46579
6993 182857 146526 172540 159213 195516 -178692 -97704 -49211 -116995 -150113 332477 206376
6982 206376 -29902 -190386 -36185 -69725 68440 -296036 168574 -219084 -114712 14544 78959
6971 78959 -53675 -221835 -72352 -67051 4470 189904 -96452 -116611 144295 -21219 -60095 -263245
6959 -263245 174820 -146420 -108291 -163507 57469 -44285 93697 181596 -44788 89917 156526
6948 156526 25744 -42863 -300935 -291013 10595 -113213 44057 -7345 -54096 -29952 170373
6936 -96716 -35657 -259259 -199130 143690 -18358 -269553 -140305 -235064 -53493 -150112 -370992
6925 -370992 -147261 -201400 -118345 1397 -16705 -172393 226030 63308 301013 284655 -11634
6913 -196350 -268259 239613 -47869 -13019 -144679 -117323 -105780 -19229 224693 -232170 13176
6901 42419 -245664 -86048 227986 -14011 168949 287386 153461 -54783 -348603 -78774 -10808
6889 -760 -53933 -126411 104120 -2122 -164032 236025 -317531 -84552 177271 -22674 -58661
6878 -58661 34488 36938 -11920 162587 -111540 29568 112967 68028 -311477 -218529 -258504
6867 -258504 30116 45232 -222811 -118266 144177 -99059 -113206 -198822 -114256 42513 76445
6856 76445 -244863 -31728 3393 -23163 -109525 105919 -304260 -62124 -11979 -183561 -309651
6845 -309651 -131065 2173 101874 -8579 -99154 94475 83803 -90499 -240601 -13770 -383625
6834 -383625 -200792 -68861 71364 -229563 11720 142695 -139245 -30562 -204162 -23846 162829
6822 -291813 -217950 -13907 -171799 -234483 332105 -281468 140665 -87342 150717 424656
6812 424656 -64006 42211 112171 32425 -294296 15755 81720 -104797 49562 178472 50911
6800 -77158 -44154 -270792 -79201 -78772 -37607 234808 164611 -131694 151409 44154 -426965
6788 40488 25549 -45957 -319824 62978 -219848 -276684 45565 190390 42423 77239 -205652
6776 234683 -102172 136352 1503 -127462 -14398 -118314 -171257 -139269 -83495 -406462 -106500
6764 -86980 -272971 113513 31715 92059 -82192 -108623 -137023 -270014 146910 -45611 246981
6752 -130350 -6324 -10230 -416044 -75801 7357 414403 -469073 97993 -229823 -13746 201750
6740 15876 -199578 9603 156968 -182255 -91700 -413610 -123444 -20616 -51779 18197 -284079
6728 -164022 40665 -205594 -182910 -191315 333117 138798 176747 331696 -230435 -42153 -33316
6717 -33316 21650 -14725 127317 99594 -102194 264320 -49842 19603 -68561 -139751 266799
6705 31559 28689 -78878 133803 -63526 82883 142811 -34006 -368304 359627 248788 178194
6694 178194 -116199 -128116 43402 -106008 -96256 32022 -230713 132672 -180382 -226054 -50253
6682 119711 -72758 -217390 -207462 -285579 79664 196010 74817 -487565 -134719 22712 179790
6671 179790 180615 -59701 192481 24679 99616 -204916 -53331 -70074 -165916 20863 -61701 -201688
6659 -201688 147188 -65294 195275 275020 92373 -92324 243865 -157999 262335 236545 -157177
6647 -124927 52271 297660 -48394 -149024 86442 -1906 33942 -153819 -70681 -113629 -20084
6635 -161034 -268020 -31452 -32713 204494 -150506 -71073 63265 102042 183371 -44075 -225490
6624 -225490 150597 30545 70547 -58259 1870 313659 -250146 189631 -101179 102994 20476
6612 -56471 110310 169645 -325095 -133534 219226 307453 57846 199934 -290426 51633 -53969
6600 -12461 -15925 -318941 74109 129235 266490 171394 466 195579 169946 -138124 240604
6588 -116654 -402648 -103723 76740 160373 326358 298731 -181888 -134899 -141351 60071 -151723
6576 57247 -182919 -147989 332543 -109222 32281 -119966 394265 -81400 -70985 -87607 42368
6564 176216 -79572 59056 139551 -260206 -61614 -246004 47956 68200 62366 -82209 42387
6552 -248551 190311 92760 -7299 82037 14281 -168878 147242 -2612 92717 -75313 126716
6540 120391 -191809 183612 -79740 337 -119372 -97931 -269656 -75580 -100417 -168593 43850
6528 -217133 109820 46623 -114062 -219490 135408 -153842 -93706 -3751 -146501 26840 -339585
6516 -73647 218305 109823 230983 273190 -4252 -164259 -24533 66589 -266471 31730 79614
6505 79614 -169577 550148 -158088 119750 13530 -331962 -83088 -89713 122321 -8389 247625
6493 103039 -10532 -78044 -62797 -367049 146452 31547 146852 -294535 68990 -209569 60211
6481 168934 108977 -129677 -82570 -3998 91834 -60915 114141 298892 -41087 -115293 161472
6469 27926 98348 -82182 -37054 100548 157630 -185848 -132136 102081 -247078 -96059 -93467
6458 -93467 -73051 14804 72601 -99973 23088 -65232 -222347 -141438 188591 -61651 -64181 -112163
6446 -112163 38156 59862 220917 -120396 149734 -6757 -287951 1264 87064 -54969 -65449
6435 -65449 207908 129158 495702 -224437 50126 4771 58693 -10433 186007 -77400 -213206
6424 -213206 -258134 -285279 -213240 277860 102169 88467 -173194 16118 192908 91088 79962
6413 79962 -175957 152857 211434 185691 -85995 -382545 -5285 -214754 -54626 128969 -196834
6401 -85874 -73813 -369431 189518 131133 -256941 -115982 -55584 79433 241716 -29873 239482
6389 187647 16133 262944 319822 -47959 -303646 131497 214020 23733 -156448 57995 -252093
6377 39177 66017 -41752 -36048 -279891 -408725 439716 -216277 -172928 -5489 -28506 -137187
6366 -137187 58264 -126753 -254557 -160181 28231 -45316 -88531 62714 207989 41320 133498
6355 133498 7495 -152552 169918 -42882 123424 70402 118688 -64349 122373 -211810 51447
6343 -122593 259397 -241673 -200689 -13973 44821 -154713 17627 64959 -31471 -268696 -33302
6331 87919 -9985 107393 90290 107123 23201 72128 84889 -263366 -7565 -109856 31671 162832
6319 162832 -18502 -489895 84123 19039 364623 -30946 137983 -63736 -119915 -300348 -142434
6307 15106 -562633 -24503 225527 -345403 -63356 159967 49729 -113175 158064 -246897
6296 78560 -176392 -183798 -261626 253327 81413 -47855 -270911 -79343 -176825 220689 -495907
6284 141497 -58086 48310 99798 7897 -39436 -270037 47477 -64875 -244990 20672 29014 116191
6272 116191 -148291 14517 -61430 -239820 21395 23429 -105623 219835 15922 120184 157989
6261 157989 49365 -245310 -140946 -217418 -350809 59910 -89129 -322313 -279810 -158076 11971
6249 -8386 -98925 97864 189555 67464 306345 253027 122348 -90786 -181197 41818 -85360 -42170
6236 143450 234197 83235 77819 -1689 175899 196228 198294 -46043 -185129 -68055 20705 -135165
6223 -176225 262357 132289 253576 -275640 61675 61131 -285700 -38072 411858 -34118 -80284
6212 -80284 -196000 -308473 -31661 -155597 -160273 -138699 206836 -321811 330954 -279265 -83369
6200 68999 -238130 198868 -66072 212653 482560 -77520 23208 -230165 -208218 -277907 -25022
6188 50126 101821 -252526 -111305 101638 243676 -67785 -248023 -121989 302815 -242868
6177 140890 293753 -227869 149674 65256 -223898 -54903 -37999 -168843 -84454 -112019 205247
6165 -312297 -47827 -106437 71550 28899 118376 -123152 -42085 166717 5414 -204661 2293
6153 192126 23789 90038 15616 -19498 -237054 -342675 -13974 84732 -210642 -179968 -52697
6141 277168 -239523 282522 -57765 96583 -95500 -24898 -18252 -98935 -255264 157457 -85014
6129 -248875 -30377 -217225 -170298 -155707 147765 -14792 318150 59212 18179 -213443 -3123
6117 13742 -65709 -69954 -285156 153244 73493 -213354 374470 -62387 -39963 145879 2904
6105 55830 203257 32013 479399 103461 37992 -92863 -144807 -213147 -327960 212320 -173065
6093 51732 -265752 -132876 46101 -142779 88465 229954 -192765 -216468 -103342 39992 -118928
6081 160137 96842 -254162 -96772 -209703 -122464 152298 258174 -133762 48148 -133866
6070 -180819 -132656 -33758 -258864 272849 -18875 -68907 -178712 -371326 -24280 30402 -159589
6058 45452 -41916 -80460 154748 92377 30114 -31879 -30155 40007 -175602 44385 -73435 -210164
6046 -210164 -107679 -41537 -160250 -117492 382679 -406851 -118560 127112 77746 -305667
6035 36657 42817 211581 258538 -14180 75032 -85073 272885 27876 91248 -226750 -68321
6023 97300 34374 123354 -15668 62643 422805 -31076 -202148 62726 37764 168547 -12997
6011 131389 -155636 -62360 29186 -18685 -147660 -386028 -97412 114106 280206 568262
6001 568262 70598 85925 92625 -121724 -84236 -68505 113922 297901 -193631 28932 221550
5990 221550 -214711 -219886 -270223 -163904 490042 -267215 -258718 -168797 94450 -134429 89492
5978 -7397 67410 114690 58391 -245063 -34149 -282072 -2529 -20973 -72356 -184598 -199686 78342
5965 376796 -258586 -272111 -248806 -65043 58086 -33747 -26636 344944 -111883 -338592 -18246
5953 -188240 140384 -12028 -13849 -121826 95909 314731 -233614 51924 145627 -112183 182346
5941 137771 162378 51596 -321192 -113309 -184610 -240674 -82653 -297248 383029 23543 57660
5930 57660 -261675 -218498 233563 107184 -79528 34544 70322 -15950 92423 17366 -68288
5918 25947 -48423 -75835 -264572 -77145 140151 168184 163680 -349936 337300 -79307 -112437
5907 -112437 276979 -125752 -306003 98146 -184046 -289910 -61234 75991 -19966 118246
5896 -306857 -261203 162689 35494 -116696 198137 163167 202807 -35973 102915 149347 -21040
5884 193036 41719 -4670 -330891 64764 83228 40282 11396 -295498 66258 -47734 87550
5872 14592 57618 -195500 -290210 173427 189217 160716 -145566 -208545 -115586 1798 -376979
5860 94149 -136088 -201966 -95042 -215786 101986 -236223 -326164 -60188 29572 -90704 -192391
5849 -192391 42241 94146 -83898 321373 175621 35464 -27304 -120285 -73845 37500 -90172
5837 150996 -89272 283189 107385 4155 -146219 -225564 92033 402461 239973 63621 -40014
5825 90864 -206283 172827 31669 143845 231865 82860 -170461 -251367 200930 -72664 65511
5813 -36019 -247822 -124449 -148849 127358 133968 25857 70210 31508 -151450 98450 1575
5801 3297 -12826 135540 253780 -66654 30233 86130 48954 -133781 66062 24500 -186309
5789 184757 -84420 103695 25607 -245584 184110 -158893 -35284 74560 176170 -2647 185645
5777 287332 313889 -65086 179970 123906 97994 137052 -30354 88536 274962 -101213 -178164
5766 -178164 21855 44208 198543 -202867 87382 -10699 34542 153164 -14828 148250 46609
5754 159666 36170 79461 -99297 3704 108612 112763 178688 -95580 52412 -328430 -454563
5743 -454563 49510 107928 -110947 129333 -459102 -74669 3983 -127214 -195451 49705 73121
5732 73121 -95393 83030 4909 35167 -193716 -198606 -98066 -14882 -201779 -178270 178337 74655
5719 15210 54960 60532 265624 239475 -143604 294882 246609 -22432 95891 -58002 -169818
5708 -169818 202764 159013 123674 -104713 -396398 226298 -124655 -270509 235619 263311
5698 263311 30025 -22185 189766 73414 47432 36050 142176 -177032 -362869 62228 55598
5687 55598 -73632 265479 -113570 68753 -211552 113615 -267466 -42669 -156264 -143951 186455
5675 230841 -26742 -373575 32596 342186 -113707 95622 -292251 158751 112934 -123633
5664 -258976 -63012 223205 275049 -51300 -208171 -59533 83096 -88413 111003 -166504 41814
5652 -354239 162571 -9992 -47392 180263 -275915 -55634 -120219 -116700 -336008 -169579 -50913
5640 -318458 -229778 11864 35147 -102421 266853 -94565 93804 -27326 146249 187520 -40140
5628 54167 -205266 247353 -174119 -150462 177963 -145291 -334043 -210758 -6746 -36788 -111460
5617 -111460 -93866 -177088 116425 31682 -39857 2158 129929 91860 -147785 -33707 27067
5605 33727 331144 -180523 49910 -70227 -144051 -192877 22180 11582 42260 -24978 367211
5593 143582 -149072 95358 266299 221103 -196713 227923 -171504 223761 264691 302172
5583 302172 -391967 114664 26917 96293 -301555 -3643 -223824 251555 158404 -1982 -327698
5572 -327698 -68545 146122 -228859 -211790 113692 223414 -230480 42071 -32766 -130042 49187
5560 -205491 -301749 -234856 30972 52909 -1421 83908 -20356 62884 -193121 -216258 19245 -57685
5547 44370 52251 -13028 51271 33980 164343 -197110 -311191 -236145 77527 97923 -77555
5535 123357 -362909 -192046 -102198 97303 40096 22609 -329737 -85971 57483 -140857 6257
5523 -251736 -105481 -172915 -4042 357919 65011 36652 -194957 -172141 210748 296312 158814
5512 158814 -148041 -379532 37101 242652 178590 -192441 250210 -56419 -120831 72207 127266
5501 127266 -152873 35115 -68155 -62781 46832 -4456 353619 133359 55485 37487 -10207
5489 104090 -236243 131235 -56753 66109 -2191 -374417 -32042 82581 -101268 -284832 -75056
5477 220948 -249285 -29320 -105767 144103 -89575 182139 -139584 -6838 196604 -182465 -18120
5465 294553 141095 34141 141927 -128506 -21712 68339 -232857 -164599 35500 38149 -89333
5453 165433 9102 139011 83562 -31165 25066 130443 -52156 53819 105196 12520 -152414
5441 -274985 -245076 16007 -76427 179944 -157953 51866 -158248 -17444 -59322 249069 -19792
5429 -75248 95939 -29782 -162979 -88619 -206160 -6599 -256655 -273611 8393 -384330 -28074
5417 10273 442852 -272087 -68695 -68735 369883 -269520 -61060 59891 55164 55360 -81359 -21902
5404 -97567 232756 32754 -97486 120959 -179409 79225 21347 15769 -22150 -143315 -129625
5393 -129625 130277 225321 -176065 200288 -99897 -99372 64514 -207557 -32170 -7779 246636
5381 19536 -88256 228383 -61178 10444 -130627 94999 23637 -197997 118352 -149576 -220081
5370 -220081 -45154 -178775 -22909 -161992 155811 -141176 -102704 -190125 90403 -124421 -289647
5359 -289647 161566 8595 107307 -21758 -39728 11647 43189 -109765 -70096 -241191 -143644
5348 -143644 142562 113805 -150120 89747 74973 -77945 -257902 128677 89328 4069 3797
5337 3797 -9836 -111179 164913 149833 18309 67456 -330119 283309 292510 53649 92108 277942
5325 277942 122232 -101694 -161377 -219125 27947 247443 224019 300367 -179103 -92762 -128256
5314 -128256 -64200 184352 -38180 241303 22567 124306 -303975 -189867 -245375 -493190
5304 -493190 -99220 9615 333306 34899 -104925 205105 -123945 96975 -196137 155214 -165342
5292 189066 98499 34438 14290 -32448 286530 201415 14702 -68201 214197 -85306 37343
5280 -227223 -75725 -328650 1031 -80918 -122231 124120 -85263 -61689 17066 -183644 -65917
5268 68553 -300244 3140 -85884 -291403 106692 -25475 113549 170877 134403 -308258 207601
5256 -148489 -16549 130263 215906 399134 -258945 174831 244404 16116 135018 -56727 -137253
5245 -137253 -221920 -7507 -67504 -30935 -19536 210608 -14905 93167 -408855 -87287 276291
5233 118548 175694 -500507 -50144 39549 69819 -31098 34873 -47608 -195697 21592 152296
5222 152296 -484732 111335 34534 -115069 -13788 94915 -104892 -42356 385678 11748 -36528
5210 -19547 -195117 -39408 147321 47020 -45150 -127396 -140552 -103276 -191090 -258032 -118866
5198 -23612 -59137 -236530 224306 -51185 161473 224556 -24457 -64111 47139 -238258 8771
5186 -53839 -134111 150473 29002 -67980 -34592 7337 141527 -123038 355666 -178225 -48230
5174 170572 -268240 173208 130435 -143992 -157835 144836 68074 -227259 -20365 -36078 -55252
5163 -55252 284307 114275 98234 135114 -141033 -254002 -85966 5908 238817 -234457 -95793
5151 51696 -252577 -198979 -142655 93791 77707 242977 -81374 -78262 170297 -78955 217842
5139 -126782 114670 -41707 18729 41153 77585 -15834 -251658 377870 -90762 51825 173835
5128 173835 170978 79111 60824 -78527 -60630 -25965 -9465 176513 -127431 46668 -93865 337451
5115 273785 -402654 132714 -60571 -217038 142346 -82072 25663 -129598 58625 329003
5105 329003 -122099 -217284 -121533 -3069 -205537 89969 296806 22809 443084 116891 -45170
5093 -299607 310275 13398 242096 120216 325410 103277 -202000 74754 -136504 153149
5082 -134687 -32037 -52411 -143144 302798 -75985 32629 302945 -356743 -338039 142101 -108217
5070 191669 185101 122329 -75096 176594 66214 -193570 -228605 -354839 98285 171098 -115939
5058 -41013 133397 -43323 228124 373864 -72986 -225522 -34828 -193231 269027 194767 -229410
5046 -129037 41301 -12307 338679 162204 -483410 229274 131038 -26611 -72772 74885 70944
5035 70944 294369 -27850 -362348 182145 -95992 -124847 -48560 -147817 -254626 -123944 -205778
5024 -205778 -63639 -239308 -129770 293243 214303 -5305 337923 -271698 -52320 82573 -87920
5012 -168397 -120246 -285036 58880 5652 37287 16289 -68603 76432 3407 -162245 -264699
5001 -264699 -91508 50405 27018 315052 384350 72491 7444 12872 177565 -50471 220104
4989 -80104 -195869 -245568 238641 -115388 27087 236013 307367 147005 260667 132139
4979 132139 53517 91917 13592 90102 19215 178928 61742 247923 255486 2339 220244
4968 220244 127034 -45104 329239 -47291 -29370 60362 -306079 -188109 -123854 127301 -125660
4956 93605 90119 2312 335980 -70288 -215298 -74033 -2674 49550 191278 -68263 -115292 -95089
4944 -95089 -27205 -246198 14543 -307739 -87172 271183 -21490 -145281 263545 403139 -472386
4932 -162436 -186345 -181132 -79016 59516 -120211 325691 245801 93033 -52282 69146 87256
4921 87256 -23140 1613 -3827 -171098 -177958 395878 -109942 -7804 -17325 269759 -407328 12974
4908 31636 -191222 202035 -338552 -157858 -99345 135299 -78669 -185906 40093 5866 -97621
4896 92515 -12839 7384 -75991 27543 -116284 98439 36695 -22108 92403 -9166 42981 -113970
4883 279357 -255161 -1340 -10593 -27838 -26719 -168635 -106425 -14112 -232927 -393803 -25660
4871 -270324 -22328 -336729 91502 -191863 29574 40765 -248582 68931 53943 -262680 172376
4859 -42118 201171 -159929 -221413 142189 31060 -154634 25495 -5386 2004 189720 65195
4847 199244 108345 -116417 -73817 -8026 -88083 24202 175752 -190765 -39331 -253018 -223762
4836 -223762 299836 80341 18415 -4227 56605 37394 164408 -30900 229299 -180387 -85692
4824 -8082 -75152 127328 -400624 145390 -52954 -248779 -128880 250 -134764 269858 127031
4812 -393097 41084 105592 20466 -227574 101540 -298186 -201297 -123869 270335 121090 377879
4801 377879 -51760 -300119 52457 -146910 9378 -102459 89335 14373 85840 469594 327450
4790 327450 -211887 48322 31524 98105 -5786 -73832 67290 240510 41470 136018 87222
4779 87222 -100945 -172500 -108982 -124504 -104881 -76685 62030 67121 171180 41357 63401 -93082
4766 213006 111114 236004 -100354 -134873 -86768 -109510 -505885 3800 43900 428262 -15438
4754 -21677 156061 -15734 161091 241117 -63904 -137452 306162 3546 271197 136212 209832
4743 209832 -47911 -127360 -137822 -47771 -89577 190532 68386 23934 353261 -256642 164044
4731 441946 -337479 184165 -63036 5558 -29830 -57261 -131738 10916 -25851 84236 -52313
4719 -152012 -145773 8299 248319 -394251 103738 317789 -56167 90092 -124146 39709 -61602
4707 -10950 -94531 -14526 4636 -12976 -250581 291006 139844 -145293 25737 -36564 -239066
4696 -239066 141770 190918 125578 -120015 1151 89270 68653 70585 -34442 137690 32572
4684 -339375 -159785 -214457 -369089 153694 -125062 86072 -309754 75703 -248224 69407
4673 381690 -143976 -4397 79520 -90017 142742 27502 183752 -122731 -16950 -284329 33176
4661 74368 309675 55719 392281 5787 -8977 -40940 -6905 85386 -319874 -190128 -54373 199136
4648 -105485 218498 119482 -178858 90866 -190501 -36680 -9302 52275 196051 5193 147713
4637 147713 -105616 -3734 142546 -171326 -133312 33953 -257089 60100 -281125 -107832 -69246
4626 -69246 10667 -2801 -69436 117112 239096 70403 -89970 -56192 224491 158291 155103 27883
4613 -61406 -42942 191846 -63168 175523 -58225 144810 -3032 63840 -116067 70101 -184168
4601 167988 -121379 277878 -80160 -77240 60379 61350 -237644 179699 148491 -3584 -171170
4590 -171170 -153171 55026 195285 181425 -43647 -309990 98528 -94916 84844 -266409 -539
4578 -388475 44863 105354 25724 193499 124022 151957 35933 196014 -19661 -499757 -315809
4567 -315809 -284191 -205010 15379 -105039 63662 -232166 -4271 32453 175819 183805 -242407
4555 -88577 78731 -27118 -291393 -41514 -90643 -170421 112177 -122378 287132 182699 -115519
4543 39416 -49302 -205025 -247616 155032 -144845 -296308 -77482 -32473 -367 176424 55484
4531 198226 138274 93967 19668 374994 -72623 135121 220895 -32509 164142 -44892 -59054
4520 -59054 -319109 -174345 154745 -164649 94211 272953 -196872 -198996 -243354 150259 141928
4509 141928 144869 3418 170879 -89337 -62235 79461 169590 199142 39679 -16068 -148187 -67606
4496 -128004 -6577 -366207 -3632 124776 -294633 -4900 -74 11174 -53527 319667 24426 -12353
4483 -38840 145706 -149498 155865 -217440 -220585 -155515 -132831 117506 171773 -135758 194309
$$ [...]
##END NTUPLES=NMR SPECTRUM
##END=
