##TITLE=AC1617_BRASL13348_8317431_PXtfBHKYYE
##JCAMPDX= 6.0         $$ Bruker NMR JCAMP-DX V2.0
##DATA TYPE= NMR SPECTRUM
##DATA CLASS= NTUPLES
##ORIGIN= BRUKER
##OWNER= Administrator
$$ 1.72 TOPSPIN		Version 2.1
$$ 2013-11-14 00:52:43.268 -0800  Administrator@X
$$ Compression mode = diff/dup
##.OBSERVE FREQUENCY= 400.02188249412
##.OBSERVE NUCLEUS= ^1H
##.ACQUISITION MODE= SIMULTANEOUS (DQD)
##.ACQUISITION SCHEME= undefined
##.AVERAGES= 8
##.DIGITISER RES= 22
##SPECTROMETER/DATA SYSTEM= spect
##.PULSE SEQUENCE= zg30
##.SOLVENT NAME= COFFEE_meoh
##.SHIFT REFERENCE= INTERNAL, COFFEE_meoh, 1, 14.98509
##AUDIT TRAIL= $$ (NUMBER, WHEN, WHO, WHERE, PROCESS, VERSION, WHAT)
$$ ##TITLE= Audit trail, TOPSPIN		Version 2.1
$$ ##JCAMPDX= 5.01
$$ ##ORIGIN= Bruker BioSpin GmbH
$$ ##OWNER= Administrator
$$ $$ E:\/data/COFFEE/nmr/AC1617_BRASL13348_8317431_PXtfBHKYYE/10/pdata/1/auditp.txt
$$ ##AUDIT TRAIL=  $$ (NUMBER, WHEN, WHO, WHERE, PROCESS, VERSION, WHAT)
(   1,<2013-11-14 00:52:36.252 -0800>,<Administrator>,<X>,<go>,<TOPSPIN 2.1>,
      <created by zg
	started at 2013-11-14 00:51:29.924 -0800,
	POWCHK enabled, PULCHK disabled,
       configuration hash MD5:
       C8 4E 4E 5D D3 5C D8 9E 9F 52 82 E0 59 8A DE 15
       data hash MD5: 64K
       95 86 FF 88 F1 FA 4F A2 59 C8 A4 00 F9 14 70 CB>)
(   2,<2013-11-14 00:52:39.237 -0800>,<Administrator>,<X>,<proc1d>,<TOPSPIN 2.1>,
      <Start of raw data processing
       efp LB = 0 FT_mod = 6 PKNL = 1 PHC0 = 0 PHC1 = 0 SI = 32K 
       data hash MD5: 32K
       0E 43 23 C8 16 CA 53 19 CF 1B C4 B1 EB B3 D6 12>)
(   3,<2013-11-14 00:52:39.659 -0800>,<Administrator>,<X>,<proc1d>,<TOPSPIN 2.1>,
      <pk PHC0 = 93.7738 PHC1 = 0 
       data hash MD5: 32K
       A7 11 81 44 90 F3 C8 1F D4 76 4B 44 57 A9 3B C6>)
(   4,<2013-11-14 00:52:39.940 -0800>,<Administrator>,<X>,<proc1d>,<TOPSPIN 2.1>,
      <abs ABSG = 1 
       data hash MD5: 32K
       04 FF C6 38 FC 7C 35 2B 1F 5D 3C 4C DC 82 ED E7>)
(   5,<2013-11-14 00:52:40.002 -0800>,<Administrator>,<X>,<proc1d>,<TOPSPIN 2.1>,
      <abs ABSG = 2 
       data hash MD5: 32K
       EB 10 87 06 04 7A DC 41 EA 9E A8 2E 8E 54 EF 72>)
(   6,<2013-11-14 00:52:40.143 -0800>,<Administrator>,<X>,<proc1d>,<TOPSPIN 2.1>,
      <abs ABSG = 3 
       data hash MD5: 32K
       EB EB 79 F3 51 A3 C5 25 BE F2 1D FB 83 AF D8 14>)
(   7,<2013-11-14 00:52:40.221 -0800>,<Administrator>,<X>,<proc1d>,<TOPSPIN 2.1>,
      <abs ABSG = 4 
       data hash MD5: 32K
       60 BF 09 05 B5 51 CE B5 C5 91 CE 66 15 C5 9F C9>)
(   8,<2013-11-14 00:52:40.284 -0800>,<Administrator>,<X>,<proc1d>,<TOPSPIN 2.1>,
      <abs ABSG = 5 
       data hash MD5: 32K
       D3 8A D1 D8 DA EF 4B 03 57 BF 25 70 FA F3 31 52>)
$$ ##END=
$$ 
$$ $$ hash MD5
$$ $$ C7 F8 EE 7B FA DA 7B 38 3E BF BE 5E F5 B4 A4 3E
##$RELAX= 
##$RELAX= 
##$RELAX= 
##$RELAX= 
##$RELAX= 
##$RELAX= 
##$RELAX= 
$$ Bruker specific parameters
$$ --------------------------
##$DU= <E:\>
##$EXPNO= 10
##$NAME= <AC1617_BRASL13348_8317431_PXtfBHKYYE>
$$ [...]
##$TP= (0..7)
150 150 150 150 150 150 150 150
##$TP07= 0
##$TPNAME0= <>
##$TPNAME1= <>
##$TPNAME2= <>
##$TPNAME3= <>
##$TPNAME4= <>
##$TPNAME5= <>
##$TPNAME6= <>
##$TPNAME7= <>
##$TPOAL= (0..7)
0.5 0.5 0.5 0.5 0.5 0.5 0.5 0.5
##$TPOFFS= (0..7)
0 0 0 0 0 0 0 0
##$TUNHIN= 0
##$TUNHOUT= 0
##$TUNXOUT= 0
##$USERA1= <user>
##$USERA2= <user>
##$USERA3= <user>
##$USERA4= <user>
##$USERA5= <user>
##$V9= 5
##$VALIST= <valist>
##$VCLIST= <CCCCCCCCCCCCCCC>
##$VD= 0
##$VDLIST= <DDDDDDDDDDDDDDD>
##$VPLIST= <PPPPPPPPPPPPPPP>
##$VTLIST= <TTTTTTTTTTTTTTT>
##$WBST= 1024
##$WBSW= 4
##$XGAIN= (0..3)
0 0 0 0
##$XL= 0
##$YL= 0
##$YMAX_a= 640833
##$YMIN_a= -543246
##$ZGOPTNS= <>
##$ZL1= 120
##$ZL2= 120
##$ZL3= 120
##$ZL4= 120
##$ABSF1= 14.98509
##$ABSF2= -5.573092
##$ABSG= 5
##$ABSL= 3
##$ALPHA= 0
##$AQORDER= 0
##$ASSFAC= 0
##$ASSFACI= 0
##$ASSFACX= 0
##$ASSWID= 0
##$AUNMP= <proc_prof1d_extract_pilot.lims>
##$AXLEFT= 0
##$AXNAME= <>
##$AXNUC= <1H>
##$AXRIGHT= 0
##$AXTYPE= 0
##$AXUNIT= <>
##$AZFE= 0.1
##$AZFW= 0.1
##$BCFW= 0
##$BC_mod= 0
##$BYTORDP= 0
##$COROFFS= 0
##$CY= 15
##$DATMOD= 1
##$DC= 0
##$DFILT= <>
##$DTYPP= 0
##$F1P= 0
##$F2P= 0
##$FCOR= 0.5
##$FTSIZE= 32768
##$FT_mod= 6
##$GAMMA= 0
##$GB= 0
##$INTBC= 1
##$INTSCL= 1
##$ISEN= 128
##$LB= 0
##$LEV0= 0
##$LPBIN= 0
##$MAXI= 10000
##$MC2= 0
##$MEAN= 0
##$ME_mod= 0
##$MI= 0
##$NCOEF= 0
##$NC_proc= -8
##$NLEV= 6
##$NOISF1= 0
##$NOISF2= 0
##$NSP= 0
##$NTH_PI= 0
##$NZP= 0
##$OFFSET= 14.98509
##$PC= 1
##$PHC0= 93.7738
##$PHC1= 0
##$PH_mod= 1
##$PKNL= yes
##$PPARMOD= 0
##$PPDIAG= 0
##$PPIPTYP= 0
##$PPMPNUM= 2147483647
##$PPRESOL= 1
##$PSCAL= 4
##$PSIGN= 0
##$PYNMP= <proc.py>
##$REVERSE= no
##$SF= 400.02
##$SI= 32768
##$SIGF1= 0
##$SIGF2= 0
##$SINO= 400
##$SIOLD= 32768
##$SPECTYP= <>
##$SREGLST= <1H.CDCl3>
##$SSB= 0
##$STSI= 32768
##$STSR= 0
##$SW_p= 8223.68421052631
##$SYMM= 0
##$S_DEV= 0
##$TDeff= 65536
##$TDoff= 0
##$TI= <>
##$TILT= no
##$TM1= 0
##$TM2= 0
##$TOPLEV= 0
##$USERP1= <user>
##$USERP2= <user>
##$USERP3= <user>
##$USERP4= <user>
##$USERP5= <user>
##$WDW= 1
##$XDIM= 32768
##$YMAX_p= 461886941
##$YMIN_p= -714990
##$CURPLOT= <Network HP LaserJet P1505>
##$CURPRIN= <$Network HP LaserJet P1505>
##$DFORMAT= <normdp>
##$LAYOUT= <+/1D_H.xwp>
##$LFORMAT= <normlp>
##$PFORMAT= <normpl>
##$SURQMSG= 1
$$ End of Bruker specific parameters
$$ ---------------------------------
##NTUPLES= NMR SPECTRUM
##VAR_NAME=  FREQUENCY,     SPECTRUM/REAL,   SPECTRUM/IMAG
##SYMBOL=    X,             R,               I
##VAR_TYPE=  INDEPENDENT,   DEPENDENT,       DEPENDENT
##VAR_FORM=  AFFN,          ASDF,            ASDF
##VAR_DIM=   32768,         32768,           32768
##UNITS=     HZ,            ARBITRARY UNITS, ARBITRARY UNITS
##FACTOR=    0.250966925370066, 1,           1
##FIRST=     8223.43324360094, -84330,       -279815
##LAST=      0,             -362608,         -65507
##MIN=       0,             -714990,         0
##MAX=       8223.43324360094, 461886941,    0
$$ Real data points
##PAGE= N=1
##DATA TABLE= (X++(R..R)), XYDATA
$$ [...]
23909 153659 42510 15898 299148 60895 -6432 31818 -5866 -187883 13765 -118638 150709
23897 -140076 89693 -52334 -38758 -7011 180577 86422 -348464 -92505 71711 -454212 -249036
23886 -249036 318998 -209166 -332272 -198592 -91793 34771 201822 98802 -119986 -105382
23876 -105382 -109542 205126 93026 -223039 -67291 11849 73928 -84721 54688 118007 -101420
23864 -176442 -173018 -106253 -88747 -132143 -132288 -96007 27476 -575619 -316513 -276944 111308
23852 -565798 -89987 14926 45066 178930 -115636 186357 11177 -81926 -11243 -14804 -27332
23841 -27332 453700 10895 -422682 323273 102998 -38619 41114 30605 -168461 6390 -192114
23829 132384 -128088 154932 39982 -178422 -106086 -105732 127012 234267 -144253 -221094 -160365
23818 -160365 -93512 62363 -258378 -15696 302138 7003 19347 -100571 -161195 102920 -136191
23806 -87879 -97392 -238661 -2585 38449 29619 56046 -246265 40102 -22671 -103786 -153322 29014
23793 212282 189144 8680 -169539 -180982 164028 -42075 -47932 -130602 -31825 -191200 79431
23781 117064 142873 221632 -34824 -583803 -324684 -91338 141652 -42741 338321 44227 -80553
23769 -115369 94404 21882 146654 -30840 -103509 58485 -170233 -45886 82497 9226 26797
23758 26797 -32859 -54939 97303 230807 3531 47667 181800 17342 -234311 -220546 304238
23746 -37420 903 -63700 -162910 -431358 -24962 -4030 88720 -101304 -188614 -154806 134864 -156448
23733 70788 -196856 -56864 -144060 -62363 -43247 149775 47479 177271 -242797 179847 65434
23721 157126 -2291 35154 -98693 237440 156165 153628 130894 445026 -349578 -306975 14307
23709 217134 705 496725 -539780 -1404 -90224 136604 -277739 -224978 48271 -179336 57108
23697 -218536 1497 -28625 -184724 -304407 96636 -35098 -77765 85222 -28181 102214 -228744
23685 108195 138066 308819 12081 94534 -146329 -220118 62472 57328 243787 -32437 210679
23673 52560 -336390 -32004 23513 118765 -178320 -126140 -84546 177652 156842 -225598 22536
23661 -263024 -401574 6996 -120486 64530 74849 -48780 -193800 -116035 -20363 -323879 84662
23649 -130675 -161513 155493 368530 -202826 -70441 -93941 112138 -263550 -226692 -103011
23638 -37455 -120448 -141019 -155142 -188152 11517 24253 -188588 -162462 7285 287618 -188807
23626 -1364 99989 -204464 -342137 -121150 -145718 -14527 86964 58005 146546 89459 -22369
23614 30486 98037 15026 80297 -190529 -142240 -152955 -296456 -75838 63202 176366 52006
23602 44284 303725 73586 300020 83750 -13355 125937 23739 -205123 49970 -51565 -351557
23591 -351557 -156618 -14260 64660 114081 154239 -27983 -48818 86492 236572 346125 293748
23580 293748 -85090 304576 -223254 -75161 46672 189500 55493 -171357 -249156 -76917 130677
23568 247774 123298 285049 -44256 103479 213628 59301 140283 -60286 -167853 147772
23557 15090 17964 -22390 97877 1848 -197184 234770 -389922 52697 9549 204798 -5264 91770
23544 16284 -71705 39371 -149570 -364416 -40666 177974 -38987 228813 106962 -425971
23533 -276583 -44570 -110564 -65787 -118065 -67942 109600 -243666 4813 348532 5937 43441
23522 43441 -259715 -88314 32357 -310238 -105962 4931 53758 -141040 -47236 -201355 -40860
23510 -50579 -150225 126422 -117418 -114781 -79913 -174600 -208911 101743 68161 -67925 415413
23498 -27794 -28602 57741 168008 192830 165506 60724 -73414 140411 -367268 1957 -343133
23486 -56237 -330433 -217844 -7971 82736 302177 -288837 -154737 -83693 -137824 22650 81341
23475 81341 -443338 -86199 -80625 63750 111902 -77560 -15860 -46761 -67746 -75691 -90467 187240
23462 -109015 -186427 -50927 -180391 36179 28678 106123 -282952 -475056 380411 44173 102365
23451 102365 -70633 157770 -83760 -163653 93536 54351 79817 -221234 41891 -171951 129503
23439 -349704 54298 72528 292875 -360188 -32403 -74603 19125 96695 58920 89064 8171
23427 -494434 -258777 73467 46577 -75351 7329 -43759 -87976 -31436 32978 120067 219037
23416 219037 -178411 14380 -112465 132298 -940 56470 -51254 79838 135430 -88281 193173
23404 18889 -52551 -153380 -145347 -263445 132115 -146868 -67031 -147703 94914 -229896 -234752
23393 -234752 -164441 -65719 425131 33799 -30569 31149 -27435 -44744 267255 146645 -150214
23381 363237 -46560 -207419 -142357 -252280 15711 29636 124850 -208046 92456 -179902 -256683
23370 -256683 72357 -149082 -92985 -130191 397596 -36777 152833 129892 -54351 9192 325198
23359 325198 -35715 93472 37515 -108662 -109421 60077 -257122 134105 239498 241622 -134535
23347 160299 -91722 48931 -41104 18627 134462 -137792 14195 -242296 -175424 -100521 254820
23335 -303240 106127 2857 118214 86473 108189 28133 -184499 -177788 396127 310249 156537
23324 156537 76274 -45046 313538 170828 135593 259172 -2275 -37594 325879 290554 318000
23313 318000 -2125 236940 -113920 46835 71016 -108280 -77684 -187798 -123399 -37607 9808
23301 67963 -195783 -228909 265061 -195454 -45650 -238192 135384 -134093 6527 171159
23291 171159 -145552 376300 -174580 134971 -114285 -276991 157197 416012 169248 -84239
23280 85139 140049 -34546 211652 -93419 192123 280549 -174222 296886 170976 265826 -17798
23268 -49335 99731 -139393 21141 -64039 -3941 -67896 -217490 249442 -124349 29918 -127181
23256 -57783 -120790 -119593 -166678 -107342 -106994 312736 -31794 5540 -210853 -80040 -81241 -131731
23244 -131731 38973 39763 -67886 77788 -30568 -67626 164804 65000 114765 -185692 94206
23232 235669 -245492 163861 205072 -35610 22276 -141480 97736 -233403 -80505 98707 24357
23220 -197753 -155504 -52567 86372 -151957 -383834 6216 -35467 289474 -198026 62376 -205284
23208 -114470 66424 70803 -3116 69685 -220160 -340959 -254938 56192 -83661 -5913 -261176
23197 -261176 24843 59259 -301888 -159217 218406 240345 -81885 -194089 25808 -63945 112073
23185 -46751 -26388 66856 -206471 -194752 -11521 -379740 11589 -183404 -99637 170279 -137824
23173 125572 79989 136298 -302921 277599 99755 -86796 228225 70085 -284840 -113594
23162 11260 -208483 193933 67037 184520 -47237 -189103 12198 -24174 -35686 -195496 -102564
23151 -102564 210976 -152332 71245 -119019 -332718 50730 -135011 86678 115469 72169
23141 72169 -138296 -160396 -400443 -126206 -143696 -164439 355316 127121 224926 63797 -61949
23129 -109166 33289 -167512 -102687 -292977 288638 142608 -144428 33127 116843 -201987
23118 -113359 27436 144277 -97936 -14809 -49642 -100005 -225678 -112762 200707 115472 219390
23107 219390 85865 140025 -328561 -103900 104454 63060 -34426 -114481 183551 -261006
23096 285070 -30400 26142 -484896 -51311 185724 -68639 -300090 -42336 -30768 -347554 -281082
23085 -281082 -60685 137021 161926 5053 -281720 -68419 -124318 -139496 125084 22413 131956
23074 131956 -53580 6193 -167720 17566 -169359 -44982 131551 13256 334043 96733 -15872
23062 77656 -117830 -78214 164189 71628 -39789 20307 19581 -31192 -2263 -349934 -279926 -381076
23050 -381076 -50422 389032 -209988 -26606 -31161 -149821 -154276 -283945 186762 13092 -40083
23038 -247592 121889 -175577 -233311 -194042 -36029 7371 39696 84505 -359452 -51448 2620
23026 -53629 -79579 247279 218434 -312976 -165789 146126 -98439 151951 109591 -204227
23015 298544 -147466 -45641 33507 129911 -134002 251298 468847 49037 -95135 -269433
23005 -269433 -127073 -128330 -106968 226291 206775 51471 -222562 38883 39323 -17620 -21719 71381
22992 138325 81446 -23596 -349117 -101140 426236 -83281 -70318 171725 -186836 97237
22981 141117 249562 -122713 -145456 91568 -6788 -56280 15128 -114414 -67504 -83497 -203401
22970 -203401 -140672 -117838 86661 -339415 7069 -285027 18525 122517 132495 207899 -72750
22958 110700 -35387 -211978 -351770 -1402 -7497 -86122 -118017 215363 -65868 88704 -37078
22946 -103635 -289450 -173143 3421 -166310 -46348 112211 -172695 185873 266244 -116938
22935 30064 -95827 24124 97469 -124113 -258155 189003 25493 -15488 33703 88602 190810
22924 190810 17911 45937 115477 -121057 98731 296781 118305 -142458 191439 -148198
22913 339117 3755 121112 54613 4417 -166195 -222457 -4706 133877 -304958 -12942 -233855
22902 -233855 192395 154055 324973 138713 -63430 -28495 97464 141834 60080 145927 -91741
22890 -78556 161628 241331 -16359 291277 58595 -202772 184321 -166535 59883 -130556
22879 -24450 -286005 -63427 -367337 -6895 -335639 -185969 -298973 -163725 81078 81488 -201718
22867 -187012 -371241 -75790 -82179 70505 1829 -93010 -39071 -247078 -112197 151370 -78345
22855 -27627 90720 90486 -41208 -65158 -143711 -136917 55014 -124852 36498 61002 -63872 -305630
22843 -305630 -76468 464292 -14145 -88444 22056 -277957 -28114 -173265 131332 203713 -110995
22831 -239705 204020 -188625 -47663 -249301 -192786 75406 -241595 -30253 -40338 -261975
22821 -261975 104454 -64393 31755 -43715 -79746 139240 -44153 -350944 45238 -136942 -94351
22810 -94351 -50872 162993 243408 -36128 105266 -294887 -529684 -144726 -49263 -157267
22800 -157267 124954 -173012 -98778 -111423 -21024 -250037 -245736 147603 167607 70400 -26626
22788 -211081 69242 248386 -93241 -102332 -100639 -34454 -130545 98744 -41236 22333 -37298 -148873
22776 -148873 -139117 -101930 10613 -205385 212120 138507 -128501 221378 -347366 -408902 497254
22764 -333226 -246921 -208903 -127165 60857 -105254 198372 -21269 141568 128089 -166464 -77901
22752 -163987 160172 -27899 -12510 -80505 6982 -51405 64482 266920 -214360 -112912 -461407
22741 -461407 387811 -84027 -18289 -230529 -277407 -17646 1686 208792 45114 103009 -128780
22729 -62263 -198451 103937 -60419 20917 -96859 -295663 75136 -65519 7769 -335405 -251277
22718 -251277 -124974 -174026 -323491 -160792 438402 -143281 33542 16438 237264 -103716
22707 281204 -5375 -26455 2684 -283473 -20504 -55473 -64205 123625 -5342 -120805 -238725
22696 -238725 171862 60682 57309 -258376 -116165 19928 -164378 97513 -198564 -221712 -26211
22684 100997 239541 -6737 -318350 -157443 -186397 -48183 -172113 185104 15410 -261316
22673 55845 214127 45954 1513 -27517 344713 -12042 -68837 -72522 27917 291086 -89697
22661 -281239 -284064 183138 -138839 -51285 168731 -11590 4755 -140225 6699 -136876 -9433
22649 295813 798 262191 139888 127964 167056 261520 -17337 32471 117865 -169053 -318063
22638 -318063 227930 -268370 72900 -324153 -115531 79680 270718 276303 11027 -67117 -299081
22627 -299081 -401585 -176640 -144727 194263 167539 187407 119694 -74158 238199 106208
22616 -36383 90342 -2181 -229161 -37457 -17247 -31143 -144998 -133107 160382 -207135 -250221
22605 -250221 186500 -1017 335672 96272 249045 -189394 -77987 -186500 186429 -280063
22594 30233 -73300 49308 111598 123565 -100253 -68800 -67328 -114471 -117548 64400 34623 -48663
22581 284300 -138012 273958 94855 -9757 -104500 -193681 62271 23680 187103 -173907 -208691
22570 -208691 12119 -111962 -208673 25799 219532 21170 -85811 -32579 -67240 -157943 -36898
22558 -199530 33818 -196880 -149244 -24141 -15583 35104 83945 68006 -319859 -105719 45232
22546 -191281 -81710 229521 -39062 -70270 -10091 -226083 -64839 5581 106621 375357 -212518
22534 -356283 -211991 -321250 585 -64275 133733 347001 -36854 146228 158037 -90586 57815
22522 -184209 -113604 -178591 -48516 -98982 -176145 62279 76331 168551 115877 -186127 144901
22510 131242 -26365 -89358 -303297 -96937 -225455 -166214 -245932 -340183 -30824 81014 30979
22498 9124 -171393 -112309 -38056 41816 201224 -110419 25796 17238 -286683 -469175 -185156
22486 -119318 -23843 284023 108932 -827 92603 -90778 97675 100288 -266174 311662 95235
22474 -71773 -212386 207609 -315279 -236182 170648 -55192 180791 185736 -382890 181886
22463 -105269 -20709 52774 14776 -22712 231281 -8584 107398 -81240 236683 -183443 -77123
22451 -11338 -257820 -131159 106084 -104156 -404992 23812 -85593 28849 -320248 64753
22440 179448 135674 -439186 -164853 45437 52944 -398926 3769 -106682 167266 9321 19051
22429 19051 232109 -370336 -352811 12148 76851 -83734 -419027 287057 35760 -58235 -55711
22418 -55711 -26567 -152366 -69320 -293311 -296421 -86247 -111565 -14771 224216 1671 189970
22407 189970 -111115 -70471 -248116 117596 14531 261134 -195834 41565 85358 217832
22397 217832 102551 -280589 168361 344213 207759 -252177 -186124 -99215 162481 -338659
22386 51841 227229 -254284 -111693 385459 158229 -93337 167676 35009 34159 -18916 114231
22374 112281 -29872 2427 -199878 33079 188979 17851 163214 147361 -146431 -289802 307388
22362 -37206 -42953 16050 -221376 131159 214644 20226 70651 14774 -90267 -94457 -246746
22351 -246746 -173772 -221617 3189 157655 -306742 46556 -52322 179806 -176657 114496 143916
22340 143916 -51492 -321722 -164928 358909 128810 124162 32264 -43841 -52183 -119698 24174
22328 50437 -57173 -152033 12641 77766 -24533 -40490 -119269 -179942 -110638 43263 -144132
22316 -301549 -344933 -114601 16447 279216 182938 -31811 -48150 91316 686 -60203 212220
22304 178623 2586 -34370 99114 138804 -160565 -195687 61270 -118036 -220046 -199876 -338210
22293 -338210 257134 173633 -206541 105391 -210868 -244001 -249431 121008 55965 45107 -186587
22281 -20759 -39824 -393730 4690 -313165 69131 -65680 -160653 212373 -241159 -56490 -365765
22270 -365765 -176546 -84505 -171256 -289211 43480 -33931 276123 -75434 -137409 22148 -36417
22258 -171447 85821 193927 -112408 171598 -40347 -237698 -118856 125543 -116349 164816
22247 -117647 -310172 -9655 -116580 -295897 138507 -152666 -29274 -266389 -338172 -49171
22236 280728 308887 -353602 -281588 -185653 123051 -71712 41712 -155853 -110472 373046 -118990
22224 77851 -262438 -4539 82345 -228176 44531 431765 15324 -183988 28599 32113 -156657
22212 113835 -148501 -222569 20231 -2651 81840 -211350 -275421 262152 -341961 206184 -88044
22200 24979 -264155 -220219 -163749 -421629 -66653 -25593 -88646 -107390 -122165 101520 -14527
22188 -112903 -40851 129236 -87408 320867 -326431 -7077 -231410 -26042 87181 138862 -384521
22176 79566 234496 139526 -77070 -234710 -105285 235320 -332331 -13110 50669 -57918 191977
22164 -140230 241878 297408 113802 20332 85822 -11716 104044 155739 -173128 4502 431025
22153 431025 278346 92422 387873 -133675 -19704 179449 64946 -298997 69345 62849 -216352
22141 37905 -145670 -123662 188142 117875 -71190 -227669 -228903 36879 -34179 146901 -382673
22129 108400 14326 -115698 39531 -272533 -45117 104895 -1896 114181 25108 39369 -319593
22117 42675 144538 -55778 -30089 -143487 -319403 68139 -280031 8954 -181387 42137 -161497
22105 134519 19796 43989 -215007 -326187 -68877 -4118 -262270 -278482 -61812 -30687 -55452
22094 -55452 111567 286616 -144499 -62614 -122091 7846 -127926 -121324 -49515 238385 -128238
22082 -23714 -24601 -94829 -69729 102999 -360838 -192460 30868 345252 -159320 -71995 -2333
22070 -63082 24965 -151319 323220 -214085 108443 -350464 1745 -3281 -496706 -30088 -85477
22059 -85477 -85983 89680 46792 99204 116938 133669 40189 -76031 69871 76626 -13042 58060
22046 -241751 74852 103007 -29298 298909 -263489 16981 -29448 102337 -59 1691 -23988 66970
22033 -15676 -108601 126151 -144434 143844 -165092 -37785 -33374 -26128 -375072 -118312 52443
22021 -180086 -13329 -148617 169439 -88951 129725 203853 -63122 -74445 -150437 -109210 -154280
22010 -154280 -231105 -68267 37858 -240682 -213017 -147568 -173456 72995 -18653 -25344 -21868 21102
21997 461 -149917 -107571 -28611 -165213 -69730 216804 164834 -142046 -160161 164333 -243792
21985 -61103 49696 -295117 56462 -97228 113613 -11694 -158353 121478 -105396 -53162 -228865
21974 -228865 -287827 -312767 -173566 -142132 51536 40945 -220830 -60263 1847 -151257 -183784
21963 -183784 -40825 -139722 -38575 -341504 -134927 15733 207440 -159254 -210395 -46816 147406
21951 -8135 -97506 -305344 69718 57153 101634 90521 -274068 -87429 -32670 -144290 66925
21939 -187103 -253826 210 -284945 -6445 -171938 115798 15910 -64616 149188 -20321 -67288
21928 -67288 -180575 660 -3014 -185638 -228843 -14474 48711 22521 -77678 -361169 85023 -121643
21915 -86673 -226374 -37051 -4745 -165791 32339 -96139 -25779 242695 40768 -359625 -75253
21903 148988 -60369 -27511 -151558 -375042 -132622 -121414 5876 242267 -43098 -13612 28156
21891 -106211 -125092 16033 -34273 -51158 -225034 -489441 -26122 -176475 14598 -65002 -228540
21880 -228540 -108076 25461 55522 40202 -266009 51385 3278 118238 25897 96700 181197
21869 181197 -25100 5443 -234525 40796 149450 -156108 14096 208073 -246768 318406
21858 -175974 -47092 -29634 138939 120509 208439 -53853 -334624 19537 52392 105126 -337433
21846 -36759 -43251 -90184 -55114 82132 71483 -113888 -125500 -30660 -55462 -7812 80067 284050
21834 284050 -51044 120140 -140726 -124676 -124612 226216 -18348 -210680 -42248 112258 -391830
21822 -273846 -159721 -195919 -80184 146780 -104112 -212851 -225902 -78722 -143194 11903 -135324
21810 -248732 18938 -186278 -147131 -56596 45576 124239 -192103 -452474 86732 117094 -289503
21798 -158725 -93165 -265119 120189 -187555 39977 -9260 -109533 153389 99015 111759 38762
21786 126537 59141 -93669 -98589 34881 2058 222215 44880 -76236 -38933 37857 44650 -1929
21773 159724 14136 -9978 125876 -71779 -29047 -102284 16371 15638 -38151 -256992 7699 -116962
21760 -3967 191300 -170645 -205130 115086 219824 101829 161621 80910 -265916 343974
21749 -52357 5438 174164 121314 -123361 -221734 -19585 12236 106258 -49587 -337635 253831
21737 251227 -24137 -312529 97466 -202689 -227912 -6480 -169251 -127652 229310 30495 -18405
21725 -362198 51644 -227406 12206 -205094 130844 -44962 -253322 -24370 -388951 37726
21714 305569 22240 156458 -131075 -180118 -132916 -7882 123145 3668 -37289 282461 -220745
21702 -189780 171229 67704 -140023 370274 362901 11219 26655 -329257 37606 99813 -284834
21690 -454827 -249933 -81611 -348879 31893 86025 310321 -57922 10557 343124 -128326
21679 -86583 95343 -122628 92698 95906 146824 -138764 -333289 98165 -62229 -164403 -49067
21667 -137243 22123 46272 -272820 -143504 -67605 308496 -29851 147319 -369289 -132655
21656 41573 -227559 38678 -163978 -412026 51086 -300800 79783 133871 10874 -54001 187022
21644 18798 -9715 212124 132162 2799 -216546 30380 31593 -155577 -39703 35664 -61778 -75107
21632 -75107 -350691 -21865 -103378 -275583 -286752 -297452 -200339 -293654 341529 -333926 179887
21620 25300 72555 -99451 -61347 -271837 -255533 -53955 -234926 75444 -134089 -133370 -190561
21609 -190561 -56159 -40016 238967 -207906 -70536 -49633 -184110 141146 78261 -22179 -220284
21598 -220284 234 76705 -80788 -84682 -11748 -16076 -135412 44767 -307140 -140917 -147297 -282427
21586 -282427 142178 -217966 -85283 42144 10120 86207 154252 91050 -156503 83270 -154648
21574 -49911 236878 -292088 235119 55574 -312162 -41283 -204746 -39151 -314999 12550
21563 19266 -33721 123117 126167 -300024 96514 108112 155251 12241 31794 108173 -156138
21551 -38448 -56433 -45624 -170907 176975 -183458 -177897 20153 144575 -2319 -32795 -70649
21540 -70649 19768 -100908 78450 -98856 -89071 -159823 137974 -86639 30861 307469 -413793
21528 -197904 99200 -414453 -188318 259406 76738 320303 52253 -145330 162024 100883
21518 100883 -234445 -15664 -367297 -302196 24192 -492781 52765 -96306 -39611 41156 156625
21507 156625 -189467 -28114 -58041 -360631 49452 -52014 -99797 -35937 -59925 -74430 -95988
21496 -95988 156608 21073 -241198 223358 -91276 -117748 -396468 -72644 -287624 36206 -174372
21484 -45713 33422 37566 -210868 -160970 34014 136049 -74876 -204214 -14162 132402 -218482
21472 -93487 -364522 191370 26554 -32389 -70073 -74294 -17786 -41719 -289089 134683 212508
21461 212508 -328112 -168237 -70067 -291040 73667 -275032 245800 122118 -270778 -177524
21451 -177524 -152111 28476 104952 130400 14523 -150490 -116868 287415 344436 -114665 -128322
21440 -128322 -46959 102330 321252 132483 204631 195688 215847 114943 -26240 429646 194777
21428 29853 -83243 36831 -159337 -270252 -101627 11606 -201148 -121774 -331053 -7990 9802
21416 -15270 -21573 204795 -77201 327847 -361438 -25859 -60064 34305 -131394 -2052 -386501
21405 -386501 -101543 103470 -279028 -41348 189021 -306183 -107624 14811 43792 338279
21395 338279 -235974 178163 -314636 129054 -140525 152114 26195 -129332 -163028 -188898
21385 -188898 -68738 76247 84749 -270764 47536 360267 158878 -175977 -156625 -353599 -7604
21373 94878 99813 -156329 -257550 -4922 -182281 -154749 -62564 -229190 -49731 181842 -341357
21361 40911 -362984 133853 -258396 -185627 74074 93460 -88903 -47205 -302334 237677 68809
21349 122721 -182937 -4837 242260 418658 -55493 84056 744 -48797 -287645 17777 -141417
21337 35855 -17565 -56660 187493 -302354 20722 -99386 -131056 -94100 -180786 -271433 -132065
21325 -179787 -123748 -19496 -289243 -225476 51997 89395 -232072 -160882 -21 -49997 162041
21313 212582 219334 54127 52589 -208441 -165026 18403 -13888 -218014 -30087 335595 -77802
21301 -230096 20569 -190923 129328 95466 -115627 -105561 25564 -141400 -83996 -65345 227057
21289 -288168 -125699 105001 115142 148434 -397734 1941 -144591 -146281 -124082 129231 -20526
21277 -72099 177697 -255296 -49399 115388 46106 -334917 245429 42951 -186596 -352 45835
21265 -288229 -54370 -92921 96062 -178484 -38249 -54628 -57127 40189 9377 -92164 -248117
21254 -248117 -183908 148696 337784 -273542 -560099 -303749 -107630 205539 20476 -9794
21243 -511249 -31111 128023 -20058 146943 -19966 28956 50502 4711 -136058 -165113 99504
21231 266989 -37215 136519 212063 -28493 115419 -102507 -60996 189824 54241 -2391 -322962
21220 -322962 22400 -169640 10062 172245 15013 160195 40981 -159660 36631 -56289 -89368
21209 -89368 77671 6054 -385046 30958 -79223 -257061 -145677 -66165 -123830 -16073 -47137
21198 -47137 -90497 -56964 94557 94815 155956 -88173 32074 48623 223486 -38789 -32552 201858
21185 110272 193855 191349 -249187 -10187 470050 -12734 27513 -209908 -7706 -153878 -140265
21174 -140265 28838 250498 -234119 103157 7241 -205338 128975 -227597 31833 66886
21164 66886 494995 -88474 157590 152138 -239149 83907 50383 -385633 -267975 -202993 -222129
21153 -222129 -183944 -51211 -80826 -96989 697 -35561 64913 80102 -62197 -65310 31754 -108541
21140 295420 -435870 16803 49317 259708 -279136 -227140 106335 42902 -17628 105407
21129 185674 56157 -151131 542685 -99790 -237958 3547 -163796 -94703 -238434 -99607 -211144
21118 -211144 -313014 36762 -125238 14579 46835 -177300 254298 -40630 -255798 32809
21107 -71986 -189103 -27179 -94956 172028 43191 -142031 -59595 49652 -36246 -309716 -280894
21096 -280894 -196329 -265750 -320087 262868 123600 -134706 -161529 -317230 56065 -373036
21085 -113642 67837 3950 -283358 237080 -228551 -8819 -249190 80211 -430960 -73285 218544
21073 -108730 71703 -140805 -422117 -124716 -16192 -354843 -264142 -219711 295631 -457863
21062 -127065 -216083 -142996 -182453 -46023 -8668 36851 285698 206168 34489 -411691 186856
21050 195338 204611 -38391 -138151 103360 -41469 -130571 80257 303396 -3874 -12995 196236
21038 -233678 -45266 -19769 -44961 -31935 -283192 66435 112981 62228 -124584 -298106 107772
21026 229781 71887 35213 112101 -131089 104176 -406081 -3222 95574 84336 -145181 121334
21014 -75065 -89961 46695 -175321 -73044 -227426 162167 32609 1969 -29414 75131 -74019
21002 -519247 14084 221931 -30086 104509 -254326 -7166 -149317 -53877 15819 73486 198752
20991 198752 31942 302725 -55822 148389 -223586 333260 49872 106217 -115506 1408 118911
20980 118911 198858 -362317 128741 -218679 -42438 -39635 -60503 -17859 30567 86602 -178320
20968 -125306 -27200 -318126 -28405 -228068 331373 -47243 5364 -70053 -212627 -168246 -26352
20956 185018 239631 -176871 108977 -53342 -60217 57452 143233 247919 -203894 -47532 -72839
20945 -72839 -58388 -264412 -191317 -21355 535102 -311336 -35311 9546 259666 -170398 -413942
20934 -413942 229643 93787 -238394 -228545 -41216 -81153 175969 -157391 54971 46547 -126805
20922 -325071 -414751 37161 -144689 -6160 -43252 -208873 12780 -187945 -121094 -356067 108980
20910 39684 -368659 -184101 190316 372664 -18429 -60953 -82203 -5294 60835 -157807 -33539
20898 -283502 -54747 238263 -226929 -94785 -90033 62275 -371724 125016 82621 -86855 145954
20886 198592 -232113 -72122 -78805 78200 6832 -69373 19274 -7317 -278389 -11943 -107572 -235771
20874 -235771 -266375 27454 -85985 -68116 72905 -46309 -69832 25906 24543 -245243 98816
20862 -219908 -59682 -127875 -208008 93893 341881 -194661 -247242 -122681 -45201 -210402 399080
20850 -37124 -598876 -117059 -155458 -100256 -161888 -197214 180965 -31249 117648 -275917 79415
20838 35913 30555 -237427 -53346 -394499 370304 -35910 8696 -67038 52043 -290382 81149
20826 145504 -218690 -78519 129631 -162782 -32961 -149507 -207780 -210151 -86497 -221987 169214
20814 11776 131689 134495 -40346 6682 -249590 -48434 -114065 -33983 -169420 199819 -1787
20802 266157 -105523 -269953 54619 -95058 -172612 411498 -18178 -119989 74671 -63657 -456714
20791 -456714 -150472 -37044 241195 -87828 -160595 -154453 241873 153247 -295235 -51052 91552
20779 60671 217170 73068 -27442 198393 113544 92400 -153941 133187 78852 373561 -233109
20767 -297326 -374911 -67112 -140098 13778 38182 -322484 143560 -350071 6142 -248521 -19865
20755 -277342 146516 -861 41373 172006 253784 105862 29078 -235881 9235 -63060 -249714
20744 -249714 190576 -24727 -28229 -198854 -91099 68372 -199982 -53022 41536 -167534 -272389
20733 -272389 -300290 297167 -500417 -39448 -194823 3729 75163 136134 -85808 -101848 -191044
20722 -191044 -82718 -270927 -202756 7003 -236285 -406395 13685 -414556 -92308 161224 -38409
20710 -328314 -101140 -20167 147771 -171185 2067 -4457 3042 -144310 24486 487798 -299098
20698 -64325 110917 -278812 -108708 48210 -7908 149245 -168528 -201815 -71388 -271000 200510
20686 38226 268468 -159340 -168361 40983 -222576 182635 -204156 -43262 -19346 -30197 -149327
20675 -149327 -5126 -177210 -251851 73180 117927 -163812 -261815 105004 100406 -290942 -100910
20663 -253959 138964 -161698 -164762 -155671 -16182 -37675 99251 -292012 -102667 -28781 77088
20651 -95524 -23442 -33957 -180822 -185883 -45412 166066 -52447 -26384 -59541 -56275 129782
20639 -316560 -81090 252112 -246495 49279 -237987 -128107 -249346 -213648 149730 323529
20629 323529 202911 -25517 312471 95665 231165 -41852 -14666 69491 176766 129206 196024
20618 196024 30625 -47054 -188148 -153674 -200974 -205317 79801 198758 -354302 -94575 -151190
20607 -151190 188176 22365 59868 18570 -334715 -129291 -245208 -72046 93411 -44017 176874
20595 -120849 -82625 -164132 -273869 11762 -9951 -119911 -67157 -140330 -114788 147240 -36197
20583 -161179 -148384 -169237 50089 293724 321393 -126656 74481 -213372 52114 -40312 -386775
20572 -386775 -83965 -211898 -243242 -61020 183298 -234783 -54086 115763 -95114 85809 -290970
20560 -1956 -90345 90692 -81261 -166290 -289915 -262786 27632 -216363 -2774 -427788 171898
20548 -323810 392104 -176885 -358750 -79645 -63234 87223 -296654 154098 398889 10910
20537 -197604 -88155 69521 -39528 -88751 -110352 211701 116506 14597 -92356 184606 58729
20525 37666 -5989 -96709 470351 -45293 -98893 -35668 -245481 41513 28115 -254139 -50924
20513 109091 -114599 106252 -101700 -102512 -402796 -74730 -182726 205265 -136632 -59277
20502 -253792 21423 169108 -323256 -484889 43750 27906 -39030 -40554 132550 -32463 108431
20490 -556345 8448 219006 231213 -242164 -335588 -47447 -1509 -239539 147351 78544 7971
20478 -14358 -295609 101631 -121403 62758 59703 182463 -132537 -116082 -190007 75110 107974
20467 107974 211604 133802 120338 96079 66535 88750 -150583 297207 -155065 48327 39074
20456 39074 249480 42059 -73753 -6230 48903 -229277 6124 -67691 -181082 59926 -198460
20444 -273010 143433 -315226 205391 256332 140308 -13427 -126689 139192 10644 -204095
20433 -221020 5321 -40983 -72759 -156712 14243 62484 -32252 21232 -96738 147302 -196367
20421 77861 -48212 126601 -68850 -22151 -54710 45170 -226853 82801 471605 34404 957
20409 1558 -108350 -76698 -260836 70085 91356 430722 -47684 -15247 -415302 -28393 -41616
20398 -41616 -117252 -145832 30151 -119388 -190637 -63533 243382 35615 -149701 -256116 172554
20386 -127783 74871 371883 -69626 -14742 240693 -169385 -395374 -380698 -124109 -209920
20376 -209920 -235227 -330202 -231466 156870 195342 -36070 -63600 47336 -105631 186330 -512892
20364 196648 -62807 19698 -357891 -123523 302396 -160486 140282 -192541 89293 182449
20354 182449 134231 187579 -33624 -390139 6195 -119613 -93736 -25757 -12254 -47414 120909
20342 -217480 -209284 46102 -189259 -212151 -353128 -177239 43706 -108328 244828 -116764
20331 180305 17133 -194111 126201 79113 -84138 -96161 208159 81229 -111031 273859
20320 221330 189990 106844 -122118 123026 -58516 175264 -262397 -56935 209425 -249696
20309 224271 -172652 -36674 73433 -283710 -23316 -166026 79675 -158791 73028 143528 -185392
20297 -172093 365320 42410 -122896 -205491 -112914 -21639 100971 -23150 -13127 -105395 -102627
20286 -102627 -88647 -193721 35462 -121545 -75072 229764 227955 125152 -196465 107548
20275 147311 -39909 14647 36167 90470 -178612 -419305 -41159 98461 -28053 124968 19434
20263 -136577 155165 142499 246355 242632 -47058 360849 -9287 38558 -641300 15610 -172516
20251 -714990 -84794 118391 -101046 -67650 -225070 65980 294232 -16554 -85320 -34104 -81728
20240 -81728 35206 -60681 66917 6644 17078 -46585 -136777 -161842 -11298 95760 88868 1194
20227 110154 119091 -59418 45820 -133560 -235382 93115 -182374 765 274210 -132422 -84967
20216 -84967 -127278 -241743 48431 -151345 4910 -328480 -184443 64908 48942 -19879 19026
20204 -262271 129702 -263102 -24450 -296439 -100672 -184674 169557 -336343 -155153 177999
20193 -287158 -1909 166754 -97889 -270054 -4914 3104 121216 -10277 133535 -107180 126336
20181 83380 -15018 84429 -9078 305106 99978 -65284 -226283 -97626 -372770 -109189 27175
20169 -159345 -17994 -375455 -111992 109582 83242 -216305 -321704 -54779 -297553 -238114
20159 -238114 -197192 -447662 171633 72233 113820 -177735 -165296 -38890 -240837 82173 -129956
20147 -37327 -234411 304760 -190396 111450 -282716 37893 9980 48486 -66087 35981 163945
20136 163945 288137 -122830 -40577 -14369 -375530 53129 66025 -15451 -211891 -56170 7516
20124 -45600 -339442 181423 -148550 28306 195243 -371001 -121249 -264036 14820 -16471
20113 233046 -407652 235251 -111312 -28154 122297 90243 -59329 50334 -321959 130930
20102 -104387 -118841 -203992 -232218 -249326 -46899 32999 -1154 -216833 -239707 -382103 -257420
20091 -257420 -269353 30938 -191819 86616 -20237 -81058 -221812 168225 -3064 -61115 -198555
20080 -198555 -96955 -70540 -288394 -255578 -189256 -120997 123585 -113905 -152647 -66157 78274
20068 -90624 223441 -60621 -291547 349615 172160 -150381 77023 -183137 -163352 -275379
20058 -275379 -125895 -154593 -30892 -44047 -153485 34988 354478 -32171 109143 -41662 -164770
20047 -164770 -381939 -143199 -38441 79189 -155036 -81665 54979 -16526 -42265 -152064 -113811
20036 -113811 -210746 -230003 225237 -222282 -334230 44840 -38360 -235736 -53693 -508 31361
20024 -138324 211391 -134370 -41122 133172 41628 429910 -114592 37377 -330172 65579
20013 94212 -26651 -160802 -141719 3972 -207162 75212 12210 246187 -303693 -133750 116810
20001 -201882 32913 -81661 181085 -46015 -158970 -102955 72967 -26216 -275049 33150 -139717
19989 -86009 74352 -93686 74509 315069 -211344 -92391 139618 -106293 -117869 -157983 -45117
19977 433935 -483336 -208050 50174 62617 -16675 -96367 -67388 -10573 95108 -89764 38184
19965 81939 -127847 -68339 -24906 9882 -36772 89375 26391 -200787 -93691 -50411 89357
19953 80305 124607 -85630 -258928 -118040 11678 -223567 69274 155100 -32704 -83374 -112123
19942 -112123 285713 273344 -355635 55687 29681 -109387 53460 112381 -95473 -207238 -17394
19930 191051 -128526 41576 -66464 -346797 -299379 -161384 -290707 78549 75594 82963 220493
19919 220493 -250251 409615 -316928 -160761 90601 153895 109282 159451 -188961 215933
19908 99260 -93235 -27178 -50112 -94143 -162593 -236992 -170431 274140 -389713 -376720 80770
19896 -273197 -265003 -204947 52308 -170078 -171600 219845 307504 -114621 -14753 -114970 177481
19884 -447118 51399 -181727 -69897 20215 -52541 -155803 -2960 -72991 16056 60567 172433
19873 172433 -185974 -21421 150864 222715 -349853 -85939 -20328 29240 -117610 -22097 -101490
19862 -101490 -254102 -78481 -324388 -145403 -220619 -293806 -233248 89367 54709 89757 -317663
19850 -65675 17794 68191 -135466 -288602 242889 -235127 -37644 -26941 -33563 130778 -116094
19838 -85140 -71868 -6009 -195619 -93769 -24912 -142869 -40248 120893 93456 278344 27410
19826 113652 -261831 104325 -138048 -141643 326696 -381729 -270217 -210530 -158686 -7782 -59354
19815 -59354 269632 -242360 9479 -411121 -371422 -183260 41744 -268443 -139495 111236
19804 36609 -353527 -293406 -53195 -131769 310029 -318089 -122010 24744 107858 343110 -174749
19792 -15675 63663 -106671 159570 98568 127017 27697 -227726 263060 156271 -206348
19781 -191260 165080 -20314 -154396 5791 -89128 -375269 -67854 -100592 -125580 -246139 -434203
19770 -434203 39072 128255 -74285 -282456 228601 -150145 -61192 4085 -16506 -14147 -45237
19759 -45237 -158309 289123 142292 -19661 14304 80624 118890 -337023 -248641 -147442 -197572
19748 -197572 -348970 -54291 470661 23034 -128744 -322476 -286259 150493 396170 -148728
19737 -277618 300137 -391295 158888 -264420 -64282 90749 -195739 -104664 227260 132989
19727 132989 28455 -82475 -183740 -55302 -12309 -82206 -157167 -103746 90760 -435809 -146513
19715 243129 -232885 130903 101862 -44900 -266199 135813 -91843 -329356 78916 -61896
19704 10771 260614 295281 -364163 130434 7028 -71028 -10239 -280125 -353794 -85394 249413
19692 31165 164051 5990 -215447 105204 -229314 200304 19316 53441 57347 182721 -328303
19680 93850 67575 -386553 109874 91583 878 145052 74232 -176581 251105 -39609 -117741
19669 -117741 -205272 247554 -490563 -246181 207500 26911 -159397 -39023 -144370 72571
19658 -9867 -173799 -433 20948 -61410 -224646 -101886 -111843 -261254 -265329 -172728 -370659 -58409
19645 -100313 -327492 207675 -163350 -132971 900 113205 20678 39120 -19773 -164077 -246743
19634 -246743 32211 -180127 217632 -127226 -187406 -584765 3121 -65183 -24174 -78638 160136
19622 -29836 94551 259880 -84608 142455 -3574 -220495 -55255 -232818 -377926 -208042 -332750
19611 -332750 -357916 53105 -109702 -233385 -22220 97667 -210106 -65068 -77096 -67409 -8201
19599 43578 -113118 -7575 -225389 -301068 -221452 260801 -295125 -73648 -4081 -326964 -47085
19587 222302 -108651 -46042 26874 -165543 -137019 -168289 -321011 234558 -283230 222672
19576 -266942 -163299 -167909 -146735 -126815 -9779 -13352 -94376 -353700 -169248 134119 69848
19565 69848 174338 -91729 -451099 -110863 -339309 -176775 -7468 -18917 -165005 109184
19554 74749 -62778 140888 -136888 -222745 58544 27510 -281652 -69609 -199200 -175583 -194240
19543 -194240 -143388 89741 -156555 360068 20402 -103761 -193637 -79049 686 48199 -123390
19531 117587 -79996 381561 178959 -43039 102968 24529 -43420 -72300 199653 -114653
19520 -1838 -72559 -63131 -160378 -84228 -122482 117155 -129023 137581 -113668 195626 -63480
19508 95579 10996 -145750 -161252 -70330 -199745 162994 82874 -247756 110389 114709 -88013
19496 -214271 -139009 -259176 -71955 72238 59989 -69420 -116350 -304963 -165349 -174351 -35109
19484 33010 245410 346353 -87262 12112 17243 -157454 93209 -128602 -150127 -147379 -111705
19473 -111705 29075 -369353 160190 85442 80444 -102718 46757 55702 -4690 -142644 -135692
19462 -135692 50527 -159060 24612 201890 111250 236662 -22689 -400343 15044 168924
19452 168924 66883 338842 -20469 -153885 285700 43759 165207 20304 -13704 119138
19441 -340652 -129018 140390 90832 52339 32189 -213465 173397 -104734 -71003 166393
19430 275160 -321119 345121 563402 71924 -302871 -237243 126071 -92618 -16049 -105668
19420 -105668 25805 -287699 -225908 30947 -12816 -148396 29321 -131260 180856 -156361
19409 144498 -155758 -71875 -355869 159388 77765 -100897 21117 46623 -292405 -108881
19398 252354 -198238 1873 -93168 -105937 -186498 -155706 -175670 265176 -156666 -96540 102028
19386 90951 125009 -226900 62721 -6674 -179358 -31337 -96979 -249766 -181796 12517 -377723
19374 -192156 11439 -48453 175255 -255971 -178511 59259 -146698 -142276 -46266 -37527 -97607
19363 -97607 49351 -84920 222911 -258027 -22785 -39242 -320207 -119589 189924 -12999 -249796
19352 -249796 -328435 -220037 -257373 -72199 -12057 -199429 -65933 21072 1816 1110 -133046
19340 147830 -654954 1308 -33510 177648 158193 214709 -110413 -23361 -115658 -228904 -191013
19329 -191013 39978 353371 -8293 -357112 -243761 -170285 -54246 53123 188116 -174469 -183778
19318 -183778 -234526 178419 -132144 -169562 -76759 172301 -190521 -84057 -3216 -73036 -162475
19307 -162475 -234607 177461 -144425 -88549 -208907 -191354 183334 -663319 149080 -156589
19296 -357868 -105719 -195842 10692 -346472 319421 -585666 -1521 108997 139042 177731 -171049
19284 174501 -257784 274654 -200443 -116395 16993 233774 -86879 -272059 185352 -55352
19273 -228448 27618 102705 48831 -93649 112909 -177169 -41907 340330 -340472 -104584
19262 -103140 -103414 130401 -202236 -298146 -75352 313864 -152550 56160 -118794 -99324 -171510
19251 -171510 -80755 -329420 60696 99314 55789 -108154 -434275 116906 -37549 -334271
19241 -334271 -161095 -202061 91379 80399 90250 72257 257748 46622 199542 157722 122219
19230 122219 -176787 -198587 -11235 21796 -194148 -65973 30266 31244 -174974 -117114 -142495
19219 -142495 92650 256505 118546 -231326 3362 -480368 15973 -31162 -40314 -195352 -12090
19207 -4005 61020 -56046 100722 63227 127696 -94257 -19851 282976 58440 -51744 308646
19195 -157347 37267 -327997 -61350 -89833 -238291 -99291 45913 -140897 -193737 75900 -31268
19183 58299 -27465 -65012 137246 -179731 45602 -94873 -85997 84549 58439 -129808 45847
19171 30186 -158438 -167526 78406 78446 67650 -387463 92282 -343802 -174440 359141 -84459
19159 -166429 124395 -231033 -10313 -136886 32083 127994 -435256 -62618 -367003 -200267
19149 -200267 -4432 -36398 -16794 14962 -306848 139983 92039 156945 -2618 186130 -280734
19137 23043 106969 -90974 -140105 -28295 -116309 103940 -95980 -90599 24890 7888 -139452 -137326
19125 -137326 -52757 23275 -112298 94301 -170119 -71358 -442020 -18210 -70071 -162541 -173813
19114 -173813 47418 -94296 -25209 8241 -300038 374208 39950 -82073 149648 319833 -142343
19102 300924 -44932 -213392 132273 -16508 14624 135212 -241886 229349 -59637 4010 -403676
19090 -79010 -36310 118783 -312375 5364 -491225 -130353 105459 -189500 201208 -137838
19079 -201629 -105247 6894 -206669 216384 -66247 -109711 297786 -144603 -250485 2779 -121975
19067 -31364 78012 -148448 -245266 54341 -296157 -168450 -110850 -116130 -108762 116282 -158452
19055 -69161 -203991 -116531 65719 190333 182994 82306 -193372 -236702 -86209 -63459 1051
19043 -67459 -77041 -204342 8042 -230088 -234532 -263118 -65877 213662 -47560 120630 -170387
19031 241043 81123 174681 222159 -190568 115099 44696 -108010 -195807 181473 158353 33429
19019 77073 -208856 82330 -251884 707 -52293 -54750 -4741 -123440 49560 -105867 95881 -367767
19006 -90371 -15322 -75781 -96844 -74360 7618 -259726 13504 -44968 165941 -240741 -240136 34155
18993 93680 -196682 45447 15820 80842 -204165 -285233 -44908 94148 347798 -204171 -78438
18981 231297 -320741 -115081 89319 -128891 75270 -24974 202629 27170 -148011 -114198
18971 -114198 37155 391043 -315358 5523 3070 -96600 -81264 234236 -49003 317386 126912
18959 364351 233621 187202 -314152 -52015 91810 -164431 179109 -116728 -179193 3667 -235813
18947 -41638 -220919 -208484 223152 -281622 -182224 -83351 -113812 30215 191413 -303665 -127582
18935 63137 -278452 29923 -221682 -132687 -131551 -157270 48148 -38504 7843 104817 -114656
18923 -241969 46677 63764 -120669 -207577 -51183 -19171 -138672 119101 -29947 -37413 -17239
18911 -36055 -354537 159237 176150 166535 -247492 -206283 -46054 -296690 -10002 -267464 -9922
18899 -68159 121175 323872 -247879 -360235 -416260 -50138 -119287 -312692 -15507 -265568
18889 -265568 -243015 -432073 86470 -77111 -27519 -143159 -64632 -224783 55156 115911 -290133
18877 -124572 -382894 289792 -89442 -149627 22706 164071 251821 -156207 130225 -19006
18866 -338632 126299 -117578 -10218 -270314 31696 4796 -119383 -23064 -117340 -24591 -24734
18855 -24734 -18880 -125021 -269014 6122 -72730 6390 -211103 -289692 -105269 -88180 232521
18843 -139838 -136939 -81345 168597 -57120 42457 -123797 -107237 -384590 -317949 -15603 -300
18831 133894 -196337 140112 176917 -10977 -104001 202021 -124911 -178679 -121130 24423 -24144
18819 -86765 210317 -160649 88358 -102071 148662 -9274 -100037 57315 387271 43503 30437
18808 30437 247298 81072 121807 59711 58552 145072 18641 172706 -310133 73308 -209751
18796 96766 35548 106632 -153368 -124514 385224 -340526 194289 145121 -28403 98880 221510
18785 221510 -138474 -192730 -57677 -330450 27775 -151860 -88437 35233 -77734 -88961 -195476
18774 -195476 88488 53828 47740 -57928 -160654 94991 -11336 35823 -50029 -84595 -157609
18763 -157609 75337 -58041 110486 134223 -92413 121959 -163371 102312 -104730 44937
18752 53869 -55780 -125841 234417 -79178 -219160 113890 23655 113847 103967 106895 -160387
18740 -14294 -40393 30886 -210910 -261472 -54851 66737 -32730 -167057 -249575 367001 62565
18728 98052 64611 -261131 -394543 150634 -102477 -150175 49631 -186748 66677 -25935 83538
18716 -203177 25042 -275476 -238256 -315302 -55940 -356451 75441 -203627 -60509 -30855 16538
18704 -97436 -78577 224250 -135455 220797 -318620 -187140 -218599 115027 126743 -269424
18693 187221 -66650 -172754 91615 22426 -13464 -191074 -84914 274358 -211248 -133619 -151845
18682 -151845 -65584 -102098 -340428 -493573 -169777 -212364 -203832 -304520 19858 66987 7637
18670 -313567 -22109 -89738 -209105 105557 -114999 -138488 -81099 -16059 18647 -350168 -174833
18658 -143208 -273355 -75185 -396650 -338327 -17203 -134462 100239 5682 101263 6659 -351240
18646 -120015 -107202 -170860 -95427 -229886 -82062 139903 -62670 -218566 273946 -253650
18635 122922 -25332 -118633 17460 35385 142607 -189023 15467 -218471 129100 59678 70525
18624 70525 256440 -93546 -30855 -106563 -219682 18963 -267653 18820 -336212 -2094 94722
18612 -54532 -392432 77774 -132930 375392 397057 90215 -36408 6688 -267001 -76521 58686
18600 124523 175392 132074 238325 -121221 -220890 -185556 -6083 302679 102528 48239 -239936
18588 417813 34443 193298 48601 56121 -64552 -244225 70951 -145175 282737 -255971 -54461
18576 -186819 65899 220267 -163468 114303 74928 175443 -828 -161912 63758 259603 215008
18565 215008 1834 23818 201326 42931 -278991 196766 182458 -164808 -159327 -88146 -43559
18553 -66886 -320086 -46710 -253005 -306540 -14101 116961 81076 -96085 22560 193099 77130
18541 -463134 23595 9427 -385889 -49873 85313 -423613 -168371 113603 79189 -107596 212936
18529 76095 -42243 -108910 -36632 -177884 -69778 -225565 -113209 117093 123555 -222900 88805
18517 86618 262293 56067 96224 -16791 217307 -51557 -129060 107046 -294476 -34656 -51886
18506 -51886 -66831 12592 -260246 -155400 -179040 -20100 56712 -211069 -25348 -75401 -357904
18495 -357904 -64655 67546 -205531 -163519 -181370 -319729 -386454 -76839 55941 5995 99188
18484 99188 151964 -210531 70590 -152377 -58754 -197696 184445 12150 -26213 -122539 9340
18472 -61520 -336481 171289 -158079 41309 44678 120139 -87530 -52795 -192885 63769 -69175
18460 -78788 61387 -189464 5996 118320 30804 -142876 38326 58274 -114118 -320541 -38958
18448 129553 26683 -67510 -82099 -146864 -105511 93262 7740 -319815 -337101 -126054 92906
18436 235350 -23286 -121823 -340457 31560 -78536 135443 55882 -71058 -13598 70812 -151935
18424 -330281 54682 -251958 -139425 191905 -632418 -80344 -66435 -143503 167232 -75744
18413 -102668 -399622 97744 33490 -8126 -92205 92733 78097 -109916 -54520 -161515 -144240
18402 -144240 -4049 146386 -51988 -129524 144048 -33085 -95597 160704 -156005 -249233 -178955
18391 -178955 -244978 -152677 -231877 -253478 -950 -106712 -133064 140692 -332406 -51700 -39270
18380 -39270 -112870 193651 238160 55815 231687 -101645 172488 -70149 179135 -68105 -256323
18369 -256323 218251 61613 -5004 381653 256830 3400 263531 -232080 209119 -357349
18358 119660 44903 -217027 -136891 -282830 -162136 -14935 -132436 119035 108800 -191404
18347 -24075 -268280 -273637 -366777 145474 -315986 16163 -168403 -124304 47740 -230980 -6555
18335 -143886 19755 -23053 -378650 -131436 139636 10495 -246856 -6025 24930 -204215 340113
18323 -24826 -286 61250 -622 -340383 21943 48284 -187937 -249118 -44317 187837 245899 -106777
18310 -392483 -178678 12387 -14232 38433 143310 73633 305087 -19558 53087 101492 -307419
18298 -433902 -148353 -258293 -134857 -183611 -141033 75670 6702 -67586 25263 44657 -295763
18286 143906 198705 -294630 -141449 46314 -37566 272731 98539 -181464 -102710 -252191
18276 -252191 -286884 -107124 -19789 33323 12793 -311060 -127768 -220733 266994 229351 -116081
18264 -43490 -131829 -368551 130563 224473 25460 313443 38967 5777 -63647 126545 -133787
18252 126165 -17508 279455 29099 151710 -153181 87604 -108438 199398 -233342 70183
18241 -244519 129043 -210622 5570 196616 -91759 114668 183687 134538 84169 45348 -260441
18229 -195128 61567 34027 213003 -142321 -219122 -79224 -160438 -170479 83088 -329768 93892
18217 57445 154936 -277650 181423 150609 -267939 -31533 -207960 184648 -174239 -39824
18206 155974 -238048 -171292 -241810 297278 -259722 73218 -329738 -291841 285208 -160830
18195 -41547 -362294 133746 -245104 399046 14805 -11687 -141777 -3526 54488 58662 -239620
18183 -74986 -230021 -196183 -179495 32452 -45451 -38375 165825 -289444 -59898 191565 -257162
18171 136039 174069 -155271 -30289 -326486 -89547 -161065 18765 -112443 -91912 -94891 -161395
18160 -161395 31801 -156563 217069 147892 -3726 -113398 88858 -198502 -508 64194 235194
18149 235194 277824 -203038 -205321 39552 -281557 109446 136259 -88497 6598 -420093 114020
18137 21803 -133383 -507694 108775 19690 167421 232088 -36216 -32760 -195933 -199077 -81845
18125 104859 291221 -167500 -158190 28269 -103428 67489 75802 203596 63159 81605 -170834
18113 69319 -3879 114218 -158907 70944 -175470 -37635 36461 -203288 -163198 -446518 -93398
18101 -89880 -79595 313090 17651 -194562 62764 -154571 -82119 6665 44553 -125604 -209788
18090 -209788 -232905 -359623 380295 -20754 38012 139942 46506 419779 76829 -108276
18079 108163 43868 -346553 296470 -134650 156097 -467695 -339364 14429 -185354 227641
18068 233872 -419931 -253686 -286141 37428 200100 31858 -59168 23111 -28120 -214107 54289
18056 362142 -420317 -168684 129890 181920 -149464 -172534 -172394 -106653 -11845 -218833 47017
18044 47893 -262370 -172714 81554 18104 -3049 -8547 13246 -199646 -128264 64925 -5607 -53800
18032 -53800 -161996 131114 465136 141862 -61514 -112680 -107332 -67103 110082 178205 -137313
18020 -380769 72444 154635 -276751 21308 131312 -291978 143937 -143313 -75048 -474728
18010 -474728 -138249 -66170 347329 -70238 -65352 -178805 100846 140954 -158917 -976 172704
17998 -61811 -198593 -177941 156017 32749 -49444 -258401 -12880 -70703 -243871 188005 -21907
17986 36004 -3203 -163307 -280291 -10047 -3996 277149 214766 71558 -46890 -184799 -102028
17975 -102028 75822 -79182 -57701 -41659 -159634 -38373 -123266 10660 -90975 236371 221755
17964 221755 14474 -23893 27589 -68626 129540 -284030 -197109 50673 -274207 45884 134445
17953 134445 91721 -70639 -347487 17360 81509 172926 172678 -98956 -41710 8391 -68631 -210841
17941 -210841 134880 56999 -124443 222585 239098 -87495 -38547 -126788 -30247 27468 -18263
17929 119160 137102 -299938 -105108 -89997 -226425 24756 -7840 -81578 169521 136127 -121005
17917 -182899 -71695 10803 65157 -108932 182134 -87401 -285104 126325 -3310 310885 32875
17905 135444 234762 194163 -258928 -87582 245197 236449 -250595 24035 209122 141925 -265735
17893 350400 -240877 149434 -50796 -318743 249155 -122390 -93994 -12191 -209926 -191523
17883 -191523 182948 249482 -116983 140324 102281 232371 -28677 -25860 -251268 -357315
17873 -357315 -111865 245047 -132707 -108701 89097 19907 30351 -180471 -221284 82061 -72510
17861 -171145 -77878 244099 -96908 -39584 -248851 -120533 -213065 176845 -196443 42686
17850 344892 -174296 -105596 48037 -15294 154925 -94378 55402 181379 57646 -104800 -232260
17839 -232260 -91539 89250 -32930 -23758 -153015 -149882 266909 -166607 -210690 -77477 -223922
17828 -223922 -53953 -181378 9018 163683 -331100 276643 412136 210336 -334055 237469
17817 -29639 -399506 -24324 95519 17218 186819 -159535 -10586 -124426 276775 513199
17807 513199 92254 77576 -112178 -85647 84225 163117 276178 -4169 130320 167378 -158333
17795 -180483 -82044 35478 100139 79487 122373 -91470 276073 295081 -65323 -35451 56869
17783 124904 25723 -32266 184614 48520 83871 253758 113933 -132685 -82934 -9936 198517
17771 -353127 -203062 -37662 50993 -186641 -170966 153403 -266015 64368 -68902 -103647 73617
17759 -36388 316314 -65271 -169998 88844 -206591 108957 -119082 105510 -90906 398663
17748 352438 -108987 -85529 -18449 148220 -141169 -46365 -174373 -42220 2204 -164593 88086
17736 26862 -93142 157710 -128365 269970 -227816 -289858 -25691 -103550 -305517 -59326 -10423
17724 137900 -58996 -44094 59807 19601 161549 261460 -72240 -248207 -17472 -193426 385647
17712 4200 -42705 381009 146627 -77881 -35796 34891 120724 -136722 230739 83217 -34211
17700 -67768 -180952 11128 -110540 -66101 107394 -286905 -71235 -84782 -7074 -154566 -33163
17688 307084 102687 11811 131827 -51222 -33499 226762 -89496 361701 -211016 40975
17677 18878 162634 -102331 -316620 46645 68972 82477 194733 -131321 104220 2919 -19518
17665 -164100 193265 110498 220993 -124111 26179 -18342 149988 -23687 -203799 -255571
17655 -255571 -40567 64215 259834 -40595 34036 -22494 516670 1236 109345 -318135 75476
17643 74245 247604 -85346 -228140 -62833 134996 156032 36497 2054 307540 158767 238676
17632 238676 172379 5717 14201 45216 65848 95790 -105345 -270892 21660 243205 95206
17620 41836 -21111 -291913 -146472 150952 88096 140046 -20334 -176927 -126767 68521 -74590
17608 -12858 18368 303110 85362 100487 -40256 -153345 -219490 127327 110833 -19316 113336
17596 95878 -70434 112411 -35888 93565 306595 -352440 -98795 -16831 157193 120904 -192780
17584 -9778 54028 -251506 -188065 -141629 297404 -174063 187314 -130225 -246782 162583
17573 204293 -210660 -157743 -109924 239408 126224 387232 319689 14615 105985 39718 -197002
17561 311 58935 -65463 112869 316071 -285031 -163078 -48567 -6302 -2188 437325 21466
17549 142756 -82073 -208305 165360 -131497 -89133 -317395 -188392 -14154 50967 40720
17539 40720 153437 85485 142596 234742 342130 78671 275089 330293 21437 -203285 97402
17527 23622 41799 43021 173080 166518 -138612 241920 133816 384946 21800 296673 98774
17515 -34951 -5325 -185451 -130982 182482 -140432 -29940 -91567 78789 33907 1157 -54952
17503 147360 -235295 -65580 -20115 166292 138129 106761 200631 -247013 220718 206753 -66407
17491 138847 66572 -55526 -89852 319948 47050 -171258 272991 116834 427881 94468
17480 -78914 54856 146192 309707 1813 92414 58323 58962 -143045 245643 -46473 36510 426548
17468 426548 -125115 233019 157292 -30713 55684 384625 487730 33331 -116537 130301
17457 77695 90315 -201550 296366 701419 24968 166389 212679 190619 249593 247230 431123
17446 431123 415466 161092 18275 208941 255923 402102 319811 424496 136013 533398
17436 533398 371243 483050 256986 264325 173396 156745 386342 126691 247758 370397
17426 370397 143423 366781 549553 108239 212733 298742 141835 294446 223603 305551
17416 305551 139653 -2141 230077 137446 239189 80584 44023 -110381 31336 247430 106977
17404 -91954 139649 -184047 325967 152190 -5335 -224761 399984 232639 474139 228998
17393 234235 243971 88298 -107012 308221 325349 411213 188611 102012 67588 285177 324435
17382 324435 156669 258330 238841 107261 -109545 418107 458411 38747 275139 -1106
17371 81434 200893 578040 71436 -12 172874 75248 186176 362905 -106009 255173 47857
17359 258974 169496 193156 249558 182519 173170 78754 -55100 -75029 18742 24227 286532 -116653
17346 13250 453238 401768 -100196 76554 181609 262096 186908 -1949 58432 160499 -6309
17334 -128675 241528 251777 83283 391028 -18683 -8395 113455 224811 325958 231899 406811
17323 406811 -3538 149659 78824 147986 64642 -44423 -776 348639 -62766 -127900 -131971 -11444
17310 91279 273822 144441 196381 7079 -68789 -53979 43538 307431 -32832 357195 174304
17298 248715 170429 -56340 -123239 72215 -46188 138912 241834 165531 -43958 108526 -159644
17286 195529 384027 45725 210863 87455 113068 -22381 -76016 449161 252132 376917
17276 376917 263885 125537 -126650 65713 327770 350666 314810 229947 295781 171121
17266 171121 -44148 -95975 270343 54047 304316 273789 174820 157551 170074 95617 323754
17255 323754 -344992 290664 54373 132681 465386 168103 -29947 -30167 148744 81302 408636
17244 408636 318699 188389 218749 123401 -73291 173500 76123 187532 149497 34442 52713
17233 52713 66659 430548 440394 263949 541633 48876 164454 230445 572452 158141 40131
17221 289440 -501548 80433 218039 239344 312074 32301 85082 105242 592860 258618 82537
17209 365803 296390 301990 217602 232952 235173 498941 19156 395534 326583 354291 127353
17197 260397 115345 59821 81355 -89042 174953 149840 389625 394129 48537 338366 175020
17186 175020 316015 210311 412989 250583 204266 163484 289166 270483 102407 283581
17176 283581 247665 241239 249086 116668 150339 144864 644545 277279 262986 496107 249378
17165 249378 229160 50874 74469 182857 327142 196398 566671 296067 153343 457288
17155 457288 241347 549364 316604 384004 460116 345234 77240 441368 573679 429147
17145 429147 251331 111879 247068 305319 122078 261457 404465 626615 322618 -52708
17134 453133 198556 701082 156881 505417 182474 64165 213179 398981 269566 178696
17124 178696 256511 300130 257923 335937 362097 752164 -10211 290520 230447 886099 41038
17112 437208 379556 547138 226214 315527 152226 420707 82972 417389 403798 338344
17102 338344 302854 389115 532133 430749 463477 313288 203345 273342 291521 544006
17092 544006 377256 538894 389423 355947 363018 179872 229310 649688 538652 225468
17081 583760 434603 283854 287556 84112 556086 678675 438428 406933 329722 -30281 429310
17069 320347 268340 655495 788319 482843 404954 212917 275399 563081 416457 499587
17059 499587 262990 368516 523243 461008 616043 595229 538028 647962 462157 729070
17049 729070 404215 202569 322893 617941 649240 390306 848681 263096 618695 593285
17039 593285 573306 666508 510652 836848 844719 287670 479152 638956 534594 642305
17029 642305 597854 693561 411348 511082 422806 1021155 624377 623073 764065 511138 714309
17018 714309 487883 788452 480491 366983 754251 889668 712405 572276 629837 635726
17008 635726 369617 656394 774445 437171 612742 571319 621968 248196 508400 655451
16998 655451 652143 700583 436513 687723 818936 770599 634648 673755 682826 893861 821043
16987 821043 683408 741311 701510 743250 971244 547733 970092 701401 771100 885383
16977 885383 937076 871895 996651 788241 926195 977904 804840 901901 1049143 879154
16967 879154 964599 839285 783333 1088432 710780 855753 1006723 761767 503509 958307
16957 958307 976721 801604 964885 1145694 726554 866663 924333 759582 1135007 1028038
16947 1028038 1090641 1287209 1070350 878767 1124995 1026271 1123059 1053447 931937 1389236
16937 1389236 1182619 1246688 1205132 1096363 1249053 1410902 1376159 1326540 881831 1438127
16927 1438127 1250172 1093849 1302580 1411809 1150610 1177684 1325156 1405221 1416543 1118482
16917 1118482 1555367 1428865 1171726 1039747 1326653 1482314 1432555 1528970 1557997 1717098
16907 1717098 1516644 1576179 1997319 1315239 1199698 1564864 1696582 1585631 1243116 2119389
16897 2119389 1745975 1681858 1877712 1934053 1701117 1383200 1758311 1431291 2111980 1977172
16887 1977172 1686916 1971564 1816026 1975335 2270770 2115145 1874216 1861030 2338516 2664483
16877 2664483 2111245 2260240 2192365 1909488 2124228 2171685 2231668 2144233 2183160 2472388
16867 2472388 2422386 2204144 2658949 2491456 2540024 2550801 2764878 2370124 2695982 3087609
16857 3087609 3095899 2904565 2758652 2984634 2936466 2669586 2958189 3097470 3010004 3369289
16847 3369289 2994032 3616030 3169747 3276200 3514321 3416736 3402783 3579435 3744995 3629241
16837 3629241 3442027 3601628 3989738 4112729 4126184 3878789 3983685 4087063 3968759 4287817
16827 4287817 4367918 4204677 4667524 4570920 4549516 5108097 5139327 4848121 4930126 5298195
16817 5298195 4956853 5132828 5396005 5673669 5374418 5953967 5823534 5897482 6312201 6229618
16807 6229618 6258084 6354679 6382524 6793195 6619394 6985351 6881582 7332983 7505831 7878877
16797 7878877 7957137 7965848 8012976 8575355 8705387 8944155 8733239 9098330 9572942 9701880
16787 9701880 10075290 10278947 10729297 10796077 11301542 11390186 11588224 12345699 12489972 12913439
16777 12913439 13093788 13778650 13819242 14426594 14793754 15470670 15676499 16312973 16790079
16768 16790079 17719479 18026603 18704389 19247754 20182147 20621884 21342496 22176593 23208642
16759 23208642 23894993 24984908 25754053 26727788 28152258 29355854 30331569 31588967 33407997
16750 33407997 34863864 36447332 37982692 39862954 41837487 44073593 46529796 48438840
16742 48438840 51287655 54014822 56842764 60054171 63621660 66998603 70862569 75018191
16734 75018191 79860743 84461522 89315629 94954281 100598361 107335244 113264212 120032454
16726 120032454 127154412 134362480 141931090 149036844 156929869 163705557 171017703 177375053
16718 177375053 182885578 187969460 191318141 193791670 195423699 195177982 193889691 191667678
16710 191667678 187485241 183008579 177503628 171068820 163744328 156517593 149226962 141341328
16702 141341328 133741887 126584142 119319010 112126313 105498663 99231625 93239086 87936950
16694 87936950 82531260 77679655 73118851 68886166 64882541 61081468 57962520 54490404
16686 54490404 51622349 48947343 46228714 43899930 41637405 39626489 37787625 35858091
16678 35858091 34230343 32522203 30911806 29895561 28727075 27107594 26265130 24654302
16670 24654302 23769104 23176241 22444748 21121965 20628346 19510258 19194740 18372210 17522539
16661 17522539 16997494 16411285 15694250 15131978 14978428 14369634 13917434 13192035 12813335
16652 12813335 12547195 12344592 11888788 11164596 10921306 10594053 10490968 10217376 9955937
16643 9955937 9559224 9262385 9032243 8982355 8401471 8269583 8230190 7804745 8010613 7643119
16633 7643119 7442766 7310469 6532732 6853759 6600567 6400563 6065586 6124666 6075325 6090887
16623 6090887 5706829 6027918 5491351 5303396 5086571 5138472 4849633 4815667 4670856 4588775
16613 4588775 4353179 4489635 4638152 4895854 4396629 4449312 3990199 3886030 4164684 4197009
16603 4197009 3767533 3922238 3627476 3684305 3227082 3785375 3464645 2979908 3176484 3217290
16593 3217290 3237125 2997222 2883933 3071489 3044906 3230712 3174820 3039426 2656023 2570412
16583 2570412 2655981 2575975 2265461 2491496 2629810 2455995 2531446 2219455 2498346 2328377
16573 2328377 2496197 2549231 2293557 2074740 2201171 2070337 1890181 2261276 2108801 1831259
16563 1831259 1992872 1629772 1540754 1703112 1566198 2027745 1788669 1818872 1841703 1681137
16553 1681137 1473828 1644464 1894476 1656533 1484455 1396307 1637550 1576328 1334838 1409504
16543 1409504 1542600 1391702 1158845 1415349 1432057 1501478 1111416 1425339 1069131 1175797
16533 1175797 1323780 1454542 1131902 1228029 1252357 1254846 1305768 1061694 1282513 1424856
16523 1424856 1284166 917314 1186104 910324 1131579 702997 981739 788980 1400789
16514 1400789 771808 1158497 1092842 903345 636219 972573 997213 995521 806370 957275
16504 957275 972635 1229693 1266182 716093 683937 1022636 1023846 751959 958470 906144 674291
16493 674291 796466 745528 651588 862287 644305 605880 935224 710546 894524 876306
16483 876306 798796 781979 490385 620595 580575 700206 689212 691853 517990 746527 552213
16472 552213 941325 570241 770718 471894 659244 604128 643612 700698 649797 530955
16462 530955 750017 654081 861724 479697 815989 609605 571898 383156 614474 820157
16452 820157 782522 535120 499776 249452 348198 496124 687030 460268 439998 825253
16442 825253 644218 695741 552873 437731 720814 454275 271551 379190 594492 363506
16432 363506 646806 235405 484974 521924 525637 150937 663909 485587 383184 251392
16422 251392 292197 421590 193873 399289 407918 273586 815311 355847 751664 465755
16412 465755 234056 335792 415549 93204 630548 665234 151749 393238 334064 434187
16402 434187 423579 392166 330927 228851 677754 528915 411046 200959 424230 468303
16392 468303 337535 338481 299094 316275 209710 290628 245940 331495 304192 282724 267902
16381 267902 254092 -67917 272576 -24247 163778 214910 199078 220825 400879 -129730 480171
16369 107937 351980 230112 85257 360725 86012 136347 291776 449648 179386 375953
16359 375953 412702 170379 153607 490995 274420 222068 81723 325636 253745 176288 248434
16348 248434 107332 184171 410625 134538 23261 186969 239579 161699 371863 221229
16338 221229 -126846 -20281 516154 128948 19003 213831 104405 165137 273665 137333
16328 137333 82008 630582 487207 272480 532153 279386 147049 181995 156001 141226
16318 141226 83433 130167 378007 -136695 412950 414142 339851 522432 124413 -5128 -25571
16307 -25571 380103 387166 176407 115578 -119288 158214 -156243 417937 -814 264060 301576
16296 301576 242286 241831 91953 81024 225433 138461 15172 324077 50050 216723 327913
16285 327913 153156 288559 -135497 153571 452670 10151 118267 68212 369591 169991
16274 211329 146687 223953 146248 161235 301101 -14468 -75227 86641 -120202 -16385 -183816
16263 -183816 231500 -63808 91164 105795 -64372 -19867 -57736 106929 193610 236249 -66088
16251 -193432 284146 133283 33135 -139000 340158 -269092 -206581 -22741 166690 192993
16241 192993 35692 70237 249203 83065 -90102 -41729 -167229 63393 62311 84810 7373
16229 53253 143668 119233 -35816 -51345 -43203 217797 -7039 178559 146772 -10942 -16543 70495
16216 -192374 330607 -37614 161802 -46566 142852 340710 112101 103788 29327 85805 37169
16204 14065 196201 80555 3553 -127674 -25427 16399 -74482 229804 176876 448498 163753
16192 35318 -118699 -188392 -281316 229648 -86411 -65537 286462 122402 -100440 16706 -73703
16180 257890 299765 259220 48045 -83603 -132381 -61924 -21517 -40821 66707 98649 384792
16169 384792 -112782 257314 -45219 83206 -372883 218085 -301696 151212 237938 167765
16159 167765 -130132 49524 342075 25907 -302206 -312085 -213632 14990 174698 -112257 152002
16147 -90792 150497 -378865 302860 21376 292641 -24119 -140119 159679 156501 -81911 156804
16135 -90651 -116314 -220541 -227331 -301277 118309 4581 2886 46311 196545 64523 -139111
16123 -8964 -203966 -326394 2539 -188204 153515 -229097 30294 -52090 -157146 -44765 -239527
16112 -239527 139764 -249551 -258755 -237353 -43338 -106829 564052 -62426 -50055 224770 358284
16101 358284 402793 320959 -279617 -8242 -7184 4782 109960 327477 105814 246508 -115210
16089 309519 -85080 -113497 1597 -8113 -254974 -242013 -159968 374425 49890 150947 50449
16077 40768 69192 -257189 57278 187861 -58754 79213 31728 33934 -107250 54962 131369
16066 131369 -60975 -361201 -42285 57156 -127694 -112440 424224 124299 -76868 -333257
16056 -333257 291865 -37381 -147199 28816 3669 160403 -171773 -395177 -112424 -150052
16046 -150052 58845 103041 219819 139168 -239347 -91386 -251562 88971 44254 -83921 -114630
16035 -114630 90901 125813 -214638 212439 -155637 115265 121577 234220 -129158 287303
16024 66544 43073 -50800 246635 47090 311024 -118933 -9307 77996 6174 -230249 -460295
16013 -460295 -354 -318102 -53301 -251986 -34461 -82906 -69510 -47338 -45709 -37313 -159631 316428
16000 299543 -67997 416461 -259777 -29892 13570 49761 168333 176293 -17060 -376335 158001
15988 -33435 19801 14601 59489 -6625 129364 319189 225328 160994 199913 403386 158259
15976 40153 201865 -115482 -34190 148607 39436 118742 91059 98807 -29398 42762 -121998
15964 81822 99002 40362 30211 381061 -119368 52656 39164 -76530 -306938 38503 176000
15953 176000 -136712 -168188 -232740 -275649 -29686 -8633 14096 -195622 -172688 -229820 270286
15941 -227433 24303 -175841 -132390 26707 -63741 -85265 101475 -144093 75901 -107657 -124049
15930 -124049 -388298 -108765 72143 -213915 -253794 -139309 26772 -28485 -65507 18094 -70612
15918 22030 -22484 -145351 -439490 -66731 -102226 216748 -116837 -289720 216652 97265
15907 -288428 -107622 105556 190789 50921 -119364 83854 62619 32737 -206991 110239
15896 90773 72962 -228140 -126668 -2322 3573 -39577 393584 -23341 -1216 -153507 -287862
15885 -287862 91463 102991 1144 -52561 -69517 -18239 11762 -108023 -76514 -16782 -203475
15874 -203475 -121645 -230569 -22115 -138102 -445788 406290 -279018 190841 -27279 5062
15863 -230542 42549 12910 18464 288429 -51253 65893 185015 112385 10051 94151 111335
15852 111335 -250713 184901 -294218 172569 -392462 2846 352466 132970 -120598 -374017
15842 -374017 -113060 -211126 -72928 -201241 -494936 73577 10744 43227 -136833 30496 -112316
15830 247634 -223820 219838 115614 57161 -97551 80286 350496 -407523 47001 -206674
15819 195984 164493 -21117 -30166 107497 -127970 -162359 -137120 171587 -67082 -147744 1862
15807 -221814 -198944 -167015 274643 -6149 18342 145948 1297 -75846 -218603 14404 -33812
15795 -81698 -231427 23854 122714 132253 253316 -165207 218234 -110718 -2609 -50369 122078
15783 197067 -247133 37597 -38626 -170442 -331256 -112144 -175582 33899 -143967 160960
15772 -6693 -254829 304669 134256 -142296 -249351 172620 8970 65026 -154076 123775
15761 -186855 59392 382483 250471 44304 420020 334278 143618 139520 76126 16995 -363112
15749 129487 371968 149441 42001 -95073 -32919 346345 -423885 -93634 464 -52120 -177627
15738 -177627 -27605 -151250 -208320 -87217 4104 -176561 -70585 117988 -82100 14623 -434645
15726 -99653 -231186 130702 94878 -37808 -422506 220112 207117 -202801 -252962 70557 20014
15714 138967 116297 -126062 -136407 257589 127340 275667 -101578 -308783 -164508 40121
15703 289898 -82559 -210905 290721 184493 -211554 -106306 -231883 247810 -118700 -8830
15692 -124808 -291137 214546 195105 -155814 168053 137324 -221773 -40251 -70120 -145516
15682 -145516 126461 -19910 30057 23182 -381829 -170414 -241334 197719 -106154 -109704 59973
15670 -33667 13134 -2607 -46435 -76107 -13541 206776 147363 -189686 -146615 -147135 119762 -33700
15657 -136236 -57167 64994 221757 163760 66401 44448 -29808 125793 -238646 -90861 -37305
15645 84441 192607 266253 107280 -237052 41679 241766 179977 -346114 206008 -112387
15634 -168071 -48488 167647 248698 -168620 97087 -44310 -27868 -148358 -434084 101721
15623 51889 92233 -264568 -68431 15627 -105589 -29964 -193418 -106742 116470 -75961 75984
15611 -180028 68864 -369871 -158755 -131940 -71647 182307 -297819 74526 27064 54483 -257696
15599 29669 -77654 -1619 -243574 -8121 31467 39339 14516 -133887 -114449 -178667 -104837 -292963
15587 -292963 109571 147491 79639 38510 -308796 -67934 198204 60265 340032 -17975 20623
15575 -168652 114544 97944 5873 244686 -55410 -26892 -144705 16104 -53379 -6665 25534
15563 66852 33494 -121667 61149 89685 57049 38084 75596 2532 46312 226097 -51112
15551 42899 -151434 -131471 246254 -232679 -107017 75689 13394 -198612 -230288 293055
15540 -331921 -55774 281767 162393 249598 -170396 291026 115412 -54694 -85387 116507
15529 -66555 303465 -15554 -25440 -100434 12093 -118119 -58505 -131095 -185699 285062 -145882
15517 429761 -51066 -31699 189111 34549 -25456 76167 -6679 128091 182012 -144012 -133756
15506 -133756 269390 -108061 -188931 -139656 -71535 56779 223464 19652 258251 138897
15496 138897 109366 10156 78714 -45676 -143045 -85683 157440 199034 -235249 -364239 -222523
15485 -222523 -7809 239588 -195498 26611 170175 35659 33781 25706 -149923 -118243 -191726
15474 -191726 -30533 -142766 113360 -73611 -83437 -349105 -60179 1778 45823 -112383 -318390
15463 -318390 61587 95871 472151 -90647 -411302 25073 269223 -190136 275987 27049
15452 50223 53509 -22991 12957 -261173 -230705 -405744 128194 266498 -88655 146021 7672
15440 -269978 -206466 -93024 315500 225035 -249918 -41513 118989 104330 -95976 -106037 -199232
15429 -199232 -77355 -140884 -161899 -199182 -164445 76326 132843 -113266 474509 149583 96443
15418 96443 305211 135026 295131 -182597 104453 73609 -39530 -157412 -423315 21529
15407 96424 -141087 -155517 -64671 86864 -92405 38606 -7946 229678 -52104 191522 53396
15395 5114 27595 -118143 221549 140429 16410 350428 13955 122746 256380 -188006 -201843
15384 -201843 -69802 -187976 1761 -59953 -184556 74862 -274160 64428 -134051 -9617 45747
15372 -429106 -421847 -65945 -11284 12004 -389031 -94342 -163212 1656 73831 -315941 -64085
15360 220313 112148 -275456 174094 -321795 14151 177254 82582 64089 81073 84270 -31381
15348 72643 -194762 -97397 74508 -88539 50398 -202088 -31690 -51931 -145964 116916 2441
15336 23525 41946 92137 316682 -231002 -44553 -191330 13428 316962 -39766 153532 129214
15325 129214 -122317 56437 24954 92783 -481600 -33464 -21436 397291 -86625 -222698 56551
15313 -81971 -216783 -58078 47584 -224707 -181567 34870 323566 82392 117927 157583 -17799
15301 99474 -171609 74303 -116200 102224 361279 31749 28930 -162535 348954 3804 49090
15290 49090 -68962 148289 363961 -155962 175712 18304 27409 244212 -128035 84056 -34508
15278 -224681 -16666 46178 -81618 24650 -69493 24579 85507 98574 -195519 268614 38100
15266 101502 -79826 83778 48913 -117199 26764 238086 278665 181707 73926 -200121 119725
15254 -42375 -114784 190197 461284 92520 102496 469600 1044423 1368622 1553025 1094708
15244 1094708 1450055 684994 592069 158813 205405 -89047 157838 56113 -151940 108799
15233 81526 -300658 -141338 104820 469523 456543 186135 78463 139650 110701 421278
15223 421278 243675 227401 108633 190525 -181354 82824 -35999 63834 -132695 147587
15212 31463 201442 358687 323007 274709 -57595 222786 78891 -4208 19614 252886 286453
15201 286453 20570 209932 137985 348603 177506 292024 124699 -16030 39500 46394 9889
15189 -129204 239785 110558 116645 -273553 -261031 29352 -71524 111832 45948 144294 236076
15178 236076 -106341 170853 -24425 -147459 241399 203351 -329471 21009 264728 376188
15168 376188 19051 -59504 440893 122773 -65648 229594 232963 -34037 152301 -320783 211857
15156 105448 27391 -164312 179964 9840 248892 190125 222341 70102 23867 220515 -56520
15144 -151253 -28904 -33246 -208284 -346323 189154 40711 273874 -261563 -28503 -105253 35501
15132 246065 151877 196350 310068 255331 -63382 171369 90718 171078 -347854 53390 37640
15121 37640 117346 -88188 163313 86402 344190 -245140 -184620 250891 203998 149413 438411
15110 438411 99250 -254162 141749 519825 106746 -39340 -69017 348613 69593 -211548
15099 272014 -149445 264743 -54718 239668 147370 -28790 197009 14969 46302 -125370
15088 382179 6939 227320 117827 184511 137311 156234 113575 -104242 117572 81256 273638
15077 273638 228297 57431 100498 92596 135530 193835 -81205 180793 100330 117909 16255
15065 105699 186447 -47384 123045 231289 306074 -156451 434460 -112147 357 -7790 109297
15053 260141 225198 118764 -96456 95443 316073 292341 189588 98436 271357 -163944
15042 165191 520869 59245 -30081 -143117 -122740 -220887 17613 381806 4269 328518 151335
15030 460256 208935 -77331 106498 561817 -17107 323252 62675 42420 285680 280957 159248
15019 159248 290445 54296 64626 390698 160142 -73560 470297 187627 144176 274918
15009 274918 462272 266752 395539 298389 200615 155440 160240 135006 339623 358685 303460
14998 303460 436952 100654 215615 223150 335624 179857 6741 223308 393945 564658
14988 564658 -214154 342330 454244 231945 232074 205022 44025 412071 176718 316478
14978 316478 237185 312089 589889 96666 460894 54634 320456 410051 306712 225106 111417
14966 310706 134001 414306 436889 179791 464144 -240406 644713 754448 366495 308208
14956 308208 212761 11940 71667 346291 22362 -12730 662490 279523 200045 415544 417526
14945 417526 447173 455384 310305 204266 327706 151752 441921 347902 102252 372519
14935 372519 608070 523621 112978 339714 659281 345579 283223 80738 462432 137511
14924 -98879 48447 144519 433035 473612 129310 -8129 230829 523385 366382 433100 479323
14913 479323 139950 251911 465417 109425 500279 182103 510529 219767 598631 270852
14902 532553 471763 379337 233074 528111 285760 176433 425129 -12099 541418 291102
14892 291102 168579 516673 215533 560019 448647 604837 252030 167984 212734 443249
14882 443249 201978 65858 535925 292510 352296 335646 663137 373601 157070 331393
14872 331393 461663 354951 280131 539229 476591 523166 301306 775110 92761 568269
14862 568269 263313 140013 332042 499125 189863 140561 364862 166634 -2619 582761
14851 584114 423902 369522 225761 488097 535866 418050 566419 366708 375389 612761
14841 612761 287847 315557 438578 346606 520234 457362 361186 438688 695941 513228
14831 513228 681311 456254 493571 463672 280706 339661 405668 387258 244170 432185
14821 432185 608851 631340 408154 384276 416126 52442 503027 259470 390457 569053
14811 569053 436778 418545 305682 533897 518109 665307 641550 475064 502373 583147
14801 583147 389276 312014 566904 560743 347763 519579 516828 275973 576815 486817 435790
14790 435790 782956 392585 791047 916117 426774 147481 422032 492151 230814 482087
14780 482087 453277 779104 451799 878897 831231 307230 443980 439919 701427 246524
14769 726143 326277 579066 690164 749972 492641 554261 768480 748873 789830 351729
14758 587759 574990 840196 508350 716553 682317 606853 633923 574099 886048 639637
14748 639637 552790 458779 552469 829314 493629 670406 698614 613200 666217 737248 789543
14737 789543 625451 1114064 833574 945135 595724 674246 907832 462348 881991 755403
14727 755403 752132 1045398 740680 767953 977482 1122187 911901 1035076 745471 879267
14717 879267 816208 838156 1008909 702232 870276 928928 717587 573106 733969 702722
14707 702722 717097 1057484 719393 619202 838966 730215 834777 688421 706385 807351
14697 807351 547988 898515 749647 447177 918723 1124567 797175 849952 940855 894048
14687 894048 952012 1078833 1156969 539371 910079 844505 690940 1138687 889264 842133
14677 842133 884787 843125 1154837 912247 929314 1087168 1275862 1029367 1142479 1102837
14667 1102837 1017981 1054512 1278094 1310640 1032690 969722 908150 894745 1180993 1077713
14657 1077713 794981 1181778 1293408 1273439 1259318 1126689 981281 1066543 1086778 1458013
14647 1458013 1024455 979791 1072977 1113936 1217315 1242403 1355363 987800 1196224 1463758
14637 1463758 1250991 1191934 1282133 1041557 1178061 1366285 1392682 1201696 1523380 1390150
14627 1390150 1274976 1318228 1206286 1227632 1086973 1566166 1502297 1113366 1513759 1070430
14617 1070430 1317868 1590245 1478925 1402193 1215523 1356524 1641239 1764915 1508147 1567978
14607 1567978 1444221 1762205 1448519 1389684 1490302 1545705 1324610 1592993 1555355 1916404
14597 1916404 1682789 1958749 1787236 1684496 1536410 1582964 1642715 1775578 1658303 1683142
14587 1683142 1551564 1842916 1875215 1848676 1905338 1767777 1988730 2037648 2045345 2055654 1915201
14576 1915201 2005013 2274306 2279354 2292408 1806015 2098079 2310086 2156204 2265402 1978155
14566 1978155 2237362 2384147 2501535 2665310 2549189 2525626 2633776 2748273 2885104 3021588
14556 3021588 3353423 3305810 3659273 3718386 4464231 4676465 5412609 7323330 11194288
14547 11194288 20952353 41113052 37834136 24021781 12205341 6625191 4026517 3053319
14539 3053319 2501178 2528265 1726593 1812972 2169819 2222655 2145207 2124879 2287011 2304565
14529 2304565 2395207 2175747 2276791 2309310 2024063 2495944 2588437 2202792 2770726 2231995
14519 2231995 2582961 2563096 2343113 2692268 2655813 2576157 2551322 2688958 2694524 2729680 3000264
14508 3000264 2818065 2886607 2693575 2601648 3152837 3277358 2921621 2856705 2964678 2940582
14498 2940582 3182261 3236252 3384266 3525320 3632654 3376841 3434087 3668351 3659483 3697389
14488 3697389 3643936 3698448 3584420 3617402 3467577 3900718 3545384 4046530 3803228 3582453
14478 3582453 3984302 3756378 4187628 3990767 4132496 4186667 4139305 4407465 4072197 4626277
14468 4626277 4367184 4415790 4427265 4367296 4631661 4464623 4848557 4757171 4781364 4922184
14458 4922184 5326913 4829661 5218324 5387671 5381339 5380424 5579543 5355289 5631604 5507245
14448 5507245 5718306 5675695 5890561 6151818 5895678 5900168 5966704 6034541 6255073 6192931
14438 6192931 6390249 6641971 6394274 6967089 6758636 7154125 6554694 6903010 6909510 6897225
14428 6897225 7116009 7311545 7448848 7577282 7643599 7819623 8133919 7804452 8259718 8166644
14418 8166644 8085802 8331943 8620856 8569651 8706371 8348631 9231989 9122140 9080065 9350473
14408 9350473 9470456 9559504 9853587 10062537 10116114 10124608 10233828 10495918 10723078 10924310
14398 10924310 11211350 11157576 11055445 11697183 11970227 11856361 11792795 12225273 12554948 12520416
14388 12520416 12730678 13090987 13206396 13483895 13683699 14358308 14327935 14583626 15011831
14379 15011831 15182755 15588533 15345885 16286631 16424253 16567490 17001075 17261218 17653612
14370 17653612 18022603 18262338 18519619 19279110 19454731 19849117 20273591 20454124 21422519
14361 21422519 22087379 22091410 22805291 23074555 23538485 24085622 24701264 25249764 26032979 26908875
14351 26908875 27082186 28187830 28504757 29589913 29794101 30648304 31579688 32610921 33214081
14342 33214081 33899065 35048504 35929149 36746223 37766529 38959364 40092670 40953796 42294533
14333 42294533 43389751 44813436 46214236 47789671 49318421 50891423 52504281 54098632
14325 54098632 56180768 57889275 59847926 62114572 64187745 66125578 69128841 71179712
14317 71179712 73905370 76678374 79713201 82706184 86250544 89371670 93649130 96969861
14309 96969861 100958711 105353018 109800784 114775627 120126738 125295001 131204857 136838108
14301 136838108 143645896 150113427 157363747 165083420 173178519 181679535 190888879 200638192
14293 200638192 210563607 221409195 232701259 244744413 257127062 269687037 283181914
14286 283181914 297213124 311623637 326119307 340901811 356212588 370971782 385465478
14279 385465478 399699272 413048762 425412697 436693328 446402631 454382640 459776873
14272 459776873 461886941 461274721 459264831 452365254 451700859 447687165 440562105 431099142
14264 431099142 420172319 407835053 394656181 380982954 366557675 351260693 335872460
14257 335872460 320418308 305356587 290312886 276944081 263758639 250724260 238567471
14250 238567471 226360882 215386213 204381630 194602195 185296482 176330601 168027130
14243 168027130 160197296 152516751 145386001 138886178 132637196 126936778 121550807 116410026
14235 116410026 111104713 106426661 102060188 98124320 94534966 90548290 87145872 83756550
14227 83756550 80459788 77331077 74583804 72108856 69385542 66915034 64650620 62542648
14219 62542648 60387254 58557214 56449319 54646940 52975818 51514144 50120852 48626101
14211 48626101 46806860 45806386 44093221 42774063 42649095 41173065 39738801 38354674
14203 38354674 37384795 36168731 35735407 35308188 33777880 32759240 31772675 31244202 30545365
14194 30545365 30193439 29042813 28126492 27475068 27234329 26275381 25897517 25494384 24448069
14185 24448069 23885315 23502336 22994344 22284878 22101430 21644639 21131171 20408504 20150430
14176 20150430 19884442 19520288 19387878 18739618 18900384 17794108 17372532 17248575 16939704
14167 16939704 16577965 16170352 15851743 15431170 15600302 15268235 14955515 14466321 14277065
14158 14277065 13848988 14009907 13555046 13545427 13540581 13175341 12574518 12572218 12377974 12172796
14148 12172796 11820988 11628102 11344742 11418474 11076013 11026220 10948004 10565363 10329450 10533771
14138 10533771 10211749 10087370 10161474 9700174 9694658 9381218 9174301 8997293 8976657 8560936
14128 8560936 8804315 8812217 8219679 7921253 8747323 7957016 7921788 8029618 7602049 7962334
14118 7962334 7703871 7423996 7440003 7402935 7297468 7105245 7149416 6876132 7167059 7062702
14108 7062702 6917898 6449047 6754538 6341668 6354235 6592736 6388703 6234467 5953994 6088417
14098 6088417 6175215 5839231 5712859 5842312 5715556 5600563 5645834 5562415 5551202 5456711
14088 5456711 5451581 5330753 5503518 4952812 5130653 5380300 4964025 4870402 4964756 4922176
14078 4922176 4839414 4675152 4550671 4456653 4614204 4609382 4556662 4462108 4412611 4485658 4486578
14067 4486578 4266273 4583610 4037587 4177295 4120326 4037065 4294820 4322289 4128132 4268262
14057 4268262 4164902 3917840 4075056 4004441 3857095 3865383 3736072 3668987 3756544 3713604
14047 3713604 3768236 3599330 3613769 3714772 3264440 3345663 3214219 3437730 3520113 3584156
14037 3584156 3340561 3535421 3305486 3493280 3361742 3174825 3108197 3151403 3153094 3048166
14027 3048166 3203552 3004094 2835547 3082280 2759713 2812161 2789450 2735968 2755348 2627060
14017 2627060 2879064 2919475 2684460 2577887 2673248 2856758 2601420 2504342 2539070 2214018
14007 2214018 2404704 2462572 2311208 2438497 2261283 2259555 2325482 2464659 2459959 2519056 2403455
13996 2403455 1989782 2337279 2292805 2402410 2452846 2524968 2901835 3421714 5963987 13747015
13986 13747015 34762474 39032667 27877178 14879678 8947329 6306139 4986345 4331844
13978 4331844 3807381 3477632 2973050 2959647 3114702 3154309 2651707 2713185 2856643 2592771
13968 2592771 2825505 2534992 2229879 2538059 2170060 2266281 2318818 2312198 2028291 2353007
13958 2353007 2133394 2102421 2087991 1911240 2094068 2081800 1899308 1977689 2095517 1899714
13948 1899714 2003849 2088852 1977800 2070422 1672621 1840886 1962386 1885034 1667406 1524530
13938 1524530 1746454 1736244 1890093 1597306 1751349 1476929 1636951 1442875 1710439 1442556
13928 1442556 1584746 1694955 1389494 1486675 1626029 1442141 1586054 1514739 1773747 1690437
13918 1690437 1510206 1355288 1521764 1307496 1541860 1316147 1494489 1613006 1271488
13909 1271488 1519463 1288194 1317619 1507533 1667063 1368508 1733414 1169750 1517406 1548628
13899 1548628 1191821 1487444 1513042 1632178 1511576 1528817 1356721 1333998 1469645 1516444
13889 1516444 1338708 1334822 1029928 1404237 1163514 1199168 1145326 1320471 1522746 1148966
13879 1148966 1436498 1318253 1175139 961663 1297034 1452124 1371706 1178939 1314309 1506845
13869 1506845 1096819 886982 1177133 927989 1144290 1085685 1018997 1020902 1124879 1027628
13859 1027628 1124442 1185573 1323540 955562 1162300 1138902 1083917 818036 951841 1197824
13849 1197824 892331 1165578 1004924 995567 838505 926123 1017320 761817 936827 937102 1431812
13838 1431812 1212600 1023259 1056217 957662 1169350 1227843 882265 1128280 716010 1240378
13828 1240378 818798 1169812 886475 1052227 1026973 1011747 809318 901901 838508 817134
13818 817134 845404 769463 950320 692897 1085553 1146807 1031050 774696 684702 1055954
13808 1055954 546088 1087790 935630 873361 890229 952223 714472 975657 771942 914793
13798 914793 934218 782933 791115 668731 1044977 1028211 801575 757962 721249 1134843 891835
13787 891835 581369 496217 659098 826937 809180 925404 780585 784345 1053520 881932
13777 881932 904288 622098 906012 849632 570035 787342 564259 389938 827440 635372
13767 635372 1024590 550170 635849 695016 571199 594478 933603 682145 470411 565953
13757 565953 996738 683957 131422 521184 611470 834435 740286 543683 818095 637914
13747 637914 774423 712405 468503 637263 692088 646761 472194 677959 783726 741950
13737 741950 450475 824141 524436 797390 375001 632365 762085 634274 491098 646831
13727 646831 636747 568649 855461 833825 591527 468394 614927 563796 643200 774413
13717 774413 313434 698840 586008 867561 926523 809226 313352 440218 621268 666593
13707 666593 520014 612481 691270 702912 525243 363343 573986 570296 395849 413900 458577
13696 458577 404601 487363 697629 684507 456546 642339 213760 458380 487577 637437
13686 637437 460205 534616 467677 578815 353525 404339 381966 546571 546472 209108 381609
13675 381609 508875 345494 329481 591485 732701 381177 593866 411922 270131 638311
13665 638311 228126 487916 407033 329851 785403 575826 613342 202477 242229 252821
13655 252821 595127 222682 387143 314990 482977 649482 332129 206808 429103 821604
13645 821604 719887 925135 372759 145886 286848 650245 709254 120936 554323 353929
13635 353929 451426 574964 795076 809178 444196 413853 238552 332525 488579 548267
13625 548267 338980 441345 534382 533616 431579 405517 228328 373028 561583 331460
13615 331460 225798 257424 512662 488451 806997 125399 143251 595816 351364 499132
13605 499132 350190 426032 308082 390323 237006 46657 464263 513594 180557 491424
13595 491424 472480 619945 395759 666622 296093 575987 315886 356709 424492 513178
13585 513178 517331 458627 468781 143226 121662 424708 246250 412387 94346 535052 355150
13574 355150 317174 90060 453365 608751 298400 301931 168103 389023 378387 584420
13564 584420 306456 288180 124808 281802 379934 96073 524243 709693 288872 370434
13554 370434 74252 342156 510250 751943 129943 356602 464918 408583 339917 106758
13543 92050 71510 -179715 234711 122200 441641 547425 367545 106035 562536 199403
13532 263067 391418 126295 355685 241263 389213 287566 521760 324635 96499 149229
13522 149229 365535 467227 120425 204037 560157 521072 144553 257660 292654 539714
13512 539714 401289 464472 336184 -81345 328339 336643 281461 141329 171029 592339 61901
13500 195643 152268 260288 172520 422983 418842 345268 438137 264122 592084 307488 309402
13489 309402 87268 160989 9114 352140 393644 -130627 264840 112609 329863 517426
13479 517426 470354 288423 316795 211792 409243 65114 112146 251701 194964 115556 377506
13468 377506 527675 442293 317767 253979 226346 496973 685692 252135 319196 126918
13457 382822 392728 526047 264446 97711 339060 -137551 206883 269681 59061 211645
13447 211645 -162890 426090 249237 217135 296515 -168426 227488 66304 124767 33917
13436 226209 323330 -208722 390141 288274 -182621 170766 252950 112990 259694 145695
13426 145695 224946 142541 340103 530375 314474 217819 100019 168492 131502 -132940
13415 176031 86672 -35596 203306 221948 -409 269695 226211 40365 -47870 109033 358780
13404 358780 226938 347076 -19261 230269 179974 -137699 218728 475184 -134255 222775
13393 313039 288369 330856 301137 27452 -12618 610604 390904 198586 66241 205430 268384
13382 268384 212190 193663 314946 131038 215140 379497 -52525 163266 439712 115483
13371 254031 225967 368266 21874 194841 224364 291562 186716 405043 518630 148284
13360 234560 -214263 206221 493196 209245 25140 520693 139103 118326 175059 106511
13350 106511 316619 427666 267592 290662 57367 271440 358665 343700 180852 387028
13340 387028 323858 77039 250493 65667 535533 211627 495819 150545 83097 151081
13330 151081 336212 251059 276372 43137 257972 355454 221362 99466 148243 70888 59326
13319 59326 250741 182872 207338 564296 336799 232766 180411 46475 87192 353231 280078
13308 280078 432783 328123 229811 39697 -65600 134330 92993 144666 172832 251260 69063
13296 -261070 -99973 32627 426262 22202 183710 44631 298485 42375 20734 110535 47205
13284 159746 -70368 147256 -49332 30565 -38697 -26319 199600 424761 171567 347541
13274 347541 278854 199823 134593 -31608 73224 -145322 74699 723071 -256823 326611 81221
13262 202364 256257 498763 353627 -43432 89060 44545 72455 -8231 267005 -288030 3125
13250 -82971 209655 7954 -162764 -50366 -111309 273732 -106421 -10896 202689 5456 214532
13239 214532 -41748 71180 271818 -153948 286277 304852 201223 45549 244332 240058 258218
13228 258218 -5224 8793 116375 141117 -252262 263681 506810 130985 180181 217455 621331
13217 621331 78332 284648 161309 -47925 -80740 146786 -66997 158816 -120745 132805
13206 210501 84982 264409 7551 276619 68181 -122587 339081 223787 227320 451312 149671
13194 9538 -80476 132097 -105937 223896 -81484 50344 -172287 200173 287075 254424 -6676
13182 -49598 89424 267704 380524 323743 -84776 105848 147744 2548 81041 225873 -75435
13170 368214 185991 75007 17741 183288 425158 -25473 -995 64629 52232 -72509 51762
13158 131323 -49065 60766 15757 9027 196044 -22303 -144241 289027 150244 87191 108213
13147 108213 -67689 417865 40597 69184 106536 275398 257490 -139772 172349 64979 -222273
13135 -88798 -107724 422097 144560 -115015 259148 157162 178810 2993 -164135 291038
13124 -19468 -129976 63064 157472 220232 271711 -112471 -54780 360619 108800 -129271 209901
13112 -473375 -278536 132738 -300329 -19439 47975 254453 14575 -28387 39323 206332
13102 206332 16271 39843 -59031 206150 9624 -22658 265115 -24476 -88804 178671 -43217
13090 76414 2350 40204 320105 -14199 234649 -154011 111718 13851 12745 316469 -124781
13078 136350 256079 29897 62203 83060 296393 238311 199205 205751 44649 393778 51741
13066 125532 101369 138200 215465 -171719 335375 180523 138368 184840 208698 235269 371729
13055 371729 -38194 -306799 50914 -6788 203941 238096 220833 -121824 35505 -65937 106897
13043 36586 17226 150000 -11178 101274 7239 111624 -18552 4009 161699 115826 184699
13032 184699 112770 36348 -52212 532735 -89565 13766 163270 192939 341578 302083 125880
13020 474067 159295 32638 106712 271711 320010 -201929 229076 279506 -94575 288518
13009 119609 276951 283741 39492 -47438 263063 229884 44687 -84094 -26885 171813 93993
12998 93993 106393 84680 425170 15090 34955 118393 -106699 -32180 -207607 -131177 248689
12986 144461 -80404 316811 -22681 -328554 102888 -197562 115901 -170715 234111 173477
12976 173477 296047 88257 91667 101529 43799 -194260 174121 -119021 -4050 203185 259303
12965 259303 218170 127576 47473 238988 76335 -132041 22038 12258 62982 -187540 -131779
12954 -131779 234849 141367 -57151 242 -314768 146652 18573 -12763 210447 -61383 197240
12942 -130237 115767 -11954 91238 271676 162169 46687 107403 -120848 273518 -172468
12931 196477 -321875 -39219 107007 216914 112836 184919 21943 2951 45071 181659 -202438
12919 305527 -97423 190961 266015 -24304 26999 85167 -91770 -207331 -284463 -201223 172493
12907 -12389 -55175 17412 -173533 48550 -69357 128896 -193054 140759 -111741 -114114 -34187
12895 -264225 300739 114331 274028 256400 -62568 49042 43012 144606 88554 -60748 -109053
12884 -109053 -232870 -176604 -149200 188829 49317 347575 84814 -328597 234374 62211
12873 10538 -103118 -28992 -217033 166001 270138 172044 -154341 -82660 126403 -97959
12862 -253445 -57821 230719 -237591 183603 -29464 149063 128778 69947 -13087 190375
12851 45229 271323 -82564 136978 -123333 111241 20442 -22665 86940 258730 -83457 285957
12839 -114718 221473 -1364 -81307 198538 251995 26834 27202 -53668 -70737 142679 295213
12828 295213 44427 231648 -27264 26003 173683 278990 -357781 296506 203755 82744
12817 12824 31431 229650 7917 173603 -182847 128984 369654 -7480 170095 137409 160921
12806 160921 -251701 -81641 76873 36200 199601 -396904 138576 -268351 56785 150633
12796 150633 28749 -225065 23060 265431 200827 -20038 -129256 -442823 95009 -81208 -29450
12784 -87913 -18481 15527 -117599 74604 36514 42852 -46254 -54195 -131116 -110602 -62186 342938
12771 66989 408529 -162569 -121008 280906 -248064 -62542 101966 251421 210472 -47332
12760 -107914 -19936 10795 -185041 -23145 -155033 -105641 21619 -17796 -129871 234873 197976
12749 197976 -181459 174932 122386 37720 -61446 103870 -43168 -64575 158278 5731 220532
12738 220532 -151731 -126735 -95846 176837 82434 -284043 -28147 483885 -108461 242232
12727 -22204 -18100 132031 -66580 218008 229326 223081 -52137 76591 61589 -115054 20996
12715 5533 241753 -154916 360155 -1433 262441 -58746 325774 402566 356020 43674 221947
12704 221947 77886 282057 211619 9848 240961 208172 43921 132081 -3152 -63742 -265315
12693 -265315 67415 128746 44184 109428 142637 168204 18339 4953 25596 154130 -174472
12681 -123663 94949 -61740 186849 300009 -21417 -29938 -48470 22976 144872 198974 166146
12670 166146 -83158 83888 -125412 -59799 360798 78447 78590 157595 83006 98846 25125
12658 -81591 -13561 9395 221513 138794 362278 205070 457400 307809 153562 202012 198248
12647 198248 215194 247259 -49634 197124 -296974 32807 27690 -168375 -11293 7573 -176389
12635 -99060 -126901 154164 208721 -8028 210893 436767 439520 163290 255702 340902 149412
12623 232808 -255267 -212053 111706 506465 -24551 317225 -8939 55968 300548 -202950
12612 -118790 -31186 306051 310733 307378 -90431 181022 -85180 173818 25835 129625 220448
12601 220448 140728 306520 239762 218869 253143 556233 -299143 -282277 882 329203 88349
12589 88440 512342 388130 39604 56091 -300951 162908 -13536 369921 76112 -230275
12578 132008 -22206 -62728 101256 32208 -30979 146834 -388467 -93455 70570 147257 -95673
12566 -112421 35733 134748 330629 -85966 -75997 321977 -179893 -50438 20333 -72454 -142681
12555 -142681 199051 -172577 97979 199571 94466 22613 109935 -212180 50128 98622 -95206
12543 -268474 -29846 66412 -57123 131800 225549 28576 -205297 223170 -284573 194646
12532 -156698 74271 5552 83842 279545 -326449 170082 -27028 361523 -74625 -30893 -67269
12521 -67269 -52592 -57092 43172 -82528 -131205 -350581 -211259 177628 106780 -36554 -74771
12510 -74771 -139986 107631 -30307 -125098 -67030 140586 -49279 -46781 79685 246289 55920
12498 -283575 -5813 222184 -60637 -2026 3845 -114572 -100401 -73029 -38871 -122880 37571 239689
12486 239689 269511 30909 -41813 -249287 -26913 18854 83698 55282 -223223 83877 92144
12475 92144 -88554 181872 -17803 190173 138940 52374 51621 -304564 -51747 -63495 -137483
12464 -137483 -94312 -77503 -210080 -136861 -2378 -95281 20649 122203 138789 -64728 1429
12452 105033 327381 -49170 90783 -517159 105879 -4693 266794 -80908 73758 -6267 -303755
12441 -303755 37523 -84712 57345 -139535 -197127 79664 368566 72368 42757 -135034 126305
12429 21644 274579 189925 108544 -66067 182509 -63846 210218 -65249 163551 -150987 171333
12417 -335102 35404 -360191 69016 -289 161267 -125547 -171331 -112134 103700 -36936 299582
12405 2101 -124683 4337 -32237 119902 -143997 233879 -21861 67535 -71179 -153026 144373
12393 -329025 169566 -168912 -106439 -146321 68712 -301793 280531 78890 128719 -146060
12382 67566 -171601 -175929 168927 202785 54718 177499 -121761 244650 92522 215604 6747
12370 238934 120047 88949 -84542 -280169 66713 196165 210304 82459 -137739 59259 37265
12359 37265 -14092 72428 78227 13554 68687 -234010 182658 382528 -11843 -95696 -117812
12348 -117812 84102 -36683 -95799 12288 -66162 303858 135873 -8443 -246660 -272441 115721
12336 185491 30300 -139353 21919 428326 106138 -207574 123683 -122206 38874 -102527
12325 21915 65946 -254148 122574 -5360 -228448 -113350 138409 -47847 -159741 63210 16783
12313 47549 227274 75015 -127433 325782 174465 -161980 115225 345730 -25754 -180056
12303 -180056 220052 -226895 -85971 220579 51912 -78887 -93303 317992 43489 127108 271990
12292 271990 208437 103274 313171 173462 86708 112091 -189141 -90864 115419 217264
12282 217264 114588 -189777 19126 134288 -26764 -67300 108525 370953 346634 84410
12271 547258 -33774 73469 269778 -177450 87868 -119215 94420 -148332 99140 189577 178495
12260 178495 353961 84194 259419 314260 391338 -38566 -35655 -417557 -300951 139698 44200
12248 -139400 376398 37931 213520 157331 248935 -155705 -18977 158526 247434 180528 -58326
12236 704710 6134 -92008 -229288 436447 -80207 -454492 -77446 487024 9187 -178443 129488
12224 554734 280413 334754 163914 403147 398103 428535 -66578 296257 6010 210660 201505
12213 201505 227300 224927 -94624 129650 -13499 164151 -124598 -28186 -57162 68554 22918
12201 253528 99958 291977 -73328 233965 114490 -17750 406718 77596 90738 185745 267302
12190 267302 21110 3810 183179 -95806 -221055 288879 372215 395741 -227742 91634 119108
12179 119108 343311 148846 67115 340354 422021 375377 150429 -84336 141949 -177811
12168 95613 -52040 -164733 106258 67615 169060 159530 53392 183478 72652 134843 131293
12157 131293 -46733 45930 119729 -268592 24286 80541 -37511 -72040 39723 14891 69327
12146 69327 -258303 246860 -65072 109057 -98314 -77995 124723 73154 -275985 232053
12135 129413 154358 -107166 181341 45902 -226160 111832 -102492 -101795 -7108 98174 214040
12124 214040 -201741 -371819 -31880 136695 64587 -49063 70601 106816 -105377 -347873
12114 -347873 15638 177155 77759 -286158 21558 190297 41372 70247 235213 58506 83224
12103 83224 213137 -122587 -414546 -145338 1344 12250 -22706 -150337 -59891 -17748 259942
12091 13753 -150786 -112137 52195 157433 -144870 -270005 238043 21419 -137644 133633
12080 249123 418241 50191 -79620 231829 248127 1352692 1211848 811197 382596 246421
12070 246421 304544 109182 38594 341701 59010 142902 -331769 -109484 -35008 -303384
12060 -303384 -59424 -41331 68792 -26505 -45973 175788 224273 -325239 323232 108234 -138869
12048 -282580 -130164 147460 276766 78808 -254202 9821 -40171 34751 198570 -185602
12037 253788 -143366 4273 -77979 77907 85874 -114719 -106256 -2314 -242690 -71967 169319
12025 -132934 221139 -134292 191247 -451924 39046 -76601 17668 242559 -144753 -71795
12014 10606 69661 -119056 -350694 -277331 -476974 234252 103748 -284513 181686 193210
12004 193210 173177 84933 131060 -126848 -217274 -15343 51836 -97151 -9064 -330259 -78406
11992 -279951 -56377 -133442 338190 80813 176692 240915 -206335 257382 -36008 34990 -127448
11980 156952 -191772 9149 -297137 98996 206434 398491 322151 5424 105283 82657 48376
11969 48376 -125054 -85839 106953 172176 237942 -346813 -13338 -28697 136917 -214561 125326
11957 -58545 -204601 -68488 364468 -156999 898 -122242 -20924 101135 -28702 145546 -89975
11945 61122 65070 323576 -258465 -185852 -93758 365525 184104 97425 228476 -244548 78005
11933 129510 5376 -71121 5234 38695 114707 -197350 -181913 153188 -115536 -144002 228782
11921 -1300 -63056 30562 147307 -52739 22079 16936 65228 -301191 209917 -246645 114280
11909 -8628 -86495 8171 70355 -150799 89491 -115154 93557 129155 133117 -280309 -4332 520335
11896 103954 -60145 3335 -97426 -9494 -318811 -30182 62077 -2489 14136 195010 9556 33334
11884 33334 77783 -157927 173611 -127545 65520 -142269 145375 117636 37109 -155979
11873 126878 -91373 163483 101759 -175138 -75568 -337915 89991 -80328 -111189 124381 -277960
11861 -315444 36435 -417825 -406314 -422693 -29573 87370 -86844 -197217 -25297 -274874 203121
11849 53484 335562 205228 -75117 85264 -118041 -3473 -26464 -265186 -57690 -156985 -206815
11838 -206815 30667 65656 -175309 25027 -146229 -3769 -88996 -143268 98385 -120828 14560
11826 -195232 -47012 -128202 -171324 -196517 -390662 -188014 76513 385827 -62966 246944 201
11814 39034 124262 129930 58130 43378 70555 54171 171430 -80176 372926 459514 8511 -96775
11801 -246504 -176957 -71882 -7321 241728 -57546 -94678 183029 124247 -399218 237914 43176
11789 -57064 91612 -32864 104248 -105820 200224 257723 -221942 -97851 258215 -163691
11778 -142131 -249755 -185930 61683 -235407 -257318 -96841 -120874 -112925 -22338 -9507 8755 -1095
11765 -301817 89213 -132884 -106311 -256407 -186255 21449 -171551 -5 -181703 83686 132186
11754 132186 143215 42820 138196 -220453 230127 -261417 -58958 180479 -502337 -110309
11743 87567 -3291 -101492 -12638 -155215 170622 -266184 -17061 -65737 59201 290312 231981
11732 231981 -82109 21176 -130578 315569 -292272 109063 255150 214941 -38300 34998
11721 -392082 27903 41493 11565 243124 166342 166900 56519 -161133 100370 -1159 28235
11709 432404 236257 -114900 255111 -70052 92965 -57454 127305 314102 73930 141268
11699 141268 74547 270742 40022 -371387 -42723 -203536 62457 290546 41028 -118683
11688 -294695 215040 58706 -157124 -70736 106657 366828 43857 -118704 254983 145073
11678 145073 199970 151864 139116 -47287 79614 -16581 -57959 -236503 135061 -25607 -117137
11667 -117137 132373 -35061 327843 -91008 -192922 149847 85524 -27503 20996 183355
11657 183355 -30748 206188 164245 -70784 -44975 172086 151094 245354 -34639 -40823 -203216
11646 -203216 -178362 142323 117519 -88142 -99038 -279828 -105610 255635 -183695 -193592 149314
11634 427193 359349 113133 -33560 189291 -74838 353173 -8887 137138 -200441 358934
11623 -233370 309122 -55460 -125453 281119 -68386 27923 293661 433998 -343804 -57905
11612 -222363 130560 164907 -126396 -113117 277698 -68412 229885 -64051 150213 301117
11602 301117 -200603 153845 181465 -35997 150341 70522 115198 -72190 -365203 135275
11591 273941 -106182 360077 -77633 131046 199327 174794 206901 -28592 -20663 157960 -26867
11579 46687 52998 -153768 -339855 -43033 57403 52503 211133 57541 11975 153531 208936
11568 208936 -5113 352920 105199 259366 -43085 -23785 -31941 104541 367550 202684 237870
11557 237870 22757 310348 264468 66945 234767 -123138 -260271 -139267 256336 238342
11547 238342 327524 -71052 432965 77016 88205 -16464 194396 304703 400907 -9295 -14685
11536 -14685 76002 -3050 106737 -20083 249288 206155 38226 96670 -337292 392447 331903
11525 331903 -8579 54220 24788 -139397 -34298 -478 -201189 68937 -27701 383571 556707
11514 556707 258326 200530 -65481 72166 131511 -36436 123922 -51217 80929 157520 281989
11503 281989 360062 147166 365955 -93024 -47933 -47039 -112427 111166 110625 105004 148321 720134
11491 720134 -117974 188941 118147 89499 401733 77424 275390 291914 172200 15181
11480 -24994 301509 60345 226037 302399 -66494 206013 108555 83375 219582 159725 105403
11469 105403 114510 354213 187959 255717 111808 114869 41661 232575 -83815 -20867 207916
11457 -51407 -125989 67343 -366767 231065 -24041 16568 8532 -68735 308333 -27750 -4995
11445 293745 179862 181429 580323 69579 -123530 -95612 -230588 167795 180857 -173642
11434 89857 5401 -116540 114668 423721 70779 24009 272349 -145266 -13252 -57323 -139088
11423 -139088 -109018 157472 184706 -66005 -92477 7277 -79024 -63690 -72698 141746 -305460
11411 101707 -67661 229971 50764 24911 -26221 240477 366519 -400998 492839 -363553
11400 -219953 101482 447251 330737 82663 191375 -98908 47328 -78143 -27561 -126178 -206590
11389 -206590 -35442 84947 -67125 -186176 -89762 -228039 97970 -219625 -32196 162488 233115
11378 233115 135664 -30091 298089 -136950 57941 225506 -117374 145558 238756 -116418
11367 167321 -172023 54625 -75225 -213858 10240 78562 -157787 99736 132315 252060 -182411
11355 -80481 -250667 113843 -110732 -6084 -105347 -110291 -129843 242287 15632 -188148 -61108
11343 233575 -36065 271240 -39765 -495697 31789 -129643 -20459 -43331 -64581 110912 121183
11332 121183 192560 92582 -183687 -167096 -171861 101702 -182307 72641 -94625 10800 57870
11321 57870 256994 -175888 5270 -60787 -278856 -234620 209516 -275911 15695 66660 87713
11310 87713 -110871 -6854 -391853 -128937 12974 -325590 -204329 87855 -153447 -199382 -81945
11298 129544 -52962 -2612 30058 78330 75233 -52764 -87512 -277526 -12186 -86193 -414249
11287 -414249 -34551 72166 -39462 -143856 18539 -277337 14740 21132 259884 -102160 91343
11275 15259 -203355 242574 -245299 130514 16013 -91264 -34604 -35289 -338284 -262214 -274095
11264 -274095 144767 35345 -215627 -278635 113780 -133832 -77991 -144590 26103 -11408 -112119
11253 -112119 -262726 -69113 -103971 -282595 -90163 407494 -283294 84564 178475 -244455
11242 -125834 117963 -61828 76746 -205933 369371 24958 -37996 45122 81709 451822 -372582
11230 -58238 198358 166350 101708 -179283 241807 93680 -1898 117553 -59252 -6970 125658
11218 70073 -276493 -24216 -393138 -48935 -180214 87467 -85317 -148108 -46509 -101299 -13736
11206 48376 79800 -153502 -214668 -58474 -118958 -179456 43180 -66870 -66128 -198231 -62477 2518
11193 186239 159051 -75556 -11784 209769 -390950 -159246 -75376 -239663 74066 44280 364
11181 87532 -219322 66960 -166815 -166846 58665 -429294 326338 -222646 -108118 69063 487156
11170 487156 -289597 159527 94863 10749 -71804 -133132 261655 -154321 12466 209032
11160 209032 -281591 93059 -43157 -349382 269982 281996 9386 117379 11706 237874 91525
11148 -110785 -142129 60779 -234533 34659 19305 136011 -27852 15936 -174553 62536 -90148
11136 303541 -148685 161026 275936 -148004 -296020 -112961 -194831 38639 106637 -132008
11125 197517 -101181 -37132 -131936 -98451 385340 397048 145886 34237 99041 -7112 19530
11113 137048 95477 -114467 157801 -121312 271360 91330 4717 6034 262149 283841 156256
11102 156256 129335 144986 -157135 106709 122566 69268 253454 129052 269490 205268
11092 205268 604662 28914 -148557 -222731 189336 248935 41576 288265 399006 141339
11081 446478 385058 157655 214538 96102 116277 299185 76701 419308 -147957 293145
11070 -123861 55953 347361 -51691 135767 335833 301954 453354 631032 440623 557352
11060 557352 480372 724154 509216 804943 474441 387986 717421 552555 772362 739352
11050 739352 469299 1148474 587842 555778 896195 614168 1023319 488964 675810 497354
11040 497354 954318 873239 399820 643890 818587 872102 581458 588664 706995 278706
11029 562053 502457 729229 615606 1022920 463285 611381 395832 231568 581211 710411
11019 710411 612371 407497 520346 380613 524674 639501 854283 617418 737624 715380
11009 715380 508240 800034 574265 443502 407796 965436 241099 635649 692676 567669
10999 567669 501629 816711 339136 901133 686096 588575 539207 773893 814630 546530
10989 546530 743720 431651 1115129 698784 1085705 1206934 1083963 702778 990207 1124481
10979 1124481 1180881 1283314 1716586 1693686 2033830 2234356 2357153 2495031 2245329 2833227
10969 2833227 1993961 2282555 2216811 2015077 1783657 1803319 1557257 1750228 1595948 1745513
10959 1745513 1914310 1691239 2107977 1907512 1619701 1737357 1239296 1309186 729290 877358
10949 877358 982218 534338 335226 515983 204721 385419 497850 360491 469532 23595
10938 518384 41410 488131 111915 -20042 293903 66790 335592 274263 77402 322191
10928 322191 -93933 327697 270504 204753 425773 393744 -187064 6367 -14901 33449 47569
10917 47569 -336987 303317 109545 -151025 -166330 256796 95744 111463 197740 19378 -102066
10905 81834 265763 14757 -241816 130660 83750 66616 166941 60489 65739 -283909 174843
10893 -68837 66777 134865 -30893 116345 -79797 187937 -212895 -36066 -38480 18339 340462
10882 340462 52412 12985 -232370 86330 -60008 205366 121848 -11404 -126023 -111985 -179467
10871 -179467 -278829 141599 44838 -85874 -42527 -215498 -185361 70525 32779 121371 -230057
10859 99084 -228369 5893 -119708 -108948 -154693 -83466 116559 44626 -380211 104935 320667
10848 320667 -168806 252859 346521 119928 -277169 181301 223353 -323593 -9872 -347432
10838 -347432 290202 -23722 110569 -156887 -82614 43283 -125397 77388 -220025 127096
10827 192092 -69055 20818 139751 -132722 79072 -26985 -175232 -68523 -98934 31549 -202771
10815 -75642 -563 155605 -124510 -166446 78571 76934 -118978 -355171 306609 170681 331184
10804 331184 260904 24791 -256916 -48304 -265042 138738 93310 69057 57324 -129068 15171
10792 -6620 35950 -501366 -207196 35113 -138738 -274299 -125068 16814 -13593 345140 -104660
10780 -243391 -5004 516635 125359 -59459 -104469 -2398 -154198 -110870 -221181 138400 -83407
10768 153892 -47801 37493 53277 -161029 -50594 -79408 61687 142273 49340 224298 245599
10757 245599 -176955 -96410 -144788 -302013 -147229 -78535 55686 -5682 -121083 114691 -9209
10745 -362371 -22232 6173 -17936 -117533 -190552 -126285 -46645 -7475 -99334 112047 -109961
10733 5545 -71953 -348197 211438 345574 215498 -94903 -199280 100438 -60123 -124656 -160230
10722 -160230 82187 -16778 -32354 122149 -52727 35175 118609 -77968 -81481 75371 285637
10711 285637 5022 -188351 -53044 13905 -167056 149723 123970 -74841 255042 -26660 -39931
10700 -39931 1162 -39435 -51030 -97908 -125598 54152 -188566 -58707 122967 -136709 -42095
10688 -126624 -30700 -35029 -135029 -64182 -163495 70187 79255 -135782 -87905 104534 -17737
10676 229991 32270 -77224 -179912 146285 34086 -126460 -49270 -239915 58631 188043
10666 188043 77192 -74518 9119 -67910 210337 67879 21766 -53197 48632 -285044 11770
10654 304909 4912 -19009 21829 -181565 -69671 9574 -117048 160835 4224 -176076 -69061
10642 -5463 -41998 -141522 121300 -3674 45872 -29228 9951 -273684 -95925 -484859 113216
10630 226710 -18707 -72048 -109570 163939 -175204 -251686 -93024 92296 -365575 51790 -190917
10618 -149594 -33935 149953 -92296 -130469 -2920 9649 121888 -198154 -5213 -85942 -97764
10607 -97764 -240302 24314 -76744 218234 72524 -166607 -338745 -108747 -36852 134764
10596 -34625 -199066 -171149 -86401 205668 207449 -171491 140602 -210125 -45325 233571 188283
10585 188283 309480 -292239 -102663 89692 130079 -50553 -72162 -233792 -22530 -326586
10575 -326586 100093 -80177 5445 220579 72844 -2468 -247736 -287949 94281 95573 208063
10564 208063 -121954 -87858 -38968 -13537 65767 -41010 -195568 -163290 -84511 40662 103492
10553 103492 -195704 -31380 -19436 -148745 -123801 146461 -302515 102677 -179261 -176168
10543 -176168 251867 233667 119770 -362518 94290 391387 16039 98327 128046 233570
10533 233570 -153787 74156 -366777 -11952 26048 -50241 -1123 267674 -119069 148865 -579241
10521 239875 -160565 -11529 -341088 17671 162185 -92871 -58249 176729 9014 14373 21862
10510 21862 152412 -10995 -35460 339300 -45167 -181721 270130 -74229 -3183 -258767 389957
10498 148619 157073 -184563 412002 -100646 198572 48814 3712 -174648 -176728 170356 219387
10487 219387 -10794 151935 -228481 -38565 302887 -141778 262010 225603 376596 535874
10477 535874 668 80370 -264920 305455 -148752 -247354 104375 -140157 -45218 49379 243360
10466 243360 -115462 -208139 -70178 -66411 -49880 423079 13446 -98403 -173099 -126477 -304238
10455 -304238 -233635 -26584 -256009 502 235970 -318518 -71139 90727 19503 -66538 47118
10443 111538 361521 -154409 192384 297831 -14825 143532 -293828 182701 -187483 101932
10432 21830 298914 -8759 -89066 -295884 -155052 22894 108012 95934 -28027 34249 164201
10421 164201 -112169 -85055 130564 -288615 -7431 165359 -7146 -271058 68152 -363597 -69468
10409 -255472 31165 36022 -242852 208482 28743 36317 236666 -210052 87321 -167444 -206279
10398 -206279 -2524 -216008 -42382 157411 13746 139911 111393 302356 92613 -81730 52120
10386 183352 204271 -109973 139277 230249 -20616 157570 157171 44258 93849 139862 49291
10374 130246 186690 211368 171361 25149 21360 152113 503922 490476 304179 650581 884011
10363 884011 409703 -147360 135336 93750 221679 95524 59489 56132 303907 405709
10353 405709 126020 394414 620095 126875 710591 191773 401519 253567 326236 291827
10343 291827 239551 250073 285767 529566 76113 -44665 188922 171245 245141 169762 476220
10332 476220 103734 179406 170528 361642 423613 -83007 -41405 105676 134076 27725 43725
10321 43725 346751 27613 -65360 141003 85736 20113 195808 178867 114722 511478 111545
10309 139402 -207317 48258 -39182 223995 156889 51083 33682 -24456 -61244 -204621 -124117
10298 -124117 -62523 -79369 -100323 34863 -54397 73510 -44628 -220329 -128386 -101844 68426
10286 259696 373277 -89162 139691 -63383 -459606 -28517 -217399 -25184 95120 -174287
10275 26395 367202 -227819 -143673 177059 74354 50759 175500 152139 109484 56588 2418
10263 299215 -125580 141376 26859 465300 207814 372526 300109 346995 473371 272658
10253 272658 180690 138771 58385 -115448 -231643 -85006 330158 -44824 231504 30007 165408
10242 165408 -158128 124783 166051 281748 3275 -167708 -139367 46284 -224168 -82057 109753
10230 85280 -165053 -274083 53362 35376 57797 -447273 -221471 81044 199485 -217104
10219 113844 -119982 -224852 -28593 -201736 -112064 -84273 -475836 -134320 2508 -340418
10208 -15697 -314876 -32182 -231157 58072 119241 -414246 165502 -100416 -173817 63459 168141
10197 168141 -182490 108766 69261 -116303 -323329 171404 61755 93894 87240 -339795
10186 27191 121454 -153816 -319 -50305 273453 -400000 196155 -75615 56734 14430 185289
10175 185289 -258446 1840 5712 -68274 -20134 -97712 -135141 -393037 -244650 223078 -279547
10163 -71268 -304617 41949 19518 -89649 -133394 -284646 -115523 -102689 -109439 150345 47666
10151 -134500 -262034 -108001 -183596 -229817 214083 274580 -12637 26203 104238 -230343 103020
10139 -323044 -456379 -31744 178010 -8376 -27447 -73022 -239255 -43567 -24188 46823 110305
10128 110305 182234 -205536 -232801 27645 -134507 61428 -136048 260269 -137196 46875
10117 -310552 -85147 23649 -131342 -19583 146100 -53358 63110 122612 -55747 195252 -79711
10105 -327974 -131320 -51689 -77097 -222536 -53964 191165 31418 -102957 -473037 301046
10094 102921 -115002 -208399 248752 -422600 -101923 117829 -74486 41141 -238974 -78569
10083 -285327 21447 -187323 -80879 117978 -72668 -333523 115036 -33533 -32952 -279182 -86572
10071 289777 -244382 -56323 -232731 198822 71170 -251441 -145950 97514 -153510 40307
10060 257727 225114 -14005 16719 -115068 -236713 50459 -147063 -135645 -261709 -9389 -235446
10049 -235446 -306866 46921 73924 -104852 -190126 43207 -146244 -99108 111009 -67931 -151972
10038 -151972 89253 248113 -71052 24463 46123 -85325 108519 -242458 93716 -286542 -15893
10026 38155 -426599 -364189 -47832 75627 -217816 -180536 81386 -260010 8984 -147944 204133
10014 -22247 -284383 -1397 175572 -145667 135925 337085 -126431 20885 -150745 -399030
10004 -399030 -54405 245757 -111528 -66593 -445486 -25985 301732 -281037 -113852 186621
9993 -211083 -269771 -9975 78573 -228207 133335 140561 -387430 -222423 -277220 -152813 132024
9981 -345021 44783 99229 -162624 55698 -109725 -255826 -417057 -215063 39614 -177937
9970 -104399 -164228 224557 -62502 -384113 -198765 225592 105085 -217641 -167098 219468
9959 46270 164297 29198 52186 -137048 -141206 -70645 -6799 -34541 -1853 326868 79240 -128814
9946 27597 304152 98396 -10855 141844 -60472 -83950 -240247 -217701 17929 -55094 -538242
9935 -538242 -61135 -143547 285596 126573 -187713 59469 57495 -389872 -50916 -166439 -355965
9924 -355965 -149263 -140728 -132949 89020 -69609 116671 -347610 -9586 4293 -218412 19373 63260
9912 63260 105900 -229104 -4978 -163939 -344058 -180453 -61700 -241510 -116723 -54903 -104680
9901 -104680 110122 255880 -278589 228001 -69616 -120351 40136 -152967 -3840 -153178 161149
9889 -65237 -187097 -150120 -67901 39126 -352864 -217423 -143972 -15976 52472 -83246 -36220
9877 102327 -73433 -285217 -326951 17349 123086 -53277 -61912 -296720 -515603 -40899 12256
9865 61167 149468 -127709 157868 -33410 47068 -349171 166612 52284 -134086 -21526 -286802
9854 -286802 -145180 171291 70983 228753 -98925 -207297 -400359 -208977 -90539 164455
9843 37164 -183122 30875 51723 -71888 -49969 -58646 107940 -21435 -209495 227676 40138
9831 -103651 -171223 -244616 177923 -164 -75708 -60033 133473 171458 -361698 -72396 273404
9819 -115576 106417 85972 -12592 -208672 47934 -426111 -163328 -46316 128312 -69436 -266632
9808 -266632 68051 313588 -148934 -120971 -186496 18570 -381498 -126600 69220 -337377 96717
9796 -83235 -64452 -232375 -91962 -30500 -308773 -87233 -73639 50623 119709 207257 -236753
9784 -166643 177290 -15914 -22461 119068 46906 -23497 47722 108369 -53172 150337 -232616
9772 -446891 82521 40304 -5513 -127655 225399 207905 -108431 -357123 -352470 -209634 -535014
9761 -535014 51869 183414 -19285 57220 -225201 -246707 -76479 113433 -201905 -133258 116316
9749 80006 -287144 167778 -480813 30708 -127839 134250 75434 -236105 -75491 -118626 205812
9737 142547 -35441 -111778 -189102 -162182 77097 -231457 -123702 -118357 -226606 -31848 31511
9725 -129900 7972 58968 -117451 70769 -104879 -27655 -109885 -88821 199760 -152910 -34117
9713 -119319 -177326 52171 -324058 -12017 -173489 111540 -144566 66928 77569 24575 88773
9702 88773 126673 -142510 2566 66073 -67844 -56081 -53387 -344514 94299 -235717 -44958 -259776
9690 -259776 78312 44237 -157362 -16043 -147899 -198128 250002 -188603 -67449 -268867 -115636
9678 -68790 44420 133166 137384 177326 195047 -62711 257450 -43592 45103 50653 -91137 318780
9665 50274 -63536 -40911 10605 -21152 -50997 -117579 -85410 4083 -260913 -596205 -110994
9653 61829 119654 302091 -341974 -203303 -70753 -51094 -342963 -16094 -81846 -15651 182315
9641 -130092 49243 -34147 -233599 -376538 400475 16365 16364 195597 -70924 95216 -308202
9629 101837 -34944 64424 38513 -58238 -360500 121847 -40175 -36055 40128 33921 -306922
9617 -126804 -228127 -172499 -203770 140064 128104 148143 -73012 34458 -232708 6489 175105
9606 175105 -182599 -5918 -45834 183835 -303775 -269786 220130 76209 191786 514 -12174
9594 -198155 8904 -290553 -175578 -332589 60486 -289032 -89394 -76399 116301 29797 -260114
9582 -7807 -63477 -210763 -157326 -2365 -316305 64875 -80111 -20711 38309 -200881 -229793 256033
9569 -136370 -392217 -43224 9455 29748 196337 -300506 51466 -192479 64416 21744 50801
9558 50801 -2839 28451 137227 -132782 -9934 -259627 -58315 139751 -248501 -38764 -99976
9547 -99976 51852 235124 -137209 36367 -345233 -33159 -19525 -314004 -99719 39178 63831
9536 63831 -110480 -203468 4919 -137800 -229230 464413 -190541 64655 -88934 5258 -201709
9524 5070 -324225 62014 -259458 181611 78408 16755 -458730 144619 -155101 -241145 -81392
9512 166872 -44254 -94362 -134534 -145034 7678 72804 119294 22928 -234844 138513 -510405
9500 -1812 80227 -15496 144163 -203712 -124915 -45355 -171849 136067 -153732 -55288 -104058
9489 -104058 138237 189785 -161817 221919 100227 61282 -81794 -43307 -62015 -297307 167753
9477 -218404 -92058 -237191 -212668 -85953 -17058 140632 151115 42742 -97275 -123615 -125640
9466 -125640 -192702 -179220 -7018 -109851 -158635 -55536 -231706 -35243 244919 -90747 -136237
9455 -136237 11002 -82265 -5271 -121097 -548189 -211140 183675 10321 -68133 86748 -219850
9443 136220 -297743 34085 -78623 27252 -135325 -313785 -172053 -35023 -133801 148799 -216306
9431 -66222 35821 -43411 -153280 -145062 -31351 -95188 -54108 -117539 -40897 64175 -173646 -292147
9419 -292147 -176338 17238 10384 -112801 -209558 -331701 -143808 -89992 -142503 34751 -109036
9407 -208078 123622 21047 -138393 15958 -320171 -125645 -5570 -150694 -293954 20505 -208164
9395 129533 -83279 39096 307148 -397438 -121803 46929 -133516 -45643 -31190 -184311 -315454
9384 -315454 -217469 -203055 -375260 -190862 -174272 -92250 147752 -86883 -64512 -175278 -36639
9372 -320730 161219 -288478 122078 175402 -261808 79214 -95258 -175974 -72932 191505 94778
9360 -108544 -86779 -187804 152026 -35887 -209716 194208 120366 94598 -242114 55933 175835
9349 175835 49591 -317334 55221 -458778 64385 -62455 463392 -247835 -45033 -159777 81417
9337 -400506 -134462 22140 -234703 24295 88474 -73219 -172733 -112969 -163170 -65985 77469
9325 -150475 122869 4187 516343 -16069 24382 13903 153419 118326 84737 46197 -37914
9313 -232922 91999 -75027 -75145 168189 273925 102396 130018 197349 52467 -64937 -22338
9301 -11079 129451 85360 -57451 -15280 37375 -313692 6353 -316434 -86743 -78535 6158 -17637
9288 -306643 35936 -1182 -173136 7234 84120 25485 3104 20344 -37330 -250820 132392 -6674
9275 138159 -132922 -340110 -231077 -154404 335051 -158620 -119565 -66532 99319 -163789
9264 -139902 -114971 131287 -257834 -159578 80898 139714 -54829 -107991 -171036 57968 -170009
9252 145040 57736 -267975 -127033 -56522 66779 -209058 -116252 -33037 -4260 58348 -3282
9240 52457 26407 161389 -234504 -153899 -251661 -92689 -193985 -35040 124639 -33196 -238188
9229 -238188 -134754 -261686 134519 3380 91771 -278215 -118461 22699 -38352 -111042 373752
9217 -110457 98308 -276656 -38222 -29294 53192 91399 14313 9789 205712 -164153 32121
9205 -41500 13645 44380 13878 -296676 -171563 266231 -245946 -87451 -332805 -128777 -67296
9194 -67296 -185966 36260 -38519 8451 -317145 433901 -40149 -80913 -54751 -39980 -277744
9183 -277744 -33395 -448901 -193884 90508 -321318 219395 62583 -41771 138408 -236348
9172 -266403 -90683 126858 9877 80629 -65464 -205580 12707 -112531 -363985 -363475 43190
9160 -213900 71360 -31633 -160981 -68852 -97037 -183381 138079 13701 479511 148265 -184541
9148 -110976 136714 -174082 -121244 -268134 54261 160743 215635 -282711 25128 -454894
9137 -23080 -221964 111720 -218190 -243331 -397 -116591 -23230 34027 -39034 -211157 69192
9125 -178079 -305215 -138841 -267554 200783 178282 -41273 13435 -145976 31404 -43114 -322432
9114 -322432 48233 95699 116216 -26910 -31991 81816 64985 -411993 -122210 276008 -144505
9102 46865 -13116 -36355 -84083 24849 111495 -247467 -157745 -163390 -57804 -146829 24781 -10325
9089 -185469 -164400 -241176 -138899 121628 -129798 -361929 -297671 -40412 -46005 -283277 -247147
9078 -247147 -60027 -113286 250553 -174597 -54540 31899 -99680 -182710 -224718 151067 -125948
9066 28739 64089 -269054 -332693 177771 -183056 273117 -136644 -263270 -229926 55744 -32174
9054 97159 155270 2176 -6185 32976 -148810 -259236 48893 51651 -199330 -365600 108008
9042 -179536 -70588 153276 -31442 -17573 121973 174638 61608 -478115 -107581 -118425 -180299
9031 -180299 -294040 -201810 133855 101212 -98924 -21041 -136752 -106466 79190 -156452 563562
9019 200550 -39376 -285591 40720 100436 -25634 2489 -121741 56491 -214245 -220129 -48521
9007 -106623 -305252 -77822 69817 -53817 -66387 -339295 170714 -139923 -70950 -210674 -275965
8996 -275965 27404 8254 -249536 -372935 -158978 -32166 143378 -117922 -383455 169032
8985 -251670 -72293 -365239 63681 19111 -165311 -22510 -379548 -125946 -218936 98386 -230377
8973 -242014 -262756 -177742 -65196 353494 -128707 -333155 48344 -176261 -133258 -113327 -325187
8962 -325187 -24210 -60690 282525 -118276 -351179 -161488 -76113 -9167 -20156 48376 -164980
8950 -162265 -49886 53240 -92444 -77152 -270000 -74511 -73618 -36957 404765 20411 51303 -15697
8937 -203318 -39974 185779 -61021 213658 230346 -103809 283402 83182 -39219 153446 -18344
8925 314900 350043 863370 2465515 9939489 8470492 4622629 1689072 422315 561910
8916 561910 118232 -5776 76819 181553 -31459 259928 -241689 237715 18978 -142348 -265497
8905 -265497 40936 -138819 -25417 118572 64206 -143905 169134 229939 9916 -284628 -37912
8893 51997 284111 3244 -365303 -180190 -195308 372039 -55792 -196944 -57959 21286 -221182
8881 66541 108584 -199776 176436 -430809 -92047 -461244 -215886 -235802 -18730 -244764 135187
8869 -246287 -10277 -67704 -38534 -221502 83998 58255 -34828 -58117 -231402 46464 -30878
8857 -245729 -146700 -263056 20980 -220026 124677 -190219 39776 156131 -235620 -140912
8847 -140912 63830 -23423 -200588 -116125 -270603 -189201 45367 -118870 -341992 -269686 -171090
8836 -171090 428130 -114319 5225 -96793 2030 -32485 -114763 -204421 147134 -16125 176931
8824 -206401 224123 46927 306113 187119 -214198 -228066 183539 -244925 239407 -14408
8813 -215909 -198011 -27230 92785 79692 -171781 30646 -154382 -41567 -112562 -224041 -242141
8802 -242141 75115 342384 -54658 -201180 -267271 -90627 -177652 -249398 -123018 -102711 -152165
8791 -152165 50577 98355 -556371 122774 12930 -272075 185654 125547 64856 -128327 -146815
8780 -146815 35532 110147 -137050 -86579 104531 -83523 -391152 20741 -202527 70038 -53505
8768 -118882 -129189 18278 -145973 -83412 5271 -74622 99034 198798 -187210 183804 133585
8757 133585 185631 26856 139538 -58631 178795 85859 -20534 -51450 -36077 54070 29986
8746 29986 -189053 -135956 -210979 -99664 264605 -95262 339361 -113260 126185 -198059 247244
8734 -298114 -90326 -29466 229386 -157328 -149541 191690 98010 117823 16951 -49735 -185100
8723 -185100 -250375 -17119 -5295 191843 -104204 -64324 -140103 -114002 -258470 206316 158951
8712 158951 150281 -311917 -44362 142001 -50034 -375458 42014 -89788 114646 -228103 70159
8700 74141 59477 64945 -95202 217203 -271452 265213 83728 155023 -179031 5367 179544
8689 179544 -96105 -64327 -49249 -157832 -47570 316683 508466 -127739 -551364 264343
8678 81890 -230871 -303385 113163 -463424 -186994 -122560 228560 -37141 -147250 46885 -228722
8666 -396221 142928 -179784 338183 272366 -161354 -262569 -100582 -153044 56 172367 144524
8655 144524 -160745 317919 -109838 41866 73565 278399 234217 -247993 96200 158287 -159857
8643 -174663 -135319 -168328 -37266 1022 -213857 -324078 -345534 108659 -186658 64877 132716
8632 132716 -20876 136978 264653 184374 53817 35643 -219105 -151195 206415 -43483 -368971
8621 -368971 -206466 -107290 -189272 -147659 -71634 65465 -329539 -69485 152024 -308464 -238311
8610 -238311 -7525 -439601 -41335 -49685 124422 33428 -73697 -89139 -70482 -86610 -426232
8599 -426232 6063 -155122 -298518 -404322 -55856 -203964 -186847 -7151 -143682 -70448 29298
8587 26775 -70825 101549 -131440 -3686 -335886 30884 5401 -46096 -319131 -83741 36174
8575 -131547 74881 71958 -50272 -341772 -113624 115523 -7312 -321011 171557 -230854 18766
8563 -366625 -3419 -21044 167140 -12504 -168098 -10888 -67484 -130642 -213456 -314274 -45746
8551 -60817 -89824 21712 92241 -119170 -316367 101287 6591 141634 -228805 104607 139591
8540 139591 238128 292943 -156099 -236661 -122941 63927 -184285 -209616 12693 65476 -30890
8528 -90186 -119258 407847 93404 -13525 366760 -13365 15751 -223779 10429 173327 166697
8517 166697 39660 55656 -78756 103814 -93706 -142455 108352 80297 280655 -39033 23524
8505 245949 -85883 63525 -249335 94013 47002 -84990 -2736 -38543 159348 -87628 -56241
8494 -56241 -45750 -280749 -77778 112439 -53162 -143537 -209749 -199968 -147544 -23727 -160803
8483 -160803 -116293 -128910 -121133 92109 -69990 -244546 -171150 -241906 304264 -154505 -88735
8472 -88735 485193 58697 110729 244375 -314116 -193831 -183934 -78794 200753 73318 255837
8461 255837 237817 -91847 -180438 -178171 -103583 49567 -94340 -288599 -267508 -266192 40852 -41962
8448 -103524 -53820 -185376 -249847 -42043 -187192 40234 -34063 -372089 -417027 372318 214378
8437 214378 97238 128357 -125657 -11306 -195574 -38009 99189 -240651 717 -238902 265236
8425 177124 -136417 -59420 -14975 -332779 -135087 217736 -99451 -327448 160381 -38507
8414 -149485 -8665 13593 -10553 9041 -106359 -257668 283592 172770 -37344 -30230 -69788
8403 -69788 34515 184905 81346 197008 121700 93017 -298271 -42243 321810 -193336 -30173
8391 -246373 -193625 5120 -215362 158751 176266 -107016 -106635 40983 -4263 -171675 18546 150034
8379 150034 93611 12010 -58783 -122430 4601 -126095 450240 -220537 22296 233043 -33753
8367 46285 -98898 -150293 206086 7161 -95900 388585 -131576 -36630 -107147 56831 -363147
8355 -101086 7708 -193808 22778 -143704 -1366 46176 -25933 40121 -59910 19143 7025 -103517
8342 11844 -128465 -151001 49750 58498 -198658 93497 -35633 -179457 -71397 -1011 -98664 -71796
8330 -71796 -27757 -138128 -133545 -62301 58503 139956 -10963 -58526 -64085 25568 185509 94835
8318 94835 -26163 -125213 217644 77060 -278477 80786 -156458 53928 -172281 -33838 158638
8306 165146 11455 -254320 -62762 236426 -151532 174970 -253692 -145806 -563337 106785
8295 -539882 -20920 246573 31177 -258673 166694 156301 -17467 -178200 -187287 -230319 -65131
8283 -23301 -12009 -244894 -49528 -152401 -226047 -108670 70216 -293928 -444373 -12534 -127634
8272 -127634 -40371 196892 -254463 -75311 242077 -169516 70476 49848 39600 -171912 -82672
8260 207323 11504 85579 -194543 -242674 -104149 -202329 84853 -6256 -134592 -293939 -182938
8249 -182938 283 -22729 -166406 47566 -67285 64657 263852 -199160 -127879 -143748 55514
8237 -509396 108386 -118808 368446 109654 -218217 210043 31371 -278107 -119746 49835
8226 145651 316573 -177169 4813 -118228 32999 88129 -163896 -303121 -127821 -9849 332284
8214 -68395 215832 -267436 228986 98111 108311 9932 -141521 -64223 -192587 -344267 70667
8202 -326319 663 295087 77272 -28442 424795 -175606 31753 -336352 -57111 -97945 167904
8190 -201110 -440857 -507528 -37424 181115 -180504 -15723 129603 -195710 -372243 40921
8179 279675 -6772 160311 -100971 -89620 -137978 -558866 106385 -72673 -37410 -233101 -257139
8168 -257139 -259693 -174851 789 49640 -18741 22395 111442 24046 -102065 -192240 41399 63700
8156 63700 -86520 196620 75927 41300 -44077 54815 107803 -251574 60306 -35909 -23275
8145 -23275 124400 -68978 16059 135637 -54466 71201 391221 191143 -122750 -71895 -211060
8134 -211060 29284 -19558 12748 543993 132985 90205 156140 -125643 -268599 -67815 176160
8122 239416 -85266 -258500 -117187 16348 96818 -299461 -6158 -692506 58129 230357 203576
8111 203576 209844 -374055 -128673 9455 80086 120238 124535 -320635 -284865 3455 -46182 -217953
8099 -217953 -107433 -77490 -267231 -313209 -119299 77601 -74427 -95370 -217039 -200224 -72829
8087 -58053 241049 -65560 28228 -109654 24953 -369727 -352578 -497060 -210395 -60745 -139220
8076 -139220 313309 175384 32437 -67005 -150678 183595 -66510 -359081 -262700 -243298 45998
8064 352827 -243173 50035 -53799 -97074 -130232 -71287 -118035 70443 -297372 -19863 21218
8052 -83418 -4779 169647 -10841 -163613 -364905 -190247 -498432 -174206 -118455 -35011 7249
8040 -274388 -13932 126015 -80729 20521 150572 -327540 -75603 67349 -261375 -33488 -64531
8029 -64531 60127 -225220 -194167 379716 35808 -8695 -106738 212567 81951 -204069 121063
8017 106089 -213005 120184 95794 86499 136482 140459 119668 14472 -119729 -107127 122860
8005 197879 -83303 -314022 -102280 15540 46732 -218186 -441049 -98437 116049 182323 -135339
7993 -184189 46267 138891 -30892 249014 -399045 -224060 111888 -23709 39553 -56828 115943
7981 35361 120424 -19379 50707 291243 -108621 -215818 117325 120127 13987 10417 136261
7970 136261 125457 134541 114695 -303368 115303 59172 197710 -109629 41896 48646 34551
7959 34551 -310041 -7509 -24127 -11770 -91673 231042 148495 -305153 -61396 -161138 -14792
7947 176449 68938 25420 -93900 -8010 -245879 -150742 -124161 -44951 -140086 228090 -211591
7935 114098 -391259 -258087 -113939 -24159 -131580 -88490 100063 -1025 -226895 143092
7924 -420093 10458 11716 -207210 -63928 336233 -343247 -108616 134986 47081 -105231 53237
7912 -34924 -243247 -154933 -138492 -60509 1456 -122002 202677 106734 -46562 296176 131606
7900 -273831 2804 129323 -180735 28357 -233344 20397 -63114 113589 -7363 209864 56596
7888 -108878 -249128 -170555 -111675 90414 255769 -66124 125210 -10440 14850 -153971 325378
7876 -304770 -199498 86961 -554124 -253701 -115369 191001 -224793 163866 -84176 -187108
7866 -187108 24509 -221677 -152496 -111662 -429838 -367452 70357 -149453 -227874 -230374 -13640
7854 27219 -44422 -36985 219409 -144803 37032 -2721 -212626 -56644 -160459 -10410 123196
7842 -151499 8531 -63714 129941 -61505 -290987 402209 -347393 93845 -47919 -346385 -449750
7831 -449750 16989 2365 -1667 304283 -131792 16905 -13157 -217559 239286 -245461 -174757
7820 -174757 -106831 -42917 -126391 47911 191307 2508 -372531 49097 181306 -52922 130172
7808 278138 -253848 -83560 -13440 -80921 100350 124007 16328 -179484 145759 -266341 135260
7796 -47781 -23247 -244825 128332 -41165 -28799 -3504 20263 -72326 -202558 344318 257129
7785 257129 27883 -108473 -251824 -145535 -248907 35083 96396 -40934 63010 -58925 -124058
7774 -124058 11979 -365909 -10134 19635 414314 -133221 -171975 -98416 -145013 13190 51655
7763 51655 -235696 150920 -244878 137103 991 72533 13703 -216018 25805 10517 -24540
7751 -213562 -190356 -324662 114653 -17231 -417292 -213581 -113717 54685 -32667 -153963 98955
7739 -11227 52274 -81947 -97030 -210848 137378 259185 -38954 33601 -243588 -210354 141692
7727 -103641 -237015 -184716 -13106 -76329 -220949 -46764 -228688 70404 -227870 135961 -165149
7715 -118458 -90865 -106958 260763 48140 -19831 -7852 -79384 155179 282293 -217351 105003
7703 245495 -74519 -24076 -68614 149348 133751 112397 115642 68936 -162595 -176939 -125249
7692 -125249 5320 129600 -10155 -282250 66267 32036 -439987 235975 131475 -2284 -56744
7681 -56744 205083 -298328 -97952 -171373 -218215 -241796 573214 -271830 179312 31090 132384
7670 132384 -364170 -184347 -73114 -34382 -30691 -107569 -66456 167316 82104 12559 -190613
7658 -81586 231436 -103055 -11996 -122621 -54019 -289184 -186619 24422 31808 90233 -90917
7646 -466106 -217136 48593 -233785 -115226 -374420 -73029 137712 84610 178292 -123066
7635 109492 75165 -302745 118998 -206220 114631 16719 -9991 -55416 114827 -424096 -8629
7623 -128877 -50456 -102375 82783 -161151 61556 -173908 86116 -284957 73518 -390124 -156110
7611 -231781 45639 -34482 317169 299904 -162770 -277448 -156374 215818 -228488 50356
7600 -465143 -259499 -34796 -91736 290901 150417 198066 -270707 43002 16652 137743 -73445
7588 32921 77549 257695 31832 -50331 -29068 -246893 135103 22702 -29799 -60228 281723
7576 -348167 -147679 -104981 86474 178966 -135473 -182227 -200555 -23122 12453 232064 -129167
7564 -218187 127573 -83734 -105129 -300332 75536 -130104 265555 -176079 63067 -277804
7553 -75552 -142615 -201605 -306587 -189850 198718 118863 -144345 -39742 305924 200846 154428
7542 154428 315324 -119497 -426243 -241199 -195962 261969 -44446 -18006 157670 -133448
7531 111712 143774 -93999 92743 177287 39850 -101232 -42406 252950 -29584 120416 -1685
7519 -133034 242128 -86612 -55626 25147 272579 191315 -153909 -26025 268402 -22602 -91805
7508 -91805 321644 -72839 -80945 71054 -112238 -182100 24302 -185379 200600 285373 9682
7496 184976 -433098 -56001 196290 -145536 111139 240137 109122 73808 -67331 421867
7485 -42090 -16830 -182284 -119219 174879 -96309 102091 74659 -55380 23889 74009 -27055
7473 -170173 302368 -213937 -193099 372297 160760 -303263 122620 290819 -205438 -28670
7462 138895 137004 -96282 63740 -128249 -233182 -322463 -266834 58187 -114863 203355 117413
7451 117413 -168508 -206374 -90238 -261194 -309429 38388 146728 -10736 -77601 -148937 -204935
7440 -204935 293077 -84940 104912 -150536 -376067 69540 126594 -202571 -61778 -77776 -163780
7429 -163780 -3199 -143141 -118229 -32305 22966 -282557 -41866 -120613 76104 -78728 -157645
7418 -157645 -106506 -366757 486875 102262 -21525 200077 -182059 -212271 -120760 -31887 -211988
7407 -211988 -188553 -28866 90869 -158795 -104508 108319 108053 -30957 -45776 15714 24331 196038
7395 196038 56714 82293 48773 -2526 8716 -235868 186952 -445703 -320650 -161789 77577
7383 -8767 -145354 68913 -209638 -188301 -49100 -148298 -181481 203299 118997 -71366 -61238
7372 -61238 -182733 -154739 112602 -196526 -184080 -177972 -35947 -107357 25825 47977 -132150
7360 -151965 5565 342862 -324836 -215082 -129551 -158940 -386728 142343 32432 35345 54213
7349 54213 31068 -203987 -92651 -10881 -207275 -113151 -44664 158055 -29084 60263 319686
7338 319686 -85883 181038 -195622 -32930 60101 -29256 62291 -101812 -116307 189958 -25070
7326 -186354 -106972 -96599 -296268 17399 107062 55897 -122225 57789 36337 -26099 -36233
7315 -36233 77299 290327 274213 86850 185769 6952 -43259 -173570 -287637 -22245 151816
7303 362430 -73462 147602 -56148 62919 -311680 -407638 -175258 -8575 144033 -26269 254585
7291 252446 -144804 -88284 29628 -141842 -442013 107010 -127395 -343107 -343413 178930 131546
7280 131546 -152617 -307771 154264 -317553 54138 -509226 -179160 -163178 -23970 -189309
7270 -189309 47447 332967 -169508 -291098 -248011 24369 -276751 46621 72681 52673 -145465
7258 -624420 1559 202288 34747 78860 -112647 309902 -26760 49712 -209942 35427 -6087
7246 -21071 37330 -46224 -194898 102484 396998 203542 225982 139710 83012 -96775 -267646
7235 -267646 -420481 47614 -19113 -57023 75022 120553 -271192 -97312 -28946 142181 193837
7224 193837 182442 59071 -154149 -29911 -60031 193168 -35024 -69619 -110058 -134993 -341536
7213 -341536 -140583 69181 -6356 160550 32926 146721 -48782 236870 -150855 118563 332987
7202 332987 135461 -72159 115030 110866 -192491 131282 -10568 94633 75009 -446596 -1084
7190 192591 -219341 -269623 -107514 -101379 9523 -22837 -147245 -159413 131803 -200313 39476
7178 -194488 291701 4885 292428 77264 83708 211542 113450 180727 172860 49806 -351394
7166 -95064 -56385 -11648 -55178 -139110 -112750 -146870 12154 -61745 133373 -2024 -130410 23246
7153 71617 225266 281932 -163396 -5674 -58488 208918 31848 68700 94574 133266 75512
7142 75512 90454 165705 4714 -148604 -184054 53345 -13030 -126066 -2500 252782 65108 9990
7129 124217 -221129 -225919 70316 -292367 179604 -170090 -24738 -113225 -57466 -142376 113669
7117 -208249 9672 -197818 -8953 71494 108596 -29570 -32632 -4553 252240 -295231 -177809 63800
7104 -199969 -31544 -84193 -100738 -183816 1080 -5553 -153991 -136438 -154584 58708 -215304 229385
7091 25677 -19967 -195052 -87785 -60986 -54626 -194611 -70478 -47966 -148121 321003 -4710
7079 586136 -20467 135245 -208652 -71081 263457 -364428 -299935 983 -146987 120319 -2459
7067 24263 -323967 38989 47696 -11737 118065 -57942 -154661 -135525 -270781 37396 -253525
7055 -242421 -430470 -10132 -170228 -354277 -19783 231277 -350254 -16832 -3480 202767 -98840
7043 -117630 -121008 -166046 -259369 -171030 54182 34223 82285 -130159 51139 191640 -29499
7031 -324178 -162717 -142738 63360 121400 -272811 21197 -28193 -111643 -7463 -271282 -4406
7019 -72702 -183636 -245105 -133927 -86920 212412 -359871 -234727 72808 -39939 243352 -53261
7007 -54053 129920 -111768 98155 59163 -43728 -248670 -66540 61347 -16146 -68838 78818
6995 113408 -94644 -85192 -131871 99315 -50366 313822 14361 15720 -114397 -55916 1536 123405
6983 123405 121203 -81448 235412 -78766 -196668 53893 98621 -244073 -89867 218941 39545
6971 155007 -146766 -12888 -81273 -53712 129440 -179649 -15215 219768 -167769 131707
6960 -364551 -95610 -131152 -399171 66723 208741 17818 52701 -107060 4185 30531 -20008
6948 -67022 -106734 -130960 203661 -86398 -231476 263268 41707 263960 -62428 175297 141826
6937 141826 -69359 -113087 -169147 -188958 -15877 -78379 -165320 -212214 117745 -269800 130195
6925 258252 -168695 129390 114921 -109932 -27489 279007 -158726 110752 77457 -229841
6914 70152 121759 -110440 -129227 121299 158283 253448 -144240 -27979 176244 -313362 -59598
6902 115449 -103496 410805 45876 -52273 15208 -59204 -227269 -461696 -93247 218959 128300
6891 128300 -158832 -98082 14224 -78807 -101583 73932 79347 -173131 144615 -61262 -131413
6880 -131413 186796 -318652 -175122 56068 104869 52731 -362041 -652818 -273457 180204
6869 -89156 -9026 -110521 97993 -165345 322266 -427804 -137149 -17969 -152464 -11939 82759
6857 170369 151146 73243 -71150 -296587 -1371 -96681 21463 -125678 -189831 -49071 -300171
6846 -300171 -30927 -38994 -45180 81868 143671 -102526 -149122 112988 98351 -232914 -90973
6834 250155 36656 97169 13890 137395 -321407 15091 -263786 18043 -92139 83678 182304
6823 182304 -162868 -269147 30404 299689 401467 -99682 -317522 201243 -92188 166904
6812 -121673 97645 24110 95491 -15504 118785 -41343 97250 -218101 22837 -479628 20055
6800 185581 -19551 -196929 227781 -106301 238026 -317246 -62106 79706 -131219 180156
6789 -58084 45398 -204997 182023 -190057 40026 270993 34569 -256659 -217257 -141126 42536
6777 36222 -257271 -146984 189145 187165 -37230 -121541 170583 -15172 -28865 36936 21607
6766 21607 -82603 53242 -189497 -285262 -92150 58249 -249758 -12561 -152866 162870 -227436
6754 146297 -161952 -5372 256938 -142463 -28686 -93163 246810 69820 390787 -58284 166840
6742 178159 -77596 153325 125083 6013 -124756 38422 -20870 -74847 -138710 -81862 155734
6730 -141548 22207 51645 26066 255878 25532 -139052 188929 27822 173965 559054 -102698
6718 -33218 143749 391175 24715 -85261 -1682 161028 -113970 -35440 -211198 -70567 268444
6706 -110181 -89013 180641 -205439 67786 100772 112780 7884 -12905 167190 282479 -250998
6694 -296247 139963 140213 -67655 -213562 -172469 -311280 -158992 150074 -32849 9225 232844
6683 232844 -53648 49632 121873 -17259 -139991 14070 50562 -18199 -24881 -27399 53152 47147
6671 47147 -248677 -557472 -300636 -268301 187912 -157080 292870 445165 -114966 -332919
6661 -332919 -22681 111552 -302840 132265 -210681 -160673 -114881 243198 24323 -35985 196917
6649 19000 -277044 -344499 -92900 48502 104313 -235895 -69258 -32235 32426 89337 52820
6638 52820 42971 -205458 62876 -263601 67780 91495 -21574 -208143 165179 -41183 203960
6626 -137728 -126586 -86829 -44839 -165874 61154 -144903 211214 -222640 105495 30359 126924
6615 126924 -182296 -93055 31592 -100497 -586560 -961 -397813 -141835 76839 -112676 -107424
6604 -107424 65554 11197 -90935 -79254 315281 -87575 77345 110296 83474 19889 173958
6593 173958 -76029 -53544 242987 89056 -178031 34855 -158504 -398884 84150 202610 -94247
6581 312385 -89190 -132413 -328109 93121 -75651 -278144 -63661 -326673 -254619 13599 -340067
6569 -134057 54361 72487 -112475 -65906 -116070 84024 -76350 -60416 55047 -190517 -469320
6558 -469320 75579 -205867 155361 99888 -3997 39952 59447 -320850 45078 173930 248279
6547 248279 -123206 -223724 13909 -180237 -123475 274588 -8030 -195920 -252517 382162 -133728
6535 -52281 -47920 -32492 140160 133045 211878 156146 250913 295793 -107014 9307 103994 -212252
6522 155622 -209396 90121 -139314 129045 22240 -216367 299982 120262 -291338 -107652
6511 -132236 -127142 209094 -57677 -147215 91494 104912 -19363 -90584 47954 213623 -75852
6499 325160 162558 -31586 227689 -288939 36240 56717 -136942 230845 -205211 -77251
6488 -176638 -1567 43052 -63063 -228183 -306473 -4690 19199 570145 -29573 -79423 -123373 68103
6475 -182453 259967 22050 -15907 -66456 300654 186559 -108628 102500 -278088 -73548
6464 -286173 -180601 73209 291827 -42365 -14009 93979 -40738 107052 -132837 -117777 -283948
6453 -283948 -59281 -378710 -150755 -78534 -330630 -98711 -61095 -354852 -211990 -150473 -2240
6441 57516 57194 -151295 -63821 -194188 161464 -291650 -51637 187617 138445 -346236 -67911
6429 -63649 252107 125951 37646 157065 174830 100613 42552 77493 145660 -123349 -97726
6418 -97726 188165 -192379 121008 9380 -16760 134268 163037 71369 87123 -172260 -207386
6407 -207386 -291012 -236769 -234630 -272253 -278192 -99139 335318 -192513 -276970 -101742 -89777
6396 -89777 144006 -327638 -131699 -261867 -31966 65944 42317 -185426 221154 304112 3386
6384 49665 63706 -82564 157695 165518 226773 -81236 -198296 35951 -43167 6125 -51107 -195824
6372 -195824 -346984 296103 256787 71805 190540 -70512 -207243 -120480 -147413 -114386 415
6360 -270193 -260414 -53947 -58689 -77233 243611 143075 -131344 207354 -158575 -157294 -386305
6349 -386305 75725 -173 425355 -42198 243163 9415 -183149 63972 8968 71069 -239799 209861
6336 -265938 86222 193700 -263129 200460 -257038 33989 -85013 -157887 25389 -17334 -86150
6325 -86150 173629 -127546 -30510 -37404 211414 -267 61486 -96996 10201 -45767 66976 211511
6313 211511 -23118 50940 171942 -140220 119005 -119635 11893 -213083 469859 -226920
6302 -86813 -63360 -156038 393341 -175645 -28637 -113978 144214 43282 114545 74657 61982
6291 61982 -13527 57743 -91239 132908 300053 -292612 57947 121815 107322 73543 -34477
6279 39427 -11536 -212979 200080 149601 40455 249703 52248 -61732 146255 -118813 223252
6267 -71245 22885 -159808 -19313 -69611 33421 -176494 -261981 25492 81501 -218426 -245944
6256 -245944 -69233 329288 100371 146985 -262365 -80733 201377 41254 152542 285320
6246 285320 40606 545755 -83922 62593 -14484 21064 -32326 -6356 242555 -33343 -117200
6235 -117200 222639 44743 -321756 71543 -34336 -258679 92777 111129 -426750 -54358 -165044
6224 -165044 211998 -158728 70059 243346 42436 -255924 -32885 -63471 -34146 119224 -237864
6212 36421 -46892 -219190 150842 -213881 160829 -127468 195036 -186479 -175285 -136041
6202 -136041 -104463 -342770 -260347 -317556 27521 -279851 -217278 212699 -322808 26183 -18481
6190 228865 -112132 157488 -191176 179259 35283 -159484 -67388 67518 44977 -369412
6179 90151 -91964 116042 -80107 -60534 -320365 42782 316920 154720 -142937 -284375 -185598
6168 -185598 -82923 -40007 -231770 -22378 -41381 -263263 9299 -261067 204218 127067 -9688
6156 -72204 49252 21832 204604 53940 -179245 158540 92873 61558 -59249 -3469 -24933
6145 -24933 -96763 324870 -165030 -39217 -135100 -197478 -272662 146095 -116089 189232 174747
6134 174747 -483771 -93620 11657 -326781 -55489 -184045 21121 32970 283113 -194972 56096
6122 -19704 171952 -83685 110848 -134195 -44606 -93515 150681 -62183 -32110 118747 35287
6110 -177226 171466 -147645 -54937 -152012 132712 -171253 -58187 -223170 -54849 -176071
6100 -176071 12102 9825 -193300 50510 -63821 51211 -172471 -52101 -268090 -212059 -49502
6088 -270931 23217 14718 108779 -213506 56709 78127 289393 -167619 -62102 -164362 -36672
6076 3186 -77701 195446 -367640 -156960 -188957 16796 36534 -154731 -20295 -24573 188928
6064 128299 151668 141553 240863 218983 110984 120330 -149552 107456 -266172 297952 223524
6053 223524 203866 -125358 -51455 -272740 65859 309864 80249 29960 -99735 -104660 -71476
6042 -71476 1522 183074 -244394 23556 113721 81122 -84063 45734 111484 -23458 -152571
6031 -152571 -37221 -228887 -378888 25500 56038 291369 -160208 -256118 -154597 -145504 -102780
6020 -102780 -9672 33520 142107 42807 298026 160284 -132858 -31123 -48299 152535 16844
6008 -348144 67949 299330 -137582 -184319 -242993 -68532 -132368 -5703 252389 -57839 -172814
5997 -172814 92197 -123688 326425 -126702 -68323 -75779 105725 -26035 159041 279397 -17227
5985 112710 97499 123401 -90303 -65762 -23908 9168 179731 -223341 209145 -168107 136002
5973 -61553 -70624 -33207 126659 131211 -299 -31152 82440 -117759 96774 238131 82005 69955
5961 69955 121400 -417714 -120089 -294349 -348751 572352 -41735 -175494 403631 4001 -261809
5949 108241 -265642 316637 -90142 -597162 -147301 -46798 -64829 -117264 -247163 107469
5938 -5042 -178887 -115034 -111982 299994 -234228 85191 92127 26237 54131 379754 60040 -157219
5925 -55274 167046 -173568 -252543 -135777 37944 -276768 287016 -86726 172930 -295559
5914 73711 -109039 -220811 5950 -1524 31283 -44821 -74981 -108436 -11745 -208233 -169185 -166000
5902 -166000 -20777 -138489 130359 -231552 -26344 -98515 -264852 -110855 181129 -182453
5891 -17792 -137439 -183502 -69932 -54837 96439 182934 -69311 113141 269473 -170369 117719
5879 125974 -312110 63652 20079 80883 -202541 135613 -100996 -64708 99616 88885 32612
5867 -92992 118774 210995 77123 25953 195553 -98997 110365 -149771 239042 133516 -178489
5855 -64039 -484986 81687 -38339 221158 -242562 152966 296742 38188 -39273 68552 235578
5844 235578 43249 72477 110694 -34410 -88289 39775 5925 -201368 393383 -180578 267423
5832 40174 -79155 -52595 35756 -92981 23780 -79571 -360569 106773 -293544 -271728 125111
5820 -184836 139568 193132 -166420 33481 184403 -242914 176598 169777 -120766 -193488 -114709
5809 -114709 3375 -56842 -230020 -38904 -189904 117627 -43912 69384 12374 63541 -15995
5797 -128216 -46763 -233016 421747 293858 23840 73408 -234102 -73874 -74533 256438 86479
5785 112600 65780 104571 42124 -44544 359518 106946 112611 173074 -143407 41378 -134751
5773 17890 43538 -17016 -221514 100379 -229246 -424001 -306723 84233 404473 96814 -7136
5761 -187543 -368907 147533 180464 168335 56357 21079 202695 531498 -1625 185162 13660
5749 -65965 -359214 76723 14575 90731 -53438 261262 -173612 -166438 -124803 -32243 -93431
5738 -93431 121897 -319596 -495612 -87429 6983 -44699 -128660 -98944 291669 -910 45222 -2977
5725 178487 -163709 -26809 176511 -51917 -37928 245143 731 -105607 67944 -131225 -176411
5714 -176411 -122525 59730 81588 -55891 69284 -36519 278460 -224127 -98020 83995 20898
5702 -38185 115779 -172987 -103767 -99600 -101485 -390573 126627 -139917 -276931 196384 -286735
5690 -231547 -212752 223499 -21989 -310950 145890 -114114 101434 -84393 -13548 113522
5679 -206052 -199847 -114964 -7341 195737 268515 -20654 -218346 -304883 9277 16173 -175139 -308732
5667 -308732 -151826 116420 -52822 24931 -167127 55469 155840 -232908 -353414 43414
5656 -67644 -82792 48327 -114314 -229524 178485 159506 172291 -268652 232813 132180 -26930
5644 -177941 465731 164792 -368623 -42017 -219900 -42279 -190876 -38212 -266085 183960
5633 155883 -207865 -84330 -283748 154332 -32400 27452 -61796 130825 -15271 72256 328996
5622 328996 -131413 -11917 565726 -153873 264054 -210757 -7534 241651 4553 216994 11518
5610 -85511 193810 -24064 37121 95863 294966 210947 -47651 -120794 195309 -56187 -142218
5599 -142218 -226278 -38097 -75721 66105 -138121 269744 10284 26826 -230630 52834 143723
5588 143723 128593 207557 -95517 43676 -79322 242747 -37858 79396 13955 -70159 -250765
5577 -250765 139411 -77486 -145079 15800 -31815 -54670 60136 -13816 45790 -243778 -73419
5565 -58289 -67466 -169647 39876 205320 -385 -137535 292488 114187 66647 -128233 33206
5553 158722 44266 74680 2262 133265 64598 -24814 102756 -18767 -73513 -210886 -165681
5542 -165681 -59977 218021 169488 103687 -328868 26979 -95773 -126946 126268 116838 123370
5531 123370 19761 -80446 -175230 -242318 -317898 -388118 -114786 -14554 195838 -140300 41251
5519 7108 -12185 -140458 -149738 -50199 88822 194006 -81479 236705 127683 -319110 131133
5507 -37284 84646 -134652 -130733 82515 131108 -272870 -121872 -160087 -16772 -275661 -88727
5495 44462 -3022 -140658 -44410 -15531 -54305 155651 95821 -232091 134296 89925 -436976
5483 409125 -209403 -265257 -87569 141811 216379 204540 75954 68468 16129 -215800 -121882
5472 -121882 -42973 302907 -189148 -93669 44115 -72168 245952 84107 181514 -90458 -340714
5461 -340714 164162 -182774 150004 83504 -129104 1934 172900 65393 -11000 -147065 -191933
5450 -191933 -105659 -380634 -224825 193549 123405 -29280 -97475 118823 11972 183002 -157638
5438 -26694 38027 -109792 -90815 71007 -48521 -320012 -161070 137381 -128177 206989 115984
5427 115984 -3925 252660 9345 390203 27741 -108975 25689 76830 100179 -417258 162550
5415 -177579 -43965 -232250 -44058 305108 210409 -98824 69064 105091 -182476 86657 142616
5404 142616 333590 49431 -204243 122069 -64458 -43100 127894 -46666 -108669 -208254 -162375
5393 -162375 -160157 385832 53598 -228992 395058 -20333 -246129 -17320 311844 -27891 -83217
5382 -83217 24318 146807 -16271 77506 -302552 140378 -3967 -45382 -188161 -77274 260458
5370 128462 -153725 -62105 -170152 -8760 -172376 -68076 -206021 -55361 174486 13223 -179695
5358 -180933 -192666 44020 129152 -197818 -6883 402987 -92491 197236 74174 -196832 50968
5346 -364132 75158 33667 -43128 -241745 -611611 -173861 385102 170931 101908 -18178 -27676
5335 -27676 -26291 257555 -129206 -13377 -248198 82605 -105854 1828 26974 -302633 270054
5323 -202352 120350 -393133 -48854 115068 -351744 15892 146637 19034 122165 -81062
5312 113188 -316220 324036 156020 4785 78554 135175 13387 -195582 -81209 -98683 91942
5300 -260805 -234478 124345 41459 -235058 -202601 -281574 -224926 44597 -63087 -119770 -87695
5289 -87695 -159702 -238296 -11262 -80034 -263440 352127 13427 133022 -102549 275977 -91056
5277 -102369 -415091 298383 147787 148362 -39274 -114148 192900 29165 178035 476771 216396
5265 23118 -31577 61710 200595 150477 240608 -458548 149866 -281324 458245 310383 300148
5254 300148 284886 -25005 128665 109056 103738 -159751 74954 -47710 -5875 523377 -10871
5242 -252599 -383866 141908 104725 50994 216610 -45488 -138820 20657 -155474 -149777 50868
5230 -196211 72803 270487 -58295 46124 -187813 -266891 29996 98432 34581 -27571 189449
5218 -137303 12231 -157240 78105 -101065 -90022 37894 110669 -49233 74167 -151350 222701
5206 17491 -101487 -10771 -345528 -389674 156220 18964 -90966 -1931 -227188 140178 -7983
5194 -152855 -12029 -43030 306395 76290 -161133 -193940 -198653 -100747 -28294 93294 -204815
5182 232426 -111746 17641 -3576 84423 48332 84524 -139792 -148446 -72424 188669 140482
5171 140482 25304 250305 -151105 243397 -96716 355572 -95558 -236606 -36995 33566 40339
5160 40339 85367 72220 -8961 -172582 118287 -198140 -38062 164506 30165 -87812 -205445
5149 -205445 23581 -331331 -5986 91333 -82788 39461 -58188 -68158 291937 -18873 -191369
5138 -191369 73666 53715 -131814 -73929 -125979 -39336 58983 -3621 323065 -42588 -98149
5127 -98149 -83152 -241974 128964 53958 29765 -339846 -123547 -183511 216157 -335032 -11202
5115 -135911 88702 7476 252509 -205743 103226 86438 296900 -125499 -199634 81413 -145308
5103 -130533 103567 285063 -20463 72526 166603 -103279 -189977 215557 -41573 -88253 420233
5091 157156 -131669 -183903 45219 -33541 -158989 309517 -3439 75672 49197 95620 -155975
5079 26491 -152610 53884 -42841 79424 -126939 -26914 5276 4980 -9565 114744 65889 217876
5067 217876 40566 -78539 48753 166299 124908 328425 -87180 46699 -162991 -194451 -78679
5055 -125115 85220 93168 -96808 20699 -138522 -12682 267177 44486 -159229 -55339 -56489
5044 -56489 64667 211334 -27306 -15685 42786 5675 -41347 10993 -94539 168439 -32257 -112870
5032 -112870 189547 233321 -5655 -121337 -185889 -94456 176673 -138321 -34728 329871 -218080
5020 -30197 180348 -98132 -166312 -100695 -67878 -217517 113441 8669 -176206 76765 -224892
5008 67994 42403 70346 16721 43608 -307938 26135 360956 236579 -144377 -5569 141304
4996 59522 -102108 -246857 28996 50934 172555 -61214 137752 -185843 223238 -180635
4985 67390 -58698 427068 51135 -86637 -174147 -7325 -102300 98947 -73713 -95373 175939 -73515
4972 -284728 -76655 284948 -249318 -184278 109678 -4493 170610 -102015 -186793 -113806 65042
4960 -138418 31116 33038 78983 -89451 -25959 -302066 -247802 -6929 -274376 166049 177471
4949 177471 -353555 100711 -266212 -161571 33899 -72696 -39914 58930 50691 -154629 305825
4937 -38970 4098 -91464 -2962 120350 233638 -276152 123943 260467 29053 65218 -90901
4925 300807 -161154 -168012 46050 143913 -34726 18124 239159 97609 81630 -45184 -278420
4914 -278420 34 -296807 167462 -187437 287379 128304 235291 62797 -80987 227669 -159215
4902 -63483 -138158 -118851 -278792 -315090 180735 89937 -144781 157794 -274804 303479 -116238
4890 -399806 102975 143030 -49648 35377 31344 182960 -35145 426203 -30685 16110 -254016
4878 -318325 -145758 -156923 -187688 -66885 124249 107346 133562 59058 308723 184477 -6513
4866 -29439 -228779 -87264 42120 -450207 -92245 324402 -14894 -60133 -160506 -68481 5112
4854 -105808 -20730 41782 4596 -57595 351811 52191 58536 -205074 430104 175600 -21313
4842 -194241 -31128 -65775 -164733 -131574 -384424 -112577 205277 -129738 -36036 -202119 57071
4830 112466 217448 -84992 -184662 165932 -350567 129139 -9794 180653 235410 214970 269000
4819 269000 -294323 193114 -303756 115620 589805 -150507 268908 -147756 -186498 273710
4808 -594511 232155 -93377 173111 -14549 128696 106729 -94084 -247616 -134531 -315678
4798 -315678 136098 105479 -402228 -201590 -203439 -63299 14015 135179 39093 247138 -14092
4786 -79504 -156091 244041 126642 73171 -25596 -268261 289277 -45516 88333 -123343 81961
4774 -185457 28759 167789 149701 -64467 -142600 -77630 75235 227952 -19585 206745 37146
4762 -63385 -169575 -132937 -7096 -468266 -141549 -10944 -35179 209461 -184760 -194058 326915
4750 -87716 -99073 49763 12375 101211 293447 227544 82673 30450 50753 -318384 67432
4738 -42352 279809 -286590 64189 -44870 261370 157752 146880 86307 -66060 -57446 206321
4726 43896 347376 43808 214368 77294 -188785 -137919 204723 -106843 191356 -37775 33723
4714 108185 -116293 -10985 320520 -24318 135783 146002 165828 21727 24968 -113080 -205867
4703 -205867 -184248 -299874 169744 162146 210765 19638 127702 75120 75342 -20650 126613
4691 140684 176112 203278 -179743 169058 -210598 -107024 -180130 -44514 252150 -191446
4680 -69234 -129645 71216 -121301 294187 148887 -50544 591 53104 211255 -459799 -32035
4668 -54669 104708 -19618 105755 -175281 -130151 -298248 117802 -28686 26383 -14937 -75898
4657 -75898 353591 -103585 242838 -16205 113769 191571 173843 -231972 271368 449 108981
4646 108981 260635 85448 83107 -330241 47658 -37659 -61289 88998 -104500 30469 232671
4635 232671 -130862 121047 149994 112209 165548 -23531 -99765 -28290 -28876 128336 110974
4624 110974 -186917 313067 -182500 10255 -209856 30036 92036 -35781 -246085 212420
4613 27109 -47173 336199 46273 -133013 -8912 -174778 31442 51449 406814 -170779 84945
4601 105000 -176398 30122 13202 61388 -376810 -199432 91194 -181415 301551 -151651
4590 266418 -218309 93803 -45549 73673 178358 -616746 -91716 -93153 42254 -89593 303926
4578 305863 -296315 3361 -395196 114471 -112429 -117518 -8491 90810 32104 1552 93822 -109880
4565 -91997 -142767 -35465 21077 -2077 128276 -146908 -61114 75133 261303 -440021 -111093
4553 48698 -52366 -176595 175989 156900 31694 276860 257036 -308954 -65702 -184449 -164257
4542 -164257 79466 -12846 -172599 333908 243855 -23905 -63350 64240 -75734 -298593 -51021
$$ [...]
##END NTUPLES=NMR SPECTRUM
##END=
