##TITLE=AC1619_BRASL13350_8325958_LeAUvf3HCF
##JCAMPDX= 6.0         $$ Bruker NMR JCAMP-DX V2.0
##DATA TYPE= NMR SPECTRUM
##DATA CLASS= NTUPLES
##ORIGIN= BRUKER
##OWNER= Administrator
$$ 1.72 TOPSPIN		Version 2.1
$$ 2013-11-13 21:10:42.716 -0800  Administrator@X
$$ Compression mode = diff/dup
##.OBSERVE FREQUENCY= 400.02188249412
##.OBSERVE NUCLEUS= ^1H
##.ACQUISITION MODE= SIMULTANEOUS (DQD)
##.ACQUISITION SCHEME= undefined
##.AVERAGES= 8
##.DIGITISER RES= 22
##SPECTROMETER/DATA SYSTEM= spect
##.PULSE SEQUENCE= zg30
##.SOLVENT NAME= COFFEE_meoh
##.SHIFT REFERENCE= INTERNAL, COFFEE_meoh, 1, 14.98509
##AUDIT TRAIL= $$ (NUMBER, WHEN, WHO, WHERE, PROCESS, VERSION, WHAT)
$$ ##TITLE= Audit trail, TOPSPIN		Version 2.1
$$ ##JCAMPDX= 5.01
$$ ##ORIGIN= Bruker BioSpin GmbH
$$ ##OWNER= Administrator
$$ $$ E:\/data/COFFEE/nmr/AC1619_BRASL13350_8325958_LeAUvf3HCF/10/pdata/1/auditp.txt
$$ ##AUDIT TRAIL=  $$ (NUMBER, WHEN, WHO, WHERE, PROCESS, VERSION, WHAT)
(   1,<2013-11-13 21:10:35.419 -0800>,<Administrator>,<X>,<go>,<TOPSPIN 2.1>,
      <created by zg
	started at 2013-11-13 21:09:29.341 -0800,
	POWCHK enabled, PULCHK disabled,
       configuration hash MD5:
       C8 4E 4E 5D D3 5C D8 9E 9F 52 82 E0 59 8A DE 15
       data hash MD5: 64K
       6C 2F D2 DF 37 FA 3C D6 E8 1C 86 7C A2 D7 BD DF>)
(   2,<2013-11-13 21:10:38.513 -0800>,<Administrator>,<X>,<proc1d>,<TOPSPIN 2.1>,
      <Start of raw data processing
       efp LB = 0 FT_mod = 6 PKNL = 1 PHC0 = 0 PHC1 = 0 SI = 32K 
       data hash MD5: 32K
       14 88 F2 C3 14 B9 56 4C 98 5A 09 D6 95 95 64 69>)
(   3,<2013-11-13 21:10:38.857 -0800>,<Administrator>,<X>,<proc1d>,<TOPSPIN 2.1>,
      <pk PHC0 = 92.10938 PHC1 = 0 
       data hash MD5: 32K
       C8 02 0D F3 84 D8 16 0F D4 0E C2 06 5E 04 F1 99>)
(   4,<2013-11-13 21:10:39.138 -0800>,<Administrator>,<X>,<proc1d>,<TOPSPIN 2.1>,
      <abs ABSG = 1 
       data hash MD5: 32K
       A8 8A 56 A4 1B CA 59 1B 32 17 8B 5D E4 3D 84 A9>)
(   5,<2013-11-13 21:10:39.357 -0800>,<Administrator>,<X>,<proc1d>,<TOPSPIN 2.1>,
      <abs ABSG = 2 
       data hash MD5: 32K
       14 D4 58 EF AB 9D 20 2D FF 40 99 EE D8 A8 A9 80>)
(   6,<2013-11-13 21:10:39.450 -0800>,<Administrator>,<X>,<proc1d>,<TOPSPIN 2.1>,
      <abs ABSG = 3 
       data hash MD5: 32K
       E5 B7 60 95 CB 3C F8 7E 52 10 F5 54 B3 C6 18 8E>)
(   7,<2013-11-13 21:10:39.513 -0800>,<Administrator>,<X>,<proc1d>,<TOPSPIN 2.1>,
      <abs ABSG = 4 
       data hash MD5: 32K
       47 D2 4D 11 DB 2E 0F 5D EF A9 F6 83 8B 8B 3A B7>)
(   8,<2013-11-13 21:10:39.591 -0800>,<Administrator>,<X>,<proc1d>,<TOPSPIN 2.1>,
      <abs ABSG = 5 
       data hash MD5: 32K
       5F FE 39 8C 71 2E 4E 43 2E CA 9E 88 EE 00 EB 4E>)
$$ ##END=
$$ 
$$ $$ hash MD5
$$ $$ E4 0A 9E 19 77 B4 29 82 25 0D CF 84 F6 9F 74 11
##$RELAX= 
##$RELAX= 
##$RELAX= 
##$RELAX= 
##$RELAX= 
##$RELAX= 
##$RELAX= 
$$ Bruker specific parameters
$$ --------------------------
##$DU= <E:\>
##$EXPNO= 10
##$NAME= <AC1619_BRASL13350_8325958_LeAUvf3HCF>
$$ [...]
##$TP= (0..7)
150 150 150 150 150 150 150 150
##$TP07= 0
##$TPNAME0= <>
##$TPNAME1= <>
##$TPNAME2= <>
##$TPNAME3= <>
##$TPNAME4= <>
##$TPNAME5= <>
##$TPNAME6= <>
##$TPNAME7= <>
##$TPOAL= (0..7)
0.5 0.5 0.5 0.5 0.5 0.5 0.5 0.5
##$TPOFFS= (0..7)
0 0 0 0 0 0 0 0
##$TUNHIN= 0
##$TUNHOUT= 0
##$TUNXOUT= 0
##$USERA1= <user>
##$USERA2= <user>
##$USERA3= <user>
##$USERA4= <user>
##$USERA5= <user>
##$V9= 5
##$VALIST= <valist>
##$VCLIST= <CCCCCCCCCCCCCCC>
##$VD= 0
##$VDLIST= <DDDDDDDDDDDDDDD>
##$VPLIST= <PPPPPPPPPPPPPPP>
##$VTLIST= <TTTTTTTTTTTTTTT>
##$WBST= 1024
##$WBSW= 4
##$XGAIN= (0..3)
0 0 0 0
##$XL= 0
##$YL= 0
##$YMAX_a= 637030
##$YMIN_a= -543657
##$ZGOPTNS= <>
##$ZL1= 120
##$ZL2= 120
##$ZL3= 120
##$ZL4= 120
##$ABSF1= 14.98509
##$ABSF2= -5.573092
##$ABSG= 5
##$ABSL= 3
##$ALPHA= 0
##$AQORDER= 0
##$ASSFAC= 0
##$ASSFACI= 0
##$ASSFACX= 0
##$ASSWID= 0
##$AUNMP= <proc_prof1d_extract_pilot.lims>
##$AXLEFT= 0
##$AXNAME= <>
##$AXNUC= <1H>
##$AXRIGHT= 0
##$AXTYPE= 0
##$AXUNIT= <>
##$AZFE= 0.1
##$AZFW= 0.1
##$BCFW= 0
##$BC_mod= 0
##$BYTORDP= 0
##$COROFFS= 0
##$CY= 15
##$DATMOD= 1
##$DC= 0
##$DFILT= <>
##$DTYPP= 0
##$F1P= 0
##$F2P= 0
##$FCOR= 0.5
##$FTSIZE= 32768
##$FT_mod= 6
##$GAMMA= 0
##$GB= 0
##$INTBC= 1
##$INTSCL= 1
##$ISEN= 128
##$LB= 0
##$LEV0= 0
##$LPBIN= 0
##$MAXI= 10000
##$MC2= 0
##$MEAN= 0
##$ME_mod= 0
##$MI= 0
##$NCOEF= 0
##$NC_proc= -8
##$NLEV= 6
##$NOISF1= 0
##$NOISF2= 0
##$NSP= 0
##$NTH_PI= 0
##$NZP= 0
##$OFFSET= 14.98509
##$PC= 1
##$PHC0= 92.10938
##$PHC1= 0
##$PH_mod= 1
##$PKNL= yes
##$PPARMOD= 0
##$PPDIAG= 0
##$PPIPTYP= 0
##$PPMPNUM= 2147483647
##$PPRESOL= 1
##$PSCAL= 4
##$PSIGN= 0
##$PYNMP= <proc.py>
##$REVERSE= no
##$SF= 400.02
##$SI= 32768
##$SIGF1= 0
##$SIGF2= 0
##$SINO= 400
##$SIOLD= 32768
##$SPECTYP= <>
##$SREGLST= <1H.CDCl3>
##$SSB= 0
##$STSI= 32768
##$STSR= 0
##$SW_p= 8223.68421052631
##$SYMM= 0
##$S_DEV= 0
##$TDeff= 65536
##$TDoff= 0
##$TI= <>
##$TILT= no
##$TM1= 0
##$TM2= 0
##$TOPLEV= 0
##$USERP1= <user>
##$USERP2= <user>
##$USERP3= <user>
##$USERP4= <user>
##$USERP5= <user>
##$WDW= 1
##$XDIM= 32768
##$YMAX_p= 463885187
##$YMIN_p= -708204
##$CURPLOT= <Network HP LaserJet P1505>
##$CURPRIN= <$Network HP LaserJet P1505>
##$DFORMAT= <normdp>
##$LAYOUT= <+/1D_H.xwp>
##$LFORMAT= <normlp>
##$PFORMAT= <normpl>
##$SURQMSG= 1
$$ End of Bruker specific parameters
$$ ---------------------------------
##NTUPLES= NMR SPECTRUM
##VAR_NAME=  FREQUENCY,     SPECTRUM/REAL,   SPECTRUM/IMAG
##SYMBOL=    X,             R,               I
##VAR_TYPE=  INDEPENDENT,   DEPENDENT,       DEPENDENT
##VAR_FORM=  AFFN,          ASDF,            ASDF
##VAR_DIM=   32768,         32768,           32768
##UNITS=     HZ,            ARBITRARY UNITS, ARBITRARY UNITS
##FACTOR=    0.250966925370066, 1,           1
##FIRST=     8223.43324360094, -145466,      55186
##LAST=      0,             -54863,          -125439
##MIN=       0,             -708204,         0
##MAX=       8223.43324360094, 463885187,    0
$$ Real data points
##PAGE= N=1
##DATA TABLE= (X++(R..R)), XYDATA
$$ [...]
19561i3q641j51754k99003D6289c1191A4118J67637a31577A69939J11274b23470
19549a65195b4010f92k90994A29467Q9013M8240g1615B53747p8106a04771r5650
19538b00421C94949a86725F0666b80924K6160M3915R0811A42621j5823b8656j64452
19527a93108d629q5584j17968B08851b42265j91635a8750j80474K1281E9018c1307
19515i1353C78247I805a78284e9349J9988G5914c77342e5448b3892n2370A3934
19503B68669a45103d7099q9034M9218I6089J25390a58524j0518D038a35818a5749
19491a29124k07359e0605C2464g8734J7664G58M53414A07832d8521C159q02a31927
19478h779j53430D0158K50657b76488N6712E8377A2253J84422a67543e4744I9402
$$ plain form
19561 -93 -8734 -160488 -459491 46289 -31191 14118 181755 -131577 169939 281213 -223470
19549 -165195 -24010 -692 -291686 129467 218480 266720 -71615 253747 175641 -104771 -200421
19538 -200421 394949 -186725 60666 -280924 -254764 -210849 -120038 142621 126798 -28656 -193108
19527 -193108 -4629 -90213 -208181 208851 -242265 -433900 -18750 -199224 -177943 59018 -31307
19515 -91353 378247 9805 -178284 -59349 -39361 75914 -377342 -55448 -23892 -76262 13934
19503 268669 -145103 -47099 -136133 -86915 96089 221479 -158524 -169042 4038 -135818 -15749
19491 -129124 -336483 -50605 32464 -78734 -61070 758 454172 107832 -48521 3159 2357 -131927
19478 -8779 -162209 40158 290815 -276488 -219776 58377 12253 196675 -167543 -54744 99402
19466e0747q7612q1053j24281P3677J10460J6670A83902B7235a46572k24682A80314
19454C30031a23217E1538M8453E2J89955b36175j20782H8563D4173Q1699n4525
19443G1347j7215a47852j17722k4875J30023k5745I938O1508J9076k0691l0416
19432C9415c46491m8113a93137a0167l6579m28780h8465d2646H4567a75930B11121
19420F3380e15319b7950F8035i5950C8825a60114L6678n2512I4809K1988a10343
19408h5933K1778k81582B5264c85217J76588M424h5211a4540A4797L99494a89809
19396A9997N5401a15027Ia51888M7643A41311b54054A92630c4576C8176a7583
19384c13774J41465l2476p7543F7526a70051A08675e523l18851a14355d4372I2511
$$ plain form
19466 -50747 -138359 -219412 -343693 -270016 -159556 -142886 183902 27235 -146572 -371254 180314
19454 330031 -123217 51538 99991 52 190007 -236175 -356957 88563 44173 125872 71347
19443 71347 54132 -147852 -265574 -290449 -160426 -186171 9938 71446 90522 69831 39415
19432 39415 -346491 -394604 -193137 -10167 -46746 -475526 -88465 -42646 84567 -175930 211121
19420 63380 -515319 -27950 68035 -95950 38825 -160114 -123436 -175948 94809 116797 -110343
19408 -85933 -64155 -345737 25264 -385217 -208629 -204205 -85211 -14540 14797 414291 -189809
19396 19997 75398 -115027 9 -151888 -104245 141311 -254054 192630 -34576 38176 -17583
19384 -313774 -172309 -204785 -282328 67526 -170051 108675 -5523 -324374 -114355 -44372 92511
19372A6398h934A20056L9593O9536n4794d02692J80305h0991k1167K4532J1877
19361f5749G8200J02710b73600c2519r2471B70381j12134c0360k21948a3377k01646
19350b15023c4071l66995a33559E3327a11443k48432A63780f8014C9595P1416
19340A11011J7502b5937m6290E3191h07A29993h8579A1587C788d9399r5558B32595
19327C155J34621b16739N6328A57621m9595b22252d7104k624n0797A23055Q3376
19316B06431a27469k5415r1009J11820J0571I2986J68869b32569P8646b7462B10727
19304A1016a94640l29739b3244k433q6758H508a64111G5574a07503j55756j48520
19293d11779a51029B52740i5843g23E6147a4289o1369j0186j37436I2652J3212
$$ plain form
19372 16398 -8934 120056 159649 229185 174391 -402692 -222387 -80991 -102158 -77626 -65749
19361 -65749 78200 180910 -273600 -32519 -124990 270381 158247 -30360 -252308 -13377 -215023
19350 -215023 -34071 -401066 -133559 53327 -111443 -359875 163780 -68014 39595 111011
19340 111011 128513 -25937 -72227 53191 -807 129993 -88579 11587 3788 -49399 -144957 232595
19327 3155 137776 -216739 -160411 157621 108026 -222252 -47104 -49728 -100525 123055 206431
19316 206431 -127469 -152884 -243893 -132073 -121502 92986 261855 -232569 -153923 -27462 210727
19304 11016 -194640 -524379 -23244 -25677 -112435 8508 -164111 75574 -107503 -263259 -411779
19293 -411779 -151029 252740 -95843 -723 56147 -14289 -75658 -85844 -223280 92652 105864
19282A05864D2702a19786j1910j16389P6797j61949N7811b6281j49350G1662a42669
19270f5353A07748C726R6823h9303j10955c1180o4039A54286a72984Q1260K7738
19259f3986M509H1203K77954j40567H2146J91461b05193D2486j7643b4640A6745
19247D8328b88235g25r4592A08295b07252i4610b3428B2374h4651j54060J15115
19236a23596p4046G0614a28800l35400a18566B71006e023j60409d0616l992A64436
19224a59634a8071k47254b0790A73282b10350h0951k5723o7148g4335L1637j66614
19213b09312M0230B25757c79188a57670B06958a34749k6582I19a0777C94360e3408
19201a14957l1706l1324A63619n0195k2109c42511R6036D292b79709G9972f4229
$$ plain form
19282 105864 42702 -119786 -131696 -248085 -171288 -333237 -275426 -26281 -175631 71662 -142669
19270 -65353 107748 3726 100549 -89303 -200258 -31180 -95219 154286 -172984 -91724 -63986
19259 -63986 -59477 81203 359157 218590 82146 273607 -205193 42486 24843 -24640 16745
19247 48328 -288235 -725 -95317 108295 -207252 -94610 -23428 22374 -84651 -238711 -123596
19236 -123596 -197642 70614 -128800 -464200 -118566 271006 -5023 -165432 -40616 -44608 164436
19224 -159634 -18071 -265325 -20790 173282 -210350 -80951 -106674 -173822 -74335 -42698 -209312
19213 -209312 -169082 225757 -379188 -157670 206958 -134749 -161331 919 -10777 394360 -53408
19201 -114957 -146663 -177987 163619 113424 91315 -342511 -246475 4292 -279709 79972 -64229
19189C6204b00557q6225b6936p9948J8641A60641b15024A6647f503C3304L35864
19178C69168D4040d1633L066L442R807m2683A11627l9607h1243l80706a81887
19166a5889A6948a34512J2910a982H1017a3006n2332F8895a04124b2845l76797
19155c99642J92017k74666M5289K08987A882b60560H4024a13818J3164j42313
19145b42967B45685q6385a88252P2093q3453c1006j96025A06062d96617a18295
19134A77786a03941H8075b17822k12909D9122a03824b9159D0424O9136b4036D588
19122b10719d7370j36627r995C06833a90263A77975c04065J17908k61150d9776
19111C7160j8568c4371R459F3225a45952o5717r0828Q5963A93431b04020R4194
$$ plain form
19189 36204 -200557 -286782 -26936 -106884 -88243 160641 -215024 16647 -6503 33304 369168
19178 369168 44040 -41633 -38567 -35125 -25318 -68001 111627 72020 -81243 -461949 -181887
19166 -15889 16948 -134512 -121602 -1982 81017 -13006 -65338 68895 -104124 -22845 -399642
19155 -399642 -207625 -482291 -437002 -228015 1882 -260560 84024 -113818 -100654 -242967
19145 -242967 245685 159300 -188252 -116159 -199612 -31006 -227031 106062 -496617 -118295
19134 177786 -103941 88075 -217822 -430731 49122 -103824 -29159 40424 109560 -24036 4588
19122 -210719 -47370 -183997 -193992 306833 -190263 177975 -304065 -186157 -447307 -49776
19111 37160 18592 -34371 -24912 63225 -145952 -211669 -302497 -216534 193431 -204020 -109826
19100a09826b664A93054J0482a04792L2997k2204J5678k26127g5621C9479J19359
19089A58838p3966K3068b13165A2171f1540j37225q8438f3494q2878a7666o7613
19078h5279p3660A38827a69404A10339c0692j44490B54061F1458a86307h2297
19067g4705l02545L8756g6563C3045a41825k58977a56231d1437j51126P8969k9862
19056a43456b7791q6462A95293a35204d9792b3943D904J45157a8432F0227b53091
19044G9862J24765c49425D3988k1443f2332B34933c75121d5685j52288P5586p658
19033a30045I3898J19712G5044C0124M760J86224C6688O0390a32627C74963A30546
19021A51565L4508E9810b11957B14480b08236D2216b10392E6501b10164f6780
$$ plain form
19100 -109826 -2664 193054 203536 -104792 -71795 -93999 -78321 -304448 -75621 39479 158838
19089 158838 84872 107940 -213165 12171 -61540 -198765 -287203 -63494 -146372 -17666 -85279
19078 -85279 -158939 138827 -169404 110339 -30692 -175182 254061 61458 -186307 -82297
19067 -74705 -377250 -338494 -76563 33045 -141825 -400802 -156231 -41437 -192563 -113594 -143456
19056 -143456 -27791 -114253 195293 -135204 -49792 -23943 4904 150061 -18432 60227 -253091
19044 79862 204627 -349425 43988 22545 -62332 234933 -375121 -45685 -197973 -122387 -130045
19033 -130045 93898 213610 75044 30124 34884 221108 36688 97078 -132627 374963 130546
19021 151565 186073 59810 -211957 214480 -208236 42216 -210392 56501 -210164 -66780
19010A75799f9523I8482c11173g252j8691k24461A5288J8605b7440k29583L531
18999b53492b7212k7020J3935D9756c38172O8130A31807b8959j70495l3952A75230
18987b40217l8172d403B27240P6415a46040J4050B21363d66742F3133a17132j75
18976a17307B04307b12728E5677c83A3315a10824d3660I7245a13073A16075R5299
18965B11374f4104B6028a18602p1495B36987B5134b47532h916o5641m1330j12659
18954b28546m4558G9862a12864j5810J8678j2185q4209K8965l5881A93849b44710
18942c2877o8748B60614r5857D305f7394G4442b27716L0438A2703K49311a37058
18930H2515a44857K4607B88356D1714a8127C58770q6587a8198F110i0911A44200
$$ plain form
19010 175799 -69523 98482 -311173 -7252 -25943 -250404 15288 33893 -27440 -257023 -253492
18999 -253492 -27212 -54232 -40297 49756 -338172 -270042 131807 -28959 -199454 -233406 175230
18987 -240217 -278389 -4403 227240 303655 -146040 -131990 221363 -466742 63133 -117132 -117307
18976 -117307 204307 -212728 55677 -383 13315 -110824 -43660 97245 -113073 116075 211374
18965 211374 -64104 26028 -118602 -190097 236987 25134 -247532 -8916 -74557 -115887 -228546
18954 -228546 -273104 79862 -112864 -128674 -109996 -122181 -206390 -177425 -213306 193849 -244710
18942 -32877 -101625 260614 164757 4305 -67394 74442 -227716 -197278 12703 262014 -137058
18930 82515 -144857 -120250 288356 41714 -18127 358770 272183 -18198 6110 -90911 144200
18918B6989J45965F9335k4938B180M9013c12090A45627E2913c31270C39651a45152
18906b36379g2245B9503d44809A58665c88239A57759l5038b79888J19865A91751
18895I9060a3182H3652M1072l1027i8985o094j46774A55606a83137Q0217j74478
18884b77398i722j80011C11734a20238L8618o5894F9521d53573a07654F5075a74042
18872B0599h1611k90851a12649e3476K5607G1286b2800B94700B4978N1237O0746
18861A36961J24449a84486J0619A22930l2729a056r0645B23521C0211J31555e367
18849c3018o0907J5317I6283a11513j64460B56465c85066b9702j44650e4866k43961
18838b98827A69012f0893k54573F7433b13304j3591h5755j26176A88296c48300
$$ plain form
18918 26989 172954 69335 44397 2180 51193 -312090 145627 52913 -331270 339651 -145152
18906 -236379 -72245 29503 -444809 158665 -388239 157759 122721 -279888 -160023 191751
18895 99060 -13182 83652 124724 93697 -98985 -105079 -251853 155606 -183137 -102920 -277398
18884 -277398 -9722 -189733 311734 -120238 -81620 -147514 69521 -453573 -107654 65075 -174042
18872 20599 -81611 -372462 -112649 -53476 -27869 71286 -22800 294700 24978 76215 136961
18861 136961 261410 -184486 -173867 122930 90201 -1056 -91701 223521 30211 161766 -5367
18849 -33018 -93925 -78608 96283 -111513 -275973 256465 -385066 -29702 -174352 -54866 -298827
18838 -298827 169012 -60893 -315466 67433 -213304 -226895 -85755 -211931 188296 -348300
18827b71312h124j88708i029j27360p4479A25864J8014a49568m2973A11246L6427
18816A47673D269b58636c516A5683K18787N5841C8061a28274M7030A33339K9254
18805A62593C2867a68845B36630F30a95760f4640j02174K3603B83705C4766b91143
18793b67360J23811j4815o6406A49244a42441A2506L56129c53252J64306F7733
18782b9254q9922G077R1410a25776C52773a45474a2221B941N4657g3662j95657
18771b69319L3701D35474a71731A3537b3093G152b4650A28980D6147e900r8287
18760a04187r1115g3846k2888O678I6669e9732l14013l466J26757R7566k0676
18749a73564j34910b4286j4241F8870i0623j12114a6424j91522j21880A91654
$$ plain form
18827 -271312 -8124 -196832 -9029 -136389 -210868 125864 143878 -149568 -192541 111246 147673
18816 147673 4269 -258636 -3516 15683 234470 290311 38061 -128274 -81244 133339 162593
18805 162593 32867 -168845 236630 630 -195760 -64640 -166814 -143211 283705 34766 -291143
18793 -267360 -143549 -158364 -224770 149244 -142441 12506 368635 -353252 -188946 67733
18782 -29254 -119176 7077 98487 -125776 352773 -145474 -12221 2941 57598 -73662 -269319
18771 -269319 -235618 435474 -171731 13537 -23093 7152 -24650 128980 46147 -5900 -104187
18760 -104187 -195302 -73846 -96734 -90056 96669 -59732 -373745 -377211 -250454 -152888 -173564
18749 -173564 -308474 -24286 -38527 68870 -90623 -202737 -16424 -207946 -329826 191654
18738a76910m2753A5819a84454A36525h309q1073k20165K4123i5181o5991A25146
18726a28414A38908N5551H4741b25753i831j01926j93990P3816L6438I3540m738
18715H8802h7440n0184a9233I0680c4222j71737B34983a256k64851Q9172d5989
18703F1946A5472h7971J9860k9045m9100l9970A81140b03852A79526K8349a00972
18691F8638L48450c3904E8265a09529n1277j97994i0177b206j07915A28290f9211
18679f944l05084E8888b2284I1479J6922L69323k25251j6258B3368a47798b1396
18667a17803B83985A5250h7553j07277O4916p955B69330g9616a6273k03503h3418
18655C37267r8648C6994N907E133b49861j762Q639b1107j34208E0820g4170j19995
$$ plain form
18738 -176910 -219663 15819 -184454 136525 -8309 -89382 -309547 -285424 -95181 -161172 125146
18726 -128414 138908 194459 84741 -225753 -9831 -111757 -305747 -231931 -195493 93540 88802
18715 88802 -87440 -137624 -19233 90680 -34222 -205959 234983 -1256 -266107 -176935 -45989
18703 61946 15472 -87971 -68111 -97156 -146256 -186226 181140 -203852 179526 207875 -100972
18691 68638 417088 -33904 58265 -109529 -160806 -358800 -90177 -2206 -110121 128290 -69211
18679 -6944 -312028 58888 -22284 91479 108401 477724 252473 236215 23368 -147798 -21396
18667 -117803 283985 15250 -87553 -194830 -129914 -137869 269330 -79616 -16273 -219776 -83418
18655 337267 238619 36994 42901 5133 -249861 -251623 -242984 -21107 -155315 50820 -74170 -194165
18643a94165R555E1243d430j17939a6276k06207h1897a6342D0754f0046O538D539
18630c7071B01920E780g7032r0389n0187C1679b16740d0365E755b52264g824k686
18618a0510q2602A11394L1591J96512a08660c7465j32924A15951l2456a74142
18607I5122a10002j33920E9873d559k25963j6937h341B4063d5045C52272a4714
18595I9796a54907a1760H4766a15785K0175K7657j69573J726B01014b29971i1618
18583c82985d9056k12870a14414o4209B11293i9534E6336b1485A32493o1314b22020
18571C3020M4259b83056O1077R471B46921i4939n5254A16183a63340k39292A50064
18559B38953a0187A09710b55261D0295f3472l17505J55412a2421k71709A04650
$$ plain form
18643 -194165 -184610 51243 -4430 -122369 -16276 -222483 -81897 -16342 40754 -60046 -53508 4539
18630 -37071 201920 5780 -77032 -167421 -217608 31679 -216740 -40365 5755 -252264 -7824 -10510
18618 -10510 -93112 111394 142985 339497 -108660 -37465 -170389 115951 83495 -174142
18607 95122 -110002 -243922 59873 -4559 -230522 -247459 -8341 24063 -45045 352272 -14714
18595 99796 -154907 -11760 84766 -115785 -95610 -67953 -237526 -235800 201014 -229971 -91618
18583 -382985 -49056 -261926 -114414 -178623 211293 -99534 56336 -21485 132493 71179 -222020
18571 33020 77279 -283056 -221979 -212508 246921 -94939 -150193 116183 -163340 -402632 150064
18559 238953 -10187 109710 -255261 40295 -63472 -380977 -225565 -12421 -284130 104650
18548A24417Q2956O0397a83417k308M2320A60481F5528f9407K9603p1961j94276
18537c06041b0828A12603n0777a9317H0810c37772c0567m7744l15741i6145N189
18526i0956j8646d6383B33285c37099A16841n3687a89894P5776M9430D6600J18426
18515A65026J4428b41257A24023h6847A06121b48945h4733d2100q9130A72998
18504a98620G9993R7672c08705F2478b12715L6121B22307A4708b0820E2352K12865
18493B65217e4180k3766c4961j60791l701p2248N9840g2994C9237c5693k59694
18482b95387j0954A10624c18981g3434j73472D7251c1872A71175J58174i4530
18471d2615n962B7280c9802A41120a1509k38490g8397a2937j76925d7023A9832
$$ plain form
18548 124417 207373 267770 -183417 -185725 -143405 160481 65528 -69407 -39804 -111765 -306041
18537 -306041 -20828 112603 61826 -19317 80810 -337772 -30567 -78311 -394052 -96145 -90956
18526 -90956 -109602 -46383 233285 -337099 116841 63154 -189894 -114118 -64688 46600 165026
18515 165026 179454 -241257 124023 -86847 106121 -248945 -84733 -42100 -131230 172998
18504 -198620 79993 177665 -308705 62478 -212715 -176594 222307 14708 -20820 52352 265217
18493 265217 -54180 -77946 -34961 -195752 -199453 -271701 -211861 -72994 39237 -35693 -295387
18482 -295387 -306341 110624 -318981 -73434 -246906 47251 -31872 171175 329349 -94530
18471 -42615 -48577 27280 -39802 141120 -11509 -249999 -78397 -12937 -189862 -47023 19832
18459A20961c22162f7156B69303b23369G2761E656b5081k63624f3712B03607a33240
18447G2787J70085j11799e86l18081a07886D0424b93334h2200k15363J4866j1885
18436b94582A51224e0548J7575H5198b1071E1518P5166a10824B09020a0213A68394
18424c37296A15260R0376b60863R2910A02887J20222E876b60648A9561f484l8163
18413d4647F9473k5336K08160h1270n0403M3074A18336D4719K31198e5268a5290
18401c1884B2568J7196c8411m2365A00903a40965l47633c4142A13886i1742A49896
18389c11782J32588r2k0155A49053b55577A27843c2162F0181c54547a03477A16703
18377i4632I4497j6971O5337P0982d9451k202E7885B8467Q7410J20453d7388j48618
$$ plain form
18459 120961 -322162 -67156 269303 -223369 72761 5656 -25081 -288705 -63712 203607 -133240
18447 72787 242872 131073 -586 -318667 -107886 40424 -293334 -82200 -297563 -282697 -294582
18436 -294582 151224 -50548 -32973 85198 -21071 51518 126684 -110824 209020 -10213 168394
18424 -337296 115260 205636 -260863 -167953 102887 223109 5876 -260648 19561 -6484 -44647
18413 -44647 69473 44137 252297 -81270 -131673 -88599 118336 44719 275917 -55268 -15290
18401 -31884 22568 39764 -38411 -80776 100903 -140965 -488598 -34142 113886 -91742 149896
18389 -311782 -179194 -179286 -199441 149053 -255577 127843 -32162 60181 -354547 -103477 116703
18377 -94632 94497 77526 142863 213845 -49451 -51653 57885 28467 115877 236330 -47388 -196006
18365a96006B99270I8279k545j59K90804d689r1268A21579c744j37108A57112
18353i2067B32608a04265K5052H007c4230C3364f3567r3015C663d34088i2420
18341A09928K54743B8558a37591L4990m05468e6728l51923A76974G1564b74668
18330d27351I8025a16878A95296F6693J2565b7836j14980J4849C8400A3475a50636
18318c26998D7425i417l22409d2078l4945B74161C3597a27546B8117J8151b17306
18306I6577d227k06311f4272A78918o2639b55503D4878k1077b72468C7395d73870
18294b53676a430l50992A1352K40613b25402P3130d1778B00743b84109n3281a43129
18282a43816a5110k79454A82022C6290b13078G2502f0256b156k16042C23345Q3400
$$ plain form
18365 -196006 299270 98279 95734 95575 386379 -4689 -95957 121579 -3744 -140852 157112
18353 -92067 232608 -104265 -79213 8007 -34230 33364 -63567 -156582 3663 -434088 -92420
18341 109928 364671 28558 -137591 -102601 -508069 -56728 -408651 176974 71564 -274668
18330 -427351 98025 -116878 195296 66693 79258 -27836 -142816 -127967 38400 13475 -150636
18318 -326998 47425 -9417 -331826 -42078 -77023 274161 33597 -127546 28117 46268 -217306
18306 96577 -4227 -210538 -64272 178918 116279 -255503 44878 23801 -272468 37395 -473870
18294 -253676 -1430 -352422 11352 251965 -225402 -152272 -41778 200743 -284109 -337390 -143129
18282 -143816 -15110 -294564 182022 36290 -213078 72502 -60256 -2156 -218198 323345 406745
18271D06745b0953N943D49387e5149A66154b49216L8187A07046i9465k23513e3502
18259a81732P4423d2620A20510i3825F3703c8572j55906d6007A88089D5939h0188
18247B7539K73519a68430B33809g7337A21342a24141A26242J2602f3743H2241
18236A83150a03868l04487i0061p5299A24349k8634a12840k89909A02299d5633
18225a57145G0694b04375A81958b47729f5885A89086E4415k6672F328a15489b1312
18213a17003K1084A3305P3968D43K25023b87285I0779J66040c9105H0567b20073
18201f4401D1035a49763J4480l23746A8765J19776a40058f4365B52397a07586
18190H9836k3632a4561E79525D2205b71917J00893N3816l5768L2561A2004N2357
$$ plain form
18271 406745 -20953 -15010 449387 -55149 166154 -249216 -211029 107046 -99465 -322978 -53502
18259 -181732 -107309 -42620 120510 -93825 63703 -38572 -194478 -46007 188089 45939 -80188
18247 27539 301058 -168430 233809 -77337 121342 -124141 126242 138844 -63743 82241
18236 183150 -103868 -408355 -90061 -165360 124349 95715 -112840 -402749 102299 -45633
18225 -157145 70694 -204375 181958 -247729 -65885 189086 54415 27743 6328 -115489 -21312
18213 -117003 -95919 13305 87273 443 225466 -287285 90779 256819 -39105 80567 -220073
18201 -64401 41035 -149763 -135283 -459029 18765 138541 -140058 -64365 252397 -107586
18190 89836 66204 -14561 579525 42205 -271917 -171024 -117208 -152976 -120415 12004 64361
18179F4361a25917k17183a11963n2619P8178d0439B33524c25737O2939C62669
18168C095J84406b25854M9697G4981b32149g9989C31452b0624A54471k5507o1325
18157F7639f6605E3295b41265A1581a49394J4086I7019a80549j72240D2213J24333
18146A66546a53988N470O9604B63369a6888p1232I2594b10970D928J13931C6418
18134a76669c1973D3763d4719j4385I1474B2282b83426A53202a44223J6929p53
18123a28047A43117i5858j11820p4251a29973B92514m5084H2263a05995A49806
18112d09169H1983d8359M148F0216b8602k19070C5074K47075b3268d045E2928
18100B34758l5563C7688J02054a79362B63859E9336a22334b3246A03562J98435
$$ plain form
18179 64361 -125917 -343100 -111963 -164582 -86404 -40439 233524 -325737 -262798 362669
18168 3095 187501 -225854 -176157 74981 -232149 -79989 331452 -20624 154471 128964 67639
18157 67639 -66605 53295 -241265 11581 -149394 -135308 97019 -180549 -352789 42213 166546
18146 166546 -153988 -148518 -78914 263369 -16888 -88120 92594 -210970 4928 118859 36418
18134 -176669 -31973 43763 -44719 -59104 91474 22282 -283426 153202 -144223 -127294 -128047
18123 -128047 143117 -95858 -207678 -281929 -129973 292514 247430 82263 -105995 149806
18112 -409169 81983 -48359 -44211 60216 -28602 -247672 35074 282149 -23268 -4045 52928
18100 234758 199195 37688 139742 -179362 263859 59336 -122334 -23246 103562 301997
18090C01997c15130A12039J13047b38665i9346m6629A4640J71568a58904d8530
18079c3523k51886d7939C30641A01983a32058B3209a30241D06J91387a02866F4128
18067F4008a95120f5424k33913Q2221D45398b71147J19310A89716c94173a96773
18056a5585k00667h502k39063J6033a3208o4256k84159f9647K0407f074A7460
18044a70152j04086B07906F5151I099J40057a66798M3982c5011A63157M8995b8331
18032c8533B39855A5998K06822b474j28892A94283p1475L6120c48623A18911D2526
18020b0964A16713J33755f703n6344C903a08140J5309a9317k0248n1113c2028
18008F1601a78825K9501L965m3311k45761D6850a58l87831D4234K0276K00185
$$ plain form
18090 301997 -315130 112039 225086 -238665 -99346 -145975 14640 186208 -158904 -48530
18079 -33523 -285409 -47939 330641 101983 -132058 23209 -130241 406 191793 -102866 64128
18067 64008 -195120 -65424 -299337 -217116 445398 -271147 -151837 189716 -394173 -196773
18056 -15585 -216252 -8502 -247565 -231532 -13208 -77464 -361623 -69647 -49240 -6074 17460
18044 -170152 -274238 207906 65151 9099 149156 -166798 -122816 -35011 163157 212152 -28331
18032 -38533 239855 15998 222820 -2474 -131366 194283 122808 158928 -348623 118911 42526
18020 -20964 116713 250468 -6703 -63047 3903 -108140 -92831 -19317 -39565 -90678 -32028
18008 61601 -178825 -149324 -145359 -188670 -434431 46850 -158 -387989 44234 64510 264695
17997B64695f6238B0667e0454j11026j51858C40975c19960a46455E4322b05524
17986a22478B50444G9179a84609N2473C813a13761a5342A88924c0371m05970J72421
17975b63920f4445B7488a87133g8585l7082p6369O1351K1594k06705G1866c19926
17963d33840b10141F3803g8759a4243A76436K29268c8724C3105b07785B7638a23461
17951a64344A28899c45247A8765P7735J47905b42218e6575k67154e1972K4517
17941b7455h769B1179a39458B13690c5282j25246A36711a57574I159N0641a85289
17929D4572a58023F3033J36572a98085E5365c4234H3760c0018A41479Q895L3580
17918A83954b07674H9373h1572E1556i4198R639L2727o1704L0834E481K23159
$$ plain form
17997 264695 -66238 20667 -50454 -161480 -313338 340975 -319960 -146455 54322 -205524
17986 -122478 250444 79179 -184609 -132136 3813 -113761 -15342 188924 -30371 -436341 -263920
17975 -263920 -64445 27488 -187133 -78585 -115667 -192036 -130685 -109091 -315796 71866 -319926
17963 -433840 -210141 63803 -78759 -14243 176436 405704 -38724 33105 -207785 27638 -123461
17951 -164344 128899 -345247 18765 96500 244405 -242218 -56575 -323729 -51972 -27455
17941 -27455 -8769 21179 -139458 213690 -35282 -160528 136711 -157574 9159 59800 -185289
17929 44572 -158023 63033 199605 -198085 55365 -34234 83760 -30018 141479 150374 183954
17918 183954 -207674 89373 -81572 51556 -94198 -84559 -51832 -113536 -82702 5481 228640
17907B28640A1174i2459e910B75406B2500a90360C0541b42665G1393b49138m4164
17896b93302J40919a0494A49068d42621B50207E8924M6491a16604E5078a28190
17885A44905R9644i9530B24710m9300q7119K75328A0735M3630K72449F3968a60175
17873a39839A7102d2173G8182a52458M1872K3421k6021F7541q195N3355a81871
17861A96518Q532d2734C8041G248L15571E8840c20372B8383d0322r98A75439a95440
17848c16027d4329H3079a80769G1879a88409f0341A21163g7556C8851b26077c0940
17836D14746d4793A81108l9631k8180D0349P8932a97641c3919j56928f6820A26409
17824B03340L9129q0034h9143B94373d2970A8479c4083k46200d3853B82611A30066
$$ plain form
17907 228640 11174 -92459 -5910 275406 22500 -190360 30541 -242665 71393 -249138 -293302
17896 -293302 -152383 -10494 149068 -442621 250207 58924 105415 -116604 55078 -128190
17885 144905 244549 -99530 224710 175410 88291 363619 10735 54365 326814 63968 -160175
17873 -139839 17102 -42173 78182 -152458 -110586 -87165 -113186 67541 59346 112701 -181871
17861 196518 205050 -42734 38041 7248 322819 58840 -320372 28383 -40322 -41320 175439 -195440
17848 -316027 -44329 83079 -180769 71879 -188409 -60341 121163 -77556 38851 -226077 -30940
17836 414746 -44793 181108 141477 113297 40349 119281 -197641 -33919 -190847 -66820 126409
17824 203340 242469 162435 -89143 294373 -42970 18479 -34083 -280283 -43853 282611 130066
17812a69685h156k16543b9350k00340E7983c52238a2716A7838O170J41519a00761
17800A01030C4385a64930p6154H3843f5530j77815a01101B8919g0103B10203e2009
17788A44728a53932K1205A29421k4957d6989A18156n943b26429c5643E1682b39403
17776h652F18f9294B69410a08512H2373J40287B0699Q9157g7641l2505A44798
17764A2577a2145A10091R897B7850K25469c21349g2472A49786h3638k2983d9516
17752B60149h16o0070A75929i6730A97632m1787J77470F6376k9494b85478A99061
17740C84868B8000b08207d6686A9563a67221B21039H5943a3262j3865l9114H7398
17728b0668j51982r3391Q0557A11361a58853F999i126p9970D137J4954K38404
$$ plain form
17812 -169685 -8156 -224699 -29350 -229690 57983 -352238 -12716 17838 24008 165527 -100761
17800 101030 34385 -164930 -241084 83843 -65530 -243345 -101101 28919 -70103 210203 -52009
17788 144728 -153932 -132727 129421 104464 -46989 118156 112213 -226429 -35643 51682 -239403
17776 -8652 618 -69294 269410 -108512 82373 222660 20699 109856 -77641 -110146 144798
17764 12577 -12145 110091 119988 27850 253319 -321349 -72472 149786 -83638 -106621 -49516
17752 260149 -816 -60886 175929 -96730 197632 155845 333315 66376 36882 -285478 199061
17740 384868 28000 -208207 -46686 19563 -167221 221039 85943 -13262 -27127 -66241 87398
17728 -20668 -172650 -266041 -185484 111361 -158853 6999 -9126 -89096 4137 19091 257495
17717B57495m5166C9832Q0476c24369J06166A39913R0474a24733B46887H3431
17706A42965b1496E1403a95438A72883f6624A09099J17301f6078B73667A10709
17695D4052J19059o3065f2864k2772J9734B34269a09889d1958j60983A82453F1480
17683A49974L2738a80482g7843A46017g4398d116j84964C2194b29621H1702a57196
17671A20113a9690F6755J09620a8552o0014j58329B25928C1022d555B12477L9962
17660B52439I4933i5507B25860a28638k2903k9542G2776A7068p146J81410b25127
17648G3914b13170A33569J41292A18350P5503b19958r0412A82726b11979r3567
17638c05546A13907J0090K0099D2672J77216a11058q3054I1821K38085f2521A84878
$$ plain form
17717 257495 212329 39832 120308 -324369 -218203 139913 230387 -124733 246887 83431
17706 142965 -21496 51403 -195438 172883 -66624 109099 226400 -66078 273667 110709
17695 44052 163111 100046 -62864 -85636 -65902 234269 -109889 -41958 -202941 182453 61480
17683 149974 182712 -180482 -77843 146017 -74398 -4116 -189080 32194 -229621 81702 -157196
17671 120113 -19690 66755 176375 -18552 -78566 -236895 225928 31022 -4555 212477 252439
17660 252439 94933 -95507 225860 -128638 -151541 -181083 72776 17068 9922 191332 -225127
17648 73914 -213170 133569 274861 118350 193853 -219958 -310370 182726 -211979 -305546
17638 -305546 113907 123997 144096 42672 219888 -111058 -194112 91821 329906 -62521 184878
17626b6660C81514b43395A04933a5650B64954D1196a90979a1955A51720a7861
17615g2724B2354b18083A1013b95316F3453e3399K6251A77600J20070G1969b86947
17603D582a24514A47142G3046J96375b35144l4122g3288B34442H3858i792n4829
17592f4621L1110l7561a8618C1064J61664A1744D193J81111L4935b75468J15320
17581a60148B39596b84394A62689A4744a14804I3190d648G3148P9807L05989b48268
17569C43935j49001N5409a55037j06897Q214R0912H5732K9922a1803l9108E3597
17557b34591B9034e9301B32197a5340A79236f5504H3378N2866O5591n9529L4650
17546A76956C1668b35897D34289a81428A82644g6289j15670B44533j1134E4154
$$ plain form
17626 -26660 381514 -243395 104933 -15650 264954 41196 -190979 -11955 151720 -17861
17615 -72724 22354 -218083 11013 -295316 63453 -53399 -27148 177600 297670 71969 -286947
17603 4582 -124514 147142 73046 269421 -235144 -269266 -73288 234442 83858 -9792 -64621
17592 -64621 -33511 -71072 -18618 31064 192728 11744 4193 185304 220239 -275468 -160148
17581 -160148 239596 -284394 162689 14744 -114804 93190 -4648 73148 152955 458944 -248268
17569 343935 194934 250343 -155037 -261934 -253720 -162808 85732 115654 -11803 -50911 53597
17557 -234591 29034 -59301 232197 -15340 179236 -65504 83378 136244 201835 142306 176956
17546 176956 31668 -235897 434289 -181428 182644 -76289 -191959 244533 233399 54154
17535B01123a26465M6506c1535A62352G9774L55126A6302N9822a37538A34913
17524B61452E9919a52435A33399E5841i2291A15629J04945F9816J8852N8426A4020
17512B30399O2926o5533f9700A07826J61413N8867C2622O7111d3576E4909N8525
17501A13434K33767m8393I9542O8875j3331C74J85846K0414a02561L9622j818
17490f4757p9278G3664J20929g5435L3815A69450J27071H2552l7702N0911Q2174
17479A77935O5045j16467J50119C8720J97581n2510J07749k2931r8515Q1387D8838
17467C20711A41278N889b9859A19821K27509e3043D1224R7885c61588C40236a59549
17455A40002R957J31774a17328D62457A71641m233k3242J69804k2266r2788J33337
$$ plain form
17535 201123 -126465 -79959 -31535 162352 79774 434900 16302 76124 -137538 134913
17524 261452 59919 -152435 133399 55841 -92291 115629 220574 69816 88668 147094 14020
17512 230399 293325 227792 -69700 107826 269239 328106 32622 99733 -43576 54909 113434
17501 113434 347201 298808 99542 168417 155086 374 186220 206634 -102561 -62939 -64757
17490 -64757 -144035 73664 194593 -75435 -41620 169450 296521 82552 44850 95761 177935
17479 177935 242980 126513 276632 38720 236301 183791 291540 268609 170094 251481 48838
17467 320711 141278 147167 -29859 119821 347330 -53043 41224 139109 -361588 340236 -159549
17455 140002 149959 281733 -117328 462457 171641 167408 144166 313970 291704 198916 332253
17444C32253j49228o7303J24646a49130C27621R3007b57382A58289K6718N7120
17434B42127H4903L1446a85876A9984L46983F4823P2519a75809A98533I4504J90138
17423B84642c4124D69346B15305D5717K92423K169j25352N5030A13508b638m3946
17412d6584C12249j52296J95286E6106L0044L54686H7732M3016Q1448G8843a91415
17400G0550O9474C3269b50608E96786B28745C1675a20918A46399L73868A3630
17389B91055O3582A66783n7030p73J15068D6371I371L5461M70563B1598b3128
17377d599B43621K01951d3427A80484D1383J05581N8795M9113H5108J29392c5074
17365B68518a19450I9783C2432j0566J02253L33168F2278J93079q0603F3384J87708
$$ plain form
17444 332253 183025 115722 240368 -149130 327621 420628 -257382 158289 185007 242127
17434 242127 84903 116349 -185876 19984 366967 64823 137342 -175809 198533 94504 284642
17423 284642 -34124 469346 215305 45717 338140 340309 214957 269987 113508 -2638 -46584
17412 -46584 312249 159953 355239 56106 86150 440836 87732 130748 212196 78843 -191415
17400 70550 140024 33269 -250608 596786 228745 31675 -120918 146399 520267 13630
17389 291055 354637 166783 109753 108980 224048 46371 9371 44832 515395 21598 -23128
17377 -4599 243621 445572 -43427 180484 41383 146964 205759 254872 85108 214500 -35074
17365 268518 -119450 99783 32432 21866 124119 457287 62278 255357 174754 63384 251092
17354B51092j08195n6087K11468d0026r0168b0151C28842c0183e818D62351A78144
17342B49622N5473H0211J36323l5003G916e5210H5293J9014k8623J06380R6170
17331B78234f9581A41206D7604a1854F5197a42128A29303J19046G459b09978A85596
17319f5778D3710M8973K45345A47096J87689B4174J94612K69173b26888K5917
17309b00971A33280K32560j17053L98360a67515A05503J08776i0608B93963F8612
17298D06455j70339G6779o152J40602B1117O28670E4177a14038E82755a08407
17287A25733K65814j0896j01643n1974c0507q3234M3455A38954K52799N9341a24313
17275B11434I6904a01788b4059B68583A24074k8692k7281O0341a73403A1551K02720
$$ plain form
17354 251092 142897 86810 298278 -40026 -130194 -20151 328842 -30183 -5818 462351 178144
17342 249622 305095 80211 216534 181531 7916 -55210 85293 104307 75684 182064 278234
17331 278234 -69581 141206 47604 -11854 65197 -142128 129303 248349 7459 -209978 185596
17319 -65778 43710 92683 338028 147096 334785 24174 218786 487959 -226888 -200971
17309 -200971 133280 365840 248787 647147 -167515 105503 214279 -90608 293963 68612
17298 406455 236116 76779 70627 211229 21117 649787 54177 -114038 582755 -108407
17287 125733 391547 380651 279008 227034 -30507 -113741 -70286 138954 391753 451094 -124313
17275 211434 96904 -101788 -24059 268583 124074 95382 68101 128442 -173403 11551 214271
17264B14271J28208j63153J95981A44334A4943J28904R1884K02635j07726d558
17253A50846j1748F4961L8185L5491c2515B29380b47693B20193c0405A30467E3740
17241b6093B04019m5028L0256J07849N3246m0081n7632j15528B6866J44532M81
17230A71879L1452L77208B41805R4685n542A17540B5756Q2757B9697i498p2122
17219h1620D65213j55840R2894r5597A6262J12025a22904G3070A8977J44103M14619
17208E77699a71831B55873l9009P9551p0658f6178B25687K96500A90290J28998
17198C19288E2001P1238J25211j4937n6051O6012J3415j19546h5965B31562i0641
17186D47039o4801A82152j6890O2136J23189a57768C06374N2028E7536K29053
$$ plain form
17264 214271 342479 179326 375307 144334 14943 143847 235731 438366 330640 -4558
17253 150846 139098 64961 103146 138637 -32515 229380 -247693 220193 -30405 130467 53740
17241 -26093 204019 158991 189247 297096 350342 310261 252629 137101 26866 171398 171879
17230 171879 203331 580539 241805 336490 330948 117540 25756 108513 29697 -9498 -81620
17219 -81620 465213 309373 402267 306670 16262 128287 -122904 73070 18977 163080 577699
17208 577699 -171831 255873 216864 296415 225757 -66178 225687 522187 190290 319288
17198 319288 52001 123239 248450 233513 177462 243474 256889 137343 -85965 231562 -90641
17186 447039 382238 182152 165262 227398 350587 -157768 306374 358402 57536 286589
17176B86589K13367J19038B70127j21594L6877J02424J6409C9858R7747J80984
17166C18589R0155j75942r9688m5417K25549E7427K36902A4398J79064l695c134
17154A57134O1163H1826J53695O7695m7765J38159A14104K67858m3710o8018n0395
17143B19839n3771D8204J73332L62396B06389L0118L32586j82900P8751j35997
17133C28947r9280K77183B16375n0785P9718N81768B30227J83589A51658K45571
17123C97229j63367J53978F9761M59245j34799L6098i9360B73176J39379K41317
17113F53872K1025C00646K56991k51716o3487J25426K24182j15668Q2888k60805
17103B98457J4897k6980J06873H2006j3583N56114p9024j79641k3483m7027J03839
$$ plain form
17176 286589 499956 618994 270127 148533 185410 287834 304243 39858 137605 318589
17166 318589 408744 232802 133114 87697 313246 57427 294329 14398 193462 189767 -3134
17154 157134 218297 81826 235521 303216 255451 393610 114104 381962 338252 270234 219839
17143 219839 166068 48204 221536 583932 206389 236507 569093 386193 464944 328947
17133 328947 229667 506850 216375 165590 245308 827076 230227 413816 151658 397229
17123 397229 233862 387840 69761 529006 394207 430305 -99360 273176 412555 653872
17113 653872 674897 300646 557637 305921 242434 367860 592042 476374 559262 298457
17103 298457 313354 286374 393247 82006 68423 624537 545513 365872 342389 295362 399201
17092C99201m4029A01183O3391J90036L54461B82329K75433j75635j09256K91471
17082E64342Q9307j09455j86748A43157K89778k00225K60762A94514J13107K02474
17072E10095k25361K28661q1168M9630j40043M24332l51892J7459J3221J12546
17062E57480j87266j63C5219K27653n9390K41705L15349k22005r0822L78264l79297
17051D46676j70168J10348M13554C79129K39676j73990M54134k73479J27905l62287
17041C91088J13994A91574N39428l22447K17266j95442L27562k13783n4461K28236
17031G17933j46521l2141L1244r5692m5926L48449C86777K03872n90J03918j72816
17020E21161P2239J13932O6291J15256l39967l6941L60024Q740M2171k95604j67150
$$ plain form
17092 399201 355172 101183 164574 354610 709071 282329 557762 382127 272871 564342
17082 564342 653649 544194 357446 143157 432935 232710 493472 194514 307621 510095
17072 510095 284734 513395 432227 481857 341814 766146 414254 431713 444934 557480
17062 557480 370214 370051 35219 262872 203482 445187 760536 538531 447709 825973 446676
17051 446676 276508 386856 800410 379129 618805 444815 898949 625470 753375 391088
17041 391088 505082 191574 731002 408555 625821 430379 757941 544158 489697 717933
17031 717933 571412 539271 570515 474823 428897 777346 386777 590649 590059 693977 521161
17020 521161 593400 707332 773623 888879 548912 511971 871995 880735 922906 627302 460152
17009D60152k5592K60110k31262j18017L35763k1189k63264M80655l81427K09698
16999G05627k06261J98521j62072K62423k35669J38094L03867j33454k25049K72382
16989I18409n725K4094m04274K87092k76371L70037J48209n19396M53647m26482
16979E69240K10103j79J62184J96223m54250O8511o9935J93740J04135O0668p861
16968A032579k60029k7603M98301l55480m02115N25080L74545n02237L52929k21965
16958A014005p3152J70877j16451k4432k63152L88038K09942m02314K67325D54546
16947F82837L81940l785J50112l19730L06591k4549k13707K59839k15877j4077
16937I89594J16363J83556J81989n39916K81054j20331k02991L12428J39435m77204
$$ plain form
17009 460152 434560 694670 463408 345391 681154 659965 396701 877356 495929 705627
16999 705627 499366 697887 535815 798238 562569 700663 1004530 871076 646027 918409
16989 918409 912684 936778 532504 819596 543225 913262 1061471 542075 995722 569240
16979 569240 779343 779164 941348 1137571 683321 751832 681897 875637 979772 1040440 1032579
16968 1032579 772550 744947 1243248 887768 485653 1010733 1385278 883041 1235970 1014005
16958 1014005 940853 1111730 995279 970847 707695 1095733 1305675 903361 1170686 454546
16947 682837 1064777 1060992 1211104 891374 1197965 1173416 959709 1219548 1003671 989594
16937 989594 1105957 1289513 1471502 931586 1212640 1092309 889318 1201746 1341181 863977
16927H63977M52733K2368n5208k9972J57044l17665K12796L438q67n0521K78026
16916A536149l52591J86291K64366j54745R7959q4828k49188L15620j82107P4439
16906A451365J49768m9651k67948N97027n7296k38529j36008J79143M1987j42642
16896A527216L68943l64353K95339l736o5319J89690J8600k7692L7386k57780
16886A718294Q4567J960J2910N3007N63256j54918J45936l43728M45975l23042
16876B204217P1065l08385M19650O0590j52264K07431Q4009M975k87557L05169
16866B608900k02075J9164K45294k09971K13318J78557j49340l2191K8296P9543
16856B779495n0841K15075R3160l37790J82185R0986L9247O3201J45695K28336
$$ plain form
16927 863977 1316710 1339078 1283870 1253898 1410942 1093277 1306073 1309511 1308644 1258123 1536149
16916 1536149 1183558 1369849 1634215 1479470 1577429 1492601 1243413 1559033 1376926 1451365
16906 1451365 1601133 1551482 1283534 1880561 1823265 1584736 1448728 1627871 1669858 1527216
16896 1527216 1896159 1531806 1827145 1823409 1758090 1947780 1966380 1938688 1976074 1718294
16886 1718294 1802861 1804821 1817731 1870738 2433994 2279076 2425012 2081284 2527259 2204217
16876 2204217 2275282 1966897 2386547 2447137 2294873 2502304 2586313 2591288 2303731 2608900
16866 2608900 2406825 2425989 2671283 2461312 2674630 2853187 2703847 2671656 2699952 2779495
16856 2779495 2728654 2943729 3036889 2699099 2881284 2972270 3011517 3074718 3220413 3448749
16846C448749j12550j75264K49775k3633K9307j0720K65525j15517J40974j06988
16836C589658J80464j61407O93143o08734N20836l06261M36994m3226K71150j86820
16826D385797J94477M6578K43039k03595J30092J84712L6323j81612L99253Q3458
16816E318522L68560r4983L15255j55108J45637l470M5581K86549l1056K59078
16806F454565N34713k45206P7321O5558J33427K07363K7659L20759L49001J31687
16796H056847K23242L11915L54582j85050K94705J42798K56783M47310J95072
16787A0098204o1454K20246L42144K47198L08417M39351N92951J30810M48591
16778A2766458J56572M95146O64078J91210L73585L32142P75279K79646M68287
$$ plain form
16846 3448749 3336199 3160935 3410710 3387077 3416384 3405664 3671189 3555672 3696646 3589658
16836 3589658 3770122 3608715 4301858 3693124 4213960 3907699 4344693 4301467 4572617 4385797
16826 4385797 4580274 4626852 4869891 4666296 4796388 4981100 5017423 4835811 5235064 5318522
16816 5318522 5687082 5592099 5907354 5752246 5897883 5894413 5939994 6226543 6195487 6454565
16806 6454565 6989278 6744072 6821393 6886951 7020378 7227741 7255400 7576159 7925160 8056847
16796 8056847 8280089 8592004 8946586 8761536 9056241 9199039 9455822 9903132 10098204
16787 10098204 10036750 10256996 10599140 10846338 11154755 11594106 12187057 12317867 12766458
16778 12766458 12923030 13418176 14082254 14273464 14647049 14979191 15754470 16034116 16502403
16769A6502403P72458R1908J009616P94411Q69557L52342R80095O05907J076697
16760B3055394M14784J158795R86346J168751J200192N72941J337532J425861
16752C1320596J583003J178657J987005J085599K114241J976296J801643K359807
16744D5406847J850956K438971K656342K586492K949693L565725L186646L647195
16736F8288867L876983M311191M512554M721183N192491N027519N739698O244329
16728A07914815O335889O705182O743357P351210P160346P067318P420255O723733
16720A63422105O575939N906913N297867M369259L136455K341127Q97806j80795
16712A91766676j572871k742981l951969m708920n579779o462253o565269o966499
$$ plain form
16769 16502403 17274861 17366769 18376385 19170796 20040353 20392695 21372790 21978697 23055394
16760 23055394 23470178 24628973 25615319 26784070 27984262 28557203 29894735 31320596
16752 31320596 32903599 34082256 36069261 37154860 39269101 41245397 43047040 45406847
16744 45406847 47257803 49696774 52353116 54939608 57889301 61455026 64641672 68288867
16736 68288867 72165850 76477041 80989595 85710778 90903269 95930788 101670486 107914815
16728 107914815 114250704 120955886 127699243 135050453 142210799 149278117 156698372 163422105
16720 163422105 169998044 175904957 181202824 185572083 188708538 191049665 191947471 191766676
16712 191766676 190193805 187450824 183498855 178789935 173210156 166747903 160182634 153216135
16704A53216135p210617p823268o950422p254091o830520o960400o139415o049507
16696I7997895n660393n353272n032583n023735m226795m289230l582693l536898
16688F1292296l481991l436888k897620k523228k630963k191012k072014j936122
16680D0122458k320853j831960j744420q28938j946840r48790j376055j652172
16672B7472430j007809j283980q34403j092561j092441o09525j021488n13754
16664B0016469o82641n16181q02829j179506j70689o90585p09409m46401l58470
16655A4459758n46204m07219m82844l48034m29370k58110l53761j39774l37906
16646A1156536j62450p06758l17007l54506k60580k38801q272j14939k61920j20027
$$ plain form
16704 153216135 146005518 138182250 131231828 123977737 117147217 110186817 104047402 97997895
16696 97997895 92337502 86984230 81951647 76927912 72701117 68411887 64829194 61292296
16688 61292296 57810305 54373417 51475797 48952569 46321606 44130594 42058580 40122458
16680 40122458 37801605 35969645 34225225 33396287 31449447 30500657 29124602 27472430
16672 27472430 26464621 25180641 24346238 23253677 22161236 21551711 20530223 20016469
16664 20016469 19333828 18817647 18014818 16835312 16664623 15974038 15264629 14818228 14459758
16655 14459758 13913554 13506335 13023491 12675457 12246087 11987977 11634216 11494442 11156536
16646 11156536 10994086 10287328 9970321 9615815 9355235 9116434 9108162 8993223 8731303 8611276
16636H611276m11949l62445k03933P8309k61808o10287K4448m6647J95355n48980
16626F463339k45427n6877k40934J07982l22847L6289j92659j68607j61350l4253
16616E184656m85139K74593k33372n1828j35486j55256J78904J9775l76324J62246
16606D382769l02709Q1053m2701l65172Q9430l7732p5492M6625l38233J25530
16596C563368J1822l79200N58669m48867L11621l45037k2104k4618j13125k25905
16586B886624j5288r7129k25842L38686r8834o7955J73649j58717j31298j00500
16576B503396J78920k00185K37462q5939n49057N67542o25568K31568q4070J35688
16566B309757j08335k38193M98509n27137l0237j73033M26002l22303r4108K57790
$$ plain form
16636 8611276 8199327 7836882 7632949 7711258 7449450 6839163 6863611 6816964 7012319 6463339
16626 6463339 6217912 6161035 5920101 6028083 5705236 5741525 5548866 5380259 5218909 5184656
16616 5184656 4699517 4974110 4740738 4688910 4553424 4398168 4577072 4596847 4220523 4382769
16606 4382769 4080060 4161113 4118412 3753240 3842670 3804938 3729446 3776071 3437838 3563368
16596 3563368 3575190 3195990 3754659 3305792 3617413 3272376 3250272 3225654 3112529 2886624
16586 2886624 2871336 2774207 2548365 2887051 2788217 2720262 2893911 2735194 2603896 2503396
16576 2503396 2682316 2482131 2719593 2633654 2084597 2652139 2026571 2258139 2174069 2309757
16566 2309757 2201422 1963229 2461738 1934601 1904364 1731331 2157333 1835030 1740922 1998712
16556A998712l43189L11861j59594J63230j32482k48484o9614J89697O2308j25719
16546A646726n2747j32616M5116l61045L53517k5609r1710J57021K27505l51426
16536A414732J16034l87796L50233L8342m89311M04826Q0008k73274K32849p6944
16526A409699m79789L69707j31951L97165m41295q1218K1737L96433k12788j91552
16516A056148J32784n9742j7078j68701M0267J91064Q7646l8844j89767J67231
16506A201008l63223N29884m49144P1028j43819M16888j92021j19914k00252N25189
16496A275624n67108J55460j71407K04035l1087l7043D02241L05413K76298j65465
16486H18487L21321l92976O7478l0703M5326j4327k65249J4548J27051L47527
$$ plain form
16556 1998712 1655523 1967384 1807790 1971020 1838538 1590054 1520440 1710137 1772445 1646726
16546 1646726 1593979 1461363 1506479 1145434 1498951 1473342 1381632 1538653 1766158 1414732
16536 1414732 1530766 1142970 1493203 1531545 1042234 1447060 1527068 1253794 1486643 1409699
16526 1409699 929910 1299617 1167666 1564831 1123536 1042318 1064055 1460488 1247700 1056148
16516 1056148 1188932 1129190 1112112 943411 983678 1174742 1262388 1223544 1033777 1201008
16506 1201008 837785 1367669 918525 989553 845734 1262622 1070601 950687 750435 1275624
16496 1275624 708516 863976 692569 896604 865517 828474 402241 707654 983952 818487
16486 818487 1139808 746832 814310 783607 828933 814606 549357 563905 690956 1038483
16476A038483j19758m15286L85984m15408L32854n6314N6314k68301L68296k777
16466I04087q8863l664k66225J07070J55302m2788o8337K9323k42561L98929k55130
16455F27143J62061r6217p1891j48102J72136k38632q4239K56849K74001j63067
16445F90042B23236J12639J54227j0735P1106Q5552o8023M7088j560j33009L43516
16434H24037l34933L90078k79553j51084K33670k91764K26899j3008L6j75340
16424D29038j07434J38748O0034J9931B44369J49220j65392M82077k87710j02888
16414C19676p7633J81297P9045j26968j43676O7655K26641J50728H0773K76673
16404C57446K68067j59905j39674J5736R1411K51526B45924n3114J39162J32458
$$ plain form
16476 1038483 918725 503439 889423 474015 806869 750555 806869 538568 906864 904087
16466 904087 815224 811560 545335 652405 807707 764919 696582 725905 483344 882273 627143
16455 627143 789204 692987 621096 472994 645130 406498 322259 579108 853109 690042
16445 690042 223236 335875 490102 479367 550473 636025 568002 615090 613530 480521 824037
16434 824037 489104 879182 599629 448545 682215 390451 617350 604342 604378 429038
16424 429038 321604 460352 520386 540317 244369 393589 228197 710274 422564 319676
16414 319676 242043 423340 502385 375417 231741 299396 526037 676765 80773 357446
16404 357446 625513 465608 325934 341670 433081 684607 245924 192810 331972 464430
16394D64430m0034k07634l4158J7318J9341q0912J33742a32813A62775M48962
16384F11737H4233K18738Q3627P4078r5222O0751A60482Q5749J48338A68601L69214
16373E37815J47523C38100p6210o5894M54031C02286j42606L37226R3523f0172
16362C17038L3119j30965K96571A99088N6623K62411k22521j20487K04000f3228
16351B67453p7966k4749l0624K28518A25105a09214C17540K6698j14052L07684
16341E37870j89447K73017A78519L61093B24996K6491P9452p4693b76007F42743
16330B81467l3075R839L410n5363H2195J42395I4875K60971l8334n437k4153r9806
16318A88116R3340p0327J19397G5469R2565J58619m2292p6892J0875K28189A98906
$$ plain form
16394 464430 424396 216762 182604 199922 219263 138351 272093 -132813 162775 611737
16384 611737 84233 302971 386598 460676 365454 426205 160482 246231 394569 168601 537815
16373 537815 685338 338100 261890 195996 650027 302286 159680 496906 590429 -60172
16362 317038 350157 219192 515763 199088 255711 518122 295601 175114 379114 -63228
16351 267453 189487 164738 134114 362632 125105 -109214 317540 344238 230186 537870
16341 537870 348423 621440 178519 539612 224996 251487 330939 256246 -276007 642743
16330 281467 248392 258231 261641 206278 82195 224590 94875 355846 317512 312075 287922 188116
16318 188116 281456 211129 330526 75469 168034 326653 284361 207469 218344 446533 198906
16306C64349H3048J06137J16792G4903k8524J5022q25K757J928L92869j85120
16295B73010i514B08601q0028J80595J51114A80980k857J72294C7613K85197A47086
16283D27886C0947L55680j39697l0236b47972D95369j96539H7596K21511q667
16273C00440i874A05065J30868a0568G9950L03504a6908A98470q7808K14151c785
16261A2563L1285J06048a2094B4802h1952D61080b38580A3835K67514j14817a88722
16249B12707c6381C11428a55161A6431f9783b3499A71801J878K01370G0056J5696
16238H5752O7539n21K36911p5144a2250j5986A38294K48188A051b01308i1233
16226B8698d8548E42621A51308g0866A52948i8725a0972B14138d472B1L53728
$$ plain form
16306 364349 83048 189185 305977 74903 46379 61401 60576 63333 65261 458130 273010
16295 273010 -9514 208601 128573 309168 460282 180980 178123 350417 37613 322810 147086
16283 427886 30947 386627 246930 216694 -247972 495369 298830 87596 309107 300440
16273 300440 -9874 105065 235933 -10568 79950 383454 -16908 198470 110662 324813 -3785
16261 12563 43848 149896 -12094 24802 -81952 461080 -238580 13835 281349 166532 -188722
16249 212707 -36381 311428 -155161 16431 -69783 -23499 171801 173679 375049 70056 85752
16238 85752 153291 152770 389681 314537 -12250 -28236 138294 386482 1051 -201308 -91233
16226 28698 -48548 542621 151308 -70866 152948 -98725 -10972 214138 -4472 21 353749
16215C53749H4258J51035c96374C60850i5698A23397M22961A010b09410A8155
16204A2948F69g296k6784B07983G0062a36224I678b5597F7278c13964a04775g465
16191f8272A19303b0260l97l19736B09052l6830J1665k6066E2761R9140K22291
16180C74192G5445K07048c02440E8358M711D787Q1685N4115f8408A30286h521
16168H1967a69236D1024i3841A75750L71981B21934q2687M4538f4530b0123B97349
16156C92425j37012o4382b18738i8351j12590E4750M4907B1887J2743b0722C20997
16144B32763r3161h4931A47767i5298P398B17436A01336A6624C851M9374J53820
16133B07045b88077C21666A00965J39246a14621B71640f3991B53278e591I1728
$$ plain form
16215 353749 84258 235293 -396374 360850 -95698 123397 546358 1010 -209410 18155
16204 12948 669 -7296 -34080 207983 70062 -136224 9678 -25597 67278 -313964 -104775 -7465
16191 -68272 119303 -20260 -20657 -340393 209052 172222 183887 157821 52761 151901 374192
16180 374192 75445 282493 -302440 58358 63069 4787 86472 140587 -68408 130286 -8521
16168 81967 -169236 41024 -93841 175750 547731 221934 139247 183785 -64530 -20123 297349
16156 392425 255413 191031 -218738 -98351 -210941 54750 99657 21887 34630 -20722 320997
16144 232763 139602 -84931 147767 -95298 -87900 217436 101336 16624 3851 53225 207045
16133 207045 -288077 321666 100965 240211 -114621 271640 -63991 253278 -5591 91728
16122b14564J7512D4900i3361B57018h0463o5878f4467A79175B4495K0422J81544
16111B26461l0425F8942K50688a09354A65353C6080J26604J88233a30626A5122
16100B10213a71453a4685B95402Q3443c9461B02339L6881H8865C1257J35593b77535
16088A02959N0926J8138M0365b05415a2157A44310J9203J00830a21644c5656l8677
16077g4333J0940C4049J0159J47925F4594f5043K9321j54325c1784r0616B58409
16065b19495i7041a2866j04636o1099P9526A04389b6674k0929H1239a32979F2157
16053E8258k2381h7606A28333e4083B7043a73169F7583L53887A28421m8570J6611
16042I6462l858Q013J71203d1368j44498g9398I4344a57424A08254d00029d2879
$$ plain form
16122 -214564 -197052 44900 -93361 257018 -80463 -146341 -64467 179175 24495 44917 226461
16111 226461 196036 68942 319630 -109354 165353 36080 162684 350917 -130626 15122
16100 210213 -171453 -14685 295402 378845 -39461 202339 239220 88865 31257 166850 -277535
16088 102959 153885 172023 212388 -205415 -12157 144310 163513 264343 -121644 -35656 -74333
16077 -74333 -63393 34049 44208 192133 64594 -65043 -35722 -190047 -31784 -122400 258409
16065 -219495 -97041 -12866 -117502 -178601 -99075 104389 -26674 -47603 81239 -132979 62157
16053 58258 35877 -87606 128333 -54083 27043 -173169 67583 421470 128421 79851 96462
16042 96462 92604 100617 271820 -41368 -185866 -79398 94344 -157424 108254 -400029 -42879
16030b14523K0936e5141q8634D9734J89642a796r5521C0136R5878B2782a35018
16018A44677b99647C10770d06654B57173o1729l8673d343C649h8592B1453J44812
16007A66265F7698c41849e5945k41292A73676E129L0673a37616K0089B12796C266
15995A09844G707K51383e512k21204C2050a21303B71406C820a21284e7930A29420
15983B96672A17245K12967i6885G3146J49608J08470H7101J79716g0803F8108
15972I9735K84602b4233F3401b7667A19553d2471k22188D4454R8408c7310C4280
15960A84754i0355A03649d04134O195A10069c02958o4934f965l5645C31544c00201
15948H8628k7058M23466d94464P3981E9294L4636l2300f63432d6935k06957Q5015
$$ plain form
16030 -214523 -193587 -55141 -143775 49734 239376 -1796 -97317 30136 126014 22782 -135018
16018 144677 -299647 310770 -406654 257173 195444 156771 -4343 3649 -88592 21453 166265
16007 166265 67698 -341849 -55945 -297237 173676 5129 35802 -137616 -117527 212796 3266
15995 109844 7707 259090 -5512 -226716 32050 -121303 271406 3820 -121284 -57930 129420
15983 296672 117245 330212 -96885 73146 222754 331224 87101 266817 -70803 68108
15972 99735 384337 -24233 63401 -27667 119553 -42471 -264659 44454 142862 -37310 34280
15960 184754 -90355 103649 -404134 -397939 110069 -302958 -367892 -6965 -42610 331544 -300201
15948 88628 61570 485036 -494464 -420483 59294 93930 61630 -663432 -46935 -253892 -168877
15937a68877b5981o2439b9908H1625N569a85599N2753B40889j4115b60814C5202
15925b55923A00981e0059A06873J12139e1033o7487G7685j2004O5997a9643B1862
15913b12345a9207l6963j1851j22059N3816A78704f4025j04812E1793c04241b7557
15901a59970j34926A06892b0697j91728o1400P6788J3831J3197C55865b62777
15890i0503K5449g094o5824A32389N5947D2539f6870b7198C97505F6074J39990
15879B06064A4516a82371a9277H4127i5675r0712A37108b96131E2942L66788d03228
15867b45857C9657G956Q0696P4017a60830j33944R7951F6647a3161A93991H4049
15855A31798D609d05474A88356E9785c31307C69118a12320A57793n7122l2355
$$ plain form
15937 -168877 -25981 -88420 -29908 81625 87194 -185599 -132846 240889 226774 -260814 35202
15925 -255923 100981 -50059 106873 219012 -51033 -118520 77685 65681 131678 -19643 21862
15913 -212345 -19207 -56170 -68021 -190080 -136264 178704 -64025 -168837 51793 -304241 -27557
15901 -159970 -294896 106892 -20697 -212425 -273825 -197037 -183206 -170009 355865 -262777
15890 -90503 -65054 -7094 -72918 132389 188336 42539 -66870 -27198 397505 66074 206064
15879 206064 14516 -182371 -19277 84127 -95675 -186387 137108 -296131 52942 419730 -403228
15867 -245857 39657 7956 88652 162669 -160830 -294774 -196823 66647 -13161 193991 84049
15855 131798 4609 -405474 188356 59785 -331307 369118 -112320 157793 100671 68316
15845F8316b9516H0802a07489k54902J23497D9037a53861F7949g9402A08055i1761
15833G8569a58281A47814e8531a9163k45414B12864E2324b74125K0115Q8819E6276
15821A83389A4683a33943A51349A6865a8784H0535i1611d4852j24328c7161A38002
15809a51847l5029d1591B69367A03529M9959J53985D8076k698b90818d8292l3654
15798h1946J1519A52425e5844D3224k41h187K80B40666j15523b20223f5632j51680
15786b17312H2793h1296C6648J65882b31533A29865a39256f1466n6718K8920l669
15775i2933r4006H2226M772R7683a9708A86587a23134q2294i197j35510L1513
15764a13194B7826b442j49024G3919A5416L5328L7418J00959q4336Q9739a07031
$$ plain form
15845 68316 -29516 80802 -107489 -362391 -238894 49037 -153861 67949 -79402 108055 -91761
15833 78569 -158281 147814 -58531 -19163 -264577 212864 52324 -274125 -254010 -165191 56276
15821 183389 14683 -133943 151349 16865 -18784 80535 -91611 -44852 -169180 -37161 138002
15809 -151847 -186876 -41591 269367 103529 153488 307473 48076 45378 -290818 -48292 -81946
15798 -81946 -70427 152425 -55844 43224 42983 -8187 -7907 240666 125143 -220223 -65632 -217312
15786 -217312 82793 -81296 36648 202530 -231533 129865 -139256 -61466 -118184 -89264 -92933
15775 -92933 -186939 82226 86998 184681 -19708 186587 -123134 -205428 -9197 -144707 -113194
15764 -113194 27826 -2442 -151466 73919 15416 50744 88162 189121 104785 194524 -107031
15752B22552A09254B2937b79710A68180a50198B04545H9217b24481A10707P1531
15742A82238a36673I5174a21014A02696m5879a63924a511n956A46696f1877A86801
15730e05483J90600A66663a6929A9668K48699b51540G5692b17283a06966d8841
15719B23576A4534c55215d8187A76660h8884A4405L6478c40581f2502C496c48223
15707H3882g0532j86609o7551B2786a22468K1808a2915H3500a60062j14233d8080
15695a22154I2285P4497N1623j4666J38133A21630J95668A09131b94026A90384
15684g7439f336j50059C2719d7383A40004h5207k07363g873j32807j52691F3120
15672A51072b5584H4493M5466l1695b6076n3807j2626j23067a2523H7083a13335
$$ plain form
15752 222552 109254 22937 -279710 168180 -150198 204545 89217 -224481 110707 182238
15742 182238 -136673 95174 -121014 102696 56817 -163924 -1511 -7467 146696 -61877 186801
15730 -505483 -314883 166663 -16929 19668 268367 -251540 75692 -217283 -106966 -48841
15719 223576 14534 -355215 -48187 176660 -88884 14405 50883 -340581 -62502 3496 -348223
15707 83882 -70532 -257141 -324692 22786 -122468 -100660 -12915 83500 -160062 -274295 -48080
15695 -122154 92285 166782 218405 203739 341872 121630 317298 109131 -294026 190384
15684 -77439 -6336 -156395 32719 -47383 140004 -85207 -292570 -7873 -140680 -293371 63120
15672 151072 -25584 84493 129959 98264 -26076 -79883 -92509 -215576 -12523 87083 -113335
15660e99817a83454m959h9451A55699b32197d1485m9074E7813a00043p0391o1134
15649b31568j45880c3055o1217b569B30529A7062K90947B6217J0113J17692b42085
15637A17762O1778a72203A29981R2998e3471p5274k43888G4177L4938e8166q7517
15626a45683o0509B27340K03575a30708F1275g7168A4511g9826l27049d7085j06385
15615a53470A54851J13968J07883D703a94376A82667n6648b12661I9944K5722
15605A25666e1618D8318b70462G9328J50592H0280a80900A32332a6643l4271k67390
15594c18304d3352j37554j36835A17380L913a96648A21217i4184k50804B74507
15583a08846A48464c00724D5126K38076A30153b92280p9308i0180k5127m9665
$$ plain form
15660 -599817 -183454 -188413 -89451 155699 -232197 -41485 -90559 57813 -100043 -170434 -231568
15649 -231568 -377448 -33055 -94272 -2569 230529 17062 308009 26217 36330 154022 -242085
15637 117762 179540 -172203 129981 222979 -53471 -128745 -372633 74177 109115 -58166 -145683
15626 -145683 -206192 227340 430915 -130708 61275 -77168 14511 -79826 -406875 -47085 -153470
15615 -153470 154851 268819 376702 4703 -194376 182667 126019 -212661 99944 125666
15605 125666 -51618 48318 -270462 79328 229920 80280 -180900 132332 -16643 -50914 -318304
15594 -318304 -43352 -180906 -317741 117380 121293 -196648 121217 -94184 -344988 274507
15583 -108846 148464 -300724 45126 283202 130153 -292280 -371588 -90180 -115307 -164972
15573a64972j18420J04064A71213M5294d18062A4932c02228A72883D4488a32805
15562a50976A04070a59220a0866A68366M5579r4574K546K15679D9187l796J60093
15551B05484E7339b1845H8172J77911A09870d6639j87046K6722G7880a9192A35729
15539G4393h0855c6965j33538A03317a6092j78987A28289J50209o4829k3443J7352
15528B07578b46229K4529A74049B7276a77123A59453a58012A5933c8786A32107
15517d722A46263a9386G6333a03108k7078A45498J59021A06055a25126a5567o9478
15506h5045G8104J53246a2479q5216B8247a28241l8391G6551d1368D0431b01362
15494c13545a32811I7213a70881A25079D6131c2450m25282C35575h4688E2377
$$ plain form
15573 -164972 -283392 -179328 171213 216507 -418062 14932 -302228 172883 44488 -132805
15562 -150976 104070 -159220 -10866 168366 213945 119371 121917 337596 49187 45391 205484
15551 205484 57339 -21845 88172 266083 109870 -46639 -233685 -206963 77880 -19192 135729
15539 74393 -80855 -36965 -170503 103317 -16092 -195079 128289 278498 213669 190226 207578
15528 207578 -246229 -221700 174049 27276 -177123 159453 -158012 15933 -38786 132107
15517 -4722 146263 -19386 76333 -103108 -130186 145498 304519 106055 -125126 -15567 -85045
15506 -85045 78104 231350 -12479 -97695 28247 -128241 -166632 76551 -41368 40431 -201362
15494 -313545 -132811 97213 -170881 125079 46131 -32450 -457732 335575 -84688 52377
15483i5366B1278b0484f105B31424g9284j74619F1617Q9274e51228b5439p6118
15472a01557f098A0246i3244I5765a61766J475B75497A18101B6964a966A73066
15460b98655R9081E8089f0762j54253K7506g7379l8246A6950a5337B62974K9672
15449B92646I7733e2283K1924C44949h002l6434A2727N5192e3439A33177J58572
15438B91749e3180j12425A30923a7760j07885a9637A02020b86079A70887L9874
15428B10761k9584a14076a2505r08k96121c8317j17687e3342j71604k7927A10330
15416E7795J79261b48790d4625l8944j6757E5963N5061E1691b68968A15616D4189
15404A03537a78064A8771f9129J3500a2361H8739N8582E6356b24737a08833I6211
$$ plain form
15483 -95366 21278 -20484 -6105 231424 -79284 -253903 61617 150891 -551228 -25439 -101557
15472 -101557 -6098 10246 -93244 95765 -161766 -160291 275497 118101 26964 -1966 173066
15460 -298655 -199574 58089 -60762 -215015 -187509 -77379 -115625 16950 -15337 262974 292646
15449 292646 97733 -52283 -30359 344949 -8002 -44436 12727 67919 -53439 133177 291749
15438 291749 -53180 -165605 130923 -17760 -125645 -19637 102020 -286079 170887 210761
15428 210761 181177 -114076 -12505 -13413 -309534 -38317 -156004 -53342 -224946 -252873 110330
15416 57795 237056 -248790 -44625 -83569 -100326 55963 111024 51691 -268968 115616 44189
15404 103537 -178064 18771 -69129 -55629 -12361 88739 147321 56356 -224737 -108833 96211
15392c7892A24474j8277a68696L0980H78J22502d4415B23585J78464j38740a33782
15380B07832n5638a69011L8526B55764A355i7483j18401G5825A0251J03432e0852
15368G2828J40615e6215j17831E0000a45568B22334r7672c13705a12418D2562
15357A07863b27255H5941a23309d0653p1245C16751e1341l1762A47333a10061
15346B9530a66584D3979A6512c7875k01647d5113E6730j4329J89719F2824b7114
15334A19544i2445A0683b8487A26908J31035a44158e6133A10305n4780J30831
15324A86356c3252I5661O321a71034A6420a57797B62125F3070A9819Q5978m0242
15313F5555P9468a65669A7490L3974d7433B0319c49711a74132j6390c3353B092
$$ plain form
15392 -37892 124474 106197 -168696 -137716 878 123380 -44415 223585 402049 263309 -133782
15380 207832 152194 -169011 -130485 255764 1355 -97483 -215884 75825 10251 113683 -50852
15368 72828 213443 -56215 -174046 50000 -145568 222334 124662 -313705 -112418 42562
15357 107863 -227255 85941 -123309 -40653 -111898 316751 -51341 -83103 147333 -110061
15346 29530 -166584 43979 16512 -37875 -239522 -45113 56730 42401 232120 62824 -27114
15334 119544 -92445 10683 -28487 126908 257943 -144158 -56133 110305 55525 186356
15324 186356 -33252 95661 101982 -171034 16420 -157797 262125 63070 19819 105797 65555
15313 65555 145023 -165669 17490 51464 -47433 20319 -349711 -174132 -190522 -33353 2092
15301H4198J26057j9672b9385F9567a29557C0942J24157F7813b57504g9738n0296
15290a30034I8254J93427a9674C06950c3371j94321C23745a968j26748d8972j42035
15279a91007B70549d0107j15984a8532B00766M7335A07831J738K01967i7181d6246
15267a09441k1299C85401A59370n910J135b3176l3510m5954D23735A16353c5035
15255c779C60084j46636b86697B55251n9868J29021J47154O74082P96926q01496
15245A141070M62033n66525m88340B57679o0477D1052K80576C2934Q735M3599
15235H5268P7648N2333C191Q6486a37440P649b6676A30208a24664B09773c0028
15223b60515a24476A9840J15889D1742a31503A34599C2608c3491A42820g9188
$$ plain form
15301 84198 210255 190583 -29385 69567 -129557 30942 155099 67813 -257504 -79738 -130034
15290 -130034 98254 291681 -19674 306950 -33371 -227692 323745 -1968 -128716 -48972 -191007
15279 -191007 270549 -40107 -156091 -18532 200766 248101 107831 109569 311536 -97181 -46246
15267 -109441 -130740 385401 159370 153460 154595 -23176 -56686 -102640 423735 116353 -35035
15255 -3779 360084 213448 -286697 255251 195383 324404 471558 1145640 1942566 1141070
15245 1141070 1603103 1036578 548238 257679 197202 41052 321628 32934 41669 85268
15235 85268 162916 215249 3191 89677 -137440 -129791 -26676 130208 -124664 209773 -30028
15223 -260515 -124476 19840 135729 41742 -131503 134599 32608 -33491 142820 -79188
15212a21640A73760M9534E2570J0497b07788a511G9928K73416A71768i8717F7870
15200A44588N9592m7410B9090a37693C03787A37065J31837a86346f6714B36528
15189a08174a8330A03048a76557D10003a26174C0870b37954I8810P4913K07592
15179C81315F15M672a08557C05963G0872J48591H0721b37841A19502G986a51500
15167a45847j40608d0341B25258f7377D25379j76086p8080P9854f541B43181q1813
15156A61368E1388n616n518b43554f3729D9357J6748a36859A50043l6786D8746
15144B19800h968k61348B13404C1267K77903G7733b06609C19195a6562F18809
15133c984A65763J31875C0958N3635J20858C3874L59373E3990e1950J3548A53132
$$ plain form
15212 -121640 173760 223294 52570 63067 -207788 -1511 79928 353344 171768 -98717 67870
15200 144588 204180 156770 29090 -137693 303787 137065 268902 -186346 -66714 236528
15189 -108174 -18330 103048 -176557 410003 -126174 30870 -237954 98810 173723 381315
15179 381315 615 5287 -108557 305963 70872 219463 80721 -237841 119502 7986 -151500
15167 -145847 -286455 -40341 225258 -67377 425379 249293 171213 251067 -6541 243181 161368
15156 161368 51388 45772 40254 -243554 -63729 49357 66105 -136859 150043 113257 48746
15144 219800 -8968 -270316 213404 31267 309170 77733 -206609 319195 -16562 618809
15133 -3984 165763 297638 30958 84593 205451 33874 393247 53990 -51950 -38402 153132
15121a70484d6888A46591o2081J00010J17562B7089d5882A62720e6336q353A63931
15109B15642b61568A80138g6478a943p697k40C39495A44204m5495h8368I8597
15097E8526b8735C82635h173H9467R8351a78520e6507F9496J09139d3627B4409
15085A83212J97554b45806j7841C02644A50950J86893l9165j27239f1668B89973
15074C23451n655b92781A25126r291K1393F8060G128L6205J51103a44903A39555
15062A36825J4411a04496a8142l0675A5803P9999I325M9206J43060J05529b47620
15050d8850r8012E73348A69991a22892A58676J41927a18132C43267j10020r3877
15040A39370J28140q6188K5481J88452H9341J8573f0653F2494c7591A01687J57847
$$ plain form
15121 -170484 -46888 146591 84510 184520 302082 27089 -45882 162720 -56336 -64689 163931
15109 215642 -261568 180138 -76478 -1943 -9640 -9880 339495 144204 98709 -88368 98597
15097 58526 -28735 382635 -8173 89467 187818 -178520 -56507 69496 178635 -43627 24409
15085 183212 380766 -245806 -263647 302644 150950 337843 298678 171439 -61668 289973
15074 323451 317796 -292781 125126 115835 137228 68060 7128 43333 194436 -144903 139555
15062 136825 151236 -104496 -18142 -48817 15803 95802 9325 58531 201591 307120 -247620
15050 -48850 -146862 573348 169991 -122892 158676 300603 -118132 343267 233247 139370
15040 139370 267510 181322 206803 395255 89341 107914 -60653 62494 -37591 101687 259534
15029B59534Q6569A10694J84406B9269J95075m9911K4941K15469a96191C39996
15018D10715j88673E6184K04109p3387m838J36115g927G6275J03673m3673r283
15007A26992D1677K60367O3230A13307m5586K4606J97089A26162d30199D09679
14996B60650A00152k8003Q6520J13053j24621a36556D71487A42843P9570m5656
14986A76757K32740A03087J36600K55509a21533B49838l1336l5166M82116B00671
14975I9289M35218j86738A25842K68339j16204J94554j79648j41075i9402A52314
14964A41372K01580j68854M973J01676K27755A93658k4903J21923A06796J06590
14954B13386J96801j74135M7157D4654g7848A11711L43753A47420M56318C6932
$$ plain form
15029 259534 346103 110694 295100 29269 224344 174433 199374 414843 -196191 339996
15018 410715 222042 56184 260293 186906 182068 318183 -7927 76275 179948 136275 126992
15007 126992 41677 302044 365274 113307 67721 92327 289416 126162 -430199 409679
14996 260650 100152 72149 158669 271722 147101 -136556 471487 142843 222413 176757
14986 176757 409497 103087 239687 495196 -121533 249838 218502 183336 665452 200671
14975 99289 534507 347769 125842 394181 277977 472531 292883 151808 -99402 152314
14964 141372 342952 174098 179071 280747 508502 193658 168755 290678 106796 213386
14954 213386 410187 236052 283209 44654 -77848 111711 455464 147420 603738 36932
14943B66434O9705g0571E53396j21921j46165i805A56474K47202l1284j77376
14933A95016N4847J82423P4721k5420A75970L20098j99722n436A38594P8696J11173
14922C28463P8632b276D67220K11275F6858K15278J3717l8021L41348A22016N580
14911A27596O7579J30573J40902k536q1730A79629L15147Q075n7441m7992j27398
14900B70020N2232K57574A73078J05188J64113j55407n7684G2163K36153m5947
14890B62369d43A82141k0656c4191C6698L31323l2726R1226K97345k82298B00757
14878D19981J27625k09811L6107A64772L82426E0628J00698L70670A74716m3406
14868A31310c5661A79766L44273J3374B28876J35762M2558M8844K35897k26764
$$ plain form
14943 266434 336139 -70571 553396 431475 285310 -9805 156474 403676 372392 195016
14933 195016 249863 432286 507007 481587 175970 496068 296346 290910 138594 217290 328463
14922 328463 407095 -2276 467220 678495 66858 282136 295853 257832 599180 122016 127596
14911 127596 195175 325748 466650 464114 382384 179629 494776 502851 445410 397418 270020
14900 270020 322252 579826 173078 278266 442379 286972 229288 72163 308316 262369
14890 262369 -443 182141 161485 -34191 36698 368021 335295 426521 723866 441568 200757
14878 419981 547606 337795 373902 164772 547198 50628 151326 521996 174716 131310
14868 131310 -35661 179766 524039 537413 228876 364638 407196 456040 691937 465173
14858D65173k15340K28080J22021k64118B2606N68868k10656R2784O4332J27987
14848F65921k73305q2760A3666J17810O14800B91254K69705J28121K42704D31639
14837E61113l1096L03998l06755m8792K1919R1858r6251j7506O9844B66893A20480
14825D05587M20393j47227j88928B20724J02941J26377K41403k63186l812j83852
14815B40595m1977L03243K08932k16919r3037L96291l45746j76386M37776j87454
14805E25318N4349A46311J58591L28537C15708K97953j11397J37536k12501J43435
14795E70734q8816J54265m6577Q6188k08580J9325J45932N2639K04141l53683
14785E35568m6849J77492j53171J32985K54883l13519r9041j82252M59171r7609
$$ plain form
14858 465173 249833 477913 599934 335816 22606 591474 380818 473602 537934 665921
14848 665921 392616 309856 13666 131476 746276 291254 560959 689080 931784 431639
14837 561113 530017 834015 527260 478468 500387 592245 495994 478488 548332 266893 120480
14825 405587 825980 678753 489825 220724 323665 450042 691445 428259 424447 240595
14815 240595 198618 501861 710793 493874 400837 797128 451382 274996 712772 525318
14805 525318 579667 146311 304902 633439 315708 613661 502264 639800 427299 570734
14795 570734 481918 636183 589606 675794 467214 486539 632471 685110 889251 535568
14785 535568 488719 666211 513040 646025 900908 587389 488348 306096 765267 667658
14775F67658P5869P575l73996K99481B95276M16971J1926J8755k7942P6947k78723
14764E13210L38135k43085M0872Q7210r1780R903k0190l5406K08270j76843L6933
14753F67229q3130L14563l15426P456J66597k74350K05286L47347C33341M31736
14743G65077k02360j33559M15455j86699q7294J55927K1426K9277r0937r5748
14733E90565n142M2251j79547J12105j30658K82360J11711j00j28498k36537K88570
14722G47080B99712J31646M17583l69305K22885N2183M0212R9099l40626L02984
14712H56373j00962K42011m82257M26732M6123k07026M9854K56961k61507k63672
14702E62630J49301J99588J8864q7190J09318m2273q6322M3690o1556J30265k55941
$$ plain form
14775 667658 743527 751102 377106 676587 295276 712247 724173 742928 714986 791933 513210
14764 513210 851345 608260 649132 736342 644562 654465 634275 598869 807139 630296 667229
14753 667229 584099 898662 583236 590692 757289 482939 688225 1035572 333341 765077
14743 765077 562717 429158 844613 657914 570620 726547 747973 777250 686313 590565
14733 590565 585423 627674 448127 560232 429574 711934 823645 823545 695047 458510 747080
14722 747080 299712 431358 848941 479636 702521 754704 794916 894015 553389 856373
14712 856373 755411 997422 515165 941897 988020 780994 830848 1087809 826302 562630
14702 562630 711931 911519 930383 843193 952511 910238 823916 867606 806050 936315 680374
14691F80374L30310o2191p3410k16164J89478j47214O4638K6052L48953n33848
14681F06978J53692J76768k13526M69802p1359j55599Q1544R5285j64439R21j42768
14670H37299j63920K13866p4332n1462K58166j30229J12923q557P8413K4014O5051
14659A161232j5138J88228R0176m87050M50637o29715J06997K20141j83393M54490
14649A356605l06811J13762j29016J15354j8090o0715L4643K3692L91607j44502
14639A376529k98019J32931J61017N2463j63541j9778R3967K58726j14811j35051
14629A344433O1067P9898p8916K51042j82275p8319k93703K15182K83538k25653
14619A376294r8963M7092K48340j54866o8546j05920M23419j6865j91254L56335
$$ plain form
14691 680374 1010684 948493 875083 658919 848397 701183 765821 791873 1140826 606978
14681 606978 760670 937438 723912 1193714 1122355 966756 1048300 1143585 979146 980067 837299
14670 837299 673379 887245 812913 761451 1019617 889388 1002311 993754 1072167 1096181 1161232
14659 1161232 1146094 1334322 1424498 937448 1388085 758370 865367 1085508 902115 1356605
14649 1356605 1049794 1163556 1034540 1149894 1131804 1071089 1105732 1129424 1521031 1376529
14639 1376529 1078510 1211441 1372458 1424921 1261380 1241602 1335569 1594295 1479484 1344433
14629 1344433 1405500 1485398 1406482 1657524 1475249 1396930 1103227 1318409 1601947 1376294
14619 1376294 1277331 1324423 1572763 1417897 1349351 1243431 1666850 1649985 1458731 1815066
14609A815066m99528l2538N51014m17598O9331r7769J56326J66939K74292l72867
14599A612668N0048l03416L03954j06642J2684J90262P1880k08514M5547N4628
14589A723099J71171J18299m94601K03558J28927j62801L9802J73225k0382k11304
14579A668993L30732N1645o7187r1198j07441j2063L54452J39969j71931N5944
14569B151915k15393M83168r3945o8374M76971j24468j33974J22167J78449m41686
14559B334830K37476J62599K38281J96819L26320j01892L32971O85266N80483
14550D993153J051682J507370L985824Q660953J9169203K696581k0370953j0551758
14542A1142055n520901k150821r60659q5311l53956K47725j39414k10508m9840
$$ plain form
14609 1815066 1315538 1283000 1834014 1416416 1485747 1387978 1544304 1711243 1985535 1612668
14599 1612668 1662716 1359300 1663254 1556612 1569296 1759558 1831438 1622924 1668471 1723099
14589 1723099 1894270 2012569 1517968 1721526 1850453 1687652 1727454 1900679 1880297 1668993
14579 1668993 1999725 2051370 1984183 1892985 1785544 1773481 2127933 2267902 2095971 2151915
14569 2151915 1936522 2419690 2325745 2257371 2734342 2609874 2475900 2598067 2776516 2334830
14559 2334830 2572306 2734905 2973186 3170005 3496325 3394433 3727404 4412670 4993153
14550 4993153 6044835 7552205 11538029 20198982 39368185 42064766 21693813 11142055
14542 11142055 5621154 3470333 2509674 2424363 2070407 2318132 2178718 1968210 1918370
14533A918370K36725J49717r6133k76823M30700J59749l87542J77K05138J5269
14523B355347N74013l52619j04982R3960K38235k75586R716L7061q0222J49866
14513B644789N8810J01607j02410K6261K14137k16326P8882J9176k73080M03541
14503B955387j37153K53529m5095j79622M10670j7380j01089M04455o40660R58095
14493C861137n73085K70264O8356l4651N4900j99963J93875j39584K23065r0248
14483C634066L94240j48226J44893k61779K26744J08632k51963k34525O02380
14474D214462j64208L66654n19014K62867J48273J55934R9718J21734k78027N16532
14464D924925k93939r8471J91967J76534Q8050m82059K92712J43624P9164J19889
$$ plain form
14533 1918370 2155095 2304812 2208679 1931856 2362556 2522305 2134763 2134940 2340078 2355347
14523 2355347 2929360 2576741 2471759 2565719 2803954 2528368 2538084 2575145 2494923 2644789
14513 2644789 2703599 2805206 2702796 2729057 2943194 2726868 2805750 2824926 2551846 2955387
14503 2955387 2818234 3071763 3026668 2847046 3257716 3240336 3139247 3543702 2903042 3861137
14493 3861137 3288052 3558316 3626672 3592021 3646921 3446958 3640833 3501249 3724314 3634066
14483 3634066 4028306 3880080 4024973 3763194 3989938 4098570 3846607 3612082 4214462
14474 4214462 4050254 4416908 3897894 4160761 4309034 4464968 4564686 4686420 4408393 4924925
14464 4924925 4630986 4532515 4724482 4901016 4989066 4507007 4799719 4943343 5022507 5142396
14454E142396J33796r5581M52085j84620l01934L96922K70050j50337J44928J50715
14444E958420l33236M29446J3836j02887K88195M96904m98777N42038J63097j93056
14434F763980O0928q0124O718L68750j10157o4598K59655M46932n1813j57798
14424G442473m9217J84906J69740M65211m28142R7501J33506J81972L26933J74097
14414H698980P5554L20827j23568J1794K38917L0415K67370K58314p2977R0662
14404I796288j29969P02719Q1591p5255L80651m8032L97942K31216J47699O5185
14394A1550035J84259K88706l6075J83610J90119L93249N6228L95917O10378r8777
14384A3717649k1545P21150n1374K95595L32967L04538M58623j73434N17799L70647
$$ plain form
14454 5142396 5276192 5180611 5632696 5448076 5146142 5543064 5813114 5662777 5807705 5958420
14444 5958420 5625184 6054630 6068466 5965579 6253774 6750678 6251901 6793939 6957036 6763980
14434 6763980 6824908 6744784 6751502 7120252 7010095 6945497 7205152 7652084 7600271 7442473
14424 7442473 7393256 7578162 7747902 8213113 7784971 7882472 8015978 8197950 8524883 8698980
14414 8698980 8774534 9095361 8971793 8983587 9222504 9252919 9520289 9778603 9705626 9796288
14404 9796288 9666319 10369038 10450629 10375374 10756025 10707993 11105935 11337151 11484850 11550035
14394 11550035 11734294 12023000 11986925 12170535 12360654 12753903 12810131 13206048 13816426 13717649
14384 13717649 13696104 14417254 14365880 14661475 14994442 15298980 15757603 15584169 16101968 16472615
14374A6472615K89827L68901N19847L33496M89465J09168J73831M61735P07419
14365A9926304K35983L27073N82180P04791j5881N01497P86487N50498N81361
14356B4180293J85007N16906J160205l4231O26871N92257N67711J303437K31545
14347B9330001J101553L78982J113910Q03145N93958J176621M25700J198037J259238
14338C7381145R93907J141314J260352J088574J195272J490385J004372J256511
14330D6811832J842007J546448J292944J854324J589127J809850K627568J467212
14322F0841312K008702K077883K770848K267536K693621K757414K674295L103726
14314H1195337K964702L343447L735113L761066L852591M273416M527483M167000
$$ plain form
14374 16472615 16762442 17131343 17651190 17984686 18474151 18583319 18757150 19218885 19926304
14365 19926304 20162287 20489360 21071540 21776331 21760450 22261947 23048434 23598932 24180293
14356 24180293 24365300 24882206 26042411 26008180 26635051 27227308 27795019 29098456 29330001
14347 29330001 30431554 30810536 31924446 32727591 33321549 34498170 34923870 36121907 37381145
14338 37381145 38375052 39516366 40776718 41865292 43060564 44550949 45555321 46811832
14330 46811832 48653839 50200287 51493231 53347555 54936682 56746532 59374100 60841312
14322 60841312 62850014 64927897 67698745 69966281 72659902 75417316 78091611 81195337
14314 81195337 84160039 87503486 91238599 94999665 98852256 103125672 107653155 111820155
14306A11820155N310459N150179N755955N683245O348254O338736P090453P511351
14298A61008787P921484Q145313Q497581R233844J0123299J0004641J1037405
14291B25972354J1352627J2306920J2512373J3243054J3651388J4137372J4904399
14284C18080487J4517501J4666846J5104187J4287073J4373759J3761509J2443731
14277D17235093J1859518J0335164R720996P225248N396018K113150j448151j816844
14269D60620192l115090p616467m675759q600607r211048j0686240j2689359j3876319
14261C90149303j4576644j5306121j5638907j5390491j5428656j5090208j4209442
14254B84508834j3214478j3141243j2632710j2265274j1630927j0950866j0561108
$$ plain form
14306 111820155 117130614 122280793 128036748 133719993 140068247 146406983 153497436 161008787
14298 161008787 168930271 177075584 185573165 194807009 204930308 214934949 225972354
14291 225972354 237324981 249631901 262144274 275387328 289038716 303176088 318080487
14284 318080487 332597988 347264834 362369021 376656094 391029853 404791362 417235093
14277 417235093 429094611 439429775 449150771 456376019 461772037 463885187 462437036 460620192
14269 460620192 457505102 449888635 445212876 436612269 427401221 416714981 404025622 390149303
14261 390149303 375572659 360266538 344627631 329237140 313808484 298718276 284508834
14254 284508834 271294356 258153113 245520403 233255129 221624202 210673336 200112228
14247B00112228r861462r128881q290404q098984p818295p327409o915450o551428
14239A36119915o219711n290604n155642n296518m824688m749064m195947m165101
14231I6222640l267858m010644l552269l225828l014096k930333k767459k966413
14223G0487740k194774k457007k362338j825999k223301j846484k102864j884312
14215E3590661j408054j561169j311535j523496j526020j511137j263993j068932
14207D2416325p16605j036293j276488j244900j002391j317782q32781m51272
14199C4537813j018109q05551j223436q27051o77371o65895m57284q94495p81756
14190B7186865q47798m66798m14216q51699m02411m20387m54616p24360l77078
$$ plain form
14247 200112228 190250766 181121885 172831481 164732497 156914202 149586793 142671343 136119915
14239 136119915 129900204 124609600 119453958 114157440 109332752 104583688 100387741 96222640
14231 96222640 92954782 88944138 85391869 82166041 79151945 76221612 73454153 70487740
14223 70487740 68292966 65835959 63473621 61647622 59424321 57577837 55474973 53590661
14215 53590661 52182607 50621438 49309903 47786407 46260387 44749250 43485257 42416325
14207 42416325 41699720 40663427 39386939 38142039 37139648 35821866 34989085 34537813
14199 34537813 33519704 32714153 31490717 30663666 29986295 29320400 28863116 27968621 27186865
14190 27186865 26339067 25872269 25458053 24606354 24203943 23783556 23328940 22604580 22227502
14181B2227502n51423o23087l56370m21846l09257p46957k15543j09843n69392
14172A8323784k98046n38990k41682l6328q47199j04802k18289m98649q7596m89460
14162A4962743n8899m79908N1344j67627o56166j29266k86367j03552k5554l29478
14152A2777270l98752l44291J75071j96760n46773L09271p96687m3544K68366
14143A1203171m29393l03102M6488j13776J50294k53170k23328K79033q62404
14134I493813Q1218k24151K42817n42181k12422l61326J80284k46580M45064m84659
14124H371877l50673j56438r2913N23883o60549K09892k17223q5030k81276J13230
14114G374780k24290K53560j96651l97547j96283R7670k14256Q6555l07574Q9025
$$ plain form
14181 22227502 21676079 21052992 20696622 20274776 19965519 19218562 19003019 18893176 18323784
14172 18323784 18025738 17486748 17245066 17208738 16361539 16256737 16038448 15539799 15452203 14962743
14162 14962743 14903844 14423936 14475280 14307653 13651487 13522221 13235854 13132302 13106748 12777270
14152 12777270 12378518 12034227 12209298 12012538 11465765 11775036 10978349 10934805 11203171
14143 11203171 10773778 10470676 10517164 10403388 10553682 10300512 10077184 10356217 9493813
14134 9493813 9575031 9350880 9593697 9051516 8839094 8477768 8658052 8411472 8856536 8371877
14124 8371877 8021204 7864766 7771853 8295736 7635187 7845079 7627856 7542826 7261550 7374780
14114 7374780 7150490 7404050 7207399 6809852 6613569 6711239 6496983 6583538 6275964 6364989
14104F364989n8659n6287m5029n0703k2558o4891j86165j36335M21317k84494
14094E881185j47083j75468K25643l47107J11927m1705m7705l05938R4191l92346
14084D855594K99013q6066m05311J78865J1233n1426j66902j18402M48236p2312
14074D892522m28859q9582K92176k28252M9716l59878M23326l28819n7138J84086
14064D349298j57740l33830M28603j13007k09953J60392J72472l15516K64476
14055D245195j45361k33529j45672P3642J31837l18077J40754l95998J00403K3648
14045C476842J54365p6963m03245R911L56923l31694l12243K34281O7903n3757
14035C122323k26599J51732N29326m71718p1948o2002J79140l13491N9616K23642
$$ plain form
14104 6364989 6306330 6250043 6205014 6154311 6131753 6066862 5880697 5744362 6165679 5881185
14094 5881185 5734102 5558634 5784277 5437170 5549097 5507392 5459687 5153749 5247940 4855594
14084 4855594 5154607 5068541 4663230 4842095 4853328 4801902 4635000 4516598 4964834 4892522
14074 4892522 4463663 4374081 4666257 4438005 4487721 4127843 4551169 4222350 4165212 4349298
14064 4349298 4191558 3857728 4286331 4173324 3963371 4123763 4296235 3980719 4245195
14055 4245195 4099834 3866305 3720633 3794275 3926112 3608035 3748789 3352791 3453194 3476842
14045 3476842 3631207 3554244 3150999 3160910 3517833 3186139 2873896 3108177 3176080 3122323
14035 3122323 2895724 3047456 3576782 3105064 3033116 2971114 3150254 2836763 2896379 3120021
14025C120021k17627L1956l32775L22061J4997J20313l54836o0730P2591k52564
14015B463407J41597R9840l0375r2806K7012l58912M13790k79938q8915J84767
14005B479467l1810P5048l0214l54630L65507m99116P0795R507J04718Q8783J33834
13994B411889j75839M05814m34628P71316K23158N15214K711580P168515J8374504
13985C1971523J1600965j7824285j1857838n393052k253879j269648p43408o28192
13977C602186K13788l27889o88254q8634J58098p2119m60602L93470k72749P1236
13967B528531q2618L07581k58567j98489J18666k80671q6565K26144R2811j68077
13957B198746K19181l69464K02946m3828j70771N1273j97225J54588m02867K20051
$$ plain form
14025 3120021 2902394 2934350 2601575 2923636 2938633 3058946 2704110 2643380 2715971 2463407
14015 2463407 2605004 2704844 2674469 2581663 2608675 2249763 2663553 2383615 2294700 2479467
14005 2479467 2447657 2522705 2492491 2137861 2503368 2004252 2075047 2084554 2189272 2278055 2411889
13994 2411889 2236050 2641864 2207236 2978552 3201710 3716924 6428504 13597019 31971523
13985 31971523 43572488 25748203 13890365 8497313 6243434 4973786 4230378 3602186
13977 3602186 3815974 3488085 2799831 2711197 2869295 2797176 2336574 2730044 2457295 2528531
13967 2528531 2445913 2753494 2494927 2296438 2415104 2134433 2047868 2274012 2366823 2198746
13957 2198746 2417927 2048463 2251409 2207581 2036810 2088083 1890858 2045446 1642579 1862630
13947A862630n8476J97160J57535m29981J35979n3088l12547N03255J20513n52211
13937A570769J598M24618P6775j74392l64220M52591m07883J79515m66834L00307
13927A592844K1827J05224k43386K23058p8883K6091o2391k34170K55145q6227
13917A519132J7210j28171L3018L35946l12825J76158l03972J37845J52041m4082
13907A582300j22421j03522K11415k13235L86957l58895k07991J57124j58665
13898A173067L25240m17066J15538K84107l03267K74131N4416k52861Q2535j16544
13888A219296J92758k78362Q4621L14491n11663J75291K78948m98490k1441L07710
13878A263159l98546J75512M85543l91917k31395L88275R0180P1115j32696k44280
$$ plain form
13947 1862630 1804154 2001314 2158849 1728868 1864847 1811759 1499212 2002467 2122980 1570769
13937 1570769 1572367 1996985 2073760 1899368 1535148 1987739 1579856 1759371 1292537 1592844
13927 1592844 1614671 1719895 1476509 1699567 1620684 1646775 1584384 1350214 1605359 1519132
13917 1519132 1536342 1408171 1441189 1777135 1464310 1640468 1336496 1474341 1626382 1582300
13907 1582300 1459879 1356357 1567772 1354537 1741494 1382599 1174608 1331732 1173067
13898 1173067 1498307 1081241 1196779 1480886 1177619 1451750 1506166 1253305 1335840 1219296
13888 1219296 1412054 1133692 1218313 1532804 1021141 1196432 1475380 976890 955449 1263159
13878 1263159 864613 1040125 1525668 1133751 902356 1290631 1380811 1451926 1319230 1074950
13868A074950j8734K04046Q1852m52481L91979k46557m5427Q7586q1568J97757
13858A193403J3298l8036k53007j6696N25867k67954j25815J02701j19666N5631
13848A069726k14371M565l0160L14642L0405l57085k0706P3544J44466l55149
13838F59877M90766M3557l71066J12285J6245J46307k22282K23040k49779m4001
13828H04949L23123j97179J1454l40923K75044N2845o4002l17421M02906k43554
13818G07242J95797j02380K60221k71505K78700k36271N3275l42569N96926j06061
13808A033375l14820L00380j14913K1817J13801l09386J62581n1140k7657k69050
13798E44988K73231k4523k93410N25780q7728J50666n34608j9578K02313K6137
$$ plain form
13868 1074950 1056216 1260262 1342114 889633 1281612 1035055 989628 1077214 995646 1193403
13858 1193403 1206701 1168665 915658 898962 1424829 1156875 1031060 1133761 1014095 1069726
13848 1069726 855355 859920 829760 1144402 1174807 817722 797016 870560 1015026 659877
13838 659877 1150643 1194200 823134 935419 951664 1097971 875689 1098729 848950 804949
13828 804949 1128072 930893 942347 601424 876468 929313 865311 547890 950796 707242
13818 707242 903039 800659 1060880 789375 1068075 831804 885079 542510 1139436 1033375
13808 1033375 718555 1018935 904022 925839 1039640 730254 892835 841695 814038 544988
13798 544988 818219 793696 500286 1026066 938338 1089004 554396 534818 737131 763268
13788G63268J79067l79315J12617J47518j20991K46049M3279j97379B78069N42492
13778H20561K31696m69714k18949K39543K62122N1555Q700k64568J20207k50239
13768E30914L30111j98429K18045J20257l82391j20435m162L30981m02873K63080
13758F85098q6014M42770m76793K81434J15387C23533K48582J47207j94194N89268
13748A114396l04028k47466J00133m5292k08106M57423k00271r4589J82397k62864
13738D91733M53451k03486R5687R8229l87450J74794R2466o6303l58011L45335
13728G36445J04416j39385k7499k74356K14248k52965M39984k53248j43570o248
13718C97822K57469J4624k46277l2582K5570K99326j76463K02724j90100B02119
$$ plain form
13788 763268 942335 563020 675637 823155 702164 948213 991492 794113 278069 820561
13778 820561 1052257 582543 363594 603137 865259 916814 925514 660946 781153 530914
13768 530914 861025 662596 880641 1000898 618507 498072 493910 824891 422018 685098
13758 685098 599084 1041854 565061 846495 961882 323533 572115 719322 525128 1114396
13748 1114396 810368 562902 663035 617743 409637 867060 666789 572200 754597 491733
13738 491733 945184 741698 837385 935614 548164 722958 815424 749121 391110 736445
13728 736445 840861 701476 673977 399621 613869 360904 800888 547640 404070 397822
13718 397822 655291 669915 423638 391056 416626 715952 539489 742213 552113 202119
13707E68587J09746j62675O8013L38450l95619R2019j00788N42842l68396r9719
13697E92460k63221N2974K67692j95699H8788K79158K29410B82867K49847q2076
13687D50638J45420r3537J22328o9913J20696j27571J78682L6789K3168j68260
13677F18440K34325j55071B44809K55656o732P7923j76452j06603L38605K76769
13667I03975B84378K06461J88464j88929p7845j03409K1592L40650j77323L13489
13657H07528l35265j85823J42882j4253J0054O7225N9134G2102M30554k47826
13647B54830C79M10581m9567J26633J2700k03281A41966K58740q9464L49711a6663
13635E89936B64708K42285K6660k25357M95088j53378B97701K36093o8595k16135
$$ plain form
13707 568587 678333 515658 583671 922121 526502 618521 517733 1060575 692179 592460
13697 592460 329239 382213 649905 454206 88788 367946 597356 282867 532714 450638
13687 450638 596058 502521 624849 554936 675632 548061 726743 763532 786700 618440
13677 618440 852765 697694 244809 500465 493733 571656 395204 288601 627206 903975
13667 903975 284378 490839 679303 490374 412529 309120 330712 671362 494039 807528
13657 807528 472263 286440 429322 415069 425123 492348 551482 72102 502656 254830
13647 254830 379 410960 361393 488026 500726 297445 141966 400706 311242 660953 -16663
13635 589936 264708 506993 533653 308296 803384 650006 297701 533794 465199 249064
13625B49064P9100K57968A84468J51395P0473q1484r8045k894K8763M55649j83142
13614E25183J0978A63594N22381l23317J63579L8546k33575m3852M3175L6698
13604C67229j16725j06571k165J21185L43056k13507A69993J78276A36830L69873
13594E06703o3677j18180N0958j1050A48604L64986G6634L07175j89161J85385
13584C80033j86662J40299J60770B3069N34109j7985j64779K274j09660J58727
13574D25755j45736l1726L16444j44031J00876j18484O2689m6927m4261A28970
13563A80275M6780K87672j96725f4932H2230K66267j48006K36965A79126J29929
13553C09055K42729j73585k3607J25948I3205O6269j0114K37312M0091K41295
$$ plain form
13625 249064 328164 586132 184468 335863 406336 324852 226807 223913 252676 708325 525183
13614 525183 536161 163594 685975 362658 526237 564783 331208 287356 330531 367229
13604 367229 250504 143933 141768 262953 606009 392502 169993 348269 136830 506703
13594 506703 443026 324846 375804 364754 148604 513590 76634 383809 194648 380033
13584 380033 193371 333670 494440 23069 557178 539193 374414 376688 267028 425755
13574 425755 280019 248293 564737 420706 521582 403098 465787 418860 374599 128970
13563 180275 227055 514727 318002 -64932 82230 348497 200491 437456 179126 309055
13553 309055 551784 378199 354592 480540 93205 159474 149360 386672 426763 668058
13543F68058B93457I0016C8004a18765D29289J12369j98827j51546B8564M75458
13533E04022c2430A28439L06226j19874k2005l8552n7990M2423k4579P1284M0955
13522C26327I4036B8794M80252B36319P4487P3915A80943L31137A5318K80601
13512B95919k8863n8760j4306e1607C88993m535j09406J1364r3380J12151j03118
13501B02069L6105q8982L58434A93971J66978k9668N8039G2587M37601q9205q7044
13490C33939N5931O4116A88340j5738M3426j917G6730f3041E24461j03038m6453
13479C74970A82018K73477j58528R6842J2920R2659j6871j65106A32684l7693
13469I4991P0635G4769N6765b8953B81515I1952J58099J23952O0899o9237D8290
$$ plain form
13543 668058 293457 90016 38004 -118765 429289 541658 342831 191285 28564 504022
13533 504022 -32430 128439 434665 314791 292786 254234 196244 238667 214088 285372 326327
13522 326327 94036 28794 509046 236319 310806 384721 180943 512080 15318 295919
13512 295919 267056 208296 193990 -51607 388993 384458 275052 286416 193036 305187 202069
13501 202069 238174 149192 507626 193971 360949 331281 389320 72587 510188 420983 333939
13490 333939 389870 453986 188340 172602 216028 214111 76730 -63041 524461 421423 374970
13479 374970 182018 455495 296967 393809 406729 499388 482517 317411 132684 94991
13469 94991 165626 74769 131534 -28953 281515 91952 250051 374003 434902 365665 48290
13457C72527A04515K66466a55110A00504K55761d063C62337g2D37481k15897O6504
13446B88088r65L3442k476g4958B37080G8109l06M00411D6833J36476G1958K4191
13434I6149J52536m9740A3119K40666K06414k10467k5790j10563Q8864a6544D00703
13422f5500C79008h8685C54532A12558K42690A21365L27313A31877L465J8042
13412A53384K09522e2538B35040K773b9200j4306B10781R2433b51403D3561L82393
13401D25954G3987K3634L40749E2904M012K43103C9067J16394J8029n571L20822
13390D88741k16423M7478n941p509j44606M0535J74413a4203B73660I7091K35638
13379C32729d4144E6028K83465j30276G3435N787k3593J62622J59504M205N6762
$$ plain form
13457 372527 104515 370981 -155110 100504 356265 -4063 362337 -72 437481 221584 288088
13446 288088 287123 320565 318089 -74958 237080 78109 77803 478214 46833 183309 71958 96149
13434 96149 248685 198945 13119 253785 460199 249732 223942 113379 202243 -16544 400703
13422 -65500 379008 -88685 354532 112558 355248 121365 448678 131877 135342 153384
13412 153384 362906 -52538 235040 237813 -29200 -43506 210781 303214 -251403 43561 425954
13401 425954 73987 97621 438370 52904 56916 300019 39067 155461 173490 167919 488741
13390 488741 272318 319796 313855 306346 161740 202275 376688 -14203 273660 97091 332729
13379 332729 -44144 56028 339493 209217 73435 79222 55629 218251 377755 381960 438722
13368D38722J6358j10058n3372j28276J73678j20289K68538C99K5048J2345K03621
13357B41413J02002A50611J33899r9829P6963E7876a2436B18524n84p7149L00320
13346D41111P7700A68121K38069j65874J77709q2312K3254R3072j43186n9792
13336B49061l8224G1992Q9020J46840o1185K73436C2571M35692A15897D7228j2749
13325C4479K0625c6792B27880D6458c35425a26479F2566M12657D1836K96819A03068
13313C40657j17923N3181j10840L5818B2707N60970B37479J51250A91519p3740
13303A17779L47910B27033K1263A13788J92433O9427C474e970E5681K55328A11390
13291B62041r8759P9572o7599D0666J99474M6075j19124J71504A43772c2444A37681
$$ plain form
13368 438722 455080 345022 291650 163374 337052 216763 485301 399 25447 37792 241413
13357 241413 343415 150611 284510 184681 261644 57876 -12436 218524 217940 140791 441111
13346 441111 518811 168121 406190 240316 418025 335713 358967 452039 308853 249061
13336 249061 210837 71992 161012 307852 246667 520103 32571 468263 115897 47228 34479
13325 34479 55104 -36792 227880 46458 -335425 -126479 62566 475223 41836 338655 103068
13313 340657 222734 275915 165075 200893 22707 583677 237479 388729 191519 117779
13303 117779 465689 227033 248296 113788 306221 375648 3474 -5970 55681 311009 111390
13291 262041 163282 242854 175255 40666 240140 286215 167091 338595 143772 -32444 137681
13279A66217h7151A97516j661N5230A3734e9939Q50B93449j22990a2470k1464
13268c3934A74416J68357a41751A02106B0168g7177C65407K88620B1289J15974
13258A37263a19145J6463I0287J67375K0271A29438l302q270J92014K01712h6949
13246a38848d5387j28782E88116A99963A9371e8245C08934j3556A36839F5159
13235A64593B3819J88630h7873D8305e861G3002M03471A00315d3469n8257A80126
13223A54678k9161L92639G0840K28121A37359r232a51840H8446d2451r1148B89353
13211C04628A37964J0219b1276A99320b74555A93138A1306K80936a4735j04912
13201a19647K2869E9627K94740j62701h6413B8056a5401A65180K41445j94364
$$ plain form
13279 166217 -87151 197516 195855 251085 13734 -59939 -59089 293449 170459 -12470 -33934
13268 -33934 174416 342773 -141751 102106 20168 -77177 365407 654027 21289 137263
13258 137263 -119145 -102682 90287 257662 277933 129438 126136 117866 309880 511592 -86949
13246 -138848 -45387 -174169 588116 199963 19371 -58245 308934 295378 136839 65159
13235 164593 23819 212449 -87873 48305 -5861 73002 476473 100315 -43469 -101726 180126
13223 154678 125517 518156 70840 298961 137359 128127 -151840 88446 -42451 -133599 289353
13211 304628 137964 148183 -21276 199320 -274555 193138 11306 292242 -14735 -119647
13201 -119647 -96778 59627 354367 191666 -86413 28056 -15401 165180 406625 212261
13191B12261a61730G3685l5231K76333c3296B72755P7165J11231b2092C7398a018
13179A9810J56568m0261C0983R8212J54951E6856a39253C17624d0896A72917O443
13168A79360m8876E0090J29693a48848A77295a21952B60430D671a68982A29063
13157f5062j4519C23458F2556K64320c49005C60231b4192B61865r6369l2924a61573
13145A49127A6714N3419J78860a3060D00197A87357B1265b650o2457B40612f2983
13133B28355H5893d6933B10239H838e9788A22550f0950A26086F1123L3333J35846
13122B30302C3181i4924A91156a40612C32242I8099c6186A48707j8252Q6752b7225
13110a80988c3985H2685L7550R4058c07765h8755j87283f3314a5145n971A0874
$$ plain form
13191 212261 -161730 73685 38454 314787 -33296 272755 349920 461151 -22092 37398 -1018
13179 19810 176378 136117 30983 129195 284146 56856 -139253 317624 -40896 172917 179360
13168 179360 130484 50090 179783 -148848 177295 -121952 260430 4671 -168982 129063
13157 -65062 -79581 323458 62556 326876 -349005 360231 -24192 261865 165496 132572 -161573
13145 149127 16714 70133 248993 -13060 400197 187357 21265 -2650 -65107 240612 -62983
13133 228355 85893 -46933 210239 8838 -59788 122550 -60950 126086 61123 94456 230302
13122 230302 33181 -94924 191156 -140612 332242 98099 -36186 148707 130455 217207 -27225
13110 -180988 -33985 82685 120235 214293 -307765 -88755 -276038 -63314 -15145 -21116 10874
13098D67782F0699A2419O0321b17111A6191J96679g9832j8472E6138e8348B60185
13086d5666A70521R2787c67081a16035N7891K1528m123F0697a71911B16777H6954
13074h2661B28212J83819A50498K56624A11992D8736j8746K85859b1183E1125
13063E04388k07836e2002n3878C02599M217O8932E5918a6052n22B5196n892e3731
13050B79654a46461B63137a6597B16577J9959n6107b6280A18748a09336J0490
13040i8846I1824e4066A53786M22141B08437b7911A35080j949J11525J70114A14358
13028A24580A7653d7970C920K77508a5131A51747o7057J23301K01053E9524L16359
13017C75883G0205K15746j07913R8122F0745l306M8099l443a26374A01608L32329
$$ plain form
13098 467782 60699 12419 72740 -217111 16191 212870 -79832 -98304 56138 -58348 260185
13086 -45666 170521 263308 -367081 -116035 -58144 -36616 -40739 60697 -171911 216777 86954
13074 -82661 228212 412031 150498 407122 111992 48736 29990 315849 -21183 51125
13063 504388 296552 -52002 -105880 302599 306816 375748 55918 -16052 -16574 25196 19304 -53731
13050 279654 -146461 263137 -16597 216577 236536 180429 -26280 118748 -109336 -98846
13040 -98846 91824 -54066 153786 575927 208437 -27911 135080 133131 244656 414770 114358
13028 124580 17653 -47970 3920 281428 -15131 151747 84690 207991 409044 59524 375883
13017 375883 70205 285951 178038 276160 60745 57439 105538 102095 -126374 101608 433937
13006D33937A9793M8476O9426e8338E9973K9729A5262Q7449C5018J98905E8614
12994a15468A76303c0278G8962M01235b67690g2587A31024o1543Q469a14851a9131
12982c5573A26876b67936D8998f6961m3194A76457R7864a6939r6085A45603L23810
12971D69413F124e0945B54695D017a77437h2862A44833a68211A86659i9353D42421
12959a27474A85727a69667F4339i257C15555A54178n2297J57028P8123A2401L91183
12948D03584G6934b7150A44085A6442L47393b31B66958n4974b96337C80422p0453
12937C09969c07138A4115k24g3282n350A87580e665k22183R5046N4543I5826J65025
12925B60851I2621J47416b08458A02757D7021J8645b02081n4152A33578C6898
$$ plain form
13006 433937 19793 68269 137695 -58338 59973 89702 15262 102711 35018 233923 58614
12994 -115468 176303 -30278 78962 480197 -267690 -72587 131024 69481 77950 -114851 -19131
12982 -35573 126876 -267936 48998 -66961 -110155 176457 274321 -16939 -113024 145603 469413
12971 469413 6124 -50945 254695 4017 -177437 -82862 144833 -168211 186659 -99353 442421
12959 -127474 185727 -169667 64339 -9257 315555 154178 101881 258909 337032 12401 403584
12948 403584 76934 -27150 144085 16442 363835 -231 266958 211984 -296337 380422 309969
12937 309969 -307138 14115 13891 -73282 -78632 187580 -5665 -227848 -132802 -78259 95826 260851
12925 260851 92621 240037 -208458 102757 47021 65666 -202081 -256233 133578 36898
12914h516b413l115C95292r3084a35419j91901a02872l3460d4358I6952e1541
12902A92922n7662b364A71229Q116D6852g5688k38665a26747j33967B87275g4041
12890b0063A12597K75861g1763A11473h8895n9377B10332E8474i9963L9296C8405
12878B7547O1179P7787b9727F8821g789B06848M3489q1594P245g0056F0120Q9889
12866A50009F0726K51659A6174M7002L7334J57484q9840e3687p6767F17873A1825
12854I2730a02391A60622b97100D11579c1497O648A2122b21443C48175D0207a00558
12842i4774A26174b87058C54615c0129A51498b11136d2557F1155K15971E0576
12831b38042N3918D6596a9723A21076j9584b4041E7512J82289l5869H7552C0763
$$ plain form
12914 -8516 -2413 -5528 395292 302208 -135419 -327320 -102872 -136332 -44358 96952 -51541
12902 192922 135260 -2364 171229 179345 46852 -75688 -314353 -126747 -260714 287275 -74041
12890 -20063 112597 388458 -71763 111473 -88895 -148272 210332 58474 -99963 -60667 38405
12878 27547 88726 166513 -29727 68821 -7789 206848 250337 168743 175988 -70056 60120 150009
12866 150009 60726 312385 16174 63176 100510 257994 168154 -53687 -130454 617873 11825
12854 92730 -102391 160622 -297100 411579 -31497 -24849 12122 -221443 348175 40207 -100558
12842 -94774 126174 -287058 354615 -30129 151498 -211136 -42557 61155 277126 50576
12831 -238042 -184124 46596 -19723 121076 101492 -24041 57512 239801 203932 87552 30763
12819g6110A21984b26549B17205I6661J5488N2745J0775b1731B63368B3613c7726
12807G9992a3271k4655q7805F1659c2688e42G2129h579p09H9176L30143b20289
12794A90296h1779A50303a43625j9405C38046C9904a49504A19976A1782h9982
12783C0170A2421b7200j16952A76985A3636e4919A5163c5224f229B02343e5259
12771g8016A24396a7076j3043B88005c9896o3312E2857a0095k6776G0967b49225
12759a11933B77742H4967L8161b31307B6080K68687b11048B30488G2175a95229
12748C2611O9361a53624A62463E8553P887a62193H0625K8799a37589A34757j493
12737A33264J43351H6677a08880B8604a48010i566B06363p4910l3965j980J11542
$$ plain form
12819 -76110 121984 -226549 217205 96661 112149 164894 175669 -21731 263368 23613 -37726
12807 79992 -13271 -37926 -125731 61659 -32688 -542 72129 -8579 -9288 89176 419319 -220289
12794 190296 -81779 150303 -143625 -163030 338046 39904 -149504 119976 11782 -89982
12783 30170 12421 -27200 -144152 176985 13636 -54919 15163 -35224 -6229 202343 -55259
12771 -78016 124396 -17076 -30119 288005 -39896 -103208 52857 -10095 -36871 70967 -249225
12759 -111933 277742 84967 123128 -231307 26080 294767 -211048 230488 72175 -195229
12748 32611 101972 -153624 162463 58553 66440 -162193 80625 109424 -137589 134757 133264
12737 133264 276615 86677 -108880 28604 -148010 -9566 206363 131453 97488 95508 207050
12726B07050i1206b8377C14777l621f8469B93772F2465J63423b5955j37090d2118
12714c82660a89422d3044B18134M2680Q3114q0829M3316m5231A14220K67201q9559
12703B91862C8378M09540a5527D034J87428g936B43010N8777H1288M1869E3322
12691A76576b2606A02122a58683A7024c6210D6068a1946o2316A9052i8079j08379
12680b06458A69452L82805n3398B39368A01646b5154k00900F5458B9391e328k0449
12669b5777k33657B22499r7494c89228i3217A4222L9550a47280G8604O545C8234
12657H8658a01537l9264C3533a63507B96037D0964J63776m7064R2570e569B11519
12645E5794e0985n9309A10014h9489j39228R4792A99297l085p3694L79498G2516
$$ plain form
12726 207050 -91206 -28377 314777 311156 -68469 293772 62465 225888 -25955 -163045 -42118
12714 -382660 -189422 -43044 218134 260814 343928 263099 306415 261184 114220 381421 291862
12703 291862 38378 447918 -15527 4034 191462 -7936 243010 301787 81288 123157 53322
12691 176576 -22606 102122 -158683 17024 -36210 46068 -11946 -74262 19052 -98079 -206458
12680 -206458 169452 552257 498859 239368 101646 -25154 -226054 65458 29391 -5328 -25777
12669 -25777 -259434 222499 125005 -389228 -93217 14222 53772 -147280 78604 85149 38234
12657 88658 -101537 -140801 33533 -163507 296037 40964 204740 157676 250246 -5569 211519
12645 55794 -50985 -110294 110014 -89489 -228717 -133925 199297 196212 122518 502016 72516
12633B37400a40052A76260R2990A32389f3842G6267R544A2325J69261J49904D8547
12621A61400e4088F0070J24624d4223B03593d6486o1613A25242B7191p115R3715
12610A13791K5730a35803c638F9413P8891O6717P7259n2945I3127a46107C8206
12598b19725B85180a81795A99759l0244a09239r4283A7793d347l3704D5937A2160
12586E5853P2352a53232n2054h6130A08400J0190h1878F1326j7780f5671A86480
12574a76577B096J66407H0396L03028a30636c859C48266A61562p2489L6854e738
12562a85445m04J3996C7445j1136a17368j2937G2412b05777D3769e716B7492K02268
12550B29760E5188b88887E9037E018N9557a673j31469n898C2216b35829B19689
$$ plain form
12633 237400 -140052 176260 269250 132389 -63842 76267 85811 12325 181586 331490 48547
12621 161400 -54088 60070 184694 -44223 203593 -46486 -108099 125242 27191 20076 113791
12610 113791 139521 -135803 -3638 69413 148304 215021 292280 239335 93127 -146107 38206
12598 -219725 285180 -181795 199759 169515 -109239 -203522 17793 -4347 -38051 45937 12160
12586 55853 128205 -153232 -205286 -86130 108400 118590 -81878 61326 43546 -65671 186480
12574 -176577 2096 168503 80396 383424 -130636 -3859 348266 161562 89073 125927 -5738
12562 -185445 -185849 -171853 37445 26309 -117368 -130305 72412 -205777 43769 -5716 27492 229760
12550 229760 55188 -288887 59037 5018 64575 -1673 -133142 -139040 32216 -235829 219689
12538a75897j06800h1648I3832a1622j50851A11917A3820a06835C16785A41211
12527D09985G2407J25437C4425N0875J7800k1693J18492b5015A78702E1632h8013
12515e6313B52190K10032D4730K81862A30312J72649j16216a97624G3291a6989
12504E6998b3483m4516A71445a49871I7428d693k71460d8098l6183m8176C6994
12492H0783b63517J23974j558c6059o8789j70139D18884j42019q6192o4440B1839
12480g6005L7182A50902n7820h2903A16337E5148n707f9184B69540a23862E875
12468A33540c02987A20526D0387a68592j8747a8993P898r933k5910j39233N3558
12457a32613j12276B9774a16783A87171C6191P1077b07k60792H2710O7614B9691
$$ plain form
12538 -175897 -282697 -81648 93832 -11622 -162473 111917 13820 -106835 316785 141211
12527 409985 72407 197844 34425 85300 103100 81407 199899 -25015 178702 51632 -88013
12515 -56313 252190 462222 44730 326592 130312 302961 186745 -197624 73291 -16989
12504 56998 -23483 -67999 171445 -149871 97428 -4693 -276153 -48098 -84281 -132457 36994
12492 80783 -263517 -139543 -141101 -36059 -104848 -274987 418884 276865 190673 126233 21839
12480 -76005 -38823 150902 93082 -82903 116337 55148 49441 -69184 269540 -123862 5875
12468 133540 -302987 120526 40387 -168592 -187339 -18993 -11095 -21028 -46938 -186171 -132613
12457 -132613 -244889 29774 -116783 187171 36191 107268 -207 -260999 82710 150324 29691
12445E6993J11781l6631e0814B33094a11076q4041C20430A14102N8507G3216B3086
12433A80380E5414A6778a0673A269a60541B24802i2181d4061E8156i6253D6827
12421C3248a89608N3197A02582c52934F4688a53215A97588a91323A14515m384
12411A10131J48538b02935r8895j01233A87889G9245g2758j58438h3400q3148
12401a66548f9738A07061a55576D6709j2296K24253h8261b7375q563k99517a31981
12389F4085B209i6186F3104b99398C29653H2062b1434j050D03421G3873g2173
12377B63625j31164N6345i1744A59646a8371j3673m27610a38601B89110n872p3054
12366B10184I4664A2973a4877l06694d5407G834c4957A3810a1361j34379N1153
$$ plain form
12445 56993 168774 132143 -50814 233094 -111076 -195117 320430 114102 172609 73216 23086
12433 180380 55414 16778 -10673 1269 -160541 224802 -92181 -44061 58156 -96253 46827
12421 33248 -189608 -136411 102582 -352934 64688 -153215 197588 -191323 114515 110131
12411 110131 258669 -202935 -301830 -403063 187889 79245 -72758 -231196 -83400 -166548
12401 -166548 -69738 107061 -155576 46709 34413 258666 -88261 -27375 -35938 -335455 -131981
12389 64085 2209 -96186 63104 -299398 329653 82062 -21434 -22484 403421 73873 -72173
12377 263625 132461 188806 -91744 159646 -18371 -32044 -459654 -138601 289110 283238 210184
12366 210184 94664 12973 -14877 -321571 -45407 7834 -34957 13810 -11361 -145740 -94587
12355i4587a7213A30595L9218i7093B3487a56999A49023o8703g4500C8392a19975
12343a8133l3852A46998D006a9326j4091j17122h488B34095C9017a78695c6613
12331e6011A40470d271E0346J38473o5416c9754A44870c52027B47334C0036h0007
12319H6214J56578b20367g6205j1508j05129A30624K57589j38027G0812Q4437
12309A55249a18466A53645D2182c0892j50460g4643A66334d1365B32629E4065
12298A32799k7151a40782M2803B2105R1166b50949B81030a72945g2895E9158b38512
12286c138j70888A58935i6786A15270M271J13444i2309D63622C9144i8195B0899
12274A18122Q2771h8289K1425J5886B88958a3022A7362a22229j41359e1069A87642
$$ plain form
12355 -94587 -17213 130595 169813 -97093 23487 -156999 149023 80320 -74500 38392 -119975
12343 -18133 -51985 146998 4006 -19326 -33417 -150539 -8488 234095 39017 -178695 -36613
12331 -56011 140470 -4271 50346 188819 123403 -39754 144870 -352027 247334 30036 -80007
12319 86214 242792 -220367 -76205 -87713 -192842 130624 388213 250186 70812 155249
12309 155249 -118466 153645 42182 -30892 -181352 -74643 166334 -41365 232629 54065
12298 132799 105648 -140782 -97979 22105 113271 -250949 281030 -172945 -72895 59158 -238512
12286 -3138 -174026 158935 -96786 115270 119541 232985 -92309 463622 39144 -98195 20899
12274 118122 200893 -88289 -66864 -50978 288958 -13022 17362 -122229 -263588 -51069 187642
12262i9225D03909j42688D1360a03409B97272G2082J10257p1539c1753j68827
12252b00580M7925D42799A41143A4809i783B68901f4622B21758g0160A49364f0589
12240A69727h5994A26137A2656N6762P7647j1834J07424B3022L31053m0340h023
12228E2422J12201Q1641n711L0995j03124L43282B49135J12453l6911m1447r8002
12217A85228a36772A95158O188G673J86119C0076M21587F9344N1973Q2412K15582
12206D19311n578a30764A84847c7192B59812b44237C59714l5504m0156k5399A20148
12194A23160K6929J98659C7369f9313o7181B64208h5450D69116H3180J67217c8066
12182C34725r2590J74243f1462a926G7342b8567A28047J06589K47816a49098d078
$$ plain form
12262 -99225 403909 261221 41360 -103409 297272 72082 182339 110800 -31753 -200580
12252 -200580 -152655 442799 141143 14809 -9783 268901 -64622 221758 -70160 149364 -60589
12240 169727 -85994 126137 12656 69418 147065 135231 242655 23022 354075 313735 -8023
12228 52422 164623 246264 240553 271548 168424 511706 249135 361588 324677 283230 185228
12217 185228 -136772 195158 201346 7673 193792 30076 451663 69344 121317 203729 419311
12206 419311 413733 -130764 184847 -37192 259812 -244237 359714 324210 284054 258655 120148
12194 123160 150089 348748 37369 -69313 -136494 264208 -85450 469116 83180 250397 -38066
12182 334725 242135 416378 -61462 -1926 77342 -28567 128047 234636 482452 -149098 -4078
12170B77931q7674P8660a632F0177e299E4883j9922J38262n8537B0180J68389
12159A88569G7668P1842K29556j29877N8776a85784R1323L8913D35019e5241A43723
12147h4981C11925d5060D42296k7774A2970b94518A42983b1393p1284A89580b14488
12135e3180A36310J62746h0154B93496A7987@h2264b9269A84254i8117F22g8530
12122A23873g2876p3467c9220j00450H9165b16587D4889L28581h196C30836a37248
12110a61566k50356A08894B8991d5355E9732j305K70808b43590A32894C2253L189
12099C5442c2816H8270c59784D5575K4381h1765d0842j75675J8856D8073N8500
12088A06573J30917F4583e8500B22084b99367D1287J10201N5172b9511A30218
$$ plain form
12170 277931 190257 268917 -1632 60177 -5299 54883 34961 173223 114686 20180 188569
12159 188569 77668 149510 379066 249189 307965 -185784 -94461 -55548 435019 -55241 143723
12147 -84981 311925 -45060 442296 414522 12970 -294518 142983 -21393 -92677 189580 -214488
12135 -53180 136310 299056 -80154 293496 17987 0 -82264 -29269 184254 -98117 622 -78530
12122 123873 -72876 -146343 -39220 -139670 89165 -216587 44889 373470 -8196 330836 -137248
12110 -161566 -411922 108894 28991 -45355 59732 58427 329235 -243590 132894 32253 35442
12099 35442 -32816 88270 -359784 45575 69956 -81765 -40842 -216517 -197661 48073 106573
12088 106573 237490 64583 -58500 222084 -299367 41287 151488 206660 -29511 130218
12077A83128a31497E8089L1074Q69368R13095H83729C94518B8400j1288M1179
12067E8291d8000j00975e054B15330E4435L6807K11722A03689N1400J25654F4182
12055A05312a14164H5931b26193j31951J39185i7024C3857J98720a42240e4270
12044G4384a99432m7292h1834k69505a42334b9770j92956J09972j36794a08346
12033C2587F36J56051c8217h131j29217C5105a69766A8858A418h537G4643g6026
12020A21152a51420f9638J2086j43660M1241A21893i6793A99840J1886l1311a92615
12008e9372B82534A23576q503j4639b99951C8043L0113A8108O2661b12120h6141
11996b16010d0631k13246b6755C2733K93904j59052b44981G8201d89711b01910
$$ plain form
12077 183128 -131497 58089 89163 958531 1871626 883729 394518 28400 17112 58291
12067 58291 -48000 -148975 -5054 215330 54435 91242 302964 103689 155089 280743 64182
12055 105312 -114164 85931 -226193 -358144 -218959 -97024 33857 232577 -142240 -54270
12044 74384 -199432 -246724 -81834 -351339 -142334 -29770 -222726 -112754 -249548 -108346
12033 32587 636 156687 -38217 -8131 -137348 35105 -169766 18858 1418 -8537 74643 -76026
12020 121152 -151420 -69638 -57552 -201212 -159971 121893 -96793 199840 211726 180415 -192615
12008 -59372 282534 123576 115073 100434 -299951 38043 68156 18108 80769 -212120 -86141
11996 -216010 -40631 -253877 -26755 32733 326637 167585 -244981 78201 -489711 -201910
11985A90301e8628d603j38743G723d9386B49326q5009M8500k5690e767j47625
11974a53392K773H0537L3419m622d0455J8246A69172a0519m20578C18552A29779
11962a6284k32868i8904g100k02357G05f3032K6620j27479L9733A57665c5811
11950b9598k10629I3254D2107g7165a8978j6449l03442f2795I027a39189C29902
11938a11088g722Q28C98564c4861B49728a31461p2510b9258A60577J3804J18478
11927B92859A1441M11640j33080i9797k32737B61842a95573k69873E5732R0693
11917A46425d9937K731B12264b62214a03546C6547K20159a54586B33179F2889
11906b2854j65210f4461A1684f8569B30779h8008j10935E3035R793a9370j77186
$$ plain form
11985 190301 -58628 -4603 -143346 7723 -49386 249326 164317 212817 187127 -5767 -153392
11974 -153392 -150619 80537 113956 109334 -40455 -22209 169172 -10519 -431097 318552 129779
11962 -16284 -249152 -98904 -7100 -209457 705 -63032 -36412 -163891 -124158 157665 -35811
11950 -29598 -240227 93254 42107 -77165 -18978 -35427 -338869 -62795 9027 -139189 329902
11938 -111088 -7722 -6894 398564 -34861 249728 -131461 -203971 -29258 160577 174381 292859
11927 292859 11441 423081 290001 -99797 -332534 261842 -195573 -465446 55732 146425
11917 146425 -49937 -47206 212264 -262214 -103546 36547 256706 -154586 233179 62889
11906 -22854 -188064 -64461 11684 -68569 230779 -88008 -198943 53035 62828 -19370 -196556
11895a96556H7347a66280O4584j97675A50171a2525j91171a4044C8641a9086k32588
11884b51674M0917h8402c2272k02660J0405B40508B1092M5340B5013L06268b79021
11872b09922F8962c5643D9018L7767O4275c9996A3892K92034A18181m1577j5602
11861F1002a85561j21773g4174H1818a03427F3774b46189O451o5701d2239r5993
11850a38232A99480K8615p4710K1365q2234a90333j80727A80990n5897o0045b70462
11838b51516k5217J22116A29859n7619i5B9335a00545j7328M7176A44952d9819
11826b49798C5340N1670a74667j33995M0768J15646f774B72139E9561b15150B14647
11814C30977C8140g7260A50964j0044a64379l02228a1574k27287a07618r0376
$$ plain form
11895 -196556 87347 -166280 -101696 -299371 150171 -12525 -203696 -14044 38641 -19086 -251674
11884 -251674 -210757 -88402 -32272 -234932 -224527 240508 21092 66432 25013 331281 -279021
11872 -209922 68962 -35643 49018 86785 151060 -39996 13892 305926 118181 76604 61002
11861 61002 -185561 -307334 -74174 81818 -103427 63774 -246189 -239738 -305439 -42239 -138232
11850 -138232 199480 228095 153385 174750 92516 -190333 -371060 180990 125093 65048 -270462
11838 -251516 -276733 -154617 129859 72240 -95 29335 -100545 -117873 -70697 144952 -49819
11826 -249798 35340 87010 -174667 -308662 -267894 -152248 -6774 272139 59561 -215150 214647
11814 330977 38140 -77260 150964 140920 -164379 -466607 -11574 -238861 -107618 -197994
11804a97994A76918a27443e3892A39680J11710a51372d9771j70740R8788G9563
11793c2647F9373N5889n6236B4920c34719D7016a73368O7903j37359J06283A687
11781A51509C5143b42607A00243J17646L8013b00671B1030h3809A10079K8756
11771A38835k8629j432K263k9596l4013b8435R096G2718c4107j42219k5300B4552
11758H4253h4578c6741j86370c022B21908m688M2479F2598B1138i5403A86487
11746a90407A5990c88249A46282a68660A01159f7305b289j56732B99726C057b18707
11734F3291J89247b74522A56830e236j40550A4407J4407J09442a36674G1648J2082
11723H3730J56534a47726G4254L4142J95932a0731j1553j8396k57138E5445J39466
$$ plain form
11804 -197994 176918 -127443 -53892 139680 251390 -151372 -49771 -220511 -121723 79563
11793 -32647 69373 125262 69026 24920 -334719 47016 -173368 -105465 -242824 -136541 1687
11781 151509 35143 -242607 100243 217889 255902 -200671 21030 -83809 110079 138835
11771 138835 110206 108774 111037 81441 47428 -28435 -19339 72718 -34107 -176326 -201626 24552
11758 84253 -84578 -36741 -223111 -3022 221908 217220 259699 62598 21138 -95403 186487
11746 -190407 15990 -388249 146282 -168660 101159 -67305 -2289 -159021 299726 3057 -218707
11734 63291 252538 -274522 156830 -5236 -145786 14407 28814 138256 -136674 71648 83730
11723 83730 240264 -147726 74254 108396 304328 -10731 -22284 -40680 -297818 55445 194911
11712A94911n0199o9967K8143l3641i1052B60057a7721B01329f0045G8012l6338
11701D1674e0827r0244F9385M3787R2591K3144K03179D5254K0981b02111a7760
11689A64662N0587g7712J6487j34696B61740r3846a24109d9309Q390i846D93110
11677D75837d9251C11162J12484a46650L8063j7595A33886i2575A03586b89566
11666E69989g6235A25859C7465b38545j86608b0494o2708A67039Q1769j14547
11656A34261J48215r472a3528I6153b19997M5978f1366l2650J4834D2558N7670
11645A00228c2927j19412d8395A88600H5855b03809A76214G6787A0935K5315j5263
11634B0987h8342D5497J21192H3130A0466a65183M5229D21350A30260a65034e1402
$$ plain form
11712 194911 144712 74745 102888 69247 -91052 260057 -17721 201329 -60045 78012 41674
11701 41674 -50827 -141071 69385 113172 205763 228907 432086 45254 66235 -202111 -17760
11689 164662 215249 -77712 -61225 -195921 261740 167894 -124109 -49309 -40919 -9846 493110
11677 475837 -49251 311162 423646 -146650 -108587 -126182 133886 -92575 103586 -289566
11666 569989 -76235 125859 37465 -238545 -425153 -20494 -83202 167039 248808 134261
11656 134261 282476 273004 -13528 96153 -219997 -174019 -61366 -94016 -79182 42558 100228
11645 100228 -32927 -152339 -48395 188600 85855 -203809 176214 76787 10935 36250 20987
11634 20987 -88342 45497 166689 83130 10466 -165183 -119954 421350 130260 -165034 -51402
11622a60017B07303h6388A05898b15588B54345p7815a53318B75215H0970Q9702
11612A70672n0823m2874d3842A39356c61452B18296E6642b96110C1702b0878C7219
11600B97007a59470D00378c7869E9933J76228a31149B55574q0645p1390a8943
11589I348a26588q4988g2774D08804j25666I4490K96234m1234A52332a77817Q7945
11578h9872C7982c07461G7913J35610n1826c346H5852J77047D1025b7353A23485
11566B75025H8928J93725I9375a02853C63755H6924a51588D529J85317E6945L42075
11555C99020D0116a80829C201b9233A72072h731A87831C1437b9755I1266a08998
11543f7306B20156R2908c19707C56434a0403I4176a23277C15314K9599a25547
$$ plain form
11622 -160017 207303 -86388 105898 -215588 254345 176530 -153318 275215 80970 170672
11612 170672 119849 76975 -43842 139356 -361452 218296 56642 -296110 31702 -20878 37219
11600 297007 -159470 400378 -37869 59933 236161 -131149 255574 174929 103539 -18943
11589 9348 -126588 -211576 -72774 408804 283138 94490 390724 349490 152332 -177817 -89872
11578 -89872 37982 -307461 77913 213523 161697 -3346 85852 262899 41025 -27353 123485
11566 275025 88928 282653 99375 -102853 363755 86924 -151588 4529 189846 56945 399020
11555 399020 40116 -180829 3201 -29233 172072 -8731 187831 31437 -29755 91266 -108998
11543 -67306 220156 313064 -319707 356434 -10403 94176 -123277 315314 344913 -125547
11532a13175G1476l1634e4531B82314D8187K91242a56930j258A33489J14703p2859
11521A75333k1430k7853d1898B6154c67085G0021L2068R5313j3197F8951d2346
11509B42380I3971a14062A57639N9046O134B4520P9602m7363c3829A19014N605
11498A24619b10341D0175M6350J99214E3108N5981J03193g5414E4660B5814d61
11486B90520j35408C6359J8793O3594E9219b455E4159J76261A14184R2489N387
11475B12060O4146H6612R2707G7813K63520b5582B07408r2237J66751D2553K27507
11464B70060b018j56964G6546F732L45006a64774A69094J03396o9529F323L09982
11453C16305G4130P2972J11787a16025E7679N1900b8418j2703H7760p066a68849
$$ plain form
11532 -113175 71476 39842 -54531 282314 48187 339429 -156930 -158188 133489 248192 175333
11521 175333 153903 126050 -41898 26154 -367085 70021 102089 197402 184205 68951 -42346
11509 242380 93971 -114062 157639 216685 222819 24520 104122 56759 -33829 119014 124619
11498 124619 -210341 40175 86525 285739 53108 109089 212282 -75414 54660 25814 -461
11486 290520 155112 36359 55152 118746 59219 -2455 54159 230420 114184 206673 212060
11475 212060 276206 86612 179319 77813 341333 -25582 207408 115171 281922 42553 270060
11464 270060 -2018 -158982 76546 6732 351738 -164774 169094 272490 202961 6323 316305
11453 316305 74130 147102 258889 -116025 57679 109579 -28418 -41121 87760 80694 -168849
11441E4089g0541H2087j5184K08340j19740a70927C58188C3917K60198f4168f022
11429d7446A07459N1438a55453K4733Q726j88342A72615a98482A42084b84812
11418b92913C4837a42565B70027c7623G2560e4332I6710a22361j40510g9763A63272
11406c9405I1315b36025A22437A2521c1662E8317L0564m1125f7308E16716A0610
11394B94453c07122A04880l1750f1424E0790a08497h690G5547P9341a41493E7194
11382B78750A14043M8885R6929a99888e1565o0552p1615d7377k48034A08493p837
11371A00656a25837k4957m2055i4904m2861j65899A07362A5130a64095L8233B0888
11359A13340i6465D6561J1477L3278g2413j65208G9302l8545P2693E6032J44344
$$ plain form
11441 54089 -70541 82087 66903 275243 155503 -170927 358188 33917 294115 -64168 -6022
11429 -47446 107459 158897 -155453 -130720 -121994 -310336 172615 -198482 142084 -284812
11418 -292913 34837 -142565 270027 -37623 72560 -54332 96710 -122361 -262871 -79763 163272
11406 -39405 91315 -236025 122437 12521 -31662 58317 88881 47756 -67308 516716 10610
11394 294453 -307122 104880 73130 -61424 50790 -108497 -8690 75547 154888 -141493 57194
11382 278750 114043 162928 259857 -199888 -51565 -112117 -183732 -47377 -295411 108493 100656
11371 100656 -125837 -150794 -192849 -94904 -137765 -303664 107362 15130 -164095 -125862 20888
11359 113340 -96465 46561 58038 91316 -72413 -237621 79302 40757 113450 56032 200376
11348B00376c6676J5176d637F5805K970b02625A25826a55261I6679e0697B37658
11336b31954I4933a37354B59177a5760r8709e3684I6157b40672C5755i8051c0002
11324a00198c6118a1533l1658G417M3084J21178P1083a99023A45580a26722j56077
11313b82799A84955a67314j1263A72130d220G0358C0578M5025f0019G845c0399
11301g9671H4432i1959J6294A38414P2203H7893a28488C6710J27102A7585O707
11290B4292f7228j64284A14942c20860d5552m2830l63828K17598B85944c20389
11279A8704a48591k20834a59701O326f4427j35144A63690c45792D4409a53349
11268d2847A29028E6897k4666J77537A2815e7832j85900A04756l5915Q1206M2566
$$ plain form
11348 200376 -36676 -21500 -4637 65805 68775 -202625 125826 -155261 96679 -50697 237658
11336 -231954 94933 -137354 259177 -15760 -114469 -53684 96157 -240672 35755 -98051 -30002
11324 -100198 -36118 -11533 -43191 7417 50501 171679 242762 -199023 145580 -126722 -282799
11313 -282799 184955 -167314 -178577 172130 -4220 70358 30578 75603 -60019 7845 -30399
11301 -79671 84432 -91959 -75665 138414 210617 87893 -128488 36710 163812 17585 24292
11290 24292 -67228 -231512 114942 -320860 -45552 -88382 -452210 -234612 285944 -320389
11279 18704 -148591 -369425 -159701 -153375 -64427 -199571 163690 -345792 44409 -153349
11268 -42847 129028 56897 32231 209768 12815 -57832 -243732 104756 68841 150047 192613
11257A92613E4709A4322L0677i9794L2802l95588a10132I1574b30399e102m06920
11246d12022d0160N068j37141f6113p6512B10088E6700a48594F056e1261p7949
11235a29210b8601l94688A05327K00018a6087H18b02965a00834A0309K75504F7469
11223A11410B0035J0440j455b64433d3185a1794j4280j35527n4260j87819A644
11211c08052a48514B23238a76257A80918D9221N8326g2639A12273a58472m00353
11201e58825A109J69883l1132d437n5973j36066B05018a49305N2795b9995A4784
11189A79678b5038l0730l7439k2971j33352R6196B0509a41939j6765A28855b10281
11177A14946c3803A09008a75353k54346j8534D3508c5796B63139a92870j6889
$$ plain form
11257 192613 54709 14322 44999 -99794 -66992 -462580 -110132 91574 -230399 -5102 -412022
11246 -412022 -40160 -35092 -172233 -66113 -142625 210088 56700 -148594 6056 -51261 -129210
11235 -129210 -28601 -423289 105327 305345 -16087 818 -202965 -100834 10309 285813 67469
11223 111410 20035 30475 29020 -264433 -43185 -11794 -26074 -161601 -215861 -403680 1644
11211 -308052 -148514 223238 -176257 180918 49221 107547 -72639 112273 -158472 -558825
11201 -558825 1109 170992 139860 -4437 -60410 -196476 205018 -149305 -96510 -29995 14784
11189 179678 -25038 -55768 -93207 -116178 -249530 -153334 20509 -141939 -158704 128855 -210281
11177 114946 -33803 109008 -175353 -429699 -448233 43508 -35796 263139 -192870 -209759
11167b09759k00712A24062L4660J67593a43827A61371K1029j6065j5529N7850
11157B08656b49140O2020G8894J39215a48577L2935C55924A06188a67287E00786
11146a350B310d18803A38193f5807o2359j42225h2795B06821K636E1625G776a37624
11133c1652I820d4248A16852O9948G8484B7312h5632l4081Q04c234j75472b3551
11120a3358A4465l835e2444H8799L7733j600k0014l0234Q221M22285a41456B88868
11107a72823r6618C33101H1928b07238A10235d0931B99296j23199Q8140E6559
11096b9792E8746b7139C25704j39313k3664p2248J52670a49168C77456A0453L53326
11085C63779a8743l8103B93123j01209J24088A54028J67573I9751N3673J60115
$$ plain form
11167 -209759 -410471 124062 158722 326315 -143827 161371 182400 166335 150806 208656
11157 208656 -249140 -187120 78894 218109 -148577 -115642 355924 106188 -167287 500786
11146 -1350 2310 -418803 138193 -65807 -128166 -270391 -82795 206821 209457 51625 7776 -137624
11133 -31652 9820 -44248 116852 186800 78484 27312 -85632 -119713 -118909 -3234 -178706 -23551
11120 -13358 14465 10630 -52444 88799 126532 124932 104918 74684 82905 505190 -141456 288868
11107 -172823 -269441 333101 81928 -207238 110235 -40931 299296 176097 264237 56559
11096 -29792 58746 -27139 325704 186391 162727 90479 243149 -149168 377456 10453 363779
11085 363779 -18743 -56846 293123 191914 316002 154028 321601 99751 153424 313539
11075C13539C8044N96681B93384l4689k366o4165K00201a14535j0115D86957J83977
11064F70934A07904N05800K6161j16670j60643L17850k49937J68207l758j0231
11054E84683m4659j34084J94416L01146l88080j7727J49826k98212K99465R9940
11044G46714j6130j60581A35551P65720C67167L64415k17287J3108K68165L6332
11034H31900j92551k62638L47882k12652K91469l99505L14503l4226l1809J22132
11024G74505k72991K57727j79696M4174J92970j76499k62561J55936J0328j85700
11014C58193K00501k10347r1041K89878n9427J94231r8309j03567K41249r8693
11004F22668B37351O27949k20125j54375J77509Q7213o5088j48357J20914o9783
$$ plain form
11075 313539 38044 634725 293384 258695 256329 192164 392365 -114535 -124650 486957 670934
11064 670934 107904 613704 639865 523195 362552 680402 430465 598672 594914 584683
11054 584683 540024 405940 600356 901502 513422 495695 645521 347309 646774 746714
11044 746714 730584 570003 135551 901271 367167 731582 514295 527403 795568 831900
11034 831900 639349 376711 724593 511941 803410 403905 718408 684182 652373 774505
11024 774505 501514 759241 579545 623719 816689 640190 377629 533565 543893 358193
11014 358193 558694 348347 257306 547184 487757 681988 583679 480112 721361 622668
11004 622668 237351 865300 645175 490800 668309 755522 690434 542077 662991 593208
10994E93208m3628M2584L01810m27253J24386N4823K73835o0035j07220j49408
10984F03102L00539L2473J00802J88842J06790j58807K93130j46949O34077q5453
10974A868546J31822p5050N46144K43924l7438l39087J92000k96789k53133l5781
10964A945158j09358k21931J44087K03099J6009o4586J66259j00594J57999k06107
10954A930035l31189N746j92623j79631j8231m51208k0254l3938J33714k06485
10944F35936B22605Q2745J5175J66659B06313Q4014K89867k31138J45581b1747
10933C67072a02656q2827G1201a50763D53149A03748J65119G2228a78976g8225
10922I1588Q935a02455E2198k0178N2460A7720k272e8267j86791A36364c31013
$$ plain form
10994 593208 549580 592164 893974 466721 591107 645930 919765 859730 752510 603102
10984 603102 903641 936114 1036916 1225758 1332548 1173741 1466871 1319922 1953999 1868546
10974 1868546 2000368 1925318 2471462 2715386 2677948 2338861 2530861 2234072 1980939 1945158
10964 1945158 1835800 1613869 1757956 1961055 1977064 1912478 2078737 1978143 2136142 1930035
10954 1930035 1598846 1604592 1411969 1232338 1214107 762899 742645 708707 842421 635936
10944 635936 222605 305350 320525 487184 206313 290327 580194 349056 494637 -21747
10933 367072 -102656 -185483 71201 -150763 453149 103748 268867 72228 -178976 -78225
10922 91588 100523 -102455 52198 32020 84480 17720 15448 -58267 -245058 136364 -331013
10910b7555H4242C2054c02704J47718c4752A07450a92462A96645a05755B54625
10899B20197h8830H8903C7939c29799H1664B2654c37315A14248D839b84654j4572
10888b99226A69182O1889a29326I6653N4374Q4183L2452e7694m5123a4855k3686
10877c8541j89804A95932g6342j31565d067A94550J30208F4459A8250c45014A6951
10865d19446B13553a74855D3156J2827O293J11324g3135j25699i1559j03566i3149
10853D86308F8160K1321g7040r015C20007a01557n6408J7856G373K44633H0787
10841B1996a51033m1727j40358a17084B03622J12051g4055q864q4568g6197j33516
10830b09713B5677r30g5621c6143C4983b6599A33193C7475M9262b73664G5291
$$ plain form
10910 -27555 84242 32054 -302704 -154986 -34752 107450 -192462 196645 -105755 254625
10899 220197 -88830 88903 37939 -329799 81664 22654 -337315 114248 4839 -284654 -299226
10888 -299226 169182 231071 -129326 96653 151027 235210 267662 -57694 -102817 -14855 -38541
10877 -38541 -228345 195932 -76342 -207907 -4067 194550 324758 64459 18250 -345014 16951
10865 -419446 213553 -174855 43156 55983 62276 173600 -73135 -198834 -91559 -195125 -93149
10853 486308 68160 89481 -77040 -86055 320007 -101557 -157965 -140109 7373 252006 80787
10841 21996 -151033 -192760 -333118 -117084 203622 315673 -74055 -82919 -167487 -76197 -209713
10830 -209713 25677 24747 -75621 -36143 34983 -26599 133193 37475 86737 -273664 75291
10818a44165q7617g5524a0256l50343J41398H9978h3091D05869A14854a48411
10807b7581A35920l9331M8947c79803A19879J35560o7456A2126c19441J1422A0303
10795A90652a65479b0860j05943a4846H2154M72B2997J22994l89a16775a9889
10783A4904a95371c2772k28186P4610K8525M4263B55207a85437A26567e0647j29607
10772a80254B3264L15128f934A54522R823o993B8052J60412G0543P7735F0027
10760A06581b3731D6763m599a09525p2318G5058d96488K08437D5858a25448F409
10748a59028c7931A36832k3814d5576j55464k70530A63513o5544a27701j76183
10738c03884e5080j8504d950A73328c92457i4051k70005D4402a02417q8861A6307
$$ plain form
10818 -144165 -231782 -75524 -10256 -360599 -219201 89978 -83091 405869 114854 -148411
10807 -27581 135920 96589 145536 -379803 119879 255439 187983 12126 -319441 -308019 10303
10795 190652 -165479 -20860 -126803 -14846 82154 82626 22997 145991 145602 -116775 -19889
10783 14904 -195371 -32772 -260958 -186348 -157823 -113560 255207 -185437 126567 -50647 -180254
10772 -180254 23264 338392 -6934 154522 164345 157352 28052 188464 70543 148278 60027
10760 106581 -23731 46763 42164 -109525 -181843 75058 -496488 -288051 45858 -125448 6409
10748 -159028 -37931 136832 113018 -45576 -201040 -471570 163513 97969 -127701 -303884
10738 -303884 -55080 -73584 -4950 173328 -392457 -94051 -364056 44402 -102417 -191278 16307
10726a46576j29162K2104A59372b96669A31803i7879H6436D0414b98511J13834
10716a84677A67947a28228M8932A67612L3386c84172e0673a9940A19233a1350
10705B14010b67075h7446l0976o6542g4023D03739b32700D4084K8816J18705i9536
10693b9249B47558b2407j7224o349J1262B37898b23672a3078H2418d748p7117
10682h1865K0024a2068m36527A11120l6889b1316o78r4418L2391C0912b79211
10670a07022c0039o5084K0728a5626F4442a66746L8879E8824a44079f4999D919
10658a04085A28205E8024b41294d1416k11646a9801n4034O541j74304g5901C232
10646a04042k19108J53262j22545j06079a71713C74303c5676B44574O1546A6955
$$ plain form
10726 -146576 -275738 -253634 159372 -296669 131803 -97879 86436 40414 -298511 -184677
10716 -184677 167947 -128228 -79296 167612 200998 -384172 -50673 -19940 119233 -11350
10705 214010 -267075 -87446 -118422 -184964 -74023 403739 -232700 44084 72900 191605 -99536
10693 -29249 247558 -22407 -39631 -45980 -34718 237898 -223672 -13078 82418 -4748 -81865
10682 -81865 -61841 -12068 -448595 111120 74231 -21316 -21994 -116412 -84021 30912 -279211
10670 -107022 -30039 -95123 -74395 -15626 64442 -166746 -127867 58824 -144079 -64999 4919
10658 -104085 128205 58024 -241294 -41416 -253062 -19801 -73835 -67294 -241598 -75901 3232
10646 -104042 -323150 -169888 -292433 -398512 -171713 374303 -35676 244574 306120 16955
10635D290a12230L2950J1536o5293L8892A7509K37205c13654B69452a10550A7324
10623b14889O1015C40209a42097k29482J56916g0523A9402D476f676k40199A2784
10611a89338k2226K9652O7752q3655k63869D2992K43077A07884a91045P9518m2061
10600a53588j39645f2557A36952l8489B3859J06397b96244b3045j95419k9182
10590b47646h9173c3039B47988e2135o4699j38958f7624j61657J5074i1745E3794
10578B6589a21982B7641R3315j5228b0325j77117i4807A91989C4611a90268B97087
10566a01314N703n412o4722C3812a05389E882a48996B15077h4114B66176c09418
10554i2950k0452q619C8791b95465R4172d8681A87530a99439N7420A55381a51056
$$ plain form
10635 4290 -112230 -79280 -67744 -133037 -94145 17509 254714 -313654 269452 -110550 17324
10623 -214889 -153874 340209 -142097 -371579 -214663 -70523 19402 4476 -6676 -246875 12784
10611 -189338 -211564 -181912 -114160 -197815 -461684 42992 286069 107884 -191045 -111527 -153588
10600 -153588 -293233 -62557 136952 98463 23859 130256 -296244 -23045 -218464 -247646
10590 -247646 -89173 -33039 247988 -52135 -116834 -255792 -67624 -229281 -214207 -91745 53794
10578 26589 -121982 27641 120956 105728 -20325 -197442 -94807 191989 34611 -190268 297087
10566 -101314 -95611 -101023 -165745 33812 -105389 5882 -148996 215077 -84114 266176 -309418
10554 -92950 -113402 -122021 38791 -295465 -201293 -48681 187530 -199439 -142019 155381 -151056
10542i1141A59001f5819B30465c15779A6919J24301D125b4302A29373a34107B71602
10530b008A15209B6590a56865i703A86938e1192A67411L01572a96944A89756b91970
10518b13159F1752g6254D6537J50267c45605j71538a1268A83935J37542b6168
10507a04761r2429h3421j80845A36901B821J9476c47952J9929A24302J02333a04534
10495A2009L6513c06995m6493a52732D1733i7526A2948a51209A76576a30398A19097
10483A93423a8008B59302A04336N59988k12883j16162a6811k10053B40431A13942
10472a03131A63851l2065K9726D7561L5897a30486C36707b57978a08299k7519
10462a35818j3266E7893f8406A86363b05405j30406J44072g8656C8931O6695f3165
$$ plain form
10542 -91141 159001 -65819 230465 -315779 16919 141220 4125 -24302 129373 -134107 271602
10530 -2008 115209 26590 -156865 -9703 186938 -51192 167411 468983 -196944 189756 -291970
10518 -213159 61752 -76254 46537 196804 -345605 -517143 -11268 183935 321477 -26168
10507 -104761 -197190 -83421 -264266 136901 2821 22297 -347952 -328023 124302 226635 -104534
10495 12009 48522 -306995 -353488 -152732 41733 -97526 12948 -151209 176576 -130398 119097
10483 193423 -18008 259302 104336 664324 451441 335279 -16811 -226864 240431 113942
10472 -103131 163851 131786 161512 47561 83458 -130486 336707 -257978 -108299 -135818
10462 -135818 -149084 57893 -68406 186363 -205405 -335811 -191739 -78656 38931 105626 -63165
10450a63596j7478d5263j24424A50232c7085D4175K3372f8765j38686A49978a2317
10438A40116m283L4170b7251F8422i1495n771E3260R2972R0659a84187C24950
10426b56469i735k61889b6588B8980j2544K028a81927A55015m4349a4059o8532
10415h2591l4458k90966f4919A31461g6920n5646j07000A96860i431k61146a07819
10403E7439Q5045n4317a39378j50802B99486m8858a82657G9908Q7829G1994M6280
10392A18274a1578A1601J56236D7217J13664E6376J34414l4128a39066A19300
10381C28986G4026J50220j04280J67372n0518b0725B30009j10922J66998r217
10371B76868o4358K6819K8254J81729j96498L31216K0658k41047d5110A28510
$$ plain form
10450 -163596 -181074 -45263 -169687 150232 -37085 44175 67547 -68765 -207451 149978 -12317
10438 140116 135833 170003 -27251 68422 -91495 -97266 53260 146232 236891 -184187 324950
10426 -256469 -9735 -271624 -26588 28980 16436 18464 -181927 155015 110666 -14059 -82591
10415 -82591 -117049 -408015 -64919 131461 -76920 -132566 -239566 196860 -9431 -270577 -107819
10403 57439 142484 88167 -139378 -290180 299486 250628 -182657 79908 167737 71994 118274
10392 118274 -11578 11601 167837 47217 160881 56376 190790 156662 -139066 119300
10381 328986 74026 224246 119966 287338 236820 -20725 230009 119087 286085 276868
10371 276868 212510 239329 267583 449312 252814 584030 604688 363641 -45110 128510
10360A15572J03566b34169a4318j3243C269J26507b14728A68320B378J08916L69242
10349D80536E0390j5677L07955j21527E8142M07415o6773K993m3436A33512D5603
10337B53299l1768E7520g1183B96081j21276m8366a33409A42627h2893K9123A14184
10325I8171a05401B72598m5633C5211J58407k8564K14041e9123b27C02196B0104
10313C67042A16815L7318D0431J37354a3607A75309l3038a84422B5904M4990a83568
10301I1467k9032a99792A29358a18734A08715m4252a4137p5252c3024j83555b2032
10289B12973n7332f49016D9283a65169h0702k757H512J3484A0426a09493k39952
10278c49445e5941k26113A28425h5009q7742c3911A77613C0665h5675j40322e7820
$$ plain form
10360 115572 219138 -234169 -14318 -27561 3269 129776 -214728 168320 2378 111294 480536
10349 480536 50390 34713 342668 221141 58142 465557 398784 401777 358341 133512 45603
10337 253299 221531 57520 -71183 296081 174805 126439 -133409 142627 -82893 -53770 114184
10325 98171 -105401 272598 226965 35211 193618 165054 379095 -59123 -227 302196 20104
10313 367042 116815 154133 40431 177785 -13607 175309 142271 -184422 25904 70894 -183568
10301 91467 62435 -199792 129358 -118734 108715 64463 -14137 -89389 -33024 -216579 -22032
10289 212973 155641 -649016 49283 -165169 -80702 -83459 8512 21996 10426 -109493 -349445
10278 -349445 -55941 -282054 128425 -85009 -172751 -33911 177613 30665 -85675 -225997 -57820
10266a25989B68120H7193k6171P6215K11639A17569P9727K00471p1968o7150J71046
10255D29695j0036G7035L63379A3779J45299b43169I329R1930O8394b1006k30068
10244b51074l2805a26529k5513C875N44J61946a86915B46993a72933H3844a5009
10232I7270l2481i9674F0719b57391j03429a26995a2302p4814A71219l3700c9043
10220A00073M6198D633a64720a2496C01337A21151a70143I5726b40523A46929
10209a23175C0007M7666p603a64321A42842c3069j39974j99818D4002c97268d7952
10197d09641K02543H9164c75645G1726a89303B73585b00448B2817f9414j09707
10187a79121B50190O3994j50991p5962e8987A90327k7542A3485b44925j69827
$$ plain form
10266 -125989 268120 87193 61022 137237 348876 117569 197296 397767 325799 258649 429695
10255 429695 419659 77035 440414 13779 159078 -243169 9329 101259 169653 -21006 -251074
10244 -251074 -283879 -126529 -152042 3875 4419 166365 -186915 246993 -172933 83844 -15009
10232 97270 64789 -99674 60719 -257391 -360820 -126995 -12302 -87116 171219 137519 -39043
10220 100073 146271 4633 -164720 -12496 301337 121151 -170143 95726 -240523 146929
10209 -123175 30007 77673 70070 -164321 142842 -33069 -173043 -372861 44002 -397268 -47952
10197 -409641 -207098 89164 -375645 71726 -189303 273585 -200448 22817 -69414 -179121
10187 -179121 250190 314184 163193 87231 -58987 190327 162785 13485 -244925 -414752
10177d14752J35335A55669a19237B52350A02008B7954c6374l55234A8310K4304
10167D2614M6100j4632c6837r2304M2313j02214d0289k70739J8370G6328a60062
10155a7237k8250j89479B21404h6168j4763A26062Q5982b10541A08428C9923J11634
10144A51557a48611M2474j22692c0794B09612E6000c26182a42671F0103b10383
10133b39979I2466i2019q4746D692b8510j98154d7864I2785h9256I6861d88201
10121F2177O6033m1320b8184j6607l01430b7316k2836j47485O2306O2954E9506
10109a0811C4123L4983j2338j2874d82341J59304a00164c0177q6066j32749j04359
10098c53351I6400a04089p5818B7184Q540A07a01801K7369B37561d0018o444j02315
$$ plain form
10177 -414752 -279417 155669 -119237 252350 102008 27954 -36374 -391608 18310 42614
10167 42614 88714 74082 -36837 -129141 -86828 -189042 -40289 -311028 -292658 76328 -160062
10155 -17237 -45487 -234966 221404 -86168 -100931 126062 212044 -210541 108428 39923 151557
10144 151557 -148611 -106137 -228829 -30794 209612 56000 -326182 -142671 60103 -210383
10133 -239979 92466 -92019 -176765 4692 -28510 -226664 -47864 92785 -89256 96861 -488201
10121 62177 128210 86890 -28184 -44791 -346221 -27316 -50152 -197637 -135331 -72377 59506
10109 -10811 34123 69106 56768 43894 -482341 -323037 -100164 -30177 -116243 -248992 -353351
10098 -353351 96400 -104089 -179907 27184 35724 107 -101801 -74432 237561 -40018 -46462 -148777
10086a48777e3216j6105D674b4014k08702g4023r7101j19059A24051D3690b71448
10074A5040i9941M4870k89123A32412J21339I1752J03809a50632j22696B39194
10063b93044E2632a88414o6745A66875N3837B9575L7634J18688b42798H3689c06505
10051b07045A41981b99322a30440D4603c4700I7844a55041j43658N6694E894e799
10039A03548a64981c6385G3752O3630L9735b89165c1834q3989l14833g4391A44222
10027a91036e010n370k49738A46148a70457E8871B3648a9875m18393B26446a05325
10015a21922B9082Q6701b931p8894H3131b81488h6163A68845a37460e4910I6833
10003c40380a59387j68339a58538l7943N4257J6343l35671B3300c93265Q3229
$$ plain form
10086 -148777 -53216 -69321 4674 -24014 -232716 -74023 -171124 -290183 124051 43690 -271448
10074 15040 -99941 -55071 -344194 132412 253751 91752 195561 -150632 -273328 239194
10063 -293044 52632 -188414 -255159 166875 220712 29575 67209 185897 -242798 83689 -306505
10051 -207045 141981 -299322 -130440 44603 -34700 97844 -155041 -298699 -242005 5894 -5799
10039 103548 -164981 -36385 73752 137382 177117 -289165 -31834 -115823 -430656 -74391 144222
10027 -191036 -5010 -10380 -260118 146148 -170457 58871 23648 -19875 -438268 226446 -105325
10015 -121922 29082 115783 -2931 -81825 83131 -281488 -86163 168845 -137460 -54910 96833
10003 -340380 -159387 -327726 -158538 -196481 -142224 -125881 -461552 23300 -393265 -310036
9993c10036J42737m63e7551j48187f3456j52899c3275k03544A40470d6011j8315
9982f4326m4202E9232b87002J12647c947j95634g8481L2083C9972a5423j30799
9971a46222j86308n6519A34944h9411o2599B1226b87474d2741D9298c25901C7493
9959d16626A19957D4728d72013a18226j63826B10992b24458C57241b07578k35476
9949d43054e1650o8114A53953K2587a36428j80675d7767k49479J17908h4160K8761
9938e5399A21232m3201i2936J8547j60385G551b36554P1750A26112b52918i8306
9926c89468J88447O2761A67399a19210b0946k48910B24929j05971b18717f7573
9915I8435a47953M024C03135b86954B61198a6905F5202c8832j86636i3741l1952
$$ plain form
9993 -310036 -167299 -167762 -57551 -205738 -63456 -216355 -33275 -236819 140470 -46011 -64326
9982 -64326 -108528 59232 -287002 -174355 -3947 -199581 -78481 -46398 39972 -15423 -146222
9971 -146222 -332530 -389049 134944 -89411 -152010 21226 -287474 -42741 49298 -325901 37493
9959 -416626 119957 44728 -472013 -118226 -282052 210992 -224458 357241 -207578 -443054
9949 -443054 -51650 -119764 153953 176540 -136428 -317103 -47767 -297246 -179338 -84160 -55399
9938 -55399 121232 78031 -92936 -74389 -234774 7551 -236554 -164804 126112 -252918 -98306
9926 -389468 -201021 -138260 167399 -119210 -20946 -269856 224929 118958 -218717 -67573
9915 98435 -147953 -143929 303135 -286954 261198 -16905 65202 -38832 -225468 -93741 -125693
9904a25693C2608a56148i778C1986l477L8716L70199A48037c00990f5318q8451
9893a53769l78342a14333F3125c68751A99129e5768K6675j99671A37453a94245
9882a4767l00703C1703J09495h6467o8212r4838O138a19811C21517i7011C861
9870a87159j24148J36021F6833C2044b32092g4904B36257b17760A04158J24909
9860B29067a968H4051J40511a04850J2693B87058D6976b33076g5511k43328c5523
9848F5197H479c46092C47021b59374g1016j31026j13213a21202A6895J882P1627
9837I0404c04961h9036B6176N5825L5875a32551J0762A4014a14712r9285i4629
9825A29513a18061A02041g8416D0994b56621J22991C8059K69708J18888i4011
$$ plain form
9904 -125693 32608 -156148 -9778 31986 28509 67225 437424 148037 -300990 -65318 -153769
9893 -153769 -532111 -114333 63125 -368751 199129 -55768 -29093 -228764 137453 -194245
9882 -14767 -315470 31703 141198 -86467 -154679 -249517 -243379 -119811 321517 -97011 3861
9870 -187159 -311307 -175286 66833 32044 -232092 -74904 236257 -217760 104158 229067
9860 229067 -1968 84051 224562 -104850 -92157 287058 46976 -233076 -75511 -318839 -35523
9848 65197 8479 -346092 347021 -259374 -71016 -202042 -315255 -121202 16895 18777 90404
9837 90404 -304961 -89036 26176 82001 117876 -132551 -121789 14014 -114712 -213997 -94629
9825 129513 -118061 102041 -78416 40994 -256621 -133630 38059 307767 426655 -94011
9814B03789I4747J52947a47289r242B48766a81744r326J7532A3153P4359J50076
9803B37588c4921j61501M6107j6083F9185B9853J5033c52745h3374K4892C3999
9791a59936a7993k30947C7557O1032a31805A31613b49909f9631j96430a3952l86860
9780d00812J01711B26258c49020e897B12479i3285A82766a78559D0941d47197
9769d7392k90789b4059M406j25497j36769G563d3200B04329b50004e7135C5876
9757I0303A2057a53494m627M3860A56517i2032o1322P5958h265j2224A31806b14033
9744B1530b28529J05704B32471a15208a2024A8873a67137j69878a10375A36346
9733F9837J5791a84045j28486b6133N344A86608n6585M4736c09451I2427a59431
$$ plain form
9814 203789 94747 247694 -147289 -156531 248766 -181744 -191070 -173538 13153 87512 237588
9803 237588 -34921 -196422 -150315 -166398 69185 29853 44886 -352745 -83374 -58482 33999
9791 -159936 -17993 -248940 37557 98589 -131805 131613 -249909 -69631 -266061 -13952 -400812
9780 -400812 -299101 226258 -349020 -5897 212479 -93285 182766 -178559 40941 -447197
9769 -47392 -338181 -24059 -19653 -145150 -281919 7563 -43200 204329 -250004 -57135 35876
9757 90303 12057 -153494 -158121 -114261 156517 -92032 -153354 -77396 -8265 -20489 131806 -214033
9744 21530 -228529 -122825 232471 -115208 -12024 18873 -167137 -337015 -110375 136346
9733 69837 85628 -184045 -312531 -26133 -20789 186608 130023 174759 -309451 92427 -159431
9721a21471k9364B4658O9044h1387B78541d1650I4429h5224k2752K9812l72452
9710d50616c3352A79504a47554f4366B6517g4585A8916K10750b13994c8752B29991
9698I3300J23926l3748p2290L2041a5987j67548Q0925j00931j36127a64451P859
9687a56592j16898O2309C50827b0359j20500A67032e5389b0301n0181A5532e917
9675a74231A46167a8257j43894A29230c19234a02735Q77M9926p8437A3525a47610
9663c64101C6507a94259m3769a10377A07748a13971p4086d5615m0013B438a25549
9651i3543D0629a68977M3719j61677A47182h368A8259b52882j33502m2011a97559
9639C9878O6853a48797j01750A06436R0700c05667d9986a6674j23809k81967J48734
$$ plain form
9721 -121471 -150835 24658 93702 -81387 278541 -41650 94429 -85224 -107976 -78164 -450616
9710 -450616 -33352 179504 -147554 -64366 26517 -74585 18916 229666 -213994 -38752 229991
9698 93300 217226 183478 111188 143229 -15987 -183535 -102610 -203541 -339668 -164451 -156592
9687 -156592 -273490 -211181 350827 -20359 -140859 167032 -55389 -20301 -70482 15532 -5917
9675 -174231 146167 -18257 -162151 129230 -319234 -102735 -101858 -51932 -130369 13525 -147610
9663 -364101 36507 -194259 -238028 -110377 107748 -113971 -188057 -45615 -85628 2438 -125549
9651 -93543 40629 -168977 -125258 -286935 147182 -8368 18259 -252882 -386384 -428395 -197559
9639 39878 106731 -148797 -250547 106436 197136 -305667 -49986 -16674 -140483 -422450 -273716
9628b73716E0624c63679F7123a26708J0274A26118J41648b77799A74908b72921
9617A91799K9993c397l8813j31699k57609J73519J01763A13410b1438l29770f2927
9605c2647j69396n9000E7153O94b00464i2950A50298a46734A36984b32176k39563
9594d71739B1358a82677m9509i2430j30572Q9877j85892N2153A2234b66916C56400
9582A26968b9653j16445j42950a01293k3008q5904f4432n15684h3034A01175a52210
9570e7768l8194o3311O2634B49665a17083A06567c49188J67417H4593J564b57752
9558d855E0255B2820K29271a05020a0708E3455B5248f1495j24195F3534a2282
9546A13232O6610a26936F3946a04932l57698H8300L1201N2172a8228j44906A7468
$$ plain form
9628 -273716 50624 -363679 67123 -126708 -116434 126118 267766 -277799 174908 -272921
9617 191799 221792 -3397 -42210 -173909 -431518 -257999 -156236 113410 -21438 -351208 -62927
9605 -32647 -202043 -261043 57153 57847 -200464 -92950 150298 -146734 136984 -232176 -471739
9594 -471739 21358 -182677 -232186 -92430 -223002 -133125 -319017 -266864 12234 -266916 356400
9582 126968 -29653 -146098 -289048 -101293 -124301 -210205 -64432 -580116 -83034 101175 -152210
9570 -57768 -95962 -159273 -96639 249665 -117083 106567 -349188 -181771 84593 86157 -257752
9558 -4855 50255 22820 252091 -105020 -10708 53455 25248 -61495 -185690 63534 -12282
9546 113232 179842 -126936 63946 -104932 -462630 88300 119501 171673 -18228 -163134 17468
9534C3808a23830C5541M4362b8933C802a5165m8048n740l5777L479k22548C8805
9521a02545J9082A9328b84231I783a11349L2800B99653f6443B3982e9407k398
9510f1805k74773e4381A04617c42854L5217A36791f1118E7122a15425k28327P1690
9499b72062F3095j5303a38244F8470h7436l4403j20083m4702A14212b32658k47626
9488d80284K01142A33664F4206j4211i7292M7969A40910a71112o8324M7755A25313
9476A22557a80262A1933a17530B36216g429B0440B72P0565M5663h282m5869o6470
9464a20621k2138O1079q4285M6086K8371k69630c104B31265a7150k65419A81008
9452b61364R4507k1137I3666h2879B53201h6101j70161J24323k76555A7856m655
$$ plain form
9534 33808 -123830 35541 79903 -28933 3802 -15165 -63213 -68953 -104730 -101251 -323799 38805
9521 -102545 -83463 19328 -284231 9783 -111349 -78549 299653 -66443 23982 -59407 -61805
9510 -61805 -336578 -54381 104617 -342854 -307637 136791 -61118 57122 -115425 -343752 -272062
9499 -272062 63095 47792 -138244 68470 -87436 -121839 -241922 -286624 114212 -232658 -480284
9488 -480284 -279142 133664 64206 49995 -97292 -49323 140910 -171112 -239436 -191681 125313
9476 122557 -180262 11933 -117530 236216 -7429 20440 272 70837 116500 -8282 -54151 -120621
9464 -120621 -142759 -81680 -165965 -119879 -91508 -361138 -3104 231265 -17150 -282569 181008
9452 -261364 -166857 -187994 93666 -82879 253201 -86101 -256262 -131939 -408494 17856 13201
9441A3201N5726a13159F9396b45539R6883D1110N0907b20877j62173a50100H306
9429d05924G0314L06293A84743e0943b409j39270a4804l75577d2405M966A27693
9417b04142f9403C8169a46153A29271i3744d4022A16145l27k0093E447f8747b0349
9404A51509j6855a04878B31692A04599i388l57368a6862E8753a56894A54650A3816
9392b28411m5019k26016F5860K30045F1859a47095r5068K6517A6795a19256j30502
9381b49758g9386l1704Q878c5846j69471f0680j83538e7856F7240a01088B7916
9369C63871G709b14503G2999a07368d5392N170A3228K96699i638j64932E8577
9357d22879c5984D7180e2410D8259a59007j59790A46414R1441G3106L4538b57702
$$ plain form
9441 13201 68927 -113159 69396 -245539 -148656 41110 92017 -220877 -383050 -150100 8306
9429 -405924 70314 376607 184743 -50943 -2409 -141679 -14804 -390381 -42405 -37439 127693
9417 -204142 -69403 38169 -146153 129271 -93744 -44022 116145 115818 95725 5447 -68747 -20349
9404 151509 134654 -104878 231692 104599 -9388 -366756 -16862 58753 -156894 154650 13816
9392 -228411 -273430 -499446 65860 295905 61859 -147095 -242163 -215646 16795 -119256 -249758
9381 -249758 -79386 -111090 -102212 -35846 -205317 -60680 -244218 -57856 67240 -101088 27916
9369 363871 7709 -214503 72999 -107368 -45392 -40222 13228 309927 -9638 -174570 58577
9357 -422879 -35984 47180 -52410 48259 -159007 -318797 146414 237855 73106 107644 -257702
9345b8976D2879a78293K6686k707a1556E9014e6966Q572D7713L21304b55802i3326
9332A10713b6717A1401M4617N559b68165A02695b15177O5769l0938B78330D9281
9320A93747a24443d6454j95618d3716C08640h8845A9612c97911a26408A51942
9309A10742b0675j41463b3409m5582A85636e8365j89741I3684j1111J86641b37757
9297G1127L6997R5633b1078H1433b09176j76995O3317A15898c3360E4306F072
9285D6315a63643f3312r44B0394a12258G3433M1445E1079A9253b97522n7350I1529
9272e4712j29925l8600E574a22650F64b07140D7822c4326m3702r6516D5706b7027
9259a31564A52510b7214Q390C31679E9144c18524f5168A11902a73692f9716A07289
$$ plain form
9345 -28976 42879 -178293 -151607 -154314 -11556 59014 -56966 -48394 47713 369017 -255802 -93326
9332 110713 -26717 11401 56018 61577 -268165 102695 -215177 -149408 -180346 278330 49281
9320 193747 -124443 -46454 -242072 -43716 308640 -88845 19612 -397911 -126408 151942
9309 110742 -20675 -162138 -23409 -68991 185636 -58365 -248106 93684 82573 269214 -237757
9297 71127 108124 203757 -21078 81433 -209176 -386171 -322854 115898 -33360 54306 6072
9285 46315 -163643 -63312 -64256 20394 -112258 73433 114878 51079 19253 -297522 -354872 91529
9272 -54712 -184637 -223237 5574 -122650 664 -207140 47822 -34326 -78028 -174544 45706 -27027
9259 -131564 152510 -27214 -18824 331679 59144 -318524 -65168 111902 -173692 -69716 107289
9247C3121a03219o1260A73540G8249C3420L8032b93975D1758K10207a1539k50534
9236b62073f0727I3120a53109B5745a51710D9668J1731J67441I7211f1059j87340
9225b48399e3529j435l5618a9578m0678o5250A5742b57561a12429p353A44028
9213b99667a03567N1450k53041C95014A86077m5707E3046b31787A77561F7853
9202c41581k504J70467d2749j02174p4722k35019a75935d2730q1535M3005j7444
9191i8704A5317b8478H1135L9356a56740I8002L14498b17026B4913L82806b20
9179e12082J41989A7619g9286C00020A36718a76746I8994a16246m188l42226h9642
9167b23552j36074G978K89256b28942L0687E401c26637g4121E5666a95067b2618
$$ plain form
9247 33121 -103219 -164479 173540 78249 33420 71452 -293975 41758 251965 -11539 -262073
9236 -262073 -60727 93120 -153109 25745 -151710 49668 61399 228840 97211 -61059 -248399
9225 -248399 -53529 -54964 -90582 -19578 -60256 -125506 15742 -257561 -112429 -119782 144028
9213 -299667 -103567 -52117 -305158 395014 186077 140370 53046 -231787 177561 67853
9202 -341581 -344085 -173618 -42749 -144923 -219645 -454664 -175935 -42730 -124265 -81260 -98704
9191 -98704 15317 -28478 81135 120491 -156740 98002 412500 -217026 24913 407719 -220
9179 -512082 -370093 17619 -79286 300020 136718 -176746 98994 -116246 -120434 -462660 -89642
9167 -223552 -359626 7978 297234 -228942 -198255 5401 -326637 -74121 55666 -195067 -22618
9155a40175A64617a29589A4161b14162i7658H3658A237g9281G3155a60502l246
9144a63748A67304g4198A8998R7977b1307A07422a33545n5140e8637A89196b5019
9132H2823b22551A12498a45897G6635l7549L0333i7951j49638B353Q1925a17474
9120I059b89225N8459M0743M0930e6143j72685n6345A55958e2140J5698B86799
9108G983M51828I725J4159c2761k6467J3280j32213O2044A48498c35112h432j25692
9096a34124k110H2885k3054c06059F0065b62951a03200R051A25411j3470b73630
9084D50955a85396L5224g3146A38785a22338j02350F8392a03117F0978c51057
9073f0507C56209l2171F5545a33233A405a63703I1223h8125F51a11628K0932l2382
$$ plain form
9155 -140175 164617 -129589 14161 -214162 -97658 83658 1237 -79281 73155 -160502 -163748
9144 -163748 167304 -74198 18998 116975 -21307 107422 -133545 -188685 -58637 189196 -25019
9132 82823 -222551 112498 -145897 76635 39086 69419 -97951 -247589 2353 84278 -117474
9120 9059 -289225 -230766 -190023 -149093 -56143 -228828 -285173 155958 -52140 -36442 286799
9108 7983 459811 9725 23884 -32761 -59228 -45948 -178161 -116117 148498 -335112 -8432 -134124
9096 -134124 -136234 82885 59831 -306059 60065 -262951 -103200 -94149 125411 111941 -273630
9084 450955 -185396 -150172 -73146 138785 -122338 -224688 68392 -103117 60978 -351057
9073 -60507 356209 324038 65545 -133233 1405 -163703 91223 -88125 651 -111628 -90696 -123078
9061a23078j9753j78669Q5047R3783j23493A0797d4820A99608b32047B53981a44966
9049A84690f4066C00668k2114j03667C6301J34024c06507E7683a27907A2401J9567
9038C1968g2585B64142A25867j6116C5719j2617P7914f6854k42131G7171b34531
9026i4200k45624B02656F2080b76324p9875A03209N9208m7637b1847A99987h7099
9014a16941J2088A46235a94878G3549c52410A49582c98223K6804i1823A83873
9003b56008G5046b02948k142N2019d5076A57807b7642N611j85499A12514a8458
8991a76668Q7660B09733b008G7817J02629a981k53051c3375k87814r3355a26498
8979b00935f5577E8808K3444b07277e6345J1158A4067a16629j07273A81460b17029
$$ plain form
9061 -123078 -142831 -321500 -236453 -142670 -266163 10797 -44820 199608 -232047 253981 -144966
9049 184690 -64066 300668 278554 174887 36301 170325 -306507 57683 -127907 12401 31968
9038 31968 -72585 264142 125867 109751 35719 23102 101016 -66854 -308985 77171 -234531
9026 -94200 -339824 202656 62080 -276324 -356199 103209 162417 114780 -21847 199987 -87099
9014 -116941 -104853 146235 -194878 73549 -352410 149582 -398223 -371419 -91823 183873
9003 -256008 75046 -202948 -205090 -153071 -45076 157807 -27642 -22031 -207530 112514 -18458
8991 -176668 -89008 209733 -2008 77817 180446 -1981 -255032 -33375 -321189 -414544 -126498
8979 -200935 -65577 58808 82252 -207277 -56345 -45187 14067 -116629 -223902 181460 -217029
8967b47258J16580B7799e1407I8020k8940l4501b29230c594A4400K05461a44840
8955a11658E2350b96667a31543G4819a59560j4230B29269h531A83733a46692B76447
8943g4058n4507D1624a48328j9725O0284A9486g1059b5699D15235A40998K44660
8932C85658c8995l56666a93381M5758r4977C22463I1453J81713O05821J532827
8922B411814O150838J916457C410992H23086L1426k11556k28371a57412N3773
8913a03639I7756d6481A86682j0053n4256J44046b5793j60532A17678i0944r4590
8902a85534n7211h7847C45422C8842a58198o1960C6603a99148H1325J41427a15536
8890i9589E7901b48270I327d4483J3644B24584B7828j3022K07228a38853B11084
$$ plain form
8967 -247258 -130678 27799 -51407 98020 69080 34579 -229230 -3594 14400 219861 -144840
8955 -111658 52350 -296667 -131543 74819 -159560 -173790 229269 -8531 183733 -146692 276447
8943 -74058 -128565 41624 -148328 -168053 -107769 19486 -71059 -25699 415235 140998 385658
8932 385658 -38995 -395661 -193381 -147623 -242600 322463 91453 273166 878987 2411814
8922 2411814 8562652 10479109 3410992 823086 854512 642956 414585 -157412 -103639
8913 -103639 97756 -46481 186682 176629 122373 266419 -25793 -186325 117678 -90944 -185534
8902 -185534 -242745 -87847 345422 38842 -158198 -220158 36603 -199148 81325 222752 -115536
8890 -99589 57901 -248270 9327 -44483 -30839 224584 27828 14806 222034 -138853 211084
8878C10907a51734K7799l8612m1062l16724a90549j32056I5028a846I4252j8126
8867G6126K10364B0077h2941l1038B0483a4887n9732j26167j980b9632B12208
8855F2551C1052a19568A3755a87137Q2435L4130a7220j83472h6216A5347a96689
8843b28723B41368H034b54386a16973I0354n060a60113N909B11434a58851I6655
$$ plain form
8878 310907 -151734 -123935 -162547 -203609 -520333 -190549 -322605 95028 -1846 94252 76126
8867 76126 286490 20077 -82941 -113979 20483 -14887 -74619 -200786 -202766 -29632 212208
8855 62551 31052 -119568 13755 -187137 -104702 -70572 -17220 -200692 -86216 15347 -196689
8843 -228723 241368 8034 -254386 -116973 90354 85294 -160113 -154204 211434 -158851 96655
$$ [...]
##END NTUPLES=NMR SPECTRUM
##END=
