##TITLE=AC1621_CTIAN13352_8326002_7VyrGmWWVK
##JCAMPDX= 6.0         $$ Bruker NMR JCAMP-DX V2.0
##DATA TYPE= NMR SPECTRUM
##DATA CLASS= NTUPLES
##ORIGIN= BRUKER
##OWNER= Administrator
$$ 1.72 TOPSPIN		Version 2.1
$$ 2013-11-13 17:04:56.539 -0800  Administrator@X
$$ Compression mode = diff/dup
##.OBSERVE FREQUENCY= 400.02188249412
##.OBSERVE NUCLEUS= ^1H
##.ACQUISITION MODE= SIMULTANEOUS (DQD)
##.ACQUISITION SCHEME= undefined
##.AVERAGES= 64
##.DIGITISER RES= 22
##SPECTROMETER/DATA SYSTEM= spect
##.PULSE SEQUENCE= noesygpps1d.comp
##.SOLVENT NAME= COFFEE_meoh
##.SHIFT REFERENCE= INTERNAL, COFFEE_meoh, 1, 14.96087
##AUDIT TRAIL= $$ (NUMBER, WHEN, WHO, WHERE, PROCESS, VERSION, WHAT)
$$ ##TITLE= Audit trail, TOPSPIN		Version 2.1
$$ ##JCAMPDX= 5.01
$$ ##ORIGIN= Bruker BioSpin GmbH
$$ ##OWNER= Administrator
$$ $$ E:\/data/COFFEE/nmr/AC1621_CTIAN13352_8326002_7VyrGmWWVK/12/pdata/1/auditp.txt
$$ ##AUDIT TRAIL=  $$ (NUMBER, WHEN, WHO, WHERE, PROCESS, VERSION, WHAT)
(   1,<2013-11-13 17:04:50.852 -0800>,<Administrator>,<X>,<go>,<TOPSPIN 2.1>,
      <created by zg
	started at 2013-11-13 16:53:21.461 -0800,
	POWCHK enabled, PULCHK disabled,
       configuration hash MD5:
       C8 4E 4E 5D D3 5C D8 9E 9F 52 82 E0 59 8A DE 15
       data hash MD5: 64K
       DC 91 28 6E AE F5 C7 B6 B6 10 F8 AD E5 A9 5A 66>)
(   2,<2013-11-13 17:04:54.023 -0800>,<Administrator>,<X>,<proc1d>,<TOPSPIN 2.1>,
      <Start of raw data processing
       efp LB = 0.3 FT_mod = 6 PKNL = 1 PHC0 = 0 PHC1 = 0 SI = 128K 
       data hash MD5: 128K
       67 6F 70 86 E1 BA C4 99 84 CD C8 36 9E 9A 04 73>)
(   3,<2013-11-13 17:04:55.164 -0800>,<Administrator>,<X>,<proc1d>,<TOPSPIN 2.1>,
      <pk PHC0 = -82.57324 PHC1 = 0 
       data hash MD5: 128K
       EA E0 29 2C C6 55 D6 37 88 8D 1B 17 C8 75 05 63>)
(   4,<2013-11-13 17:04:55.727 -0800>,<Administrator>,<X>,<proc1d>,<TOPSPIN 2.1>,
      <abs ABSG = 1 
       data hash MD5: 128K
       04 63 57 3E BC 4C ED 57 8D 37 BD DC C5 D3 DF B6>)
(   5,<2013-11-13 17:04:55.852 -0800>,<Administrator>,<X>,<proc1d>,<TOPSPIN 2.1>,
      <abs ABSG = 2 
       data hash MD5: 128K
       9B ED 4C 7C 31 92 A2 47 D7 F6 4D 8E BC 2E 34 F9>)
(   6,<2013-11-13 17:04:55.930 -0800>,<Administrator>,<X>,<proc1d>,<TOPSPIN 2.1>,
      <abs ABSG = 3 
       data hash MD5: 128K
       43 02 F2 8D C0 B9 E9 85 90 E7 36 5F 72 64 26 10>)
(   7,<2013-11-13 17:04:56.008 -0800>,<Administrator>,<X>,<proc1d>,<TOPSPIN 2.1>,
      <abs ABSG = 4 
       data hash MD5: 128K
       9B B0 64 4C 24 46 C3 75 4D 62 05 E5 98 39 FC F2>)
(   8,<2013-11-13 17:04:56.164 -0800>,<Administrator>,<X>,<proc1d>,<TOPSPIN 2.1>,
      <abs ABSG = 5 
       data hash MD5: 128K
       7D 44 98 0E 4F 75 C7 DC 1C 8E 58 70 AE 77 94 30>)
$$ ##END=
$$ 
$$ $$ hash MD5
$$ $$ 00 DE 41 2F A4 21 A7 DD 82 4B D0 D2 21 E1 5A 5D
##$RELAX= 
##$RELAX= 
##$RELAX= 
##$RELAX= 
##$RELAX= 
##$RELAX= 
##$RELAX= 
##$RELAX= 
$$ Bruker specific parameters
$$ --------------------------
##$DU= <E:\>
##$EXPNO= 12
$$ [...]
##$TP07= 0
##$TPNAME0= <>
##$TPNAME1= <>
##$TPNAME2= <>
##$TPNAME3= <>
##$TPNAME4= <>
##$TPNAME5= <>
##$TPNAME6= <>
##$TPNAME7= <>
##$TPOAL= (0..7)
0.5 0.5 0.5 0.5 0.5 0.5 0.5 0.5
##$TPOFFS= (0..7)
0 0 0 0 0 0 0 0
##$TUNHIN= 0
##$TUNHOUT= 0
##$TUNXOUT= 0
##$USERA1= <user>
##$USERA2= <user>
##$USERA3= <user>
##$USERA4= <user>
##$USERA5= <user>
##$V9= 5
##$VALIST= <valist>
##$VCLIST= <CCCCCCCCCCCCCCC>
##$VD= 0
##$VDLIST= <DDDDDDDDDDDDDDD>
##$VPLIST= <PPPPPPPPPPPPPPP>
##$VTLIST= <TTTTTTTTTTTTTTT>
##$WBST= 1024
##$WBSW= 4
##$XGAIN= (0..3)
0 0 0 0
##$XL= 0
##$YL= 0
##$YMAX_a= 5303573
##$YMIN_a= -11528068
##$ZGOPTNS= <>
##$ZL1= 120
##$ZL2= 120
##$ZL3= 120
##$ZL4= 120
##$ABSF1= 14.96087
##$ABSF2= -5.597312
##$ABSG= 5
##$ABSL= 3
##$ALPHA= 0
##$AQORDER= 0
##$ASSFAC= 0
##$ASSFACI= 0
##$ASSFACX= 0
##$ASSWID= 0
##$AUNMP= <proc_prof1d_extract.lims>
##$AXLEFT= 0
##$AXNAME= <>
##$AXNUC= <1H>
##$AXRIGHT= 0
##$AXTYPE= 0
##$AXUNIT= <>
##$AZFE= 0.1
##$AZFW= 0.1
##$BCFW= 0
##$BC_mod= 0
##$BYTORDP= 0
##$COROFFS= 0
##$CY= 15
##$DATMOD= 1
##$DC= 0
##$DFILT= <>
##$DTYPP= 0
##$F1P= 0
##$F2P= 0
##$FCOR= 0.5
##$FTSIZE= 131072
##$FT_mod= 6
##$GAMMA= 0
##$GB= 0
##$INTBC= 1
##$INTSCL= 1
##$ISEN= 128
##$LB= 0.3
##$LEV0= 0
##$LPBIN= 0
##$MAXI= 10000
##$MC2= 0
##$MEAN= 0
##$ME_mod= 0
##$MI= 0
##$NCOEF= 0
##$NC_proc= -2
##$NLEV= 6
##$NOISF1= 0
##$NOISF2= 0
##$NSP= 0
##$NTH_PI= 0
##$NZP= 0
##$OFFSET= 14.96087
##$PC= 1
##$PHC0= -82.57324
##$PHC1= 0
##$PH_mod= 1
##$PKNL= yes
##$PPARMOD= 0
##$PPDIAG= 0
##$PPIPTYP= 0
##$PPMPNUM= 2147483647
##$PPRESOL= 1
##$PSCAL= 4
##$PSIGN= 0
##$PYNMP= <proc.py>
##$REVERSE= no
##$SF= 400.020009688692
##$SI= 131072
##$SIGF1= 0
##$SIGF2= 0
##$SINO= 400
##$SIOLD= 131072
##$SPECTYP= <>
##$SREGLST= <1H.CDCl3>
##$SSB= 0
##$STSI= 131072
##$STSR= 0
##$SW_p= 8223.68421052631
##$SYMM= 0
##$S_DEV= 0
##$TDeff= 65536
##$TDoff= 0
##$TI= <>
##$TILT= no
##$TM1= 0
##$TM2= 0
##$TOPLEV= 0
##$USERP1= <user>
##$USERP2= <user>
##$USERP3= <user>
##$USERP4= <user>
##$USERP5= <user>
##$WDW= 1
##$XDIM= 131072
##$YMAX_p= 374833967
##$YMIN_p= -10572
##$CURPLOT= <Network HP LaserJet P1505>
##$CURPRIN= <$Network HP LaserJet P1505>
##$DFORMAT= <normdp>
##$LAYOUT= <+/1D_H.xwp>
##$LFORMAT= <normlp>
##$PFORMAT= <normpl>
##$SURQMSG= 1
$$ End of Bruker specific parameters
$$ ---------------------------------
##NTUPLES= NMR SPECTRUM
##VAR_NAME=  FREQUENCY,     SPECTRUM/REAL,   SPECTRUM/IMAG
##SYMBOL=    X,             R,               I
##VAR_TYPE=  INDEPENDENT,   DEPENDENT,       DEPENDENT
##VAR_FORM=  AFFN,          ASDF,            ASDF
##VAR_DIM=   131072,        131072,          131072
##UNITS=     HZ,            ARBITRARY UNITS, ARBITRARY UNITS
##FACTOR=    0.0627417313425164, 1,          1
##FIRST=     8223.62146879497, 2830,         -53728
##LAST=      0,             4045,            -53800
##MIN=       0,             -10572,          0
##MAX=       8223.62146879497, 374833967,    0
$$ Real data points
##PAGE= N=1
##DATA TABLE= (X++(R..R)), XYDATA
$$ [...]
67923 81513 82816 84168 85124 85960 87161 88484 89170 88930 88112 87051 85767 84303 82845 81518 80400 79620
67907 79620 79061 78174 76629 75012 74272 74503 74844 74612 73919 73083 72099 71042 70430 70713 71714 72952 74284
67890 74284 75846 77556 78958 79558 79177 78176 77408 77682 78954 80209 80435 79653 78793 78663 79301 80259 81182
67873 81182 81954 82492 82648 82370 81837 81330 80966 80623 80204 79854 79851 80313 81063 81750 82083 81976 81493 80633 79276
67854 79276 77563 76173 75768 76057 75897 74631 72886 71643 70950 70126 68924 67721 66696 65582 64343 63385
67838 63385 62932 62775 62814 63276 64205 65297 66487 68051 69849 71102 71415 71454 72071 73216 74319 75302 76541
67821 76541 78076 79548 80770 81753 82298 82197 81802 81779 82251 82686 82611 81888 80324 77706 74464 71651 69900
67804 69900 68831 67814 66903 66544 66654 66560 65809 64616 63415 62282 61001 59571 58463 58330 59500 61707
67788 61707 64226 66268 67392 67691 67536 67042 65891 63995 62159 61549 62341 63397 63676 63440 63573 64152 64511
67771 64511 64518 64918 66222 67938 69234 69845 70119 70579 71680 73505 75426 76536 76668 76598 76928 77332 77331 77222
67753 77222 77575 78173 78274 77773 77338 77339 77374 77026 76458 75924 75230 74109 72788 71720 70972 70271 69552 69060 68869
67734 68869 68645 68041 67140 66366 66042 66156 66514 66909 67109 66818 65872 64507 63250 62492 62285 62562 63290 64236
67716 64236 64843 64698 63990 63190 62417 61473 60468 59830 59576 59093 57966 56662 55946 55890 55972 55963 56192 56889 57805
67697 57805 58656 59544 60624 61665 62267 62370 62257 62168 62190 62474 63133 63812 63695 62277 60090 58426 58243 59432
67679 59432 61175 62822 64282 65658 66789 67344 67283 66961 66717 66520 66192 65856 66001 67004 68756 70800 72717
67662 72717 74255 75226 75550 75429 75243 75121 74790 74035 73172 72789 73049 73496 73572 73073 72048 70592 68967 67663
67644 67663 66997 66747 66476 66148 66141 66680 67484 68031 67976 67395 66878 67330 69311 72450 75729 78327 79972 80598
67626 80598 80229 79329 78678 78573 78537 78148 77696 77611 77714 77630 77601 78193 79346 80437 81228 82062 83088 83995 84625
67607 84625 85177 85597 85421 84547 83552 82874 82262 81399 80481 79669 78502 76522 74096 71947 70203 68613 67434
67590 67434 67248 67939 68609 68618 68120 67484 66836 66308 66118 66086 65591 64263 62381 60439 58826 58061 58663 60335
67572 60335 61870 62434 62500 62921 63433 62961 61315 59783 59716 61117 62958 64496 65787 67081 68181 68617 68267
67555 68267 67560 67021 66728 66392 65873 65378 65072 64774 64265 63663 63228 62903 62397 61713 61249 61249 61375 61018 59918
67536 59918 58418 57171 56654 56890 57521 58144 58561 58715 58559 58129 57743 57849 58584 59568 60240 60360 60181 60176 60615
67517 60615 61311 61715 61392 60408 59237 58301 57734 57572 57920 58763 59735 60344 60442 60259 59944 59262 57986 56459
67499 56459 55488 55520 56095 56339 55918 55287 54975 54915 54648 54047 53527 53552 54110 54771 55126 55064 54727 54374 54259 54488
67479 54488 54906 55199 55262 55440 56247 57733 59266 60107 60129 59810 59595 59553 59651 59947 60342 60488 60306 60327 61092 62285
67459 62285 63004 62902 62585 62715 63163 63402 63344 63312 63369 63196 62660 62061 61666 61375 61079 61044 61576 62466 63176 63585
67439 63585 64182 65323 66606 67280 67129 66634 66295 66119 65872 65528 65264 65194 65285 65381 65137 64114 62246 60108
67421 60108 58404 57262 56319 55453 54948 54858 54732 54281 53897 54088 54589 54582 53764 52750 52330 52687 53481 54366 55230
67402 55230 56088 56986 57862 58416 58229 57210 55797 54618 54045 54167 55003 56429 57935 58730 58230 56474 54107
67385 54107 52072 51204 51832 53604 55729 57454 58385 58548 58319 58244 58640 59335 59937 60339 60766 61310 61745 61891
67367 61891 61836 61622 61035 60072 59353 59577 60624 61654 62099 62126 61965 61324 59837 57813 56125 55426 55775 56908
67349 56908 58476 59956 60657 60127 58546 56670 55353 55021 55445 56017 56306 56394 56637 57228 58055 58906 59679 60422
67331 60422 61270 62297 63363 64220 64891 65825 67454 69688 71976 73723 74441 73772 71835 69504 67820 66997
67315 66997 66396 65603 65039 65206 65794 66024 65603 64904 64381 64324 65036 66671 68703 70086 70277 69860 69898 70767 71857
67296 71857 72368 72184 71863 71848 71845 71214 69963 69055 69371 70553 71269 70667 69191 67873 67261 67301 67862 68838 69872
67277 69872 70481 70613 70723 71157 71663 71768 71504 71502 72305 73737 75038 75573 75311 74604 73632 72268 70495 68746
67259 68746 67595 67135 66880 66418 65975 66148 67148 68525 69681 70415 70832 70905 70445 69502 68491 67814 67476 67244
67241 67244 67065 67145 67648 68442 69212 69785 70299 71019 71935 72579 72415 71408 70038 68753 67613 66629 66100 66335
67223 66335 67185 68178 69055 69882 70709 71431 72015 72548 73007 73253 73317 73397 73467 73175 72288 71091 70170 69976 70610 71825
67203 71825 73129 74149 74986 76033 77318 78300 78459 77822 76773 75651 74767 74458 74759 75216 75382 75358 75535
67186 75535 76016 76667 77566 78908 80468 81610 81915 81546 80943 80446 80249 80433 80910 81449 81791 81688 81047 80270
67168 80270 80162 81095 82427 83284 83787 84836 86621 88079 88173 87189 86309 86260 86794 87285 87405 87343 87611 88536 89804
67149 89804 90703 90977 91084 91439 91813 91823 91696 92051 93075 94366 95440 96059 96181 95987 95913 96330 97280 98712
67131 98712 100657 102755 104032 103849 102933 102660 103320 103876 103627 103219 103545 104427 105111 105573 106447 107870 109222
67114 109222 110157 111161 112761 114625 115883 116177 116083 116462 117584 118946 119859 120157 120270 120607 121057 121246 121189
67097 121189 121376 122101 122927 123098 122482 121886 122245 123662 125379 126648 127350 127770 128161 128781 130017 131980 134065
67080 134065 135366 135678 135680 136037 136698 137329 137962 138799 139628 139978 139879 140042 141123 143038 145069 146514 147192 147491
67062 147491 147957 148758 149576 150177 150942 152589 155307 158447 161145 163052 164331 165158 165513 165472 165506 166316 168277
67045 168277 171005 173535 175044 175489 175582 176221 177927 180581 183482 185755 186977 187527 188260 189810 192193 194910
67029 194910 197223 198508 198671 198261 197958 198024 198503 199772 202328 205910 209390 211887 213672 215614 218116 220966
67013 220966 223998 227230 230454 233210 235372 237382 239765 242640 245762 248714 250966 252106 252379 252779 254322
66998 254322 257161 260562 263721 266486 269312 272685 276646 280813 284791 288474 291958 295221 298062 300353
66984 300353 302294 304324 306764 309564 312445 315308 318419 322006 325801 329288 332478 336026 340301 344685
66970 344685 348282 351139 354231 358234 362833 367353 371611 375888 380494 385624 391345 397428 403401 409059
66956 409059 414696 420629 426757 432901 439314 446391 453937 461186 467649 473624 479774 486414 493374 500392
66942 500392 507465 514798 522489 530376 538283 546302 554679 563478 572595 582099 592196 602767 613348
66929 613348 623781 634537 646079 658266 670690 683285 696130 709015 721731 734588 748031
66918 748031 761897 775713 789697 804691 820948 837688 854146 870540 887625 905734 924619
66907 924619 943874 963159 982349 1001820 1022336 1044300 1067357 1091031 1115460 1141086 1167808
66896 1167808 1194931 1221942 1248906 1276097 1303632 1331668 1360663 1391054 1422671 1454760 1486823
66885 1486823 1519335 1553273 1588870 1625269 1661670 1698329 1735876 1773989 1811579 1848200 1884477
66874 1884477 1921042 1957926 1995198 2033217 2071712 2109489 2145860 2181638 2217851 2254057 2288953
66863 2288953 2322243 2354707 2386498 2416572 2444052 2469159 2492404 2513686 2532791 2550162 2566507
66852 2566507 2581835 2595338 2606095 2613618 2617873 2619027 2617203 2612447 2605013 2595494 2584338 2571290 2555698
66839 2555698 2537406 2516930 2494694 2470525 2444067 2415268 2384321 2351521 2317423 2282794 2248086
66828 2248086 2213151 2177645 2141445 2104540 2066808 2028171 1988779 1948890 1908794 1868952 1829881
66817 1829881 1791710 1754171 1717176 1681080 1646091 1611805 1577671 1543703 1510311 1477553 1444938
66806 1444938 1412040 1379055 1346709 1315625 1285787 1256637 1227794 1199564 1172506 1146602 1121271
66795 1121271 1096175 1071545 1047640 1024438 1001984 980470 959705 939088 918504 898683 880147
66784 880147 862319 844275 826001 808216 791283 775038 759449 744670 730525 716644 703127
66773 703127 690396 678341 666302 653969 641672 629673 617889 606524 596202 587004 577979 568100
66761 568100 557353 546464 535980 526145 517235 509320 501805 493866 485440 477310 470053 463259 455978
66748 455978 447722 438858 430177 422302 415421 409393 403948 398788 393627 388279 382740 377083 371320 365488
66734 365488 359846 354735 350110 345421 340171 334531 329192 324637 320716 317016 313422 310159 307283 304357
66720 304357 300772 296362 291557 286896 282566 278487 274651 271180 268158 265615 263600 262055 260638 258876
66706 258876 256537 253680 250435 246957 243506 240276 237056 233384 229149 224836 221083 218173 216011 214280
66692 214280 212519 210345 207849 205520 203646 202027 200489 199291 198672 198285 197548 196371 195054 193594 191697
66677 191697 189548 187931 187249 186848 185708 183540 180835 178105 175521 173241 171571 170601 169990 169273 168231
66662 168231 166874 165250 163494 161945 160939 160442 160020 159239 158041 156701 155445 154218 152825 151270 149822
66647 149822 148736 148000 147456 147092 146969 146869 146297 145024 143460 142221 141430 140660 139517 138012 136322 134505
66631 134505 132571 130680 129124 128208 128151 128847 129638 129662 128686 127434 126796 126831 126810 126114 124773 123156 121538 120140
66613 120140 119266 119098 119479 120096 120794 121588 122388 122928 122947 122311 120981 119039 116837 114926 113650 112903 112407
66596 112407 112161 112341 112816 113083 112843 112304 111720 110967 109941 109032 108628 108276 107105 105158 103623 103415 104189
66579 104189 105164 106273 107790 109274 109833 109308 108386 107487 106371 105056 104273 104394 104445 103023 100097 97257
66563 97257 96035 96411 97219 97679 98027 98691 99391 99504 99048 98719 98885 99149 99154 99199 99496 99335 97861 95525 93847
66544 93847 93575 93912 93840 93437 93332 93492 93328 92733 92236 92140 92092 91694 91124 90931 91454 92581 93894 94866 95026
66525 95026 94169 92542 90772 89435 88609 87867 86823 85578 84526 83895 83696 83978 84732 85610 86148 86339 86539
66508 86539 86814 86881 86837 87261 88211 88755 88129 86900 86268 86514 86905 86981 86998 87011 86421 84904 83125 81945 81312
66489 81312 80527 79374 78431 78294 78967 80008 80907 81247 80907 80269 79960 80172 80450 80317 79905 79728 80028 80702
66471 80702 81754 83285 84976 86031 85997 85293 84589 83917 82844 81347 79933 78911 78096 77416 77243 77796 78615
66454 78615 79077 79260 79822 81105 82613 83433 82993 81501 79843 78947 79111 79873 80531 80619 79932 78526 76976
66437 76976 76276 77037 78815 80533 81454 81595 81411 81433 82033 83069 83766 83343 81874 80260 79279 78954 78890 78927
66419 78927 79289 80268 81865 83613 84713 84522 82977 80577 78063 76193 75482 75751 76030 75344 73695 71993
66403 71993 71054 70987 71480 72156 72528 72114 71010 70066 70123 71199 72631 73837 74651 75066 74965 74213 72898 71432
66385 71432 70395 70101 70281 70429 70513 71117 72649 74647 76169 76766 76781 76749 76820 76825 76646 76335 75973 75591 75207 74894
66365 74894 74797 75053 75649 76308 76636 76473 76075 75799 75590 74961 73675 72237 71393 71165 70822 69952 69079 68901 69326
66346 69326 69777 70139 70740 71526 72036 72304 73027 74533 76217 77425 78266 79017 79289 78605 77471 76891 76848 76141
66328 76141 74049 71446 69784 69454 69694 69810 69856 70146 70625 70954 70964 70785 70607 70481 70385 70396 70703 71414 72373
66309 72373 73249 73822 74126 74312 74407 74299 73938 73480 73170 73080 73086 73122 73330 73788 74201 74159 73735 73511 73814 74220 74073
66288 74073 73271 72272 71526 71286 71760 72856 73859 73975 73380 73116 73678 74294 74041 73140 72553 72683 73183 73754
66270 73754 74307 74388 73357 71433 69807 69359 69760 70221 70540 70920 71272 71381 71445 71762 72038 71677 70735 69973 69932
66251 69932 70503 71446 72698 73939 74496 74104 73354 72941 72792 72383 71689 71328 71799 72992 74485 75957 77179
66234 77179 77866 77794 77028 75924 74848 73912 73012 72076 71185 70414 69704 69036 68601 68535 68616 68570 68594 69136 70082 70657
66214 70657 70415 69917 69999 70678 71249 71341 71390 72010 73235 74533 75413 75905 76491 77524 78714 79354 79122 78451 77998
66195 77998 77986 78262 78703 79233 79660 79828 79811 79623 78960 77587 75877 74587 74172 74655 75930 77665 78983 78978
66177 78978 77736 76395 75996 76643 77887 79296 80358 80350 78966 76898 75329 74816 74960 75115 75098 75154 75459 75839
66159 75839 75941 75615 75052 74548 74229 74098 74222 74616 75040 75233 75380 75993 77163 78255 78537 77879 76665 75318
66141 75318 74196 73739 74252 75496 76758 77383 77157 76252 75096 74276 74333 75379 76988 78558 79788 80728 81432
66124 81432 81727 81422 80625 79674 78762 77844 76956 76372 76320 76736 77487 78547 79726 80479 80433 79983 79951 80641 81631
66105 81631 82449 83052 83590 84222 85316 87271 89785 91711 92110 91290 90396 90193 90610 91277 91920 92144 91404 89648
66087 89648 87780 87041 87820 89299 90373 90718 90746 90776 90679 90348 89971 89560 88638 86862 84803 83620 84002 85676
66069 85676 87807 89529 90224 89812 88840 87955 87307 86760 86487 86789 87393 87599 87198 86689 86442 86239 85849 85407
66051 85407 85002 84443 83775 83448 83608 83773 83637 83644 84218 84971 85324 85523 86359 88098 90302 92516 94511 95969
66033 95969 96611 96706 96976 97857 99122 100229 100789 100842 100939 101786 103440 105084 105882 105862 105609 105461 105491 105904 106731
66014 106731 107353 107089 106251 105873 106347 107070 107630 108565 110515 113190 115703 117601 119159 120883 123174 126334
65998 126334 130460 135203 139770 143316 145489 146684 147761 149301 151121 152560 153147 152863 151941 150668 149286
65983 149286 147800 145996 143902 142037 140785 139665 137765 134952 132104 130006 128474 126775 124505 121799
65969 121799 119060 116850 115698 115579 115671 115026 113579 112249 111956 112705 113737 114447 114877 115259 115415 115055 114602
65952 114602 115148 117245 120132 122515 123867 124559 125037 125459 126069 127297 129298 131757 134220 136359 137920
65937 137920 138800 139252 139708 140384 141297 142548 144182 145885 147296 148586 150245 152312 154399 156530 159276
65922 159276 162824 166496 169607 172321 175237 178539 181973 185422 189002 192694 196222 199301 201826 203833
65908 203833 205377 206391 206715 206430 206072 206146 206467 206400 205775 204995 204141 202600 200012 197059 194720 193041 191159
65891 191159 188400 184851 180931 176930 173075 169661 166875 164551 162216 159428 156109 152592 149253 146132
65877 146132 143018 139835 136777 134078 131915 130404 129405 128357 126742 124777 123223 122427 121994 121540 121214
65862 121214 121204 121211 120839 120140 119406 118692 118002 117662 118111 119398 121148 122877 124072 124269 123426 122099 120948 120143
65844 120143 119484 118867 118413 118283 118669 119757 121457 123405 125450 127881 130833 133747 135847 137052 138064
65829 138064 139612 141922 144845 148181 151893 156127 160944 165939 170403 174042 177253 180456 183503 186025
65815 186025 187963 189302 189609 188405 185899 182877 179928 177150 174466 171803 168994 165916 162699 159535
65801 159535 156447 153508 151065 149328 147937 146432 145004 144315 144627 145557 146542 147141 147079 146606 146669 148093 150586
65784 150586 153156 155515 158365 162193 166507 170577 174322 178060 181909 185840 189954 194184 197967 200618
65770 200618 201948 202249 201737 200290 197668 193890 189386 184813 180617 176744 172899 169049 165519 162723 161054
65755 161054 160912 162388 164921 167721 170672 174437 179529 185633 192035 198368 204686 211126 217817 224925
65741 224925 232374 239534 245380 249073 250453 250034 248466 245830 241534 235077 226806 217679 208419 199318
65727 199318 190688 182925 175959 169204 162383 156023 150827 146845 143488 140095 136306 132242 128587 126153
65713 126153 125043 124468 123648 122611 121793 121275 120848 120553 120580 120709 120393 119447 118242 117156 116246 115556 115365 115869
65695 115869 116829 117745 118286 118444 118399 118381 118606 119184 120094 121271 122733 124603 127007 129923 133151 136446 139730
65678 139730 143183 147116 151779 157240 163422 170194 177453 185141 193256 201916 211336 221502 231867 241677
65664 241677 250784 259834 269356 278826 287007 293095 297147 299538 300569 300681 300490 300362 300297 300374 300860 301689
65648 301689 302385 302893 303970 306164 308744 310266 310103 308774 306763 303653 298690 291661 282843 272439 260532
65633 260532 247544 234358 221834 210376 200000 190636 182180 174380 166968 160061 154198 149733 146219
65620 146219 142725 138819 134987 131959 129872 128306 126923 125731 124758 123819 122763 121758 121141 121049 121310 121704
65604 121704 122162 122602 122702 122100 120915 119851 119571 120062 120852 121770 123134 125156 127519 129746 131764 133809
65588 133809 135901 137646 138604 138783 138771 139450 141496 145020 149628 154786 160118 165467 170935 176898 183836
65573 183836 191982 201102 210589 219753 228142 235802 243157 250397 256955 261760 264042 263773 261389 257372
65559 257372 252159 246195 239897 233585 227334 220745 213130 204376 195533 187992 182015 176629 171110 165874
65545 165874 161540 157822 154065 150475 148025 147164 147318 147765 148412 149493 150917 152260 153210 153787 154191 154599
65529 154599 155107 155750 156508 157193 157407 156786 155377 153598 151724 149627 147150 144515 142072 139791 137330 134561
65513 134561 131798 129492 127905 127044 126707 126567 126427 126443 126972 128176 129832 131524 132896 133736 133949 133568 132834
65496 132834 132204 132148 132747 133662 134663 136056 138237 141002 143821 146819 150796 155949 161182 165216 167900
65481 167900 169886 171427 172284 172600 172981 173511 173455 172250 170318 168499 166982 165189 162597 159373 156189 153579
65465 153579 151542 149728 147864 145854 143505 140580 137311 134565 133091 132682 132402 131557 130197 128840 128036
65450 128036 128069 128676 129108 128851 128252 128074 128493 128997 129284 129784 131120 133378 136030 138329 139780 140551 141425
65433 141425 143071 145381 147814 150177 152520 154387 155006 154400 153552 153099 152474 150826 148300 145824 144026
65418 144026 142935 142412 142241 141907 140929 139464 138145 137329 136883 136711 136968 137618 138180 138235 138050 138439 140003 142568
65400 142568 145392 147940 150424 153457 157182 160977 164119 166463 168237 169433 169795 169339 168473 167563 166695
65385 166695 165950 165556 165539 165479 164913 163938 163149 162946 163082 163064 162832 162835 163391 164228 164898 165459 166383 167828 169363 170635
65365 170635 172013 174232 177537 181467 185482 189610 194409 200399 207553 215280 222981 230635 238679 247207
65351 247207 255477 262417 267536 271194 274086 276645 278729 279567 278138 274036 268099 261806 256018 250630
65337 250630 245512 241183 238063 235391 231578 225722 218353 210634 203292 196591 190889 186608 183664 181364
65323 181364 179072 176783 174865 173439 172198 170775 169034 166999 164717 162348 160202 158500 157066 155495
65309 155495 153708 152168 151325 150996 150644 150250 150468 151644 153056 153669 153517 153763 155335 157978 160862 163584
65293 163584 166178 168534 170345 171514 172173 172367 172132 171828 171955 172556 173204 173666 174205 175061 175982 176490 176373
65276 176373 175709 174613 173206 171675 170106 168395 166535 164890 163865 163316 162574 161110 159005 156674 154364
65261 154364 152104 150015 148357 147226 146480 146093 146335 147349 148738 149911 150757 151556 152302 152604 152413 152277
65245 152277 152486 152441 151386 149462 147495 145941 144636 143513 142903 143001 143497 143917 143980 143612 142971 142530 142743 143531
65227 143531 144400 145050 145491 145597 145126 144247 143506 143098 142708 142248 142169 142739 143534 144002 144074 143871 143301 142396 141657
65208 141657 141578 142143 143104 144340 145519 145927 145239 144133 143493 143323 143072 142778 143094 144222 145534 146369 146698
65191 146698 146991 147832 149623 152160 154570 156169 157290 158773 160787 162813 164675 166718 168875 170467 171276
65176 171276 172053 173452 175099 176264 176948 177698 178746 180003 181631 183982 186996 190207 193383 196774 200750
65161 200750 205552 211325 217946 224790 231123 237016 243582 252003 262424 274057 286302 299484 314428
65148 314428 331590 350914 372320 395941 421755 449448 478849 510123 543070 576466 608664
65137 608664 638828 667137 693875 718891 742006 763214 782168 797974 809858 817604 820958 819146
65125 819146 811626 799077 783045 764686 744305 721929 697669 671418 642811 611811 579095 545663
65113 545663 512300 479523 447833 417824 390170 365577 344508 326766 311499 297758 285051
65102 285051 273307 262489 252430 243028 234370 226568 219500 212867 206567 200922 196395 193066 190539
65089 190539 188426 186731 185646 185088 184672 184100 183414 182806 182321 181833 181274 180786 180537 180437 180205 179831 179754 180262
65071 180262 180878 180819 180088 179570 179849 180470 180692 180405 179795 178694 177087 175918 176293 177821 178721 177918 176232
65054 176232 175105 174939 175256 175715 176129 175986 174976 173839 173723 174612 175203 174554 173146 172027 171539 171347 171228
65037 171228 171205 171111 170534 169203 167161 164633 161923 159363 157167 155356 153946 153018 152483 152049 151630 151528 151874
65020 151874 152126 151539 150007 148057 146203 144799 144360 145315 147296 149352 151139 153312 156352 159584 161974
65005 161974 163475 164928 166867 169159 171694 174591 177557 179824 181094 182021 183307 184774 185853 186582 187488
64990 187488 188618 189409 189639 189922 190956 192658 194405 195897 197362 199008 200728 202398 204096 205671 206378
64975 206378 205400 202813 199650 196812 194188 191143 187612 184223 181384 178774 175959 173112 170731 168910
64961 168910 167263 165456 163454 161305 159111 157251 156215 155993 155899 155222 153911 152476 151379 150731 150453 150505
64945 150505 150917 151697 152625 153159 152786 151718 151018 151624 153270 154655 154793 153882 152803 152165 152085 152633 153966
64928 153966 156016 158275 160074 160951 160804 159854 158562 157447 156818 156661 156732 156799 156861 157186 158106 159641 161418
64911 161418 163051 164561 166268 168302 170402 172256 173877 175641 178049 181472 185902 190891 195943 201057
64897 201057 206687 213041 219602 225539 230427 234368 237602 240259 242439 244208 245528 246393 247046 247717 248147
64882 248147 247690 246050 243610 240852 237732 233974 229759 225682 222093 218879 215951 213508 211609 209900
64868 209900 208137 206754 206343 206685 206817 206222 205498 205518 206270 206877 206493 204734 201480 196952 192078 188166 185728
64851 185728 183917 181439 177939 174298 171747 170894 171376 172184 172437 172090 171826 172140 172719 172944 172699 172325 171990
64834 171990 171595 171237 171246 171650 172038 172047 171678 171085 170479 170409 171631 174386 178047 181806 185501 189483 193868 198299
64816 198299 202383 206129 209971 214479 219958 226225 232914 240032 247909 256432 264721 271911 277980 283311
64802 283311 287648 290080 290072 288005 284499 279677 273384 265866 257897 250336 243709 238105 233278 228829 224475
64787 224475 220206 216260 213024 210847 209764 209360 209090 208793 208745 209244 210371 212171 214778 218152 221957 225891
64771 225891 230002 234500 239418 244686 250401 256726 263505 270219 276387 281926 287117 292319 297654 302841
64757 302841 307374 310966 313795 316174 318087 319185 319151 317875 315392 311935 308035 304182 300265 295638 289879
64742 289879 283243 276235 269063 261760 254578 247854 241617 235660 229956 224645 219730 215237 211719 209992
64728 209992 210104 210977 211478 211560 211950 212951 214106 214952 215495 215879 216114 216380 217087 218284 219391 220032 220798 222531
64710 222531 224965 226733 226887 225816 224371 222651 220156 216853 213396 210348 207667 205073 202493 200067
64696 200067 198007 196632 196191 196475 196874 197043 197256 197866 198719 199481 200310 201728 203847 206253 208738 211687
64680 211687 215494 219915 224368 228667 233175 238304 244201 250898 258511 267094 276384 285754 294426 301738
64666 301738 307278 310818 312162 311167 307915 302755 296106 288354 280012 271827 264553 258613 254046 250728
64652 250728 248520 247223 246530 246073 245608 245256 245618 247424 250943 255760 261294 267421 274534 283150 293578
64637 293578 305836 319553 333997 348445 362605 376537 390154 402928 414061 422799 428655 431616
64625 431616 432241 431340 429425 426452 422074 416029 408314 399190 389080 378346 367160 355708 344409
64612 344409 333638 323220 312559 301439 290429 280302 271223 262793 254724 247167 240378 234353 228924
64599 228924 224039 219852 216525 214044 212181 210625 209152 207713 206365 205122 203875 202554 201438 201241
64585 201241 202607 205439 208876 212016 214549 216656 218640 220901 223903 227695 231584 234760 237185 239452
64571 239452 241800 243765 244816 244715 243133 239645 234487 228840 223833 219604 215699 211986 208629 205570
64557 205570 202719 200504 199479 199337 198924 197438 195180 192998 191447 190656 190602 191113 191811 192337 192595 192646 192491
64540 192491 192094 191590 191336 191664 192501 193191 192867 191237 188959 187156 186585 187298 188779 190154 190570 189909 189118
64523 189118 189353 190753 192406 193557 194397 195572 197369 199660 202264 205065 207994 211199 215007 219502 224234
64508 224234 228569 232252 235561 239084 243427 248910 255412 262636 270597 279529 289247 298943 307818 315591
64494 315591 322144 327021 329650 329846 327812 323885 318556 312413 305674 298034 289474 281010 274054 269026
64480 269026 265115 261410 257775 254521 251773 249381 247043 244292 240764 236789 233414 231493 230893 230791 230573
64465 230573 230208 229957 230031 230506 231312 232239 233039 233532 233679 233686 234007 234968 236304 237359 237902 238431 239490 241027
64447 241027 242749 244773 247426 250612 253906 257256 261039 265454 270409 276175 283488 292608 302746 313000
64433 313000 323602 335668 349744 365241 381527 399186 419764 444336 472597 503470 536573
64422 536573 573004 614677 662909 717682 778166 843583 913261 985933 1059422 1131283 1199651
64411 1199651 1263367 1321426 1372574 1415503 1449229 1473114 1486585 1489110 1480540 1461399 1432666 1395407
64399 1395407 1350757 1300082 1244615 1184750 1120115 1050830 978619 906352 836558 770662 709458
64388 709458 653690 603902 560152 522188 489677 462022 438195 417167 398439 381974 367722
64377 367722 355444 344857 335624 327227 319119 311070 303199 295745 288923 282939 277819 273274 268975 264981
64363 264981 261634 259045 256960 255181 253865 253317 253752 255294 257861 260895 263611 265870 268623 273052 279289
64348 279289 286283 292906 298932 304833 310844 316426 320553 322459 322152 320384 318190 316393 315315 314767 314330
64333 314330 313810 313440 313516 313938 314382 314964 316313 318731 321635 324159 326075 327661 328782 328714 327002 324039
64317 324039 320540 316743 312412 307367 301741 295867 290168 285065 280697 276740 272736 268581 264493 260526
64303 260526 256438 252166 248234 245394 243913 243309 242866 242299 241892 242062 242914 244262 245914 247773 249757 251856
64287 251856 254347 257748 262369 268018 274251 280760 287388 293980 300527 307336 314687 322317 329660 336628
64273 336628 343718 351030 357611 362220 364633 365708 366221 366109 364946 362762 360033 357079 353877 350469 347303
64258 347303 344970 343629 342777 341577 339373 335903 331204 325522 319290 312906 306389 299450 292133 285195
64244 285195 279554 275382 272002 268645 265021 261215 257476 254264 252135 251240 251091 251077 251096 251509 252583 254131
64228 254131 255634 256590 256830 256608 256270 255805 254930 253654 252450 251617 250814 249544 247838 246060 244254 242184
64212 242184 239934 237965 236513 235374 234448 234014 234299 235121 236212 237609 239438 241558 243706 245899 248463
64197 248463 251711 255724 260316 265099 269761 274484 279978 286919 295397 305024 315459 326620 338446
64184 338446 350586 362275 372436 380030 384489 385835 384362 380335 374047 365997 356858 347296 337872
64171 337872 328925 320493 312529 305282 299201 294309 289936 285406 280771 276595 273222 270617 268759 267705
64157 267705 267308 267275 267566 268345 269453 270332 270633 270616 270714 270961 271044 270784 270422 270489 271443 273223 275177 276666 277704
64138 277704 278605 279035 278033 275334 272131 269963 269122 268738 268159 267607 267553 268220 269836 272691 276533 280426
64122 280426 283649 286472 289681 293650 298302 303756 310422 318416 327256 336291 345251 354381 364152 374730
64108 374730 385491 395128 402636 408163 412617 416429 419203 420760 421987 424172 427692 431866 436074 440570
64094 440570 445979 452305 458654 463788 466745 467131 465163 461526 456947 451730 445771 439072 432056 425160
64080 425160 418282 410964 403097 395102 387379 379933 372755 366126 360174 354450 348495 342700 338038 334942
64066 334942 332936 331380 330058 328868 327534 325955 324416 323127 321948 320912 320640 321764 324185 327289
64052 327289 330651 334107 337461 340741 344599 349861 356612 364164 371848 379405 386691 393640 400677 408623
64038 408623 417930 428281 438986 449353 458636 466178 471895 476281 479758 482322 483956 484873 485132 484505
64024 484505 483087 481635 480918 480972 481336 481646 481579 480573 478176 474583 470336 465512 459655 452553 444707 436937
64008 436937 429710 422906 416108 409180 402614 397177 393022 389439 385787 382421 380283 379632 379664 379488 379073
63993 379073 379072 379992 381796 384226 387287 391284 396346 401971 407288 411888 416323 421644 428588 437259 447348
63978 447348 458448 470304 482959 496524 510760 525204 539909 555648 572998 591584 610776
63967 610776 630887 653048 678061 705994 736754 770278 806131 843875 884245 929285 980855
63956 980855 1039540 1105493 1179706 1263678 1358255 1463762 1581244 1712674 1859585 2022033
63946 2022033 2199192 2390445 2595324 2812655 3040322 3275845 3516655 3759616 4000668
63937 4000668 4235225 4458744 4666643 4854002 5015951 5148516 5248815 5314520 5343756 5335834
63927 5335834 5291616 5212691 5100497 4956811 4784895 4589555 4375978 4148847 3912485 3671259
63917 3671259 3429553 3191547 2960961 2740600 2532105 2336508 2155097 1989323 1839853
63908 1839853 1706194 1587393 1482541 1390357 1308878 1236162 1171147 1113503 1062834 1018304 978793
63897 978793 943163 910574 880768 853826 829419 806627 784721 763711 743750 724386 704945
63886 704945 685420 666472 648679 632275 617404 604092 592007 580873 571191 564017 559896 558339
63874 558339 558433 559516 561246 563529 566627 570954 576516 582793 589271 595779 602218 608386 614253 620022 625659
63859 625659 630745 635039 638802 642133 644374 644713 643215 640728 637801 634190 629475 623648 616851 608968
63845 608968 599880 589937 579781 569594 558816 546764 533427 519470 505483 491420 476915 461959
63833 461959 447019 432457 418128 403710 389305 375550 363170 352541 343580 335852 328814 322073
63821 322073 315535 309313 303564 298382 293755 289606 285992 283238 281587 280597 279246 276976 274455 272943
63807 272943 272918 273716 274457 274859 275042 274998 274584 273681 272066 269393 265732 261934 259001 257121 255713 254331 253008
63790 253008 251614 249477 246120 242104 238635 236409 235188 234500 234271 234606 235251 235651 235487 234875 234040 233036
63774 233036 231954 231216 231364 232482 233977 235047 235283 234777 233855 232883 232214 232050 232301 232774 233508 234689 236175
63757 236175 237375 237761 237361 236598 235859 235381 235332 235700 236268 236962 238111 239955 241996 243340 243850 244516 246335
63740 246335 249158 251991 254205 255945 257412 258367 258690 259039 260444 263258 266871 270542 274137 277863 281600
63725 281600 284873 287472 289735 292164 295037 298423 302271 306294 309973 312922 315108 316537 316952 316081 314109
63710 314109 311574 308859 306030 303164 300589 298746 297907 297985 298501 298872 298957 299205 300057 301351 302633 303885
63694 303885 305517 307665 309992 312251 314590 317140 319703 322073 324317 326527 328611 330507 332247 333622
63680 333622 334193 333998 333828 334379 335387 336089 336314 336628 337436 338470 339213 339476 339459 339501 339859 340520 341160 341405 341082
63661 341082 340106 338283 335482 331904 327956 323916 319929 316136 312481 308598 304270 299951 296393 293768
63647 293768 291621 289693 288310 287814 288042 288585 289216 289830 290289 290643 291281 292624 294738 297450 300686 304517
63631 304517 308939 313769 318746 323694 328628 333735 339163 344943 351240 358510 367074 376658 386736 397299
63617 397299 408853 421692 435762 451299 468886 488495 509121 529936 551316 574087 598052
63606 598052 621913 644419 664905 682879 697889 709913 719199 725517 728212 727260 723752 718967 713378
63593 713378 706866 699477 691394 682477 672378 661067 648782 635428 620484 603755 585926 568144
63581 568144 551162 535152 520258 506987 495846 486797 479393 473409 468999 466121 464262 463058 462888
63568 462888 464400 467627 472031 477290 483444 490236 497012 503551 510426 518165 526549 535217 544544 555286
63554 555286 567663 581411 596641 613933 633613 655502 679500 705769 734060 763258 791834
63543 791834 818347 841302 859063 870560 876007 876590 873496 867526 859469 850364 841228 832678 824837
63530 824837 817348 809353 799669 787287 771849 753587 732786 709426 683560 656038 628522 602446
63518 602446 578110 555030 533055 512657 494179 477386 462037 448409 436858 427167 418749 411288
63506 411288 404757 398964 393509 388212 383257 378873 375151 372148 369941 368523 367807 367633 367663 367446 366863 366316
63490 366316 366131 365982 365328 364333 363799 364188 365187 366361 367729 369535 371833 374472 377176 379522 381241 382634
63474 382634 384211 385777 386479 386065 385399 385207 384856 383135 379937 376389 373464 371305 369873 369388 369735 370060
63458 370060 369557 368388 367476 367554 368691 370609 373097 376145 379925 384703 390670 397800 405881 414632 423762
63443 423762 433012 442257 451639 461564 472509 484741 498232 512902 528932 546619 565754 585327
63431 585327 604067 621243 636751 650539 662343 672105 680400 688223 696466 705698 716319 728719
63419 728719 743300 760460 780456 803045 827208 851421 874330 895056 912828 926614 935580 939894
63407 939894 940639 938682 934066 926819 917962 908960 900205 890658 879142 865337 849315 830780 809395
63394 809395 785537 760175 734143 707978 682291 657812 635027 614063 594822 577039 560443
63383 560443 545251 532242 521921 513886 507546 503162 501451 502310 504784 508386 513616 520917 529897 539985
63369 539985 551084 563040 575084 586545 597760 609688 622911 637521 653689 671602 691012
63358 691012 711490 733076 756077 780172 804292 827412 848895 867926 883296 894149 900566 903167
63346 903167 902485 899032 893580 886892 879295 870770 861308 850840 838964 825202 809552 792479 774325
63333 774325 754948 734033 711580 688119 664749 642999 624219 608721 595611 583769 572941
63322 572941 563724 556596 551322 547278 543888 540411 535586 528039 517294 504224 490393 476946 464169
63309 464169 451949 440448 430274 422100 416195 412310 409888 408376 407449 407000 406905 406782 406119 404748 403002
63294 403002 401173 398947 395717 391441 386754 382062 376954 370831 363889 357083 351238 346516 342653 339321
63280 339321 336181 332960 329694 326793 324665 323291 322216 321008 319741 318971 319071 319685 320099 320223 320756 322199
63264 322199 324113 325741 327027 328514 330492 332872 335764 339468 343815 348158 352221 356431 361158 366086
63250 366086 370703 375037 379564 384643 390373 396799 403981 411931 420650 430117 440208 450817 462123
63237 462123 474456 487807 501815 516287 531394 547216 563492 580075 597221 615136 633501
63226 633501 651698 669204 685644 700890 715482 730492 746510 763010 779089 794468 809307
63215 809307 823353 835884 846364 854660 860708 864392 865645 864218 859544 851404 840693 828987 817251
63202 817251 805385 792958 779946 766785 754219 743147 734058 726449 719301 712303 706157 701504 698026
63189 698026 694895 691756 688966 687207 687187 689422 693904 700034 707116 714797 722940 731331 739779 748333 757084
63174 757084 765815 774046 781415 787886 793647 798906 803634 807359 809308 808931 806269 801690 795367 787157
63160 787157 776926 764871 751472 737183 722147 706188 689156 671316 653409 636343 620892
63149 620892 607583 596641 587851 580570 574088 568054 562555 557747 553517 549607 546130 543687 542706 542738
63135 542738 542837 542698 542992 544309 546285 548279 550569 554156 559408 565633 572107 578905 586359 594207 601690
63120 601690 608241 613662 617866 620799 622570 623361 623246 622291 620749 619007 617385 616020 614807 613374 611394
63105 611394 609130 607429 606844 606846 606220 604269 601374 598397 595829 593634 591680 590024 588789 587985 587579 587597
63089 587597 587964 588284 588103 587548 587442 588518 590628 593018 595227 597392 599752 602371 605426 609303 614134
63074 614134 619562 625232 631302 638214 646122 654723 663537 672214 680825 690060 700949 714085 729196
63061 729196 745596 762965 781613 802242 825598 852033 881073 911554 942537 974047 1006763
63050 1006763 1041144 1077131 1114513 1153195 1193024 1233607 1274406 1314893 1354717 1393823 1432385
63039 1432385 1470450 1507728 1543876 1578848 1612764 1645475 1676409 1704722 1729375 1749204 1763181
63028 1763181 1770679 1771355 1764830 1750725 1728996 1700111 1664966 1624799 1581119 1535459 1489082 1442918
63016 1442918 1397660 1353892 1312255 1273627 1238963 1208879 1183547 1163093 1147677 1136923 1129683
63005 1129683 1124863 1122364 1122774 1126360 1132831 1141915 1153495 1167058 1181574 1196182 1210653 1225103 1239611
62992 1239611 1254295 1269313 1284514 1299324 1313113 1325436 1335782 1343492 1348153 1349800 1348505 1343889
62980 1343889 1335213 1321775 1303243 1279969 1253103 1224097 1193858 1162547 1130262 1097509 1064860
62969 1064860 1032621 1001159 971158 943156 917119 892804 870223 849298 829410 809908 790921
62958 790921 773115 756637 740839 725129 709598 694662 680472 666903 653889 641543 630059
62947 630059 619534 609717 599985 589808 579309 569117 559700 551127 543439 536818 531210 526176 521472
62934 521472 517593 515327 514783 515134 515373 515112 514540 513816 512815 511494 510144 508965 507577 505377 502423 499452
62918 499452 496847 494066 490462 486223 481981 477834 473474 469130 465616 463296 461587 459689 457293 454483
62904 454483 451506 448850 447000 445827 444727 443569 442905 442903 442831 442182 441717 442526 444421 446073 446594 446148 445149
62887 445149 443723 442175 441175 441084 441535 441943 442057 441868 441470 441237 441647 442573 443098 442409 440646 438635 437075
62870 437075 436259 436302 437148 438455 439744 440684 441148 441189 441140 441481 442346 443329 444019 444600 445608 447231 449109 450737
62852 450737 451781 452093 451755 451142 450698 450561 450546 450457 450253 449893 449229 448124 446554 444647 442743 441314 440627
62835 440627 440439 440245 439821 439341 438974 438637 438266 438136 438709 440185 442303 444480 446162 447253 448343 450353
62819 450353 453655 457549 460880 463213 465224 467838 471251 474950 478442 481615 484585 487630 491290 495985
62805 495985 501365 506505 511085 515962 522137 529459 536873 543794 550672 558377 567627 579025 592872 608654
62791 608654 625311 642434 660883 681967 706396 734294 765711 800619 838671 879489 923115
62780 923115 969857 1019786 1072589 1127674 1184122 1240718 1296387 1350415 1401926 1449454 1491441
62769 1491441 1527003 1555685 1576615 1588490 1590516 1582962 1566660 1542259 1510130 1470804 1425381 1375503
62757 1375503 1322816 1268400 1212898 1157250 1102838 1050554 1000162 951139 903898 859535 818551
62746 818551 780507 744960 712032 681933 654565 629903 608189 589369 572708 557307 542807
62735 542807 529400 517480 507502 499839 494409 490489 487100 483538 479636 475846 473051 471903 472102 472601
62721 472601 472732 472906 474158 477229 482132 488254 494723 501094 507939 516522 527652 541059 556025 572284
62707 572284 590088 609707 631236 654710 680118 707354 736405 767474 800797 836343 873745
62696 873745 912407 951655 990937 1029845 1067796 1103851 1137166 1167457 1194449 1216922 1233010
62685 1233010 1241642 1243104 1237959 1226126 1207478 1182667 1152706 1118192 1079681 1038498 996387 954434
62673 954434 913001 872612 834177 798169 764178 731643 700671 671884 645655 621703 599337
62662 599337 578042 557960 539833 524340 511426 500311 490142 480581 471805 464053 457162 450601
62650 450601 444013 437643 431976 427043 422435 418043 414322 411635 409743 408209 406959 406146 405750 405672 405969
62635 405969 406669 407514 408177 408589 408847 409058 409435 410200 411078 411274 410382 409037 408280 408514 409435 410687 412177 414024
62617 414024 416617 420441 425454 430965 436509 442394 448884 455412 461369 467259 474089 481960 490300 499362
62603 499362 510222 523114 536952 550976 565880 582704 601440 621513 642959 666240 691199
62592 691199 717022 743172 769705 796524 822680 846564 866682 882313 893577 900848 904089 902872
62580 902872 897027 886944 873141 855903 835596 813083 789438 765271 740560 715205 689670 665033
62568 665033 642353 621958 603435 586327 570601 556315 543192 530900 519538 509431 500637 493109
62556 493109 487089 482723 479392 476138 472838 470268 468880 468165 467437 466589 465727 464694 463443 462463 462336 463038
62540 463038 463993 464637 464736 464455 464298 464700 465565 466509 467603 469340 471767 474278 476600 479410 483577 489329
62524 489329 496578 505522 516326 528606 541854 556102 571642 588432 606332 625706 647130 670636
62512 670636 695698 721765 748306 774584 800043 824789 849088 872445 893762 912374 928295
62501 928295 941459 951457 958322 962994 966623 969703 972170 974132 976285 979768 985744 994977 1007713 1024046
62487 1024046 1044304 1068899 1097914 1131198 1168768 1210672 1256355 1304594 1354278 1404819 1455362
62476 1455362 1503815 1547133 1582713 1609338 1626827 1635160 1634135 1623610 1603568 1573954 1534915 1487541
62464 1487541 1433977 1376286 1315397 1251751 1186828 1123249 1063174 1007366 956104 910068 869542
62453 869542 833460 800379 770286 744546 724010 708020 695374 685435 677926 672329 668097 665170
62441 665170 663782 663906 665117 666895 668890 671006 673341 675883 678222 679723 680039 679198 677138 673513 668125
62426 668125 661306 653624 645367 636536 627206 617720 608558 600094 592400 585220 578262 571450 564794 558071
62412 558071 551037 544046 537982 533292 529316 525015 520216 515743 512304 509690 507256 504881 503087 502245
62398 502245 502003 501677 501071 500629 500777 501348 501892 502368 503249 504828 506695 508190 509312 510899 513766 517763
62382 517763 521878 525298 528211 531527 536010 541836 548816 556738 565423 574710 584525 594867 605765 617414
62368 617414 630349 645175 661980 680289 699811 721063 745107 772816 804427 839455 876864
62357 876864 915673 955746 997752 1041872 1086706 1129846 1169517 1205226 1236860 1263701 1284543
62346 1284543 1298508 1305529 1306269 1301701 1292559 1278967 1260632 1237523 1210335 1180352 1148945 1117190
62334 1117190 1085737 1054909 1024977 996386 969681 945180 922761 901930 882163 863275 845508
62323 845508 829132 813870 798856 783287 766993 750264 733363 716398 699488 682789 666385
62312 666385 650409 635208 621217 608702 597730 588248 580031 572747 566264 560774 556376 552791 549726
62299 549726 547254 545433 543801 541809 539741 538642 539198 541056 543352 545579 547854 550645 554310 558644
62285 558644 562881 566462 569825 574058 579736 586538 594047 602394 611785 621820 631758 641325 650983 661450
62271 661450 673147 686004 699670 713947 729078 745507 763358 782348 802257 823286 845943
62260 845943 870771 898232 928595 961829 997755 1036253 1077052 1119235 1161218 1201329 1238211
62249 1238211 1270774 1298180 1320040 1336302 1346814 1351339 1350093 1343788 1332827 1316791 1295116 1268043
62237 1268043 1236615 1201943 1164928 1126528 1087830 1049698 1012586 976816 942891 911458 882967
62226 882967 857434 834588 814239 796416 781056 767694 755686 744692 734783 726138 718857 712921
62214 712921 708064 703770 699765 696421 694261 693158 692549 692405 693302 695375 697894 700262 702827 706279 710746
62199 710746 716015 722191 729426 737255 744842 751864 758657 765521 772334 778858 785056 791043 796974 802976
62185 802976 809043 815073 821144 827496 834019 840088 845260 849917 854768 859947 865084 870181 875914 883025
62171 883025 891825 902354 914721 929218 946324 966478 989504 1014357 1039789 1065151 1090153 1113980
62159 1113980 1135230 1152832 1166587 1176650 1182906 1185016 1182748 1176128 1165578 1151996 1136254 1118412
62147 1118412 1097794 1074092 1048158 1021418 994785 968404 942314 917052 893658 873164 855913
62136 855913 841220 827858 815045 802928 792097 782884 775169 768476 762003 754864 746753 738381 730939
62123 730939 725123 720760 717324 714556 712673 712159 713311 715697 718046 718956 717902 715434 712315 708659 704103
62108 704103 698633 692901 687690 683294 679481 675802 671716 666662 660443 653524 646693 640439 634953 630695
62094 630695 628368 628031 628733 629464 630249 631830 634497 637827 641466 645565 650344 655786 661995 669309 677795
62079 677795 687022 696731 707320 719261 732293 745694 759242 773449 788804 805171 822013 838936
62067 838936 855941 873334 891507 910608 930312 949920 968659 985821 1000778 1013035 1022229 1027935
62055 1027935 1029662 1027275 1021257 1012159 999895 984041 964858 943448 920602 895961 868800 839362
62043 839362 808915 778584 748665 719165 690494 663365 638236 615140 593974 574712 557386
62032 557386 542030 528695 517389 507901 499707 492165 484983 478489 473248 469312 465949 462291 458078
62019 458078 453641 449365 445502 442345 440090 438495 437108 436011 435906 437199 439313 441166 442117 442220 441911
62004 441911 441844 442760 445068 448548 452665 457045 461408 465277 468185 470054 471071 471388 471309 471509 472370 473133
61988 473133 472344 469340 464814 459789 454587 449033 443082 436752 429801 422024 413822 406107 399675 394799
61974 394799 391258 388476 385788 382855 379868 377180 374840 372616 370411 368456 367067 366321 366015 365958 366251
61959 366251 367139 368518 369777 370371 370399 370357 370516 370913 371834 373706 376476 379634 382983 386865 391499 396645
61943 396645 402253 408842 416800 425724 434939 444333 454191 464470 474735 484629 494006 502763 510946 518814
61929 518814 526420 533322 539117 544001 548326 551797 553704 553855 552777 551017 548717 545867 542534 538856
61915 538856 535264 532731 532304 534299 538242 543611 550221 557899 566309 575268 584788 594618 604050 612412
61901 612412 619484 625244 629520 632134 633262 633402 633035 632393 631509 630403 629231 628184 627256 626333 625633 625783
61885 625783 627071 628766 629549 628578 625857 621700 616281 609701 602040 593217 583192 572390 561654 551641
61871 551641 542518 534358 527526 522457 519167 517132 515683 514652 514678 516638 520525 525143 529313 533241 538307
61856 538307 545597 555037 565811 577137 588656 600608 613698 628375 644176 660180 675970 691635
61844 691635 706891 720916 733183 743758 752517 758771 762053 762769 761665 759177 755695 751924 748385
61831 748385 744905 741260 738149 736979 738675 743011 749018 755725 762585 769549 776749 783948 790367 795179
61817 795179 798036 798954 797928 794924 790148 784062 777174 769873 762400 754881 747462 740337 733362 725717
61803 725717 716416 705274 693015 680315 667280 654017 641157 629325 618538 608621 599828 592466
61791 592466 586116 579863 573290 566825 561096 556381 552663 549780 547395 545080 542555 539744 536787 534173
61777 534173 532672 532719 533884 535266 536448 537810 539865 542616 545699 548965 552672 557089 562069 567262 572767
61762 572767 579267 587181 595955 604661 613221 622355 632267 642136 651188 659500 667157 673270 676642 677094
61748 677094 675366 671980 666977 660587 653281 645013 635187 623719 611645 600338 590420 581607 573346
61735 573346 565453 558319 552534 548151 544368 540237 535599 531027 526965 523426 520475 518421 517329 516761
61721 516761 516255 515719 515149 514271 512783 510782 508722 507029 505887 505263 504942 504536 503609 501922 499643 497250
61705 497250 495077 492902 490187 486734 482823 478654 474107 469333 465051 461802 459263 456809 454421 452371
61691 452371 450340 447631 444208 440736 437563 434413 431145 428079 425390 422908 420738 419332 418656 418010 417073
61676 417073 416380 416234 415832 414214 411675 409508 408614 408946 410088 411681 413370 414881 416215 417475 418647
61661 418647 419883 421747 424713 428577 432771 437018 441203 444862 447505 449353 451047 452577 453193 452632 451745
61646 451745 451470 451699 451672 451196 450904 451350 452330 453254 453940 454862 456642 459431 462816 466298 469652 472692 474862
61629 474862 475448 474356 472366 470320 468158 464987 460076 453554 446121 438432 430989 424432 419422 416054
61615 416054 413616 411160 408219 404826 401047 396832 392292 387773 383578 379835 376644 374034 371756 369455
61601 369455 367194 365389 364051 362510 360220 357475 354953 352899 351176 349744 348446 346614 343734 340508
61587 340508 338424 338026 338303 338086 337352 336718 336327 335910 335491 335233 334846 333981 333142 333335 334653 335950 336264 335961
61569 335961 336006 336626 337266 337568 337691 337795 337799 337796 338282 339741 342258 345590 349353 353017 356086 358510 360722 363058
61551 363058 365303 367013 368092 368765 369125 369019 368327 367074 365318 363263 361534 360969 361865 363660 365539 367247
61535 367247 369080 371185 373179 374535 375157 375467 375965 376757 377505 377842 377827 377924 378489 379329 379882 379774 379122 378291
61517 378291 377551 377039 376899 377209 377739 377979 377602 376882 376485 376729 377233 377485 377649 378513 380522 383163 385549 387443
61499 387443 389395 391917 394944 398167 401547 405208 409086 413019 417032 421175 425097 428198 430338 432111
61485 432111 434187 436563 438701 440297 441733 443741 446718 450274 453407 455268 455893 456081 456454 456838 456749 456233
61469 456233 455821 455767 455724 455284 454488 453648 452920 452181 451146 449472 446965 443864 440785 438206 436118 434332 432954
61452 432954 432393 432896 434260 435985 437659 439202 440805 442656 444807 447260 450017 452899 455535 457781 459978
61437 459978 462402 464583 465703 465700 465446 465662 466190 466556 466731 466948 467273 467799 468892 470710 472777 474508 475959
61420 475959 477603 479638 481991 484651 487426 489626 490689 490925 490959 490605 489151 486709 484340 482657 481123
61405 481123 479048 476461 473598 470310 466587 463091 460483 458577 456736 454770 452865 450945 448751 446460
61391 446460 444621 443445 442582 441646 440620 439732 439226 439274 439876 440854 442098 443744 445992 448891 452403 456447
61375 456447 460691 464603 467980 471199 474578 477740 479997 481196 481810 482339 483001 483874 484919 485915 486714 487418
61359 487418 488068 488406 488434 488896 490577 493214 495851 498204 500936 504464 508334 512110 516078 520547 525008
61344 525008 528587 530938 532216 532600 532447 532509 533242 534076 534119 533502 533309 534074 535040 535154 534187 532599 530823 529115
61326 529115 527720 526729 525995 525560 525945 527608 530304 533397 536672 540352 544403 548388 552191 556437 561923
61311 561923 568886 577068 586214 596217 606955 618227 629744 640949 651063 659596 666741 672927 678023
61298 678023 681286 682106 680516 676950 671865 665702 658897 651726 644272 636644 628996 621251 613114 604586
61284 604586 596219 588606 581815 575616 570064 565511 562166 559997 558997 559129 560002 560988 561824 562758 563986
61269 563986 565257 566266 567122 568170 569568 571341 573721 577125 581769 587536 594087 600900 607281 612731
61255 612731 617300 621373 625103 628363 631247 634249 637767 641734 645888 650040 653886 656937 659074 660876
61241 660876 662945 665025 666258 666229 665270 663810 662060 660482 659903 660753 662529 664440 666309 668535 671487
61226 671487 675293 679953 685215 690534 695631 701003 707338 714510 721565 727774 733257 738514 743799 749097
61212 749097 754387 759703 765151 770880 776743 782006 785887 788549 791186 794906 799890 805816 812637 820503
61198 820503 829312 838826 849073 860152 871786 883496 895123 906686 917744 927405 935108 941043
61186 941043 945595 948804 950602 951347 951711 952087 952337 952128 951323 950061 948616 947253 946094 945005 943655 941787
61170 941787 939490 937181 935262 933743 932305 930790 929551 929177 929854 931145 932562 934198 936631 940209 944729
61155 944729 949936 956089 963767 973204 984109 996142 1009186 1022969 1036636 1049028 1059462 1068109
61143 1068109 1075596 1082249 1087754 1091636 1094129 1096381 1099513 1103571 1107717 1111392 1114750 1117887 1120302 1121622
61129 1121622 1122377 1123524 1125453 1127908 1130540 1133017 1134923 1136285 1137994 1140987 1145139 1149773 1155065 1161942
61115 1161942 1170392 1178948 1186301 1192641 1198895 1205395 1211893 1218196 1223958 1228304 1230464 1230589 1229293 1226632
61101 1226632 1222179 1215875 1208098 1198896 1187739 1174129 1158033 1139751 1119830 1099032 1078008 1056896
61089 1056896 1035571 1014164 992998 972179 951715 931979 913521 896372 880018 864170 849104
61078 849104 835110 822032 809633 798091 787727 778389 769434 760514 752223 745767 741837 739926 738894
61065 738894 738013 737150 736180 734985 734193 735070 738086 742176 746097 750025 755001 761210 767842 774628 782464
61050 782464 792329 804374 818353 834165 851541 869886 888904 908972 930418 952934 976193 1000690
61038 1000690 1027313 1056194 1086485 1117351 1148870 1181948 1217581 1256235 1297775 1341873 1388444
61027 1388444 1437648 1489602 1544354 1602217 1663902 1730291 1802322 1881263 1968933 2067421 2178606
61016 2178606 2303934 2444661 2602570 2780945 2985092 3221774 3498007 3820333 4195009
61007 4195009 4628616 5128687 5704275 6365851 7124224 7989822 8974069 10090901 11352611
60998 11352611 12756555 14268029 15811133 17276556 18545375 19519919 20151049 20453407
60990 20453407 20502480 20411026 20290409 20211358 20180561 20141123 19993775 19630217 18969525 17986792
60980 17986792 16722112 15265092 13724264 12198734 10762953 9463181 8319602 7331571
60972 7331571 6485732 5764354 5150195 4627538 4181998 3800791 3472977 3189241 2941811
60963 2941811 2724680 2533415 2364310 2213744 2078458 1956325 1846586 1749113 1663328 1587772
60953 1587772 1520656 1460614 1406794 1358383 1314378 1273772 1235765 1199808 1165619 1133053 1101798
60942 1101798 1071492 1042439 1015742 992053 970402 949055 927426 906271 886045 866166 846238
60931 846238 826873 808641 791087 773629 756745 741403 727792 715478 704390 694729 686126 677804
60919 677804 669544 661733 654492 647455 640406 633471 626662 619881 613451 608043 603922 600753 598220 596366
60905 596366 595153 594129 592729 590637 587916 585070 582914 581922 581689 581392 580661 579552 577875 575228 571764
60890 571764 568199 564911 561633 558251 555229 552834 550488 547351 543244 538610 533921 529458 525371 521541
60876 521541 517641 513769 510796 509632 510193 511462 512502 513085 513391 513567 513725 514076 514718 515427 515909 516342 517422
60859 517422 519624 522495 524857 525769 525135 523482 521528 520046 519550 519637 519034 516879 513746 510832 508315 505236
60843 505236 500967 495975 490954 486055 481274 476846 472682 468013 462293 456036 450157 444857 439811 435062
60829 435062 430900 427046 422900 418672 415374 413399 411894 410015 408142 407220 407285 407393 406881 406061 405554 405440
60813 405440 405308 404822 403998 403041 402157 401478 401019 400720 400552 400571 400789 401023 400964 400403 399414 398333 397548 397294 397581
60794 397581 398299 399282 400220 400621 400139 398983 397804 396999 396248 394948 393004 390906 389030 387167 384974 382642
60778 382642 380815 379801 379127 378060 376452 374882 373880 373248 372394 371240 370407 370368 370763 370921 370841 371199 372452
60761 372452 374382 376547 378701 380689 382438 384280 386741 389624 391729 392086 391245 390780 391621 393372 395216
60746 395216 396899 398691 400898 403653 406838 409910 412065 412833 412394 411189 409405 407073 404457 402045 400140
60731 400140 398669 397439 396467 395998 396237 397107 398245 399208 399640 399329 398224 396451 394249 391864 389519 387435
60715 387435 385693 384069 382257 380282 378433 376665 374454 371557 368543 366205 364664 363514 362609 362103 361849
60700 361849 361389 360636 359948 359393 358541 357219 355877 354846 353774 352287 350816 350134 350326 350773 351089 351555 352658
60683 352658 354595 357261 360263 362940 364792 366011 367316 369156 371429 374007 377065 380585 383895 386129
60669 386129 387043 387093 386749 386095 385106 384024 383288 383139 383390 383559 383288 382679 382198 382185 382539 383019 383693 384789 386158
60650 386158 387311 388142 389192 390947 393107 394981 396339 397390 398043 397770 396307 393951 391011 387521 383814
60635 383814 380834 379301 378856 378607 378295 378288 378486 378052 376502 374508 373210 373084 373830 375058 376549 377936 378683
60618 378683 378560 377863 377011 376129 375239 374650 374851 375934 377401 378681 379703 380789 382075 383285 384092 384477
60602 384477 384692 385053 385814 386989 388178 388795 388666 388244 388042 388077 388088 388128 388547 389448 390512 391431 392319 393601
60584 393601 395676 398692 402415 406236 409435 411626 413009 414256 416094 418842 422219 425785 429630 434471
60570 434471 440869 448557 456818 465300 474089 483034 491431 498462 503706 507178 509112 509849 509783 509291 508667
60555 508667 507955 506818 504877 502430 500573 500252 501378 503262 505731 509312 514413 520843 528191 536238 544924
60540 544924 554310 564644 576117 588581 601884 616367 632461 649746 666941 682922 697124 708937
60528 708937 717412 721937 722615 719732 713504 704638 694413 683716 672601 661264 650706 641698 633749
60515 633749 626007 618759 613086 609398 607337 606974 608943 613187 618656 624672 631870 641346 653603 668773
60501 668773 687228 709342 734990 763845 795791 830512 866863 903238 938506 972138 1003533
60490 1003533 1031733 1055973 1076172 1092715 1105927 1115779 1121800 1123107 1118640 1107561 1089498 1064580
60478 1064580 1033440 997218 957359 915345 872658 830846 791223 754336 720010 688107 659058
60467 659058 633389 610943 590947 572817 556560 542338 529950 518832 508309 497845 487364
60456 487364 477549 469451 463511 459107 455231 451397 447672 444135 440692 437278 433934 430819 428341 426993
60442 426993 426699 426565 425688 424038 422151 420250 418264 416431 415069 413817 411991 409818 408458 408501 409266 409962
60426 409962 410704 411760 412564 412365 411372 410399 409636 408677 407638 407357 408348 410260 412591 415311 418440 421506
60410 421506 423833 425210 425992 426674 427550 428692 430039 431487 432991 434662 436760 439495 442790 446288 449756
60395 449756 453295 456905 459940 461540 461776 461876 462996 465126 467502 469706 471819 473794 475272 476065 476393
60380 476393 476630 477149 478326 480299 482650 484630 485818 486422 486960 487783 488777 489407 489221 488494 488171 488926 490525
60363 490525 492372 494377 496844 499742 502596 505080 507294 509562 512293 515886 520358 525156 529728 534086
60349 534086 538353 541993 544130 544546 543723 541937 539065 535382 531753 528664 525661 522142 518281 514809 512215
60334 512215 510468 509247 508135 506882 505639 504738 504054 502944 500994 498549 496270 494485 493137 492093 491259
60319 491259 490687 490738 491875 494138 497127 500656 505053 510568 516852 523300 529551 535424 540759 545726 550976
60304 550976 557012 563561 569888 575562 580562 584824 588080 590046 590457 589024 585635 580539 574136 566803
60290 566803 559116 551963 545993 541143 537010 533476 530614 528281 526348 525098 524756 524723 523981 522328 520479
60275 520479 518801 516673 513545 509897 506567 503555 500263 496659 493450 491017 488852 486289 483346 480552
60261 480552 478323 476826 476140 476120 476220 475889 475188 474722 474899 475517 476148 476675 477276 478128 479362 481185 483740
60244 483740 486815 489835 492200 493624 494272 494657 495314 496378 497519 498414 499172 500143 501428 502882 504561 506842
60228 506842 509921 513437 516833 520036 523585 528005 533136 538242 542894 547625 553438 560638 568509 576369
60214 576369 584556 593876 604249 614548 623885 632561 641464 650928 660532 669767 678531 686995 695251 703136
60200 703136 710296 716449 721641 726236 730619 734937 738981 742181 743781 743421 741613 739391 737329 735113
60186 735113 732166 728366 723906 718718 712442 704986 696884 689064 682324 676944 672626 668747 664748 660373
60172 660373 655718 651228 647614 645421 644509 644020 642998 641044 638387 635538 632881 630401 627714 624526 621118
60157 621118 618189 616174 614979 614426 614634 615768 617646 619810 621780 623132 623629 623584 623806 624861 626509 628267
60141 628267 630334 633512 638179 643800 649657 655707 662405 669830 677395 684560 691597 699336 708093 717063
60127 717063 724926 730949 735353 738803 741888 745045 748563 752464 756594 760912 765529 770462 775577 780758
60113 780758 785753 789903 792596 794177 795879 798461 801371 803606 804860 805273 804580 802349 798902 795156 791545
60098 791545 787793 783838 780174 777073 774186 771344 769077 767727 766511 764226 760700 756855 753338 749795
60084 749795 745685 741221 737023 733136 728938 724035 718855 714240 710677 708036 705839 703499 700420 696228
60070 696228 691086 685610 680276 674908 668873 661789 653938 645950 638175 630505 622784 615255 608466 602851
60056 602851 598557 595578 593798 592872 592395 592327 592953 594226 595522 596410 597418 599536 603176 608104 614165 621267
60040 621267 628660 635136 640342 645267 650906 656929 662146 665848 668124 669184 669074 667940 666005 663236
60026 663236 659405 654423 648268 640756 631877 622273 612921 604349 596542 589515 583406 577918 572241 565787
60012 565787 558764 551820 545419 539699 534654 530232 526448 523540 521906 521676 522430 523411 524025 524215 524419 525074
59996 525074 526074 526846 527096 527222 527805 529015 530908 533956 538611 544407 550154 555135 559577 563846 567789
59981 567789 571115 573780 575651 576332 575824 574906 574249 573454 571575 568464 565020 562123 559863 557940 556350
59966 556350 555406 555309 555917 556875 557952 559336 561524 564733 568516 572175 575535 578978 582733 586469 589689
59951 589689 592139 593676 594076 593371 592192 591351 591046 590798 590229 589623 589554 590165 591065 591874 592671 593901 595915
59934 595915 598650 601694 604664 607543 610591 613891 617080 619592 621073 621509 621091 620152 619174 618554 618302 618121
59918 618121 617897 617992 619053 621595 625723 631022 636647 641770 646139 650142 654315 658870 663700 668530 672875
59903 672875 676055 677603 677705 677069 676274 675238 673308 669890 665155 660157 656148 653720 652652 652487 653021
59888 653021 654295 656384 659291 662773 666256 669255 671967 675146 679274 684175 689505 695095 700592 705343
59874 705343 709093 712378 715699 718726 720846 722136 723072 723504 722723 720585 717870 715433 713566 712290 711644
59859 711644 711463 711328 710974 710475 709933 709438 709373 710267 712180 714675 717547 721037 725193 729534 733588 737161
59843 737161 739768 740489 739066 736681 734963 734431 734496 734734 735369 736459 737382 737493 736818 735780 734539 733007
59827 733007 731349 730005 729072 727956 725920 723000 720069 717854 716119 714132 711818 710010 709453 709965 710814
59812 710814 711663 712742 714188 715564 716146 715527 713839 711458 708651 705663 702969 701069 699808 698252 695648
59797 695648 692359 689390 687103 684965 682545 680042 677636 675013 671975 668956 666392 663999 661264 658324
59783 658324 655694 653325 650676 647725 645243 643862 643389 643247 643258 643748 645138 647623 651063 654996 658817
59768 658817 662085 664693 666923 669452 673094 678139 683992 689745 695053 700168 705288 710434 716026 722909
59754 722909 731444 740981 750653 760372 770552 781003 790721 798904 805779 812176 818467 824177 828644 831858
59740 831858 834490 837061 839199 839935 838757 836203 833272 830437 827435 823883 819787 815453 811207 807350
59726 807350 804123 801540 799410 797645 796391 795649 794962 793745 791895 789820 787957 786541 785797 785881 786487 786928
59710 786928 786972 787338 789012 792220 796431 801204 806575 812615 819113 825922 833307 841679 851113 861233 871397
59695 871397 880920 889418 897154 904861 912948 920930 927828 933085 936978 940185 943119 945606 947078 947111 945922
59680 945922 944310 943020 942118 941049 939248 936567 933172 929248 924898 920177 915142 909912 904828 900578
59666 900578 897983 897424 898415 899883 901046 902017 903502 906041 909741 914622 920849 928410 936726 944833 951961
59651 951961 957881 962723 966569 969221 970286 969376 966155 960282 951543 940244 927341 913900 900353
59638 900353 886414 871704 856318 840830 826041 812722 801268 791281 781732 771800 761553 751646
59626 751646 742437 733613 724670 715484 706333 697511 689065 680819 672465 663628 654062 643990 634214 625656
59612 625656 618699 613122 608678 605465 603547 602446 601450 600451 600151 601221 603383 605502 606574 606603 606482 607075
59596 607075 608524 610413 612377 614234 615668 616297 616190 615861 615489 614549 612582 609964 607415 605105 602711
59581 602711 600092 597290 594143 590568 587077 584241 581708 578547 574699 571267 569157 568094 567230 566040
59567 566040 564418 562587 561278 561315 562574 563962 564738 565231 565864 566308 566245 566230 566966 568258 569532 571007 573432
59550 573432 576934 580927 585043 589393 594031 598923 604433 611143 619181 628276 638451 650088 663326
59537 663326 677872 693195 708291 721410 730791 735765 736658 733947 728396 721856 716708 714023 713014
59524 713014 712587 712707 713833 715780 717662 718501 717478 714209 709249 703864 698759 693411 687083 679958 672727
59509 672727 665489 657849 649910 642460 636073 630498 625053 619349 613645 608723 605360 603707 603238 603445 604286
59494 604286 605772 607473 608935 610347 612312 615054 618315 621961 626138 630792 635582 640394 645476 650832
59480 650832 655891 660109 663585 666779 669923 673055 676324 679811 683110 685580 687074 687951 688309 687674 685781
59465 685781 683307 681354 680344 679857 679480 679417 680211 682256 685669 690230 695305 700188 704795 709736 715461
59450 715461 721668 727781 733584 738907 743075 745329 745725 744993 743540 741201 738032 734644 731390 727868 723697
59435 723697 719432 716149 714343 713680 713685 714146 714899 715798 717215 720172 725576 733313 742312 751580 761053 771445
59419 771445 783457 797285 812777 829763 848106 867628 888205 909789 931988 953514 972218
59408 972218 985927 993420 994811 991257 984385 975886 967493 961042 958076 959002 962609 966609 968753 967461
59394 967461 961753 951191 936141 917933 898446 879384 861766 845864 831565 818907 808298 800098
59382 800098 793999 789061 784528 780546 777926 777204 778034 779577 781368 783633 786638 789989 792894 795116 797258
59367 797258 800012 803448 807283 811422 815859 820290 824321 828058 832144 837211 843424 850426 857509 864114
59353 864114 870482 877657 886490 896798 907811 919072 930436 941578 952308 963229 975182 987932
59341 987932 1000135 1010731 1019664 1027028 1032412 1035503 1036597 1035930 1033130 1027872 1020515 1011521 1000808 988451
59327 988451 975546 963438 952221 940853 928716 916269 904077 891990 879625 867118 855007
59316 855007 843719 833486 824468 816656 809789 803573 797862 792556 787547 782951 779204 776755 775741 776090
59302 776090 777797 780941 785474 791094 797195 802754 806373 806766 803433 796844 787925 777440 765969 754304
59288 754304 743536 734574 727708 722774 719594 718117 718273 719935 722974 727178 732184 737777 744224 752049
59274 752049 761447 772189 784124 797361 811718 826318 840062 852456 863763 874461 884774 894665
59262 894665 903948 912239 918876 923143 924724 923968 921625 918337 914522 910670 907292 904250 900482 894916
59248 894916 887621 879611 871617 863608 855532 847828 840864 834372 827956 821807 816418 811762 807260 802576
59234 802576 798006 793979 790385 786634 782293 777562 773009 768850 764644 759797 754161 747913 741085 733707
59220 733707 726317 719806 714611 710453 706966 704126 701901 700048 698517 697593 697312 697204 696945 696806 697036 697306
59204 697306 697257 697159 697360 697428 696619 695009 693452 692420 691612 690721 689925 689458 689292 689541 690696 693116 696495 700110
59186 700110 703370 706059 708296 710439 712828 715484 718172 720727 723082 724977 725975 725873 724831 723019 720399
59171 720399 716999 713102 709030 704966 701140 697873 695187 692584 689576 686422 684012 682932 682795 682604 681656
59156 681656 679977 677926 675594 672704 669003 664542 659567 654377 649383 645055 641568 638583 635566 632262
59142 632262 628692 624845 620682 616444 612656 609617 607039 604368 601428 598599 596334 594701 593572 593151
59128 593151 593988 596309 599655 603506 608038 613763 620527 627459 634022 640566 647623 655250 663370 672203
59114 672203 681760 691328 700029 707660 714447 720332 725195 729621 734584 740267 745832 750468 754114 756971
59100 756971 758925 759761 759488 758167 755859 753002 750403 748452 746685 744486 741952 739702 738108 737082 736375
59085 736375 735575 734017 731222 727456 723401 719176 714173 708026 701336 695079 689559 684340 679125 674177
59071 674177 669771 665597 661120 656388 652108 648856 646473 644379 642220 639971 637579 634911 632029 629148
59057 629148 626160 622582 618269 613955 610599 608249 606020 603350 600856 599606 599910 601291 603334 605894
59043 605894 608470 610216 610947 611543 612869 614734 616444 617939 619656 621569 623263 624974 627729 632187 637938
59028 637938 644190 650617 657390 664981 674181 685686 699197 713429 727311 740718 753675 765499
59016 765499 775285 782774 788077 790895 790727 787672 782517 776162 769429 763137 757735 752982 748528 744678
59002 744678 742066 740759 740290 740490 741610 743604 745970 748372 750845 753239 754991 755723 755568 754732 753192
58987 753192 751118 749189 748080 747788 747737 747566 747670 749017 752321 757384 763342 769660 776619 784606 793383
58972 793383 802525 812303 823370 835608 847976 859622 870556 881007 890694 899079 905921 911228 914907
58959 914907 916781 916759 914812 910950 905328 898153 889412 878957 866940 853923 840463 826919 813693
58946 813693 801211 789490 778188 767364 757813 750230 744306 739119 734285 730273 727580 726049 725172
58933 725172 724728 724817 725362 725955 726338 726819 727998 730155 733115 736582 740180 743137 744433 743628 741420 739097
58917 739097 737608 737261 737971 739419 741142 742852 744624 746641 748974 751821 755678 760981 767831 776314 786598
58902 786598 798343 810504 822400 834568 847817 861656 874534 885590 895406 905031 915086 925924
58890 925924 937852 950784 964248 978008 992291 1007213 1022412 1037357 1051607 1064725 1076467
58879 1076467 1087089 1096921 1105560 1112118 1116360 1118936 1120313 1120173 1118152 1114574 1110109 1105249 1100427 1096023
58865 1096023 1091869 1087169 1081286 1074241 1066225 1057137 1046873 1035589 1023418 1010402 996946 983752
58853 983752 970987 958120 944911 931992 920126 909473 899895 891238 882780 873219 861961 849891
58841 849891 838127 826595 814607 802298 790433 779110 767779 756466 745959 736638 728067 720034
58829 720034 713163 708029 704242 700983 698116 696322 696254 697874 700590 703848 707555 711936 716994 722210 726890
58814 726890 730752 734019 737019 739822 742258 744083 745114 745316 744776 743621 741975 739983 737734 735135 732009
58799 732009 728354 724416 720512 716905 713736 710893 707975 704698 701254 698080 695442 693594 693089 694333
58785 694333 696967 700363 704753 711052 719389 728580 737426 745895 754560 763447 771960 779490 785615 789972
58771 789972 792343 792604 790490 785866 779392 772193 764617 756009 746190 736313 727615 720100 713284 707502
58757 707502 703344 700276 697050 693391 690174 687840 685705 683166 680726 679298 678934 678693 677567 675399 673013
58742 673013 671499 671211 671597 672209 673507 676186 680028 684086 687900 691811 696007 699990 703326 706415 710107
58727 710107 714804 720213 725746 730939 735613 739941 744379 749376 755072 761275 767787 774709 782317 790552
58713 790552 798812 806452 813300 819332 824063 826808 827489 826551 823981 819146 811798 802507 791697 778965
58699 778965 763876 746841 728635 709652 690313 671670 654811 639966 626877 615684 606642 599216
58687 599216 592337 585577 579378 574138 569645 565419 561098 556572 552186 548701 546588 545526 545042 545337 546793
58672 546793 548934 550763 552147 554113 557580 562417 567925 573746 580032 587062 594873 603021 610639 616861
58658 616861 621136 623002 621923 617780 611289 603524 595237 586959 579338 572737 566737 560678 554611 549200
58644 549200 544841 541391 538573 536100 533620 531126 529273 528693 529124 529763 530271 530810 531377 531804 532272 533013
58628 533013 533622 533442 532579 531818 531561 531575 531732 532175 532692 532753 532342 532127 532738 534436 537390 541525 546104 550339
58610 550339 554448 559248 564623 569330 572537 574639 576264 577465 578367 579655 581759 584189 586313 588234
58596 588234 590294 592203 593328 593573 593469 593633 594582 596798 600557 605764 612253 619990 628792 638109 647422
58581 647422 656698 666234 676229 686639 697249 707696 717629 727028 736277 745860 756149 767470 780118
58568 780118 794274 810057 827625 847033 868043 890330 913747 938227 963533 989309 1015102
58557 1015102 1039929 1062116 1080027 1092898 1100754 1103881 1102875 1098853 1092914 1085538 1077026 1068238 1060185
58544 1060185 1052988 1045870 1038017 1028827 1017529 1003459 986727 967956 947341 924705 900515 876191
58532 876191 853252 832563 814267 797889 782620 768145 755066 743963 734362 725384 717106 710275
58520 710275 704888 700052 695251 690744 686701 682915 679475 676774 674687 672609 670395 668417 666727 665070
58506 665070 663635 662797 662143 660977 659840 660230 662532 665455 667878 669981 672165 674129 675708 677559 680326
58491 680326 684012 688628 694509 701405 708366 715211 723215 733620 746319 760607 776275 793154 810443
58478 810443 827359 843830 859769 874336 886716 897034 905620 911876 914661 913565 909215 902613 894717
58465 894717 886346 878009 869965 862669 856842 852984 851287 852087 855748 862000 870008 879281 889774 900979
58451 900979 911695 920879 928008 932509 933748 931782 927228 920253 910649 899049 886928 875130 863464
58438 863464 852064 841972 834019 828208 824434 822580 821658 820332 818832 818930 821447 825292 829534 834766
58424 834766 841434 848471 854795 860774 866898 872211 875379 876247 875074 871314 864534 855682 846184 836546
58410 836546 826937 818134 810612 803629 796580 790402 786266 783641 781116 778528 776898 776764 777847 779877
58396 779877 782532 785028 786992 789296 792965 797655 802210 806170 809727 812811 815332 817749 820351 822571
58382 822571 824065 825849 829236 834211 839917 846087 852834 859642 865847 871698 877849 884335 891090 898936
58368 898936 908803 920384 932611 945072 958020 971457 985189 999335 1013883 1028211 1041700 1054148
58356 1054148 1064989 1073169 1078678 1083114 1087718 1091929 1094948 1097424 1100319 1103308 1105827 1108585 1112470 1117020
58342 1117020 1121690 1127617 1136310 1147346 1159141 1171290 1184431 1198478 1212815 1227598 1243157 1258658
58330 1258658 1273102 1287077 1301729 1316467 1329384 1339586 1347578 1353883 1358866 1363406 1368101 1372320
58318 1372320 1375483 1378598 1382985 1388308 1393589 1399358 1406904 1416129 1426124 1437196 1450251 1464610 1478549
58305 1478549 1491766 1505514 1520570 1536775 1554096 1572426 1590785 1608466 1626482 1646237 1667353
58294 1667353 1688411 1709128 1730157 1751608 1773566 1797119 1823022 1850272 1877831 1906462 1936887
58283 1936887 1967598 1996974 2026204 2057411 2090074 2122144 2153613 2185995 2219252 2252362 2286179
58272 2286179 2322645 2361774 2402407 2445311 2492461 2543918 2598416 2656332 2718931 2785360 2853621
58261 2853621 2923834 2997315 3073254 3149690 3226973 3306629 3387656 3467751 3547601 3630093 3715924
58250 3715924 3803970 3895364 3992988 4097213 4206275 4320439 4441799 4570573 4705901 4849626
58240 4849626 5004732 5170650 5344824 5528169 5723997 5932361 6151044 6381664 6629092
58231 6629092 6895160 7178741 7481726 7808724 8160989 8537102 8939730 9375281 9846906
58222 9846906 10354721 10902969 11499769 12149722 12854589 13621696 14463840 15390799 16409693
58213 16409693 17534469 18786202 20183633 21743217 23489474 25455611 27674207 30180034
58205 30180034 33024886 36279972 40025941 44356853 49395288 55284831 62161395 70146524
58197 70146524 79370566 89982037 102130309 115962745 131643725 149346365 169215578
58190 169215578 191368252 215909092 242802275 271531084 300762211 328321795 351538304
58183 351538304 367753112 374833967 371656452 358455316 336826122 309288897 278630570
58176 278630570 247350455 217353525 189850441 165407251 144112787 125785615 110122415
58169 110122415 96769620 85370338 75608041 67221304 59988620 53719148 48259764 43492813
58161 43492813 39318421 35645842 32400425 29524732 26967962 24682444 22631255 20788763
58153 20788763 19130635 17631019 16270501 15037895 13921892 12908372 11987171 11153515
58145 11153515 10400696 9718285 9099118 8540879 8038677 7582585 7164498 6781278 6429273
58136 6429273 6101914 5795095 5509445 5244909 4997986 4766219 4550515 4350962 4164854
58127 4164854 3990730 3829923 3682226 3544156 3413312 3290464 3175669 3066313 2960789
58118 2960789 2860484 2766356 2676996 2591600 2511439 2436810 2365742 2297170 2232269 2171368 2112730
58107 2112730 2055691 2001829 1951644 1903126 1855028 1808561 1764445 1721176 1677660 1634866 1593465
58096 1593465 1552419 1511242 1471133 1432606 1394534 1356824 1321605 1290431 1262554 1237092 1214535
58085 1214535 1194868 1176454 1158111 1140352 1123539 1106856 1090058 1074137 1059242 1043915 1027308
58074 1027308 1010242 993358 976240 959080 943071 928363 913721 898872 885060 872631 860399
58063 860399 848140 837332 828451 819858 810338 800517 790760 779915 767338 754180 741613 729693
58051 729693 718757 709674 701770 692863 682530 673185 666661 661875 657080 652200 647538 642239 635647 628468
58037 628468 621232 613332 604825 597247 591257 585309 578086 570434 563397 556170 547712 538774 530623 523091
58023 523091 515497 508268 502178 497091 492726 489440 487106 484484 480942 477464 474873 472424 469345 466280
58009 466280 463891 461483 458395 455423 453489 452141 450630 449205 448041 446269 443388 440376 438076 435794
57995 435794 432783 429701 427243 424780 421891 419811 419628 420332 420434 420294 421006 422074 422193 421549 421379 421826
57979 421826 422006 421782 421785 422044 422128 422395 423697 426067 428768 431378 433886 436171 438260 440523 442812 444145
57963 444145 444047 443284 442399 440650 437426 433544 429835 425591 419958 413840 408807 404870 400972 396965 393480
57948 393480 390437 387310 384489 382897 382601 383143 384792 388068 392428 396791 401073 405915 411289 416619 421897
57933 421897 427475 433124 438456 443718 448893 452545 452979 450241 445757 440392 434174 427448 420811 414164
57919 414164 407128 400197 394189 388841 383226 377316 371896 367181 362874 359309 357201 356402 356149 356375 357525
57904 357525 359238 360477 360815 360394 358907 355960 352299 349226 346823 344062 340704 337724 335761 334424 333346
57889 333346 332729 332615 332611 332526 332421 332018 330972 329615 328491 327356 325704 324048 323424 323709 323689 322821 321693 320780
57871 320780 320037 319824 320906 323205 325698 327825 329994 332527 335267 338398 342525 347617 352884 357969 363284
57856 363284 368964 374540 379923 385634 391744 397619 402957 408053 412712 416002 417577 418244 418673 418460 417014
57841 417014 414564 411713 408694 405607 402769 400277 397714 394719 391461 388367 385784 384034 383204 382776 382033
57826 382033 380883 379723 378655 377646 377336 378540 380759 382319 382444 382230 383053 384823 386394 386945 386326 384612
57810 384612 381999 378824 375275 371295 366974 362678 358677 355060 352158 350461 350020 350390 351268 352636 354236
57795 354236 355517 356294 356891 357555 358281 359197 360432 361529 361795 361370 361168 361524 361691 360974 359707 358779 358775 359762
57777 359762 361245 362124 361470 359707 358385 358404 359023 358881 357395 354770 351321 347336 343180 339028 334698 329982
57761 329982 324948 319784 314682 309959 306018 303081 301179 300221 299840 299564 299597 300890 303678 306448 307435 306831
57745 306831 306338 306751 307331 307601 308204 309565 311036 312029 312932 314305 316080 318152 320818 324066 327299 330331
57729 330331 333758 337718 341201 343401 344978 347217 350495 354324 358244 361940 364965 367092 368627 369854
57715 369854 370560 370564 370184 369763 369226 368487 367637 366293 363543 359187 354411 350544 347640 344900 341972 339208
57699 339208 337085 336007 336196 337223 338032 337978 337435 336981 336571 335998 335520 335363 335176 334660 334253 334571 335688 337630
57681 337630 340991 346309 353309 361573 371538 384056 399308 416939 436938 459627 485102 513420
57669 513420 544993 579919 617010 654058 688718 718345 739366 748024 742291 722844 692539 655437
57657 655437 615870 577269 541407 508961 480551 456694 437043 420470 406013 393310 382259
57646 382259 372868 365292 359442 354563 349754 344863 340396 336624 333327 330336 327747 325515 323321 320908
57632 320908 318241 315331 312235 309137 306088 302810 299086 295152 291334 287541 283569 279646 276135 272903
57618 272903 269594 266384 263787 261700 259399 256643 254233 253179 253603 254664 255341 255147 254296 253319 252467 251538
57602 251538 250291 248821 247392 246139 245117 244409 243934 243410 242751 242275 242278 242653 243145 243619 243829 243367 242236
57585 242236 241145 240818 241265 242006 242599 242622 241686 239990 238436 237600 236959 235668 233591 231020 227918 224362
57569 224362 221262 219623 219196 218744 217541 215795 213781 211577 209726 209139 209992 211416 212483 212880 212544 211482
57553 211482 210311 210202 211779 214447 217159 219388 221094 222218 222617 222228 221076 219360 217655 216659 216495
57538 216495 216607 216547 216536 216960 217634 217847 217032 215202 212870 210737 209342 208841 209063 209723 210582 211522 212576 213763
57520 213763 214837 215431 215656 216250 217811 220101 222426 224434 226075 227042 226910 225890 224977 225113 226450 228372
57504 228372 230020 230812 230781 230412 230057 229711 229443 229594 230194 230627 230486 230398 231323 233227 235115 236269 236724 236668
57486 236668 236221 235847 236129 236861 237098 236403 235407 234730 233996 232466 230280 228500 228014 228742 229818 230325 229898
57469 229898 228824 227579 226288 224701 222613 220120 217517 215146 213318 212163 211584 211455 211688 212015 211985 211522
57453 211522 211209 211629 212596 213420 213717 213596 213335 213344 214204 216085 218261 219800 220669 221613 223049 224727 226422
57436 226422 228234 230106 231676 232854 234069 235782 238097 240839 243633 245940 247509 248756 250230 251837
57422 251837 253126 254174 255479 257051 258427 259594 261069 262875 264287 264902 265221 265777 266345 266433 266010 265351
57406 265351 264679 264348 264871 266262 267696 268253 267814 266973 266365 266282 266652 267149 267581 268242 269652 271892 274564
57389 274564 277405 280482 283745 286884 289776 292604 295417 297957 300001 301446 302191 302498 303325 305484 308408
57374 308408 310562 311259 311261 311385 311393 310671 309214 307433 305628 304126 303299 303020 302687 302208 302364 303781 306175 308989
57356 308989 312069 315175 317576 318830 319481 320403 321921 324023 326773 329847 332277 333430 333843 334441 335411
57341 335411 336487 337780 339521 341413 343113 345074 348048 351911 355654 358387 359782 359861 359156 358837 359867
57326 359867 361999 364240 366152 368095 370316 372557 374608 376602 378635 380558 382218 383642 385043 386939
57312 386939 389964 394129 398502 402078 404751 407062 409372 411818 414634 417784 420625 422705 424657 427476
57298 427476 431110 434606 437582 440615 444284 448722 454246 461402 470061 479291 488455 497743 507280 516530
57284 516530 525129 533713 543265 553970 565178 576195 586683 596570 606084 615759 625972 636477 646638
57271 646638 656093 664990 673604 681931 689711 696673 702704 707828 712159 715964 719683 723753 728381 733675
57257 733675 739913 747437 756341 766711 779263 795146 814827 837763 863579 893004 926854 964358
57245 964358 1003162 1040733 1075101 1104500 1127427 1143512 1153894 1160413 1164667 1167843 1171109 1176121
57233 1176121 1185316 1201331 1225443 1256436 1291314 1327074 1361500 1392885 1420178 1443659 1464663
57222 1464663 1484241 1502561 1519707 1536244 1552571 1568265 1582516 1594844 1605294 1615063 1627994
57211 1627994 1650914 1690651 1749152 1820959 1895544 1962795 2017514 2060175 2094476 2124403 2152863
57200 2152863 2181667 2211566 2242159 2272449 2301870 2330564 2358517 2384907 2408757 2430088 2450058
57189 2450058 2469938 2490177 2510553 2530929 2551564 2572611 2593705 2614368 2634748 2655481 2676798
57178 2676798 2698217 2719307 2740281 2761481 2782623 2802998 2822103 2839656 2855343 2869025 2881026
57167 2881026 2891762 2901348 2910060 2918878 2928881 2940222 2952270 2964532 2976728 2987948 2996608 3001561
57155 3001561 3002971 3002017 3000053 2997871 2995285 2991602 2987141 2984176 2985759 2993725 3008369 3029654 3057668
57142 3057668 3092028 3132079 3178011 3230816 3290971 3358386 3434134 3521042 3621540 3735483 3860619
57131 3860619 3994208 4133246 4273986 4412909 4548424 4680894 4810904 4938125 5061860
57122 5061860 5182068 5299583 5415632 5531367 5647798 5766118 5887962 6015116 6149021
57113 6149021 6290897 6442239 6604634 6779098 6966392 7168471 7389249 7633830 7907782
57104 7907782 8217664 8571707 8979250 9449649 9992188 10617169 11337465 12169838 13134995
57095 13134995 14255898 15555926 17058979 18790251 20774319 23031373 25576714 28425643
57087 28425643 31599392 35127071 39040192 43352865 48021795 52900563 57727088 62172846
57079 62172846 65932102 68790763 70634842 71415796 71119467 69762535 67404566 64155791
57071 64155791 60175129 55661191 50835612 45918179 41100798 36530664 32306354 28482718
57063 28482718 25079195 22088933 19487457 17239873 15306518 13647432 12225416 11007066
57055 11007066 9962491 9065098 8291855 7623249 7042540 6534943 6087387 5688696 5329769
57046 5329769 5003630 4705335 4431602 4180121 3948805 3735277 3536838 3350952 3175900
57037 3175900 3011039 2856457 2712545 2579975 2459749 2352733 2259070 2178424 2110923 2057342
57027 2057342 2017789 1989953 1968583 1946520 1916565 1873462 1815501 1744842 1666100 1584206 1503171
57016 1503171 1426041 1355020 1291200 1234486 1184133 1139393 1099677 1064438 1033149 1005234 979877
57005 979877 956046 932961 910466 888892 868575 849529 831308 813043 793839 773455 752578
56994 752578 732264 713145 695282 678617 663298 649557 637509 627195 618725 612303 608210 606709
56982 606709 607723 610397 613001 613540 610692 604243 594745 582971 569832 556554 544449 534349 526432
56969 526432 520664 517153 515924 516711 519244 523536 529568 536926 545186 554580 565807 579114 593846 608854
56955 608854 622885 634488 642033 644226 640587 631420 617626 600695 582585 565279 550322 538579
56943 538579 530119 524322 520432 518221 518012 520132 524711 532053 542723 556907 573886 592418 611480
56930 611480 630392 648267 663511 673908 677308 672544 659925 640860 617082 590330 562521 535636
56918 535636 511120 489475 470512 453828 439117 426372 415892 407825 401698 396661 392197 388280
56906 388280 384941 382166 380241 379591 380053 380826 381411 382147 383583 385856 389002 393351 399106 405933 413519
56891 413519 422221 432698 445125 459254 474970 492192 510296 528079 544246 557609 567026 571665
56879 571665 571433 566938 559195 549610 539979 531897 526160 523000 522762 525940 532726 543044 557026 574989
56865 574989 596915 622408 651359 684242 721416 762194 804601 845801 882564 911559 929732
56854 929732 935015 927202 908246 881510 850512 818307 787666 761177 740756 727357 721325 722779
56842 722779 731533 747165 769608 799307 836458 880469 930666 987129 1050036 1117902 1186637 1250084
56830 1250084 1301260 1333733 1343139 1328352 1291590 1237685 1173093 1104578 1037554 975286 919736
56819 919736 872793 836089 809911 793177 784700 783991 790819 804706 825144 851876 884633 922714
56807 922714 964740 1008227 1049176 1082446 1103081 1107600 1094577 1064780 1021018 967510 908948 849856
56795 849856 794287 745367 704723 672432 647599 629016 615673 607192 603777 605443 611396 620571
56783 620571 632712 648365 667672 689401 710998 729137 740346 741998 733207 714717 688019 654974
56771 654974 618153 580639 544916 512154 482637 456439 433453 413329 395818 380908 368295
56760 368295 357071 346358 336069 326701 318472 311004 303833 296992 290970 286168 282374 278841 274949
56747 274949 270746 266672 262943 259520 256559 254367 252831 251393 249790 248438 247748 247400 246619 245041 243077
56732 243077 241525 240952 241230 241525 240950 239430 237797 236928 237060 238066 239982 242809 245939 248266 249041 248486
56716 248486 247488 246812 246603 246554 246448 246457 246858 247477 247602 246627 244773 243043 242389 242915 243947 244824 245461 246084 246665
56697 246665 246970 247088 247451 248262 249237 250108 250989 252068 253308 254654 256119 257376 257787 257278 256701 256756 256983
56680 256983 256550 255648 255226 255497 255607 254844 253373 251667 249990 248634 247905 247553 246814 245345 243577 241926
56664 241926 240252 238433 236861 235884 235176 234146 232690 231226 230228 230021 230738 232144 233674 234865 235597 235906
56648 235906 235893 235904 236387 237337 238247 238752 238973 239077 238985 238717 238591 238780 239013 238994 238761 238438 238020 237715 238056 239244
56628 239244 240655 241358 240919 239476 237383 235096 233148 231792 230762 229587 228068 226359 224837 223962 223908
56613 223908 224204 224097 223433 222754 222346 221689 220252 218380 216904 216095 215444 214369 212791 211087 209738 209000
56597 209000 208841 209245 210399 212262 214055 214791 214403 213809 213685 213759 213571 213310 213453 214084 215038 216296 217843
56580 217843 219435 220883 222181 223069 223010 222038 221167 221429 222847 224796 226933 229269 231756 234431 237678 241708
56564 241708 246057 250234 254651 260258 267378 275481 283965 292474 300376 306530 309887 310177 308024 304539
56550 304539 300657 296647 292371 288025 284209 281030 277732 273712 269447 265831 262953 260214 257473 255359
56536 255359 254435 254586 255214 255647 255436 254678 253925 253500 253097 252393 251702 251536 251794 251998 252059 252169 252134 251520 250336
56517 250336 248947 247387 245464 243474 242058 241319 240784 240336 240392 240978 241367 241027 240295 239691 239094 238108 236848
56500 236848 235794 235051 234245 233087 231685 230336 229303 228789 228845 229182 229290 228877 228146 227484 227008 226578 226243
56483 226243 226289 226706 226925 226486 225706 225242 225154 224992 224720 224820 225306 225394 224517 223077 221779 220775 219917 219359 219334
56464 219334 219692 220099 220435 220590 220273 219453 218639 218269 218168 218076 218256 219085 220383 221683 222810 223734 224255 224423
56446 224423 224886 226202 228105 229984 231642 232953 233249 231891 229253 226417 224149 222791 222707 223948 225679
56431 225679 226787 226991 226724 226236 225624 225422 226163 227428 228233 228308 228191 228195 228236 228612 229850 231667 233015 233399
56413 233399 233343 233382 233409 233265 233210 233512 234128 234931 235698 235899 235189 234139 233750 234232 235040 236054 237775 240180 242404
56394 242404 243836 244714 245333 245555 245411 245343 245405 245005 243884 242662 241975 241751 241728 241999 242532 242793 242408 241736 241321
56375 241321 241213 241274 241650 242475 243421 243955 243899 243585 243769 245342 248552 252370 255206 256465 256870 257242 257734 258463
56357 258463 259962 262476 265481 268405 271217 273812 275476 275661 274881 274176 273898 273594 272954 272359 272489 273622
56341 273622 275382 277141 278736 280630 283202 286140 288995 292030 295837 300258 304439 307954 311081 313925
56327 313925 316123 317613 318926 320418 321956 323528 325366 327219 328339 328525 328406 328376 328064 327287 326732 327160
56311 327160 328589 330728 333500 336670 339665 342313 345120 348324 351385 354014 357011 361323 366754 372302
56297 372302 377340 381910 386231 390617 395620 401636 408465 415596 422787 430106 437649 445411 453256 461021
56283 461021 468959 477880 488228 499210 509678 519790 530773 542987 555493 567892 581264 596617
56271 596617 613479 631032 649695 670603 694063 719496 746564 775645 807473 842813 882208
56260 882208 925642 972883 1024361 1081171 1144061 1213180 1288989 1372412 1463704 1562250 1668026
56249 1668026 1782132 1905056 2035317 2170516 2308844 2448792 2588401 2725637 2858575
56240 2858575 2984275 3098461 3197396 3279352 3343353 3387490 3409733 3409641 3388002 3345492 3283071
56229 3283071 3203234 3109517 3004987 2892089 2773358 2651019 2526320 2400428 2275542 2153893
56219 2153893 2036084 1921839 1812084 1708821 1612990 1523810 1440378 1362659 1290729 1224203
56209 1224203 1162834 1106750 1055738 1008985 965823 926187 890197 857773 828717 802697 779106
56198 779106 757324 737056 718183 700545 684222 669619 656878 645628 635710 627565 621416 616660
56186 616660 612646 609372 606773 604098 600893 597956 596370 596083 596355 597025 598383 600196 601929 603640 605853
56171 605853 608872 612894 618248 624763 631498 637936 644768 652626 660852 668624 676535 685783 696375 707426
56157 707426 718700 730577 742991 755827 770035 787004 807016 829528 854732 883626 916819
56146 916819 954451 997123 1045761 1100772 1162317 1230864 1306204 1386256 1468023 1549359 1628653
56135 1628653 1703521 1771502 1831902 1885504 1932696 1973347 2008281 2039174 2066705 2089934 2107476
56124 2107476 2118193 2121086 2115899 2103756 2085938 2062103 2030801 1991337 1943787 1887690 1822567 1749772
56112 1749772 1672414 1593392 1514732 1438559 1367076 1301455 1242022 1189440 1144408 1106411 1074113
56101 1074113 1046843 1024428 1005952 990282 977506 968232 961738 956449 952022 949243 948047 947446 947348
56088 947348 948652 951523 955183 959337 964194 969299 974118 979548 986999 996128 1005380 1014531 1024675 1035859
56074 1035859 1046956 1057894 1069870 1083158 1096779 1110458 1124896 1139992 1154868 1169722 1185617
56063 1185617 1202395 1218963 1235555 1253421 1272344 1290889 1309060 1328091 1347618 1365904 1383145
56052 1383145 1401593 1421900 1442248 1461708 1481550 1502508 1523746 1545504 1569826 1597423 1626458
56041 1626458 1655587 1685586 1716823 1747746 1777243 1806157 1835303 1864300 1893364 1923854 1956084
56030 1956084 1989058 2023165 2060408 2101053 2142907 2184958 2228861 2275721 2324511 2374907 2428573
56019 2428573 2486150 2545971 2607288 2671776 2740353 2811593 2884944 2962408 3045258 3132063 3221766
56008 3221766 3315788 3415403 3519960 3629435 3745664 3869358 3998983 4134215 4277328 4429622
55998 4429622 4589873 4757856 4935775 5124685 5323449 5532909 5756923 5997419 6252823
55989 6252823 6523404 6813592 7126855 7463023 7823080 8211528 8631526 9083041 9568692
55980 9568692 10095968 10670754 11294554 11971520 12712271 13527439 14424033 15412325 16509859
55971 16509859 17734756 19102282 20632553 22354508 24298693 26496027 28990419 31845355
55963 31845355 35135271 38943853 43378043 48568877 54645837 61720427 69903967 79326928
55955 79326928 90129470 102450893 116443352 132274041 150092152 170014227 192146755
55948 192146755 216515868 242777293 269838029 295719043 317831415 333519935 340634849
55941 340634849 338020695 325852397 305657223 279912206 251373788 222475041 195003069
55934 195003069 170034369 148022491 128973277 112649371 98724664 86856117 76714262
55927 76714262 68011265 60514437 54032733 48401613 43486113 39183615 35409855 32085909
55919 32085909 29142700 26527988 24199967 22119397 20253271 18578875 17076994 15725610
55911 15725610 14504851 13402242 12407429 11506525 10686548 9940654 9264024 8648740 8087159
55902 8087159 7576138 7113247 6692331 6306931 5954553 5633608 5339506 5067701 4817382
55893 4817382 4588357 4377224 4180247 3997221 3828957 3673542 3528495 3394103 3271320
55884 3271320 3158478 3052987 2954028 2860757 2770243 2680138 2591345 2505427 2421506 2338341 2257258
55873 2257258 2180250 2107098 2036860 1970208 1907764 1848155 1790278 1735661 1686101 1640774 1598070
55862 1598070 1558364 1522423 1488801 1455374 1421945 1389026 1355677 1320948 1285897 1251788 1217793
55851 1217793 1182814 1148061 1115422 1084700 1054814 1026288 1000096 975356 950719 926881 905321
55840 905321 885630 866557 848592 832949 818788 803969 788049 772329 757523 743453 730406
55829 730406 718677 707277 695159 683219 673154 664817 656562 647672 638555 629060 618579 607486
55817 607486 596713 586207 575433 564890 555464 546809 538207 530541 525493 523027 521493 520117 519628
55804 519628 520478 522082 523993 526474 529770 533832 538583 543441 547011 548420 548458 548230 547221 544082 538759
55789 538759 532374 525502 518092 510685 504075 498031 491859 485934 481095 476793 471550 465238 459278 454540
55775 454540 450686 447792 447075 449509 454820 462107 470301 477751 482419 482923 478827 470162 457627 443097
55761 443097 428698 415209 402183 389507 377741 367004 356707 346541 336755 327416 318425 310370
55749 310370 304346 300697 298675 297379 296310 295053 293334 291460 289959 288748 287315 285555 283735 281847
55735 281847 279787 277825 276026 273554 269608 264751 260209 256113 251624 246649 242057 238160 234285 230121
55721 230121 226329 223504 221537 220275 219879 220245 220964 222110 224268 227571 231511 235756 240263 244449 247246
55706 247246 248241 247955 246768 244443 240961 236924 232809 228603 224464 220896 217895 214665 210639 206216 202150
55691 202150 198777 196091 193979 192102 190046 187876 186171 185384 185551 186587 188285 190109 191647 193263 195653
55676 195653 198716 201493 203140 203275 201594 198120 193841 190034 186839 183495 180131 178091 178022 178746 178761 178038
55660 178038 177614 178142 179529 181482 183638 185486 186797 187985 189655 191898 194306 196388 197873 198857 199733
55645 199733 200687 201333 201239 200563 199463 197129 192475 185902 179242 173610 168421 163069 158361 155351 153671
55630 153671 152223 150934 150601 151168 151410 150528 149150 148411 148621 149237 149755 150200 150804 151417 151394 150171 147943
55613 147943 145566 143686 142114 140143 137288 133677 129988 127171 125923 126138 126933 127410 127343 127067 126897 126822
55597 126822 126598 125987 124916 123528 122120 121063 120692 121020 121452 121128 119866 118490 117878 117885 117712 117112 116675
55580 116675 116989 118156 120212 123348 127393 131522 134891 137456 140033 143653 148743 154625 159879 163504
55566 163504 165710 167288 168361 168193 166100 162086 156667 150667 145084 140493 136490 132289 127931 124200
55552 124200 121324 118611 115672 113206 112030 111951 112138 112148 111991 111518 110426 108788 107134 105994 105586 105844
55536 105844 106462 106989 107062 106593 105757 104923 104550 104852 105503 105899 105703 104975 103950 103029 102766 103285 103790 103277 101762
55517 101762 100175 98927 97349 94813 91748 89076 87142 85647 84220 82689 81102 79797 79160 79080 79011
55502 79011 78777 78860 79627 80762 81794 82752 83876 85122 86339 87529 88529 88795 88043 86802 85856 85338 84833
55485 84833 84146 83585 83609 84536 86371 88563 90148 90561 90172 89735 89542 89467 89528 89882 90420 90824 90937 90639 89529
55466 89529 87274 84377 82087 81302 81741 82263 81892 80533 78882 77715 77223 77095 77147 77572 78418 79139 79018
55449 79018 77930 76390 74975 73958 73402 73289 73514 73896 74255 74425 74400 74573 75542 77366 79161 79862 79375
55432 79375 78641 78532 78967 79322 79407 79661 80368 81058 80987 80120 79266 79138 79610 80125 80495 80902 81348 81611 81672 81718
55412 81718 81717 81470 81174 81366 82147 82851 82750 81739 80206 78584 77303 76770 77081 77913 78878 79765 80345 80355 79893
55393 79893 79503 79635 80248 81061 81817 82163 81812 81092 80853 81362 81723 80930 79217 77753 77192 77098 76839 76491 76578
55374 76578 77242 77910 77795 76677 75167 74175 74114 74677 75275 75488 75160 74436 73759 73549 73790 74159 74491 74763 74680
55355 74680 73813 72312 70962 70347 70386 70850 71819 73271 74741 75715 76082 75946 75464 75069 75279 75875 75836 74621
55337 74621 73044 72285 72407 72443 71699 70341 68871 67607 66650 66018 65809 66367 67958 70133 71910 72958 74030
55320 74030 75731 77439 78155 77942 77698 77833 78027 78086 78139 77978 77054 75319 73436 72047 71360 71421 72160 73088
55302 73088 73596 73707 74044 74855 75535 75283 73907 71975 70483 70247 71168 72177 72377 72142 72536 73848 75407
55285 75407 76700 77822 78750 79085 78771 78271 77744 76824 75614 75042 75669 76787 77365 77330 77284 77413 77410 77141 76646
55266 76646 75719 74236 72836 72542 73550 74897 75502 75165 74461 74020 74053 74292 74241 73641 72737 72013 71775 72192
55248 72192 73490 75588 77628 78479 77976 77215 77332 78389 79802 81378 83212 84789 85115 83977 82416 81485
55232 81485 81088 80584 80065 80197 80907 81116 80104 78483 77414 77281 77605 77931 78266 78704 79113 79305 79314 79376 79685
55213 79685 80127 80263 79781 79014 78807 79660 81230 82806 84025 84888 85346 85277 84811 84353 84217 84420 84791 85167
55195 85167 85478 85718 85778 85431 84673 84033 84071 84562 84680 84213 84000 84782 86176 87331 88107 88885 89519 89380 88392
55176 88392 87281 86637 86361 86240 86517 87528 89028 90162 90077 88639 86737 85718 86189 87460 88441 88869 89222
55159 89222 89684 89896 89744 89643 89819 89827 89196 88182 87601 88039 89376 90888 91738 91584 90750 89709 88552 87281
55141 87281 86378 86462 87376 88154 88067 87212 85963 84431 82779 81601 81445 82166 83076 83683 84024 84353 84667 84593 83815
55122 83815 82650 82038 82648 84058 85165 85374 85067 84944 85342 86224 87355 88265 88462 87944 87305 87172 87727 88841
55104 88841 90293 91729 92681 92843 92224 91018 89610 88685 88922 90384 92468 94521 96272 97659 98680 99549
55088 99549 100667 102189 103798 105015 105591 105588 105317 105138 105132 105053 104861 104977 105561 105854 104959 103140 101566 100793 100403
55069 100403 100197 100661 101914 103152 103743 104017 104406 104558 104107 103553 103493 103542 103005 102202 102055 102494 102345 100902
55051 100902 98744 96825 95516 94779 94627 94996 95542 95909 95926 95444 94300 92636 90988 89859 89366 89399 89878
55034 89878 90713 91655 92384 92706 92592 92065 91140 89961 88970 88781 89624 90965 91939 92199 92102 92061 92126 92282 92703
55015 92703 93387 93943 94062 93950 93989 94233 94582 95135 96005 96988 97826 98555 99222 99531 99245 98730 98571 98763 98793 98450
54995 98450 98067 97936 97951 97902 97688 97239 96592 96094 96099 96436 96607 96605 97074 98422 100111 101162 101133 100440 99803 99640
54975 99640 99937 100543 101452 102717 104087 104965 104947 104293 103662 103466 103686 104121 104545 104744 104746 104910 105412 105787 105469
54956 105469 104774 104743 105810 107142 107647 107242 106684 106415 106102 105274 103993 102798 102253 102621 103735 105030 105850
54939 105850 105973 105797 105864 106261 106689 107067 107725 108827 109912 110433 110583 111177 112641 114549 116288 117870 119928
54922 119928 123123 127684 133170 138539 142804 145918 148711 151709 154325 155588 155312 154099 152417 150272
54908 150272 147742 145245 143040 140826 138075 134600 130677 126803 123420 120791 119041 118224 118309 119000 119734
54893 119734 119973 119541 118716 118086 118200 119069 119990 120188 119686 119261 119536 120554 122306 125037 128676 132497 135842
54876 135842 138835 142001 145559 149436 153483 157148 159442 159855 158941 157417 155202 152060 148679 145995 143756
54861 143756 140846 137031 133324 130562 128597 127011 125609 123985 121680 119156 117598 117212 116650 114761 112033
54846 112033 109586 107547 105359 103114 101577 101144 101607 102728 104264 105550 105855 105219 104403 103948 103732 103426
54830 103426 102896 102190 101509 101235 101647 102606 103733 104744 105365 105187 104111 102822 102294 102763 103539 103857 103518
54813 103518 102696 101529 100135 98825 98120 98524 100192 102660 105082 106860 107938 108354 107893 106533 104961
54798 104961 104135 104334 105055 105780 106437 107136 107872 108638 109470 110276 110874 111234 111458 111506 111258 110848 110618 110709 110950
54779 110950 111242 111729 112557 113776 115527 118024 121250 124910 128693 132243 134978 136550 137652 139792 143814
54764 143814 148985 153893 157881 161190 164094 166532 168424 169714 170015 168825 166256 163089 159867 156306
54750 156306 151905 146896 142229 138696 136348 134723 133395 132176 130940 129456 127591 125650 124289 123835
54736 123835 123800 123341 122248 121121 120537 120422 120489 120884 121975 123725 125746 127879 130281 133012 136044 139661
54720 139661 144220 149272 153476 155841 156685 157003 157190 156879 155722 153722 150901 147258 143170 139300 135932
54705 135932 132768 129519 126307 123394 120975 119443 119311 120409 121529 121450 120212 118916 118328 118148 117693 116806
54689 116806 115874 115274 115082 115151 115228 115045 114495 113767 113185 112942 112989 113069 112799 111838 110259 108723 108045 108404 109137
54670 109137 109486 109435 109512 109871 109987 109468 108756 108581 108923 109033 108571 108185 108682 109932 110957 111031 110357 109667 109464
54651 109464 109750 110311 110974 111526 111607 111000 110104 109790 110461 111352 111174 109521 107322 105757 105073 104714 104338 104251
54633 104251 104883 106140 107370 107823 107211 105972 104965 104732 105110 105646 106246 107154 108440 109860 111183 112341
54617 112341 113179 113429 113089 112574 112351 112554 113059 113669 114070 113906 113163 112303 111787 111640 111681 111931 112449 112986 113282
54598 113282 113644 114686 116339 117611 117604 116448 114939 113610 112509 111647 111141 110935 110789 110652 110746 111196 111764
54581 111764 112036 111745 110933 110054 109859 110833 112583 114039 114447 114015 113460 113165 112975 112620 112044 111418 111061 111330
54563 111330 112330 113679 114713 115034 114831 114671 115045 116097 117655 119418 121104 122462 123305 123641 123712 123774 123850
54546 123850 123869 123981 124540 125697 127165 128460 129228 129360 129017 128544 128151 127639 126682 125355 124096 123093 122124
54529 122124 121115 120400 120147 119941 119324 118438 117755 117413 117207 117020 116862 116650 116345 116167 116277 116417 116269 116048
54511 116048 116349 117460 119194 121197 123025 124099 124158 123691 123422 123405 123090 122267 121409 121063 121402 122376 123746
54494 123746 124861 124992 124122 123067 122674 123216 124528 126202 127589 128194 128246 128435 128950 129338 129420 129723 130680 131964
54476 131964 133007 133712 134308 134938 135685 136637 137637 138401 139078 140166 141607 142578 142565 142078 141857 141993 142377 143334
54458 143334 145005 146570 146947 146047 144592 142965 141086 139232 138018 137410 136546 134855 132846 131555 131551 132598
54442 132598 133922 134735 134759 134275 133538 132418 130927 129682 129222 129166 128794 128292 128567 129775 130966 131420 131581
54425 131581 132283 133690 135346 136684 137147 136432 135053 134115 133960 133584 132015 129835 128583 128910 130121 131442
54409 131442 132851 134460 135812 136305 135961 135384 135101 135272 135858 136771 137844 138896 139878 140821 141621 142064 142164
54392 142164 142347 143128 144536 145965 146679 146515 146098 146321 147509 149098 150255 150832 151501 152804 154343 155279
54376 155279 155508 155892 157268 159607 162241 164472 165812 166111 165835 165808 166302 166673 166322 165634 165415 165683 165753 165445
54358 165445 165399 165969 166465 165898 164154 162126 160909 161024 162108 163124 163114 162017 160594 159403 158150 156230
54342 156230 153637 150928 148425 145918 143274 140999 139886 140148 141138 141993 142373 142415 142210 141684 141017 140700 140988
54325 140988 141579 142115 142663 143370 143963 144058 143801 143640 143562 143066 141964 140664 139587 138777 138278 138361 139094 140008 140572
54306 140572 140752 140860 141038 141192 141275 141386 141628 141989 142302 142314 141970 141646 141811 142415 142905 142982 143012 143490 144374 145227
54286 145227 145767 146023 146131 146288 146826 147999 149677 151373 152603 153157 153143 152868 152570 152173 151439 150427 149601
54269 149601 149347 149572 149964 150448 151090 151679 151823 151540 151457 152173 153552 154876 155745 156594 158144 160450 162780
54252 162780 164403 165140 165028 163928 161913 159755 158407 158011 157927 157730 157593 157536 156989 155583 153983 153334 153958
54235 153958 155012 155409 154769 153434 151884 150363 149005 148109 148049 148763 149518 149470 148498 147256 146418 146163 146371
54218 146371 146899 147520 147947 148108 148134 147888 146897 145058 143139 142165 142430 143343 144105 144276 143904 143450 143525 144335 145373
54199 145373 145844 145440 144569 143895 143819 144293 144973 145541 145978 146458 146993 147412 147759 148422 149610 150966 151958 152556
54181 152556 153233 154357 155841 157312 158491 159451 160623 162355 164332 165640 165692 164905 164182 163870 163528 162606
54165 162606 160971 158788 156241 153525 150940 148873 147684 147480 147894 148240 148117 147750 147561 147541 147390 147123 147186
54148 147186 147936 149269 150796 152148 153014 153181 152679 151797 150909 150376 150540 151597 153367 155338 157020 158231
54132 158231 159034 159505 159624 159359 158851 158453 158477 158920 159565 160331 161292 162359 163271 164102 165360 167253 169087 169861
54114 169861 169335 168117 166791 165454 164201 163479 163633 164313 164714 164371 163558 162885 162647 162596 162259 161399 160181
54097 160181 159029 158384 158507 159265 160168 160806 161268 161873 162491 162508 161666 160589 160196 160770 161847 162822 163386 163566
54079 163566 163680 164199 165403 167137 169026 170784 172279 173535 174840 176528 178452 179966 180661 180778 180643
54064 180643 180172 179350 178722 178745 179017 178859 178453 178599 179449 180341 180930 181651 182835 184125 185160 186170 187478
54047 187478 188927 190287 191873 194263 197623 201707 206307 211365 216770 222295 227715 232849 237583 241914
54033 241914 245834 249218 252043 254647 257430 260331 262972 265271 267404 269209 270251 270597 270869 271270 271265 270554
54017 270554 269669 269067 268276 266629 264326 261993 259586 256602 253133 249763 246432 242369 237403 232601 229166
54002 229166 227224 226042 225033 224074 223166 222264 221434 220930 221000 221693 222816 224105 225546 227454 230049 233000
53986 233000 235672 237755 239319 240211 239815 237686 234140 229933 225506 220884 216212 212023 208784 206356 204115
53971 204115 201629 199105 197134 196104 195994 196621 197766 198961 199557 199346 198981 199384 200759 202541 204243 205887
53955 205887 207509 208813 209663 210541 212033 214089 216241 218375 220763 223397 225895 228213 230916 234417 238341
53940 238341 241987 245129 247977 250624 252993 255188 257427 259630 261525 263170 264937 266930 268867 270640
53926 270640 272576 274961 277772 281121 285406 290596 295865 300491 304832 309748 315286 320633 325394 330119
53912 330119 335360 340785 345652 349679 353016 355678 357462 358337 358528 358198 357288 355729 353616 351118 348312
53897 348312 345169 341760 338355 335185 332036 328362 323974 319401 315191 311013 305929 299590 292695 286178
53883 286178 280347 275028 270133 265761 261937 258574 255563 252802 250260 248018 245979 243591 240345 236663
53869 236663 233699 231960 230641 228748 226368 224252 222640 221215 219952 219133 218543 217527 215988 214562 213446
53854 213446 211767 208687 204753 201546 200126 200276 201144 202098 202859 203318 203612 204222 205588 207466 208892 208985
53838 208985 207762 206003 204388 203011 201759 200782 200337 200340 200432 200412 200382 200520 200923 201644 202626 203636 204487 205314
53820 205314 206366 207574 208609 209459 210572 212259 214198 215792 216861 217764 218919 220454 222383 224901 228333
53805 228333 232727 237581 242095 245793 248909 252123 255954 260434 265222 269848 273867 277053 279602 282036
53791 282036 284733 287532 289902 291536 292667 293713 294669 295014 294268 292468 289921 286741 283007 279281 276366
53776 276366 274325 272164 268963 265015 261374 258452 255609 252151 248193 244392 241220 238732 236685 234574
53762 234574 231829 228368 224885 222320 220976 220358 219855 219381 219242 219538 219884 219760 218993 217776 216301 214638
53746 214638 212996 211903 211855 212824 214246 215454 216093 216268 216416 216915 217634 217972 217508 216504 215561 214953 214609
53729 214609 214572 215072 216145 217538 219056 220616 221958 222736 223108 223831 225462 227736 230006 232092 234302 236752
53713 236752 239047 240730 241861 243009 244762 247239 250069 252815 255347 257743 259989 261994 263844 265760
53699 265760 267816 269962 272403 275566 279564 283979 288325 292392 295942 298487 299813 300452 301110 301682 301311
53684 301311 299460 296596 293720 291546 290222 289546 289169 288697 287782 286321 284649 283508 283516 284411 285087 284707 283714
53667 283714 283321 284058 285261 286104 286572 287078 287538 287416 286610 285756 285473 285680 285880 285889 285921 286120 286335 286465 286687
53648 286687 287155 287679 287979 288096 288310 288749 289460 290778 293122 296241 299112 300936 301942 302885 304047 305234
53632 305234 306531 308427 311043 313718 315641 316732 317754 319603 322480 325567 327620 328154 328051 328672 330437
53617 330437 332662 334753 336993 339890 343270 346480 349206 351682 354259 357121 360299 363552 366352 368307
53603 368307 369603 370748 372037 373577 375679 378640 382009 384551 385285 384385 382850 381491 380448 379524 378657
53588 378657 377961 377429 376785 375710 374206 372604 371092 369403 367164 364484 361925 359841 357990 355923 353536
53573 353536 351152 349139 347618 346503 345755 345524 345899 346449 346272 344862 342846 341485 341361 341911 342352 342662
53557 342662 343412 344939 347029 349227 351108 352327 352710 352403 351887 351831 352785 354730 356897 358413 359326 360583
53541 360583 362791 365505 368127 371010 374983 380061 385413 390578 395946 401956 408555 415698 423677 432547
53527 432547 441791 451037 460671 471248 482675 494494 506686 519543 532938 546392 559915 574211
53515 574211 589844 606619 624002 641819 660340 679917 700781 722925 745956 769154 791922
53504 791922 814130 835849 856846 876606 894873 911977 928484 944659 960411 975706 990790
53493 990790 1005902 1020888 1035343 1049098 1062456 1075912 1089778 1104105 1118731 1133263 1147143
53482 1147143 1160014 1172073 1183938 1196075 1208355 1220118 1230628 1239482 1246696 1252392 1256416 1258302
53470 1258302 1257676 1254631 1249631 1243071 1235060 1225655 1215155 1204006 1192368 1179979 1166591 1152496 1138353
53457 1138353 1124414 1110162 1094908 1078556 1061499 1043965 1025917 1007627 989858 973232 957792
53446 957792 943442 930427 918914 908336 897710 886702 876057 866835 859485 853793 849442 846342
53434 846342 844440 843438 842920 842834 843780 846578 851444 857755 864792 872555 881614 892281 904278 917229
53420 917229 931127 946152 962344 979751 998682 1019357 1041345 1063792 1086459 1110186 1135879
53409 1135879 1163208 1190867 1218297 1246570 1277178 1310282 1344758 1379758 1415546 1452720 1491334
53398 1491334 1531130 1572160 1614664 1658524 1703237 1748297 1793313 1837949 1882038 1925671 1968919
53387 1968919 2011550 2053190 2093588 2132520 2169688 2204923 2238258 2269488 2297927 2323000 2344812
53376 2344812 2363656 2379144 2390416 2397120 2399641 2398314 2392910 2382973 2368149 2348187 2323155 2293873
53364 2293873 2261541 2226658 2188772 2147649 2104269 2060210 2016300 1972266 1927551 1882083 1836378
53353 1836378 1791249 1747414 1705195 1664549 1625470 1588106 1552292 1517234 1482040 1446587 1411628
53342 1411628 1378060 1346300 1316319 1287969 1261133 1235731 1211818 1189671 1169624 1151668 1135242
53331 1135242 1119613 1104570 1090594 1078187 1067108 1056556 1045976 1035423 1025139 1015209 1005766 997173
53319 997173 989651 982892 976385 970142 964915 961614 960540 961116 962363 963657 965090 967077 969824 973342
53305 973342 977862 983862 991634 1001088 1012051 1024460 1038186 1052939 1068538 1085110 1102882 1121909
53293 1121909 1141999 1162693 1183377 1203742 1224180 1245262 1266747 1287500 1306558 1323780 1339254
53282 1339254 1352727 1364094 1373912 1382668 1389772 1393976 1394774 1392772 1388732 1382830 1374967 1365179 1353431
53269 1353431 1339441 1323076 1304741 1285142 1264762 1243719 1221938 1199315 1175871 1151905 1127928
53258 1127928 1104300 1080939 1057467 1033631 1009517 985394 961372 937300 913004 888561 864223
53247 864223 840182 816620 793969 772704 752748 733377 714024 694929 676752 659795 643996
53236 643996 629389 616047 603620 591560 579936 569561 561003 553797 546915 539790 532586 525545 518430
53223 518430 510747 502405 493904 485755 477811 469423 460291 450856 441761 433221 425145 417484 410062 402394
53209 402394 394290 386421 379613 373597 367255 360343 354165 349930 346955 343226 337568 330624 323690 317239
53195 317239 310855 304238 297757 292065 287431 283606 280229 277181 274554 272423 270755 269376 267846 265507
53181 265507 261990 257738 253786 250947 249290 248343 247525 246403 244941 243642 243104 243236 243209 242487 241597 241448
53165 241448 242096 242647 242401 241572 240763 240133 239373 238286 237051 235965 235114 234348 233429 232238 230920 229824 229152
53148 229152 228666 227871 226600 225339 224843 225436 226682 227701 227777 226793 225306 224239 224298 225537 227486 229668
53132 229668 231844 233814 235288 236230 237102 238453 240267 242028 243478 245001 247101 249696 252157 254060 255683
53117 255683 257682 260321 263162 265573 267442 269163 270886 272035 271736 269669 266345 262674 259413 256908
53103 256908 255084 253619 252251 250897 249413 247403 244542 241041 237567 234708 232687 231524 231143 231291 231599
53088 231599 231786 231611 230738 228981 226730 224743 223399 222465 221683 221152 220934 220706 220215 219737 219657 219791 219637 219214
53070 219214 219115 219672 220525 221202 221750 222511 223487 224281 224572 224361 223676 222331 220256 217990 216540 216491 217344 218023
53052 218023 218019 217821 218140 218982 219743 220020 220001 220092 220450 220997 221664 222418 223080 223241 222559 221223 220055 219917 220889
53033 220889 222201 223052 223306 223255 223011 222506 221950 221794 222151 222667 223062 223429 223846 224083 224040 224138 224841 225982 226967
53014 226967 227524 227747 227534 226605 225232 224374 224704 225872 227028 227768 228228 228647 229277 230414 231939 233043 232989
52997 232989 232048 231137 230630 230197 229739 229633 229926 230192 230528 231764 234042 236012 236396 235785 235898 237331 239091
52980 239091 240250 240997 241903 243008 244006 244640 244609 243703 242346 241502 241689 242512 243301 243671 243310 242033 240499
52963 240499 240119 241521 243565 244609 244392 243996 244223 244789 244976 244321 242652 240196 237817 236550 236629 237393 238256
52946 238256 239225 240296 240956 240761 240005 239319 238846 238301 237680 237362 237415 237288 236498 235296 234335 233783 233170 232173
52928 232173 231138 230581 230387 229919 228870 227638 226743 226179 225595 224926 224559 224922 226058 227547 228714 229005 228355
52911 228355 227230 226263 225819 225898 226297 226848 227509 228260 228825 228655 227515 226078 225514 226288 227703 228828 229528
52894 229528 230265 231220 232071 232535 232660 232609 232497 232391 232235 231844 231325 231370 232665 234969 237199 238583 239391 240430
52876 240430 242158 244484 247171 250118 253277 256434 259133 260904 261726 262116 262559 262910 262631 261528 259880
52861 259880 257876 255468 252878 250760 249445 248407 246861 244712 242492 240525 238591 236392 233931 231344
52847 231344 228704 226193 224218 223111 222791 222917 223318 224035 224925 225455 225130 224029 222660 221346 220098 219121
52831 219121 219027 220133 221777 222868 223123 223314 224162 225373 226039 225669 224539 223229 222207 221774 221991 222503 222688
52814 222688 222205 221372 220873 221103 221842 222581 223064 223456 223965 224458 224563 224060 223039 221686 220093 218349 216668
52797 216668 215318 214480 214182 214250 214285 213821 212708 211341 210363 210109 210331 210525 210483 210488 210943 211836 212691 213076 213014 212818
52777 212818 212649 212448 212272 212411 213078 214139 215220 215953 216058 215381 214035 212473 211233 210559 210303 210217 210334
52760 210334 211022 212598 214878 217175 218839 219740 220170 220402 220523 220614 220851 221376 222269 223640 225523 227606 229345
52743 229345 230492 231316 232154 232974 233567 233981 234435 234892 235081 235054 235393 236604 238380 239776 240191 240030 240209 241077
52725 241077 242066 242395 241846 240670 239040 237016 235008 233808 233892 234837 235616 235403 234160 232601 231612 231503 231735
52708 231735 231591 231059 230781 231102 231644 232039 232553 233538 234618 235010 234495 233458 232108 230400 228855 228634 230258
52691 230258 232752 234620 235403 235708 235977 235978 235562 235175 235234 235469 235331 234769 234147 233553 232686 231461 230304 229724
52673 229724 229830 230369 230954 231241 231184 231334 232486 234703 236902 237861 237553 237152 237707 239142 240578 241321 241423
52656 241423 241575 242589 244802 247746 250506 252419 253350 253345 252433 250891 249369 248397 247905 247486 246975 246477 245967
52639 245967 245295 244599 244323 244647 245162 245343 245178 245081 245278 245536 245581 245629 246328 248130 250688 252910 253762 253090 251717
52620 251717 250688 250456 250808 251367 251890 252082 251511 250001 248016 246310 245231 244638 244468 244973 246207 247663
52604 247663 248807 249719 250787 251885 252385 252084 251611 251695 252323 252937 253267 253561 254053 254521 254511 253867 252918 252155
52586 252155 251816 251836 252175 252990 254371 256028 257488 258574 259455 260214 260661 260650 260347 260001 259681 259386 259204 259160
52568 259160 259096 258962 259002 259329 259480 258847 257587 256641 256640 257088 256910 255620 253698 251983 251044 251127 252228 253940
52550 253940 255505 256413 256907 257599 258544 259048 258552 257379 256318 255726 255379 255133 255241 255930 257007 258114 259132
52533 259132 260124 260976 261315 260841 259753 258825 258906 260175 261928 263332 264262 265150 266100 266682 266710 266739 267518 269205
52515 269205 271429 273838 276273 278623 280871 283161 285535 287704 289360 290586 291673 292621 293140 293060 292415
52500 292415 291170 289202 286590 283659 280657 277616 274614 271931 269828 268295 267109 266073 265157 264456 264067
52485 264067 263975 264076 264281 264502 264610 264619 264904 265899 267509 269165 270573 272016 273697 275234 276244 276993 278005
52468 278005 279322 280729 282366 284412 286433 287904 289355 292037 296198 300503 303512 305028 305532 304992 302935
52453 302935 299334 294782 289944 285314 281302 278104 275563 273450 271712 270200 268511 266471 264530 263254
52439 263254 262692 262635 263175 264396 265700 266124 265333 263808 262099 260518 259546 259763 261063 262516 263417 264042 265040
52422 265040 266507 268122 269784 271557 273163 274162 274656 275339 276708 278609 280716 283099 286054 289567 293298
52407 293298 297100 301305 306372 312326 318546 324070 328009 329794 329228 326491 322114 316860 311549 306883
52393 306883 303277 300653 298464 296185 293941 292515 292447 293164 293300 292081 290223 289246 289940 291749 293637 295233
52377 295233 296928 299109 301637 304079 306143 307896 309748 312258 315722 319872 324157 328327 332386 335887
52363 335887 337811 337601 336068 334729 334322 334412 334403 334363 334595 334922 334819 334048 332823 331493 330389 329933 330531 332254
52345 332254 334748 337477 340061 342394 344627 347026 349769 352936 356696 361336 366994 373469 380468 387887
52331 387887 395635 403347 410611 417551 424914 433550 443920 455977 469196 482716 495866 508713 521774
52318 521774 535067 547790 559172 569358 579147 589099 599258 609595 620293 631551 643369 655514
52306 655514 667512 678771 689044 698749 708564 718714 728890 738718 747887 755879 762106 766507 769553
52293 769553 771385 771353 768806 764094 758358 752494 746674 740773 734860 729233 724245 720162 717038 714749 713286
52278 713286 712912 713843 715907 718787 722507 727328 733152 739389 745553 751737 758396 765816 773927 782404 790852
52263 790852 799032 806956 814697 822196 829505 837185 845997 856019 866380 876106 884991 893345 901200 908158
52249 908158 913833 918019 920388 920484 918093 913378 906543 897736 887438 876632 866257 856541 847057 837344
52235 837344 827259 816812 806016 795007 784155 773868 764322 755449 747158 739496 732624 726760 722126
52222 722126 718827 716668 715147 713721 712087 710196 708115 706084 704718 704866 706988 710681 714950 718981
52208 718981 722536 725662 728312 730420 732211 734158 736571 739350 742243 745243 748634 752603 756859 760715
52194 760715 763710 766215 769330 773999 780099 786454 791710 795207 797068 797729 797492 796425 794409 791242 786767
52179 786767 780990 774082 766374 758371 750692 743893 738338 734242 731693 730491 730050 729638 728852 727888 727457
52164 727457 728426 731284 735744 740866 745756 750050 753652 756309 757828 758587 759334 760341 761167 761405 761310 761440
52148 761440 762038 763051 764529 766598 769155 771833 774266 776213 777596 778684 780132 782493 785700 789284
52134 789284 793063 797374 802623 808948 816420 825335 836087 848765 863025 878370 894555 911711 930031
52121 930031 949399 969430 989849 1010580 1031320 1051258 1069504 1085740 1100320 1113773 1126290
52110 1126290 1137576 1147085 1154540 1160321 1165122 1169080 1171555 1172053 1171087 1169724 1168443 1166865 1164514 1161341
52096 1161341 1157493 1152872 1147036 1139336 1129354 1117464 1104717 1091701 1077783 1062163 1045639 1030469
52084 1030469 1018243 1008516 999876 991706 984391 978306 973344 969312 966321 964719 964870 966932 970616 975226
52070 975226 980149 985230 990751 997217 1005134 1014555 1024712 1034517 1043637 1052675 1062119 1071607 1080506 1088709
52056 1088709 1096404 1103552 1110146 1116561 1122901 1128232 1131159 1131098 1128407 1123402 1115957 1106131 1094471 1081500
52042 1081500 1067453 1052682 1037790 1023130 1008640 994441 981143 969207 958322 947800 937395
52031 937395 927420 918173 909514 901003 892408 884109 876915 871111 865776 859467 851768 843781 836830 831029
52017 831029 825440 819305 812689 806131 800100 794819 790194 785828 781246 776153 770382 763701 755887 746932
52003 746932 736968 726075 714453 702773 692026 682885 675335 668961 663380 658313 653444 648460 643172
51990 643172 637534 631540 625165 618347 610995 603082 594698 585937 576757 567103 557165 547268 537471 527586
51976 527586 517734 508581 500702 493990 488076 483203 480196 479611 481444 485631 492205 500689 509936 519029
51962 519029 527935 536852 545439 553308 560880 568916 577295 585164 592357 599874 608592 618209 627877 637323
51948 637323 646821 656290 664880 671285 674289 673398 669283 663385 656829 650045 643582 638616 636000 635169 634584
51933 634584 633124 630600 627198 623082 618432 613191 606738 598312 587828 575852 562860 549038 534848
51920 534848 521141 508454 496585 485087 473877 463304 453904 446179 440245 435641 431816 428875 427481
51907 427481 428028 430244 433534 437212 440465 442802 444735 447329 450726 453683 454934 454431 452783 450063 445834
51892 445834 439982 432866 424894 416613 409121 403692 400810 399965 400432 401877 404204 407230 410724 414591 418987
51877 418987 424317 430894 438302 445293 450773 454846 458442 461916 464542 465499 464863 463342 461505 459648 458093
51862 458093 457028 456087 454574 452323 450099 448934 449165 450180 450997 450964 450020 448529 446927 445318 443224 439833
51846 439833 434673 428094 421022 414253 408060 402380 397098 392097 387239 382498 378047 374107 370832 368395
51832 368395 367132 367415 369323 372395 375674 378078 378916 378189 376381 374015 371459 369012 366897 365116 363543
51817 363543 362219 361407 361330 362026 363448 365437 367565 369347 370736 372102 373607 374961 375935 376709 377367 377471
51801 377471 376664 375499 375099 375969 377576 379095 380183 380895 381224 381012 380156 378755 377096 375520 374243 373244
51785 373244 372303 370991 368759 365430 361846 359606 359635 361174 362636 363378 364145 365848 368583 372069 376433
51770 376433 382075 388979 396580 404219 411500 418286 424532 430060 434406 437073 438074 437989 437240 435472 431905
51755 431905 426261 419084 411219 403282 395649 388643 382476 377111 372365 368203 364867 362687 361747 361721 362063
51740 362063 362442 363026 364313 366608 369770 373528 377931 383233 389224 394977 399575 403011 405970 408717 410691
51725 410691 411497 411861 413078 415543 418244 419743 419387 417549 415100 412872 411354 410518 409899 408947 407398 405372
51709 405372 403155 400952 398814 396874 395576 395417 396285 397245 397307 396397 395319 394821 394944 395242 395252 394647 393296
51692 393296 391450 389721 388650 388317 388407 388514 388352 387837 387043 385944 384197 381450 377965 374674 372494 371713
51676 371713 372115 373353 375017 376615 377890 379162 381168 384544 389518 395919 403304 411131 418938 426327
51662 426327 432853 438154 442260 445438 447598 448198 446983 444591 442142 440467 439947 440740 442626 444817 446417
51647 446417 447019 446477 444289 439789 433007 424809 416078 407171 398246 389561 381225 373149 365538 359017 353933
51632 353933 349926 346543 343918 342404 341840 341686 341665 341727 341525 340545 338860 337227 336240 335723 335142 334278 333294
51615 333294 332334 331308 329975 328190 326164 324448 323448 322973 322545 322153 322315 323380 325227 327891 331905
51600 331905 337519 343965 350147 355993 362452 370137 378503 386532 393601 399321 403031 404120 402797 400057
51586 400057 396797 393325 389826 386939 385550 386063 388114 391053 394610 399097 405054 412775 422072 432380
51572 432380 443059 453699 464279 475070 486366 498266 510673 523448 536548 550051 564091
51561 564091 578777 594252 610901 629445 650549 674025 698425 721568 741649 757907 770407
51550 770407 779333 784453 785083 780494 770464 755546 736810 715386 692176 667787 642572 616853
51538 616853 591297 566991 544892 525285 507926 492545 478846 466176 453835 441915 431327
51527 431327 422743 415896 410173 405377 401431 397725 393505 388788 384319 380593 377511 374983 373263 372385
51513 372385 371815 371048 370253 369870 369784 369302 367960 366022 364184 363007 362696 363130 363954 364785 365536 366533 368174
51496 368174 370408 372641 374216 374917 374951 374527 373688 372511 371213 369950 368729 367623 366789 366030 364597 361859
51480 361859 358094 354256 350970 348127 345463 343047 340993 339061 336878 334372 331730 329067 326413 323959
51466 323959 322057 320911 320414 320322 320537 321187 322408 324083 325851 327493 329261 331677 335057 339405 344765
51451 344765 351318 358996 367204 375137 382310 388749 394806 400911 407290 413794 420031 425710 430647 434406
51437 434406 436237 435638 432883 428865 424533 420491 416831 413091 408642 403393 397951 392843 387830 382377
51423 382377 376567 371090 366417 362493 359270 357010 355894 355745 356351 357664 359372 360701 361062 360799 360876 361842
51407 361842 363427 365186 367199 369944 373592 377620 381174 383776 385645 387370 389376 391849 395001 399091
51393 399091 404081 409592 415400 421780 429111 437346 446225 455885 466924 479877 495010 512600 532913
51380 532913 555674 579991 605206 631580 659768 689699 720220 749564 775828 797227 812539
51369 812539 821503 824481 821750 813513 800476 783673 763522 739684 712332 683003 653619 625055
51357 625055 597332 570883 546662 524967 505055 486308 469160 454416 442047 431158 420892
51346 420892 410966 401519 392821 385144 378551 372757 367344 362100 357077 352432 348342 344972 342304 340017
51332 340017 337687 335182 332829 331226 330761 331219 331887 332227 332324 332459 332411 331709 330628 330265 331295 333090 334518
51315 334518 335281 336005 337253 339010 341035 343207 345449 347627 349536 350829 351170 350710 350192 350182 350400 350212
51299 350212 349525 348648 347548 345987 344274 343029 342124 340736 338734 337144 336802 337265 337710 338237 339478 341370
51283 341370 343238 344938 347112 350232 354042 358034 361861 365130 367332 368312 368479 368331 367999 367434 366797 366450
51267 366450 366675 367494 368625 369656 370435 371295 372619 374208 375386 375768 375576 375089 374149 372494 370314 368178
51251 368178 366526 365367 364282 362627 359956 356515 353117 350335 348002 345706 343446 341430 339522 337480
51237 337480 335628 334669 334700 334905 334484 333427 332185 330986 329924 329327 329496 330193 330843 331264 331823 332883 334425
51220 334425 336266 338265 340289 342340 344806 348132 352001 355215 356770 356858 356515 356568 357326 359036 361904 365586
51204 365586 369206 372157 374486 376249 377008 376465 375278 374595 374784 375110 374811 373997 373247 372731 372078 370943 369321
51187 369321 367383 365294 363212 361215 359204 357089 355076 353585 352863 352848 353357 354133 354693 354519 353608 352538
51171 352538 351796 351256 350643 350251 350761 352444 354946 357860 361023 364170 366817 368846 370854 373535 376822
51156 376822 379956 382295 383706 384296 384148 383432 382448 381349 379943 377898 375097 371781 368455 365650 363631
51141 363631 362230 361109 360217 359829 360039 360495 360852 361310 362219 363243 363370 362131 360468 359956 361208 363436
51125 363436 365574 367359 369129 371027 372903 374755 376742 378707 380139 380762 380855 380911 381238 382024 383451 385486
51109 385486 387746 389751 391213 392022 392237 392263 392736 393909 395347 396535 397581 399010 401041 403448 405972
51094 405972 408348 409977 410163 408919 407195 406045 405787 406122 406811 407935 409590 411505 413037 413615 413326 413014
51078 413014 413558 415057 416967 418965 421307 424280 427718 431338 435193 439560 444670 450836 458592 468278
51064 468278 479612 491977 505023 518731 533003 547448 561442 574107 584431 591888 596887 600243
51052 600243 602221 602581 601543 600072 598928 597903 596426 594588 593021 591892 590521 588069 584261 579329
51038 579329 573614 567528 561715 556889 553356 550743 548276 545249 541253 536109 529863 523022 516645 511949
51024 511949 509646 509602 511089 513305 515825 518774 522594 527437 532762 537679 541738 545118 548009 550185 551469
51009 551469 552207 552857 553216 552620 550886 548636 546578 544892 543397 541901 540196 538195 536390 535799 537011
50994 537011 539613 542915 546921 552061 558258 564971 572118 580202 589454 599498 610080 621531 634208
50981 634208 647954 662433 677434 692398 706149 717726 727330 736076 745135 755576 768623 785292
50969 785292 805762 829608 856572 886586 919162 953586 989781 1028290 1069100 1111050 1152788
50958 1152788 1193842 1234308 1273862 1311567 1346452 1377884 1405494 1429127 1448908 1465129 1478060
50947 1478060 1487973 1495212 1500115 1502985 1504250 1504437 1503798 1502111 1498979 1494170 1487510 1478698 1467580 1454504
50933 1454504 1440139 1424912 1408807 1391640 1373290 1353640 1332458 1309440 1284422 1257609 1229568
50922 1229568 1200786 1171235 1140602 1109053 1077516 1047104 1018471 991756 966693 942581 918629
50911 918629 894869 872471 852632 835311 819528 804708 791074 778763 767262 756113 745602
50900 745602 736345 728438 721434 715040 709424 704800 700967 697434 693967 690887 688757 687851 688049 689177 691100
50885 691100 693329 695001 695696 696145 697665 700900 705538 711130 717566 724620 731728 738763 746657 756661
50871 756661 768998 782610 796283 809760 823685 838697 854753 871417 888728 907629 929358
50860 929358 954447 982523 1013109 1046378 1083098 1124121 1170039 1221058 1277055 1337925 1404000
50849 1404000 1475798 1553190 1635169 1720707 1809484 1901338 1995251 2089454 2182442 2273289 2360877
50838 2360877 2443332 2518540 2584868 2641130 2686253 2719453 2740753 2751038 2751536 2743403 2727725 2705738
50826 2705738 2678952 2649189 2618520 2588980 2562133 2538797 2519081 2502568 2488341 2474895 2460228
50815 2460228 2442295 2419517 2390953 2355997 2314050 2264576 2207489 2143460 2073859 2000332 1924345
50804 1924345 1847039 1769534 1693249 1619689 1549895 1484296 1423237 1367439 1317703 1274276 1236750
50793 1236750 1204471 1176805 1153123 1132955 1116278 1103317 1093910 1087263 1082492 1079083 1076629 1074436
50781 1074436 1071842 1068834 1065983 1063722 1061924 1060162 1058016 1055061 1050876 1045337 1038711 1031243 1022828 1013272
50767 1013272 1002773 991868 980953 970059 959086 948063 937150 926633 917013 908868 902476 897660
50755 897660 894179 892259 892604 895862 902096 910702 920747 931494 942805 955188 969462 986279 1005894
50742 1005894 1028237 1053118 1080394 1110096 1142452 1177790 1216373 1258326 1303586 1351767 1402039
50731 1402039 1453326 1504700 1555545 1605315 1653317 1698934 1741981 1782596 1820699 1855702 1886765
50720 1886765 1913046 1933570 1947134 1952841 1950764 1941764 1926549 1905314 1878537 1847844 1815637 1783954
50708 1783954 1753928 1726204 1701368 1679887 1661999 1647786 1637010 1628819 1622011 1615786 1609782 1603076
50696 1603076 1593605 1579130 1558625 1532381 1501120 1465619 1427039 1386851 1346259 1306118 1267344
50685 1267344 1230784 1196616 1164650 1135513 1110847 1091897 1078465 1069715 1065368 1065424 1069265 1075953 1085231
50672 1085231 1097362 1112045 1128313 1145531 1163692 1182593 1201510 1219971 1238095 1255822 1272510
50661 1272510 1287854 1302616 1317884 1334071 1351147 1369311 1388717 1408888 1429185 1449672 1470822
50650 1470822 1492594 1514613 1537207 1561399 1587692 1615639 1644810 1675458 1707886 1741815 1776844
50639 1776844 1812967 1850124 1887669 1924781 1961032 1996054 2029017 2059063 2086180 2111145 2134716
50628 2134716 2157198 2178572 2198420 2215701 2229040 2237316 2239835 2236239 2226876 2213309 2198013 2183343
50616 2183343 2170871 2161439 2155335 2152358 2152071 2153920 2156838 2159001 2158621 2154946 2147856 2136491 2119048 2094145
50602 2094145 2061660 2021987 1975286 1922054 1863792 1802328 1738795 1673854 1608575 1544444 1482697
50591 1482697 1424232 1370008 1320748 1276233 1235548 1198168 1164310 1134093 1106958 1082271 1060140
50580 1060140 1041253 1025966 1013843 1004107 996460 991362 989385 990325 993268 997705 1004160 1013290 1024630
50567 1024630 1036874 1049350 1062643 1077655 1094569 1112920 1132195 1152080 1172479 1193581 1215670
50556 1215670 1238661 1262118 1285854 1310239 1335604 1361732 1388212 1414938 1441875 1468594 1494605
50545 1494605 1520088 1545856 1572616 1600735 1630828 1663990 1701152 1742476 1787821 1837673 1893118
50534 1893118 1954750 2021923 2093370 2168369 2246892 2328680 2412719 2498009 2584427 2672256 2760911
50523 2760911 2848701 2933879 3015354 3092026 3162007 3223065 3273726 3313464 3341883 3358159 3361413
50512 3361413 3351298 3328151 3292948 3247345 3193527 3133658 3069484 3002718 2935711 2871433 2812609
50501 2812609 2761055 2718002 2684769 2662623 2651825 2651159 2658603 2672265 2690425 2710916 2730928 2747520
50489 2747520 2758091 2760320 2751926 2730750 2695147 2644504 2579599 2502470 2415781 2322271 2224699 2125823
50477 2125823 2027843 1931928 1838788 1749733 1666689 1591010 1522716 1461094 1405644 1356160 1312342
50466 1312342 1273796 1240308 1211763 1187833 1167980 1151725 1138846 1129436 1123844 1122320 1124575 1129883
50454 1129883 1137714 1148021 1160810 1175777 1192545 1210859 1230300 1250275 1270705 1292390 1316155
50443 1316155 1341723 1367715 1392478 1414527 1432486 1445265 1452409 1454047 1450708 1443524 1434380 1425292
50431 1425292 1417607 1412002 1408929 1408478 1410051 1412945 1417308 1424002 1433513 1445533 1459640 1475796 1494119
50418 1494119 1514787 1538316 1565381 1596170 1630361 1667726 1708121 1750783 1794378 1837993 1881411
50407 1881411 1924128 1964939 2002886 2037849 2069567 2096777 2118142 2133441 2143027 2146501 2142854 2131629
50395 2131629 2113059 2087219 2054015 2014046 1968614 1918774 1865279 1809752 1755030 1703762 1657111
50384 1657111 1615254 1578651 1548311 1525049 1508936 1499359 1495300 1495709 1499839 1507196 1517055 1528089 1538475
50371 1538475 1546130 1548989 1545607 1535755 1520163 1499590 1474525 1445881 1415216 1383743 1351475 1317872
50359 1317872 1282940 1247096 1210293 1172116 1132766 1093212 1054295 1016373 980099 946856 917911
50348 917911 893497 873063 856074 842149 830824 821797 815316 811709 810544 810743 811644 813516 816776
50335 816776 821053 825351 828999 832164 835516 839606 844486 849715 854704 859228 863698 868847 875150 882508
50321 882508 890423 898375 906091 913635 921271 929120 936880 943983 950130 955702 961605 968749 977702 988744
50307 988744 1002069 1017811 1035986 1056576 1079717 1105658 1134441 1165817 1199751 1236945 1278475
50296 1278475 1324611 1373926 1423485 1469488 1507535 1532794 1540975 1529975 1500887 1457541 1405090
50285 1405090 1348692 1292612 1239677 1191254 1147864 1109927 1077909 1051880 1031243 1015094 1002783
50274 1002783 993983 988251 984760 982622 981467 981539 983131 986015 989444 992566 994736 995692 995703 995500 995681 996142
50258 996142 996373 996330 996621 997590 998625 998740 997575 995428 992552 988959 984827 980532 976155 971517 966886 963117
50242 963117 960787 959580 958816 958134 957067 954249 947812 936801 921882 904681 886735 869041 852095
50229 852095 836015 820743 806221 792308 778675 765159 752229 740693 730838 722162 714054 706335
50217 706335 698993 691915 685219 679406 674655 670245 665277 659877 655162 651989 650216 649274 648909 649069 649349
50202 649349 649017 647601 645317 642862 640830 639279 637838 636150 634027 631231 627494 623073 618936 615915
50188 615915 613779 611619 609122 606886 605403 604326 603048 601541 600203 599124 597945 596310 594219 592015
50174 592015 590257 589435 589568 590179 590836 591597 592763 594408 596444 599052 602782 608123 615105 623287 632184
50159 632184 641791 652694 665489 680157 696302 713937 733543 755219 778296 801961 825701 848822
50147 848822 870148 888850 905118 919481 931905 942314 951524 960572 969141 975658 979058 979530 977281
50134 977281 971713 962483 950605 937600 923896 908865 892219 874689 857333 840786 825363 811457
50122 811457 799478 789481 780926 772909 764752 756451 748455 741010 733931 727097 720765 715167 710073 705179
50108 705179 700777 697653 696232 696091 696357 696401 696003 695047 693294 690607 687320 684129 681439 678946 676120 673036
50092 673036 670373 668622 667702 667520 668475 670998 674791 678934 682708 686096 689472 693007 696423 699249 701326
50077 701326 703031 704884 706928 708707 709871 710564 711124 711687 712229 712665 712682 711820 710027 707881 705925 704019
50061 704019 701794 699506 697922 697380 697440 697553 697676 698114 699040 700385 702049 704145 707161 711764 718175 725728
50045 725728 733351 740600 747993 756285 765738 776253 787898 800901 815144 829948 844590 858999
50033 858999 873831 889778 906811 924161 940965 956729 971151 983811 994322 1002601 1008741 1012762
50021 1012762 1014782 1015287 1014812 1013240 1009714 1003340 993746 980886 964721 945376 923463 900010 876084
50008 876084 852590 830308 809838 791384 774692 759374 745381 733200 723489 716545 712197 710164
49996 710164 710247 711962 714304 716237 717376 717871 717665 716342 713855 710890 708049 704830 699867 692278 682564
49981 682564 672077 661871 652171 642783 633597 624638 615925 607654 600403 594788 590781 587594 584460 581282
49967 581282 578312 575418 572108 568309 564751 562337 561287 561044 560955 560942 561583 563590 567189 571976 577341 583002
49951 583002 589086 595806 603164 610897 618542 625599 631793 637232 642193 646714 650441 652887 653819 653473 652483
49936 652483 651434 650291 648271 644451 638548 631092 622944 614761 606838 599251 592110 585759 580666 577041
49922 577041 574670 573226 572555 572525 572801 573096 573550 574519 576072 577992 580236 582987 586242 589730 593417 597719
49906 597719 603039 609364 616516 624443 632952 641408 649127 656054 662699 669282 675253 679844 682893 684861
49892 684861 686060 686171 684695 681643 677475 672495 666736 660420 654088 648045 642028 635775 629605 624125
49878 624125 619557 615661 612068 608354 604090 599343 594945 591720 589572 587860 586511 586060 586656 587794 589240
49863 589240 591537 595282 600416 606476 613040 619621 625749 631581 637926 645222 652917 660216 666928 673071
49849 673071 678186 681812 684414 687039 690035 692696 694198 694340 693284 691046 687454 682391 675988 668765
49835 668765 661550 655096 649753 645518 642188 639246 636015 632346 629000 626903 626202 626459 627529 629572 632281
49820 632281 634878 637166 640007 644287 649782 655451 660624 665442 670217 674780 678651 681612 683899 685850
49806 685850 687501 688606 688950 688448 687014 684575 681310 677648 673940 670288 666685 662976 658518 652366 644190
49791 644190 634772 625216 615996 607211 599445 593647 590148 588351 587459 587041 586897 586959 587413 588393 589420 589764
49775 589764 589541 589862 591568 594372 597664 601544 606463 612275 618341 624435 630840 637539 643939 649529 654362
49760 654362 658680 662455 665554 667991 669663 670024 668404 664755 659822 654494 649119 643589 637995 632901
49746 632901 628890 626002 623873 622339 621622 621894 622904 624223 625662 627228 628785 630058 631067 632396 634843
49731 634843 638751 643731 649071 654344 659531 664578 669207 673448 678149 684512 692891 702387 711812 720831
49717 720831 729889 739276 748662 757457 765108 770853 773642 772833 768981 763550 757718 751686 745309 739094
49703 739094 734221 731624 731392 733040 735957 739404 742454 744338 744751 743588 740637 735966 730561 726071 723704
49688 723704 723557 725064 727782 731564 736328 742069 749047 757689 768178 780265 793575 808028 823891
49675 823891 841368 860122 879094 896666 910937 920233 923881 922681 918371 912482 905950 899784 895389
49662 895389 893721 894582 897343 901900 908007 913834 916311 913257 904529 891043 873740 854036 834212
49649 834212 816190 800223 785566 772162 760864 752155 745560 740404 736436 733558 731592 730544 730563
49636 730563 731340 731989 731783 730580 728302 724506 718948 712235 705366 698714 691949 684913 678074 671979 666624
49621 666624 661668 657074 653209 650331 648201 646364 644669 643368 642709 642587 642666 642803 643291 644639 647025 649879
49605 649879 652147 653225 653614 654337 655608 656433 655811 654036 652366 651538 651152 650572 649943 649964 650886 652132 652872
49588 652872 652784 652226 651830 652005 652806 654140 655922 657942 659698 660661 660810 660794 661461 663185 665668 668355 671088
49571 671088 674399 679035 685150 692106 699274 706822 715326 724639 733630 741213 747280 752388 756917 760871
49557 760871 764175 766574 767367 765815 761995 756904 751638 746824 742904 740359 739178 738500 737362 735788 734678
49542 734678 734721 735812 737564 739775 742262 744758 747391 750837 755614 761495 768078 775652 784912 795957
49528 795957 808243 821586 836553 853502 871781 890237 908177 925346 941208 954773 965142
49517 965142 971898 975060 975049 972840 969863 967539 966764 967693 969843 972554 975447 978377 980840 981728 979895
49502 979895 974770 966208 954193 939269 923086 907706 894112 881863 870361 859865 850917 843382
49490 843382 836710 830883 826433 823551 821782 820796 820960 822754 825842 829147 831839 833955 835957 837912 839389
49475 839389 840142 840670 841892 844305 847577 850930 853821 856293 858809 861799 865183 868279 870343 871382 872308
49460 872308 874107 876836 879598 881492 882402 882797 882985 882828 882154 881185 880371 879872 879383 878461 876963 875114 873267
49443 873267 871613 870111 868652 867325 866488 866581 867962 871010 876128 883303 891704 900171 908249 916461 925424
49428 925424 935093 945143 955670 967006 979097 991633 1004687 1018635 1033319 1047668 1060206 1069562
49416 1069562 1074533 1074373 1069439 1061269 1051754 1042434 1034572 1029322 1027302 1028280 1031727 1037510 1045735 1056084
49402 1056084 1067755 1080037 1092625 1105407 1118169 1130485 1141790 1151665 1160246 1168193 1176029 1183615
49390 1183615 1190391 1195870 1199595 1200911 1199301 1194952 1188615 1180891 1171964 1161970 1151221 1140009 1128605
49377 1128605 1117535 1107536 1099097 1092257 1086911 1083001 1080324 1078472 1077129 1076215 1075671 1075368 1075315 1075526 1075545 1074417
49361 1074417 1071466 1066853 1061080 1054215 1045979 1036495 1026523 1016924 1008166 1000342 993423 987360 982138 977845
49347 977845 974671 972819 972429 973512 975875 979121 982864 986965 991593 997097 1003737 1011411 1019577 1027534
49333 1027534 1034793 1041018 1045645 1047814 1046860 1042742 1035944 1027225 1017583 1008093 999388 991310 983285 974935
49319 974935 966153 956784 946661 935933 925038 914345 904052 894435 885888 878646 872692 867955 864399
49306 864399 861846 859999 858792 858479 859258 860892 862827 864655 866443 868713 871999 876185 880372 883682 886214
49291 886214 888820 891900 894816 896686 897250 896693 895086 892539 889580 886766 884048 881118 878315 876528 876097
49276 876097 876471 877186 878546 880885 883702 886141 887994 889585 890872 891411 891203 890885 890863 890819 890407 889930 889990
49259 889990 890840 892513 895267 899455 905167 912444 921658 933117 946273 959771 972311 983096 991475
49246 991475 996742 998544 997121 992956 986519 978565 970244 962552 955819 949956 945040 941416 939427 939232
49232 939232 940736 943559 947300 951946 957679 964123 970254 975372 979814 984287 988916 993455 998036 1002994
49218 1002994 1008192 1013180 1017969 1022903 1027866 1032348 1036369 1040537 1045028 1049317 1053204 1057397 1062599 1068680
49204 1068680 1075216 1082319 1090380 1099453 1109420 1120283 1131743 1142953 1153328 1163286 1173460 1183455 1192191
49191 1192191 1199349 1205703 1211996 1218215 1224139 1229877 1235619 1241371 1247276 1253802 1261333 1269898 1279569 1290821
49177 1290821 1304285 1320361 1339230 1360989 1385520 1412433 1441307 1471763 1503017 1533406 1560586
49166 1560586 1582302 1597126 1604745 1605795 1601506 1593516 1583858 1574613 1567113 1561446 1557005 1553433 1550750
49153 1550750 1548746 1546847 1544748 1542800 1541595 1541460 1542497 1544827 1548551 1553633 1559967 1567361 1575441 1583876
49139 1583876 1592861 1603027 1614711 1627498 1640724 1654168 1668088 1682744 1698105 1713929 1729964
49128 1729964 1746185 1762864 1780260 1798289 1816848 1836514 1858477 1883548 1911539 1941864 1974452
49117 1974452 2009805 2048575 2091573 2140072 2195640 2259662 2333238 2417475 2513660 2623034 2746121
49106 2746121 2881536 3025023 3170135 3310893 3444251 3569939 3687738 3794601 3883730 3946112
49096 3946112 3973795 3963270 3916827 3840973 3743312 3630284 3506532 3375203 3238650 3099585
49086 3099585 2961961 2830549 2709562 2601682 2508046 2428414 2361214 2304079 2254972 2212780
49076 2212780 2176846 2146269 2119871 2096570 2075513 2056074 2037904 2020920 2005181 1990954 1978850
49065 1978850 1969447 1962490 1956828 1951504 1946697 1943272 1941627 1941450 1942480 1944957 1949094 1954513 1960539 1966916
49051 1966916 1973904 1981641 1989638 1997021 2003156 2007878 2011160 2012797 2012588 2010797 2008262 2006006 2004771 2004915
49037 2004915 2006550 2009631 2013944 2019106 2024663 2030210 2035495 2040511 2045477 2050624 2055892 2060895 2065239 2068812
49023 2068812 2071643 2073561 2074338 2074266 2074302 2075326 2077425 2080211 2083656 2088148 2093754 2099956 2106310 2112945 2120121
49008 2120121 2127676 2135191 2142457 2149508 2156404 2163209 2170010 2176721 2183127 2189274 2195455 2201559 2206861 2210821
48994 2210821 2213687 2215846 2217088 2217142 2216552 2216155 2215877 2214912 2213107 2211260 2209901 2208648 2207060 2205353 2203807
48979 2203807 2202128 2200018 2197885 2196408 2195668 2195149 2194347 2192957 2190820 2188117 2185396 2183001 2180645 2177973 2175310
48964 2175310 2173421 2172665 2172850 2173832 2175823 2179132 2183962 2190465 2198680 2208322 2218903 2230136 2242161 2255498
48950 2255498 2270886 2288890 2309313 2331112 2353273 2375779 2399400 2424543 2450590 2476481 2501776
48939 2501776 2527117 2553775 2582727 2613983 2646810 2680633 2715577 2752042 2790036 2829289 2869826
48928 2869826 2911979 2955778 3000686 3046035 3091526 3137222 3183243 3229453 3275305 3320086 3363617
48917 3363617 3406659 3450262 3494576 3538520 3580624 3619997 3656571 3690847 3723611 3755503 3786554
48906 3786554 3816266 3844304 3870862 3896205 3920079 3941899 3961292 3978194 3992564 4004482 4014524
48895 4014524 4023629 4032357 4040444 4047200 4052148 4055130 4055996 4054524 4050624 4044343 4035621 4024185 4009802 3992560
48881 3992560 3972818 3950973 3927285 3901808 3874317 3844415 3811832 3776710 3739526 3700715 3660332
48870 3660332 3617998 3573241 3526168 3477884 3430009 3383501 3338095 3293095 3248598 3205612 3165041
48859 3165041 3126928 3090761 3056256 3023663 2993490 2966002 2940963 2917879 2896605 2877497 2860802
48848 2860802 2846183 2833253 2822312 2813960 2808024 2803619 2800418 2799126 2800383 2803845 2808833 2815337 2823776
48835 2823776 2834198 2846346 2860218 2875865 2892764 2910007 2927143 2944405 2962171 2980594 2999650
48824 2999650 3019111 3038541 3057762 3077211 3097356 3117855 3137864 3157105 3176076 3195230 3214525
48813 3214525 3233847 3253189 3272271 3290660 3308577 3326990 3346474 3366506 3386330 3406060 3426365
48802 3426365 3447389 3468674 3490050 3511889 3534357 3556892 3578734 3599665 3619909 3639408 3657492
48791 3657492 3673355 3686668 3697629 3706577 3713844 3719953 3725464 3730286 3733393 3733697 3731086 3726107 3718696
48778 3718696 3707839 3692700 3673488 3650849 3624874 3595321 3562492 3527257 3490155 3451041 3409774
48767 3409774 3366876 3323215 3279306 3235188 3190864 3146610 3102849 3059938 3018134 2977635 2938548
48756 2938548 2900900 2864823 2830644 2798691 2768993 2741295 2715350 2691023 2668133 2646446 2625973
48745 2625973 2607039 2589889 2574371 2560225 2547515 2536560 2527554 2520472 2515208 2511513 2508928 2507047
48733 2507047 2505732 2504812 2503741 2502013 2499841 2498023 2497120 2497143 2498012 2499831 2502616 2506200 2510569 2515878 2521950
48718 2521950 2528104 2533662 2538373 2542222 2545281 2547936 2550832 2554260 2557876 2561225 2564224 2566894 2569038 2570521
48704 2570521 2571625 2572778 2574267 2576431 2579718 2584094 2588814 2593383 2598430 2604992 2613055 2621530 2629653 2637724
48690 2637724 2646323 2655456 2664847 2674581 2685031 2696373 2708594 2721881 2736718 2753535 2772390 2793040
48678 2793040 2815397 2839888 2867235 2897732 2930979 2966643 3005277 3047823 3094160 3142553 3190627
$$ [...]
##END NTUPLES=NMR SPECTRUM
##END=
