##TITLE=AC1622_CTIAH13353_8326114_Co7wGyJ9ZX
##JCAMPDX= 6.0         $$ Bruker NMR JCAMP-DX V2.0
##DATA TYPE= NMR SPECTRUM
##DATA CLASS= NTUPLES
##ORIGIN= BRUKER
##OWNER= Administrator
$$ 1.72 TOPSPIN		Version 2.1
$$ 2013-11-14 00:15:02.983 -0800  Administrator@X
$$ Compression mode = diff/dup
##.OBSERVE FREQUENCY= 400.02188249412
##.OBSERVE NUCLEUS= ^1H
##.ACQUISITION MODE= SIMULTANEOUS (DQD)
##.ACQUISITION SCHEME= undefined
##.AVERAGES= 8
##.DIGITISER RES= 22
##SPECTROMETER/DATA SYSTEM= spect
##.PULSE SEQUENCE= zg30
##.SOLVENT NAME= COFFEE_meoh
##.SHIFT REFERENCE= INTERNAL, COFFEE_meoh, 1, 14.98509
##AUDIT TRAIL= $$ (NUMBER, WHEN, WHO, WHERE, PROCESS, VERSION, WHAT)
$$ ##TITLE= Audit trail, TOPSPIN		Version 2.1
$$ ##JCAMPDX= 5.01
$$ ##ORIGIN= Bruker BioSpin GmbH
$$ ##OWNER= Administrator
$$ $$ E:\/data/COFFEE/nmr/AC1622_CTIAH13353_8326114_Co7wGyJ9ZX/10/pdata/1/auditp.txt
$$ ##AUDIT TRAIL=  $$ (NUMBER, WHEN, WHO, WHERE, PROCESS, VERSION, WHAT)
(   1,<2013-11-14 00:14:55.546 -0800>,<Administrator>,<X>,<go>,<TOPSPIN 2.1>,
      <created by zg
	started at 2013-11-14 00:13:49.843 -0800,
	POWCHK enabled, PULCHK disabled,
       configuration hash MD5:
       C8 4E 4E 5D D3 5C D8 9E 9F 52 82 E0 59 8A DE 15
       data hash MD5: 64K
       DC F4 64 4C A2 6D 57 1C 9C B1 18 35 02 B5 C2 BE>)
(   2,<2013-11-14 00:14:58.765 -0800>,<Administrator>,<X>,<proc1d>,<TOPSPIN 2.1>,
      <Start of raw data processing
       efp LB = 0 FT_mod = 6 PKNL = 1 PHC0 = 0 PHC1 = 0 SI = 32K 
       data hash MD5: 32K
       2B DD E5 3F 4D 8E 55 5F 57 A7 10 71 8A 44 9E 7B>)
(   3,<2013-11-14 00:14:59.124 -0800>,<Administrator>,<X>,<proc1d>,<TOPSPIN 2.1>,
      <pk PHC0 = 91.19202 PHC1 = 0 
       data hash MD5: 32K
       2E 6A F8 CC 2A 5A EA A8 14 60 5F 75 6E C5 23 20>)
(   4,<2013-11-14 00:14:59.343 -0800>,<Administrator>,<X>,<proc1d>,<TOPSPIN 2.1>,
      <abs ABSG = 1 
       data hash MD5: 32K
       63 34 CF 48 D8 77 98 F2 F4 06 87 FD A4 A0 1C 14>)
(   5,<2013-11-14 00:14:59.530 -0800>,<Administrator>,<X>,<proc1d>,<TOPSPIN 2.1>,
      <abs ABSG = 2 
       data hash MD5: 32K
       A3 C9 C4 D6 08 62 B3 BE 69 82 97 E1 82 9F 10 1F>)
(   6,<2013-11-14 00:14:59.671 -0800>,<Administrator>,<X>,<proc1d>,<TOPSPIN 2.1>,
      <abs ABSG = 3 
       data hash MD5: 32K
       E7 3F 07 8F F6 E3 03 C5 D9 9E CE AF 30 E6 2A 72>)
(   7,<2013-11-14 00:14:59.765 -0800>,<Administrator>,<X>,<proc1d>,<TOPSPIN 2.1>,
      <abs ABSG = 4 
       data hash MD5: 32K
       A5 8B C8 31 8D 16 1C 62 B3 83 E1 26 64 10 6D 73>)
(   8,<2013-11-14 00:14:59.858 -0800>,<Administrator>,<X>,<proc1d>,<TOPSPIN 2.1>,
      <abs ABSG = 5 
       data hash MD5: 32K
       6F 01 42 40 EB EA 4A C1 E6 59 F1 EC AB F2 58 75>)
$$ ##END=
$$ 
$$ $$ hash MD5
$$ $$ 6A CC D4 05 BF 10 0E DC F3 E9 E1 65 04 75 B0 F0
##$RELAX= 
##$RELAX= 
##$RELAX= 
##$RELAX= 
##$RELAX= 
##$RELAX= 
##$RELAX= 
$$ Bruker specific parameters
$$ --------------------------
##$DU= <E:\>
##$EXPNO= 10
##$NAME= <AC1622_CTIAH13353_8326114_Co7wGyJ9ZX>
$$ [...]
150 150 150 150 150 150 150 150
##$TP07= 0
##$TPNAME0= <>
##$TPNAME1= <>
##$TPNAME2= <>
##$TPNAME3= <>
##$TPNAME4= <>
##$TPNAME5= <>
##$TPNAME6= <>
##$TPNAME7= <>
##$TPOAL= (0..7)
0.5 0.5 0.5 0.5 0.5 0.5 0.5 0.5
##$TPOFFS= (0..7)
0 0 0 0 0 0 0 0
##$TUNHIN= 0
##$TUNHOUT= 0
##$TUNXOUT= 0
##$USERA1= <user>
##$USERA2= <user>
##$USERA3= <user>
##$USERA4= <user>
##$USERA5= <user>
##$V9= 5
##$VALIST= <valist>
##$VCLIST= <CCCCCCCCCCCCCCC>
##$VD= 0
##$VDLIST= <DDDDDDDDDDDDDDD>
##$VPLIST= <PPPPPPPPPPPPPPP>
##$VTLIST= <TTTTTTTTTTTTTTT>
##$WBST= 1024
##$WBSW= 4
##$XGAIN= (0..3)
0 0 0 0
##$XL= 0
##$YL= 0
##$YMAX_a= 553674
##$YMIN_a= -478468
##$ZGOPTNS= <>
##$ZL1= 120
##$ZL2= 120
##$ZL3= 120
##$ZL4= 120
##$ABSF1= 14.98509
##$ABSF2= -5.573092
##$ABSG= 5
##$ABSL= 3
##$ALPHA= 0
##$AQORDER= 0
##$ASSFAC= 0
##$ASSFACI= 0
##$ASSFACX= 0
##$ASSWID= 0
##$AUNMP= <proc_prof1d_extract_pilot.lims>
##$AXLEFT= 0
##$AXNAME= <>
##$AXNUC= <1H>
##$AXRIGHT= 0
##$AXTYPE= 0
##$AXUNIT= <>
##$AZFE= 0.1
##$AZFW= 0.1
##$BCFW= 0
##$BC_mod= 0
##$BYTORDP= 0
##$COROFFS= 0
##$CY= 15
##$DATMOD= 1
##$DC= 0
##$DFILT= <>
##$DTYPP= 0
##$F1P= 0
##$F2P= 0
##$FCOR= 0.5
##$FTSIZE= 32768
##$FT_mod= 6
##$GAMMA= 0
##$GB= 0
##$INTBC= 1
##$INTSCL= 1
##$ISEN= 128
##$LB= 0
##$LEV0= 0
##$LPBIN= 0
##$MAXI= 10000
##$MC2= 0
##$MEAN= 0
##$ME_mod= 0
##$MI= 0
##$NCOEF= 0
##$NC_proc= -8
##$NLEV= 6
##$NOISF1= 0
##$NOISF2= 0
##$NSP= 0
##$NTH_PI= 0
##$NZP= 0
##$OFFSET= 14.98509
##$PC= 1
##$PHC0= 91.19202
##$PHC1= 0
##$PH_mod= 1
##$PKNL= yes
##$PPARMOD= 0
##$PPDIAG= 0
##$PPIPTYP= 0
##$PPMPNUM= 2147483647
##$PPRESOL= 1
##$PSCAL= 4
##$PSIGN= 0
##$PYNMP= <proc.py>
##$REVERSE= no
##$SF= 400.02
##$SI= 32768
##$SIGF1= 0
##$SIGF2= 0
##$SINO= 400
##$SIOLD= 32768
##$SPECTYP= <>
##$SREGLST= <1H.CDCl3>
##$SSB= 0
##$STSI= 32768
##$STSR= 0
##$SW_p= 8223.68421052631
##$SYMM= 0
##$S_DEV= 0
##$TDeff= 65536
##$TDoff= 0
##$TI= <>
##$TILT= no
##$TM1= 0
##$TM2= 0
##$TOPLEV= 0
##$USERP1= <user>
##$USERP2= <user>
##$USERP3= <user>
##$USERP4= <user>
##$USERP5= <user>
##$WDW= 1
##$XDIM= 32768
##$YMAX_p= 437582148
##$YMIN_p= -677057
##$CURPLOT= <Network HP LaserJet P1505>
##$CURPRIN= <$Network HP LaserJet P1505>
##$DFORMAT= <normdp>
##$LAYOUT= <+/1D_H.xwp>
##$LFORMAT= <normlp>
##$PFORMAT= <normpl>
##$SURQMSG= 1
$$ End of Bruker specific parameters
$$ ---------------------------------
##NTUPLES= NMR SPECTRUM
##VAR_NAME=  FREQUENCY,     SPECTRUM/REAL,   SPECTRUM/IMAG
##SYMBOL=    X,             R,               I
##VAR_TYPE=  INDEPENDENT,   DEPENDENT,       DEPENDENT
##VAR_FORM=  AFFN,          ASDF,            ASDF
##VAR_DIM=   32768,         32768,           32768
##UNITS=     HZ,            ARBITRARY UNITS, ARBITRARY UNITS
##FACTOR=    0.250966925370066, 1,           1
##FIRST=     8223.43324360094, -65564,       -251115
##LAST=      0,             4251,            -285961
##MIN=       0,             -677057,         0
##MAX=       8223.43324360094, 437582148,    0
$$ Real data points
##PAGE= N=1
##DATA TABLE= (X++(R..R)), XYDATA
$$ [...]
19573d6786D9398d608A12605b21133A90668i8650M7947j22067p3062D6672A791
$$ -46786 49398 -4608 112605 -221133 190668 -98650 -50703 -172770 -245832 46672 1791
19561b16853k13385K10773F9809B8808a39648F4087g6532Q227J7342o0080j65840
$$ -216853 -430238 -219465 69809 28808 -139648 64087 -76532 -68305 -50963 -111043 -276883
19550b76883O2361R0042c4560k14534f3412k30207A60522a38287N943r8297B48956
$$ -276883 -214522 -124480 -34560 -249094 -63412 -293619 160522 -138287 -132344 -230641 248956
19538A45356b17113M7170J9897h171F8009b18377B36301e0786r1347F0133F975
$$ 145356 -217113 -169943 -150046 -8171 68009 -218377 236301 -50786 -142133 60133 6975
19526D21990a59765D6074D284a32170j48553B41184J54329H7733N0277h9831d3031
$$ 421990 -159765 46074 4284 -132170 -280723 241184 395513 87733 138010 -89831 -43031
19514c43660J09420B26224A743a63211M8771b7441J1537j70539A24066h9868k25609
$$ -343660 -234240 226224 1743 -163211 -114440 -27441 -15904 -186443 124066 -89868 -315477
19503c15477H2732a12892p8966A253K55942a25285I7021h0188K2490n4176B29985
$$ -315477 82732 -112892 -191858 1253 257195 -125285 97021 -80188 -57698 -111874 229985
19491A14746Q9525g1754B22115B1239a66140j50725H9502a77421A52960f9804
$$ 114746 204271 -71754 222115 21239 -166140 -316865 89502 -177421 152960 -69804
19480C36159e4412l4031H9609a95332e3269C894b44746E6263a41965A45030i1466
$$ 336159 -54412 -88443 89609 -195332 -53269 3894 -244746 56263 -141965 145030 -91466
19468c10645O9860j29160A8218K33688g1992K5815j89065a14m63225K12956C04339
$$ -310645 -240785 -369945 18218 251906 -71992 -46177 -235242 -114 -463339 -250383 304339
19456g7505q7637j29777A05242a44473r6947D3900L86609D311h9934n8213B9109
$$ -77505 -165142 -294919 105242 -144473 -241420 43900 430509 4311 -89934 -148147 29109
19444f8424k16073l4598D342L65732c51580d8463E0034K1928a82296k1741b9138
$$ -68424 -284497 -319095 4342 370074 -351580 -48463 50034 71962 -182296 -204037 -29138
19432c68087B32144I1315K27974a31457A25074J67487A2990a76767A29555c92048
$$ -368087 232144 91315 319289 -131457 125074 292561 12990 -176767 129555 -392048
19421b97196D2577A7912a26562B8936c0989A12117e9534g084p0835A84414a52643
$$ -297196 42577 17912 -126562 28936 -30989 112117 -59534 -7084 -77919 184414 -152643
19409B27866c19446j72714e7135k70084a13245j61556G0362k9652J05509h1075
$$ 227866 -319446 -492160 -57135 -327219 -113245 -274801 70362 40710 146219 -81075
19398i0557G1095a53076J7970p3373B24116j01669J40135B3909Q6642b71240P8910
$$ -90557 71095 -153076 -135106 -208479 224116 122447 262582 23909 110551 -271240 -192330
19387a92330g2472p9071J5083k31350a54100k10465a14912C98762a62330q6584
$$ -192330 -72472 -151543 -136460 -367810 -154100 -364565 -114912 398762 -162330 -248914
19377b48914q3786J48414D3132b26799e228A07055c45961a0313D0484K2489K407
$$ -248914 -332700 -184286 43132 -226799 -5228 107055 -345961 -10313 40484 62973 65380
19366F5380h6754e646A62329b95270I4885b17570f6822k9741l9381j32678e3261
$$ 65380 -86754 -5646 162329 -295270 94885 -217570 -66822 -96563 -135944 -268622 -53261
19354A22450e9881f85j47832d3341D3099a49241k448j0698m149B47034b25822
$$ 122450 -59881 -685 -148517 -43341 43099 -149241 -151689 -162387 -166536 247034 -225822
19342A2296a0931A17381K30939D1060N191b55664f6920A36031D2796a86893f2963
$$ 12296 -10931 117381 348320 41060 46251 -255664 -66920 136031 42796 -186893 -62963
19330a79961d3748j03461P2223A7921c73690J85296n694A61134B4566b09974B73048
$$ -179961 -43748 -147209 -74986 17921 -373690 -188394 -194088 161134 24566 -209974 273048
19318C0389a23820k214Q093F6157O4340l4071J2970g3276m1045j92580a12196
$$ 30389 -123820 -126034 -117941 66157 130497 96426 109396 -73276 -114321 -306901 -112196
19306A72578E4859a4982j21713N4937k61917h5129k24988g3700G6541d1133A3285
$$ 172578 54859 -14982 -136695 -81758 -343675 -85129 -310117 -73700 76541 -41133 13285
19294d4398B38149h0954j36936b4376p5663j12208C25573a32813j01168l6669
$$ -44398 238149 -80954 -217890 -24376 -100039 -212247 325573 -132813 -233981 -270650
19284b70650d1856j71683d9387a2942M191j73222F6718M2920f8944E5443a59796
$$ -270650 -41856 -213539 -49387 -12942 -8751 -181973 66718 109638 -68944 55443 -159796
19272a00739n81A36319F2352a32828A32037b58252H5253a01052j48514H9225a27918
$$ -100739 -101320 136319 62352 -132828 132037 -258252 85253 -101052 -249566 89225 -127918
19260c5956a2122p2746C7392K0294i8855o0523r6405M5102J05060A02899k6570
$$ -35956 -12122 -84868 37392 57686 -98855 -159378 -255783 -210681 -105621 102899 76329
19249G6329J00151g4392k1810B44586b26779b0433F3116a36570A92381p7898a87850
$$ 76329 176480 -74392 -96202 244586 -226779 -20433 63116 -136570 192381 114483 -187850
19237b37658B11483d4853j2902l5975K434C9288b01165H6347g7104k05424i8700
$$ -237658 211483 -44853 -57755 -93730 -91296 39288 -201165 86347 -77104 -282528 -98700
19225I1881C2909d1989j52256A1011g9627J28o1861d2j46895A72139J33454o676
$$ 91881 32909 -41989 -194245 11011 -79627 -79499 -141360 -42 -146937 172139 305593 298917
19213B98917H0490b6517l1505A13196J3627R440a16750c4474k64225Q0948B5426
$$ 298917 80490 -26517 -58022 113196 126823 136263 -116750 -34474 -298699 -217751 25426
19201C2639a8067A18379i1424j2877a8440j0224A15651j1491c6274C87704b7881
$$ 32639 -18067 118379 -91424 -104301 -18440 -28664 115651 104160 -36274 387704 -27881
19189c22606J54106B7346b56886D0007d0322n8146l19006a24500J3134B9712a09649
$$ -322606 -168500 27346 -256886 40007 -40322 -98468 -417474 -124500 -111366 29712 -109649
19177d5602j67881d0258B53921f9996B2614Q785J52517p7471J13452c52901k4785
$$ -45602 -213483 -40258 253921 -69996 22614 31399 183916 106445 219897 -352901 -377686
19166c77686A22426i7785j5604Q946J1842m533n5849m58j36229C3193N5024c62287
$$ -377686 122426 -97785 -113389 -104443 -92601 -97134 -152983 -153441 -289670 33193 88217 -362287
19153a56398E835a72906G4886a54481A76452a76709N9033j43182d1831A97852
$$ -156398 5835 -172906 74886 -154481 176452 -176709 -117676 -260858 -41831 197852
19142f0344A28412n2214J07154c92697e851G5752h0525a841l50222J37040j44443
$$ -60344 128412 76198 183352 -392697 -5851 75752 -80525 -1841 -352063 -215023 -359466
19131c59466B09773b14447B30210G9693L574d88051B12191a69487O4528D2080
$$ -359466 209773 -214447 230210 79693 83267 -488051 212191 -169487 -104959 42080
19120A66127l2028a46973C7560J70639b45621J14660m1716J873A19638f1759A72699
$$ 166127 134099 -146973 37560 208199 -245621 -130961 -172677 -170804 119638 -61759 172699
19108i9476j08416j79996a89458H6007c11830i9793A69175C6150b87758I4655
$$ -99476 -207892 -387888 -189458 86007 -311830 -99793 169175 36150 -287758 94655
19097a53737k12442A25099b48585k03993J77383o0923A37397d8172j24477e7278
$$ -153737 -366179 125099 -248585 -452578 -275195 -336118 137397 -48172 -172649 -57278
19086a35789A49526J1930c61140f2815H2489b37919a8202j36615H99Q5007l6771
$$ -135789 149526 161456 -361140 -62815 82489 -237919 -18202 -154817 899 85906 49135
19075D9135J63435a5136E0690N4854b99514j0665J03343G260i3254C6874M21071
$$ 49135 212570 -15136 50690 105544 -299514 -310179 -206836 7260 -93254 36874 457945
19064D57945B8030c54960a05034k2824o116k42145b6010g101A00590A6321P6541
$$ 457945 28030 -354960 -105034 -127858 -133974 -376119 -26010 -7101 100590 16321 92862
19053I2862J0210A1654J559a12640A01942d8070a8680n7779J8372j68695C0395
$$ 92862 103072 11654 13213 -112640 101942 -48070 -18680 -76459 -58087 -226782 30395
19041f3656A64699E6016P4973a13289G9720g3202B47070d8852A06963R8172k3599
$$ -63656 164699 56016 130989 -113289 79720 -73202 247070 -48852 106963 205135 181536
19030A81536l6117j5977c3395k98814g8435K5340r0613H5348P6538K50306a00965
$$ 181536 145419 129442 -33395 -332209 -78435 -53095 -143708 85348 161886 412192 -100965
19018E290b36235e8951q7367H0356J01379n4454d4966K1370l26573R8433E0052
$$ 5290 -236235 -58951 -146318 80356 181735 127281 -44966 -23596 -350169 -251736 50052
19006I026a21773b0782j65534d0608D3642a48621l1795j16195C3513K46201F2359
$$ 9026 -121773 -20782 -186316 -40608 43642 -148621 -180416 -296611 33513 279714 62359
18994b10522B85504b14796D67729F5598h0517c5087A24407Q778D6991P2866a90381
$$ -210522 285504 -214796 467729 65598 -80517 -35087 124407 133185 46991 119857 -190381
18982F3337a43172C5517h5210B57157b4720l11513e5589A68244b36321J11512
$$ 63337 -143172 35517 -85210 257157 -24720 -336233 -55589 168244 -236321 -124809
18972a24809r0753K3542A34053A7505k590J76572I5314K6077g1445k65642c9737
$$ -124809 -215562 -192020 134053 17505 14915 191487 95314 121391 -71445 -337087 -39737
18960C7755K84020j32536b25654j51775C05146f8123k0116D7279a44067M6593
$$ 37755 321775 189239 -225654 -377429 305146 -68123 -88239 47279 -144067 -97474
18950i7474F9462j7622a1347A42633a27579A90760a26659D774g6075k87373J80988
$$ -97474 69462 51840 -11347 142633 -127579 190760 -126659 4774 -76075 -363448 -182460
18939a82460H2644a95399A45100a74440A33213K3841A3930a91367p046c4354A57296
$$ -182460 82644 -195399 145100 -174440 133213 157054 13930 -191367 -198413 -34354 157296
18927B28331M8110b80100J3336f358B6130Q2592Q1457b83461A48121P7485h7297
$$ 228331 276441 -280100 -266764 -6358 26130 108722 190179 -283461 148121 225606 -87297
18915g8987f42m02279h4213a7217l70848J65097D0216J41124g3798D4945c2418
$$ -78987 -642 -402921 -84213 -17217 -388065 -222968 40216 181340 -73798 44945 -32418
18903a9772A58122J27114a73532B71336d08404a99185A35723a32681j40622A60963
$$ -19772 158122 285236 -173532 271336 -408404 -199185 135723 -132681 -273303 160963
18892G5261K9210b14850k79156b14969B45073f6761B44514H8967f538j17252n553
$$ 75261 104471 -214850 -494006 -214969 245073 -66761 244514 88967 -6538 -123790 -129343
18881a29343A9641a42799B2375d5976l53528A5643P7268c08955a8008k29712O3128
$$ -129343 19641 -142799 22375 -45976 -399504 15643 92911 -308955 -18008 -247720 -184592
18870a84592A23822b02941G9615a95993A45381C6158j0318J97137C5930a10410
$$ -184592 123822 -202941 79615 -195993 145381 36158 25840 222977 35930 -110410
18859A5212Q7643K348e2327K1567k16328j3560P0959f4132B93426a3577A579Q6478
$$ 15212 102855 105203 -52327 -30760 -247088 -260648 -189689 -64132 293426 -13577 1579 88057
18847H8057a68255e7457A26599J9480i5297k1571m0876N7797n4670C25556b52055
$$ 88057 -168255 -57457 126599 146079 -95297 -116868 -157744 -99947 -154617 325556 -252055
18835A45907Q1684b6451j62319A853R2069d4867F8845g2214K1271B44303b0576
$$ 145907 227591 -26451 -188770 1853 93922 -44867 68845 -72214 -50943 244303 -20576
18823b11879A89822B8600K8034J79672f635B56943A0233b07116C04817A5715a97209
$$ -211879 189822 28600 56634 236306 -6635 256943 10233 -207116 304817 15715 -197209
18811A32703k6061a58973A23732a16961A44638F0058c31766j2748A77305b11854
$$ 132703 106642 -158973 123732 -116961 144638 60058 -331766 -344514 177305 -211854
18800b3249k70690A77719c65496C1513J89808H4952N1154l8077a6952k09175g868
$$ -23249 -293939 177719 -365496 31513 221321 84952 136106 98029 -16952 -226127 -7868
18788h4621A16982J6405d2959k03924c2065l10499a26694A99474b10420j42928
$$ -84621 116982 133387 -42959 -246883 -32065 -342564 -126694 199474 -210420 -353348
18778c53348a39352n4059l669G2112J43422A0456b81651D666i4723g268j80659
$$ -353348 -139352 -193411 -197080 72112 215534 10456 -281651 4666 -94723 -7268 -187927
18767a87927B19651a68752o1917K2265a03303j64772G2839J86465b30135E3219
$$ -187927 219651 -168752 -230669 -208404 -103303 -268075 72839 259304 -230135 53219
18756f957A11523j3669b22413B3138J5936c4018H1006J16923h679B55813b29123
$$ -6957 111523 97854 -222413 23138 39074 -34018 81006 197929 -8679 255813 -229123
18744B20584G4038J26907a87969f1771A54984n6921a76046K6100e5502p8247H122
$$ 220584 74038 200945 -187969 -61771 154984 98063 -176046 -149946 -55502 -133749 8122
18732a29967C9937d7083j22843g9024m8158B54502f8735j49654B25703g9073G181
$$ -129967 39937 -47083 -169926 -79024 -127182 254502 -68735 -218389 225703 -79073 7181
18720a05805j07062b3454o8031K2247B46348A08223m8204F911d6124A9612J34550
$$ -105805 -212867 -23454 -91485 -69238 246348 108223 60019 6911 -46124 19612 154162
18709A54162a04764M0669G2447a18907L5866A87290J8426F7145J24641a48234
$$ 154162 -104764 -64095 72447 -118907 -83041 187290 205716 67145 191786 -148234
18698e5190l5131n6990G1806h1290j89345A95346b55581D4155J78262E0881g1386
$$ -55190 -90321 -147311 71806 -81290 -270635 195346 -255581 44155 222417 50881 -71386
18686a91133E2699J09941J46681c74562G2024b10322A31374a91946A61111d0702
$$ -191133 52699 162640 309321 -374562 72024 -210322 131374 -191946 161111 -40702
18675a35438D9955a4863l75629h1232a8331j63908L6750j15603F4723c2810A1585
$$ -135438 49955 -14863 -390492 -81232 -18331 -182239 -145489 -261092 64723 -32810 11585
18663a80112g6849k44185a0260A79230G626b86358J20215e5628j94882M6496F0076
$$ -180112 -76849 -321034 -10260 179230 7626 -286358 -166143 -55628 -250510 -204014 60076
18651A28812j973c9952l479j77155H7126a92390n7611M6415O3776e316A41M7842
$$ 128812 126839 -39952 -43431 -220586 87126 -192390 -250001 -203586 -139810 -5316 141 47983
18639D7983J35095b0475q210j32146P4753B38036g8061K0454m5667p9945O0335
$$ 47983 183078 -20475 -28685 -160831 -86078 238036 -78061 -57607 -103274 -183219 -122884
18628a22884D9664P8318b68277A79077l0943K8188g8909H5265C6359K44923a56283
$$ -122884 49664 127982 -268277 179077 148134 176322 -78909 85265 36359 281282 -156283
18616a23640n7769N2769a5294j78867A11697J03998b73051A89414A6259a55401
$$ -123640 -181409 -128640 -15294 -194161 111697 215695 -273051 189414 16259 -155401
18605a65835M5514j62646c1406j32202A27668f6063j11549B60934b6451j23480
$$ -165835 -120321 -282967 -31406 -163608 127668 -66063 -177612 260934 -26451 -149931
18595a49931A99458a48680k05608F2782h9381C2261J8137b03657E73231e7737
$$ -149931 199458 -148680 -354288 62782 -89381 32261 50398 -203657 573231 -57737
18584C0402a3792l62682a14164d0553l79154J56655C35371a42672a0329l3799
$$ 30402 -13792 -376474 -114164 -40553 -419707 -263052 335371 -142672 -10329 -44128
18574d4128k03761N8906C4915h2910j03066A65482b27290F3513a09243e10k26825
$$ -44128 -247889 -188983 34915 -82910 -185976 165482 -227290 63513 -109243 -510 -227335
18563b27335q5498a17591B30797c91468C68067A09578e5667F7559r265b88362
$$ -227335 -312833 -117591 230797 -391468 368067 109578 -55667 67559 58294 -288362
18552g6405C949J5220J04635J9062F5380J6020P565K53671a68280b3126C5902
$$ -76405 3949 19169 123804 142866 65380 81400 88965 342636 -168280 -23126 35902
18540A4220a6466p4079A03521h7159K3729a2088j88742M9497k64578b05180B98221
$$ 14220 -16466 -90545 103521 -87159 -63430 -12088 -200830 -151333 -415911 -205180 298221
18528a12791n6356F7384F570a46763a9527C876J30035O0460f1667j13683j62970
$$ -112791 -169147 67384 6570 -146763 -19527 3876 133911 194371 -61667 -175350 -338320
18517c38320j9272A0674b05228g1203E4239b22698i2767k36614J11424K0822q1677
$$ -338320 -357592 10674 -205228 -71203 54239 -222698 -92767 -329381 -217957 -197135 -278812
18506b78812N1056C4767Q4042e7966B19064I2228A4718c27127A01282b8516A64209
$$ -278812 -227756 34767 118809 -57966 219064 92228 14718 -327127 101282 -28516 164209
18494A57292b2013k51833J19835b598A88937a78867k35448I3769d08550f1122
$$ 157292 -22013 -273846 -154011 -2598 188937 -178867 -414315 93769 -408550 -61122
18483a31846j92620J46179j11938Q2179a8220l3891j45681C138d889k25323C25098
$$ -131846 -324466 -178287 -290225 -208046 -18220 -52111 -197792 3138 -4889 -230212 325098
18471C0274P4675K7718O7235l746q8135N0855a70954c112j12020A06567C5766
$$ 30274 104949 132667 199902 196156 108021 158876 -170954 -3112 -115132 106567 35766
18459C5570b02040F5245J24640Q1075A216a29230A69169d14635C5928b21480j33968
$$ 35570 -202040 65245 189885 270960 1216 -129230 169169 -414635 35928 -221480 -355448
18448c55448D3656a78510G3099A9242a92028c4750G2691a16726B91111m0006e9268
$$ -355448 43656 -178510 73099 19242 -192028 -34750 72691 -116726 291111 251105 -59268
18436f5027r1995O421B2263a3245j73458p5172A66132g6347E2059a30384A5159
$$ -65027 -157022 -150601 22263 -13245 -186703 -261875 166132 -76347 52059 -130384 15159
18424c38076N1287B0534O3862N1808K48811a49030H1599C3079a52604O486A23305
$$ -338076 -286789 20534 84396 136204 385015 -149030 81599 33079 -152604 -146118 123305
18412E3247M9330a49490L5607B09370I6733L9743k7710e4746k6073C4833a16569
$$ 53247 102577 -149490 -113883 209370 96733 136476 108766 -54746 -80819 34833 -116569
18400b848A14591f1494g955k58019j88902A11688c48910G317R2884b0727j15013
$$ -2848 114591 -61494 -7955 -265974 -454876 111688 -348910 7317 100201 -20727 -135740
18389a35740k5442C7971j3296c3817j98863p2641E2681b37280M5364A81924d951
$$ -135740 -161182 37971 24675 -33817 -232680 -305321 52681 -237280 -191916 181924 -4951
18377a07816A19786h6435j556B03737b56999D5565a45239j48129B31133a27109
$$ -107816 119786 -86435 -87991 203737 -256999 45565 -145239 -293368 231133 -127109
18366A39642l7947J01025q5681K3916o3325A6335c8196l1298j41388i9698R983
$$ 139642 101695 202720 117039 140955 77630 16335 -38196 -69494 -210882 -99698 -89715
18355h9715H2391b6054k02515a5091j06142r6564k3676g2466K0122m01481A17561
$$ -89715 82391 -26054 -228569 -15091 -121233 -217797 -241473 -72466 -52344 -453825 117561
18343c68616a50212H4946a89497q1296l71349f4725B08690c48277B9116J51679
$$ -368616 -150212 84946 -189497 -270793 -642142 -64725 208690 -348277 29116 180795
18333A80795k4596b24944O5023f3105e44j35987n0376C94271a75187J6133A29002
$$ 180795 156199 -224944 -159921 -63105 -544 -136531 -186907 394271 -175187 -159054 129002
18321B30388H5519K6428A4103J62133c91332J58523F7680b71714H4618a03358
$$ 230388 85519 111947 14103 176236 -391332 -232809 67680 -271714 84618 -103358
18310a94113C97940a94869H2686M1088h0043D76787c78076c3084j69488A99985
$$ -194113 397940 -194869 82686 123774 -80043 476787 -378076 -33084 -202572 199985
18299a48681P0943C02989c79800A09826b06553a02101p2393A50984a2543k1755
$$ -148681 -77738 302989 -379800 109826 -206553 -102101 -174494 150984 -12543 -34298
18289c4298B43534f5747k41153a40176C8307a60523G9288K8970b55956i2047m4721
$$ -34298 243534 -65747 -306900 -140176 38307 -160523 79288 108258 -255956 -92047 -136768
18278a36768A09551C3975a5832j08383A446a48164o495L6733I2606a56888B556
$$ -136768 109551 33975 -15832 -124215 1446 -148164 -154659 -117926 92606 -156888 2556
18266E69731g1883A68001K8772c55401I2283B1298Q8682J4790b03519e2845k26839
$$ 569731 -71883 168001 196773 -355401 92283 21298 109980 124770 -203519 -52845 -279684
18255b79684E6744h3751j82374B16183d8672A0687b2435A49775n5486n449l1149
$$ -279684 56744 -83751 -266125 216183 -48672 10687 -22435 149775 94289 88840 57691
18244E7691L2949d922j97930B05184g498n37286a24830c9500A0296h4002m7712
$$ 57691 90640 -4922 -202852 205184 -7498 -544784 -124830 -39500 10296 -84002 -131714
18233a31714a2998k27558A81273J43743b14469I5179G810L51075I9608o611L8146
$$ -131714 -12998 -240556 181273 325016 -214469 95179 7810 358885 99608 92997 131143
18222A31143a70578B07671a89267A75038F7057d4981C1050L9677a79723A46150
$$ 131143 -170578 207671 -189267 175038 67057 -44981 31050 70727 -179723 146150
18211a73879c7000r2769a4342A14298A6884L5967d44274J82869L8343P7367A19237
$$ -173879 -37000 -129769 -14342 114298 16884 52851 -444274 -261405 -223062 -145695 119237
18199c7673A5268a41967C6125K3132i2585n918A68367b66987A24302a86007j22492
$$ -37673 15268 -141967 36125 59257 -92585 -98503 168367 -266987 124302 -186007 -308499
18188c08499N5060j15021a01875j40477A5580b6246A9292a17894J0044C2114b39508
$$ -308499 -253439 -368460 -101875 -242352 15580 -26246 19292 -117894 -107850 32114 -239508
18176f1125A57275J61638j39444o6213k2004B7470L470J8840a26706A63436a60133
$$ -61125 157275 318913 179469 113256 91252 27470 30940 49780 -126706 163436 -160133
18164a44226j51618a44067A44641R0986I6985g4582H6928O5057b93737C5096a41731
$$ -144226 -295844 -144067 144641 235627 96985 -74582 86928 151985 -293737 35096 -141731
18152H7226c46578A09891M0477F2614b06959b0105j44411P0393k64332R1806J17419
$$ 87226 -346578 109891 150368 62614 -206959 -20105 -164516 -94123 -358455 -266649 -149230
18141a49230B52763I3805a50852q9944g5046k5855D8160K37408c3722j22286d3811
$$ -149230 252763 93805 -150852 -240796 -75046 -100901 48160 285568 -33722 -156008 -43811
18129b43538B03362b3198B17668j03801L64399d6886A57584d3605G8554d0696
$$ -243538 203362 -23198 217668 113867 478266 -46886 157584 -43605 78554 -40696
18118G0869M0060d45837a34665A62059b1710j83481C3747a6890l7309q8058A20620
$$ 70869 110929 -445837 -134665 162059 -21710 -205191 33747 -16890 -54199 -142257 120620
18106E2383b03860E5344K2507L5787j4517g4610E521O5256a3268j10366C52442
$$ 52383 -203860 55344 77851 113638 99121 -74610 5521 70777 -13268 -123634 352442
18094A10421m173A7266H594c7618j15012P0306K9080a7400r1475c4911f812G4674
$$ 110421 106248 17266 8594 -37618 -152630 -82324 -53244 -17400 -108875 -34911 -6812 74674
18081d2723A32236e1594G9005a41321L7497H3638c31558a53579e5956A27672P01
$$ -42723 132236 -51594 79005 -141321 -103824 83638 -331558 -153579 -55956 127672 128373
18070A28373C9067b10186k8007A97470k3831o0935b55306A59180a86085D0951
$$ 128373 39067 -210186 -238193 197470 173639 112704 -255306 159180 -186085 40951
18059C12029c7155A58557a93900Q4817a1467m6558D2486P4230b75294b8227r6290
$$ 312029 -37155 158557 -193900 -109083 -11467 -58025 42486 116716 -275294 -28227 -124517
18048a24517A61298a01195I5493a43603O2291A09651g4608o5364L9514c6359j81549
$$ -124517 161298 -101195 95493 -143603 -81312 109651 -74608 -139972 -100458 -36359 -217908
18037b17908A17510b79617E1137c83537a60685j41306L9003d4711A32361g5124
$$ -217908 117510 -279617 51137 -383537 -160685 -301991 -262988 -44711 132361 -75124
18026a62914A19958l2393b78131b3076l11762a08055A40996J195J1592a24282
$$ -162914 119958 87565 -278131 -23076 -334838 -108055 140996 142191 153783 -124282
18015b7617E663R307a49340J9144k3230A91683l2555a37618b629l7594E7080J0484
$$ -27617 5663 14970 -149340 -130196 -153426 191683 159128 -137618 -2629 -40223 57080 67564
18003F7564K29900c56034a28188r4458a9114k03602N4172c949A43828f17721A02471
$$ 67564 297464 -356034 -128188 -222646 -19114 -222716 -168544 -3949 143828 -617721 102471
17991E9711A456K09870C2982L7463j1845a11412I9401D8005J560b86728A00886
$$ 59711 1456 211326 32982 70445 58600 -111412 99401 48005 49565 -286728 100886
17979A38198f6116j88725B0259J49973D5069e4354K4169j39219b5924j5457B94766
$$ 138198 -66116 -254841 20259 170232 45069 -54354 -30185 -169404 -25924 -41381 294766
17967A84427a45000I8191b07901l0874j33506B28023a31823f3206A44899J65731
$$ 184427 -145000 98191 -207901 -238775 -372281 228023 -131823 -63206 144899 310630
17957C10630B0315a95793l8313e6897R09k02079C23111j41600e4953l25386c6460
$$ 310630 20315 -195793 -234106 -56897 -55988 -258067 323111 181511 -54953 -380339 -36460
17945b74402B87338d4563B15024g567A37740a7380E0167b42971A94256b84218
$$ -274402 287338 -44563 215024 -7567 137740 -17380 50167 -242971 194256 -284218
17934A74953J4492p6395A4065h4759c4851j36701c9210F7960a7303n4847p3839
$$ 174953 189445 113050 14065 -84759 -34851 -171552 -39210 67960 -17303 -72150 -145989
17923a45989A38071f6382C0216e1358j37523G2366a5120l6775C95b5924H9507
$$ -145989 138071 -66382 30216 -51358 -188881 72366 -15120 -51895 395 -25924 89507
17911E1426K12388a48741A71916c51300h7279K9536j08523j8948I2195a31891
$$ 51426 263814 -148741 171916 -351300 -87279 -57743 -166266 -185214 92195 -131891
17900A22151n7417J29411i5044b4790B83187i1488k83398C08599a21713P568B06612
$$ 122151 64734 194145 -95044 -24790 283187 -91488 -374886 308599 -121713 -114145 206612
17888a04951q6905I2309C6012b79809A2722b46452G3945a15389H7156o967c04659
$$ -104951 -191856 92309 36012 -279809 12722 -246452 73945 -115389 87156 80189 -304659
17876A2206a21713n4445A6853o135e8811A46505f1267G0464J54970b97588A97175
$$ 12206 -121713 -176158 16853 10718 -58811 146505 -61267 70464 225434 -297588 197175
17864B62530H1661L5042e193k08470c7489e822j9577l72718k2233H7755J4138
$$ 262530 81661 116703 -5193 -213663 -37489 -5822 -25399 -398117 -420350 87755 101893
17853A01893l1768K3926h1073A69103J11006B7352J16789L2337F4496J5177a09829
$$ 101893 70125 94051 -81073 169103 280109 27352 144141 176478 64496 79673 -109829
17841G8807L7200l7683a72477A3388J43371p0525d439A40857I242b83325B0860
$$ 78807 116007 78324 -172477 13388 156759 86234 -4439 140857 9242 -283325 20860
17829a04258B22076B010a68544e6720B66695D5818P0623b41839J521C0513L6624
$$ -104258 222076 2010 -168544 -56720 266695 45818 116441 -241839 -240318 30513 67137
17818F7137c90727a3591j8561j07897f6957B0862a88373A29083a5022j82549l46350
$$ 67137 -390727 -13591 -32152 -140049 -66957 20862 -188373 129083 -15022 -197571 -543921
17807e43921b43280B89652A1030J86807b1201j6312j81094n2771h778k05450A11832
$$ -543921 -243280 289652 11030 197837 -21201 -37513 -218607 -271378 -8778 -214228 111832
17795A24037g6005J4362A82570A855L05013H0761B9652O8286P7605l71a47055
$$ 124037 -76005 -61643 182570 1855 306868 80761 29652 97938 175543 175172 -147055
17783a46330L2989a2945J807A31822b08034A51763F4759g6656b8012l8043b5892
$$ -146330 -113341 -12945 -11138 131822 -208034 151763 64759 -76656 -28012 -66055 -25892
17771H1292K7413d2849A21888a39014j2793B57957A26722n7744b939D1846J05171
$$ 81292 108705 -42849 121888 -139014 -151807 257957 126722 68978 -2939 41846 147017
17760A47017n6773e3431B6165c7462k48636a13915j16927A43631e0763o4168l4009
$$ 147017 90244 -53431 26165 -37462 -286098 -113915 -230842 143631 -50763 -114931 -148940
17749a48940G7510J80015I533M54362B9624D853M4368a86645C05597A42071M0921
$$ -148940 77510 257525 9533 463895 29624 4853 49221 -186645 305597 142071 182992
17738A82992O9465g1222J0617B89b44750f4129o099D5826Q7491d87596A89689
$$ 182992 252457 -71222 -60605 289 -244750 -64129 -70228 45826 133317 -487596 189689
17726a33833B79726A38186A8745F087J24984b17785d0672B15342q7382b78354
$$ -133833 279726 138186 18745 6087 131071 -217785 -40672 215342 127960 -278354
17715b3468j13646b0115k68899O9807F4528i5844g857m1946I9795d4744J8624
$$ -23468 -137114 -20115 -289014 -219207 64528 -95844 -7857 -49803 99795 -44744 -26120
17704b6120q7987A62946E4000a83341B7048L7127a94440A21678f4833C56102b54363
$$ -26120 -114107 162946 54000 -183341 27048 64175 -194440 121678 -64833 356102 -254363
17692a84990o5788d338n5703D17173E1745J61907b01860c3591C19716a46374r2274
$$ -184990 -250778 -4338 -60041 417173 51745 213652 -201860 -33591 319716 -146374 -238648
17681b38648B96707A17298e9018I0949K7945a20370C14122A48455a24440B38953
$$ -238648 296707 117298 -59018 90949 118894 -120370 314122 148455 -124440 238953
17670b81758h838n77n5434l3759L5378F9094i5780B9752a2122C04934E4646d00880
$$ -281758 -8838 -9415 -64849 -98608 -63230 69094 -95780 29752 -12122 304934 54646 -400880
17657C7105O2645b11038a4047j03031C40605j48111B268J58357a34155A78684
$$ 37105 99750 -211038 -14047 -117078 340605 192494 2268 160625 -134155 178684
17646h1366C41467J00660c1058j19145A52535b50789K5617g158k28370P2729E0652
$$ -81366 341467 442127 -31058 -150203 152535 -250789 -225172 -7158 -235528 -162799 50652
17634b32585q77D0762a4187C2621P993M3552J3279N3259p9l1471h2923b5463j86848
$$ -232585 -233462 40762 -14187 32621 40614 84166 97445 150704 150625 119154 -82923 -25463 -212311
17621b12311c0215k07023d8678j4805j6583r0285P6648p270A05343g7216J4460
$$ -212311 -30215 -237238 -48678 -63483 -80066 -170351 -93703 -100973 105343 -77216 -62756
17610f2756A12738i811A33770b7754o3477B6523K9013J71629a29343H8893b22546
$$ -62756 112738 -9811 133770 -27754 -91231 26523 55536 227165 -129343 88893 -222546
17598a10501E8109J05379p9715J61931A01177a95685C14829g2260a2574A56899
$$ -110501 58109 163488 83773 245704 101177 -195685 314829 -72260 -12574 156899
17587a09762B02164n4217R1100A03828b1333j86382B9350g3759C72486D5460a34270
$$ -109762 202164 147947 239047 103828 -21333 -207715 29350 -73759 372486 45460 -134270
17575a2100o8016e161B68894J16141C1210d995j55714a8606j78989N3771C7469
$$ -12100 -80116 -5161 268894 385035 31210 -4995 -160709 -18606 -197595 -143824 37469
17563i1193a9318C7652L542h7792A7583J48219a53335C5687J59136I3398K45619
$$ -91193 -19318 37652 41194 -87792 17583 165802 -153335 35687 194823 93398 339017
17552C39017B7353Q7187E3067M586a37651E6153f3266C56592H2504k7584N6642
$$ 339017 27353 114540 53067 57653 -137651 56153 -63266 356592 82504 54920 111562
17541A11562f2336J872A18580i6189C29550B4975J48370a97601G8854e0502A94248
$$ 111562 -62336 -60464 118580 -96189 329550 24975 173345 -197601 78854 -50502 194248
17529d48668D1892a84680A8269J01573P9200K27155A32966n2885R3574j842l7507
$$ -448668 41892 -184680 18269 119842 199042 426197 132966 80081 173655 171813 134306
17518A34306O8101K8867Q337A02149i3014j7496F6800J00200M2484M1951R392
$$ 134306 202407 231274 239611 102149 -93014 -110510 66800 167000 209484 251435 260827
17507B60827C5077O9404a51466A08087a14685A01114a68038A04848J21067A6108
$$ 260827 35077 104481 -151466 108087 -114685 101114 -168038 104848 225915 16108
17496B96853a9815B57381n7970b27136A75607h7984j8293H492K2939c1341A25188
$$ 296853 -19815 257381 199411 -227136 175607 -87984 -106277 8492 31431 -31341 125188
17484a24925q1851P8388d4315B924Q1642Q7135f0039b7069A7389g8803B3113J49523
$$ -124925 -206776 -128388 -44315 2924 84566 171701 -60039 -27069 17389 -78803 23113 172636
17472A72636J2754m3485J66557R8482I6033R9829a1122D38777a16298B94994A16500
$$ 172636 185390 141905 308462 406944 96033 195862 -11122 438777 -116298 294994 116500
17460c5137j46026b8145j95J2773j2609A89335b42911C58343J24940A84161K067
$$ -35137 -181163 -28145 -28340 -15567 -28176 189335 -242911 358343 483283 184161 186228
17449A86228J92423n8481J36365k3596h718C51748A10352o793i1809D39506j60543
$$ 186228 378651 320170 456535 432939 -8718 351748 110352 103559 -91809 439506 278963
17438B78963B3837K19571D8134a19279d7509B45880D6337P5653L0444P2847m6466
$$ 278963 23837 243408 48134 -119279 -47509 245880 46337 121990 152434 225281 178815
17427A78815K08771b14030H351f790B40325K75431a80369I7343a2140D0468j7164
$$ 178815 387586 -214030 8351 -6790 240325 515756 -180369 97343 -12140 40468 23304
17416B3304J99519E3903J11187L5546Q7118a26377A0787O1848i7774n5506C35900
$$ 23304 222823 53903 165090 200636 287754 -126377 10787 72635 -97774 -153280 335900
17404A30150j3454k0637k2224M1545K23898A40559K97991A06569b2710E0491K74004
$$ 130150 116696 96059 73835 115380 339278 140559 438550 106569 -22710 50491 324495
17393C24495A21657a11462A16476B6274L84916d24957C1637e5157J0516k07765
$$ 324495 121657 -111462 116476 26274 411190 -424957 31637 -55157 -44641 -252406
17383b52406D11283C451Q1760J05146n7340C1746d8419F443O8959a70938A76892
$$ -252406 411283 3451 85211 190357 133017 31746 -48419 6443 75402 -170938 176892
17371B11067o5147E3084L0191L00759l0401b82759d3902B55417f5733A6565J15299
$$ 211067 145920 53084 83275 384034 353633 -282759 -43902 255417 -65733 16565 131864
17360A31864J65104H6084J58694d9984C46562n9273j8998J15269E491L56629I9618
$$ 131864 296968 86084 244778 -49984 346562 287289 268291 383560 5491 362120 99618
17348I8910o689q458B3362R9047j6260J45601j17378n7740K26120A4390a28635
$$ 98910 92221 83763 23362 122409 106149 251750 134372 76632 302752 14390 -128635
17336f7376m4563B69330o4768d3136j69466B21515G8177R7054a08267B94066b35764
$$ -67376 -111939 269330 204562 -43136 -212602 221515 78177 175231 -108267 294066 -235764
17324h6787A12318R0538B5082J83290a79051E03654j78952p4957e1152C10518
$$ -86787 112318 202856 25082 208372 -179051 503654 324702 249745 -51152 310518
17313A11956J42857A12642j6668c4296D27830F0168b00939h4176D50054j11708
$$ 111956 254813 112642 95974 -34296 427830 60168 -200939 -84176 450054 338346
17303C38346M111j59025K76381A66250a3960D7436a22198F12242A14986C7959
$$ 338346 342457 183432 459813 166250 -13960 47436 -122198 612242 114986 37959
17292A91560o1280M5229i362B73453P398k8932m2785L4726o6034b6196p5196C31277
$$ 191560 130280 175509 -9362 273453 280851 251919 209134 243860 177826 -26196 -101392 331277
17279A24864D7275O54271B34014B3743R6308J55751I1214O637J75192G6795J29403
$$ 124864 47275 701546 234014 23743 120051 275802 91214 97851 273043 76795 206198
17268B06198k0116h4510A15047M1545J01924k8225E517J24376J58254i8224A45056
$$ 206198 186082 -84510 115047 156592 258516 230291 5517 129893 288147 -98224 145056
17256a65222N2483h162B74245f0094A81943q6218J8304D9449K38628e4263a6021
$$ -165222 -112739 -8162 274245 -60094 181943 95725 114029 49449 288077 -54263 -16021
17244B51838r5741Q1680J60187O7849p7207A90723O8943A7527R9335l5803K68056
$$ 251838 156097 237777 397964 465813 388606 190723 259666 17527 116862 81059 349115
17233C49115j47982I7883J8826K38514j10613m154l2934K796J77721C4603A0934
$$ 349115 201133 97883 116709 355223 244610 240456 207522 210318 388039 34603 10934
17221C55449A19494M8264K20917n5035p5302r574B0889J25628m1589m9423J42934
$$ 355449 119494 167758 388675 333640 258338 248764 20889 146517 104928 55505 198439
17210A98439o4738i1510A3318K38841O4468j25330g1415A97661R250e068C63286
$$ 198439 133701 -91510 13318 252159 316627 191297 -71415 197661 206911 -5068 363286
17198B77952J49343j21631B3065J04240L626M3098R6097d862j99581C42741n9355
$$ 277952 427295 305664 23065 127305 130931 174029 270126 -4862 -204443 342741 283386
17187B83386o676F0816A3707P910J99893n5729K34073j95217J0730K52050A70570
$$ 283386 276710 60816 13707 21617 221510 165781 399854 204637 215367 467417 170570
17175a50373A99616C9154J82171p9231L23468k13457E8367N75758C00607J1676
$$ -150373 199616 39154 221325 142094 465562 252105 58367 634125 300607 312283
17165C12283F5145j4584K04845L81239l05683A06905l8633j5216L21291j50866
$$ 312283 65145 50561 255406 636645 330962 106905 68272 53056 374347 223481
17155B23481K28805b8945D69503A63941K50766r8999K310i926B32604l970R526
$$ 223481 452286 -28945 469503 163941 414707 315708 318018 -9926 232604 228634 238160
17144B38160K8421J99537j85832J53645m2999m1343p4819Q7414A62986L80435
$$ 238160 266581 466118 280286 433931 390932 349589 274770 362184 162986 543421
17134E43421k42666R8200A20557K463O2232C5563L06799A00204J27756C1481L78219
$$ 543421 300755 398955 120557 123020 185252 35563 342362 100204 227960 31481 409700
17123D09700q6125k3269p3592J08086M7385r3406F14L64734I4018j6333L03179
$$ 409700 323575 300306 226714 334800 382185 288779 614 365348 94018 77685 380864
17112C80864A41516K07198k7771c45552C74919j64706K32736P295A22988R8815
$$ 380864 141516 348714 320943 -345552 374919 210213 442949 450244 122988 221803
17102B21803j04701M18674k8217K9375k225r1751o3083J42622B51878J53642p4482
$$ 221803 117102 535776 507559 536934 534709 442958 379875 522497 251878 405520 331038
17091C31038j58619J95449G821M80882k35139j08068p2618N05180j68597j62862
$$ 331038 172419 367868 7821 488703 253564 145496 72878 578058 409461 246599
17081B46599P0885K48502B35747o9328R0558J60408K54404j51515j56665L3401
$$ 246599 317484 565986 235747 166419 256977 417385 671789 520274 363609 397010
17071C97010O5027j63290Q4748A0015M35021L5736N9357j30916J6003j97801J18332
$$ 397010 462037 298747 383495 10015 445036 480772 540129 409213 425216 227415 345747
17060C45747A52818K87721J83247k46406Q1473k15426K52348B01061L59204A85313
$$ 345747 152818 440539 623786 377380 458853 243427 495775 201061 560265 185313
17049E23689B37841O1258K25334J42145R6064k34966k09859L59872k44576k03834
$$ 523689 237841 299099 524433 666578 762642 527676 317817 677689 433113 229279
17039B29279K16140L2944a0958D43830j20470J59725R5J19457J82449C17234J48691
$$ 229279 445419 478363 -10958 443830 323360 483085 483180 602637 785086 317234 465925
17028D65925J19193m910k62425M56201p0116o1594j95814j48339J87989R2631
$$ 465925 585118 580208 317783 773984 703868 642274 446460 298121 486110 578741
17018E78741j7395j07895P2971K92281D07462J51712L6420j69984J25957j85089
$$ 578741 561346 453451 526422 818703 407462 559174 595594 425610 551567 366478
17008C66478J47056r6401J39548L1994R989j6825J2026J30682C07242L55510L8069
$$ 366478 513534 417133 556681 588675 598664 581839 593865 724547 307242 662752 700821
16997G00821o3374N5899q3765K03182j85382q5216o8179K6365J12660K11142m08257
$$ 700821 637447 693346 609581 812763 627381 542165 473986 500351 613011 824153 415896
16986D15896k9427R9517l9080L46526j50073K6406j26429L06983l77156m1J21625
$$ 415896 386469 485986 446906 793432 643359 669765 543336 850319 473163 473122 594747
16975E94747j33482M32334k67258K94778D03455L92164k29017J09068M68319j90577
$$ 594747 461265 893599 626341 921119 403455 795619 566602 675670 1143989 953412
16965I53412N1653j45432K25161k15770k02977L9156r1057n7003J69174J72577
$$ 953412 1005065 859633 1084794 869024 666047 705203 614146 557143 726317 898894
16955H98894J69806L4579m4962k19433K70217k83569j50390J31858J69399n1365
$$ 898894 1068700 1103279 1058317 838884 1109101 825532 675142 807000 976399 925034
16945I25034J35192k22364J22487J87432O043j59429K03383k03438k9653r2394
$$ 925034 1060226 837862 960349 1147781 1153824 994395 1197778 994340 964687 872293
16935H72293J25996K03566n8525r2813R785O2452N5170k25138K43136k22829M46266
$$ 872293 998289 1201855 1143330 1050517 1060302 1122754 1177924 952786 1195922 973093 1419359
16924A419359m08139j39519J55568K20370r8209p0720q9954J20206N1975l9037
$$ 1419359 1011220 871701 1027269 1247639 1149430 1078710 988756 1108962 1160937 1121900
16914A121900m504r3090L0549K08287m53371N94578n86303L38983L03358o764
$$ 1121900 1117396 1024306 1054855 1263142 809771 1404349 818046 1157029 1460387 1453623
16904A453623m53316L22947J57539j90046j56948K84160K9400j68032J47740J60571
$$ 1453623 1000307 1323254 1480793 1290747 1133799 1417959 1447359 1279327 1427067 1587638
16894A587638J8694n7026k31263J29306j26519J01900m7804K57220J53440n11596
$$ 1587638 1606332 1549306 1318043 1447349 1320830 1422730 1374926 1632146 1785586 1273990
16884A273990O90553m50468k15208J1839K24412M17760j00155j16990r6515K26416
$$ 1273990 1964543 1514075 1298867 1310706 1535118 1952878 1852723 1735733 1639218 1865634
16874A865634k07936J05190j87296M67020m0316p233K10924m1896L6406m1545
$$ 1865634 1657698 1762888 1575592 2042612 2002296 1995063 2205987 2164091 2200497 2158952
16864B158952J55013l13289Q9170n8721k30236K96657p1091M22989j66173j21603
$$ 2158952 2313965 2000676 2089846 2031125 1800889 2097546 2026455 2449444 2283271 2161668
16854B161668J40118J64397J25779j67815O0532J39852J37074k59029L24321K26012
$$ 2161668 2301786 2466183 2591962 2424147 2484679 2624531 2761605 2502576 2826897 3052909
16844C052909j75811J93092l46749M11645k75080J4532M75661k21628k94566N79967
$$ 3052909 2877098 3070190 2723441 3135086 2860006 2874538 3350199 3128571 2834005 3413972
16834C413972J38653K38397k07084P2881j49360k24212L88980K58057k08606j80406
$$ 3413972 3552625 3791022 3583938 3656819 3507459 3283247 3672227 3930284 3721678 3541272
16824C541272K63582L17966j5842L50242j61839M272j83800L0995N59843K19R1507
$$ 3541272 3804854 4122820 4106978 4457220 4295381 4299653 4115853 4146848 4706691 4706910 4798417
16813D798417j4832K04535J98202J75290m76707N80794k03203L07454J48992K4258
$$ 4798417 4783585 4988120 5186322 5361612 4884905 5465699 5262496 5569950 5718942 5743200
16803E743200j6726L10067M4817J35624J78719J01552n6525J78901N9105K11476
$$ 5743200 5726474 6036541 6081358 6216982 6395701 6497253 6440728 6619629 6678734 6890210
16793F890210N39433n5214K64477L03359L8628J10488L24225N56862M6085n1725
$$ 6890210 7429643 7374429 7638906 7942265 7980893 8091381 8415606 8972468 9018553 8966828
16783H966828M48590K41677L33030P9758K95811O64674J28514p8108M64989M27505
$$ 8966828 9415418 9657095 9990125 10069883 10365694 11030368 11158882 11080774 11545763 11973268
16773A1973268N56718L01802M83483L62540N20760M30025N64486O45983N40731
$$ 11973268 12529986 12831788 13315271 13677811 14198571 14628596 15193082 15839065 16379796
16764A6379796K72774P92935N93139P61096O47751Q54229O33644R37801P78628
$$ 16379796 16652570 17445505 18038644 18799740 19447491 20301720 20935364 21873165 22651793
16755B2651793R15583J148660J100011R21286J474343R46671J386807J661653
$$ 22651793 23567376 24716036 25816047 26737333 28211676 29158347 30545154 32206807
16747C2206807J219985K039892J839722J808750K190676J895259K692499K266518
$$ 32206807 33426792 35466684 37306406 39115156 41305832 43201091 45893590 48160108
16739D8160108K586673L387742K987788L376146L328270L631381M833091M020034
$$ 48160108 50746781 54134523 57122311 60498457 63826727 67458108 72291199 76311233
16731G6311233M682943M956646N680014N753866N385730O607337O654502O686666
$$ 76311233 80994176 85950822 91630836 97384702 102770432 109377769 116032271 122718937
16723A22718937O806411P218923O550554P014434O084386N669279M940743L935650
$$ 122718937 129525348 136744271 143294825 150309259 156393645 162062924 167003667 170939317
16715A70939317K595419J686005O66222j138832j790183l329148m412234n176447
$$ 170939317 173534736 175220741 175886963 174748131 172957948 169628800 165216566 160040119
16707A60040119o130645o254010o931359p081527o916081o994939p215509o264343
$$ 160040119 153909474 147655464 140724105 133642578 126726497 119731558 112516049 106251706
16699A06251706o060976o177889n735673n583607m918387m723413m212893m149100
$$ 106251706 100190730 94012841 88277168 82693561 77775174 73051761 68838868 64689768
16691F4689768l985721l290109l261629l129430k862469k664601k417855k117056
$$ 64689768 60704047 57413938 54152309 51022879 48160410 45495809 43077954 40960898
16683D0960898k272531j456139k075264j902777j390569j816734j297809j349017
$$ 40960898 38688367 37232228 35156964 33254187 31863618 30046884 28749075 27400058
16675B7400058j099364j171844j117686q35089j140568j093561p15579p08612
$$ 27400058 26300694 25128850 24011164 23176075 22035507 20941946 20226367 19517755
16667A9517755r11616o67661q88772J404j291369l09498o50184p27959l67400
$$ 19517755 18606139 17938478 17049706 17051110 15759741 15450243 14800059 14072100 13704700
16658A3704700l15927l53559o18725l84615k58731o02082j62516m03410k75554
$$ 13704700 13388773 13035214 12416489 12031874 11773143 11171061 11008545 10605135 10329581
16649A0329581j27471n91823k14444k53087n16697J81915q03489j47634P6261
$$ 10329581 10202110 9610287 9395843 9142756 8626059 8807974 8004485 7856851 7933112
16640G933112m17973p9220J80734p31619Q7006k91195l10530j8481J1769l24648
$$ 7933112 7515139 7435919 7616653 6885034 6972040 6680845 6370315 6351834 6363603 6038955
16630F038955n902j02654k37340l72648J64489k24208J01434l98243l4645j87430
$$ 6038955 6033053 5930399 5693059 5320411 5484900 5260692 5362126 4963883 4929238 4741808
16620D741808o4226k56055L02029m33232K4982k19760l6941k76423O0747o2960
$$ 4741808 4677582 4421527 4723556 4290324 4315306 4095546 4058605 3782182 3842929 3779969
16610C779969m5910l41135L72104R0618j75734j57339j53162J24398o47896L03344
$$ 3779969 3734059 3392924 3765028 3855646 3679912 3522573 3369411 3493809 2845913 3149257
16600C149257J87051p08388L30151L52839m06629K1027l8512K17392m47937J72077
$$ 3149257 3336308 2627920 2958071 3310910 2904281 2925308 2886796 3104188 2656251 2828328
16590B828328l7528l38416N74719n46929O8408p0290k55157K71478P3379n86137
$$ 2828328 2790800 2452384 3027103 2480174 2548582 2478292 2223135 2494613 2567992 1981855
16580A981855J53047K64500j71175k00960J17908j81491P4764J33367k09902l88746
$$ 1981855 2134902 2399402 2228227 2027267 2145175 1963684 2038448 2171815 1961913 1573167
16570A573167M05226J03422j97905P6620R2463m44200J07506m6767n1354Q6313
$$ 1573167 1978393 2081815 1883910 1960530 2052993 1608793 1716299 1669532 1618178 1704491
16560A704491J32429j33563j94690P0041M0631j32898l06303L84891N9022N4596
$$ 1704491 1836920 1703357 1508667 1578708 1619339 1486441 1180138 1565029 1624051 1678647
16550A678647k04286m19591L26306p838K4811m03392K15642K68351m15226K88544
$$ 1678647 1474361 1054770 1381076 1373238 1398049 994657 1210299 1478650 1063424 1351968
16540A351968j05376j86094J02455K05662m62256K82537M854j95735L74205R488
$$ 1351968 1246592 1060498 1162953 1368615 906359 1188896 1193750 998015 1372220 1381708
16530A381708l19941J17385k35655J64594M9818E58657N43216J71960O3170k15775
$$ 1381708 1061767 1179152 943497 1108091 1157909 558657 1101873 1273833 1337003 1121228
16520A121228j08636j15272K67362j60216n1069l82485M72321j60698J05977k10640
$$ 1121228 1012592 897320 1164682 1004466 953397 570912 1043233 882535 988512 777872
16510G77872J16070o1180L13469l52314O3710k31096J52871J82196k92189j03377
$$ 777872 893942 832762 1146231 793917 857627 626531 779402 961598 669409 566032
16500E66032L31659l05027k35004M83921J40189Q129j74847Q3503r8488j92703
$$ 566032 897691 592664 357660 841581 981770 989899 815052 898555 800067 607364
16490F07364L09309j60455j2552M0043j14788n3864O4446k10789L21191j50889
$$ 607364 916673 756218 743666 783709 668921 615057 679503 468714 789905 639016
16480F39016P4618L4890J91437l87570K34676J24373l86302K00728J83325D41891
$$ 639016 713634 748524 939961 552391 787067 911440 525138 725866 909191 441891
16469F18659j21199K56510j26631p1256Q1824k62299J32712j22534L46519l10572
$$ 618659 497460 753970 627339 556083 637907 375608 508320 385786 732305 421733
16459D21733P9990n4842q2787K84723j47814R1547R6299k64739N62742k84528
$$ 421733 501723 446881 364094 648817 501003 592550 688849 424110 986852 702324
16449G02324k11012k10537K58104H1789M32050J83649l17335L65113B69581j06088
$$ 702324 491312 280775 538879 81789 513839 697488 380153 745266 269581 163493
16439A63493L13220A74660M08734a58567C33177l5805L58732C25495Q5088k8185
$$ 163493 476713 174660 583394 -158567 333177 297372 656104 325495 410583 382398
16429C82398J79323k14587K59997n8920j70573L00036A90320L45690j51913A74940
$$ 382398 561721 347134 607131 548211 377638 677674 190320 536010 384097 174940
16418C99691n5112p0734j2654L4683j30148M15698m6902M4741B81599J48720o9379
$$ 399691 344579 273845 261191 295874 165726 581424 534522 579263 281599 430319 360940
16407C60940o7047M1913j30975K69322p0750l3062j75595J28235a32965A33283
$$ 360940 293893 335806 204831 474153 403403 370341 194746 322981 -132965 133283
16396D80313B22795K16023O1679e9702D10594P1638A91538M07380B52566J7329
$$ 480313 222795 438818 500497 -59702 410594 482232 191538 598918 252566 269895
16386B69895J47259H4514J01523d2205B72574a7517C5113J07524K27915I2118
$$ 269895 417154 84514 186037 -42205 272574 -17517 35113 142637 370552 92118
16375E53249c4853C01181r1871l4650b4876B84750J02600i3204B78235A04314
$$ 553249 -34853 301181 209310 174660 -24876 284750 387350 -93204 278235 104314
16364D52207B05866C4011N2963J63692I3491L42477j96926a38230C21269j21663
$$ 452207 205866 34011 86974 250666 93491 435968 239042 -138230 321269 199606
16354A99606l2791J23338K13647j79867A17937L3846b5781B37736A16229e9625
$$ 199606 166815 290153 503800 323933 117937 151783 -25781 237736 116229 -59625
16343A47717H235K41552k6092A06298J21890Q5920j51120J19224j13068m5111
$$ 147717 8235 249787 223695 106298 228188 314108 162988 282212 169144 124033
16333A24033n9903B3293L11181F6841B5452O218O14403a0546A8051M32610q1470
$$ 124033 64130 23293 334474 66841 25452 31670 646073 -10546 18051 450661 369191
16322C69191j08854f9718B7589E272K03468K48611A26744B4512L32926J9132D8803
$$ 369191 260337 -69718 27589 5272 208740 457351 126744 24512 357438 376570 48803
16310B73747C2718D330b28944A64614m0081J64603g0407C75205A53037A2831K01179
$$ 273747 32718 4330 -228944 164614 124533 289136 -70407 375205 153037 12831 214010
16299B14010K46568A36358a62789A86981a24207A46400L0147a33445B31436E9103
$$ 214010 460578 136358 -162789 186981 -124207 146400 176547 -133445 231436 59103
16288H0402O2698n0927j9125n408J35187J8677Q3522A17885m2599J8183a17903
$$ 80402 143100 92173 73048 67640 202827 221504 305026 117885 75286 93469 -117903
16276c8030B42152J11758c9825B62409g0465B32307l1166C2485P0555e1962B37956
$$ -38030 242152 353910 -39825 262409 -70465 232307 201141 32485 103040 -51962 237956
16264F8546e8693k35707G1221g969A37065M4727a67888B32306a03802L3898o2899
$$ 68546 -58693 -294400 71221 -7969 137065 181792 -167888 232306 -103802 -69904 -132803
16253a32803b1579a339A40675A9550L35714j51726b5901l02674B12714b46971
$$ -132803 -21579 -1339 140675 19550 355264 203538 -25901 -328575 212714 -246971
16242B52183E2972J1735a31847B32188r5656c7061C36700p5364H4016h7898p3019
$$ 252183 52972 64707 -131847 232188 136532 -37061 336700 261336 84016 -87898 -160917
16231a60917B13760I9678O382j3394j5445R756a57359b9733B068a45589C31181
$$ -160917 213760 99678 106060 92666 77221 86977 -157359 -29733 2068 -145589 331181
16219f6642B72822m7378D154K38933A14496e8604a9374A22893L3332o3533C1986
$$ -66642 272822 225444 4154 243087 114496 -58604 -19374 122893 156225 92692 31986
16207A23768a13200B84810g4078G7316C8256J12239O9298A8317J18130E830a55187
$$ 123768 -113200 284810 -74078 77316 38256 150495 219793 18317 136447 5830 -155187
16195a87443F9848d3275B26882m8618K8119k8962m3110J31236L9036A00761b1197
$$ -187443 69848 -43275 226882 178264 206383 177421 134311 265547 304583 100761 -21197
16183d2771A38750C3715Q5867l3727J52002b0339A23655c7294B1136I940J98634
$$ -42771 138750 33715 119582 85855 237857 -20339 123655 -37294 21136 9940 208574
16172B08574K3956A0887R6043g1846k6979j72105j16687B60775A671J28780b01698
$$ 208574 232530 10887 106930 -71846 -98825 -270930 -387617 260775 1671 130451 -201698
16160A90491a60338B12995L1223a81821A04663h6754a2743I8160f7242l10473
$$ 190491 -160338 212995 244218 -181821 104663 -86754 -12743 98160 -67242 -377715
16150c77715e917C14375D065h0541B24894b57672A52588M2722k8501b31158A97578
$$ -377715 -5917 314375 4065 -80541 224894 -257672 152588 195310 166809 -231158 197578
16138f505k73266i0305A8757b20926g2342c3401A11568b75411B33878k4005f5092
$$ -6505 -279771 -90305 18757 -220926 -72342 -33401 111568 -275411 233878 209873 -65092
16126g133E2315J01571K3201b5474j1453j7686A82509n8884a8282l9920o9522
$$ -7133 52315 153886 177087 -25474 -36927 -54613 182509 123625 -18282 -58202 -127724
16115a27724c5484A61409k1485d1761B61723a32226A3127K24661b4733l4314B1606
$$ -127724 -35484 161409 139924 -41761 261723 -132226 13127 237788 -24733 -59047 21606
16103B97517G6600C2478N6902J1749i686C87992j0885j10272b68406P4357j78884
$$ 297517 76600 32478 89380 101129 -9686 387992 377107 266835 -268406 -194049 -372933
16092c72933a46891j46015B13800p6144R7134A7830K23272D7664e6694H716c21738
$$ -372933 -146891 -292906 213800 137656 234790 17830 241102 47664 -56694 8716 -321738
16080b12850q301I6269B5020b28431P2454q4257f2399j11574k034F1177o849b69304
$$ -212850 -221151 96269 25020 -228431 -155977 -240234 -62399 -173973 -176007 61177 54328 -269304
16067b22641n4414A59617Q4425o4348a72599A0472b7622A69200b36759C2211e829
$$ -222641 -277055 159617 244042 179694 -172599 10472 -27622 169200 -236759 32211 -5829
16055a4242C11356d1379A70235M6195b02165n4455a01339A48439J09686b03104
$$ -14242 311356 -41379 170235 216430 -202165 -256620 -101339 148439 258125 -203104
16044b37269r2000O6391b8125J1226r8928e3369j02560D2632J80480a81535B150
$$ -237269 -329269 -262878 -28125 -16899 -115827 -53369 -155929 42632 223112 -181535 2150
16032B17526a50367j27722A31690a5572D3308e929A86695b04902m8700k445c1003
$$ 217526 -150367 -278089 131690 -15572 43308 -5929 186695 -204902 -253602 -256047 -31003
16020A09847J07475e0043B0145b20230j13778A05543a83352f2712k01821l3007
$$ 109847 217322 -50043 20145 -220230 -334008 105543 -183352 -62712 -264533 -297540
16010b97540H301b24561M7076a1092j71904A43450E515J05835r783Q4723b30074
$$ -297540 8301 -224561 -177485 -11092 -182996 143450 5515 111350 101567 186290 -230074
15998d15421e7056D5305a35880a7645D7248J51021a90339E3528c02882B0705P5470
$$ -415421 -57056 45305 -135880 -17645 47248 198269 -190339 53528 -302882 20705 96175
15987I6175a01102j98165A56864P1250R4576j30906L22825b325A45726a43227
$$ 96175 -101102 -299267 156864 228114 322690 191784 514609 -2325 145726 -143227
15976A36229J8721K38254f6042B42215a39994j99567B0151h8407c2422B58331
$$ 136229 154950 393204 -66042 242215 -139994 -339561 20151 -88407 -32422 258331
15965a37142l6097f110j70870B73682a44147E1999O8279N2962a98049j87862a53867
$$ -137142 -173239 -6110 -176980 273682 -144147 51999 120278 173240 -198049 -385911 -153867
15953A55647B2284J30947a06091a9632A85e817j38820A59555b44102b6625m2419
$$ 155647 22284 153231 -106091 -19632 185 -5817 -144637 159555 -244102 -26625 -69044
15942f9044A24552D6937b39431A49010a19749p3105A18914h6516a7637j85931
$$ -69044 124552 46937 -239431 149010 -119749 -192854 118914 -86516 -17637 -203568
15932b03568N9619q0187Q7700j29600A86631a80824A39751d75801c7970r8316
$$ -203568 -143949 -224136 -136436 -266036 186631 -180824 139751 -475801 -37970 -136286
15922a36286A76798m9876i3114A38713h4801j92q6221P5429q7983a7350J230j59444
$$ -136286 176798 126922 -93114 138713 -84801 -84993 -171214 -95785 -183768 -17350 -16120 -175564
15910a75564c8697k1390G4078A7481K12366a27208j13906B27024m9004R1601b33889
$$ -175564 -38697 -60087 74078 17481 229847 -127208 -241114 227024 178020 269621 -233889
15898B96962c8924J0856C2449a77878G178a03803l67665A93080B9410h6402b3415
$$ 296962 -38924 -28068 32449 -177878 7178 -103803 -471468 193080 29410 -86402 -23415
15886e1260f362A3586a12987B17931J19442e8289r9373M1649e0425A42827o8480
$$ -51260 -6362 13586 -112987 217931 337373 -58289 -157662 -116013 -50425 142827 74347
15875G4347r264N8573a91658A96251B2653c2791B28239o7753B3515K00253a09791
$$ 74347 65083 123656 -191658 196251 22653 -32791 228239 160486 23515 223768 -109791
15863A11904b44300A90092i087k99368A30696b76628m2767B32815b85850l0044
$$ 111904 -244300 190092 -9087 -308455 130696 -276628 -319395 232815 -285850 -315894
15853c15894a22274c0251j09449d7053j94620C22637a36200j421j62610A1112
$$ -315894 -122274 -30251 -139700 -47053 -241673 322637 -136200 -137621 -300231 11112
15842B98394j14363a0744l00347a36149A98696f287B11994c63191a27710B00763
$$ 298394 184031 -10744 -311091 -136149 198696 -6287 211994 -363191 -127710 200763
15831c21179H644L6634M1236h4366l17647c4170o6075D5153J01594m9086J40430
$$ -321179 8644 45278 86514 -84366 -402013 -34170 -100245 45153 146747 97661 238091
15820B38091H1992k5245b16262D81660k34719i1963k27130a56053A30575m6639
$$ 238091 81992 56747 -216262 481660 246941 -91963 -319093 -156053 130575 83936
15810H3936e3640A47170a03607q5632l7421E2984j7100A2879a58999b8629A00257
$$ 83936 -53640 147170 -103607 -189239 -226660 52984 35884 12879 -158999 -28629 100257
15798B54173c40601H7999C3044i4925j5159e3099j4455A83485c200A06116c8779
$$ 254173 -340601 87999 33044 -94925 -110084 -53099 -67554 183485 -3200 106116 -38779
15786F6005N262J31013a82233k87282A67753b7686o612k95537a58928G6301c44768
$$ 66005 71267 202280 -182233 -469515 167753 -27686 -34298 -329835 -158928 76301 -344768
15774G9200I531b66556a09307M555j70359a5037A95250e4968j6760q9775A58349
$$ 79200 9531 -266556 -109307 -104752 -275111 -15037 195250 -54968 -71728 -161503 158349
15762A07312d9972q2435A43113O0475K6359a6535G3523B2947R6924h6583r3399
$$ 107312 -49972 -132407 143113 203588 229947 -16535 73523 22947 119871 -86583 -179982
15751a79982l40738A49038J16142a1066D09891A64991h7043E4699J78639i7707
$$ -179982 -520720 149038 265180 -11066 409891 164991 -87043 54699 233338 -97707
15740A33218m8606m537K1558a85072l4245i0747j26038M3585a6040B1437K73652
$$ 133218 84612 80075 101633 -185072 -219317 -90747 -216785 -173200 -16040 21437 295089
15729B95089E0410r96K84770i8421G1672J42375d31042a00001C35221c6847p6096
$$ 295089 50410 49414 334184 -98421 71672 214047 -431042 -100001 335221 -36847 -112943
15718a12943j7468E9004a93940G7901c83355a14696n0638c1552o7927j07030d6700
$$ -112943 -130411 59004 -193940 77901 -383355 -114696 -165334 -31552 -99479 -206509 -46700
15706a06535A25348P0463p831D6291Q4395b0597q5359m04528d3932I5301L4208
$$ -106535 125348 195811 187980 46291 130686 -20597 -105956 -510484 -43932 95301 129509
15695A29509b46589J21107C80235G2102M20790b69913a29977c0560B85177k3054
$$ 129509 -246589 -125482 380235 72102 492892 -269913 -129977 -30560 285177 262123
15685B62123a44611A00054b67461j23248h8725C8623b17608g8831j79667D0191
$$ 262123 -144611 100054 -267461 -390709 -88725 38623 -217608 -78831 -258498 40191
15674c43327A67175p0070a4571A8462J77450E711Q0155a5150j92770A37889a53375
$$ -343327 167175 97105 -14571 18462 195912 5711 85866 -15150 -207920 137889 -153375
15662A81828d2924I2913C844c02973a4386j65017j53338a19280A25692b92761
$$ 181828 -42924 92913 3844 -302973 -14386 -179403 -332741 -119280 125692 -292761
15651c6198G5384b63644B42393J2828a29594C98212A62673i034k36233H0566O5051
$$ -36198 75384 -263644 242393 255221 -129594 398212 162673 -9034 -245267 80566 145617
15640A45617E8601a07502j82368N2532f4227j92055e4747B17572a47676k56744
$$ 145617 58601 -107502 -289870 -237338 -64227 -256282 -54747 217572 -147676 -404420
15630d04420d5119m3627B65307b43278H6361c598A26397D3000J9659J4522a89558
$$ -404420 -45119 -88746 265307 -243278 86361 -3598 126397 43000 62659 77181 -189558
15618A06238N6061F594J63375a10384E4941c9767C9094a50082A33117h9518j6887
$$ 106238 162299 6594 169969 -110384 54941 -39767 39094 -150082 133117 -89518 -106405
15607a06405j57190m6718B2992b84634M9489O6061A2160i1696j84175J27573A83032
$$ -106405 -263595 -310313 22992 -284634 -235145 -169084 12160 -91696 -275871 -148298 183032
15595a84563A81908b36494C1963c83773C7260K30484I713a40873A37685e4245
$$ -184563 181908 -236494 31963 -383773 37260 267744 9713 -140873 137685 -54245
15584f9549r3022r4305Q6504f0223o736j39338Q9436K6628l83099I3906h4404
$$ -69549 -162571 -256876 -170372 -60223 -66959 -206297 -116861 -90233 -473332 93906 -84404
15572c11766i8304k472j65252g8392H839L48723B1585K31734F7746i5132A68056
$$ -311766 -98304 -100776 -266028 -78392 8839 357562 21585 253319 67746 -95132 168056
15560c15946B34426B7042N4230i8157B24138I8653a43781d7668k15703A67137
$$ -315946 234426 27042 81272 -98157 224138 98653 -143781 -47668 -263371 167137
15549G3690h2872J2355A9405g7290C00420A16365L1598D0103d7621B37459a27574
$$ 73690 -82872 -70517 19405 -77290 300420 116365 147963 40103 -47621 237459 -127574
15537b64556I0403a81668A4805P5974N2539J02990d0503k77688a57163A20278
$$ -264556 90403 -181668 14805 90779 143318 246308 -40503 -318191 -157163 120278
15526A80793a15033A56708J5670F6736N1512J08128a69838A62117f0578k78977
$$ 180793 -115033 156708 172378 66736 118248 226376 -169838 162117 -60578 -339555
15516c39555f4866B13171i3281H3233L8974b9549n1100o0991j35948j07948f246
$$ -339555 -64866 213171 -93281 83233 122207 -29549 -80649 -141640 -277588 -385536 -6246
15504H5245h7237j62812B5822Q3365L9098b14132p7458d8899k50742D6191e8505
$$ 85245 -87237 -250049 25822 109187 148285 -214132 -291590 -48899 -299641 46191 -58505
15492a70728H825c29934I3646a5578j06206j13376E5191c8118H5930c1670o0357
$$ -170728 8825 -329934 93646 -15578 -121784 -235160 55191 -38118 85930 -31670 -92027
15481i2027L1416J1237k10675F5115a5110B0689g4916C1516a54105B8220a6054
$$ -92027 -60611 -49374 -260049 65115 -15110 20689 -74916 31516 -154105 28220 -16054
15469a21578C30953c9291l1329j80834g4164j74486A30441i7122n6985e9592n6409
$$ -121578 330953 -39291 -70620 -251454 -74164 -248650 130441 -97122 -154107 -59592 -116001
15458a16001l4511M9864A17827j1317c67269R9618A38859b20977H1236a7432A42606
$$ -116001 -150512 -100648 117827 106510 -367269 -267651 138859 -220977 81236 -17432 142606
15446E2452a12396k54186e2443A17192j724l7597g4206A4493a35586A03712K33994
$$ 52452 -112396 -366582 -52443 117192 115468 77871 -74206 14493 -135586 103712 337706
15435C37706a68407o7141A91123H5733a6233k73886i7817F2882b1648j80802O7644
$$ 337706 -168407 -235548 191123 85733 -16233 -290119 -97817 62882 -21648 -202450 -134806
15424a34806i291A68845D0120K3554f5901A92893g4428A68975a18283A04795j2271
$$ -134806 -9291 168845 40120 63674 -65901 192893 -74428 168975 -118283 104795 92524
15413I2524M1116C4617R0331f9430H796J7112K15371A6889J77689m5381J6918
$$ 92524 133640 34617 124948 -69430 8796 25908 241279 16889 194578 149197 166115
15402A66115H2344K46798D7088k2794K85545b9499l73220A56364J6312P0780b92026
$$ 166115 82344 329142 47088 24294 309839 -29499 -402719 156364 172676 243456 -292026
15390c01564R3865A8887i3944D1343J05301A3264b44540a00837K5303A8275e3511
$$ -301564 -207699 18887 -93944 41343 146644 13264 -244540 -100837 -75534 18275 -53511
15378B43394I8841L0704K4663n4237m2468a47240q3327e7128j69643C312a39695
$$ 243394 98841 129545 154208 99971 57503 -147240 -230567 -57128 -226771 3312 -139695
15366a60501k8226A5688J35397J27824E2510J55053d31458c9915k50997g8147
$$ -160501 -188727 15688 151085 278909 52510 207563 -431458 -39915 -290912 -78147
15355c93996A24374b54768G5611a0942k00705C2247i3273k20704C7999N3143c63280
$$ -393996 124374 -254768 75611 -10942 -211647 32247 -93273 -313977 37999 91142 -363280
15343f3958A04283e0298C5968f3691r3181I5195g1074H3800M7908b68551A4952
$$ -63958 104283 -50298 35968 -63691 -156872 95195 -71074 83800 131708 -268551 14952
15331F7910J52138g9651j96607B1647K8529b49402a2624B56580F8294M4697j8055
$$ 67910 220048 -79651 -276258 21647 50176 -249402 -12624 256580 68294 112991 94936
15320I4936e0632k83583D36793i313B77565H3937a41306G7406l0050J55675d30530
$$ 94936 -50632 -334215 436793 -9313 277565 83937 -141306 77406 47356 203031 -430530
15308B82121A01862N7929m9960c8216A58655b20281g3107q1442m3174B59962F5731
$$ 282121 101862 159791 109831 -38216 158655 -220281 -73107 -154549 -197723 259962 65731
15296A5397c0195E2682G552J49448c6127o6326J2848I5043C1240f3553B46147
$$ 15397 -30195 52682 7552 157000 -36127 -102453 -89605 95043 31240 -63553 246147
15284i2734j4049A56515a44167O6997b8759B60851a29278A17725B6025L57041
$$ -92734 -106783 156515 -144167 -77170 -28759 260851 -129278 117725 26025 383066
15274C83066D9665M43431B13832C4149c8136A79426e397p3489A50077I239P0983
$$ 383066 49665 493096 213832 34149 -38136 179426 -5397 -78886 150077 9239 80222
15263H0222a1721j30943B4516J12112b24094C42999H1817L17082j86700n0562
$$ 80222 -11721 -142664 24516 136628 -224094 342999 81817 398899 212199 161637
15253A61637k6541J71103K32221R4199M8193k0741k00113N55380k32246C63236
$$ 161637 135096 306199 538420 632619 680812 660071 459958 1015338 783092 363236
15242I2985K39322a45809j87854g2425M365b6412C0632J6853a74220A23889I499
$$ 92985 332307 -145809 -333663 -72425 -68060 -26412 30632 47485 -174220 123889 9499
15230f8443B7362L65185j03022a84816A46095j5859M8456C6868J87119A08359
$$ -68443 27362 392547 289525 -184816 146095 130236 178692 36868 223987 108359
15219B07908J97389A39364R1311b45063d101o526j07061I0624A188K03102g8796
$$ 207908 405297 139364 230675 -245063 -4101 -10627 -117688 90624 1188 204290 -78796
15207B32970C1944a48592M9236d2266j79747h0171j06438G3250J78294g9150J9246
$$ 232970 31944 -148592 -99356 -42266 -222013 -80171 -186609 73250 251544 -79150 -59904
15196e9904B00173p7597a19355a7052D1821J86864D4702J33371B831b04806C7095
$$ -59904 200173 122576 -119355 -17052 41821 228685 44702 178073 2831 -204806 37095
15184B96864c25248j1482B73473b68736F569O3701f0784b7029B25492P5315o2723
$$ 296864 -325248 -336730 273473 -268736 6569 70270 -60784 -27029 225492 300807 238084
15173B38084D3196F96K14989o9268n2239a82929B23522n4261b87105G0827J85862
$$ 238084 43196 696 215685 146417 94178 -182929 223522 169261 -287105 70827 256689
15162B56689F1403a13546q9271Q7936A93339A0525L23508b9883A54450J19237
$$ 256689 61403 -113546 -202817 -114881 193339 10525 334033 -29883 154450 273687
15152B73687a97421E0488J40673a68873O7244A74123a12017B76957q5804J2793
$$ 273687 -197421 50488 191161 -168873 -101629 174123 -112017 276957 191153 203946
15142B03946c2104A33217J22416r5039r577J71284i8961A60625K34734a23831
$$ 203946 -32104 133217 255633 160594 151017 322301 -98961 160625 395359 -123831
15131a86771b8256C20041B6903J94987F247M96386B03950k822P5919o1661E1796
$$ -186771 -28256 320041 26903 221890 6247 502633 203950 201128 277047 215386 51796
15119B07380q1127B233J66800b58732A93825k4054J3261J15334k2970B639O5952
$$ 207380 126253 2233 169033 -258732 193825 169771 183032 298366 275396 2639 68591
15108F8591J61745G0476M3286a66160C6199a11920B39798A14319R909J80546F708
$$ 68591 230336 70476 113762 -166160 36199 -111920 239798 114319 124228 304774 6708
15096A52073g952B86030j10339a37491r168d314q518C09989M3352D9135J41496
$$ 152073 -7952 286030 175691 -137491 -146659 -4314 -12832 309989 353341 49135 190631
15085A90631a02176l2880m4441A60595N8055K63938A08361N51064B59561O8036
$$ 190631 -102176 -135056 -179497 160595 218650 482588 108361 659425 259561 327597
15075C27597E8517b8590D29388g5918C2323O7110e4391k24522B33578j08666J18978
$$ 327597 58517 -28590 429388 -75918 32323 99433 -54391 -278913 233578 124912 243890
15064B43890l2003m3557E5090N6019d3611B51676o9399b19459C1938J14237l8564
$$ 243890 211887 168330 55090 111109 -43611 251676 182277 -219459 31938 146175 107611
15053A07611B1480M07731a4319B65447D5619K54071J42251j88106L4801b52856
$$ 107611 21480 429211 -14319 265447 45619 299690 441941 253835 288636 -252856
15042A06830C138J03907O885L34216A93401a47079E51374C604K34713E48K41178
$$ 106830 3138 107045 113930 448146 193401 -147079 551374 3604 238317 548 241726
15031B41726q4947J43834j08252q6514K64351j81280b8459J820l9049D46229A72464
$$ 241726 156779 300613 192361 105847 370198 188918 -28459 -26639 -65688 446229 172464
15019B96985l5124M1208d5587B12250a05056E4463b47023B54806D1133Q5222a89448
$$ 296985 261861 303069 -45587 212250 -105056 54463 -247023 254806 41133 126355 -189448
15007C26992j34868J011J4784G9724J04826R0020H3810B6734L26078j50687a58304
$$ 326992 192124 193135 207919 79724 184550 274570 83810 26734 352812 202125 -158304
14995F6823b0712A95886L22844I3237j447B3698g846B11449D2474L62624a43860
$$ 66823 -20712 195886 518730 93237 91790 23698 -7846 211449 42474 405098 -143860
14983D46634A69868j5771M50680F2650M76641j96702m6864b6821C25499N0612
$$ 446634 169868 154097 604777 62650 539291 342589 295725 -26821 325499 376111
14973C76111C5673J52155J59179j27793J512J67401j53186J49257j60826J92998
$$ 376111 35673 187828 347007 219214 220726 388127 234941 384198 223372 416370
14963D16370A41912a02898B63563j16321j2307K70134q2154R5392B1745M76033
$$ 416370 141912 -102898 263563 147242 134935 405069 322915 418307 21745 497778
14953D97778a06364A39489K04133a8895B07230M7119J939o0207K42535A55002
$$ 497778 -106364 139489 343622 -18895 207230 254349 256288 196081 438616 155002
14942B13544O3386j26278K0628J51890m7091o7473G4799f2890A50114J33873A40502
$$ 213544 276930 150652 171280 323170 276079 208606 74799 -62890 150114 283987 140502
14930B45531K69561B36801L3584q0174J37845k1036A23896q900K56120J23113
$$ 245531 515092 236801 270385 190211 328056 307020 123896 114996 371116 494229
14920D94229A02252L1203J42044N339A22842O2400N5581E0368L49860J62335q3817
$$ 494229 102252 133455 275499 280838 122842 185242 240823 50368 400228 562563 478746
14909D78746B39215Q6752A47297K26411J54591C863J91913K25620B04997J42826
$$ 478746 239215 325967 147297 373708 528299 3863 195776 421396 204997 347823
14899C47823m068J02148E5115L88918A76456E6966K59162o3064N4784l8743F5654
$$ 347823 343755 445903 55115 444033 176456 56966 316128 253064 307848 269105 65654
14887A11486J69634M60178l34287l7145A62306J44219J60457k24572J42113G5705
$$ 111486 281120 741298 407011 369866 162306 306525 466982 242410 384523 75705
14876D33465J13890k20064J55088j10129K05962A46771L51775a26262B23901J98047
$$ 433465 547355 327291 482379 372250 578212 146771 498546 -126262 223901 421948
14866D21948B02516K32733L9530p8999P3685O6154A93215D1430K02118P5042J77519
$$ 421948 202516 435249 474779 395780 469465 535619 193215 41430 243548 318590 496109
14855D96109j55379M7499l3308K06159k37942O5662J12403j4638k22090J16607
$$ 496109 340730 388229 354921 561080 323138 388800 501203 486565 264475 381082
14845C81082j47634R8360a16410A44365K00934j27613K04273J34688k52951l8271
$$ 381082 233448 331808 -116410 144365 345299 217686 421959 556647 303696 265425
14835B65425P4303J68059k44967L01746j72453J45326O4622I5466L51407C5054
$$ 265425 339728 507787 262820 564566 392113 537439 602061 95466 446873 35054
14824A09740J78200P0726J50204R7768a1954C19294j3365O4025J10533j77993
$$ 109740 287940 358666 508870 606638 -11954 319294 305929 369954 480487 302494
14814C02494M4986J57865j62189M8134q9731L5428K27276j08887j63957K19289
$$ 302494 347480 505345 343156 391290 301559 336987 564263 455376 291419 510708
14804E10708O2008j17963l6996j9119J83478j86591K04494n0450B28419P6484
$$ 510708 572716 454753 417757 398638 582116 395525 600019 549569 228419 304903
14794C04903J99036L40750B34657J80908j17518j07033J38394N6637j54829N06788
$$ 304903 503939 844689 234657 415565 298047 191014 329408 386045 231216 738004
14784G38004k10706j83268A28105N60457B62551K91134j83341L68399k83330N85931
$$ 738004 527298 344030 128105 688562 262551 553685 370344 738743 455413 1041344
14774A041344n13061j09139j7436A76952R9447L31864B59576K76663q1353n9858
$$ 1041344 528283 419144 401708 176952 276399 608263 259576 536239 454886 395028
14764C95028m321L60980k92577J63582J8685A84953M48797J38057C82565N59356
$$ 395028 390707 751687 459110 622692 641377 184953 633750 771807 382565 941921
14754I41921C15006e6871C43647K62010B65236N39528k66159K81577l36276K22408
$$ 941921 315006 -56871 343647 605657 265236 804764 538605 820182 483906 706314
14744G06314j80777P3429j64901P2705J63257j56316J03300B91529K75403J07788
$$ 706314 525537 598966 434065 506770 670027 513711 617011 291529 566932 674720
14734F74720k86295J79793R4870m5883q8497J92963q0390K81426k48858m1500
$$ 674720 388425 568218 663088 617205 528708 721671 641281 922707 673849 632349
14724F32349r6230M091O501P8236n1774K89175k70486K56829l96635j99562L20272
$$ 632349 536119 540210 546711 624947 573173 862348 591862 848691 452056 252494 572766
14713E72766J7581L28054D48900J73930M031L40471k55841P2057J76090k19058
$$ 572766 590347 918401 448900 622830 626861 967332 711491 783548 959638 740580
14703G40580Q19j10058L77503k89854C17671P00559l27431M7545K52734m49159
$$ 740580 741399 631341 1008844 718990 317671 1018230 690799 738344 991078 541919
14693E41919r446j17469l8484M32219j29951Q655j15072K68983l72104L4874J93440
$$ 541919 532473 415004 376520 808739 678788 687443 572371 841354 469250 504124 697564
14682F97564M2910J87708J24518k07760j67923K15902l37148L53406N6279q1662
$$ 697564 740474 928182 1052700 844940 677017 892919 555771 909177 965456 883794
14672H83794J34326j46136K04613J2536j96105R3986N6287k63235m2932j76208
$$ 883794 1018120 871984 1076597 1089133 893028 987014 1043301 780066 737134 560926
14662E60926N78551m37533r4862K62841q1371K1679j49701J40142M31908j91086
$$ 560926 1139477 701944 607082 869923 788552 810231 660530 800672 1232580 1041494
14652A041494k22907N54237k14885k52320L48829l26958Q9334o3628J72199J26906
$$ 1041494 818587 1372824 1157939 905619 1254448 927490 1016824 953196 1125395 1252301
14642A252301j75271R0930J5852k55565P7592L69497j78299k08070J01381r8658
$$ 1252301 1077030 1167960 1183812 928247 1005839 1375336 1197037 988967 1090348 991690
14632I91690K38910k21272k59856L80765J5143P4455k68819J10446L84752l26842
$$ 991690 1230600 1009328 749472 1130237 1145380 1219835 951016 1061462 1446214 1119372
14622A119372M2086J10923j99615K51293p1093j9733n2255J28154j40175P1978
$$ 1119372 1161458 1272381 1072766 1324059 1252966 1233233 1180978 1309132 1168957 1240935
14612A240935m95580M93343j80745M19335j2742J80429m41184N4613J17046Q6772
$$ 1240935 745355 1238698 1057953 1477288 1464546 1644975 1203791 1258404 1375450 1462222
14602A462222k02533L8607J27243r1726J47289o1867j03755k7502l24892N12626
$$ 1462222 1259689 1298296 1425539 1333813 1481102 1419235 1315480 1287978 963086 1475712
14592A475712N8046j97565R7501k3445J44637K226J03246j11394q4325k0624J09686
$$ 1475712 1533758 1336193 1433694 1410249 1554886 1557112 1660358 1548964 1464639 1444015 1553701
14581A553701K5961J1660J83014k59823l86623N6374N24091j64933k6890M56965
$$ 1553701 1579662 1591322 1774336 1514513 1127890 1184264 1708355 1543422 1516532 1973497
14571A973497m05631K9239M34080j15795k78087L88420j00714L85206j39099O13732
$$ 1973497 1567866 1597105 2031185 1915390 1637303 2025723 1925009 2310215 2171116 2784848
14561B784848l22569l44140O45023l60689n4118M68261M2039j13297M58933J90100
$$ 2784848 2462279 2118139 2763162 2402473 2348355 2816616 2858655 2745358 3204291 3394391
14551C394391N22469R37097J228999M708418R946306J4431367L144548A7744294
$$ 3394391 3916860 4853957 6082956 10791374 20737680 35169047 38313595 17744294
14542F672347l168542j127057l20439k37036j29139k26145M10829l21311J82615
$$ 6672347 3503805 2376748 2056309 1819273 1690134 1463989 1874818 1553507 1736122
14533A736122P1214P5064L93980l68275l01266R6019Q5930L9845L95165l40457
$$ 1736122 1807336 1882400 2276380 1908105 1606839 1702858 1788788 1828633 2223798 1883341
14523A883341N7775P8336j44384M21058j76293k24902J27882J73036K0159Q403
$$ 1883341 1941116 2019452 1875068 2296126 2119833 1894931 2022813 2195849 2216008 2224411
14513B224411J69444l0846j92462K6915j6219O64038l32674j42789J96012j82537
$$ 2224411 2393855 2363009 2170547 2197462 2181243 2845281 2512607 2369818 2565830 2383293
14503B383293j00581O9405L58224m24124J25387M01871l00649K8672K55599k01317
$$ 2383293 2282712 2352117 2710341 2286217 2411604 2813475 2512826 2541498 2797097 2595780
14493B595780L50638q8199j25380O69556o92228L75622J49781k25831J4440J4757
$$ 2595780 2946418 2858219 2732839 3402395 2710167 3085789 3235570 3009739 3024179 3038936
14483C038936j13235K11549j66493j9781M53019j48690k79562R0520K25379r0425
$$ 3038936 2925701 3137250 2970757 2950976 3403995 3255305 2975743 3066263 3291642 3201217
14473C201217K14990r2502L69595k00154j96997R9276K68078K64842m17298J64668
$$ 3201217 3416207 3323705 3693300 3493146 3296149 3395425 3663503 3928345 3511047 3675715
14463C675715o6518K6209P8201j9725P03J81830K22282j69196j9367k45532J154572
$$ 3675715 3609197 3635406 3713607 3693882 3694585 3876415 4098697 3929501 3910134 3664602 4819174
14452D819174j85763j25984k29247j32325L46109k64128Q7881Q3854O52030n86163
$$ 4819174 4633411 4507427 4278180 4145855 4491964 4227836 4315717 4399571 5051601 4465438
14442D465438L24053J44622J70496j77066k9452K02513K06607j87659K36949J50225
$$ 4465438 4789491 4934113 5104609 4927543 4898091 5100604 5307211 5119552 5356501 5506726
14432E506726p3751J48804j30361K82459k1113M3490N1674o6670O44598o12480
$$ 5506726 5432975 5581779 5451418 5733877 5712764 5756254 5807928 5741258 6385856 5773376
14422E773376K57555N35574k71027N2640M48368Q5551J9545L43617k69704K34345
$$ 5773376 6030931 6566505 6295478 6348118 6796486 6882037 6901582 7245199 6975495 7209840
14412G209840L28761k45229j11022N60433L8686K20486l14039M13082J1922J21706
$$ 7209840 7538601 7293372 7182350 7742783 7781469 8001955 7687916 8100998 8112920 8234626
14402H234626K07331J32550J42454J48033P978K27213J30971R2505j10757M74737
$$ 8234626 8441957 8574507 8716961 8864994 8872972 9100185 9231156 9323661 9212904 9687641
14392I687641j8548L03094J72280M77224Q3896p0444L64413O9269K7998J88547
$$ 9687641 9669093 9972187 10144467 10621691 10705587 10635143 10999556 11068825 11096823 11285370
14382A1285370J42390N01528K92065o9931L84965k16782P13616Q1239N68835L04153
$$ 11285370 11427760 11929288 12221353 12151422 12536387 12319605 13033221 13114460 13683295 13987448
14372A3987448K35379N38196k0317M11147J55577L34557L32152L08276N04084
$$ 13987448 14222827 14761023 14740706 15151853 15307430 15641987 15974139 16282415 16786499
14363A6786499K86797M12353K78388M34420M53050K52426L40608P41330M31780
$$ 16786499 17073296 17485649 17764037 18198457 18651507 18903933 19244541 19985871 20417651
14354B0417651N39623K28765Q06713O31102N81994M12365N12072L92990O58497
$$ 20417651 20957274 21186039 21992752 22623854 23205848 23618213 24130285 24523275 25181772
14345B5181772R42359L80869Q17724L68879J262724O02420Q13497R83894N76232
$$ 25181772 26124131 26505000 27322724 27691603 28954327 29556747 30370244 31354138 31930370
14336C1930370R38552Q85866J249235J236947Q09000J358647J344717J036067
$$ 31930370 32868922 33754788 35004023 36240970 37049970 38408617 39753334 40789401
14328D0789401J249194J626133J668162J251719J575739J525496K045885J914968
$$ 40789401 42038595 43664728 45332890 46584609 48160348 49685844 51731729 53646697
14320E3646697J690166K349156K168877K092120K414280K654382K952549K779954
$$ 53646697 55336863 57686019 59854896 61947016 64361296 67015678 69968227 72748181
14312G2748181K530296L299549L926284L278303L783817M047241M228974M763963
$$ 72748181 75278477 78578026 82504310 85782613 89566430 93613671 97842645 102606608
14304A02606608M662385N292056N368929N602333O479640O131301P077252P454515
$$ 102606608 107268993 112561049 117929978 123532311 130011951 136143252 143220504 150675019
14296A50675019Q268683Q068023R169081R379438R831197J0892319J1252535J1952002
$$ 150675019 158943702 167011725 176180806 185560244 195391441 206283760 217536295 229488297
14288B29488297J2489272J3112238J3479802J4664375J4234710J5435990J5268727
$$ 229488297 241977569 255089807 268569609 283233984 297468694 312904684 328173411
14281C28173411J5165041J4940082J4901834J4268253J3321121J1857926J0688664
$$ 328173411 343338452 358278534 373180368 387448621 400769742 412627668 423316332
14274D23316332Q225322N478837N61657m039209l253595j894468l231212m687969
$$ 423316332 431541654 437020491 437582148 433542939 430289344 428394876 425163664 420475695
14266D20475695r415500j1503785j2119798j4051346j5040173j5930219j5564462
$$ 420475695 411060195 399556410 387436612 373385266 358345093 342414874 326850412
14259C26850412j5829264j5570944j4962685j4124583j3907692j3173419j2832833
$$ 326850412 311021148 295450204 280487519 266362936 252455244 239281825 226448992
14252B26448992j2061271j1177570j0891983j0286122r232701q965962q860805
$$ 226448992 214387721 203210151 192318168 182032046 172799345 163833383 154972578
14245A54972578p505477o867593o852922o754229o246060n702339n326570m571081
$$ 154972578 147467101 140599508 133746586 126992357 120746297 115043958 109717388 105146307
14237A05146307m635173m877630l856405m121305l823545l341817k930435l357211
$$ 105146307 100511134 95633504 91777099 87655794 83832249 80490432 77559997 74202786
14229G4202786k706647k922462k559792k834164k244953k546028k135482j672345
$$ 74202786 71496139 68573677 66013885 63179721 60934768 58388740 56253258 54580913
14221E4580913k172080j474566j844704j605184j477365j809537j360330j060725
$$ 54580913 52408833 50934267 49089563 47484379 46007014 44197477 42837147 41776422
14213D1776422j073820j365975j277168j471579r22581r45538k08011j224248
$$ 41776422 40702602 39336627 38059459 36587880 35665299 34719761 34511750 33287502
14205C3287502j195815j204423o62733j012191n57103m86109q96117r87575m55030
$$ 33287502 32091687 30887264 30224531 29212340 28655237 28169128 27273011 26285436 25830406
14196B5830406j063750m45908o03859o41792m80184l80925p79685k47289p06228
$$ 25830406 24766656 24320748 23716889 23075097 22594913 22213988 21434303 21187014 20480786
14187B0480786m98130n89761m48029j73439l03136m27311n53936m54737k28577
$$ 20480786 19982656 19392895 18944866 18771427 18468291 18040980 17487044 17032307 16803730
14178A6803730l35075l58927o86472j89013k49738k99935k05137l07756l76075
$$ 16803730 16468655 16109728 15423256 15234243 14984505 14684570 14479433 14171677 13795602
14169A3795602k52634l69762L7167k63760l08133M1305m33374o4748k69235J410
$$ 13795602 13542968 13173206 13210373 12946613 12638480 12679785 12246411 12181663 11912428 11913838
14159A1913838n87580j56715m59018L6273k19029o0626k67568P4196J04996r25326
$$ 11913838 11326258 11169543 10710525 10746798 10527769 10467143 10199575 10273771 10378767 9453441
14149I453441j4604J37617k16914k27172p4638j20491k47626m8741J9546k83480
$$ 9453441 9438837 9576454 9359540 9132368 9057730 8937239 8689613 8640872 8660418 8376938
14139H376938m51419L58829k64591m65558K39479o40469J42648M51595l33232
$$ 8376938 7925519 8284348 8019757 7554199 7793678 7153209 7295857 7747452 7414220
14130G414220j99846j12812l15394M00019j30682o61438N86536m50836o1284l00987
$$ 7414220 7214374 7101562 6786168 7186187 7055505 6394067 6980603 6529767 6468483 6167496
14120F167496O7968J10212k71324j25927L3805l80325K94292M7943k88194J6978
$$ 6167496 6235464 6345676 6074352 5948425 5982230 5601905 5896197 5944140 5655946 5672924
14110E672924j25802r758q4604j58004J66375k61120P2047J00573j34482q2262
$$ 5672924 5547122 5537364 5452760 5294756 5461131 5200011 5272058 5372631 5238149 5155887
14100E155887j55699k04607J29046k89855j57029J39681j65767k08575J85593
$$ 5155887 5000188 4795581 4924627 4634772 4477743 4617424 4451657 4243082 4428675
14091D428675k46029N24204j19882m41585M1692p4829K08846j49410r4775l4438
$$ 4428675 4182646 4706850 4586968 4145383 4187075 4112246 4321092 4171682 4076907 4042469
14081D042469J17366j27765k38980J6744L19364j01980j02304j12758o25191M97770
$$ 4042469 4159835 4032070 3793090 3809834 4129198 4027218 3924914 3812156 3186965 3684735
14071C684735j90406j71184N84896k58289l48186L31559l52235K52315n60208
$$ 3684735 3494329 3323145 3908041 3649752 3301566 3633125 3280890 3533205 2972997
14062B972997K56412K38219k72930J55921O5664m2656k32763J05933K5270k59283
$$ 2972997 3229409 3467628 3194698 3350619 3416283 3373627 3140864 3246797 3272067 3012784
14052C012784j91243M24002N5820k79067o0121J73216m52262l70439O76706j39816
$$ 3012784 2821541 3245543 3301363 3022296 2962175 3135391 2683129 2312690 2989396 2849580
14042B849580q6214j78462J17316n0992j24988K8686J63647k79051N8755J40921
$$ 2849580 2763366 2584904 2702220 2651228 2526240 2554926 2718573 2439522 2498277 2639198
14032B639198k10108N4079j94086q2024K03499l32468k8871J07115L6702n7848
$$ 2639198 2429090 2483169 2289083 2207059 2410558 2078090 2049219 2156334 2193036 2135188
14022B135188O9602l35299K97736M22941n39476K984J22315J85557m53800K12641
$$ 2135188 2204790 1869491 2167227 2590168 2050692 2053676 2175991 2361548 1907748 2120389
14012B120389o7572j36493J89935j78530k74347K7288K86766M7323P4302p5789
$$ 2120389 2052817 1916324 2106259 1927729 1653382 1680670 1967436 2014759 2089061 2013272
14002B013272p2625m1078J31166l47451J28433k91963J09717K33090k13502o4552
$$ 2013272 1940647 1899569 2030735 1683284 1811717 1519754 1629471 1862561 1649059 1584507
13992A584507K71454l06216N53922P70058K772985Q777375J4484801R814400j6352834
$$ 1584507 1855961 1549745 2103667 2873725 5646710 14424085 28908886 38723286 22370452
13983B2370452A0912424m473985j835330o96493p44153j23367q3473j56664l30696
$$ 22370452 10912424 6438439 4603109 3906616 3162463 3039096 2955623 2798959 2468263
13974B468263k46485K79259j81741l27897J63588j7008k46771k45539L76747m3414
$$ 2468263 2221778 2501037 2319296 1991399 2154987 2137979 1891208 1645669 2022416 1979002
13964A979002j68687Q8802K8376n27068P19468k50353j27219K5207n6739l2973
$$ 1979002 1810315 1899117 1927493 1400425 2119893 1869540 1742321 1767528 1710789 1677816
13954A677816j58586j79058M09254k46945j76454J31969p2279K0790K55565j33278
$$ 1677816 1519230 1340172 1749426 1502481 1326027 1457996 1385717 1406507 1662072 1528794
13944A528794l65828N5565L33530j11666q134n5356r2901K64631o3739k66559
$$ 1528794 1162966 1218531 1552061 1440395 1432261 1376905 1284004 1548635 1484896 1218337
13934A218337R4924K16399n45732J00643K77973L6788k45884L93884l76678j50939
$$ 1218337 1313261 1529660 983928 1084571 1362544 1399332 1153448 1547332 1170654 1019715
13924A019715J9152M67722r6657j81948K7702r9568J10283p2960l32528P1898
$$ 1019715 1038867 1506589 1409932 1227984 1255686 1156118 1266401 1193441 860913 932811
13914I32811K32833k0796r000j02302M04715k4613n35014M16410l05148L26418
$$ 932811 1165644 1144848 1135848 1033546 1438261 1413648 878634 1295044 989896 1316314
13904A316314k40894J5204K2281k423K58594j55959j68132j38608N05290l92745
$$ 1316314 1075420 1090624 1112905 1110482 1369076 1213117 1044985 906377 1411667 1018922
13894A018922O6007K67614k41779r7080N069j83236K31347K37207j60826k64317
$$ 1018922 1084929 1352543 1110764 1013684 1018753 835517 1066864 1304071 1143245 878928
13884H78928J95440j59665j88807K89256m292P1467l29993l1728j09931L53594
$$ 878928 1074368 914703 725896 1015152 1010860 1082327 752334 720606 610675 964269
13874I64269j26190K81178j34803J21604j9354m07112J5069J95392J79600E00174
$$ 964269 838079 1119257 984454 1106058 1086704 679592 694661 890053 1069653 500174
13863I47888j71960O8782k02519K45124j54859N9677R3452J07054k51810p007
$$ 947888 775928 844710 642191 887315 732456 792133 885585 992639 740829 733822
13853G33822j38004N8105J17721j23673J23587k71944J16888L64156m58137M67147
$$ 733822 595818 653923 771644 647971 771558 499614 616502 980658 522521 989668
13843I89668j21883J16893m87549K00995K54540l76267L34565M6923P7761k58003
$$ 989668 867785 984678 497129 698124 952664 576397 910962 957885 1035646 777643
13833G77643J99940j77499N8947l41779L02406C87096Q13164n05552J23910O135
$$ 777643 977583 800084 859031 517252 819658 387096 1200260 694708 818618 824753
13823H24753J99615l93599p3475K75591p3903j3770k95651J92126L832J2560R7106
$$ 824753 1024368 630769 557294 832885 758982 745212 449561 641687 645519 658079 755185
13812G55185P6170C88214K54470n8691L26351N4453j13977J83169k19910P5430
$$ 755185 831355 388214 642684 583993 910344 964797 850820 1033989 814079 889509
13802H89509l25156j84419J39136l3319R6780K65866l5826k70666r2364P8682
$$ 889509 564353 379934 519070 485751 582531 848397 812571 541905 449541 528223
13792E28223o6132K11512J96280B96237M35076l14790R8960Q4488M6171K20583
$$ 528223 462091 673603 869883 296237 731313 416523 515483 599971 646142 866725
13782H66725J4231k40262j74784j36686E4384L25543J19757m0539J74136K50261
$$ 866725 880956 640694 465910 329224 54384 379927 499684 459145 633281 883542
13772H83542l09098R2211p5754K9071L9054r721j16916J50227n7096n2205J88284
$$ 883542 574444 666655 590901 619972 659026 649305 532389 682616 625520 573315 761599
13761G61599o1834C44901L61652J40646j67449C35290K99574k26052j94787K74032
$$ 761599 699765 344901 706553 847199 679750 335290 634864 408812 214025 488057
13751D88057B20404K40403J2481L26765C35926L03399E8389O88496k40546K16893
$$ 488057 220404 460807 473288 800053 335926 639325 58389 746885 506339 723232
13741G23232k84188k0009q4751L38178J1621A12137M35288j50944J69225A98401
$$ 723232 439044 419035 334284 672462 684083 112137 547425 396481 565706 198401
13730A21349L89957j75975J07042L80302l14234j44294j13206L6994O4215K39715
$$ 121349 511306 335331 442373 822675 508441 364147 250941 287935 352150 591865
13720E91865B74985P7901J86642n5080p6213J76094K04054l78887J14396k01770
$$ 591865 274985 352886 539528 484448 408235 584329 788383 409496 523892 322122
13710C22122r8776M99965k39726l8912j45958j16380K56980J8327j6152F8989
$$ 322122 223346 723311 483585 444673 298715 182335 439315 457642 441490 68989
13699A19733K98726j3674j16266P6034J97062j16843n4062j15887H5332M80906
$$ 119733 418459 404785 288519 364553 561615 444772 390710 274823 85332 566238
13689E66238K55719C19277n4251m3541J54758A69907M55156B70805K04346k03182
$$ 566238 821957 319277 265026 221485 376243 169907 625063 270805 475151 271969
13679B71969K92404k0358J70620n2575k31269P2129P1841B80800Q6214K97692
$$ 271969 564373 544015 714635 662060 430791 502920 574761 280800 367014 664706
13669F64706k55046j18133j28996K00913e7795B69492J86923A75251J08665j40017
$$ 664706 409660 291527 162531 363444 -57795 269492 456415 175251 283916 143899
13659A43899M94604o1642B83570j01605K53526j50565K8908R5172m4303q9622
$$ 143899 638503 576861 283570 181965 435491 284926 313834 409006 364703 275081
13649B75081K29600j20707K6740e8121C42935P1663j71305L0060J10795j20072
$$ 275081 504681 383974 410714 -58121 342935 414598 243293 273353 384148 264076
13639B64076K85377A39494J88791E503J70006O1346J34672p4855N3386A45748
$$ 264076 549453 139494 328285 5503 175509 236855 371527 296672 350058 145748
13628C51398n1378K77773k04322j26578C3185J54301J38912J72029A87090l1771
$$ 351398 300020 577793 373471 246893 33185 187486 326398 498427 187090 155319
13618A55319J00276j13927M45959n9183A12222K58901J83394q1509j22709J88255
$$ 155319 255595 141668 587627 528444 112222 371123 554517 473008 350299 538554
13608E38554B68596J468K49242g0604D91309A66298L93479j71179M314M5572j06179
$$ 538554 268596 270064 519306 -70604 491309 166298 559777 388598 392912 438484 332305
13597C32305J18818j35820k3626M6997A50060J25305k6820F4873L01571k0992
$$ 332305 451123 315303 291677 338674 150060 275365 248545 64873 366444 345452
13587C45452C8741J87582J61746J69868A39152J00340K75672A97531L37685n1205
$$ 345452 38741 226323 388069 557937 139152 239492 515164 197531 535216 484011
13577D84011G1637n646L05957A24269L26616j20351q5599o5735K35424j01181
$$ 484011 71637 65991 371948 124269 450885 330534 244935 179200 414624 313443
13567C13443o8194l8388J7450o2724G6758J63057A01493L10283l94A59197K0909
$$ 313443 245249 206861 224311 161587 76758 239815 101493 411776 411382 159197 180106
13556A80106J18308n8290J04059A56643J1697J64060J32425A54679L4462m5693
$$ 180106 298414 240124 344183 156643 168340 332400 464825 154679 189141 143448
13546A43448J74168C2916K93309C3683M60111A08425K70948a270D2084P8718K17153
$$ 143448 317616 32916 326225 33683 493794 108425 379373 -1270 42084 120802 337955
13535C37955K38956k27520A60835e5966E0184N8409K26741a87624A16847K27395
$$ 337955 576911 349391 160835 -55966 50184 108593 335334 -187624 116847 344242
13525C44242A61494k5129D5332M29987H4863M73013k57176J00367A71062J28248
$$ 344242 161494 136365 45332 475319 84863 557876 300700 401067 171062 299310
13515B99310A14102J97911J08199j22358C5324P8217Q9037r397a16147C45180
$$ 299310 114102 312013 420212 297854 35324 113541 202578 193181 -116147 345180
13504D53102R329A03418c04044C71725A85464J25643a2270A99809P1751J37205
$$ 453102 462431 103418 -304044 371725 185464 311107 -12270 199809 271560 408765
13494D08765j94697C9800J60940C4211g1889D11438j38906E6311J62059I335d9309
$$ 408765 214068 39800 200740 34211 -71889 411438 272532 56311 218370 9335 -49309
13482D694J67373A5919K37011j5843l7717A256a0290A21129K63074a3551C44567
$$ 4694 172067 15919 252930 237087 199370 1256 -10290 121129 384203 -13551 344567
13470D41547j82055a20365D80241F0339K0633K6760J7748J51298P3739r3444k5858
$$ 441547 259492 -120365 480241 60339 80972 107732 125480 276778 350517 257073 231215
13459B31215j12363L93123A73520m3081J31707j13020m8350L03919b8167B6017
$$ 231215 118852 511975 173520 130439 262146 149126 100776 404695 -28167 26017
13448A41539o0470l1877R2921J21797a08476A3860K8504J80930A5473J17483J59714
$$ 141539 81069 49192 142113 263910 -108476 13860 42364 223294 15473 132956 292670
13437B92670j22145L7175J77809j03571J6201q8319c0043A85016F933a72226A69943
$$ 292670 170525 207700 385509 281938 298139 209820 -30043 185016 6933 -172226 169943
13425D3984Q4903P8076J62972j00302E9429M5747j2989E507J40110c7093H4124
$$ 43984 128887 206963 369935 269633 59429 105176 92187 5507 145617 -37093 84124
13413C53375J39244E8756K61961K91042A52245K94670B09182e4094A26111g9932
$$ 353375 492619 58756 320717 611759 152245 446915 209182 -54094 126111 -79932
13402C41169b47764A02959J58860E8040K65350j32894J01570I9299J90996A19671
$$ 341169 -247764 102959 261819 58040 323390 190496 292066 99299 290295 119671
13391D94335A29548a14751N3945C60650j12267A15349K81114D127J97891d6619
$$ 494335 129548 -114751 -60806 360650 248383 115349 396463 4127 202018 -46619
13380E3288K01344h1525l4992d10C33420R433A22815L709L31584a42639D11435
$$ 53288 254632 -81525 -116517 -410 333420 342853 122815 126524 458108 -142639 411435
13368C25491l1755A35050n9860a62219I2886J33784j08630K16794C4804O17562
$$ 325491 293736 135050 75190 -162219 92886 226670 118040 334834 34804 652366
13358F52366C07694L0692h5972A41021i524C82692n4543E9278J55244l3783K5837
$$ 652366 307694 338386 -85972 141021 -9524 382692 328149 59278 214522 180739 206576
13347B06576F1184a32781B84315J59929C6705a15840B17847j05972J56326j02331
$$ 206576 61184 -132781 284315 444244 36705 -115840 217847 111875 268201 165870
13337A65870N7643N0866a47514B0549J09112k9761L1667J13471K2554a95683B54826
$$ 165870 223513 274379 -147514 20549 129661 99900 131567 245038 267592 -195683 254826
13325A41003J24420D9520f7563R556B19349A08965J25891a0477j19441D39104
$$ 141003 265423 49520 -67563 -58007 219349 108965 234856 -10477 -129918 439104
13314b389C19376I4538H47J10804a49025B23676Q5447A45172K53258j23855A9526
$$ -2389 319376 94538 847 111651 -149025 223676 309123 145172 398430 274575 19526
13302B69670G9255b73388B07361M7587E0633L13221l6270j30240k0037L7389a80494
$$ 269670 79255 -273388 207361 254948 50633 363854 327584 197344 177307 214696 -180494
13290A00919l5808J885J99404O664C5437L20496j25114b8574A03686N2407G6020
$$ 100919 65111 66996 266400 273064 35437 355933 230819 -28574 103686 156093 76020
13278B21301j03029a52245A4775J48043g2159B9582F634J5878J5523A0724J62118
$$ 221301 118272 -152245 14775 162818 -72159 29582 6634 22512 38035 10724 172842
13267A72842a04268E02556B1149K75029a04167d579k6684A74772m5265B3397K95268
$$ 172842 -104268 502556 21149 296178 -104167 -4579 -31263 174772 129507 23397 318665
13256C18665j09456Q3658C7375c1991B4449J40870i5994A29484l3636h9677J2059
$$ 318665 209209 292867 37375 -31991 24449 165319 -95994 129484 95848 -89677 -77618
13245g7618C25435A61676L6351D8487K36727O5612A40855M7386K7167j3543p5696
$$ -77618 325435 161676 198027 48487 285214 350826 140855 188241 215408 201865 126169
13234A26169D9799P2896P2917F2992M24773I0533D3724L21307c51573d1473j12821
$$ 126169 49799 122695 195612 62992 487765 90533 43724 365031 -351573 -41473 -154294
13223a54294c1332o0506B60174a82894O5071L0767L5771B15956n0790a04348j7534
$$ -154294 -31332 -91838 260174 -182894 -117823 -87056 -51285 215956 165166 -104348 -121882
13212a21882f614k96461A77125e6810n9359C41222A63594p5086l9182k2491f7971
$$ -121882 -6614 -303075 177125 -56810 -116169 341222 163594 88508 49326 26835 -67971
13200A33231d022B5237J22257J9647M5923l8605q1499L79004A55128m2239r265
$$ 133231 -4022 25237 147494 167141 213064 174459 92960 471964 155128 112889 103624
13189A03624L73290G381K0777h012B84822A41705f635C7077J76575l4963k6577
$$ 103624 476914 7381 28158 -8012 284822 141705 -6635 37077 213652 178689 152112
13178A52112d9543a4672C9731K29838d25077C7199P4621a28424A07539a65367
$$ 152112 -49543 -14672 39731 269569 -425077 37199 111820 -128424 107539 -165367
13167E3687a61201B24478D1962J71866k6454E8321a04035F7457R3150p1565K67670
$$ 53687 -161201 224478 41962 213828 187374 58321 -104035 67457 160607 89042 356712
13156C56712a34785C2980g5650G8898g7752K683j48849E7459L06573A38555J9590
$$ 356712 -134785 32980 -75650 78898 -77752 -75069 -223918 57459 364032 138555 158145
13145A58145n9467G236J07884l3246a00490D1014O6107O150j5229r870K72922
$$ 158145 98678 7236 115120 81874 -100490 41014 107121 113271 98042 88172 361094
13134C61094A54724b23769A24275m2216c90473a25050H4041j3554j6975c02217
$$ 361094 154724 -223769 124275 82059 -390473 -125050 84041 70487 53512 -302217
13123A94350f3907D4073h3633C3053R2878h6767B16954r6715J16838h9434C91991
$$ 194350 -63907 44073 -83633 33053 125931 -86767 216954 120239 237077 -89434 391991
13111a57771C07295f4613B05949E9613L31139A67137B3003P3033A2482a92551
$$ -157771 307295 -64613 205949 59613 390752 167137 23003 96036 12482 -192551
13100A79895H0486Q3192o3461R3564E816a27489j71046B64032O7490a49691C67484
$$ 179895 80486 163678 100217 193781 5816 -127489 -298535 264032 331522 -149691 367484
13088A71938N9978q9476o1789k6024a9358C85636c18E3701K29136E6705e6882
$$ 171938 231916 142440 80651 54627 -19358 385636 -318 53701 282837 56705 -56882
13076e319A35609b46050g3930G7469c5752D9289e9799B59507o1517J75621j48784
$$ -5319 135609 -246050 -73930 77469 -35752 49289 -59799 259507 197990 373611 224827
13065B24827O0688A19031a35639j9653B56744J18864A73312m2554d5180j6849
$$ 224827 285515 119031 -135639 -155292 256744 375608 173312 130758 -45180 -62029
13055f2029G148h6695H1974K0862f2160I0476I509g9579B18249H8115L15044m7799
$$ -62029 7148 -86695 81974 102836 -62160 90476 9509 -79579 218249 88115 403159 355360
13043C55360F4677K45583C5492a61071B83789A32727b8188M323H5188K06278a0747
$$ 355360 64677 310260 35492 -161071 283789 132727 -28188 -23865 85188 291466 -10747
13031A51056N0873b1971j77075e2125j08163D1702J64956L5177a26863J9467G3884
$$ 151056 201929 -21971 -199046 -52125 -160288 41702 206658 241835 -126863 -107396 73884
13019B5635f3818A21209N8085k2038e5817D54762f1189A65011L8852H1830c4648
$$ 25635 -63818 121209 179294 157256 -55817 454762 -61189 165011 203863 81830 -34648
13007B16151B7323a05567j25594p5179a10155B7359b88132A14711M0029J71929
$$ 216151 27323 -105567 -231161 -306340 -110155 27359 -288132 114711 154740 326669
12997C26669B4038K69219b2036C8688F614c8364C89685D4709e1217J2172o4692
$$ 326669 24038 293257 -22036 38688 6614 -38364 389685 44709 -51217 -39045 -103737
12986a03737j07385h4952E9061a79029b9994A38944J14190j19135K5983i1161
$$ -103737 -211122 -84952 59061 -179029 -29994 138944 253134 133999 159982 -91161
12975f0404n543l7385b7006I1670Q8080a04065n2515c0159A69426n5585k3343
$$ -60404 -65947 -103332 -27006 91670 179750 -104065 -156580 -30159 169426 113841 90498
12964I0498a86774G6313b70q9596q6484b5361A35120f9757A36759J76484a3740
$$ 90498 -186774 76313 -270 -89866 -176350 -25361 135120 -69757 136759 313243 -13740
12952C59402a30475A11754h8828q2602H5722d1782H1909c17055J47354A37991
$$ 359402 -130475 111754 -88828 -171430 85722 -41782 81909 -317055 -169701 137991
12941a28903A96564a7810A19398L40808B25045e4935C4675h251Q76o6205A29854
$$ -128903 196564 -17810 119398 460206 225045 -54935 34675 -8251 -7375 -73580 129854
12929a93203R5918a8037j28503C9129b03636c3120j20868C52370d2616A03862
$$ -193203 -97285 -18037 -146540 39129 -203636 -33120 -153988 352370 -42616 103862
12918c47278h1431B03479a97120O6961L7258B97018A29976c58612a40750J4951
$$ -347278 -81431 203479 -197120 -130159 -92901 297018 129976 -358612 -140750 -125799
12908a25799k27297a10068C2326O0615K61723g50m3439C15200A8123a85395B26439
$$ -125799 -353096 -110068 32326 92941 354664 -750 -44189 315200 18123 -185395 226439
12896B31330A01524B0608a04616l0876B42252G5009g7370F7183J94296b108D7322
$$ 231330 101524 20608 -104616 -135492 242252 75009 -77370 67183 261479 -2108 47322
12884G234K49237b6421E3835J58666r8517J18164H0264l711B7115a34004m676
$$ 7234 256471 -26421 53835 212501 113984 232148 80264 76553 27115 -134004 -138680
12873a38680F1624r416b29893B69299H6380K116a12474K742L9298p7621J8675
$$ -138680 61624 52208 -229893 269299 86380 88496 -112474 -109732 -70434 -148055 -129380
12862a29380a172C5713K0760L44764b29670A81960b2007H1652i4047B94933C2640
$$ -129380 -1172 35713 56473 401237 -229670 181960 -22007 81652 -94047 294933 32640
12850a80205H1566L4669K54684l2979F0216J0569J25412M0083h0407j58053a09190
$$ -180205 81566 116235 370919 337940 60216 70785 196197 236280 -80407 -238460 -109190
12838c3318G3920B4443b11818e0660A307K87553A36260b70689E7064A1802Q2561
$$ -33318 73920 24443 -211818 -50660 1307 288860 136260 -270689 57064 11802 94363
12827I4363b43011A9265i8941E9547b9327D2237a42916B4153e5792A61913N7610
$$ 94363 -243011 19265 -98941 59547 -29327 42237 -142916 24153 -55792 161913 219523
12816B19523e5526M986B01409c68318R4289K1042F9245K9271A713c8099A3689
$$ 219523 -55526 -50540 201409 -368318 -274029 -252987 69245 98516 1713 -38099 13689
12804b81817D0269K72981j04045a55226B52579m0001d04557a01513E7613f6081
$$ -281817 40269 313250 209205 -155226 252579 212578 -404557 -101513 57613 -66081
12793b49076d5017R047k24476C4185O2556L3089i3282B03178a19543L9657B37648
$$ -249076 -45017 -35970 -260446 34185 96741 129830 -93282 203178 -119543 -79886 237648
12781B74434e3805A28669B4930Q3300k4810A5990b67969b0418k04379A83403D7881
$$ 274434 -53805 128669 24930 108230 83420 15990 -267969 -20418 -224797 183403 47881
12769g2203k7167A2259m797L83695j70330r4596a22260n0348C67089C8262J91070
$$ -72203 -99370 12259 7462 391157 220827 126231 -122260 -172608 367089 38262 229332
12758B29332a2121l8403B02848a72039A81723a8491q1459j15625f8682D2372j9636
$$ 229332 -12121 -50524 202848 -172039 181723 -18491 -99950 -215575 -68682 42372 22736
12747B2736K58992C1417J19520N7543i1792B52923c52500B51308F2320L18091
$$ 22736 281728 31417 150937 208480 -91792 252923 -352500 251308 62320 380411
12737C80411a6903p573B01832r8469F040d07E9497A8025J65893G1000b78160A18331
$$ 380411 -16903 -24476 201832 103363 6040 -407 59497 18025 183918 71000 -278160 118331
12724C33691b36274d4919A52292n7291j41b9547j30984A65433e0546B34905a60869
$$ 333691 -236274 -44919 152292 95001 94860 -29547 -160531 165433 -50546 234905 -160869
12712a60569A50806R0383p2109M4665D85J58282a1135G1611K68291l0565E2795
$$ -160569 150806 241189 169080 213745 485 158767 -11135 71611 339902 309337 52795
12700D04127A3747b54549C38700A20500a14942C6012M52657B22675a61806j43706
$$ 404127 13747 -254549 338700 120500 -114942 36012 488669 222675 -161806 -305512
12690c05512h7899A88062c31567A16739e070A68190K50137c06916F0328g7181
$$ -305512 -87899 188062 -331567 116739 -5070 168190 418327 -306916 60328 -77181
12679c40169H7665B3076J23480R358Q1635r5579m9644Q1715G0405a94224m15M1030
$$ -340169 87665 23076 146556 155914 237549 141970 92326 174041 70405 -194224 -194639 -153609
12667a53609G3238J38393a30592B33824l7514a51977A5329a92120A4407K38188
$$ -153609 73238 211631 -130592 233824 196310 -151977 15329 -192120 14407 252595
12657B52595b36786C77266g2584C38632b9250B41630b96119B03244a39697a8321
$$ 252595 -236786 377266 -72584 338632 -29250 241630 -296119 203244 -139697 -18321
12646e5546A57282G0551a18768B6077c01499J06066D4319K53312H540f9776A4952
$$ -55546 157282 70551 -118768 26077 -301499 -195433 44319 297631 8540 -69776 14952
12634a09682m2612A12273i6075B51834A8832e4538j35192C57312n5036o0433e1736
$$ -109682 -152294 112273 -96075 251834 18832 -54538 -189730 357312 302276 241843 -51736
12622A56347a51035C72238A09198J34678E4286a23639a7778bA78772m8502b57710
$$ 156347 -151035 372238 109198 243876 54286 -123639 -17778 -2 178772 130270 -257710
12610a34187B41901A0543b3323K374D64655A19611g2534C43732A37325K9355p9263
$$ -134187 241901 10543 -23323 -20949 464655 119611 -72534 343732 137325 166680 87417
12599H7417j1845O8365a06621G1267n295b94350C56879a6133l14831A75333a5579
$$ 87417 75572 143937 -106621 71267 65972 -294350 356879 -16133 -330964 175333 -15579
12587A4508c72252c3054C8642e5023K1308A14637K18294a27787E6600a70124B40333
$$ 14508 -372252 -33054 38642 -55023 -33715 114637 332931 -127787 56600 -170124 240333
12575B24909D7411a12749N1231b5631A91857a50315A24499M485j4056J50338D872
$$ 224909 47411 -112749 -61518 -25631 191857 -150315 124499 128984 114928 265266 4872
12563A09013n2142B0072a59667O988D7739K6340Q0509m6059r280J4226m2343b46974
$$ 109013 56871 20072 -159667 -152679 47739 74079 154588 108529 99249 113475 71132 -246974
12550A65887f7542D5866b97181L4951i0839N946E2145i6407r4206E1186b18642
$$ 165887 -67542 45866 -297181 -262230 -90839 -84893 52145 -96407 -190613 51186 -218642
12538b9308A9600a52630B54417a2134l76787a69702O8391H9343L0232l3248J26299
$$ -29308 19600 -152630 254417 -12134 -388921 -169702 -101311 89343 119575 86327 212626
12527B12626F9651J16997b76322a25743j07741D2458c09904h6623B19959B0761
$$ 212626 69651 186648 -276322 -125743 -233484 42458 -309904 -86623 219959 20761
12516A17536K65480a7645L898q2100C49797r0049I2786a1845j79596G9577J59504
$$ 117536 383016 -17645 -13747 -95847 349797 259748 92786 -11845 -191441 79577 239081
12505B39081i9432A20885a0061C64790F02d879j77878E04321a74301B10547J7611
$$ 239081 -99432 120885 -10061 364790 602 -4879 -182757 504321 -174301 210547 228158
12494B28158F7012a32309m415j04694B94404a84073j36696H8506b15858c2017
$$ 228158 67012 -132309 -136724 -241418 294404 -184073 -320769 88506 -215858 -32017
12483d9958G1848J34197p006f7265I9589a40313D42317a01550C48973A10830D7256
$$ -49958 71848 206045 199039 -67265 99589 -140313 442317 -101550 348973 110830 47256
12471d8279G1555b96990I45a63957E6482J11633a07036B97639a34566N9920m93449
$$ -48279 71555 -296990 945 -163957 56482 168115 -107036 297639 -134566 -74646 -568095
12460e68095b73805B99588a66649B18216B1558R7032a34045K3135B9586a29766
$$ -568095 -273805 299588 -166649 218216 21558 118590 -134045 -110910 29586 -129766
12449B6663J148b9773h858k07701B57295A0623b75198R587A05863L80249B38904
$$ 26663 27811 -29773 -8858 -216559 257295 10623 -275198 -265611 105863 486112 238904
12437a18845o6073K7153a1949B9210j1255O1865h1693p0228L550L6715M2661k32557
$$ -118845 -184918 -157765 -11949 29210 17955 79820 -81693 -151921 -148371 -111656 -68995 -301552
12425c01552G6713a54926B40605e68043b01517A10685K86602A61112L0445K7934
$$ -301552 76713 -154926 240605 -568043 -201517 110685 397287 161112 191557 219491
12415B19491B8151M21565A02655B9298a15075l02973A51364i7447j65385A63953
$$ 219491 28151 449716 102655 29298 -115075 -418048 151364 -97447 -262832 163953
12404A32216n0796b04093E411L3127a11004o023M9860A649c20764a25627j819
$$ 132216 81420 -204093 5411 38538 -111004 -117027 -67167 1649 -320764 -125627 -127446
12393a27446o5126A1280a15401a7121m54066e0224R232j58534L7314g6812j36399
$$ -127446 -192572 11280 -115401 -17121 -471187 -50224 -40992 -199526 -162212 -76812 -213211
12382b13211P5787A08185a7892n7375b4038o4655o2330C14446b66774i5898G9761
$$ -213211 -137424 108185 -17892 -75267 -24038 -88693 -151023 314446 -266774 -95898 79761
12370a57192B67546a20139B42444I3714b8620A00173a92238B39857J41134c47021
$$ -157192 267546 -120139 242444 93714 -28620 100173 -192238 239857 380991 -347021
12359f8843E4694J61573B8421K859b85377A8356M07c3143k75694e1340A75833
$$ -68843 54694 216267 28421 31280 -285377 18356 18763 -33143 -308837 -51340 175833
12347f9341e229k2193l761F42b98281a21806I6489l5030J59249a43042C0362K2173
$$ -69341 -5229 -27422 -31183 642 -298281 -121806 96489 61459 220708 -143042 30362 52535
12335E2535i6865o1244j5150A44897M0143J2726E5143a47777a2681m2685B30912
$$ 52535 -96865 -158109 -173259 144897 185040 197766 55143 -147777 -12681 -55366 230912
12323E9170M1858c20216L8161f3079A56058b41894q8312a04822A67605m0872a34393
$$ 59170 101028 -320216 -282055 -63079 156058 -241894 -330206 -104822 167605 126733 -134393
12311e6174j0534C29469B3673b22867A16799a17132c3791g917k81092o3884g4885
$$ -56174 -66708 329469 23673 -222867 116799 -117132 -33791 -7917 -289009 -352893 -74885
12299d00000A54109n3929M49375b75028A76490K7824a27180F650K12358B5605
$$ -400000 154109 100180 549555 -275028 176490 204314 -127180 6650 219008 25605
12288f9015P978C6803b62374h4499o3931D06391b5786B7458M8730a92465h9808
$$ -69015 -61037 36803 -262374 -84499 -148430 406391 -25786 27458 76188 -192465 -89808
12276A27640K66338b9741m2777B07460A02803J051c16254A35483k6747K5625a66735
$$ 127640 393978 -29741 -72518 207460 102803 103854 -316254 135483 108736 134361 -166735
12264E8070Q7059k6591c0115n1425p8792A0411K75092H5436b0100B11730b03495
$$ 58070 145129 118538 -30115 -81540 -160332 10411 285503 85436 -20100 211730 -203495
12252g4955B21554R2484A45152f9644M254C58862h769E3519b37052B131a37524
$$ -74955 221554 314038 145152 -69644 -65390 358862 -8769 53519 -237052 2131 -137524
12240i7938D8801J38299c4696I7663A7360K63221J98705B27210b0646D7189J30326
$$ -97938 48801 187100 -34696 97663 17360 280581 479286 227210 -20646 47189 177515
12229A77515K48139H5721L09467J79717F5219a79262A99288G3389J73159O5254
$$ 177515 425654 85721 395188 574905 65219 -179262 199288 73389 246548 311802
12219C11802j20431i8597A88529h0528k71834A63265J71685I2134j6298K07121
$$ 311802 191371 -98597 188529 -80528 -352362 163265 334950 92134 75836 282957
12209B82957G3472O6424o3538g7157F1520e0553A31392g581B33848Q3570a15263
$$ 282957 73472 139896 76358 -77157 61520 -50553 131392 -7581 233848 317418 -115263
12197A60342K2437b8929C7926K11477a23330F3822J40451M1803n0903a51772C78318
$$ 160342 182779 -28929 37926 249403 -123330 63822 204273 246076 195173 -151772 378318
12185B74407D6259J80124j755I8344a26929F9883e9430C90008d7257H2775j3444
$$ 274407 46259 226383 224628 98344 -126929 69883 -59430 390008 -47257 82775 69331
12174F9331B1825b52631C24177k4483E6102J89037c0627C42675j60346f154A31728
$$ 69331 21825 -252631 324177 299694 56102 245139 -30627 342675 182329 -6154 131728
12162D0330K43814j03750m7054a36381M0358C24570A48394l0091a15140p4967
$$ 40330 284144 180394 133340 -136381 -96023 324570 148394 118303 -115140 -190107
12152a90107B3057Q8862L8050n454e17173A85790g4563B12556g4165A75418g2696
$$ -190107 23057 111919 149969 144515 -517173 185790 -74563 212556 -74165 175418 -72696
12140a65467j03417J07045B24355e1932C01117A6996K32342J38255j74429c6598
$$ -165467 -268884 -161839 224355 -51932 301117 16996 249338 387593 213164 -36598
12129h7659n1434A80362b10191F7210a8436j73459C15003b12114k36496A19083
$$ -87659 -139093 180362 -210191 67210 -18436 -191895 315003 -212114 -448610 119083
12118E8475m89a96224L4876j42653a41886k5578A01434d4482A20695L9154f2204
$$ 58475 57986 -196224 -161348 -304001 -141886 -167464 101434 -44482 120695 159849 -62204
12106C00686c23576f6808C6733f7244J7169A3162P3347C7057b73483C82711j59205
$$ 300686 -323576 -66808 36733 -67244 -50075 13162 86509 37057 -273483 382711 223506
12095B23506c7188j48384B28712i4118E0244a38967A50102i9829B81073o0944
$$ 223506 -37188 -185572 228712 -94118 50244 -138967 150102 -99829 281073 220129
12085B20129d3526C1555J28500a28748K9448j49123C55084P0499L65947N28423
$$ 220129 -43526 31555 160055 -128748 -99300 -248423 355084 425583 791530 1319953
12075A319953D58458F9658d5619j78899A6381L15019q4733E5662K1962L03484
$$ 1319953 458458 69658 -45619 -224518 16381 331400 246667 55662 77624 381108
12065C81108b4737k81515B6574a02147p9175E6556J35198l7683b5880A02999D4293
$$ 381108 -24737 -306252 26574 -102147 -181322 56556 191754 154071 -25880 102999 44293
12053a01347r7151R6668d4695r5403j02628R6903e362H0679a40582B03723b07401
$$ -101347 -198498 -101830 -44695 -140098 -242726 -145823 -5362 80679 -140582 203723 -207401
12041a60365O2861L9722A59965j3341b87118K7691A63434a11712E0337e7892B01424
$$ -160365 -97504 -57782 159965 146624 -287118 -259427 163434 -111712 50337 -57892 201424
12029b5056q1374j24281b2665C11625r9334a50870b239B99762a51393A44326a42294
$$ -25056 -106430 -230711 -22665 311625 212291 -150870 -2239 299762 -151393 144326 -142294
12017a63657B54Q6153a07311A36232A1896c5384D3296a87720B2616a67496j41186
$$ -163657 254 86407 -107311 136232 11896 -35384 43296 -187720 22616 -167496 -308682
12006c08682c1706q624C52811f7020K6823a1033A95418F1886a19203e8388j18756
$$ -308682 -31706 -40330 352811 -67020 -40197 -11033 195418 61886 -119203 -58388 -177144
11995a77144g3444r93l5684A83652R9981r9685b07017R0784r3944G9023a80636
$$ -177144 -73444 -74437 -110121 183652 283633 183948 -207017 -116233 -210177 79023 -180636
11983A52824b1193l7235r407n5847B45737f4971j1271A61528b0252o0940C65236
$$ 152824 -21193 -58428 -67835 -123682 245737 -64971 -76242 161528 -20252 -81192 365236
11971F1809a57806f1222j88744A11192d53810d669l88307I3544a51545J5402l0380
$$ 61809 -157806 -61222 -249966 111192 -453810 -4669 -392976 93544 -151545 -136143 -166523
11960a66523B11244a60924L2931C9940b70837A51929a09023j10240d7438A60971
$$ -166523 211244 -160924 -127993 39940 -270837 151929 -109023 -219263 -47438 160971
11949a91442m3077B32216d8734j27262j13240A18851K2338c82626G293c6893F7550
$$ -191442 -234519 232216 -48734 -175996 -289236 118851 141189 -382626 7293 -36893 67550
11937i8135J9273c130j2732B60470A03116a01376l3362A3238d57717a07603C8443
$$ -98135 -78862 -3130 -15862 260470 103116 -101376 -134738 13238 -457717 -107603 38443
11925B29513i6599J6665A01489g3139j2715A12425b2101B59385b72897B63305
$$ 229513 -96599 -79934 101489 -73139 -85854 112425 -22101 259385 -272897 263305
11914a86805b3732l06893d5892H6523g3355F4348d00135I0782a59667B92007b54508
$$ -186805 -23732 -330625 -45892 86523 -73355 64348 -400135 90782 -159667 292007 -254508
11902f0552D7383J91531d21607A13086i7510b9636A64938e0187m25952e6621k9960
$$ -60552 47383 238914 -421607 113086 -97510 -29636 164938 -50187 -476139 -56621 -86581
11891h6581J5235A06370a31897A52023b24538i6829E6365d7481k26861J8238M6600
$$ -86581 -71346 106370 -131897 152023 -224538 -96829 56365 -47481 -274342 -256104 -209504
11880b09504d1805k9761m5141A47842E7252J23859F7460M0179I866O0204i396
$$ -209504 -41805 -71566 -116707 147842 57252 181111 67460 107639 9866 70070 -9396
11868a49349o0139I652c07116n3139P3828B2479b06080a5199B58841H3017L2744
$$ -149349 -209488 9652 -307116 -360255 -286427 22479 -206080 -15199 258841 83017 115761
11857A15761D4049h6032L632C02276j24133a10742A01155b61527J03623A09380
$$ 115761 44049 -86032 -82400 302276 178143 -110742 101155 -261527 -157904 109380
11846E903b45872G7287B0700a93177P5345C26246a23260j44873d3432C704O1808
$$ 5903 -245872 77287 20700 -193177 -117832 326246 -123260 -268133 -43432 3704 65512
11835F5512p645b30540R6627c429k73874D8814h9109m0900j18052h1633l4497
$$ 65512 57867 -230540 -133913 -3429 -277303 48814 -89109 -130009 -248061 -81633 -116130
11824a16130B14720o4276j8981c89992a92898P1854A30165n7186b2042I4251d96305
$$ -116130 214720 150444 131463 -389992 -192898 -121044 130165 72979 -22042 94251 -496305
11812I9893a07184A32538b19501F1223O2630a72803r9072K463C04810q4061a60376
$$ 99893 -107184 132538 -219501 61223 123853 -172803 -271875 -269412 304810 220749 -160376
11800a3096D6634a33199A4669b15042d0441A23898d1723A74217a05731q2328A19187
$$ -13096 46634 -133199 14669 -215042 -40441 123898 -41723 174217 -105731 -188059 119187
11788C00218b810A51893a27372k07639B00518d74214a74914n3183B29380C0808
$$ 300218 -2810 151893 -127372 -335011 200518 -474214 -174914 -228097 229380 30808
11777f878G960a4743A10375R3715I6144c69190f1211D9195Q9502K31874c82700
$$ -6878 7960 -14743 110375 204090 96144 -369190 -61211 49195 138697 370571 -382700
11765b96290A4714b8809j96683A7507M42322b0543j37221L2260j9746A60993A7984
$$ -296290 14714 -28809 -225492 17507 459829 -20543 -157764 -125504 -145250 160993 17984
11753B03414d01747C70498A27975j6821b32870D20J61394i6814A3460c71822c7261
$$ 203414 -401747 370498 127975 111154 -232870 420 161814 -96814 13460 -371822 -37261
11741C22391F2170a59684l4548O414d2831k2870j36542A00527a24997A31566b0440
$$ 322391 62170 -159684 -194232 -187818 -42831 -65701 -202243 100527 -124997 131566 -20440
11729c05731e2744N033B3517O5135K7349R170k7527k1682a57309O2558A01993
$$ -305731 -52744 -47711 23517 88652 116001 125171 97644 75962 -157309 -94751 101993
11717G2068O116O6412L9639b00267K325F8741K35675a72105K7160B52124B2438
$$ 72068 78184 144596 184235 -200267 -197942 68741 304416 -172105 -144945 252124 22438
11705D0663L42346B7633b2189B17866g1561o6277f3181A83319A2245a57664C30072
$$ 40663 383009 27633 -22189 217866 -71561 -137838 -63181 183319 12245 -157664 330072
11693h8743A09893a57238j6355b2507i429p4318C07428j33327A7280J94592f2602
$$ -88743 109893 -157238 -173593 -22507 -9429 -83747 307428 174101 17280 211872 -62602
11681C1225n202J67222a98168A23209l2693L7034n6967k0058r424a13772A61087
$$ 31225 26023 193245 -198168 123209 90516 127550 70583 50525 41101 -113772 161087
11669f4941B5948J34737d9184p3935N2243A39992o0971b19248B23487E4746g0023
$$ -64941 25948 160685 -49184 -123119 -70876 139992 79021 -219248 223487 54746 -70023
11657b25202A07046B9630L6465b00852A2666e13250A89454J97267j28921e1835
$$ -225202 107046 29630 66095 -200852 12666 -513250 189454 386721 257800 -51835
11646f237H8416J51697E2766a78408P1223j65972c4280A63896p5700d5953k20540
$$ -6237 88416 240113 52766 -178408 -107185 -273157 -34280 163896 88196 -45953 -266493
11635b66493A69262B0812R0864i6984f132j44704K4434p1148B62954D693J34990
$$ -266493 169262 20812 111676 -96984 -6132 -150836 -126402 -197550 262954 4693 139683
11624A39683g3984A61863E8714j4139M0086N3319l8104c20876B06630e3147A30402
$$ 139683 -73984 161863 58714 44575 84661 137980 99876 -320876 206630 -53147 130402
11612h064A87699Q8573j3414b50659a2700G4056b80183q532a12225G924Q0592
$$ -8064 187699 276272 262858 -250659 -12700 74056 -280183 -288715 -112225 7924 88516
11601H8516L93048A92595a9696f334A00090a50140B24840l9297a1286B05026p4524
$$ 88516 481564 192595 -19696 -6334 100090 -150140 224840 185543 -11286 205026 130502
11590A30502J6206a24062C05668O5000J8901D5424d1885A05746L224a41380k4969
$$ 130502 146708 -124062 305668 370668 389569 45424 -41885 105746 108970 -141380 -166349
11579a66349A98941i6141A6937J05461K7446M4364K24260a94560j01113A55790
$$ -166349 198941 -96141 16937 122398 149844 194208 418468 -194560 -295673 155790
11568a90293C0352a13694J3593B69885a7004C12361g3479C8140R6100J47051J04262
$$ -190293 30352 -113694 -100101 269885 -17004 312361 -73479 38140 134240 281291 385553
11557C85553e4463n456d108j71015n1687C20822D3927K07829M49G5502b26033
$$ 385553 -54463 -59919 -4108 -175123 -226810 320822 43927 251756 252205 75502 -226033
11545A56523A0358K58060A19695K33397g0221n901B79802c12496B80435M14a71410
$$ 156523 10358 268418 119695 353092 -70221 -76122 279802 -312496 280435 280849 -171410
11533D40647p6923e4521A07246R1745a24516B47305j17509l2206N545C4671J54903
$$ 440647 363724 -54521 107246 198991 -124516 247305 129796 97590 103135 34671 189574
11522A89574P7432b62108B21786m2713q1261B7395J54294c528j70992O1221i555
$$ 189574 267006 -262108 221786 179073 97812 27395 181689 -3528 -174520 -113299 -9555
11510B27855k3564g1112j68278A68751b8042A31660P6704J23800j49424H1764
$$ 227855 204291 -71112 -239390 168751 -28042 131660 208364 332164 182740 81764
11499b5064j78522r430q9708e1635j09233A43963a6798A0881J86819a36096B15466
$$ -25064 -203586 -213016 -302724 -51635 -160868 143963 -16798 10881 197700 -136096 215466
11487b77302A43360J56769C8096a68770G6590M9794g8378I3858Q1946p5064A7797
$$ -277302 143360 300129 38096 -168770 76590 126384 -78378 93858 175804 100740 17797
11475f0553J88r2336M8523C55076c8828C00208h3603D4516A1637a22274A63282
$$ -60553 -60365 -152701 -104178 355076 -38828 300208 -83603 44516 11637 -122274 163282
11463B96131B2047g6547m0904B3558a99398B03446a74815l3005B33442r49G5260
$$ 296131 22047 -76547 -117451 23558 -199398 203446 -174815 -207820 233442 232493 75260
11451C95155j89831b87497B25114r3375a7224B19933e3418F4386P3226j6398J39263
$$ 395155 205324 -287497 225114 131739 -17224 219933 -53418 64386 137612 121214 260477
11440B60477n9594H2176K60993b17436d002H7821P434C8582J51822a8031D412
$$ 260477 200883 82176 343169 -217436 -4002 87821 95255 38582 190404 -18031 4412
11428b65814B95254A42316J08862c18998G7769d9962o1358c9883G7070J09263
$$ -265814 295254 142316 251178 -318998 77769 -49962 -111320 -39883 77070 186333
11418A86333p9721h401C5016b16218C5645a3052j92060A75934k5442a23762q5050
$$ 186333 106612 -8401 35016 -216218 35645 -13052 -205112 175934 150492 -123762 -208812
11407b08812H7153a35571q7504A07501k4395b4167A13623j1044d2807B10290D9659
$$ -208812 87153 -135571 -223075 107501 83106 -24167 113623 102579 -42807 210290 49659
11395A40355b12390A5614K14755A5238Q2807a32053D9026a11100A4977M7297L0872
$$ 140355 -212390 15614 230369 15238 98045 -132053 49026 -111100 14977 62274 93146
11384I3146d19745A66572h0941D63a7200o3202r8195f9402q0100o835d554j5220
$$ 93146 -419745 166572 -80941 463 -17200 -80402 -178597 -69402 -149502 -156337 -4554 -19774
11372a9774I7535a7956A76042G0824M4379b2616A41902J56919I1280O3328a41263
$$ -19774 97535 -17956 176042 70824 115203 -22616 141902 298821 91280 154608 -141263
11360a00284B973f7353l1275k13604A33347c09666r8318A34861c9684k91J4505
$$ -100284 2973 -67353 -98628 -312232 133347 -309666 -407984 134861 -39684 -39975 -25470
11349b5470p404j97522J05021q4722E8326J12233b65312B84181c01627c9748h28
$$ -25470 -32874 -230396 -125375 -210097 58326 170559 -265312 284181 -301627 -39748 -828
11337a31743B4272b90726F2343a31867A28581D1877K80032a86262A55395m9555
$$ -131743 24272 -290726 62343 -131867 128581 41877 321909 -186262 155395 105840
11327A05840a40533J0057K0302E0329L0500a90371I9641c1597j20009D595J294
$$ 105840 -140533 -130476 -110174 50329 80829 -190371 99641 -31597 -151606 4595 5889
11316E889c3448H987a4952l83431I698f3100D852B332Q3103a52101d7509A70447
$$ 5889 -33448 8987 -14952 -398383 9698 -63100 4852 2332 85435 -152101 -47509 170447
11303a18671N8693D2831g1616B05329A5194f4083R963j32205D7227H983R7448
$$ -118671 -59978 42831 -71616 205329 15194 -64083 -54120 -186325 47227 8983 106431
11292A06431a98549l4611k2617J1304P0039A42969F5848a32345C69132a46736
$$ 106431 -198549 -233160 -255777 -244473 -174434 142969 65848 -132345 369132 -146736
11281a65780A77046a11026C6247J79436h5502l418A37945a66419O1683B3089c00413
$$ -165780 177046 -111026 36247 215683 -85502 -88920 137945 -166419 -104736 23089 -300413
11269C2381b8913A23420a12844k18155B07623O705K8894i0438O534p9267m1548
$$ 32381 -28913 123420 -112844 -330999 207623 214328 243222 -90438 -83904 -163171 -204719
11258b04719I3397k7978K20189N6327a46452m1099A1239a1080j2943A4494J37764
$$ -204719 93397 65419 285608 341935 -146452 -187551 11239 -11080 -24023 14494 152258
11247A52258o3957b31895H1699a33168C5873K10768b0807j47873O9269n0132j02689
$$ 152258 88301 -231895 81699 -133168 35873 246641 -20807 -168680 -99411 -149543 -252232
11236b52232n7320J51077h471k89359J24814F1216k0593J44237a37968E7184B1814
$$ -252232 -309552 -158475 -8471 -297830 -173016 61216 40623 184860 -137968 57184 21814
11224b05841M2776A39279N8805C8102b56230c6123B00082a67650j0487B07146
$$ -205841 -163065 139279 198084 38102 -256230 -36123 200082 -167650 -178137 207146
11213A17072d9038G2545K12174G229i3873D326R7385D7466K90231a48907K3706
$$ 117072 -49038 72545 284719 7229 -93873 4326 101711 47466 337697 -148907 -125201
11202a25201m49217i2839N155b362C2665a209r236A73977d58144a66271C2542
$$ -125201 -574418 -92839 -87684 -2362 32665 -1209 -10445 173977 -458144 -166271 32542
11190e54636a71637f4539A05019c17667J52879l3916k51907J41866J06625k6028
$$ -554636 -171637 -64539 105019 -317667 -164788 -198704 -450611 -308745 -202120 -228148
11180b28148M6151k4046G8595f4987j55465j73974a19292N6430b2360k91193g116
$$ -228148 -181997 -206043 78595 -64987 -220452 -394426 -119292 -62862 -22360 -313553 -7116
11168c83776c3817j53246B14733a35989B65701c1427B04376k7091a05346j57331
$$ -383776 -33817 -187063 214733 -135989 265701 -31427 204376 177285 -105346 -262677
11158b62677A88549a03495o2053N8951A5713n647a9037k9124k20522a28865c4805
$$ -262677 188549 -103495 -165548 -106597 15713 10066 -19037 -48161 -268683 -128865 -34805
11146a11856r9207B25483K713a07692p1268a1872o8307a1823B62892e7001B77691
$$ -111856 -211063 225483 228196 -107692 -178960 -11872 -80179 -11823 262892 -57001 277691
11134B3959L29703A07170b04096A25527b040k92328c8875D06582d7502j9482E2504
$$ 23959 353662 107170 -204096 125527 -2040 -294368 -38875 406582 -47502 -66984 52504
11122g4523C36003d5866j7629B15267B5190N5499J15532b975j76996A54276c5428
$$ -74523 336003 -45866 -63495 215267 25190 80689 196221 -2975 -179971 154276 -35428
11110a82860C53526A30882Q0816C7193J59684K53503j22483j50944D3591i6114
$$ -182860 353526 130882 211698 37193 196877 450380 327897 176953 43591 -96114
11099A22842m625a7668n9246A27480L59830H2269J87005C3509L62280A20628a03395
$$ 122842 118217 -17668 -76914 127480 487310 82269 269274 33509 395789 120628 -103395
11087B64134F6874I886K87335b358A44440h0762H2470M94891k78391J2162K21854
$$ 264134 66874 9886 297221 -2358 144440 -80762 82470 577361 298970 311132 532986
11076E32986k55651j07922F9884L33866d7408A52223a1066C31920A13452M23385
$$ 532986 277335 169413 69884 403750 -47408 152223 -11066 331920 113452 536837
11066E36837r87A62165L6242J30267K27812J8800j72373K5056O0096K1715k38141
$$ 536837 535850 162165 198407 328674 556486 575286 402913 427969 488065 509780 271639
11055B71639R4296K09314j95676L95981o115k95325p9061m43m9979J16005B25704
$$ 271639 365935 575249 379573 775554 769439 474114 395053 394610 344631 460636 225704
11043C67675M56155k42836O5702K45879m03295M0833K8156j29318J53620j67165
$$ 367675 823830 580994 646696 892575 489280 530113 558269 428951 582571 415406
11033D15406J60443r3347N9719n418K49704j98334n25O1549J82941k48229J57354
$$ 415406 575849 482502 542221 536803 786507 588173 587648 649197 832138 583909 741263
11022G41263k03833K26984j68333B01199K09007A57845K59429J76231k3680p1488
$$ 741263 537430 764414 596081 201199 410206 157845 417274 593505 569825 498337
11012D98337o1005j38283K77957J43124B76941M05388C27351q5907L55903P1338
$$ 498337 437332 299049 577006 720130 276941 682329 327351 241444 597347 668685
11002F68685j75888M30227l86789J43859L4148j98680K30709I7181M08191j35681
$$ 668685 492797 923024 536235 680094 714242 515562 746271 97181 505372 369691
10992C69691N4399K20779j07754K8483K48623P4288C00616J52370K67960l8119
$$ 369691 424090 644869 537115 565598 814221 888509 300616 452986 720946 682827
10982F82827L00276j37820K08801l09474K84622L92470Q0343m5352K70763K15621
$$ 682827 983103 845283 1054084 744610 1029232 1421702 1502045 1456693 1727456 1943077
10972A943077l3476N27419o59599N8163j41540l51726J67462O937m70862M34318
$$ 1943077 1909601 2437020 1777421 1835584 1694044 1342318 1509780 1516717 1045855 1480173
10962A480173n482m81474M16310R5554j54495K71735r8316n5289l52033k90286
$$ 1480173 1474691 993217 1409527 1505081 1350586 1622321 1524005 1468716 1116683 826397
10952H26397J82998r2311O4725m01985B85680K53412k65572J92982F8912c7678
$$ 826397 1009395 917084 981809 579824 285680 539092 273520 466502 68912 -37678
10941B97215A6259J89273J302C5387K52314p2367g59A6366J11753Q4073l2497
$$ 297215 16259 205532 206834 35387 287701 215334 -759 16366 128119 212192 179695
10930A79695B0648f00H6178a9165j6029J3373A81579D8877J09095O7938E6235
$$ 179695 20648 -600 86178 -19165 -35194 -21821 181579 48877 157972 225910 56235
10918g258I5947c57096a39715d6958B62289j10728c31744a36680c2377j38998
$$ -7258 95947 -357096 -139715 -46958 262289 151561 -331744 -136680 -32377 -171375
10908a71375A43871F857a33497j83771G9227l4437a02267d3527C46052a26808
$$ -171375 143871 6857 -133497 -317268 79227 44790 -102267 -43527 346052 -126808
10897d6239j16855j38121m1318A76420R8330J0922G9156a28269c1775A72609e43224
$$ -46239 -163094 -301215 -342533 176420 274750 285672 79156 -128269 -31775 172609 -543224
10885A5579J14804a48737A66703a30957N9015A63881m6594c29303a43466f968
$$ 15579 130383 -148737 166703 -130957 -71942 163881 117287 -329303 -143466 -6968
10874A7638i2273p8303D9643i2947B05322H8882J35686I1561J10691m621H8358
$$ 17638 -92273 -170576 49643 -92947 205322 88882 224568 91561 202252 197631 88358
10862h5118d762B43222o1383a53906m7375C293K65430d2678B49168K08938D9482
$$ -85118 -4762 243222 181839 -153906 -201281 3293 268723 -42678 249168 458106 49482
10850A90755b4204A83109B31e74355A92489i0125I6027b07664k67080B9419b08457
$$ 190755 -24204 183109 231 -574355 192489 -90125 96027 -207664 -474744 29419 -208457
10838C49368H5474N4522L5179J92894h3848j27995c620D4242K54881p6807f9037
$$ 349368 85474 139996 175175 368069 -83848 -211843 -3620 44242 299123 222316 -69037
10826d1256A56611b50299A25587b72953b9543l46563c8525o3653K523a4068l38408
$$ -41256 156611 -250299 125587 -272953 -29543 -376106 -38525 -102178 -99655 -14068 -352476
10815c52476B69502E9971J00902g8614P425n9447N6962k38797a02401j65771L1753
$$ -352476 269502 59971 160873 -78614 -71189 -130636 -73674 -312471 -102401 -268172 -236419
10804b36419A82023d69099H8460a58945j26754A73636a58169j86261C12825c7457
$$ -236419 182023 -469099 88460 -158945 -285699 173636 -158169 -344430 312825 -37457
10793E38148A02899C7942b97113H00R6193A0322K04800D3465e4799G7811b33362
$$ 538148 102899 37942 -297113 800 96993 10322 215122 43465 -54799 77811 -233362
10781A39380H374J49369n6746a13209d5252j0150a9350k7313B7686b90887E1941
$$ 139380 8374 157743 100997 -113209 -45252 -55402 -19350 -46663 27686 -290887 51941
10769A38162a745o1527H3890a41920E802K71305b10933A11769f8997j33305e724
$$ 138162 -1745 -63272 83890 -141920 5802 277107 -210933 111769 -68997 -202302 -5724
10757I2583i4263k61865a29660C87796B2727d5160l175E5395M8905b56399J429
$$ 92583 -94263 -356128 -129660 387796 22727 -45160 -48335 55395 104300 -256399 -254970
10746b54970J26419A35598a06057A18489k5696K28404a13421A30371b17523d7410
$$ -254970 -128551 135598 -106057 118489 92793 321197 -113421 130371 -217523 -47410
10735H2392P0880i7067B5288d2560q1879A45602b80142L8539g4364I7937M470
$$ 82392 153272 -97067 25288 -42560 -124439 145602 -280142 -241603 -74364 97937 102407
10724A02407b48530J10497A96215d67550e3447H545K56212f9039F8893a26400
$$ 102407 -248530 -138033 196215 -467550 -53447 8545 264757 -69039 68893 -126400
10713a6143B73694a70499D4648b14209E3737f1928A73489i9259p8282A11430j8312
$$ -16143 273694 -170499 44648 -214209 53737 -61928 173489 -99259 -177541 111430 93118
10702I3118i2077L2368j42766g3944A72272f4522A0619c60767G0069a92260n6504
$$ 93118 -92077 -59709 -202475 -73944 172272 -64522 10619 -360767 70069 -192260 -248764
10691b48764A10218K2230c13919f7408k680I495b4642n7891B22616b26949D7324
$$ -248764 110218 132448 -313919 -67408 -70088 9495 -24642 -82533 222616 -226949 47324
10679d9859k12361p3645C480a19666A8264e4124A28812m3504B5686i2357B7272
$$ -49859 -262220 -335865 3480 -119666 18264 -54124 128812 85308 25686 -92357 27272
10667a75043g1686l02247K0329a56160O7801o0374B8311a46698H0953b50726k5648
$$ -175043 -71686 -373933 -353604 -156160 -88359 -148733 28311 -146698 80953 -250726 -276374
10656b76374h8659F9024j2197c21110Q7797B39232G3633l2773b49265B1740M2481
$$ -276374 -88659 69024 56827 -321110 -233313 239232 73633 40860 -249265 21740 64221
10645F4221c0537B55274a87899A89386a93244A24490J65225j02379f3114A90557
$$ 64221 -30537 255274 -187899 189386 -193244 124490 289715 187336 -63114 190557
10634a96046C8617a37620D7189b57885l3347A8355b14698o4122P1029A62219c2476
$$ -196046 38617 -137620 47189 -257885 -291232 18355 -214698 -278820 -207791 162219 -32476
10622a65701q949p1787k7253h0393L4364A46402a4947j55826E6969a8810j5704
$$ -165701 -174650 -246437 -273690 -80393 -46029 146402 -14947 -170773 56969 -18810 -34514
10611c4514B01091a15152H606a59970K2402e0949E0866c0709j09830G6878A1627
$$ -34514 201091 -115152 8606 -159970 -137568 -50949 50866 -30709 -140539 76878 11627
10599c18279E9920K72664a95141j3536e2140I5605b46782F1543a7105F207P5964
$$ -318279 59920 332584 -195141 -208677 -52140 95605 -246782 61543 -17105 6207 82171
10588H2171C0011D699h4282k77795A48372k7265F405d38236d8406j18602L8529
$$ 82171 30011 4699 -84282 -362077 148372 121107 6405 -438236 -48406 -167008 -128479
10577a28479e8851A97883a31261B64527g9192j5657D0004h7918p1827A05658a18007
$$ -128479 -58851 197883 -131261 264527 -79192 -94849 40004 -87918 -159745 105658 -118007
10565d38707B45352b27878k47287C4558b34704Q4421D1813c282k15281R5193m8248
$$ -438707 245352 -227878 -475165 34558 -234704 -150283 41813 -3282 -218563 -123370 -171618
10554a71618B13046B385R510J00511b43851a03400J8625j07808d3889p7763B842
$$ -171618 213046 2385 11895 112406 -243851 -103400 -84775 -192583 -43889 -121652 2842
10542G6735L2377b36782R0019k17490Q049j83282a08416o1225A59802G4431b10471
$$ 76735 109112 -236782 -146763 -364253 -356204 -539486 -108416 -169641 159802 74431 -210471
10530A12424a0966F015h4417D0491K8583f817j56886Q1522J3172B86477D1752
$$ 112424 -10966 6015 -84417 40491 69074 -6817 -163703 -82181 -69009 286477 41752
10518i2360J0085I842L7151b1349m6006j856q8587A75605d7311j09294d918j02295
$$ -92360 -82275 9842 46993 -21349 -67355 -69211 -157798 175605 -47311 -156605 -4918 -107213
10506a07213j22304A44033J65542a0361D8764a0885k6305l5713c5036A77145A8147
$$ -107213 -229517 144033 309575 -10361 48764 -10885 -37190 -72903 -35036 177145 18147
10494b72997a5343B18280L3153o7079o3659b16921J03878E8072M2193B2317E229
$$ -272997 -15343 218280 251433 184354 120695 -216921 -113043 58072 100265 22317 5229
10482C92611J58054j73635A28657K26040a30983B698d7575B56525F8700d3980
$$ 392611 550665 377030 128657 354697 -130983 2698 -47575 256525 68700 -43980
10471C0691b5652A86010C564K60787F7409a56601j08635B03695R4844A25108B5953
$$ 30691 -25652 186010 3564 264351 67409 -156601 -265236 203695 298539 125108 25953
10459a53815O8062B71409C4207a1766j80236L2701e7390A8739a75643g4067A93547
$$ -153815 -85753 271409 34207 -11766 -192002 -159301 -57390 18739 -175643 -74067 193547
10447b34930A21674c25462A42299g9780k45986a13128B16093m1337a37373l8457
$$ -234930 121674 -325462 142299 -79780 -325766 -113128 216093 174756 -137373 -175830
10437a75830j90131g3827j10811A05444Q589B4652a6951Q465o1347j00391a9368
$$ -175830 -365961 -73827 -184638 105444 114033 24652 -16951 -8486 -69833 -170224 -19368
10425h9295h470l31433C51035h0745n3822j05488p2730B70736f5055G6166b21332
$$ -89295 -8470 -339903 351035 -80745 -134567 -240055 -312785 270736 -65055 76166 -221332
10413B13475f3651C51874a04509j65708a16635L3544k2577p6097O8238B28992
$$ 213475 -63651 351874 -104509 -270217 -116635 -83091 -105668 -181765 -113527 228992
10402f0496B36000L1276d35652a02079A78322b50970l0709G3494d4397A09927
$$ -60496 236000 267276 -435652 -102079 178322 -250970 -281679 73494 -44397 109927
10391H8970A4842P204N9243a8116B3298a70336c3135H3907a97476B69098C5212
$$ 88970 14842 22046 81289 -18116 23298 -170336 -33135 83907 -197476 269098 35212
10379C48114f1829C22675m1763B9369J10363a64430A7876C210K91772k6844J7688
$$ 348114 -61829 322675 280912 29369 139732 -164430 17876 3210 294982 268138 285826
10368B85826a3385E32108M4710f3983C45263g7692A8598K19397j5208b14505I6308
$$ 285826 -13385 532108 576818 -63983 345263 -77692 18598 237995 222787 -214505 96308
10356D13706A37917M0398p666L86274j31818A88206o3125K03273l4446F2376K18347
$$ 413706 137917 178315 170649 556923 425105 188206 125081 328354 293908 62376 280723
10345B80723n4265J89171j21968n7123a74209a312k7981B40267n8135Q3925r2295
$$ 280723 226458 415629 293661 236538 -174209 -1312 -29293 240267 182132 266057 173762
10334A73762a66952B54355a12641A3148K77655A15735D4235K20432a77827C65061
$$ 173762 -166952 254355 -112641 13148 290803 115735 44235 264667 -177827 365061
10323B7770e9467B3377J0168Q4133N8348R6159m3501A5009J68963E9595K07566
$$ 27770 -59467 23377 33545 117678 176026 272185 228684 15009 183972 59595 267161
10312B67161E6941h0621I6364a07820B3128c03833G8760K1250c8009l1378k6584
$$ 267161 56941 -80621 96364 -107820 23128 -303833 78760 100010 -38009 -69387 -95971
10301i5971K6557k51891C9754K48717C9093J2206b76549e3854a7292B23218H6372
$$ -95971 -69414 -321305 39754 288471 39093 51299 -276549 -53854 -17292 223218 86372
10289a02495A30715a77596k94770a2723j34053A36274a31349q9947A01900J25754
$$ -102495 130715 -177596 -472366 -12723 -146776 136274 -131349 -221296 101900 227654
10279B27654b36404O4971F3991f61B03810O6311I5477l8293J46572D4371N9204
$$ 227654 -236404 -171433 63991 -661 203810 270121 95477 57184 203756 44371 103575
10268A03575a25527b2407A56585b55625h0196I7320J73102C8362J60263K39028
$$ 103575 -125527 -22407 156585 -255625 -80196 97320 270422 38362 198625 437653
10258D37653j80735j02630c53069b6429G6145q767j4080a18785A2691c9478B27694
$$ 437653 256918 154288 -353069 -26429 76145 67378 53298 -118785 12691 -39478 227694
10246b16821B99594F920b34078A08366R1943a90082a9380k4345a0910j15115A63250
$$ -216821 299594 6920 -234078 108366 200309 -190082 -19380 -43725 -10910 -126025 163250
10234D0590b21796N0472j10886P6274J2431K1993A35592h9657A77805a52372k7086
$$ 40590 -221796 -171324 -282210 -205936 -193505 -171512 135592 -89657 177805 -152372 -179458
10223a79458C5533c39187c733D8962f5969o5241I4975l2440J19904q1565b39057
$$ -179458 35533 -339187 -3733 48962 -65969 -131210 94975 62535 182439 100874 -239057
10211I9909m4987R1186a00629H9710a21783j05836P6001E008c47835B9473a7086
$$ 99909 54922 146108 -100629 89710 -121783 -227619 -151618 5008 -347835 29473 -17086
10199b44340i3947o7244b2159l2007j41434f8329q3373M9749L7405j70867B6150
$$ -244340 -93947 -161191 -22159 -54166 -195600 -68329 -151702 -101953 -64548 -235415 26150
10187c78452A17566J76961a0021j65470d3957A325a40276K528A61729a27362N6430
$$ -378452 117566 294527 -10021 -175491 -43957 1325 -140276 -137748 161729 -127362 -70932
10176g0932m1359E9202d33274A79340b07302h1926A64744J32603H55h3825a5166
$$ -70932 -112291 59202 -433274 179340 -207302 -81926 164744 297347 855 -83825 -15166
10164A10493b75663a25879B64777H846a26396k1159n7251d6548I8816d2540A73226
$$ 110493 -275663 -125879 264777 8846 -126396 -147555 -204806 -46548 98816 -42540 173226
10152c9412A40885b13547F8919d3933D4217J28131a78911B89610c64116h170A82046
$$ -39412 140885 -213547 68919 -43933 44217 172348 -178911 289610 -364116 -8170 182046
10140e3789m0200m1839G7370b59957h5529p0229M4857I2168a46599d0371E1131
$$ -53789 -93989 -135828 77370 -259957 -85529 -155758 -110901 92168 -146599 -40371 51131
10128D692b015n5510h627j33181A82313C5471Q3876P728a91573B3650a45091A82277
$$ 4692 -2015 -57525 -8627 -141808 182313 35471 119347 127075 -191573 23650 -145091 182277
10115I666f8999D7325K1440c10425h8315d0875q8441N683B9456a13844j5434l63905
$$ 9666 -68999 47325 68765 -310425 -88315 -40875 -129316 -123633 29456 -113844 -129278 -493183
10103d93183A42148l1420a30469a4349q3243A90115a54118B36076D159f069k9072
$$ -493183 142148 110728 -130469 -14349 -97592 190115 -154118 236076 4159 -6069 -35141
10092c5141n281j88651B17683g4813L6534A20565n8357K6970m0242O3038a29381
$$ -35141 -40422 -229073 217683 -74813 -38279 120565 62208 89178 48936 111974 -129381
10080c7779A82113a4903o2438A0332J26617F5985e0608j34570L3873A29124a20974
$$ -37779 182113 -14903 -77341 10332 136949 65985 -50608 -185178 -151305 129124 -120974
10068A21404b38365J07025A17859b01655A53506a01145O855A02669a03125C8240
$$ 121404 -238365 -131340 117859 -201655 153506 -101145 -94290 102669 -103125 38240
10057C42699d7728A25360i3680K3536p021H1391d7320j99107A23558d19007A19295
$$ 342699 -47728 125360 -93680 -70144 -77165 81391 -47320 -246427 123558 -419007 119295
10045A90223h0776j47904A3476L4264N2853c3877A229i7622B9744N6265a60702
$$ 190223 -80776 -228680 13476 47740 100593 -33877 1229 -97622 29744 86009 -160702
10033A07786h104I7475b15172j24458J47321A96337F667a15546D2212P7512E9119
$$ 107786 -8104 97475 -215172 -339630 -192309 196337 6667 -115546 42212 119724 59119
10021d20895a19592d1429l39666J70193n6664D0922d7881k0231F4718h7695b4701
$$ -420895 -119592 -41429 -381095 -210902 -267566 40922 -47881 -68112 64718 -87695 -24701
10009c34038G6115b97625p789B95001b39269e8824j30634Q2957a3647j96209j00906
$$ -334038 76115 -297625 -305414 295001 -239269 -58824 -189458 -106501 -13647 -209856 -310762
9998c10762R3573C49243a70444G7411J11662a37786b1084j22584K6594M5879j02841
$$ -310762 -217189 349243 -170444 77411 189073 -137786 -21084 -143668 -117074 -71195 -174036
9987a74036k25614I5346D1359f9231A68410g1096c3445C2355a16798B85700B7668
$$ -174036 -399650 95346 41359 -69231 168410 -71096 -33445 32355 -116798 285700 27668
9975B32299b25172A56432a55987j88924J63747p8270a11761p9872D7995b10304
$$ 232299 -225172 156432 -155987 -344911 -181164 -259434 -111761 -191633 47995 -210304
9964B87296h1506B8007a84823g4171k5823K3017n1138j02553c0864C03766a36262
$$ 287296 -81506 28007 -184823 -74171 -99994 -76977 -128115 -230668 -30864 303766 -136262
9952b63767A04130c8509C1358a60239j87205a45113d7066l45430B0048d6950k82804
$$ -263767 104130 -38509 31358 -160239 -347444 -145113 -47066 -392496 20048 -46950 -329754
9941c29754g9863j99987b9375l0601o7307N1006B6135M2402c38009J09083A73662
$$ -329754 -79863 -279850 -29375 -59976 -127283 -76277 26135 68537 -338009 -228926 173662
9929A55229F8505N1519e7650A5559h4665F4289h987o5617k47124A3709h4460k76693
$$ 155229 68505 120024 -57650 15559 -84665 64289 -8987 -74604 -321728 13709 -84460 -361153
9917c61153J73326R0294C2816A5776a3529D3725c85465Q3979A00406a40517B6716
$$ -361153 -187827 -97533 32816 15776 -13529 43725 -385465 -301486 100406 -140517 26716
9905B31496E6950a18954o3506a7915j14469A51381a18355b6445o9068k1138d0947
$$ 231496 56950 -118954 -182460 -17915 -132384 151381 -118355 -26445 -95513 -116651 -40947
9893A894a5401A55514L04328c29987a18725g321B5899b93483l8910K6828H873
$$ 1894 -15401 155514 459842 -329987 -118725 -7321 25899 -293483 -332393 -305565 8873
9881h3502l7345j7346j22184d9405k35566A29237l5128a07664j36690a4189D46
$$ -83502 -120847 -138193 -260377 -49405 -284971 129237 94109 -107664 -244354 -14189 446
9869A28503n8728a0890l07117J26956A6482i7440k7252j44722l2409q5180d0954
$$ 128503 69775 -10890 -318007 -191051 16482 -97440 -124692 -269414 -301823 -387003 -40954
9857c27654A79450a02849b0520j20557C19221a29431c1663o3208E3273a87325
$$ -327654 179450 -102849 -20520 -141077 319221 -129431 -31663 -94871 53273 -187325
9846e9468k92223O1258e9014A6407a46926d9907A42412b77298B2545J99214a87429
$$ -59468 -351691 -290433 -59014 16407 -146926 -49907 142412 -277298 22545 221759 -187429
9834a33928o5481j92522A59041a75330A54750a33182A2557K16195b4958q8611
$$ -133928 -199409 -391931 159041 -175330 154750 -133182 12557 228752 -24958 -113569
9824a13569j08095B07642e8432j13765N8990K3691D1307c27007d6365C0387a05178
$$ -113569 -221664 207642 -58432 -172197 -113207 -89516 41307 -327007 -46365 30387 -105178
9812a95176Q6116j16881j12468J25341A81897b27587a08520H0902b33461m8370
$$ -195176 -109060 -225941 -338409 -213068 181897 -227587 -108520 80902 -233461 -281831
9802b81831P8510h6816j31864K2978N0420q6885n6612I8726e8306I6970g2280
$$ -281831 -203321 -86816 -218680 -195702 -145282 -232167 -288779 98726 -58306 96970 -72280
9790a64487d079n2043a5242A92240F0826L7375a17669J5582i262j97445B87591
$$ -164487 -4079 -56122 -15242 192240 60826 98201 -117669 -102087 -9262 -206707 287591
9778c04934i3365F6987K5217J60016a83424g2684j29114A86327L170a8592A09645
$$ -304934 -93365 66987 92204 252220 -183424 -72684 -201798 186327 189497 -18592 109645
9766b9923B43429b58517E7471d5130i493j70275I1471h9357j33790A92498d26828
$$ -29923 243429 -258517 57471 -45130 -9493 -179768 91471 -89357 -223147 192498 -426828
9754a48219q5904h5240b7701B69044i4922n1631a6317A00872b4082j66569b0141
$$ -148219 -234123 -85240 -27701 269044 -94922 -146553 -16317 100872 -24082 -190651 -20141
9742C180R3285d74079K13582m7781a0697l08532B62966i4624M6481A55690O507
$$ 3180 96465 -474079 -260497 -308278 -10697 -319229 262966 -94624 -48143 155690 162197
9731A62197E4784a03841j52895a09451q383j17883O1166p4960P9044K8384f8544
$$ 162197 54784 -103841 -256736 -109451 -117834 -235717 -174551 -249511 -170467 -142083 -68544
9719a4039l56136B09018f465n9172k87280c8455j97650h7279I6568a84917g180
$$ -14039 -370175 209018 -6465 -65637 -352917 -38455 -236105 -87279 96568 -184917 -7180
9707b29830M2511k30046A37818C4063e1877p0334C65573A09044A4014b00090k7611
$$ -229830 -187319 -417365 137818 34063 -51877 -122211 365573 109044 14014 -200090 -227701
9696b27701A60960a59633N3769D1361b68259C1083f4812B73836a43400A56751
$$ -227701 160960 -159633 -105864 41361 -268259 31083 -64812 273836 -143400 156751
9685C9729d79770A22638g201k73905J24095l7184m3084J7537I1455K9064D9821
$$ 39729 -479770 122638 -7201 -281106 -157011 -194195 -237279 -219742 91455 120519 49821
9673a46222B2793e8788j98123r9978G7310b0515k43045e3811A78722q2254g2955
$$ -146222 22793 -58788 -256911 -356889 77310 -20515 -263560 -53811 178722 96468 -72955
9661A06864B8420N5029A507f77057a9295j29015q9399D16003b22432i6850H714
$$ 106864 28420 83449 1507 -677057 -19295 -148310 -237709 416003 -222432 -96850 8714
9649b58290F9955K78464a65249H6434a60234l3483H4602C0680K9015b05791J4681
$$ -258290 69955 348419 -165249 86434 -160234 -193717 84602 30680 59695 -205791 -191110
9638a91110j55673A88595b18534Q9655F1084K4751h9604j88592L614J25245A31125
$$ -191110 -346783 188595 -218534 -128879 61084 85835 -89604 -278196 -274582 -149337 131125
9626G2281b55249b8053C79058c75874b6264l0530q079j09218a3205A15423a72666
$$ 72281 -255249 -28053 379058 -375874 -26264 -56794 -64873 -174091 -13205 115423 -172666
9614A8171b2812B9652J9712K56173a40951n9395O3262L9667D6307b08635D0007
$$ 18171 -22812 29652 49364 305537 -140951 -200346 -137084 -97417 46307 -208635 40007
9602E9698J04792b20436C4029M2102a76396d5832A67820F265L4617b26865H6046
$$ 59698 164490 -220436 34029 76131 -176396 -45832 167820 6265 40882 -226865 86046
9590D00394a89038A37254Ba88877a1315j63027E8318J58023q1850a37048A07401
$$ 400394 -189038 137254 2 -188877 -11315 -174342 58318 216341 134491 -137048 107401
9578c9199p726j73190a5991q5835k2282A18749e1598j40551J9460j37941f6669
$$ -39199 -46925 -220115 -15991 -101826 -124108 118749 -51598 -192149 -172689 -310630 -66669
9566a22852o1777M6476C88670a90181A8435c95878R3683A58103b73946A60673
$$ -122852 -184629 -138153 388670 -190181 18435 -395878 -302195 158103 -273946 160673
9555b16082P8589e3326m06665D8571B3860J6424a19037j06337B48390C6637g9485
$$ -216082 -137493 -53326 -459991 48571 23860 40284 -119037 -225374 248390 36637 -79485
9543I1747E435i604r1110p8442I0184a55153L2190E7273o624b53281B59456a90287
$$ 91747 5435 -9604 -100714 -179156 90184 -155153 -122963 57273 50649 -253281 259456 -190287
9530a46163q355N3681l67090F5110d7693A98397n3868J5323a1918A98985d3314
$$ -146163 -154518 -100837 -467927 65110 -47693 198397 144529 159852 -11918 198985 -43314
9518G5454a08755K3078l8098B1121M3227c6411B20954F0287J27235H8603P4493
$$ 75454 -108755 -85677 -123775 21121 64348 -36411 220954 60287 187522 88603 163096
9507A63096j5241g5614L5889B22276A5411K84363a70075j0778O6349A05736J42198
$$ 163096 147855 -75614 -39725 222276 15411 299774 -170075 -180853 -114504 105736 247934
9496B47934J29201a36216j68490r5450C4759a75026f291l70k5557a2978j32627
$$ 247934 377135 -136216 -304706 -400156 34759 -175026 -6291 -6661 -32218 -12978 -145605
9485a45605k14584L2099J39422b8368k32576e9730Q749a7035A49916C0120b05705
$$ -145605 -360189 -328090 -188668 -28368 -260944 -59730 -50981 -17035 149916 30120 -205705
9473A66334a4428k6589C73495E5597L57702f4643k31095C0828J00769H063R2958
$$ 166334 -14428 -41017 373495 55597 413299 -64643 -295738 30828 131597 8063 101021
9462A01021C6387b4432A98523b2186l4991k16964O1339b9478j10208B40620b9510
$$ 101021 36387 -24432 198523 -22186 -57177 -274141 -212802 -29478 -139686 240620 -29510
9450B40045a06736k86244a34236j35615a09001p3578C98856d36391a60228j26626
$$ 240045 -106736 -392980 -134236 -269851 -109001 -182579 398856 -436391 -160228 -286854
9440b86854e9824D749b7292A03980j7876b65275p0043A0735c65873a46415f1923
$$ -286854 -59824 4749 -27292 103980 86104 -265275 -335318 10735 -365873 -146415 -61923
9428b48865B1327d6195j82946o5148E5293O1726A95b09205r0492R5140O1865e3805
$$ -248865 21327 -46195 -229141 -294289 55293 117019 195 -209205 -299697 -204557 -142692 -53805
9415f4141D8495b67832I2036a11624a5508n971j5684j13250k54474a60785P9654
$$ -64141 48495 -267832 92036 -111624 -15508 -21479 -37163 -150413 -404887 -160785 -81131
9404h1131r957m9061A71587D933i9534n5535p5019B79255A05290k814a7106p4095
$$ -81131 -91088 -140149 171587 4933 -99534 -155069 -230088 279255 105290 102476 -17106 -91201
9392i1201L559j67938a04024j06552I4491c68353f2004J5917q7778C03013c1920
$$ -91201 -87642 -255580 -104024 -210576 94491 -368353 -62004 -46087 -133865 303013 -31920
9380a69118M0895o8089J3768C39055j61365A933b37640g6858K3856o8403j25328
$$ -169118 -128223 -196312 -182544 339055 177690 1933 -237640 -76858 -53002 -121405 -246733
9369b46733K9723I2314a37216F4732F284J34502N7528a61263k37l1611I5539b11458
$$ -246733 -217010 92314 -137216 64732 6284 140786 198314 -161263 -161500 -193111 95539 -211458
9356c937A22405a69742E6770d3407A14057K861e6455j73852C46297j24213D5556
$$ -3937 122405 -169742 56770 -43407 114057 116918 -56455 -230307 346297 222084 45556
9344c71230J81967A61916b5144C8643a07304A47259o0264J0875l6394a8367j40371
$$ -371230 -189263 161916 -25144 38643 -107304 147259 86995 97870 61476 -18367 -158738
9333a58738K3011l3408j38990I953e3374a4214k36590I686a05866C4727P9289
$$ -158738 -135727 -169135 -308125 9953 -53374 -14214 -250804 9686 -105866 34727 114016
9322A14016i8477c0173D0429b43395E1126M2956d7068j7504p6610A35414A072
$$ 114016 -98477 -30173 40429 -243395 51126 94082 -47068 -64572 -141182 135414 1072
9310D9609a62914I3982a18515n0061N216o5307a12158j41124h4784l9266c4481
$$ 49609 -162914 93982 -118515 -168576 -163360 -228667 -112158 -253282 -84784 -124050 -34481
9298A29876b20207j17229E0470b54893B30782g0269j88453E663a3355j40157j4114
$$ 129876 -220207 -337436 50470 -254893 230782 -70269 -258722 5663 -13355 -153512 -167626
9287a67626D5073K01276A7151b39031k7943J32312D8347a59714N2803j1527A46618
$$ -167626 45073 246349 17151 -239031 -266974 -134662 48347 -159714 -106911 -118438 146618
9275e5384A73456a11837l9136F4779J9655l8043h4210O186k54836A16898b74365
$$ -55384 173456 -111837 -150973 64779 84434 46391 -84210 -78024 -332860 116898 -274365
9263a97315c5204D3978i33j77643A37265o7502K3625K8880b50394B3705a90697
$$ -197315 -35204 43978 -933 -178576 137265 69763 93388 122268 -250394 23705 -190697
9251C31291a98297J9295M6097d5329k8871j4106A15231c62542J60924b2051m1213
$$ 331291 -198297 -179002 -132905 -45329 -74200 -88306 115231 -362542 -201618 -22051 -63264
9240f3264j76568A54519g5153j33497A09341c03020A76187a95690B22387c1828
$$ -63264 -239832 154519 -75153 -208650 109341 -303020 176187 -195690 222387 -31828
9229D3664c7529C1081N4110e3687G9786P7737a65083h2445A17918a21254j21723
$$ 43664 -37529 31081 85191 -53687 79786 157523 -165083 -82445 117918 -121254 -242977
9218b42977A74635a89544A88542M4522H7397a73481h6201j27723D6989K56625
$$ -242977 174635 -189544 188542 233064 87397 -173481 -86201 -213924 46989 303614
9208C03614A28336O8324B2725M7885c27804A08876d3146A20010b24790o80n5284
$$ 303614 128336 196660 22725 70610 -327804 108876 -43146 120010 -224790 -225470 -280754
9197b80754B48288b04971j55832A64202H1351h6288j12217E6287J6769J20857
$$ -280754 248288 -204971 -360803 164202 81351 -86288 -198505 56287 73056 193913
9187A93913e2817A52506h5021A1437K4349a45739j1784e0806b3763A69944h818
$$ 193913 -52817 152506 -85021 11437 35786 -145739 -157523 -50806 -23763 169944 -8818
9175b23152c8071A90493r2361a12061B31545p3940l5563a35674A33716a77661
$$ -223152 -38071 190493 98132 -112061 231545 157605 122042 -135674 133716 -177661
9164A55890e12379N8888J94856P6847l1634j4796b2817A08076d4907H362c09173
$$ 155890 -512379 -453491 -258635 -181788 -213422 -228218 -22817 108076 -44907 8362 -309173
9152i917A10260b63549B46318a38882j107q4943A61907b48732A874P0954a39196
$$ -9917 110260 -263549 246318 -138882 -139989 -224932 161907 -248732 1874 72828 -139196
9140B65345C1144a30970o7373L0544c8917j52867Q9022C4769h5309F1953o275
$$ 265345 31144 -130970 -198343 -167799 -38917 -191784 -102762 34769 -85309 61953 55678
9129E5678j0197A1152d41411b6007A39703m375b34150a04012A65037H763g1013
$$ 55678 45481 11152 -441411 -26007 139703 135328 -234150 -104012 165037 8763 -71013
9117A93427i9633j65099d6858A3772e9539J7821B0922d3853m6568M5181j60239
$$ 193427 -99633 -264732 -46858 13772 -59539 -41718 20922 -43853 -90421 -45240 -205479
9106b05479B97182E8310a22182P274l4931G1644e4234k02938C0032a05181k04069
$$ -205479 297182 58310 -122182 -114908 -149839 71644 -54234 -257172 30032 -105181 -309250
9095c09250J23085K8533L0510q3705F3235K39542b38136A52482a09035r8901k52120
$$ -309250 -186165 -157632 -127122 -210827 63235 302777 -238136 152482 -109035 -207936 -460056
9084d60056A83924J52825a78949a2696k39215i3688q9942Q0674l9338o3369B86137
$$ -460056 183924 336749 -178949 -12696 -251911 -93688 -183630 -102956 -142294 -205663 286137
9072b44669D6935a63386k8611J4495M6338E7654J39838i155l56681B6298c22470
$$ -244669 46935 -163386 -191997 -177502 -131164 57654 197492 -9155 -365836 26298 -322470
9060a23475j17313I1842L8720F3411a70493J7137f2520A14216J5154C3658i4093
$$ -123475 -240788 91842 130562 63411 -170493 -153356 -62520 114216 129370 33658 -94093
9048g1099k77301B26069j04191a30603A9073e8728A42820f2850B24021F0289M0027
$$ -71099 -348400 226069 121878 -130603 19073 -58728 142820 -62850 224021 60289 100316
9037A00316b68042A2665N6071K5566k2595N7849J0638a25140E4354a9194A99608
$$ 100316 -268042 12665 68736 94302 71707 129556 140194 -125140 54354 -19194 199608
9025B06918a93691a3803j82700Q1427k919l31506A09583P1698d5068k00038H9377
$$ 206918 -193691 -13803 -196503 -115076 -117995 -449501 109583 181281 -45068 -245106 89377
9013i8500f038H7543c37867p9154f8200m675j30360c448r2470A08380h0297r2460
$$ -98500 -6038 87543 -337867 -417021 -68200 -72875 -203235 -3448 -95918 108380 -80297 -172757
9001a72757A07473h7562L691A38908b02791O5788L627H7465q946c16913h6484
$$ -172757 107473 -87562 -83871 138908 -202791 -137003 -133376 87465 78519 -316913 -86484
8989b3066j03876A39585C832J51647p4742a11493B2085b51714p830J00607b7084
$$ -23066 -126942 139585 3832 155479 80737 -111493 22085 -251714 -259544 -158937 -27084
8977c07588B76732a8195l545k31966m65a13564j37152e0345A3886L6124e4674
$$ -307588 276732 -18195 -21740 -253706 -254171 -113564 -250716 -50345 13886 50010 -54674
8965a27158j47262B40166b40448h3049J7430A14074B4962c7578j32405G0504N5843
$$ -127158 -274420 240166 -240448 -83049 -65619 114074 24962 -37578 -169983 70504 126347
8954A26347B1740b49280f1729k9286d5079b660m7195A7698O0198A6540a26982
$$ 126347 21740 -249280 -61729 -91015 -45079 -2660 -49855 17698 77896 16540 -126982
8942G6697a66319l2855A61058m7919K38930A14337b57539B36216j7053E5260K39513
$$ 76697 -166319 -199174 161058 113139 352069 114337 -257539 236216 219163 55260 294773
8931B94773a5501H714K2549L39840F4375J90950R6972J415193L102650N549401
$$ 294773 -15501 8714 31263 371103 64375 255325 352297 1767490 4870140 10419541
8921A0419541k376307A872514D38947c9632B20639D7048c41318c6255m5282A59774
$$ 10419541 8043234 1872514 438947 -39632 220639 47048 -341318 -36255 -81537 159774
8910e5720q6787B79335r300b02683h5387b6711A30018b40740G2136J17661d29321
$$ -55720 -142507 279335 270035 -202683 -85387 -26711 130018 -240740 72136 189797 -429321
8898a77880G4236N7942b52151D03887A35747a68092b509A34852a88256A66356
$$ -177880 74236 132178 -252151 403887 135747 -168092 -2509 134852 -188256 166356
8887F7134k3800Q605J15491a01147j71662d9303o9881D415a82253o3558g5221
$$ 67134 43334 51939 167430 -101147 -272809 -49303 -119184 4415 -182253 -245811 -75221
8875f5207B49503a37039C7753a51195l0032I9632e093B44468E4852P9801d4044
$$ -65207 249503 -137039 37753 -151195 -181227 99632 -5093 244468 54852 134653 -44044
8863b47453d3249k28482C9424a74200L8292j2929C01326d29976a28496o6221k54024
$$ -247453 -43249 -271731 39424 -174200 -135908 -148837 301326 -429976 -128496 -194717 -448741
8852d48741D2104J2549g5592j1458B0907g3284L4145k60537h12A03294a8461k47994
$$ -448741 42104 54653 -75592 -87050 20907 -73284 -39139 -299676 -812 103294 -18461 -266455
$$ [...]
##END NTUPLES=NMR SPECTRUM
##END=
