##TITLE=AC1623_CTIAN13354_8326158_Or4ZAyMkGR
##JCAMPDX= 6.0         $$ Bruker NMR JCAMP-DX V2.0
##DATA TYPE= NMR SPECTRUM
##DATA CLASS= NTUPLES
##ORIGIN= BRUKER
##OWNER= Administrator
$$ 1.72 TOPSPIN		Version 2.1
$$ 2013-11-13 23:01:37.494 -0800  Administrator@X
$$ Compression mode = diff/dup
##.OBSERVE FREQUENCY= 400.02188249412
##.OBSERVE NUCLEUS= ^1H
##.ACQUISITION MODE= SIMULTANEOUS (DQD)
##.ACQUISITION SCHEME= undefined
##.AVERAGES= 8
##.DIGITISER RES= 22
##SPECTROMETER/DATA SYSTEM= spect
##.PULSE SEQUENCE= zg30
##.SOLVENT NAME= COFFEE_meoh
##.SHIFT REFERENCE= INTERNAL, COFFEE_meoh, 1, 14.98509
##AUDIT TRAIL= $$ (NUMBER, WHEN, WHO, WHERE, PROCESS, VERSION, WHAT)
$$ ##TITLE= Audit trail, TOPSPIN		Version 2.1
$$ ##JCAMPDX= 5.01
$$ ##ORIGIN= Bruker BioSpin GmbH
$$ ##OWNER= Administrator
$$ $$ E:\/data/COFFEE/nmr/AC1623_CTIAN13354_8326158_Or4ZAyMkGR/10/pdata/1/auditp.txt
$$ ##AUDIT TRAIL=  $$ (NUMBER, WHEN, WHO, WHERE, PROCESS, VERSION, WHAT)
(   1,<2013-11-13 23:01:29.759 -0800>,<Administrator>,<X>,<go>,<TOPSPIN 2.1>,
      <created by zg
	started at 2013-11-13 23:00:24.018 -0800,
	POWCHK enabled, PULCHK disabled,
       configuration hash MD5:
       C8 4E 4E 5D D3 5C D8 9E 9F 52 82 E0 59 8A DE 15
       data hash MD5: 64K
       C0 35 11 B9 E2 14 0D 6D 19 EC DE DE ED 43 51 33>)
(   2,<2013-11-13 23:01:32.806 -0800>,<Administrator>,<X>,<proc1d>,<TOPSPIN 2.1>,
      <Start of raw data processing
       efp LB = 0 FT_mod = 6 PKNL = 1 PHC0 = 0 PHC1 = 0 SI = 32K 
       data hash MD5: 32K
       02 0C C8 D7 91 D5 E6 C1 FA 2B 66 55 86 CC 68 31>)
(   3,<2013-11-13 23:01:33.119 -0800>,<Administrator>,<X>,<proc1d>,<TOPSPIN 2.1>,
      <pk PHC0 = 93.12012 PHC1 = 0 
       data hash MD5: 32K
       B2 6C EB D4 CA 6F F1 89 AF 4B 69 28 6D 97 44 09>)
(   4,<2013-11-13 23:01:33.353 -0800>,<Administrator>,<X>,<proc1d>,<TOPSPIN 2.1>,
      <abs ABSG = 1 
       data hash MD5: 32K
       F4 CD 3F A9 65 AF B4 69 AB 04 EF F8 AE 6D CA 58>)
(   5,<2013-11-13 23:01:33.541 -0800>,<Administrator>,<X>,<proc1d>,<TOPSPIN 2.1>,
      <abs ABSG = 2 
       data hash MD5: 32K
       51 52 B8 C9 2A 9A AB D7 3E 98 B9 0D FF F0 BD EB>)
(   6,<2013-11-13 23:01:33.666 -0800>,<Administrator>,<X>,<proc1d>,<TOPSPIN 2.1>,
      <abs ABSG = 3 
       data hash MD5: 32K
       F4 F7 8C BD 7F 85 E1 E4 0C 8D 85 02 D0 8C 92 A6>)
(   7,<2013-11-13 23:01:33.775 -0800>,<Administrator>,<X>,<proc1d>,<TOPSPIN 2.1>,
      <abs ABSG = 4 
       data hash MD5: 32K
       AD 7F A4 AD DF E3 D5 97 33 F0 A2 75 BE 44 9B 9B>)
(   8,<2013-11-13 23:01:33.853 -0800>,<Administrator>,<X>,<proc1d>,<TOPSPIN 2.1>,
      <abs ABSG = 5 
       data hash MD5: 32K
       A7 3A E9 50 FE 94 0C C3 DD C5 50 79 1D 6B A8 06>)
$$ ##END=
$$ 
$$ $$ hash MD5
$$ $$ 28 42 96 8F BD 30 DB 61 08 D1 41 8E 0A 29 8A 3E
##$RELAX= 
##$RELAX= 
##$RELAX= 
##$RELAX= 
##$RELAX= 
##$RELAX= 
##$RELAX= 
$$ Bruker specific parameters
$$ --------------------------
##$DU= <E:\>
##$EXPNO= 10
##$NAME= <AC1623_CTIAN13354_8326158_Or4ZAyMkGR>
$$ [...]
##$TP= (0..7)
150 150 150 150 150 150 150 150
##$TP07= 0
##$TPNAME0= <>
##$TPNAME1= <>
##$TPNAME2= <>
##$TPNAME3= <>
##$TPNAME4= <>
##$TPNAME5= <>
##$TPNAME6= <>
##$TPNAME7= <>
##$TPOAL= (0..7)
0.5 0.5 0.5 0.5 0.5 0.5 0.5 0.5
##$TPOFFS= (0..7)
0 0 0 0 0 0 0 0
##$TUNHIN= 0
##$TUNHOUT= 0
##$TUNXOUT= 0
##$USERA1= <user>
##$USERA2= <user>
##$USERA3= <user>
##$USERA4= <user>
##$USERA5= <user>
##$V9= 5
##$VALIST= <valist>
##$VCLIST= <CCCCCCCCCCCCCCC>
##$VD= 0
##$VDLIST= <DDDDDDDDDDDDDDD>
##$VPLIST= <PPPPPPPPPPPPPPP>
##$VTLIST= <TTTTTTTTTTTTTTT>
##$WBST= 1024
##$WBSW= 4
##$XGAIN= (0..3)
0 0 0 0
##$XL= 0
##$YL= 0
##$YMAX_a= 630034
##$YMIN_a= -534448
##$ZGOPTNS= <>
##$ZL1= 120
##$ZL2= 120
##$ZL3= 120
##$ZL4= 120
##$ABSF1= 14.98509
##$ABSF2= -5.573092
##$ABSG= 5
##$ABSL= 3
##$ALPHA= 0
##$AQORDER= 0
##$ASSFAC= 0
##$ASSFACI= 0
##$ASSFACX= 0
##$ASSWID= 0
##$AUNMP= <proc_prof1d_extract_pilot.lims>
##$AXLEFT= 0
##$AXNAME= <>
##$AXNUC= <1H>
##$AXRIGHT= 0
##$AXTYPE= 0
##$AXUNIT= <>
##$AZFE= 0.1
##$AZFW= 0.1
##$BCFW= 0
##$BC_mod= 0
##$BYTORDP= 0
##$COROFFS= 0
##$CY= 15
##$DATMOD= 1
##$DC= 0
##$DFILT= <>
##$DTYPP= 0
##$F1P= 0
##$F2P= 0
##$FCOR= 0.5
##$FTSIZE= 32768
##$FT_mod= 6
##$GAMMA= 0
##$GB= 0
##$INTBC= 1
##$INTSCL= 1
##$ISEN= 128
##$LB= 0
##$LEV0= 0
##$LPBIN= 0
##$MAXI= 10000
##$MC2= 0
##$MEAN= 0
##$ME_mod= 0
##$MI= 0
##$NCOEF= 0
##$NC_proc= -8
##$NLEV= 6
##$NOISF1= 0
##$NOISF2= 0
##$NSP= 0
##$NTH_PI= 0
##$NZP= 0
##$OFFSET= 14.98509
##$PC= 1
##$PHC0= 93.12012
##$PHC1= 0
##$PH_mod= 1
##$PKNL= yes
##$PPARMOD= 0
##$PPDIAG= 0
##$PPIPTYP= 0
##$PPMPNUM= 2147483647
##$PPRESOL= 1
##$PSCAL= 4
##$PSIGN= 0
##$PYNMP= <proc.py>
##$REVERSE= no
##$SF= 400.02
##$SI= 32768
##$SIGF1= 0
##$SIGF2= 0
##$SINO= 400
##$SIOLD= 32768
##$SPECTYP= <>
##$SREGLST= <1H.CDCl3>
##$SSB= 0
##$STSI= 32768
##$STSR= 0
##$SW_p= 8223.68421052631
##$SYMM= 0
##$S_DEV= 0
##$TDeff= 65536
##$TDoff= 0
##$TI= <>
##$TILT= no
##$TM1= 0
##$TM2= 0
##$TOPLEV= 0
##$USERP1= <user>
##$USERP2= <user>
##$USERP3= <user>
##$USERP4= <user>
##$USERP5= <user>
##$WDW= 1
##$XDIM= 32768
##$YMAX_p= 462245634
##$YMIN_p= -648019
##$CURPLOT= <Network HP LaserJet P1505>
##$CURPRIN= <$Network HP LaserJet P1505>
##$DFORMAT= <normdp>
##$LAYOUT= <+/1D_H.xwp>
##$LFORMAT= <normlp>
##$PFORMAT= <normpl>
##$SURQMSG= 1
$$ End of Bruker specific parameters
$$ ---------------------------------
##NTUPLES= NMR SPECTRUM
##VAR_NAME=  FREQUENCY,     SPECTRUM/REAL,   SPECTRUM/IMAG
##SYMBOL=    X,             R,               I
##VAR_TYPE=  INDEPENDENT,   DEPENDENT,       DEPENDENT
##VAR_FORM=  AFFN,          ASDF,            ASDF
##VAR_DIM=   32768,         32768,           32768
##UNITS=     HZ,            ARBITRARY UNITS, ARBITRARY UNITS
##FACTOR=    0.250966925370066, 1,           1
##FIRST=     8223.43324360094, 42749,        -53484
##LAST=      0,             137550,          -935
##MIN=       0,             -648019,         0
##MAX=       8223.43324360094, 462245634,    0
$$ Real data points
##PAGE= N=1
##DATA TABLE= (X++(R..R)), XYDATA
$$ [...]
19522i6034A8977c6823o4717j85981c1667m6465L4324k32998A06276J30669B2836
$$ -96034 18977 -36823 -101540 -287521 -31667 -78132 -43808 -276806 106276 236945 22836
19510a3797l44549G4097a764l33782J02547a7159j3622k44671a936j85100R1611
$$ -13797 -358346 74097 -1764 -335546 -232999 -17159 -30781 -275452 -1936 -187036 -95425
19499i5425M0928E940c21438J25231D8951f8437A0831M8153b64364A58332b86283
$$ -95425 -54497 5940 -321438 -196207 48951 -68437 10831 58984 -264364 158332 -286283
19487i7973B34273a05405c2224D0957a50545C06373a3999l34491J51072j7384
$$ -97973 234273 -105405 -32224 40957 -150545 306373 -13999 -348490 -197418 -214802
19477b14802f7997m2149F7358e7601A44624B5914O7552j2991k0963b57164Q4737
$$ -214802 -67997 -110146 67358 -57601 144624 25914 93466 80475 59512 -257164 -172427
19466a72427j165m5860d8788k20074A72574a2355k0598l53323A37734q428C0281
$$ -172427 -173592 -219452 -48788 -268862 172574 -12355 -32953 -386276 137734 129306 30281
19454A20738A7440a30195I6931J2950a82639B78927A04176J89902a17616N4690
$$ 120738 17440 -130195 96931 109881 -182639 278927 104176 294078 -117616 -62926
19444f2926j47451i188A28687a2013l1638k08808g1607A855c39052Q6214d5923
$$ -62926 -210377 -9188 128687 -12013 -43651 -252459 -71607 1855 -339052 -252838 -45923
19432d2974j43659j48498A74502N3518h3792m5704p3186j43763A82676M75154
$$ -42974 -186633 -335131 174502 228020 -83792 -129496 -202682 -346445 182676 657830
19422F57830h584k12923B91721a0560j46054C5394a25190D632a30869B0542a37558
$$ 657830 -8584 -221507 291721 -10560 -156614 35394 -125190 4632 -130869 20542 -137558
19410A34525a51358k1660j05667A30036N9908C1224b96512B5095b05398m529N3577
$$ 134525 -151358 -173018 -278685 130036 189944 31224 -296512 25095 -205398 -209927 -156350
19399a56350B1090L03673a80458j64006a29166j83077a43834c7733d177k363B74190
$$ -156350 21090 324763 -180458 -344464 -129166 -312243 -143834 -37733 -4177 -6540 274190
19387B32479o8094d1895A68972p8769c46346d3775a5009E2393Q6122a49860A23040
$$ 232479 164385 -41895 168972 90203 -346346 -43775 -15009 52393 138515 -149860 123040
19375i1424A54792J1214a27001j5661A21791J00459a56076l2952K1388j34995
$$ -91424 154792 166006 -127001 -142662 121791 222250 -156076 -189028 -167640 -302635
19365c02635Q8332f4535I1870e3550j29585H1017l28b71225J297a33109j93290
$$ -302635 -214303 -64535 91870 -53550 -183135 81017 80689 -271225 -269928 -133109 -326399
19354c26399B58465c98992A25350K08459d34714i6434A65481b27825a08339j91950
$$ -326399 258465 -398992 125350 333809 -434714 -96434 165481 -227825 -108339 -300289
19344c00289A44805E7655A200J92195I046e1380m63267A85716J13627f9889j63504
$$ -300289 144805 57655 1200 193395 9046 -51380 -514647 185716 299343 -69889 -233393
19333b33393i9317d5730A25622j7738f8146n201B20624D2817g8873j47693Q3838
$$ -233393 -99317 -45730 125622 107884 -68146 -73347 220624 42817 -78873 -226566 -142728
19322a42728O3618C5693b68756a07357I524g3735j85212J03329d6931j12343e4876
$$ -142728 -79110 35693 -268756 -107357 9524 -73735 -258947 -155618 -46931 -159274 -54876
19310H7219g9637A35920N9314b33531R1614k82426J88271A94362a59079B9939
$$ 87219 -79637 135920 195234 -233531 -141917 -424343 -236072 194362 -159079 29939
19299C5489a37313r387B1461b40409R0453j82227o3577A7679b69053C11902a96269
$$ 35489 -137313 -146700 21461 -240409 -149956 -332183 -395760 17679 -269053 311902 -196269
19287H2984P962M989m2302a9134B58721e8218B1439Q2731L5176b96946J07306
$$ 82984 90946 95935 53633 -19134 258721 -58218 21439 104170 139346 -296946 -189640
19276a89640h3275o900j02980F2088r658f3955k870H1002d69318i171D05893a67747
$$ -189640 -83275 -90175 -193155 62088 52430 -63955 -66825 81002 -469318 -9171 405893 -167747
19263a62529b9647A45369a33574A66787a08599j01848R1055A16887j6094l5270
$$ -162529 -29647 145369 -133574 166787 -108599 -210447 -119392 116887 100793 65523
19253F5523N5813E2907b40438d7867G7548b02452B06581h998A90529a14344k7355
$$ 65523 121336 52907 -240438 -47867 77548 -202452 206581 -8998 190529 -114344 -141699
19242a41699O7288b7437l37224a48669A04446a57920n7047H5417c45982i7918
$$ -141699 -74411 -27437 -364661 -148669 104446 -157920 -214967 85417 -345982 -97918
19231f9250J3146j9680E0953b8852k35481k8241F0015J43061a50512j10658A27491
$$ -69250 -56104 -75784 50953 -28852 -264333 -292574 60015 203076 -150512 -261170 127491
19219d8913H5582d5345C4468M8389a19304O938G382J13304B6289l264c37236A14686
$$ -48913 85582 -45345 34468 82857 -119304 -112366 7382 120686 26289 23025 -337236 114686
19206G2529a11175j13341F822a6000H367b95182H5398a72867b3786q0407K5681
$$ 72529 -111175 -224516 6822 -16000 8367 -295182 85398 -172867 -23786 -104193 -78512
19195g8512A75668g2400B27664o3673a18308M3097K2682j79832A55246b03898
$$ -78512 175668 -72400 227664 163991 -118308 -75211 -52529 -232361 155246 -203898
19184a51084B7450K2701a90536M7979J3783A65352c64076A06333b4875j29919
$$ -151084 27450 50151 -190536 -142557 -128774 165352 -364076 106333 -24875 -154794
19174a54794C8743b9621j59476B4428h7481m385A21914D9630A0058b05539r9357
$$ -154794 38743 -29621 -189097 24428 -87481 -91866 121914 49630 10058 -205539 -304896
19163c04896a03771D6514f4460k07062c1066B40781p9865G2706l391g9942l1249
$$ -304896 -103771 46514 -64460 -271522 -31066 240781 160916 72706 69315 -79942 -111191
19152a11191l537A73438h3649n3212A79415n4466O440c70539C9718b9966A50267
$$ -111191 -114728 173438 -83649 -136861 179415 124949 131389 -370539 39718 -29966 150267
19140f1984j53297A2698a76934A46205b0334m1280a8394B2803a7971D4284J22307
$$ -61984 -215281 12698 -176934 146205 -20334 -61614 -18394 22803 -17971 44284 166591
19129A66591f4536A15117j9678e2320K72A22512B4206a16915N1184B3300d5311
$$ 166591 -64536 115117 95439 -52320 -52048 122512 24206 -116915 -65731 23300 -45311
19117a46634B28633a97332g4955A83309G2200e52891b33599g789k0365j96186
$$ -146634 228633 -197332 -74955 183309 72200 -552891 -233599 -7789 -28154 -224340
19107b24340k30933G7531c36606a11592g912q2198C1535b89619N2378R8656p1252
$$ -224340 -455273 77531 -336606 -111592 -7912 -90110 31535 -289619 -237241 -138585 -209837
19096b09837f7044C29346b17424k10137a28669G3255a0044C30595A13292b70541
$$ -209837 -67044 329346 -217424 -427561 -128669 73255 -10044 330595 113292 -270541
19085b5945j42470j5171o397D300R3248a51387M9657A30540e163j10236k3317
$$ -25945 -168415 -183586 -189983 4300 97548 -151387 -101730 130540 -5163 -115399 -138716
19074a38716A41745A4561b36909C54024a75224c7119k12319h9213A36930Q1687
$$ -138716 141745 14561 -236909 354024 -175224 -37119 -249438 -89213 136930 218617
19064B18617d1527j34480A99693m7855Q7392a91993b7448D8880a25383a5499C45146
$$ 218617 -41527 -176007 199693 151838 239230 -191993 -27448 48880 -125383 -15499 345146
19052e00728a30478b1743C0674K41463i548j39144k8842F2156M1201B4573e300
$$ -500728 -130478 -21743 30674 272137 -9548 -148692 -177534 62156 103357 24573 -5300
19040A04619a27692m1725G1122j0226a00166L2609A548P3228J77037H9923a69393
$$ 104619 -127692 -169417 71122 60896 -100166 -67557 1548 74776 251813 89923 -169393
19028F058J67013q0161O0490F0551J2416J9318b63745B26572K5347q8384M5363
$$ 6058 173071 92910 153400 60551 72967 92285 -263745 226572 251919 163535 208898
19017B08898A04058c2320n5136k15725a35686F9734b82601i468B42954b34999
$$ 208898 104058 -32320 -87456 -303181 -135686 69734 -282601 -9468 242954 -234999
19006A60557a30040A17101b90541A54948b06835k25598F8675Q6893o0643N7457
$$ 160557 -130040 117101 -290541 154948 -206835 -432433 68675 155568 94925 152382
18996A52382R9655b65371d6500j04617L2263o2942B71479c5316m41523B0002c94658
$$ 152382 252037 -265371 -46500 -151117 -118854 -181796 271479 -35316 -476839 20002 -394658
18984A01319e2588A02699a88894j23026b2543j45088C6052R8477K60829B4720
$$ 101319 -52588 102699 -188894 -311920 -22543 -167631 36052 134529 395358 24720
18973b24151I5711a11230l8865j04623k401G5281L0690c993k38465Q1320j84419
$$ -224151 95711 -111230 -150095 -254718 -257119 75281 105971 -3993 -242458 -161138 -345557
18962c45557G4455e78919f5188j13615G8668e3146a6671r7006G0968a24768n9418
$$ -345557 74455 -578919 -65188 -178803 78668 -53146 -16671 -113677 70968 -124768 -184186
18951a84186Q4553N419k5297d0821l99015E4618b64432C17204H1085l8197c14469
$$ -184186 -99633 -94214 -119511 -40821 -439836 54618 -264432 317204 81085 42888 -314469
18939c53833A67947a6776F8816b40799C10073j15412G2865a53747B25899p3704
$$ -353833 167947 -16776 68816 -240799 310073 194661 72865 -153747 225899 152195
18929A52195G97a05606k45778a1n3883B30354c3093E6109a70017h2139I9144Q1299
$$ 152195 797 -105606 -351384 -11 -53894 230354 -33093 56109 -170017 -82139 99144 180443
18917A80443b4326B95371d4620k63425D850l59a9801p2062B43269d2601a4642
$$ 180443 -24326 295371 -44620 -308045 4850 4491 -19801 -91863 243269 -42601 -14642
18905B8836L38868A50488a58331J477f1016j03661A15477a49383M7939j24998
$$ 28836 367704 150488 -158331 -156854 -61016 -164677 115477 -149383 -101444 -226442
18895b26442i5027k60032g6725A56231a92502d7062G1936a06003J4527H2064b29403
$$ -226442 -95027 -355059 -76725 156231 -192502 -47062 71936 -106003 -91476 82064 -229403
18883c25474e9877q8909d9421j46831C24507b94218A31388a97846K1225h0575
$$ -325474 -59877 -148786 -49421 -196252 324507 -294218 131388 -197846 -176621 -80575
18872C59973j70600G1444a11950j6733B717a00608C5503J66269G2702c13865a05035
$$ 359973 189373 71444 -111950 -128683 2717 -100608 35503 201772 72702 -313865 -105035
18860b19105l18230G8367g9496j69229m8384f3633k049p4228B91075D9237K30389
$$ -219105 -537335 78367 -79496 -248725 -297109 -63633 -65682 -139910 291075 49237 279626
18849B79626n2306c6242r5877K8525K2000j21910d6333j58700B9104b69719P619
$$ 279626 227320 -36242 -132119 -103594 -81594 -203504 -46333 -205033 29104 -269719 -262100
18838b62100c4682L651j79714G8169J77199a14503c3080e994j29555L8122j8762
$$ -262100 -34682 -31031 -210745 78169 255368 -114503 -33080 -5994 -135549 -97427 -116189
18827a16189r3838A31989D5543M0438c94243H1399e8186B8811J04686K36702j72739
$$ -116189 -210027 131989 45543 85981 -394243 81399 -58186 28811 133497 370199 197460
18816A97460K46574A84463a41467c122B66401n7482l6224a48857b0753D044K17900
$$ 197460 444034 184463 -141467 -3122 266401 208919 172695 -148857 -20753 4044 221944
18805B21944b500B1343Q8056a73095H3390J00686a37954m0997b7592C185d877
$$ 221944 -2500 21343 109399 -173095 83390 184076 -137954 -178951 -27592 3185 -4877
18793F4457b82661d5902q4954M4650C25768A00105a43851g0415L1352f217A95253
$$ 64457 -282661 -45902 -130856 -86206 325768 100105 -143851 -70415 -39063 -6217 195253
18781i5683J7547L0079j10359A37002b2100A16705D6745k2751I715b88610d5606
$$ -95683 -78136 -48057 -158416 137002 -22100 116705 46745 23994 9715 -288610 -45606
18769a27007L6869B64051q3828n7057L4408a02824g6l9503j65337K438R8201A68981
$$ -127007 -90138 264051 180223 123166 157574 -102824 -76 -39579 -204916 -202478 -104277 168981
18756g4004k1560a6036n08212J59573J31868M5833i2081L4224j90904l22929a37467
$$ -74004 -95564 -16036 -524248 -364675 -232807 -186974 -92081 -57857 -248761 -571690 -137467
18744A477b22553C03066i5450c6425B09898o1106b19570Q7994R225M5201A26517
$$ 1477 -222553 303066 -95450 -36425 209898 148792 -219570 -131576 -122351 -77150 126517
18732G5206j19c40033e8571k62079i4206F3154L31035a50892a0888l31960A22088
$$ 75206 75087 -340033 -58571 -320650 -94206 63154 394189 -150892 -10888 -342848 122088
18720a89079c147A1057a19376K032k71555A0329h8299l20397a25055D9521L3206
$$ -189079 -3147 11057 -119376 -117344 -388899 10329 -88299 -408696 -125055 49521 82727
18709H2727f4554k41689A05820c39858a59183e7739q5070B99013q2672r8486J52822
$$ 82727 -64554 -306243 105820 -339858 -159183 -57739 -142809 299013 216341 117855 270677
18698B70677D6603c86390A08236a27133e6693E3083c3745F1044a91650g8006G875
$$ 270677 46603 -386390 108236 -127133 -56693 53083 -33745 61044 -191650 -78006 7875
18686a89150B50527c27611g7388J9508l5330k92762C83652I5211h9133a8933j03024
$$ -189150 250527 -327611 -77388 -57880 -93210 -385972 383652 95211 -89133 -18933 -121957
18675a21957A87947b4990j0556j48367j52805B5777c1740j28394D1483d5148H7035
$$ -121957 187947 -24990 -35546 -183913 -336718 25777 -31740 -160134 41483 -45148 87035
18663c69750A00195K53004b28006n8223A36906K1504b90251b5056A07506f4469
$$ -369750 100195 353199 -228006 -286229 136906 158410 -290251 -25056 107506 -64469
18652a94029A21355D4543j6871c45152J28678G1504d45642a24861o2221a7757
$$ -194029 121355 44543 27672 -345152 -216474 71504 -445642 -124861 -187082 -17757
18641h3192F7267A8855J60658B1375M7624a55828B69438G7898a27829c570o6014
$$ -83192 67267 18855 179513 21375 68999 -155828 269438 77898 -127829 -3570 -69584
18630f9584A49871p1271i8832j72116R9674j99909R9543J16236j23727P9829g4122
$$ -69584 149871 78600 -98832 -270948 -171274 -371183 -271640 -155404 -279131 -199302 -74122
18618F5152J93985a27817H039P4505j1023M1644J10873H4306a46367J6445A96673
$$ 65152 259137 -127817 8039 82544 71521 113165 224038 84306 -146367 -129922 196673
18606c11022f9211o4824j39774A61569d9116j01906c6943I4346D4145c4346J1470
$$ -311022 -69211 -134035 -273809 161569 -49116 -151022 -36943 94346 44145 -34346 -22876
18595b2876D79288A52044a26271A14252d30816B35092a84666H7506a0603k31006
$$ -22876 479288 152044 -126271 114252 -430816 235092 -184666 87506 -10603 -241609
18585b41609b2249n8400A76089H4780k5587L4990a07665k62634G8823b41929P6890
$$ -241609 -22249 -80649 176089 84780 59193 94183 -107665 -370299 78823 -241929 -165039
18574a65039B7562b42192h7834A2540c32555A64983A5645N4441d2004l6311E9210
$$ -165039 27562 -242192 -87834 12540 -332555 164983 15645 70086 -42004 -78315 59210
18562C0346J41177a64835d8055H090J32503c99139a78560A24076K28406A5939
$$ 30346 171523 -164835 -48055 8090 140593 -399139 -178560 124076 352482 15939
18551i4574G1039e9135G3919e3461j27840Q4202k7892G167a41409O4442k8651
$$ -94574 71039 -59135 73919 -53461 -181301 -97099 -124991 7167 -141409 -76967 -105618
18540a05618e2447J3199n6150j04227A65281n5629a56660K2030q2753Q4352j67324
$$ -105618 -52447 -39248 -95398 -199625 165281 109652 -156660 -134630 -217383 -133031 -300355
18529c00355f1497k70280A49841h9353D6911c76421A542J51935c09118a29419
$$ -300355 -61497 -331777 149841 -89353 46911 -376421 1542 153477 -309118 -129419
18518A0300a32175E4509f3823J7546E3611a35720f542C92396d2372j06994N1544
$$ 10300 -132175 54509 -63823 -46277 53611 -135720 -6542 392396 -42372 -149366 -97822
18507i7822L8911k41744c3584j81741c8818B28373d7708j95618g7822l9364F4829
$$ -97822 -58911 -300655 -33584 -215325 -38818 228373 -47708 -243326 -77822 -117186 64829
18495G4095a52243B74856a5033k47812d1229n1581j93355A10759d62792G0420
$$ 74095 -152243 274856 -15033 -262845 -41229 -92810 -286165 110759 -462792 70420
18484A93001a65739A32071n6136c64371a6605j68375R2070J4768A77184b76739
$$ 193001 -165739 132071 75935 -364371 -16605 -184980 -92910 -78142 177184 -276739
18473A32608a68070J6377n2791A10246B9281d6765l40165J61304D831h2172B1035
$$ 132608 -168070 -151693 -204484 110246 29281 -46765 -386930 -225626 4831 -82172 21035
18461H0912d630C6832b485k31489j7784F4850a95157c8503A38148c19663C2202
$$ 80912 -4630 36832 -2485 -233974 -251758 64850 -195157 -38503 138148 -319663 32202
18449B69057b77647f249A75983H4872a77658c43A58067O1947a80819A49744Q7662
$$ 269057 -277647 -6249 175983 84872 -177658 -343 158067 220014 -180819 149744 237406
18438B37406G2729d05444B09118c31189B47812f7200H5985b65721A83388E3360
$$ 237406 72729 -405444 209118 -331189 247812 -67200 85985 -265721 183388 53360
18427A21097a23686l5789k2367B7999b18416e4759A14045D6961a08497q1367P6023
$$ 121097 -123686 -159475 -181842 27999 -218416 -54759 114045 46961 -108497 -189864 -113841
18416a13841r3744h0938b1280a0283r2026B82787d1505B08734A03610c2295A24208
$$ -113841 -207585 -80938 -21280 -10283 -102309 282787 -41505 208734 103610 -32295 124208
18404b938j0367I2446a24089A55637b66692B9814J37815a07318A26637a31261
$$ -2938 -13305 92446 -124089 155637 -266692 29814 167629 -107318 126637 -131261
18393i6035A75212l7431b3352A31115a49226o8433b2817j05091f006F925a33025
$$ -96035 175212 137781 -23352 131115 -149226 -217659 -22817 -127908 -6006 6925 -133025
18381a43872l95823a45414C03325c55343B3836M6342e1362a6076j32826r2313
$$ -143872 -539695 -145414 303325 -355343 23836 70178 -51362 -16076 -148902 -241215
18371b41215B72321I4343h2649E401h385A19222J19754a66380C17058a15628F6307
$$ -241215 272321 94343 -82649 5401 -8385 119222 238976 -166380 317058 -115628 66307
18359A6399M19790g4318J3518A13359b09619B50656G0424O6181N6918f821A28225
$$ 16399 436189 -74318 -60800 113359 -209619 250656 70424 136605 193523 -6821 128225
18347G5238b85986a6128j53441f8335d710k08416e0418A726L205b26178F4669
$$ 75238 -285986 -16128 -169569 -68335 -4710 -213126 -50418 1726 4931 -226178 64669
18335h7266B8515c3725B36893p2721c2132B6647G835J40120b3949k11492A58807
$$ -87266 28515 -33725 236893 164172 -32132 26647 7835 147955 -23949 -235441 158807
18323a0070k09775o7383A3101K50679D222a39437M9131D5608d55928J95958M6012
$$ -10070 -219845 -287228 13101 263780 4222 -139437 -90306 45608 -455928 -259970 -213958
18312b13958A81181a38428A98108d34925J10249K3609i5385A90948F9902a26903
$$ -213958 181181 -138428 198108 -434925 -324676 -301067 -95385 190948 69902 -126903
18301B27437A7344Q7136A7931b8422H5413a40403m8090O0981k14515D8590e5760
$$ 227437 17344 104480 17931 -28422 85413 -140403 -188493 -127512 -342027 48590 -55760
18289i1264I37R2247a06146A05769a91768c3562G0308f5058c368a583A04340b76683
$$ -91264 937 93184 -106146 105769 -191768 -33562 70308 -65058 -3368 -1583 104340 -276683
18276F9499a70314j11361B97296r1473G5130C6012h3974D2572L9580i0746l077
$$ 69499 -170314 -281675 297296 205823 75130 36012 -83974 42572 82152 -90746 -93823
18265i3823B63865k1412h4835j87199P6824A64457m2090m3935a317p5453C13174
$$ -93823 263865 242453 -84835 -272034 -195210 164457 122367 78432 -1317 -76770 313174
18253A7353i3103A9036a18249B80718a68082p5563D9547j698a71920b0441A44431
$$ 17353 -93103 19036 -118249 280718 -168082 -243645 49547 47849 -171920 -20441 144431
18241C70668e7236p2763a8787l48958j04277a49245e7649k2370j35464j28138
$$ 370668 -57236 -129999 -18787 -367745 -472022 -149245 -57649 -80019 -215483 -343621
18231c43621c9057p2733C3643q410a36570G0064H725i6537A0837K47012a06228
$$ -343621 -39057 -111790 33643 25233 -136570 70064 8725 -96537 10837 257849 -106228
18219e0262j46096g9386J4922D9270c0011A93533H345c59038J20131L5491c4985
$$ -50262 -196358 -79386 -64464 49270 -30011 193533 8345 -359038 -238907 -203416 -34985
18207a26062B26095F1928d3203A18529b32011P3941j1099C4683j6177a22408K2508
$$ -126062 226095 61928 -43203 118529 -232011 -158070 -169169 34683 18506 -122408 -99900
18196i9900A46282g2766a8629l29447k8780C29656a33127B0530Q4740n0835d7952
$$ -99900 146282 -72766 -18629 -348076 -376856 329656 -133127 20530 105270 54435 -47952
18184c65024G5539a56201l20317a02376k9617A29726f2351J3452j52094i9199
$$ -365024 75539 -156201 -476518 -102376 -131993 129726 -62351 -48899 -200993 -99199
18173A74915a74342j4622A67981E7104m175g6426B99889h9183J2106l19525b2681
$$ 174915 -174342 -188964 167981 57104 52929 -76426 299889 -89183 -77077 -396602 -22681
18161a60489L0946r2273a1369A8080N9939a68729O2229b6740r2617r3428b0186
$$ -160489 -129543 -221816 -11369 18080 78019 -168729 -106500 -26740 -119357 -212785 -20186
18149b21352c8488D3721J31650a30764J7444I8269c8790Q849j7100q8204J4771
$$ -221352 -38488 43721 175371 -130764 -113320 98269 -38790 -29941 -47041 -135245 -120474
18138a20474a8585j72313A62151b98917b0207j36742K8699j28609A11157D0370
$$ -120474 -18585 -190898 162151 -298917 -20207 -156949 -128250 -256859 111157 40370
18127B82455a65804o7353C77753d14672H6606b81975J27487B90516C4710N2593
$$ 282455 -165804 -233157 377753 -414672 86606 -281975 -154488 290516 34710 87303
18117H7303b13510l943A21395b43074A45906l9775n1987J97444b83949J8089C01224
$$ 87303 -213510 -217453 121395 -243074 145906 106131 54144 251588 -283949 -265860 301224
18105b19104P9180B42885J02991b13953f8964k0575G0898J09261d8689a675l40982
$$ -219104 -139924 242885 345876 -213953 -68964 -89539 70898 180159 -48689 -1675 -342657
18094c42657a44353j3586C094a67280p7279A08137b83969f383G1217b27954B10401
$$ -342657 -144353 -157939 3094 -167280 -244559 108137 -283969 -6383 71217 -227954 210401
18082A2643e0316l4100B79664l2189d9490B89562A14129f3551A29512j8642f472
$$ 12643 -50316 -84416 279664 247475 -49490 289562 114129 -63551 129512 110870 -6472
18070B04736a49557I0103b50208J09616o76o0787D4153i378l21437B25883m9065
$$ 204736 -149557 90103 -250208 -140592 -141268 -202055 44153 -9378 -330815 225883 176818
18059A76818B6208f4482j05928P4352j10832B30256D6084K271b11644D8651b4753
$$ 176818 26208 -64482 -170410 -96058 -206890 230256 46084 48355 -211644 48651 -24753
18047b0884A64140f7211j16156I0859a7722A10781d61761B97127a40913M5236
$$ -20884 164140 -67211 -183367 90859 -17722 110781 -461761 297127 -140913 -95677
18037i5677B08740b54090A24289k7231m447J5255d18860B215g0109H0701i1244
$$ -95677 208740 -254090 124289 97058 92611 107866 -418860 2215 -70109 80701 -91244
18025a42263B60935b25962h1120k07553e9023A77398b6107j44351G1012J94788
$$ -142263 260935 -225962 -81120 -288673 -59023 177398 -26107 -170458 71012 265800
18015B65800b05014l8357A52259A585L08535c24167f5095A44378g0735j71638
$$ 265800 -205014 -243371 152259 1585 310120 -324167 -65095 144378 -70735 -242373
18005b42373i7855K9314p6933q8873R2540C6783b2610A03379A1342a08837B21942
$$ -242373 -97855 -68541 -145474 -234347 -141807 36783 -22610 103379 11342 -108837 221942
17993a52819q5010A61529N2825C6414g5170J9179m0993C19530a79446d1118G8546
$$ -152819 -237829 161529 214354 36414 -75170 -55991 -96984 319530 -179446 -41118 78546
17981B02847d7669H0122M0654c06160G7222i8112A05647a46723l33012A44308
$$ 202847 -47669 80122 120776 -306160 77222 -98112 105647 -146723 -479735 144308
17970a45174d67k29432n3339G2519Q320a34911b4009n3973F7511a62819b2094
$$ -145174 -467 -229899 -283238 72519 80839 -134911 -24009 -77982 67511 -162819 -22094
17958I9608e6049j56105g4385C32882A49440m4694a45527A36118m770c38486C5775
$$ 99608 -56049 -212154 -74385 332882 149440 104746 -145527 136118 131348 -338486 35775
17946C9248a0297B40743e1376a2731o7234B40482C1224N1158J58611i330A1069
$$ 39248 -10297 240743 -51376 -12731 -79965 240482 31224 82382 240993 -9330 11069
17934a23413j06920i5445H5308J72634j09955k9947l6378a23983A12276h8525
$$ -123413 -230333 -95445 85308 257942 147987 118040 81662 -123983 112276 -88525
17923a27818q5518A04799K670a83034b1653n1043B6477J08817n3896e0419F2038
$$ -127818 -213336 104799 107469 -183034 -21653 -72696 26477 135294 81398 -50419 62038
17911b00513C9345K64675A46209K29332a82175O6232A39845E2447j3029c57728
$$ -200513 39345 304020 146209 375541 -182175 -115943 139845 52447 39418 -357728
17900e5837D8678K27183C8174L48953p5381b2098j40608b4921n1122A47075D4200
$$ -55837 48678 275861 38174 387127 311746 -22098 -162706 -24921 -76043 147075 44200
17888B89818e155r2458A93989d2884j54678c2763A442g4363l73454a4756B56678
$$ 289818 -5155 -97613 193989 -42884 -197562 -32763 1442 -74363 -447817 -14756 256678
17876D5983J3284c68531e0338A47206k7713K6182a84277J6465B70519j00657A6210
$$ 45983 59267 -368531 -50338 147206 119493 145675 -184277 -167812 270519 169862 16210
17864A27723f6801l37293H7062Q414K27156j21904a55581A29013C3396Q2537D0795
$$ 127723 -66801 -404094 87062 95476 322632 200728 -155581 129013 33396 115933 40795
17852a82274A69410a62106A4905a63328A78112d00355a21046B75750E664J45036
$$ -182274 169410 -162106 14905 -163328 178112 -400355 -121046 275750 5664 150700
17842A50700m7260b1231k14962O9588h0446F0687c24929A9381K03479I2285O7954
$$ 150700 103440 -21231 -236193 -166605 -80446 60687 -324929 19381 222860 92285 160239
17831A60239K31916a24325c6876j72591j42688A4952J28173E3486a97207H0046
$$ 160239 392155 -124325 -36876 -209467 -352155 14952 143125 53486 -197207 80046
17820A27363d60427a52733B8560c9699B09346d5005i097k6381j49039C21756A26337
$$ 127363 -460427 -152733 28560 -39699 209346 -45005 -9097 -35478 -184517 321756 126337
17808a36600l2435A17687P7419b517k80048B92202a01254j01568a01032D87802
$$ -136600 -169035 117687 195106 -2517 -282565 292202 -101254 -202822 -101032 487802
17797A90783H3255a98673O2239j93039a03732A84209a6721B01206d6028j15725
$$ 190783 83255 -198673 -136434 -329473 -103732 184209 -16721 201206 -46028 -161753
17787a61753o2441B23784b66023H8772m3200A0495e1843k10430a27615o0496d13
$$ -161753 -224194 223784 -266023 88772 45572 10495 -51843 -262273 -127615 -188111 -413
17775D2842J47229n3154a01378A5020N7322l2810N035b34492A15018i6881A03538
$$ 42842 190071 136917 -101378 15020 72342 39532 44567 -234492 115018 -96881 103538
17763d2597C530a11253F5445b64250c8362l9530j91548a34155C55225A54296b111
$$ -42597 3530 -111253 65445 -264250 -38362 -77892 -269440 -134155 355225 154296 -2111
17751a57280f7812m811A58098O9888K6327J01185D2835b71390a02320E9598A6375
$$ -157280 -67812 -72623 158098 227986 254313 355498 42835 -271390 -102320 59598 16375
17739A24167h8691C8047M9214a45982A02421B1428c26971A50717d5524J6151j10739
$$ 124167 -88691 38047 87261 -145982 102421 21428 -326971 150717 -45524 -29373 -140112
17728a40112E5839J53476N3881r6011e2802J4247j16907M0881C3202a28295j52860
$$ -140112 55839 209315 263196 167185 -52802 -38555 -155462 -114581 33202 -128295 -281155
17717b81155r6430A07141a51094A13044B78J7722R5138C1297A2909a17734I7251
$$ -281155 -377585 107141 -151094 113044 278 18000 113138 31297 12909 -117734 97251
17705b76300A00161M8761j7739J23387b58716j67951a88119G6848a01647B67092
$$ -276300 100161 148922 131183 254570 -258716 -426667 -188119 76848 -101647 267092
17694B57566j16078b08125C25411a6948I2465J02662e9427j00354A24540n9014
$$ 257566 141488 -208125 325411 -16948 92465 195127 -59427 -159781 124540 65526
17684F5526b66136J05478g9366l04131a46265E3727M1433D7268a7309C75548a82326
$$ 65526 -266136 -160658 -79366 -383497 -146265 53727 95160 47268 -17309 375548 -182326
17672D4770d1993I201a49477c6022F212d8939D4092A8059J49355p0714a26874
$$ 44770 -41993 9201 -149477 -36022 6212 -48939 44092 18059 167414 96700 -126874
17660D4756m929A6859K70750r1180b72028A79097G9841a2155l08276J58202B09022
$$ 44756 39827 16859 287609 196429 -272028 179097 79841 -12155 -320431 -162229 209022
17648B482J80769L255F6523k9219J28628G0017L17974l1152A3120K09112c68011
$$ 2482 183251 186506 66523 37304 165932 70017 387991 356839 13120 222232 -368011
17636A79320o5123J29818a30625A05022N5801d4850I5313O7154c3204C28579g0367
$$ 179320 114197 244015 -130625 105022 160823 -44850 95313 162467 -33204 328579 -70367
17624d44928a8066l1072B26425D9141k1096c51247i8724A4253J22992f6017r56
$$ -444928 -18066 -49138 226425 49141 28045 -351247 -98724 14253 137245 -66017 -66973
17613f6973b4651j95561A81418J81449D6955j2297K9814a06441k7549i24A60021
$$ -66973 -24651 -220212 181418 362867 46955 34658 64472 -106441 -133990 -924 160021
17601C4058a40399q4501f7407E1791k1929c43995E2469J9936a28648o277j37024
$$ 34058 -140399 -224900 -67407 51791 29862 -343995 52469 72405 -128648 -134925 -271949
17590b71949A01099l1945j9532a40323C11402k2970i6988A80999C6231J16467
$$ -271949 101099 69154 49622 -140323 311402 288432 -96988 180999 36231 152698
17580A52698a1761j78648A83429b15491A34644m237M68543A62056d2984A2268
$$ 152698 -11761 -190409 183429 -215491 134644 130407 598950 162056 -42984 12268
17569B69903A6962L84034j11447n3292e3167H6466L88221j04758b81430a39068
$$ 269903 16962 400996 289549 236257 -53167 86466 474687 369929 -281430 -139068
17558i1287B0202J23238K98382b73764E442J15678a21759j59373A67119D3869
$$ -91287 20202 143440 441822 -273764 5442 121120 -121759 -281132 167119 43869
17547b11262O5877o4328b7261G0497A460J24822K1258E0009b1621n9487F5922
$$ -211262 -145385 -209713 -27261 70497 1460 126282 147540 50009 -21621 -81108 65922
17535B35235d7968E8166Q7909b59375e645G5172a32911A06039K03813N9086A03137
$$ 235235 -47968 58166 146075 -259375 -5645 75172 -132911 106039 309852 368938 103137
17523A21340a58556F1494c8558B87206a50195L3424C14492l7195j02232m4537
$$ 121340 -158556 61494 -38558 287206 -150195 -116771 314492 277297 175065 130528
17513A30528a99429A89332d525I2165K608L21811a14608A77922L7893b9435B77792
$$ 130528 -199429 189332 -4525 92165 94773 416584 -114608 177922 215815 -29435 277792
17501C80267a4192D61091b9449F8096a39808B60527J889G2441J81201r601A05080
$$ 380267 -14192 461091 -29449 68096 -139808 260527 262416 72441 253642 244041 105080
17489A35344n4339A8877J89641a02171k79513A16734f4347A45120R4119J54615
$$ 135344 81005 18877 208518 -102171 -381684 116734 -64347 145120 239239 393854
17479C93854J9870A96977D7648J14218k2895a77138A46561J19062J47734g552
$$ 393854 413724 196977 47648 161866 138971 -177138 146561 265623 413357 -7552
17468D21L10338K9810g90k2037A28826P7986B2413h6279A70180i492A13270b77343
$$ 421 310759 340569 -790 -22827 128826 206812 22413 -86279 170180 -9492 113270 -277343
17455A58123J84596I6447L75282A13513J15034p0160L07736j37094C4674J74231
$$ 158123 342719 96447 471729 113513 228547 158387 466123 329029 34674 208905
17445B08905N8294b39313A04460K3005R7240a3102E88560B59488J97367A44712
$$ 208905 267199 -239313 104460 127465 224705 -13102 588560 259488 456855 144712
17434A04993D4535P1595L42057A35051b14876C12829b7643B26982o1878J29374
$$ 104993 44535 116130 458187 135051 -214876 312829 -27643 226982 165104 294478
17424B94478j41860L71757k53077Q000k7816o2625k9322a09602C71086l1506m9023
$$ 294478 152618 524375 271298 279298 251482 188857 159535 -109602 371086 339580 290557
17413B90557J66620A85409E0491N0136B66K70759a8299a651B96174b70063F5144
$$ 290557 457177 185409 50491 100627 266 271025 -18299 -1651 296174 -270063 65144
17401G1197a74318p0989B27985J69306j62428G3338M4708A1092K23400k4837O1472
$$ 71197 -174318 -245307 227985 397291 234863 73338 118046 11092 234492 209655 271127
17390B71127j19207l6599J22842l6344J12360L96795c8991D34026b7568F9714
$$ 271127 151920 115321 238163 201819 314179 710974 -38991 434026 -27568 69714
17379B35546A10519K44621A59663k3818a41565A11496A5421K86724h6284a9801
$$ 235546 110519 355140 159663 135845 -141565 111496 15421 302145 -86284 -19801
17368F41459A209R8130b37564a10691C60500A8000K49754P5296j52752C3866G176
$$ 641459 1209 99339 -237564 -110691 360500 18000 267754 343050 190298 33866 7176
17356D43178j97161a28195f2089A73452K02595j15505J56876j45691r619J58948
$$ 443178 246017 -128195 -62089 173452 376047 260542 417418 271727 262108 421056
17346D21056a50055H2493J87069C4376L4949K02255c8069j66432N4682C48716
$$ 421056 -150055 82493 269562 34376 69325 271580 -38069 -204501 -149819 348716
17335D8802c4116q1321i069E50938F7023a36056B75684G6353k1296h1666b9345
$$ 48802 -34116 -115437 -9069 550938 67023 -136056 275684 76353 55057 -81666 -29345
17323D8879M26100A20820f4301D0923J99311k6881a44015f3453B00774H569R3240
$$ 48879 474979 120820 -64301 40923 240234 213353 -144015 -63453 200774 8569 101809
17312A01809O0862f6111a3337D34211C7109J16949L4743q6169B8814J69341J1207
$$ 101809 162671 -66111 -13337 434211 37109 154058 188801 102632 28814 198155 209362
17301B09362H7173J20143l7347J6718D7540J32551J77052J17104h3043E3103k6150
$$ 209362 87173 207316 169969 186687 47540 180091 357143 474247 -83043 53103 26953
17290B6953R2014L3269L8394B9751f2895j69354A84643R9999A0313R2582J39101
$$ 26953 118967 152236 190630 29751 -62895 -232249 184643 284642 10313 102895 241996
17279B41996K64177d0323D87444A54422J06338k3731r7069l0131E3881J65879
$$ 241996 506173 -40323 487444 154422 260760 237029 139960 109829 53881 219760
17269B19760e3851A63419m4696O2245J05630J12311A47373A7296K97967r024H9932
$$ 219760 -53851 163419 118723 180968 286598 398909 147373 17296 315263 306239 89932
17257i7161A22203N8558l342H6815p787M5576a03506B11394r6235K28575C3679
$$ -97161 122203 180761 177419 86815 79028 124604 -103506 211394 115159 343734 33679
17245F22045b6043E8818N5041J9099a932G3593J0048K65290o1246M46995A28386
$$ 622045 -26043 58818 113859 132958 -1932 73593 83641 348931 287685 734680 128386
17233D37357j34031j44098L27541k5025j41472B9052J40864J65534p1736f834
$$ 437357 303326 159228 486769 461744 320272 29052 169916 335450 263714 -6834
17222B12395l539e9213e093E91358A6685K45097g4084B64321q2334q8966M57654
$$ 212395 208856 -59213 -5093 591358 16685 261782 -74084 264321 181987 93021 550675
17211E50675A15483P8206I2215A0021K10426J53824D8195J00460d5379C52527
$$ 550675 115483 193689 92215 10021 220447 374271 48195 148655 -45379 352527
17200A94002L6292J86331j60966q6436I049L18159A0347L63940A8122J82809K84533
$$ 194002 230294 416625 255659 169223 9049 327208 10347 374287 18122 200931 485464
17189D85464j68587k3670n4988K09965q0982j18345J35958C4491J53702m7713
$$ 485464 316877 293207 238219 448184 367202 248857 384815 34491 188193 140480
17179A40480l9092K65022J66803A10408C5622M82798A98697P3240J81669G6875
$$ 140480 101388 366410 533213 110408 35622 518420 198697 271937 453606 76875
17168B55237J1273I0149K65688l6142n1622R6950m6516J0161j5824Q3868P676
$$ 255237 266510 90149 355837 319695 268073 365023 318507 328668 312844 396712 404388
17157D04388A78120M12897A06596O9417J51585A28303L71169F9636L17665A92549
$$ 404388 178120 591017 106596 176013 327598 128303 499472 69636 387301 192549
17146C35777L61182C29193K81369j57884B13957J36813M5066p792M3691J4294
$$ 335777 696959 329193 610562 452678 213957 350770 395836 388044 431735 446029
17136D46029j19860N3998l1133J46592j82094K76698k36736m4056j08226j924
$$ 446029 326169 380167 349034 495626 313532 590230 353494 309438 201212 199288
17126A99288J08732D335J46732O0668K39835B01738K00429m2690K79571j25625
$$ 199288 308020 4335 151067 211735 451570 201738 402167 359477 639048 513423
17116E13423q8867A89196M94067B07003K01114J58566J58759B37896d1114E7183
$$ 513423 424556 189196 683263 207003 408117 566683 725442 237896 -41114 57183
17105G43057C21455q1769J60435J0343K15423A92052O7599K93637B75907N32599
$$ 743057 321455 239686 400121 410464 625887 192052 259651 553288 275907 808506
17095H08506B73576L58403k53190j71528J63843n4447R0017J78506j71342O509
$$ 808506 273576 631979 378789 207261 371104 316657 406674 585180 413838 420347
17085D20347n8j31383P4824J63824j11599R7146B04992o1026J19723N111N5883
$$ 420347 420289 288906 363730 527554 415955 513101 204992 143966 263689 268800 324683
17074C24683Q1110K80278l13235A09L49115K91383l5556P7081o7064k0771J28162
$$ 324683 405793 686071 372836 109 349224 640607 605051 682132 615068 594297 722459
17063G22459k16375J15606B72175j9897P2117L38575l28193K95180j05726J90126
$$ 722459 506084 621690 272175 252278 324395 662970 334777 629957 524231 714357
17053G14357A67243K72844J62504K6836l9045j57698J6204K1120K79156k01009
$$ 714357 167243 440087 602591 629427 590382 432684 448888 470008 749164 548155
17043E48155j48377L90478k26594J05830N9290j34488j17908J48736n6459k69299
$$ 548155 399778 790256 563662 669492 728782 594294 476386 625122 568663 299364
17033B99364L46119Q465A22895N30600J97853l88969L63290k54790O1445J03611
$$ 299364 645483 653948 122895 653495 851348 462379 825669 570879 632324 735935
17023G35935j85891m9653J32450J30402B97245N42123j651j52263M5755k79798
$$ 735935 550044 500391 632841 763243 297245 839368 837717 685454 731209 451411
17013D51411L50176J04630l55903o3809L40455p6929j73095Q2726n3783R7558
$$ 451411 801587 906217 550314 486505 826960 750031 576936 659662 605879 703437
17003G03437j00422K017K78752q912l28572J66207P7190K53392E06769K21524
$$ 703437 603015 605032 883784 874872 546300 712507 789697 1043089 506769 728293
16993G28293q48J05884P2896K6832K80475m23005l5021k52739o9317O05003k2056
$$ 728293 727445 833329 906225 933057 1213532 790527 755506 502767 433450 1038453 1016397
16982A016397l66370K92421K58617C79319L78355Q1909k2456Q9428l7282J49942
$$ 1016397 650027 942448 1201065 379319 757674 839583 817127 906555 869273 1019215
16972A019215K46901l81111k41186K44969l9938L90255l06334R7783j32967J0512
$$ 1019215 1266116 885005 643819 888788 848850 1239105 932771 1030554 897587 908099
16962I08099R1835R0289J85300m9189j37817J3743J13918j13659J99928o02331
$$ 908099 999934 1090223 1275523 1226334 1088517 1102260 1216178 1102519 1302447 700116
16952G00116M59903o0233K02760j39904J85350O2193r3425l6728k03473L4530
$$ 700116 1160019 1099786 1302546 1162642 1347992 1410185 1316760 1280032 1076559 1111089
16942A111089J05892j92471k87437L78448J29968K20430l37391j38412j03546
$$ 1111089 1216981 1024510 737073 1115521 1245489 1465919 1128528 990116 886570
16933H86570L38114J5451K17518j64592J47639j40712K16431k40028J28552l18632
$$ 886570 1224684 1240135 1457653 1293061 1440700 1299988 1516419 1276391 1404943 1086311
16923A086311K78955l6467j61151J56628J88288o2827j33515J83401K46320k10354
$$ 1086311 1365266 1328799 1167648 1324276 1512564 1449737 1316222 1499623 1745943 1535589
16913A535589Q6552J10176l83994J81033j48894J18514J70042j96456L50849j70079
$$ 1535589 1622141 1732317 1348323 1529356 1380462 1498976 1669018 1472562 1823411 1653332
16903A653332j36314M32848n36826L20070P6785K2096n2966k05613K71662j19019
$$ 1653332 1517018 1949866 1413040 1733110 1809895 1831991 1779025 1573412 1845074 1726055
16893A726055J52663l61275P98713m05633J92516M2629m8292P2086j72370M9063
$$ 1726055 1878718 1517443 2316156 1910523 2103039 2145668 2097376 2169462 1997092 2046155
16883B046155K7666J91822o0839n4417J55064j8752k21716J16745K85899m9533
$$ 2046155 2073821 2265643 2204804 2150387 2305451 2286699 2064983 2181728 2467627 2418094
16873B418094k60513R0289N96254o46041M01905j00374k7315J17765O9307M2028
$$ 2418094 2157581 2247870 2844124 2198083 2599988 2499614 2472299 2590064 2659371 2701399
16863B701399o8448K0803k37345M38972k76394M11396J3483j67509L34672k46037
$$ 2701399 2632951 2653754 2416409 2855381 2578987 2990383 3003866 2836357 3171029 2924992
16853B924992L49427m97750M20324J80063K00608l75863K62108l05711K61827
$$ 2924992 3274419 2776669 3196993 3377056 3577664 3201801 3463909 3158198 3420025
16844C420025K65303q1966k26096J49481J16277j7742L00070n35319M62458O5678
$$ 3420025 3685328 3603362 3377266 3526747 3643024 3625282 3925352 3390033 3852491 3918169
16834C918169L684r1775N86516n14010J51572J53372n1745N15050M3564j37544
$$ 3918169 3921853 3830078 4416594 3902584 4054156 4207528 4155783 4670833 4714397 4576853
16824D576853K88550k29374J82030J86462q2446J54834o2901J79322K42126M9925
$$ 4576853 4865403 4636029 4818059 5004521 4922075 5076909 5014008 5193330 5435456 5485381
16814E485381K28424M05325k14348K9406L46282k04359L44238L61743j05416k29281
$$ 5485381 5713805 6119130 5904782 5934188 6280470 6076111 6420349 6782092 6676676 6447395
16804F447395L03925K41371J89011P431M15672K02875j1567K32059K6209J0127
$$ 6447395 6751320 6992691 7181702 7189133 7604805 7807680 7796113 8028172 8054381 8064508
16794H064508P69060J4963J23M21909K03788J42413K41064M57605J18755k39158
$$ 8064508 8833568 8848531 8848654 9270563 9474351 9616764 9857828 10315433 10434188 10195030
16784A0195030M16804O27754J94480j10854P82390J49148N74224M01483K30070
$$ 10195030 10611834 11239588 11434068 11323214 12105604 12254752 12828976 13230459 13460529
16775A3460529K27281P86078N67768N87045M4170O55382N33868N97486M64135
$$ 13460529 13687810 14473888 15041656 15628701 15672871 16328253 16862121 17459607 17923742
16766A7923742P53055M80172P11804O76736M53154R75392O53332P64319R47155
$$ 17923742 18676797 19156969 19868773 20545509 20998663 21974055 22627387 23391706 24338861
16757B4338861J279897Q10761J373381R17892R85100J741870R46694J786699J141550
$$ 24338861 25618758 26429519 27802900 28720792 29705892 31447762 32394456 34181155 35322705
16748C5322705K140487J141785J915787K069878K065471K503353K335312K438420
$$ 35322705 37463192 38604977 40520764 42590642 44656113 47159466 49494778 51933198
16740E1933198K474055L182859K932404L489680L567579L778763L879751M733834
$$ 51933198 54407253 57590112 60522516 64012196 67579775 71358538 75238289 79972123
16732G9972123M477392M773579N474873N139725N942100O306287O636372O072816
$$ 79972123 84449515 89223094 94697967 99837692 105779792 112086079 118722451 124795267
16724A24795267O945050O568890P220904P011837O505840O135160N712633N110769
$$ 124795267 131740317 138309207 145530111 152541948 159047788 165182948 170895581 176006350
16716A76006350M153734L217242K500049Q48846k11840j067950k457567l391963
$$ 176006350 180160084 183377326 185877375 186726221 186514381 185446431 182988864 179596901
16708A79596901m227566n274797n836288o444215o385874p599529o826541o998594
$$ 179596901 175369335 170094538 164258250 157814035 151428161 143828632 137002091 130003497
16700A30003497o895351o546172o844930n997413n893642n684816m943144n566889
$$ 130003497 123108146 116561974 109717044 103719631 97825989 92141173 87198029 81631140
16692H1631140m712612m373322l955162l686214l700140l446190l120060k702136
$$ 81631140 76918528 72545206 68590044 64903830 61203690 57757500 54637440 51935304
16684E1935304k899647k503531k325699k277351j703442j779539k358880j484843
$$ 51935304 49035657 46532126 44206427 41929076 40225634 38446095 36087215 34602372
16676C4602372j360477j670784j216579j509074j140306j237312r84753j053241
$$ 34602372 33241895 31571111 30354532 28845458 27705152 26467840 25483087 24429846
16668B4429846q54783j279783r13649j050350k43581o91193q03402p43112m90713
$$ 24429846 23575063 22295280 21381631 20331281 20087700 19396507 18593105 17849993 17359280
16659A7359280o80832o10204n61990l34738n82588m52261q95058R518k77238n00245
$$ 17359280 16678448 16068244 15506254 15171516 14588928 14136667 13241609 13251127 12973889 12473644
16649A2473644p19531k24669n06652j12641m09222j91514m50210j50392n01409
$$ 12473644 11754113 11529444 11022792 10910151 10500929 10309415 9859205 9708813 9207404
16640I207404J56479p17022M51486o82243j91357j18364m78199J6884L7701o82577
$$ 9207404 9363883 8646861 9098347 8416104 8224747 8106383 7628184 7645068 7682769 7000192
16630G000192q205J60001m19072j54293j07204p2323j44568k86541l70246J43493
$$ 7000192 6991987 7151988 6732916 6578623 6471419 6399096 6254528 5967987 5597741 5741234
16620E741234J7413l44127J42346n00148J37659k28573k26465J4756l67589K57514
$$ 5741234 5758647 5414520 5556866 5056718 5194377 4965804 4739339 4754095 4386506 4644020
16610D644020r8895J70576l99408j9869r6610N9130j83310k2425J18063m03020
$$ 4644020 4545125 4715701 4316293 4296424 4199814 4258944 4075634 4053209 4171272 3768252
16600C768252P376R3177m01393J33717j71294o5895m95830M36192k12347l53605
$$ 3768252 3775628 3868805 3467412 3601129 3429835 3363940 2868110 3304302 3091955 2738350
16590B738350L60652m4306l01711L47069j9736k08208j24109L26780l10881l54149
$$ 2738350 3099002 3054696 2752985 3100054 3080318 2872110 2748001 3074781 2763900 2409751
16580B409751K6264K47095j78819o3319P9852j64504L22395n76978P455L03909
$$ 2409751 2436015 2683110 2504291 2440972 2520824 2356320 2678715 2101737 2109192 2413101
16570B413101m31941K77826m95450P01236m19248j59583L42723j43955k36814
$$ 2413101 1981160 2258986 1763536 2464772 2045524 1885941 2228664 2084709 1847895
16561A847895j58351K63884r3727j83773K89805k12253J94669l33287K61535o11945
$$ 1847895 1689544 1953428 1859701 1675928 1965733 1753480 1948149 1614862 1876397 1264452
16551A264452O81167k80597j35641J80065l90880R5562j74673N18553O964k25915
$$ 1264452 1945619 1665022 1529381 1709446 1318566 1414128 1239455 1758008 1764972 1539057
16541A539057j04579R9808m75093O19058k23277j9940k27165K69290l47488K10682
$$ 1539057 1434478 1534286 1059193 1678251 1454974 1435034 1207869 1477159 1129671 1340353
16531A340353r8210L86550o33813K73096L1623l2796p9872J42548l97874K46296
$$ 1340353 1242143 1628693 994880 1267976 1299599 1266803 1186931 1329479 931605 1177901
16521A177901J66373l02138M56532m27266K44880p258k38340k12210N2307p3579
$$ 1177901 1344274 1042136 1498668 1071402 1316282 1309024 1070684 858474 910781 837202
16511H37202J03863l9384K1057K19413k99531k1958J89549q8384J70343j25710
$$ 837202 941065 901681 922738 1142151 842620 820662 1010211 921827 1092170 966460
16501I66460j04394j67987K87820P3705k083l51456J66042l6362D03225L69843
$$ 966460 862066 694079 981899 1055604 1053521 702065 868107 831745 403225 773068
16491G73068k32768K67117o3227J55600N3227j0783r4656J46368k05915j61301
$$ 773068 540300 807417 744190 899790 953017 942234 847578 993946 788031 626730
16481F26730K20282j49503J80982j68620l785m5564K04413N6761l41241N3641
$$ 626730 847012 697509 878491 709871 706086 660522 864935 921696 580455 634096
16471F34096K17528l40509J5103J33025J0806n698j24610K6541B32695K79677
$$ 634096 851624 511115 526218 659243 670049 664351 539741 566282 232695 512372
16461E12372j7731K96499k83323j9342o6111J47412K25248k64691J65204k85624
$$ 512372 494641 791140 507817 488475 422364 569776 795024 530333 695537 409913
16451D09913J51174j74962J15139j31053n2043Q9137K44322B59272L85406A68520
$$ 409913 561087 386125 501264 370211 318168 407305 651627 259272 644678 168520
16440D35507Q1903q811K551L0179B63036K16139r5462K3514O9240R7433j36687
$$ 435507 517410 508599 511150 541329 263036 479175 383713 407227 476467 573900 437213
16429D37213G4567P8427L06953O050J7042L58571l35505k48358J14566K63352
$$ 437213 74567 152994 459947 465997 483039 841610 506105 257747 372313 635665
16419F35665O8515j66034j46723p9832n0170k6973J5333K16397K35262B17558
$$ 635665 704180 538146 391423 311591 261421 234448 249781 466178 701440 217558
16408C98158E2771K71929j38061K09275j04102K97863B75667L27797I5659R3485
$$ 398158 52771 324700 186639 395914 291812 589675 275667 603464 95659 189144
16398A89144K49250A38474P4838J60552A38902J10509L71182j51226k08986j16103
$$ 189144 438394 138474 213312 373864 138902 249411 620593 469367 260381 144278
16388A44278J83118N2672B3710M79771A74170K73554j50056r5691K70189k04536
$$ 144278 327396 380068 23710 503481 174170 447724 297668 201977 472166 267630
16378B67630r4241K36927A36796K20898M9918A69626P3360O0694j49847N48138
$$ 267630 173389 410316 136796 357694 407612 169626 242986 303680 153833 701971
16368G01971F5009Q3311K1485l3533M73352p0299B9699L19451C5115K58807K64401
$$ 701971 65009 148320 169805 136272 609624 539325 29699 349150 35115 293922 558323
16357E58323E1839J50964c1661B91750q8922C5223L66402A06893k6105P1470l758
$$ 558323 51839 202803 -31661 291750 202828 35223 401625 106893 80788 152258 148500
16346A48500L65497a62494E6653Q8313L51254g6418A64528K29091I2620M3122
$$ 148500 513997 -162494 56653 144966 496220 -76418 164528 393619 92620 135742
16336A35742n6939R8021p8422f7814l029B72078j5501J13111p2070C8674L06946
$$ 135742 78803 176824 98402 -67814 -70843 272078 256577 369688 297618 38674 345620
16325C45620A66629J21186r6352j0433P4422k167A17797B7060g3470C89610m7752
$$ 345620 166629 287815 191463 181030 255452 253285 117797 27060 -73470 389610 341858
16314C41858f295j69C05758d8121B07746l7054K36195e4143D05448f9802C98336
$$ 341858 -6295 -6464 305758 -48121 207746 170692 406887 -54143 405448 -69802 398336
16302B292L31321k6934R2731c8735A9016m665K51960F7908c41205B49722p6999
$$ 2292 333613 306679 399410 -38735 19016 14351 266311 67908 -341205 249722 172723
16291A72723a1173A24059k6808K15632D878K45700J50715h2743D0049J71496M5205
$$ 172723 -11173 124059 97251 312883 4878 250578 401293 -82743 40049 211545 256750
16280B56750n0081H8653K06564A30999d6705B59663F8885b5259A9689K87901F0243
$$ 256750 206669 88653 295217 130999 -46705 259663 68885 -25259 19689 307590 60243
16268A79736D4542J38039G7665N53258A72386J20827j17398b3348k31252A49325
$$ 179736 44542 182581 77665 630923 172386 293213 175815 -23348 -254600 149325
16257A08652P3101f1114I8455L1831Q4233K4800l8971F4496J02402J91732g5440
$$ 108652 181753 -61114 98455 130286 214519 239319 200348 64496 166898 358630 -75440
16245C87136j77774j95k8694a57280A50716Q1098B8756N2236a61821G0084J42751
$$ 387136 209362 209167 180473 -157280 150716 231814 28756 80992 -161821 70084 212835
16234B12835b23601B58446d4568G4025K02004a50412B58448j891I3750j8313J22168
$$ 212835 -223601 258446 -44568 74025 276029 -150412 258448 256557 93750 75437 197605
16223A97605h6316n4671B90131A27795N536e2938a9839C74172j45985e6662B04422
$$ 197605 -86316 -140987 290131 127795 133331 -52938 -19839 374172 228187 -56662 204422
16211F3728a5576r6791I450J48711R0880F9326b5511k78425B9634K04929c71388
$$ 63728 -15576 -112367 9450 158161 249041 69326 -25511 -303936 29634 234563 -371388
16199a26833o8006d7370p4034p7197E30499b9816j3929n6620C6570i4988L7080
$$ -126833 -194839 -47370 -121404 -198601 530499 -29816 -43745 -100365 36570 -94988 -57908
16188e7908A67410G7025J31909d3742a7430k0932k03301R3392A6954L8302i9876
$$ -57908 167410 77025 208934 -43742 -17430 -38362 -241663 -148271 16954 55256 -99876
16176b03704Q4998e0940o0412A93428e263k21862E1170i5411L8181j02502H178
$$ -203704 -118706 -50940 -111352 193428 -5263 -227125 51170 -95411 -57230 -159732 8178
16164H9523k8718a49753c2670B7065L437L05042e5213q6930B01063a30581A76965
$$ 89523 60805 -149753 -32670 27065 30502 335544 -55213 -142143 201063 -130581 176965
16152D19780A04493M4941n1598b63487A02253a22280p3734k515f7076G7367f5420
$$ 419780 104493 149434 97836 -263487 102253 -122280 -196014 -198529 -67076 77367 -65420
16140e1942l35877a35887A14233L03065b05475j7271i1803a8009B64820M6268
$$ -51942 -387819 -135887 114233 417298 -205475 -222746 -91803 -18009 264820 311088
16130C11088b3236m7864B06119b43015i8931A19121J25829H622c8172l3271j12204
$$ 311088 -23236 -71100 206119 -243015 -98931 119121 244950 8622 -38172 -71443 -183647
16119a83647h5016L7188d068p0109F1965K9716k5907J91993c0354A25358b70339
$$ -183647 -85016 -47828 -4068 -74177 61965 91681 65774 257767 -30354 125358 -270339
16107a09591A74695J39976e5379l30971d5032A87816a69048b5635A03823K4977
$$ -109591 174695 314671 -55379 -386350 -45032 187816 -169048 -25635 103823 128800
16097A28800b63563B56016n9409a28251B91933c36798r8917K03075A65034K9224
$$ 128800 -263563 256016 196607 -128251 291933 -336798 -435715 -232640 165034 194258
16087A94258A7543a28479B44546a9457k78149N9156B28316A01453l1828d9950
$$ 194258 17543 -128479 244546 -19457 -297606 -238450 228316 101453 69625 -49950
16076A21034J3435L8493e1175p4076m8909J4284k66467a16910A29661O7053b585
$$ 121034 134469 172962 -51175 -125251 -174160 -159876 -426343 -116910 129661 196714 -2585
16064a81173j3303A8409b84997i2971m3495F7611a25190A46143a63804P8045J6238
$$ -181173 -194476 18409 -284997 -92971 -136466 67611 -125190 146143 -163804 -85759 -69521
16053f9521C24587A28764d98805A22213a77069e0012A77677b25762g282k19985
$$ -69521 324587 128764 -498805 122213 -177069 -50012 177677 -225762 -7282 -227267
16043b27267a09284n4F0750A1294e4059A15871E0708a87712B7072a0567n5763
$$ -227267 -109284 -109338 60750 11294 -54059 115871 50708 -187712 27072 -10567 -66330
16032f6330q0707D6637g8914C37320H6713N5846h0741G0668g5850F1248M5371
$$ -66330 -147037 46637 -78914 337320 86713 142559 -80741 70668 -75850 61248 106619
16021A06619K83956a20942k16109b0329A22229g3677C26898a51137B3304a44925
$$ 106619 390575 -120942 -337051 -20329 122229 -73677 326898 -151137 23304 -144925
16010e8378j31813C10202b8716C1889a55167A3716K33512c8257l9063A60911a62592
$$ -58378 -190191 310202 -28716 31889 -155167 13716 247228 -38257 -77320 160911 -162592
15998a8263p0962C7288a30550B39095k5541m4080f5328m2520r5164a1155j84544
$$ -18263 -89225 37288 -130550 239095 213554 169474 -65328 -107848 -203012 -11155 -195699
15987a95699B92982A05017J52190P6936J03437r8098J54316j99282A20593g5552
$$ -195699 292982 105017 257207 334143 437580 339482 493798 294516 120593 -75552
15976b69550n7872B167b4497k17906h2379c6063k71184q5891g7848A33823a59157
$$ -269550 -327422 2167 -24497 -242403 -82379 -36063 -307247 -393138 -77848 133823 -159157
15964b61925L7176B8476c17578J37390k3693B878a2757k14063A12083A045J08352
$$ -261925 -224749 28476 -317578 -180188 -203881 2878 -12757 -226820 112083 1045 109397
15953A09397N2387i3401B90979c9971B17841o1014c59437J51738i0044H1489D0647
$$ 109397 161784 -93401 290979 -39971 217841 156827 -359437 -207699 -90044 81489 40647
15941b5990B22403E189L6562a20425A1209K6871K8449J75450a57511O3806A92006
$$ -25990 222403 5189 41751 -120425 11209 38080 66529 241979 -157511 -93705 192006
15929a5786H5508a90295A15701b22933B20744h3427k83660a06717p4970g1726
$$ -15786 85508 -190295 115701 -222933 220744 -83427 -367087 -106717 -181687 -71726
15918a73589A24832a0656A8650c9478j36602j71263b0506B09454e0846B55467
$$ -173589 124832 -10656 18650 -39478 -176080 -347343 -20506 209454 -50846 255467
15907a7127j04299B91411A2474h1871B6977m357b34899J16674d8564D4864b80182
$$ -17127 -121426 291411 12474 -81871 26977 22620 -234899 -118225 -48564 44864 -280182
15895a93044j70217B32089a11251H7499a91297P883j1226j34163J52459c0833
$$ -193044 -363261 232089 -111251 87499 -191297 -183414 -194640 -328803 -176344 -30833
15884b14056A80273K18936a57271A88101c16022J0598B40338c40989C0100b31388
$$ -214056 180273 399209 -157271 188101 -316022 -305424 240338 -340989 30100 -231388
15873a6554C1631b01736i7781j77053A75862a00924A8585a06433D8262k1028g3588
$$ -16554 31631 -201736 -97781 -274834 175862 -100924 18585 -106433 48262 27234 -73588
15861b36767B58600g3429b5542k92804J33584J7225B10587c28367N9349A53100
$$ -236767 258600 -73429 -25542 -318346 -184762 -167537 210587 -328367 -269018 153100
15850f2887B22854I4845b76882N9084A99807m9174F3865i3724j80036M6828L2973
$$ -62887 222854 94845 -276882 -217798 199807 150633 63865 -93724 -273760 -226932 -193959
15839a93959d8701R28j70438B79665a61132k46336e7052A71004J01911b10454
$$ -193959 -48701 -47773 -218211 279665 -161132 -407468 -57052 171004 272915 -210454
15828e7344l03816F6882B5347a52846b2661A00863l3906J1970k1552d7944j31677
$$ -57344 -361160 66882 25347 -152846 -22661 100863 66957 78927 57375 -47944 -179621
15817a79621a5461q4318j48375C16617a22438c8036D622M8485c905A73365m8666
$$ -179621 -15461 -99779 -248154 316617 -122438 -38036 4622 53107 -3905 173365 124699
15806A24699a24390A09755K00084b36201B11678c6099F9534a00995B39104F7603
$$ 124699 -124390 109755 309839 -236201 211678 -36099 69534 -100995 239104 67603
15795A15028E2129a50981A37018J44571G8556h7660L6724k96635J36334g5329
$$ 115028 52129 -150981 137018 281589 78556 -87660 -50936 -347571 -211237 -75329
15784D5766a72178N4807e1025l51255a41949b6327p7428A60059J1265b1536M291
$$ 45766 -172178 -117371 -51025 -402280 -141949 -26327 -103755 160059 171324 -21536 -17245
15773a7245j8782j17643K6877b5856G5574A6934a11932j34340a04036A017d7889
$$ -17245 -36027 -153670 -126793 -25856 75574 16934 -111932 -246272 -104036 1017 -47889
15761C9572J03924D4582a06474a974C13392r1086O2074g3849l4959I0332b44656
$$ 39572 143496 44582 -106474 -1974 313392 222306 284380 -73849 -108808 90332 -244656
15749B82041p7101i2606A21098N1278F4028a55909j30739J32262g0661G1827g3620
$$ 282041 204940 -92606 121098 172376 64028 -155909 -286648 -154386 -70661 71827 -73620
15737g0450A01785J12760c04511I5359c42975C9961a28935H5695b35321D2322
$$ -70450 101785 214545 -304511 95359 -342975 39961 -128935 85695 -235321 42322
15726a97856j77096E3208a17002j01191A16220P4195e1068j6895B08218d9449
$$ -197856 -374952 53208 -117002 -218193 116220 190415 -51068 -67963 208218 -49449
15715E0744a1463l8372B12940A00899P1739a02598J4008L711k9716n4799A73148
$$ 50744 -11463 -49835 212940 100899 172638 -102598 -88590 -84879 -114595 -169394 173148
15703f2490k2682D42689c1126j09009B33010a53078C17234A41454f7051J9868
$$ -62490 -85172 442689 -31126 -140135 233010 -153078 317234 141454 -67051 -47183
15693d7183B71761k5497j05550c9880A14639a3400B71490a66698c2301k54476
$$ -47183 271761 246264 140714 -39880 114639 -13400 271490 -166698 -32301 -286777
15683b86777a19870G7238i0732A96319c50978a51696A5741M8375K25933c2606
$$ -286777 -119870 77238 -90732 196319 -350978 -151696 15741 64116 290049 -32606
15672g7489B4003a36326d4771K450B08530b41857d3981l0332j60039f322D12692
$$ -77489 24003 -136326 -44771 -42321 208530 -241857 -43981 -74313 -234352 -6322 412692
15660b32089A38445b41095C6788b06353e2820I4776B0878g720A22969d4988j86303
$$ -232089 138445 -241095 36788 -206353 -52820 94776 20878 -7720 122969 -44988 -231291
15649b31291g4699n9447A19188R624i2232L9861g432j22923A23664b7768A33533
$$ -231291 -74699 -134146 119188 128812 -92232 -52371 -7432 -130355 123664 -27768 133533
15637d34680Q7421a21119A48700G975R9377f5851l12271a03755j31437P4046E50165
$$ -434680 -347259 -121119 148700 7975 107352 -65851 -378122 -103755 -235192 -161146 550165
15625A45588K0534d447r3350D8017J87956b65445c9467B15881p6273E8531a23974
$$ 145588 166122 -4447 -97797 48017 235973 -265445 -39467 215881 139608 58531 -123974
15613a70260A4636J79891d3915k69128F9288j6354J22571a48525e6484C9637b56287
$$ -170260 14636 194527 -43915 -313043 69288 52934 175505 -148525 -56484 39637 -256287
15601C2901a61455B17142j3834J04144F6973A3003b45849A38625L7451b0091p4625
$$ 32901 -161455 217142 203308 307452 66973 13003 -245849 138625 176076 -20091 -94716
15590i4716A21119P4744J5590l2163D4049b80754a5052k07974o0087J31121J9822
$$ -94716 121119 195863 211453 179290 44049 -280754 -15052 -223026 -283113 -151992 -132170
15579a32170D859O0752K21603c4279n794J7777k76562J7925D1084C414O3656e2141
$$ -132170 4859 65611 287214 -34279 -40073 -22296 -298858 -280933 41084 3414 67070 -52141
15566b26257f9414b7794j22031F450b6039D919L18482B8153K6832k2523b11140
$$ -226257 -69414 -27794 -149825 6450 -26039 4919 323401 28153 54985 32462 -211140
15554D0465b13258I1817O4049b82849P5976A2986b753A10752m9647b55625A53147
$$ 40465 -213258 91817 155866 -282849 -206873 12986 -2753 110752 61105 -255625 153147
15542A40000p628b08028q0219C53418a46920k1205J7776h695A4139J45743e2350
$$ 140000 132372 -208028 -288247 353418 -146920 -168125 -150349 -8695 14139 159882 -52350
15530A95690c38457a06887M3194b93q1022A35393g7387D3246O8919a49048A06881
$$ 195690 -338457 -106887 -63693 -293 -81315 135393 -77387 43246 112165 -149048 106881
15518E3968a15433H024Q2042J04824i1755q9732F593J9619K06590C232Q6022J59534
$$ 53968 -115433 8024 90066 194890 -91755 -181487 6593 26212 232802 3232 89254 248788
15506B48788B9439f1886F3768J04123a29832c4994A66505b40857b5416G263i584
$$ 248788 29439 -61886 63768 167891 -129832 -34994 166505 -240857 -25416 7263 -9584
15494A32268j4359P4056f2927k50093b1204k29757A67442d6663A35400J08285
$$ 132268 117909 191965 -62927 -313020 -21204 -250961 167442 -46663 135400 243685
15484B43685A12308b00983C1729c15972e5321J2844o167A01457C237g7190K1935
$$ 243685 112308 -200983 31729 -315972 -55321 -42477 -48644 101457 3237 -77190 -55255
15473e5255k6505E2232K20850Q3265G1194d33851a66357h0345j64888k9615J23444
$$ -55255 -81760 52232 273082 356347 71194 -433851 -166357 -80345 -245233 -274848 -151404
15462a51404m6946A98618n8362k8397a26543F024b03384d315j60393D1524c29662
$$ -151404 -198350 198618 140256 111859 -126543 6024 -203384 -4315 -164708 41524 -329662
15450B59320b71001O4753I9758a81661B29516C0182a39689A34636k5581a14002
$$ 259320 -271001 -206248 99758 -181661 229516 30182 -139689 134636 109055 -114002
15439f9105I7580B160O6844P9961a3375B75961i3118j67749J26091A06952d2051
$$ -69105 97580 2160 69004 148965 -13375 275961 -93118 -260867 -134776 106952 -42051
15427a134C23840I8915C2826K46225a60193m7699a6016H5133a52595c3359I0582
$$ -1134 323840 98915 32826 279051 -160193 -207892 -16016 85133 -152595 -33359 90582
15415B35596a10248G2062K102J12558f954m28705A7796G470f3029k6659G094h9077
$$ 235596 -110248 72062 74164 186722 -6954 -435659 17796 7470 -63029 -89688 7094 -89077
15402h9989k78684a59424A05253O9523p7566c7231j45415B60442a70624D4574
$$ -89989 -368673 -159424 105253 174776 97210 -37231 -182646 260442 -170624 44574
15391a33252j00334A69560J15603a08191e3480A52563O972G93b00756j5148H7488
$$ -133252 -233586 169560 285163 -108191 -53480 152563 159535 793 -200756 -215904 87488
15379A75570R7233c95884A00114J82325A069a62501B40367A5613a1864H9384J84801
$$ 175570 272803 -395884 100114 282439 1069 -162501 240367 15613 -11864 89384 274185
15368B74185a06662a0366k21243q7318a25967M3734F7993a19041B4829h1149A33322
$$ 274185 -106662 -10366 -231609 -318927 -125967 -82233 67993 -119041 24829 -81149 133322
15356B81523A18593c4894j82123A29606a23937A12872b58809A17519h2672j18434
$$ 281523 118593 -34894 -217017 129606 -123937 112872 -258809 117519 -82672 -201106
15346b01106B0960J48871o8702c424A59793C1236a56516A78310b57766c7180J2544
$$ -201106 20960 169831 101129 -3424 159793 31236 -156516 178310 -257766 -37180 -24636
15335b4636J1557m8888I4461B8577a03692M9025r619A53294K10089A17515K06672
$$ -24636 -13079 -61967 94461 28577 -103692 -54667 -64286 153294 363383 117515 324187
15324C24187F338J66531m729E9683O0806a79151O2009r3921I3187c3528j93698
$$ 324187 6338 172869 168140 59683 120489 -179151 -117142 -211063 93187 -33528 -227226
15313b27226c0310B63145D7105b02297G002K10716e1472A90739a34098O4500k66428
$$ -227226 -30310 263145 47105 -202297 7002 217718 -51472 190739 -134098 -69598 -336026
15302c36026B64022a38909A08909B6105K05317D0828M0065C8809J30803B3278
$$ -336026 264022 -138909 108909 26105 231422 40828 80893 38809 169612 23278
15291a7199D8549a22073A31419J62997H6124J88038m7187G954J00220M8713g0538
$$ -17199 48549 -122073 131419 294416 86124 274162 226975 7954 108174 156887 -70538
15279a39638e9353D3759b41257H2439c179A22108c8122l2176A33614J61690c85502
$$ -139638 -59353 43759 -241257 82439 -3179 122108 -38122 -70298 133614 295304 -385502
15267G435b7615A09483d8227b596B362J20672K04278a12767A1386a86908B48000
$$ 7435 -27615 109483 -48227 -2596 2362 123034 327312 -112767 11386 -186908 248000
15255C16759I8633J06391D7869J36880L2240K34341J25650K90769M90293m55163
$$ 316759 98633 205024 47869 184749 216989 451330 576980 867749 1358042 902879
15245I02879L23120j73448D08450A58793G1659J35280k2696H419K11664m2844
$$ 902879 1225999 1052551 408450 158793 71659 206939 184243 8419 220083 177239
15235A77239N5998F3708J13205F8367A2912b48492B18330b8983J2787k24004i2241
$$ 177239 233237 63708 176913 68367 12912 -248492 218330 -28983 -16196 -240200 -92241
15223a33088F6522J4166K3739J00231b8895k99840B27299f7746E5865L25974b46770
$$ -133088 66522 80688 104427 204658 -28895 -328735 227299 -67746 55865 381839 -246770
15211B39276m0246J44015j55242J0793J133a60516D5362b1767A1362b62533B23471
$$ 239276 199030 343045 187803 198596 199729 -160516 45362 -21767 11362 -262533 223471
15199a48417e0543H5591c53714D9024b52456A50129b35064D43617j47308C5638
$$ -148417 -50543 85591 -353714 49024 -252456 150129 -235064 443617 296309 35638
15188B3920a36196B60893D2553J31303e6129n0095B11640a51614B28872o3329
$$ 23920 -136196 260893 42553 173856 -56129 -106224 211640 -151614 228872 165543
15178A65543a19805B58098C2632R3676M4592k0629a70443A11069K8695l5308K98255
$$ 165543 -119805 258098 32632 126308 170900 150271 -170443 111069 139764 104456 402711
15167D02711A63470K42536A41588n5728d41584A67562M6054A7287J72520F2940
$$ 402711 163470 406006 141588 85860 -441584 167562 213616 17287 189807 62940
15156a40486d5376B43768F2243j8865L4100K40024d7006B18063a24592C09648
$$ -140486 -45376 243768 62243 43378 77478 317502 -47006 218063 -124592 309648
15145B24724C4623K0976a30844D18020g461o252F3321O204K22167F5945J06961
$$ 224724 34623 55599 -130844 418020 -7461 -13713 63321 69525 291692 65945 172906
15134A72906J4966J47945H227L0285Q6548B3804a64203E4306L45046c00756C3900
$$ 172906 187872 335817 8227 38512 125060 23804 -164203 54306 399352 -300756 33900
15122B12976K96631A76070p0923J50532R7764j63430D9628J24517P393G3335C1071
$$ 212976 509607 176070 105147 255679 353443 190013 49628 174145 181538 73335 31071
15110A54348O398J05273a65392C76858A58928m4973M4483c1789A19776f4987e657
$$ 154348 160746 266019 -165392 376858 158928 113955 158438 -31789 119776 -64987 -5657
15098a80078A07355R530f5153B53118J7662F7576i7677a021B03135J2505D7651
$$ -180078 107355 116885 -65153 253118 270780 67576 -97677 -1021 203135 215640 47651
15086B91173D346L35879k3273a8518j1259A14952K95796A87583G2813J21700J1783
$$ 291173 4346 340225 316952 -18518 -29777 114952 410748 187583 72813 194513 206296
15075B06296k7145J19429a2750C6730J74787b6991Q591A50548J59339b79096B4389
$$ 206296 179151 298580 -12750 36730 211517 -26991 -18400 150548 309887 -279096 24389
15063B33413c2145C20154j47321p5682I983L27355j07326H7987M1922K8237M5335
$$ 233413 -32145 320154 172833 97151 9983 337338 230012 87987 129909 158146 203481
15052B03481a01421A18111b56367A30953c8092A38206n3690J33718J268n4616
$$ 203481 -101421 118111 -256367 130953 -38092 138206 84516 218234 219502 164886
15042A64886N7289E7646J69867J1953r7793Q3999J6750G2981J09397O7677Q2219
$$ 164886 222175 57646 227513 239466 141673 225672 242422 72981 182378 250055 332274
15031C32274F8342k1301a5889A47968L31007D8158J58322H0106P9526K62685R0346
$$ 332274 68342 47041 -15889 147968 478975 48158 206480 80106 159632 422317 512663
15020E12663A79040J80907G6949K1554a05324C48653J74784B50759H0616J84900
$$ 512663 179040 359947 76949 98503 -105324 348653 523437 250759 80616 265516
15010B65516J73526j71568f0266C60944j16460K7895A7813b23815C61195J53632
$$ 265516 439042 267474 -60266 360944 244484 272379 17813 -223815 361195 514827
15000E14827L0910H0594K79244e7518D14897H7507L05616K48253k46976J14756
$$ 514827 545737 80594 359838 -57518 414897 87507 393123 641376 394400 509156
14990E09156G9439K87756p9239k5919A06689Q2739J73102g9087A29003O6778f9713
$$ 509156 79439 367195 287956 262037 106689 189428 362530 -79087 129003 195781 -69713
14978B30408K57621B38809q0529J99965j29249K1944j5962m4200k1519F5517d31
$$ 230408 488029 238809 158280 358245 228996 250940 234978 190778 169259 65517 -431
14966I6597M6344E2195b1761I1360K23275j01209H1353L42036J82829j27476K26459
$$ 96597 142941 52195 -21761 91360 314635 213426 81353 423389 606218 478742 705201
14955G05201a65775B77146r1299J58986P784K21k154q6414r8822L3679J70655
$$ 705201 -165775 277146 185847 344833 352617 352838 350684 264270 165448 199127 369782
14944C69782Q2306I8865K56477j35408M11496k55132J23795E6076L03146P6187
$$ 369782 452088 98865 355342 219934 631430 376298 500093 56076 359222 435409
14934D35409r9112C5382J16654J77535O8337G4209Q51887D02393j57936K29880
$$ 435409 336297 35382 152036 329571 397908 74209 926096 402393 244457 474337
14924D74337j60871O1353J00277k31386H0802J63793K1710J83857B13198J96561
$$ 474337 313466 374819 475096 243710 80802 244595 266305 450162 213198 409759
14914D09759P6236J23536j21318j18179j46457j4511K04281f4350B04206J27910
$$ 409759 485995 609531 488213 370034 223577 209066 413347 -64350 204206 332116
14904C32116L08700j17383b7951C36643o2593o4748K14885j4164L35091l26277
$$ 332116 640816 523433 -27951 336643 274050 209302 424187 410023 745114 418837
14894D18837j9431E6802J70510J58168A84486K63968j03642O5666n3717J3842
$$ 418837 399406 56802 227312 385480 184486 448454 344812 410478 356761 370603
14884C70603L94218I2883J87771J62355j33330J57420O8343Q9434k22152j93220
$$ 370603 764821 92883 280654 443009 309679 467099 535442 624876 402724 209504
14874B09504L132b9813C33755I9894J72430o2785J74247l9274n7440j936J53441
$$ 209504 212636 -29813 333755 99894 272324 209539 383786 344512 287072 285136 438577
14863D38577j76182N0856A27410N61757j00022k74337J05859j31174J69028q4757
$$ 438577 262395 313251 127410 689167 589145 314808 420667 289493 458521 373764
14853C73764j31787K19979O2158B57997J82368J36617B49778M82389A12031L21878
$$ 373764 241977 461956 524114 257997 440365 576982 249778 732167 112031 433909
14843D33909o7470j64887L03618K41225l24665o1160L33552C24289L2580n6642
$$ 433909 366439 201552 505170 746395 421730 360570 694122 324289 356869 300227
14833C00227O0235J74274j59277L01131l05463J95644k57616J76196j97986M44864
$$ 300227 360462 534736 375459 676590 371127 566771 309155 485351 287365 732229
14823G32229m4424j57342K70558C74321j09383L22632k46929K89896k51045L12361
$$ 732229 687805 530463 801021 374321 264938 587570 340641 630537 379492 691853
14813F91853j13877j68832n8328L27456k86215J66348Q3547j26988L822o3985
$$ 691853 577976 409144 350816 678272 392057 558405 641952 514964 518786 454801
14803D54801M4572K02529l01784L69389j39312q0626A73762M20858M0310q4998
$$ 454801 499373 701902 400118 769507 630195 549569 173762 594620 634930 549932
14793E49932L4066l8454J56159k67739m9045J39408J54856C24200K11385J49q7074
$$ 549932 583998 545544 701703 433964 384919 524327 679183 324200 535585 535734 448660
14782D48660J51650P1904J10456j69706j9869j69902L24412l19378J02097j01680
$$ 448660 600310 672214 782670 612964 593095 423193 747605 428227 530324 428644
14772D28644k08069M57641q2667A75706L32939J47044J73665j14280l37714J37741
$$ 428644 220575 678216 595549 175706 508645 655689 829354 715074 377360 515101
14762E15101j02767L32027k55501J12306J46588q2123j4497j43346k7260J29353
$$ 515101 412334 744361 488860 601166 747754 665631 651134 507788 480528 609881
14752F09881J34518O6978j10529k13490K04158L15530k60773L2083Q8181k75817
$$ 609881 744399 811377 700848 487358 691516 1007046 746273 778356 866537 590720
14742E90720K89516m01804M25853l53116O4295M0966J7103m4917O6646C37539
$$ 590720 880236 478432 904285 551169 615464 656430 673533 628616 695262 337539
14731H07193k61831J05609j12448O84443n40637R1863N1026j70588K89797l79820
$$ 807193 545362 650971 538523 1222966 682329 774192 825218 654630 944427 564607
14721E64607N08492m83212J93366J44978l07823K16823L05048K207m29546j9069
$$ 564607 1073099 589887 783253 928231 620408 837231 1142279 1144486 714940 695871
14711F95871j23300L34755j09532j81136J86314j29502L42957j46921J49225r4061
$$ 695871 572571 907326 797794 616658 802972 673470 1016427 869506 1018731 924670
14701I24670C29817O99075R3086r2346K1099k66o0866l09502K39972l6302j2080
$$ 924670 329817 1028892 1121978 1029632 1050731 1050465 989599 680097 920069 883767 871687
14690H71687j41049K49300k12371M1072O287l36368K74417J21958R2237J77242
$$ 871687 730638 979938 767567 808639 814926 478558 752975 874933 967170 1144412
14680A144412l17491j67866M97248J13445F11492M41321k39167K34612L28641
$$ 1144412 826921 659055 1156303 1269748 611492 1052813 813646 1048258 1376899
14671A376899m58157k0929L2892k03201K63730q8258q8779j03709K63808R6828
$$ 1376899 918742 897813 930705 727504 991234 902976 814197 710488 974296 1071124
14661A071124j6413j42575J83481l7170q5431K44100l3842j91127J76441J25469
$$ 1071124 1054711 912136 1095617 1058447 973016 1217116 1183274 992147 1168588 1294057
14651A294057p6794R5828k13466J52905j46206p9389R9963L2809j39489K36400
$$ 1294057 1217263 1313091 1099625 1252530 1106324 1026935 1126898 1159707 1020218 1256618
14641A256618o905J9226l6094k16213j44230J26211K71603J42559J93688j72959
$$ 1256618 1249713 1268939 1232845 1016632 872402 998613 1270216 1412775 1606463 1433504
14631A433504l55987N619J61250J12020l47310L39867k55187j01182K70104l57076
$$ 1433504 1077517 1083136 1244386 1356406 1009096 1348963 1093776 992594 1262698 905622
14621I05622L64134k40056J26856K81558j36899J50190J63117m05475P7428M06365
$$ 905622 1269756 1029700 1156556 1438114 1301215 1451405 1614522 1209047 1286475 1692840
14611A692840l26199j20546N78078k12177k85386l9249J0134J06950K47057K32708
$$ 1692840 1366641 1246095 1824173 1611996 1326610 1287361 1297495 1404445 1651502 1884210
14601A884210n13940J66502k0387j65722J58902L84976j36966k67930K28911k48242
$$ 1884210 1370270 1536772 1516385 1350663 1509565 1894541 1757575 1489645 1718556 1470314
14591A470314M49273l84270K99624J4909R5580l73308K61138K07817l9295k90882
$$ 1470314 1919587 1535317 1834941 1849850 1945430 1572122 1833260 2041077 2001782 1710900
14581A710900j11845J56208K7170l5310K55851N2487Q7616r1543k65434J34417
$$ 1710900 1599055 1755263 1782433 1747123 2002974 2055461 2143077 2051534 1786100 1920517
14571A920517k03330L29126M39009k44814K34479q5229l64364R5443K94513k75594
$$ 1920517 1717187 2046313 2485322 2240508 2474987 2389758 2025394 2120837 2415350 2139756
14561B139756M82017R442J17570r2686K6914M25174J87977j7393L85210L82952
$$ 2139756 2621773 2631215 2748785 2656099 2683013 3108187 3296164 3278771 3663981 4046933
14551D046933L73781Q54103K122856M532415R808826K1009381N96150A9811370
$$ 4046933 4420714 5274817 7397673 11930088 21738914 42748295 43344445 19811370
14542H556718l979661j447581p18551k64221K86327n84271L34585m34356J11618
$$ 8556718 4577057 3129476 2410925 2146704 2433031 1848760 2183345 1748989 1860607
14533A860607J79876k02677J69577k6920P0944P9070J82529k29869K27851p6281
$$ 1860607 2040483 1837806 2007383 1980463 2051407 2130477 2313006 2083137 2310988 2234707
14523B234707J27443j03895J53702j24196M76784k95080L12571n50378J84847
$$ 2234707 2362150 2258255 2411957 2287761 2764545 2469465 2782036 2231658 2416505
14514B416505K40314p5566j20858j98469N88175J39035N4124j79099P5689r4635
$$ 2416505 2656819 2581253 2460395 2261926 2850101 2989136 3043260 2864161 2939850 2845215
14504B845215K00877j54297k42428M62858j56098L98747l36943K45080k6834K99681
$$ 2845215 3046092 2891795 2649367 3112225 2956127 3354874 3017931 3263011 3236177 3535858
14494C535858k50315J43049l38451K66855M45480l29090L5566J6580j39347k6944
$$ 3535858 3285543 3428592 3090141 3356996 3802476 3473386 3508952 3525532 3386185 3359241
14484C359241K61321K15958J33770J56260l79634P0199J35304J83338l32754K68489
$$ 3359241 3620562 3836520 3970290 4126550 3746916 3817115 3952419 4135757 3803003 4071492
14474D071492O7105l98038L96819M1921m17815K74385L68021J78959j38235R2158
$$ 4071492 4138597 3740559 4137378 4179299 3761484 4035869 4403890 4582849 4444614 4536772
14464D536772k04820K29602r3783J21024L7942M6933m1299L11382P9503L0114
$$ 4536772 4331952 4561554 4467771 4588795 4626737 4673670 4632371 4943753 5023256 5053370
14454E053370j70980K79320m5220q4754K12790J69382k57468N99438l86979J29967
$$ 5053370 4882390 5161710 5116490 5031736 5244526 5413908 5156440 5755878 5368899 5498866
14444E498866J79504J21794N3151J13825J13447N25424o29190Q6447J9444L14536
$$ 5498866 5678370 5800164 5853315 5967140 6080587 6606011 5976821 6063268 6082712 6397248
14434F397248J85697q034j69003M33853j40424j22023L77411k1485J36186J84293
$$ 6397248 6582945 6574911 6405908 6839761 6699337 6577314 6954725 6933240 7069426 7253719
14424G253719j45870J64749L21180J17905j51077q1740L80538L64511J13257m6005
$$ 7253719 7107849 7272598 7593778 7711683 7560606 7478866 7859404 8223915 8337172 8291167
14414H291167j53251N18321k68830N62518m8227l3183L51990J27522J34897L10191
$$ 8291167 8137916 8656237 8387407 8949925 8901698 8868515 9220505 9348027 9482924 9793115
14404I793115J18233j53064J80438M51615j8421k56547M55784L57784K95425k67634
$$ 9793115 9911348 9758284 9938722 10390337 10371916 10115369 10571153 10928937 11224362 10956728
14394A0956728L26366j26043R69409l210j30306K58222N98670l0145j77846N44653
$$ 10956728 11283094 11157051 12126460 12123250 11992944 12251166 12849836 12819691 12641845 13186498
14384A3186498K78694m9731J43474O12933N2173N52400K66321J42440L15785K55726
$$ 13186498 13465192 13415461 13558935 14171868 14224041 14776441 15042762 15185202 15500987 15756713
14374A5756713J97447K41008j0124Q06938K24630M84845L80613L68380K02937
$$ 15756713 15954160 16195168 16185044 16991982 17216612 17701457 18082070 18450450 18653387
14365A8653387P50647L45983O8843M65041P30549L35773N25610O57713L65431
$$ 18653387 19404034 19750017 19818860 20283901 21014450 21350223 21875833 22533546 22898977
14356B2898977M54865P15262M48170O67366N53593K28553P79201Q99450M95872
$$ 22898977 23353842 24069104 24517274 25184640 25738233 25966786 26745987 27645437 28141309
14347B8141309P17463P51793Q84384Q97002P75321R20647M27962J146306J062866
$$ 28141309 28858772 29610565 30494949 31391951 32167272 33087919 33515881 34662187 35725053
14338C5725053J061077O97624J279524J099858J090096J124986J407092J431306
$$ 35725053 36786130 37483754 38763278 39863136 40953232 42078218 43485310 44916616
14330D4916616J209648J729330J467873J553381J583496J771559J402643K389435
$$ 44916616 46126264 47855594 49323467 50876848 52460344 54231903 55634546 58023981
14322E8023981J726931K344497K459946K229601K236133K676645K767409K923769
$$ 58023981 59750912 62095409 64555355 66784956 69021089 71697734 74465143 77388912
14314G7388912L279878K767974L498200L475667M082701L888311M268110M343160
$$ 77388912 80668790 83436764 86934964 90410631 94493332 98381643 102649753 106992913
14306A06992913N129168M826477N127662N796928N990228O304807O996563O805531
$$ 106992913 112122081 116948558 122076220 127873148 133863376 140168183 147164746 153970277
14298A53970277P918442Q272950Q627284R469315R344522J0228141J0764646J1706485
$$ 153970277 161888719 170161669 178788953 188258268 197602790 207830931 218595577 230302062
14290B30302062J2011933J2802918J3328867J3827005J4228762J4977500J4995160
$$ 230302062 242313995 255116913 268445780 282272785 296501547 311479047 326474207
14283C26474207J5135361J5587033J5515747J5196519J4487989J3624645J2894964
$$ 326474207 341609568 357196601 372712348 387908867 402396856 416021501 428916465
14276D28916465J1190464R385544P563477M853475L36209j665305j546192l589711
$$ 428916465 440106929 449492473 457055950 461909425 462245634 460580329 459034137 455444426
14268D55444426k756616n597648r119758r900030j1183503j1823001j3440568
$$ 455444426 452687810 447090162 437970404 428070374 416886871 405063870 391623302
14261C91623302j4637956j5377538j5694418j5838380j5267706j5571904j4537052
$$ 391623302 376985346 361607808 345913390 330075010 314807304 299235400 284698348
14254B84698348j3667740j3458940j2996440j2426034j1677004j1223608j0419521
$$ 284698348 271030608 257571668 244575228 232149194 220472190 209248582 198829061
14247A98829061r735434r757748q298579q067808p876419p297809o941648o500627
$$ 198829061 189093627 179335879 171037300 162969492 155093073 147795264 140853616 134352989
14239A34352989o305584n202995n170538n281171n090298m605701m216015l889974
$$ 134352989 128047405 122844410 117673872 112392701 107302403 102696702 98480687 94590713
14231I4590713l065949m047084l382334l448839l082611k925055k981158k552080
$$ 94590713 91524764 87477680 84095346 80646507 77563896 74638841 71657683 69105603
14223F9105603k345163k305445k310486j695044k273555j959735j848445k002362
$$ 69105603 66760440 64454995 62144509 60449465 58175910 56216175 54367730 52365368
14215E2365368j289017j601573j275747j604297j662481j378736j363121r63069
$$ 52365368 51076351 49474778 48199031 46594734 44932253 43553517 42190396 41227327
14207D1227327m87785j196583j192193j491347j107704r01482n10265p01906j219418
$$ 41227327 40739542 39542959 38350766 36859419 35751715 34850233 34339968 33638062 32418644
14198C2418644j123845o25590o78191r37919m38450j006232l77748j043661m26817
$$ 32418644 31294799 30669209 29991018 29053099 28614649 27608417 27230669 26187008 25760191
14189B5760191o41256o45367n62104m77859p66063k70270o23631j92341n93409
$$ 25760191 25118935 24473568 23911464 23433605 22667542 22397272 21773641 21581300 20987891
14180B0987891n61760m59856j35371r27328n4829n48466m20982l80100m22888
$$ 20987891 20426131 19966275 19830904 18903576 18848747 18300281 17879299 17499199 17076311
14171A7076311J02m47014j12840j59578o33760l32028j29345q35041J91101j54057
$$ 17076311 17076413 16629399 16516559 16356981 15723221 15391193 15261848 14426807 14617908 14463851
14161A4463851l61721J82800o95207N3992q78120K32679k32170k94438J07520
$$ 14463851 14102130 14284930 13589723 13643715 12765595 12998274 12766104 12471666 12579186
14152A2579186l71284n94516o7488m26634K64628m61032J67027m36160j23162
$$ 12579186 12207902 11613386 11545898 11119264 11383892 10922860 11089887 10653727 10530565
14143A0530565j28011O5977l93145k90153r1653L66251l64886j87364J17574n67955
$$ 10530565 10402554 10468531 10075386 9785233 9693580 10059831 9694945 9507581 9625155 9057200
14133I057200J01479k55290p3821k86292O4024k14201k32086k7308k03083J45830
$$ 9057200 9158679 8903389 8829568 8543276 8607300 8393099 8161013 8133705 7930622 8076452
14123H076452j12944l46245J06394l95714Q0919j51692m7707q3264p0319p8669
$$ 8076452 7963508 7617263 7723657 7327943 7408862 7257170 7209463 7126199 7055880 6977211
14113F977211k36646J74803j92132k6333l15638J39175p9614l64176M5179J82851
$$ 6977211 6740565 6915368 6723236 6696903 6381265 6520440 6440826 6076650 6121829 6304680
14103F304680k67517j07830j83901N0792R6962k73078R3758j65366N3103n9138
$$ 6304680 6037163 5929333 5745432 5796224 5893186 5620108 5713866 5548500 5601603 5542465
14093E542465l94390N24446k48483j61367L8207k46427M4229q1290r8313k20337
$$ 5542465 5148075 5672521 5424038 5262671 5300878 5054451 5098680 5017390 4919077 4698740
14083D698740J97447N1225k48038j33866M7328j40169J65052J5470j33744R5978
$$ 4698740 4896187 4947412 4699374 4565508 4612836 4472667 4637719 4653189 4519445 4615423
14073D615423l75403O4205j59401M5871l25545K78403o9289j48296J89322j33762
$$ 4615423 4240020 4304225 4144824 4190695 3865150 4143553 4074264 3925968 4115290 3981528
14063C981528K34776k88255p7864K88249r2810J21532j42148j22203j66777l09625
$$ 3981528 4216304 3928049 3850185 4138434 4045624 4167156 4025008 3902805 3736028 3426403
14053C426403N02382l52536k00852J21034L77145n17430p7567j60072N08R578
$$ 3426403 3928785 3576249 3375397 3496431 3873576 3356146 3278579 3118507 3119015 3128593
14043C128593J85543j87008J84720r926l1326m88618J94336R26J37759j539J4966
$$ 3128593 3314136 3127128 3311848 3301922 3270596 2781978 2976314 2977240 3114999 3113460 3128426
14032C128426K08685j62173k19494j14121M4822k23976N17034l41151m0670J13716
$$ 3128426 3337111 3174938 2955444 2841323 2886145 2662169 3179203 2838052 2797382 2911098
14022B911098j86397N152j36170N7142O069k62882k9213N38857m62584j82282
$$ 2911098 2724701 2729853 2593683 2650825 2656894 2394012 2364799 2903656 2441072 2258790
14012B258790N0954L09677j10824k53851q2393j87785N00685o2912o70244K81371
$$ 2258790 2309744 2619421 2508597 2254746 2172353 1984568 2485253 2422341 1752097 2033468
14002B033468K83411j03481k42828p8483K538K66971k02215Q7032k47589L9847
$$ 2033468 2316879 2213398 1970570 1892087 1894625 2161596 1959381 2046413 1798824 1838671
13992A838671P448M52940k1520J090212K952241P610431K0174924J2604406k1701591
$$ 1838671 1846119 2299059 2277539 3367751 6319992 13930423 34105347 46709753 25008162
13983B5008162A2146233m453883j948162q01711q59785m18735n07789k33358K74687
$$ 25008162 12146233 7692350 5744188 4942477 4082692 3663957 3156168 2922810 3197497
13974C197497l40127j61687q7099k34564k24400R2891J67819k30641K79539r2967
$$ 3197497 2857370 2695683 2608584 2374020 2149620 2242511 2410330 2179689 2459228 2366261
13964B366261l38913K21038K1285j62684J52104m15124K15934K8542k90850L41698
$$ 2366261 2027348 2248386 2269671 2106987 2259091 1843967 2059901 2088443 1797593 2139291
13954B139291n77755J82317N44086n03972J61462j14323m1426l8950j2558M1292
$$ 2139291 1561536 1743853 2287939 1783967 1945429 1831106 1789680 1750730 1738172 1779464
13944A779464J27255R940k63348J70620J31071k28308j18851L01401j11831J67472
$$ 1779464 1906719 1916659 1653311 1823931 1955002 1726694 1607843 1909244 1797413 1964885
13934A964885l68190O0321Q7128k39240J17893m10012P31431m59995M2712L42872
$$ 1964885 1596695 1657016 1744144 1504904 1622797 1212785 1944216 1484221 1526933 1869805
13924A869805k06232j25641l07792Q5256J16354o0479J4876N0746J97603G87253
$$ 1869805 1663573 1537932 1230140 1315396 1431750 1371271 1386147 1436893 1634496 787253
13913A664214j10380k42552J93712J251j50257L96605r7781k33759J32305n2005
$$ 1664214 1553834 1311282 1504994 1506245 1355988 1752593 1654812 1421053 1553358 1501353
13903A501353K835o8799l26776K64183K38379l10355j19730J3085R2793q0374
$$ 1501353 1504188 1435389 1108613 1372796 1611175 1300820 1181090 1194175 1286968 1206594
13893A206594L47017k54999j24837J7384O6973o4819L03563k33179J90805j49033
$$ 1206594 1553611 1298612 1173775 1191159 1258132 1193313 1496876 1263697 1454502 1305469
13883A305469k86156J69132j26652Q7474J78582j96564m4422m4369J64096J99231
$$ 1305469 1019313 1188445 1061793 1149267 1327849 1131285 1086863 1042494 1206590 1405821
13873A405821n69924N22895P7587j25310l7243J18214l60418r9988q64J99518
$$ 1405821 835897 1358792 1436379 1311069 1273826 1392040 1031622 931634 930770 1130288
13863A130288O45j8919j81685p514O8588P5699M18011m15704j83374J46066j52351
$$ 1130288 1130933 1112014 930329 922815 991403 1067102 1485113 1069409 886035 1032101 879750
13852H79750J29230L6859k99189J09101L70415k13124L7214N8179j36224l5860
$$ 879750 1008980 1045839 746650 855751 1226166 1013042 1050256 1108435 972211 936351
13842I36351l487j44004L06127m17213J88852M82885E42440M93998j20710O4893
$$ 936351 932864 788860 1094987 677774 866626 1349511 542440 1036438 915728 980621
13832I80621o2045J58455j90702k85586O04765j19766l45395M50221l2237D90040
$$ 980621 918576 1077031 886329 600743 1205508 1085742 740347 1190568 1158331 490040
13821I31946l18333R6090L20862l29982R7362j65147J47405J87964k33451N24876
$$ 931946 613613 709703 1030565 700583 797945 632798 780203 968167 734716 1259592
13811A259592n51811m0227J42288j50680J25010J3945r2373j39050J31591l3014
$$ 1259592 707781 667554 809842 659162 784172 798117 705744 566694 698285 665271
13801F65271B79086K90995K91452j78973o6110R3051L62809j98550k1449l88001
$$ 665271 279086 570081 861533 682560 616450 709501 1072310 873760 852311 464310
13791D64310O02934k49951l17410J25579J26706j6951n6345J98683k94540J34699
$$ 464310 1067244 817293 499883 625462 752168 735217 678872 877555 583015 717714
13781G17714k0222M12017n48669N67546k68959n885k84484k5842j18660K17552
$$ 717714 697492 1109509 560840 1128386 859427 853542 569058 543216 424556 642108
13771F42108L17008D30022L38742j9598K26595l71272J15732j789j71J44469C33143
$$ 642108 959116 430022 768764 749166 975761 604489 720221 718432 718261 862730 333143
13759I16180D50442q2211M45990C02859L87380m6176p0272K37070k43673J46806
$$ 916180 450442 368231 814221 302859 690239 644063 573791 810861 567188 713994
13749G13994Q1312j30667R6779k07403j4386M0598J31934j32733j20402L90094
$$ 713994 795306 664639 761418 554015 539629 580227 712161 579428 459026 849120
13739H49120l89498J63651j27890K62449J1287j1080C59946J72193k3971k01176
$$ 849120 459622 623273 495383 757832 769119 758039 359946 532139 508168 306992
13729C06992K97242j80343K86308k06168P9261l5301o3844L96665l08782j73595
$$ 306992 604234 423891 710199 504031 583292 547991 484147 880812 572030 398435
13719C98435O61399l75641l09897K87428G9241P52963D01925K00608N056K22278
$$ 398435 1059834 684193 374296 661724 79241 832204 401925 602533 607589 829867
13709H29867k32239p3443j3702A43001N93358j89989L44877e9687I62109m03270
$$ 829867 597628 524185 510483 143001 736359 546370 891247 -59687 962109 558839
13699E58839k5535O7456j81810K66049K31124C50391L02514J06736J24550k80171
$$ 558839 533304 600760 418950 684999 916123 350391 652905 759641 884191 604020
13689F04020E3680M30457O6096R6518K5922q6152q5421O4516j92241K14410p9966
$$ 604020 53680 484137 550233 646751 672673 586521 501100 565616 373375 587785 507819
13678E07819Q9094j20557j15164m1198J4949Q5248O0865j07l0823Q7419J11206
$$ 507819 596913 476356 361192 319994 334943 420191 481056 480949 450126 537545 648751
13667F48751j38641j53615N4563R0445O0793k71362L13469B65984K17897A36792
$$ 648751 510110 356495 411058 501503 562296 290934 604403 265984 483881 136792
13656D98021n7401m7636K3878Q3171B30149q7631L87120B11190J86872A38015
$$ 498021 440620 392984 416862 500033 230149 142518 529638 211190 398062 138015
13645F18834k30631L83030o4927R0105k14854B80812o9506O9995J38992j19525
$$ 618834 388203 771233 706306 796411 581557 280812 211306 281301 420293 300768
13635C00768K03839K64743B21863J92033K21202j44274A16120J39472K1756Q2672
$$ 300768 504607 769350 221863 413896 635098 490824 116120 255592 277348 360020
13625C60020o4694K45815N5347B72713A36036M98653m0691A48012M36839k29090
$$ 360020 295326 541141 596488 272713 136036 634689 593998 148012 584851 355761
13615C55761o7368A24873J02749J92266K59735A04785M1546L16919K8551j38374
$$ 355761 288393 124873 227622 419888 679623 104785 146331 463250 491801 353427
13605C53427N5574p6043J07631p1718o1418k7852J38878P3914B30720J78155K82477
$$ 353427 409001 332958 440589 368871 307453 279601 418479 492393 230720 408875 691352
13594F91352l18383M6052J67368A93785O39253A71632J05674j28088L93894B49117
$$ 691352 372969 419021 586389 193785 833038 171632 277306 149218 543112 249117
13583E3945J69262M9656M5879n7757q4072j3578a67867E40841A09833L2118K50134
$$ 53945 223207 272863 318742 260985 176913 163335 -167867 540841 109833 141951 392085
13572C92085O2521b0664B7849Q9755L93425A88724L86487A18372L14300j50066
$$ 392085 454606 -20664 27849 117604 511029 188724 575211 118372 432672 282606
13562B82606J69028B08220I7789J57517a32780C30514P8990l1315G6361L8205
$$ 282606 451634 208220 97789 255306 -132780 330514 409504 378189 76361 114566
13552A14566K47028J05517l3069I8222b0920C63565J51957A69372K6030R4574
$$ 114566 361594 467111 434042 98222 -20920 363565 515522 169372 195402 289976
13542B89976K04796A84658J34589A36760k176K03580d6270B48190K100K13144
$$ 289976 494772 184658 319247 136760 134584 338164 -46270 248190 250290 463434
13532D63434o228j04596r8158m9162g836B47570L60429b27080f654B26002M51954
$$ 463434 457206 352610 254452 205290 -7836 247570 607999 -227080 -6654 226002 677956
13521F77956k39863E5471J97021R7957K2150A03240j1572K09136K19968j95465
$$ 677956 438093 55471 252492 350449 372599 103240 91668 300804 520772 325307
13511C25307A08459j7639M27930I9142M42796B46025P3220Q5442O8325A49041
$$ 325307 108459 90820 518750 99142 541938 246025 319245 404687 473012 149041
13500A56634K30145D8576L41337j4540A75143M1826j5617C0456K27377M2279J51496
$$ 156634 386779 48576 389913 375373 175143 216969 201352 30456 257833 300112 451608
13489D51608l90A32400J06250K24335p628A78556F827M36695j18708a41213C07522
$$ 451608 451218 132400 238650 462985 455357 178556 6827 443522 324814 -141213 307522
13477B31425B0795J31492F0605a05389F2502L77680j68831K18722F9811J73319
$$ 231425 20795 152287 60605 -105389 62502 440182 271351 490073 69811 243130
13467B43130G4976C3010J14196J58103j06875J72146A41671K0077B8332L84728
$$ 243130 74976 33010 147206 305309 198434 370580 141671 161748 28332 413060
13457D13060k5935A56697J58036A38452R2407N7324P7034j74650L55040j23739
$$ 413060 387125 156697 314733 138452 230859 288183 365217 190567 545607 421868
13447D21868b36815A60351L74459o2778j63388A12926K97438A48382p1465J98197
$$ 421868 -236815 160351 534810 472032 308644 112926 410364 148382 76917 275114
13437B75114n3787C8853A5961J13591K41454k0882G9131J49288I3580C5496P5289
$$ 275114 221327 38853 15961 129552 371006 350124 79131 228419 93580 35496 110785
13426A10785j8200J28392L42247B38567n4596J4149J46181A05413K69922A06224
$$ 110785 92585 220977 563224 238567 183971 198120 344301 105413 375335 106224
13415C10395J61713Q895F9904K16561j15798Q1658q6185K2130F5522J36829H5964
$$ 310395 472108 481003 69904 286465 170667 252325 166140 188270 65522 202351 85964
13403B99035K66498k45994q5073O7684O2693H4718P3474n3656J45715E9175f859
$$ 299035 565533 319539 234466 302150 364843 84718 158192 104536 250251 59175 -6859
13391F4875P9900J80705a80183D07907I0388c1741A1530L22376E909K47394q722
$$ 64875 144775 325480 -180183 407907 90388 -31741 11530 333906 5909 253303 244581
13380B44581J59011j96439j0602J60244A76408J51873A54577O6706o2905J1594
$$ 244581 403592 207153 196551 356795 176408 328281 154577 221283 158378 169972
13370A69972K11339e011C53630A41001J67806A5165g8569A02734J07161L8915
$$ 169972 381311 -5011 353630 141001 308807 15165 -78569 102734 209895 248810
13360B48810n8437O9320j23705E4450p318J35678J21716J5325L9697c2903F8429
$$ 248810 190373 259693 135988 54450 47132 182810 304526 319851 359548 -32903 68429
13348B92288L5182k9490A43612J34911O97r8368q2602N83043I8761B38J36613
$$ 292288 327470 297980 143612 278523 279220 180852 98250 681293 98761 238 136851
13337A36851E0391L5566j8789L2885J10829M0014J86093A21127O5861n1682j820
$$ 136851 50391 85957 67168 100053 210882 250896 436989 121127 186988 135306 133486
13326A33486E4063O8980Q765J062J88440d242A91886i0594B90827c4032E1788
$$ 133486 54063 123043 131808 132870 321310 -4242 191886 -90594 290827 -34032 51788
13314B2071J73575J12799f0237A90571k0362O3367M1327P7490A0233P3628a59478
$$ 22071 195646 308445 -60237 190571 170209 233576 274903 352393 10233 83861 -159478
13302A70392Q8090b3410B39696M9863l2284O5730j19472g1300B7292K96635n3959
$$ 170392 258482 -23410 239696 289559 257275 323005 203533 -71300 27292 323927 269968
13291B69968j31640J32018H4373J1968K65790n347A40953h5727k1195P607E1285
$$ 269968 138328 270346 84373 96341 362131 356784 140953 -85727 -106922 -99315 51285
13279B70643R0536E0230K787R3063a53852P6445l50109i8800A0784J80920O7165
$$ 270643 361179 50230 53017 146080 -153852 -77407 -427516 -98800 10784 191704 258869
13268B58869C0686L46458r2645b16580A55649J14541a23430J8962M2120E9944
$$ 258869 30686 377144 284499 -216580 155649 270190 -123430 -104468 -62348 59944
13257f4150m6165c6281C77723A49859J3972J35184J93396A07967L99220A57133
$$ -64150 -110315 -36281 377723 149859 163831 299015 492411 107967 507187 157133
13246B09743K88908b59176E4212a05047L1758A01953M5512K2234a43696B7824
$$ 209743 498651 -259176 54212 -105047 -73289 101953 147465 169699 -143696 27824
13235A1426J21962B1219M91663a02981A87325a4057F9742J87653a180H7098M3310
$$ 11426 133388 21219 512882 -102981 187325 -14057 69742 257395 -1180 87098 130408
13224A30408K4910F7320M1369k3209J17558K20155F0389f2054B86455h8068A94549
$$ 130408 155318 67320 108689 85480 203038 423193 60389 -62054 286455 -88068 194549
13212A50780B5242R5067i8249C3634J53692g8911G5043O6176D968g8799I8012
$$ 150780 25242 120309 -98249 33634 187326 -78911 75043 141219 4968 -78799 98012
13200A93704a48428A64578e4193r4997C44388a4644D24688h2392Q690C867J91963
$$ 193704 -148428 164578 -54193 -149190 344388 -14644 424688 -82392 -73702 3867 195830
13189A95830r3556m6297a6046J582B61067J07854A34829B6681M3874c07957e7302
$$ 195830 102274 55977 -16046 -14464 261067 368921 134829 26681 70555 -307957 -57302
13177C1699Q6678a06289j5841A64336A0859J16808a18115B77310K8903K4128j27583
$$ 31699 118377 -106289 -122130 164336 10859 127667 -118115 277310 306213 330341 202758
13166B02758G8619P4918E1742J2897K16491A22916K6940N77893B08804a11019
$$ 202758 78619 153537 51742 64639 281130 122916 149856 727749 208804 -111019
13155B17050f9822A63398m512a07463A41225M3834J93323G5057a62913G8140K89852
$$ 217050 -69822 163398 158886 -107463 141225 185059 378382 75057 -162913 78140 367992
13144C67992b30088F6117p395K1235h5035q1201c3260A34217F1824j0508R6160
$$ 367992 -230088 66117 58722 79957 -85035 -166236 -33260 134217 61824 51316 147476
13133A47476d927A50052J02252C4546R9652a51227D77661A99797E9824M9964b6893
$$ 147476 -4927 150052 252304 34546 134198 -151227 477661 199797 59824 109788 -26893
13121a67452N4329A4445a74989D5128K08940A9604K13686C7953J76517I1191l5262
$$ -167452 -113123 14445 -174989 45128 254068 19604 233290 37953 214470 91191 55929
13110E5929b6516j63501A5814J05211d5413j2620l36026D7001L2740l0928J01977
$$ 55929 -26516 -190017 15814 121025 -45413 -58033 -394059 47001 79741 48813 150790
13099A50790e1838k48932a03441J5875A52803c15552a10066F2699J77626i4286
$$ 150790 -51838 -300770 -103441 -87566 152803 -315552 -110066 62699 240325 -94286
13088A27490a45374B73631R1080A14011K03915c4538j78893C989O1216h6819n0032
$$ 127490 -145374 273631 364711 114011 317926 -34538 -213431 3989 65205 -86819 -136851
13077a36851e4040K4821D12368A58079k6070j4786k6875a12925j79525i4120C14261
$$ -136851 -54040 -29219 412368 158079 132009 117223 90348 -112925 -292450 -94120 314261
13065B80921K04383E5043L27784o9634I4002J87285j7287C1660g8696k0878a7993
$$ 280921 485304 55043 382827 313193 94002 281287 264000 31660 -78696 -99574 -17993
13053A96228O2394o7666M14287k49520H9140J64493J17484F429K95427g1525j61814
$$ 196228 258622 190956 605243 355723 89140 253633 371117 6429 301856 -71525 -233339
13042b33339A40449B7497K62670a57492C10008J3669a6711B57831p0500a492A84903
$$ -233339 140449 27497 290167 -157492 310008 323677 -16711 257831 187331 -1492 184903
13030B64625n0439f4335D6662J4117j7812L34960d1565A15382P8644a052B23740
$$ 264625 214186 -64335 46662 60779 42967 377927 -41565 115382 194026 -1052 223740
13018e38689A53010m4800P5465d279C4675f1584p1643a5793B09548h7345G1871
$$ -538689 153010 108210 183675 -4279 34675 -61584 -133227 -15793 209548 -87345 71871
13006A01911a58824B1598J78656J98867A40606a67929K7768A26484B0679K95644
$$ 101911 -158824 21598 200254 399121 140606 -167929 -140161 126484 20679 316323
12996C16323I1869c3356C21390b69098i1E7474h1075K6090H0797b27346P1739
$$ 316323 91869 -33356 321390 -269098 -91 57474 -81075 -54985 80797 -227346 -155607
12985a55607O1790B68952o143H4048J9853D2224b98312J20858F3472k0930J48074
$$ -155607 -93817 268952 262809 84048 103901 42224 -298312 -177454 63472 42542 190616
12974A90616a00717C18924i6626L0571A54544a96410C11232a03272D204Q9426
$$ 190616 -100717 318924 -96626 -66055 154544 -196410 311232 -103272 4204 93630
12964I3630a90230k7661H7227M5944k1415L1826E535O8778f5297b5355I9886a23448
$$ 93630 -190230 -217891 87227 133171 111756 143582 5535 74313 -65297 -25355 99886 -123448
12951a25983I9528M5268R7339A15336J52414c71219h3727r7544h8599I4033N0050
$$ -125983 99528 144796 242135 115336 267750 -371219 -83727 -181271 -88599 94033 144083
12940A44083J7137A6168g0469c018j05050E9155M0326N1137p4055b30634e4333
$$ 144083 161220 16168 -70469 -3018 -108068 59155 99481 150618 76563 -230634 -54333
12928A09449J0380b88198A043J82442b69718b7968a3822k4463l9213A2433K35228
$$ 109449 119829 -288198 1043 183485 -269718 -27968 -13822 -38285 -77498 12433 247661
12917B47661a76590I4647b07920A10292h0547j28797B45803b22344E7997A879
$$ 247661 -176590 94647 -207920 110292 -80547 -209344 245803 -222344 57997 1879
12906a27308A88978a52572D19182A9827L30143b13649B19102R8795c40543h55
$$ -127308 188978 -152572 419182 19827 349970 -213649 219102 317897 -340543 -855
12895a27330B05541b81574B24184a28764N9738a9778k19314A34448j8801h2099
$$ -127330 205541 -281574 224184 -128764 -69026 -19778 -239092 134448 115647 -82099
12884g3418A58810a35164H9322J61477r5122B3408c54544G2091j4470a42891n6549
$$ -73418 158810 -135164 89322 250799 155677 23408 -354544 72091 57621 -142891 -199440
12873a99440A33262P3845f0621o3265B26456A1987D164J25515e7921E3739j8745
$$ -199440 133262 207107 -60621 -123886 226456 11987 4164 129679 -57921 53739 34994
12862C4994M8916a59429K895j1366a090j44484B93854b1264B23511b1582j41669
$$ 34994 83910 -159429 -156534 -167900 -1090 -145574 293854 -21264 223511 -21582 -163251
12851a63251A50726N50004f5276A67121p8580K8668M4844p3906P1535E5059a55937
$$ -163251 150726 700730 -65276 167121 88541 117209 162053 88147 159682 55059 -155937
12839A60766E6439L76711g5004k4452k3483C38024j01826A13149b24253A30471
$$ 160766 56439 433150 -75004 -99456 -122939 338024 236198 113149 -224253 130471
12828E1889M9193m9398a69195a4841j31115G0376a05172A6927K04730f9787j18125
$$ 51889 101082 51684 -169195 -14841 -145956 70376 -105172 16927 221657 -69787 -187912
12817a87912h8597j85024i2458j1007A48944C0192J27380o2064e6992j1679m6243
$$ -187912 -88597 -273621 -92458 -103465 148944 30192 157572 95508 -56992 -68671 -114914
12806a14914k1692c530D6005J2905L8296O6657b2007p5202l0500j10802B94271
$$ -114914 -136606 -3530 46005 58910 97206 163863 -22007 -97209 -127709 -238511 294271
12794d3572A4039i8202A7938J55158i3270B83581h5977o2495F6910g5271I8650
$$ -43572 14039 -98202 17938 173096 -93270 283581 -85977 -148472 66910 -75271 98650
12782A9416O2503J45505J26613b65844E09010a97768B5239b45230L7195A3490
$$ 19416 81919 227424 354037 -265844 509010 -197768 25239 -245230 -208035 13490
12771A43456l0749Q4285q547D3356o630J16886a2879A14809D0187a08258B63077
$$ 143456 112707 196992 188445 43356 36726 153612 -12879 114809 40187 -108258 263077
12759d0566j95587A47785f4767J0679n6090B2276i4756r1863A16372b68497A46372
$$ -40566 -236153 147785 -64767 -54088 -110178 22276 -94756 -186619 116372 -268497 146372
12747a34737d7994E1425c2826D29665i285j16327K7873A82525L7216N65011a35683
$$ -134737 -47994 51425 -32826 429665 -9285 -125612 -97739 182525 219741 784752 -135683
12735B52234j1723n3865p369f4655A39994K04546e2494n0666G1028C2581O0127
$$ 252234 240511 186646 179277 -64655 139994 344540 -52494 -103160 71028 32581 92708
12724I2708J08611a26364A70927e1799a0543A02444b17553d1386B59184G8409
$$ 92708 201319 -126364 170927 -51799 -10543 102444 -217553 -41386 259184 78409
12713b6730A95203o7544K09589L29146A89536M6408n7867L5567j00368D6993J77019
$$ -26730 195203 127659 337248 666394 189536 235944 178077 213644 113276 46993 224012
12702B24012K31259C765J49681l2091m3839Q4977J9049b22145a5202I9607e0205
$$ 224012 455271 3765 153446 121355 77516 162493 181542 -222145 -15202 99607 -50205
12690a44987c8607j22616A67075A5933a00611H825J42089B9174L52122J6671G5173
$$ -144987 -38607 -161223 167075 15933 -100611 8825 150914 29174 381296 397967 75173
12678B86493M2536j30606r1974l0204K2081L82060a15124a5589D4617A7063K01717
$$ 286493 329029 198423 106449 76245 98326 480386 -115124 -15589 44617 17063 218780
12667B18780a02354C98837A65903k3381j0079A8527J37057g3991H8130f0761H750
$$ 218780 -102354 398837 165903 142522 132443 18527 155584 -73991 88130 -60761 8750
12655d5397E2790O8023A9141a35207j84722a27837H3542e0821A86435i356B18226
$$ -45397 52790 120813 19141 -135207 -319929 -127837 83542 -50821 186435 -9356 218226
12643A75277a36863a9967B7978M8933L073R6317Q4510a81954A8010h9650K0789
$$ 175277 -136863 -19967 27978 76911 79984 176301 260811 -181954 18010 -89650 -68861
12632f8861m9136A69814L6732K8858K4679H1896L44549j80134M737E9366N25894
$$ -68861 -117997 169814 206546 235404 260083 81896 426445 246311 251048 59366 585260
12621E85260q5332B41659f266A65494O2876P0921h6196H5016b13920a04920L075
$$ 585260 499928 241659 -6266 165494 228370 299291 -86196 85016 -213920 -104920 -101845
12610a01845A80379D8515K62440h4026d0643A59070b42366O8324A83710q6967
$$ -101845 180379 48515 310955 -84026 -40643 159070 -242366 -174042 183710 96743
12600I6743K6119M8603m3316b18182m173C76071a81359C38586A45310O1069F3178
$$ 96743 122862 171465 128149 -218182 -222355 376071 -181359 338586 145310 206379 63178
12588a90597B076d6966j78247M2396A2919O4908R1335n8544k4111A482g0002B18843
$$ -190597 2076 -46966 -225213 -182817 12919 77827 169162 110618 86507 1482 -70002 218843
12575d0394B62455P7430d3532A51080d6009B82958c9574g717l56053A185b01788
$$ -40394 262455 339885 -43532 151080 -46009 282958 -39574 -7717 -363770 1185 -201788
12563a41601d7672C78480A68444a24082L0692J8937K1941B62828a7140p7188l53354
$$ -141601 -47672 378480 168444 -124082 -93390 -74453 -52512 262828 -17140 -94328 -447682
12552d47682a71492A97722a00078o1344j26077E8719k2890J31426a90741A93633
$$ -447682 -171492 197722 -100078 -161422 -287499 58719 35829 167255 -190741 193633
12541b3105j2321E2338J68587Q5361j20900C8611K52061J09645j26461A05525
$$ -23105 -35426 52338 220925 306286 185386 38611 290672 400317 273856 105525
12530a82404d34j2928A07168L9357m0508e8156k27498f0992A56215j5828j4891
$$ -182404 -434 -13362 107168 146525 106017 -58156 -285654 -60992 156215 140387 125496
12519A25496J06769h958C5087l671a28358L6869A0203L65681A21311a73257A52383
$$ 125496 232265 -8958 35087 31416 -128358 -91489 10203 375884 121311 -173257 152383
12507a02402G4742c0604B89259A23926a54740f0347m2387j2944B9704N6999Q3361
$$ -102402 74742 -30604 289259 123926 -154740 -60347 -102734 -115678 29704 86703 170064
12496A70064a591A48625Q234K5314a71203A66481P0028g2563j86946c2112i486
$$ 170064 -1591 148625 156859 182173 -171203 166481 236509 -72563 -259509 -32112 -9486
12484a06958G2520h2906r5429d6145C0144A2195N6002b5679k8474C9954c68690
$$ -106958 72520 -82906 -178335 -46145 30144 12195 68197 -25679 -54153 39954 -368690
12472e5169p0503A87258a19386M0312A09072J69952a86222Q2442l3384l53200
$$ -55169 -125672 187258 -119386 -79074 109072 279024 -186222 -103780 -137164 -490364
12462d90364b3349l31527B1395J96120n1490P5141B6479f1976D2367K60074n3069
$$ -490364 -23349 -354876 21395 217515 166025 241166 26479 -61976 42367 302441 249372
12451B49372a6609k90528N6806A82371J1405e2184A85329F59L83465j11492a1059
$$ 249372 -16609 -307137 -250331 182371 193776 -52184 185329 659 384124 272632 -11059
12439B4569b87267B12731G2131J22900J88469a92470A62987C1885b0089B04366
$$ 24569 -287267 212731 72131 195031 383500 -192470 162987 31885 -20089 204366
12428a93323e5891C18301b79878D7463h1146C40559a39697O6496c468q4428d0704
$$ -193323 -55891 318301 -279878 47463 -81146 340559 -139697 -73201 -3468 -87896 -40704
12416B43193m5908d2710A05212K39071A54009k4269a91312b7598C49288H9382
$$ 243193 197285 -42710 105212 344283 154009 129740 -191312 -27598 349288 89382
12405b9927A46416J46828f8314c2148k2873A8991d44785A2769g9146m4751J0885
$$ -29927 146416 293244 -68314 -32148 -55021 18991 -444785 12769 -79146 -123897 -113012
12394a13012k33342g3717m2884A34948c3424F1139h5767k9542b4618I7709a01147
$$ -113012 -346354 -73717 -116601 134948 -33424 61139 -85767 -115309 -24618 97709 -101147
12382a72928E6820K5084m0297e4555C49492l9077C4740R620f60B67998m4872P4107
$$ -172928 56820 81904 41607 -54555 349492 310415 34740 44360 -660 267998 223126 297233
12370B97233d7569E1225a4763j76381A92821C3224b9872j23114D500J17000K92
$$ 297233 -47569 51225 -14763 -191144 192821 33224 -29872 -152986 4500 121500 121792
12359A21792a33375A20560a93692c8593E5883P9226b52483i2267G9992a65362
$$ 121792 -133375 120560 -193692 -38593 55883 135109 -252483 -92267 79992 -165362
12348D9168e9143B93621b03707O1736B44595E2349a99252e6466A80552I932a29215
$$ 49168 -59143 293621 -203707 -141971 244595 52349 -199252 -56466 180552 9932 -129215
12336a26455B7871J91739D876K100b25700g7707a5536C58259D8289A0513O1703
$$ -126455 27871 219610 4876 6976 -225700 -77707 -15536 358259 48289 10513 72216
12325G2216b61646b8100C24133B8966K41358K06591A18853c4387E5611c13312
$$ 72216 -261646 -28100 324133 28966 270324 476915 118853 -34387 55611 -313312
12314A41682E4708a26881r8597e2026a5894D97168h9364M3841g064G8365b86796
$$ 141682 54708 -126881 -225478 -52026 -15894 497168 -89364 -45523 -7064 78365 -286796
12302A08875k7961J2154j4753J7322K18708d0813A25032m7308g1631C76389r5961
$$ 108875 80914 93068 78315 95637 314345 -40813 125032 77724 -71631 376389 280428
12291B80428g5293b3884j51840j36670a24354l13627B16753a12636A15646a06097
$$ 280428 -75293 -23884 -175724 -312394 -124354 -437981 216753 -112636 115646 -106097
12280A96689f5207q7857B12709C850K19634B201L08725I1128R7110Q8753n7448
$$ 196689 -65207 -153064 212709 3850 223484 2201 310926 91128 188238 276991 219543
12269B19543b02135A04792H494L8890c47338C84131A28021J05225h0157J2060
$$ 219543 -202135 104792 8494 47384 -347338 384131 128021 233246 -80157 -68097
12259f8097G2967h9190A24659a01247A83043c4255D33608A46490a24395j8211
$$ -68097 72967 -89190 124659 -101247 183043 -34255 433608 146490 -124395 -142606
12249a42606q7799A69159K28576A49191K25895A239d4963B4093K19784l2948E8068
$$ -142606 -230405 169159 397735 149191 375086 1239 -44963 24093 243877 210929 58068
12237a89109f2927j73449A77956J00783I6097k2683O5246K71302j87403D4265
$$ -189109 -62927 -236376 177956 278739 96097 73414 138660 409962 222559 44265
12226A50524L38804A06673I292K72274A04302J10034D0088K97780F00J22077J79541
$$ 150524 489328 106673 9292 281566 104302 214336 40088 337868 600 122677 302218
12215C02218o0162c7488F7755Q6798J3920G2933K71441B0444J14592a37339D06179
$$ 302218 242056 -37488 67755 154553 168473 72933 344374 20444 135036 -137339 406179
12203A83516J27171K57938j47959c21093A67835F6932M349L46400A46729L9049
$$ 183516 310687 568625 420666 -321093 167835 66932 71281 417681 146729 185778
12193A85778C1106K2291J53753D2347o60L0684R8906o9162L564K25555I7383J78044
$$ 185778 31106 53397 207150 42347 41687 72371 171277 102115 105679 331234 97383 275427
12181B75427j20359E3033N9522C7519L59246H0582M08492D3330M4956e3818B6318
$$ 275427 155068 53033 112555 37519 396765 80582 489074 43330 88286 -53818 26318
12169a71561j7367G0286Q4713J00513A0489R8202l185J6081J01046a28979C68092
$$ -171561 -188928 70286 154999 255512 10489 108691 105506 121587 222633 -128979 368092
12157A18687E7252M9972m3323l1022a33655A54598C5128Q2567a43961A06994Q0616
$$ 118687 57252 107224 63901 32879 -133655 154598 35128 117695 -143961 106994 187610
12146A87610D8876c00953h2213o5639C75104b04566A87507O2548I9229D552K49101
$$ 187610 48876 -300953 -82213 -147852 375104 -204566 187507 250055 99229 4552 253653
12135B53653J65846A88266b4307j08610C11747A43765a9857D3551a97110B15286
$$ 253653 419499 188266 -24307 -132917 311747 143765 -19857 43551 -197110 215286
12124C7335J68260f7322C2522g2812r9144A13472h3629M372B29304c40220a19665
$$ 37335 205595 -67322 32522 -72812 -171956 113472 -83629 -79257 229304 -340220 -119665
12112a01648j40729C73475A51092D7725a63602K4445D8239d2748k4903o3470A01956
$$ -101648 -242377 373475 151092 47725 -163602 -139157 48239 -42748 -67651 -131121 101956
12100d03700B22969A8789b4594C67822I7061g6866q2363A4675d5639k9088A75746
$$ -403700 222969 18789 -24594 367822 97061 -76866 -159229 14675 -45639 -74727 175746
12088c849A12959d7498H2359b74906A17069a84571A08853J57878R10789R79537
$$ -3849 112959 -47498 82359 -274906 117069 -184571 108853 266731 1177520 2157057
12078B157057I91040m42118a80070P7833H24N0701K1793a95624a1862q5877A70650
$$ 2157057 991040 548922 -180070 -102237 824 51525 73318 -195624 -11862 -97739 170650
12066b23857B90469A18147D8267a87537r565B06657M409H5758b4300j3847A30038
$$ -223857 290469 118147 48267 -187537 -197102 206657 211066 85758 -24300 -38147 130038
12054b10637a9085A08601a82602q1433D3473a28297j83069J37095D0980R7604
$$ -210637 -19085 108601 -182602 -264035 43473 -128297 -311366 -174271 40980 138584
12044A38584J3152J47452b1372E4470J19944J27215a75596q5409A17991a40059
$$ 138584 151736 299188 -21372 54470 174414 301629 -175596 -261005 117991 -140059
12033A2676M3803A1203J23454P8922p5851c37132C70856r7491b83212i0985j3364
$$ 12676 56479 11203 134657 213579 137728 -337132 370856 273365 -283212 -90985 -104349
12022a04349A30157a25680A50504h3884I9299a19046G4862N9786J42544o7644
$$ -104349 130157 -125680 150504 -83884 99299 -119046 74862 134648 277192 209548
12012B09548l9609k4937c9918k74199A03251L919G827J49443p5319a44236j01133
$$ 209548 169939 145002 -39918 -314117 103251 107170 7827 157270 81951 -144236 -245369
12001b45369B75555F9296i7053B22461c44377B96127r5209c7072n7596k78965
$$ -245369 275555 69296 -97053 222461 -344377 296127 200918 -37072 -94668 -373633
11991c73633A70619b0475l4924B35975j0329a09108A84993b9066m3788j56687
$$ -373633 170619 -20475 -55399 235975 225646 -109108 184993 -29066 -72854 -229541
11981b29541P5491o177B18641q0668a86435j04058a9008D2700a29709I818b9156
$$ -229541 -154050 -160227 218641 137973 -186435 -290493 -19008 42700 -129709 9818 -29156
11969a09786j5590N3534B5137N2688c57226f7771p9671R327B232a79790g4558
$$ -109786 -125376 -71842 25137 77825 -357226 -67771 -147442 -138115 2232 -179790 -74558
11957b0220B13792K25718a26792j7673A82904F6028J6917A8786a70126j74366
$$ -20220 213792 439510 -126792 -144465 182904 66028 82945 18786 -170126 -344492
11947c44492a02511j27821A9433Q5439E0024K70223e6162A17400a74713M6363
$$ -344492 -102511 -230332 19433 104872 50024 320247 -56162 117400 -174713 -128350
11937a28350k140d7997r1734O3656A16849a62517n03f3538g114A07219P9382m3904
$$ -128350 -130490 -47997 -139731 -76075 116849 -162517 -163020 -63538 -7114 107219 186601 142697
11925A42697d4099B03666n4340l3934a82944h2369B40104b40932B09686a4021
$$ 142697 -44099 203666 149326 115392 -182944 -82369 240104 -240932 209686 -14021
11914A29227f0541D9752L0712b86078M139I182c57234J21936K7916A9649a20478
$$ 129227 -60541 49752 80464 -286078 -281939 9182 -357234 -235298 -207382 19649 -120478
11902a85729d2433o1577A41196K1814K05560A7437b54970A36475d29276B0425
$$ -185729 -42433 -104010 141196 163010 368570 17437 -254970 136475 -429276 20425
11891c2418I154g9676j53381A26559J5624f7554k89512B33639B6404b75435A01351
$$ -32418 9154 -79676 -233057 126559 142183 -67554 -357066 233639 26404 -275435 101351
11879d5019F9522G856a22418A25030C4082b54910B37053a59374A04891b14398
$$ -45019 69522 7856 -122418 125030 34082 -254910 237053 -159374 104891 -214398
11868c56404a1084H9817m2424J23936A6772N794a75833B37094H000K78050C7975
$$ -356404 -11084 89817 47393 171329 16772 22566 -175833 237094 8000 286050 37975
11856a02340A0851A307P939L9972b32727j36189i9467j32174b8740m1741L3173
$$ -102340 10851 1307 9246 49218 -232727 -368916 -99467 -231641 -28740 -70481 -37308
11845c7308i081m40659H0195R2601d65892B8160O3792a70332p6705R8964d8179
$$ -37308 -9081 -449740 80195 172796 -465892 28160 91952 -170332 -247037 -148073 -48179
11833e8782j4828D166a16601B44859l0657a38787m1182B50301H9326j8c74456
$$ -58782 -73610 4166 -116601 244859 214202 -138787 -179969 250301 89326 89308 -374456
11821A81543b47024B02173b27779Q9251L2778k76732D64803a48559o0256B59513
$$ 181543 -247024 202173 -227779 -138528 -105750 -382482 464803 -148559 -208815 259513
11810a25302F6510b04125e4013k99259a7964k70883A09976K4768B7337a43761
$$ -125302 66510 -204125 -54013 -353272 -17964 -288847 109976 134744 27337 -143761
11799A20978d69623A96303M0767a82223P8622o9333I504f9890A72685a92278I9617
$$ 120978 -469623 196303 237070 -182223 -103601 -172934 9504 -69890 172685 -192278 99617
11787d9446r3960D8300h6747C39267D3585L02038j36289g3980A70639e8712F7811
$$ -49446 -143406 48300 -86747 339267 43585 345623 209334 -73980 170639 -58712 67811
11775h3506F1691J85377r8385J38453a6922C8617h2373B66876M1467a38980f2035
$$ -83506 61691 247068 148683 287136 -16922 38617 -82373 266876 308343 -138980 -62035
11763d7164m2546A45436c55720J47479B94887A20120E7615b24540N7607B7874
$$ -47164 -89710 145436 -355720 -208241 294887 120120 57615 -224540 -166933 27874
11752b64188A88457l9603c109A17610i5027j40858Q6341F407b20923d2939G7788
$$ -264188 188457 148854 -3109 117610 -95027 -235885 -149544 6407 -220923 -42939 77788
11740B54401b9854n9104A81876o9641e5398B5825f9239B84137c53264B75984M6149
$$ 254401 -29854 -88958 181876 112235 -55398 25825 -69239 284137 -353264 275984 322133
11729C22133b7216p1868m7872o7971f6162C136O4967B4142H745L10845A39681
$$ 322133 -27216 -99084 -146956 -214927 -66162 3136 68103 24142 8745 319590 139681
11717i7414k0921B597b48639C36331F5986K47711a70887A14252n2640c6146j9631
$$ -97414 -118335 2597 -248639 336331 65986 313697 -170887 114252 61612 -36146 -55777
11706e5777C3345a69773A09466J74563j17365D1014a46732f8485D0663N7841Q1703
$$ -55777 33345 -169773 109466 284029 166664 41014 -146732 -68485 40663 98504 180207
11695A80207A54i4748a0002A46861J08921Q5442A23932m2949Q329N147d4649B13367
$$ 180207 154 -94748 -10002 146861 255782 341224 123932 80983 89312 94459 -44649 213367
11682H0573P5311a55246f6325C28634q5721k6356M8776C3220K404q918a45890
$$ 80573 155884 -155246 -66325 328634 242913 216557 265333 33220 35624 26706 -145890
11670B7008J29720E0763J98439a14950I8132K05776j04817A437K04022A9666b69049
$$ 27008 156728 50763 249202 -114950 98132 303908 199091 1437 205459 19666 -269049
11658B30623D409h9839A82687D9137g6123A31536L8106A4815a5218m6614H5578
$$ 230623 4409 -89839 182687 49137 -76123 131536 169642 14815 -15218 -61832 85578
11646B5331K90245C1544a83013A77257h3455D0974H868J4492l285a12411j55919
$$ 25331 315576 31544 -183013 177257 -83455 40974 8868 23360 20075 -112411 -268330
11635b68330f3292a7689m7657G3341b70123I0835J23586H3136O5292G3771J9447
$$ -268330 -63292 -17689 -65346 73341 -270123 90835 214421 83136 148428 73771 93218
11624I3218R5679o5039E6666O7482L72782G471A264J90487c8209A43185F7575
$$ 93218 188897 123858 56666 124148 496930 7471 1264 191751 -38209 143185 67575
11612A05844m2619J01746G0402a88056C4551f7848I6489A0324J07740j0847M6078
$$ 105844 63225 164971 70402 -188056 34551 -67848 96489 10324 118064 107217 153295
11601A53295J30818r2352D8292J35241o7526n5030J47299I0590K0208D3288A7559
$$ 153295 284113 191761 48292 183533 116007 60977 208276 90590 110798 43288 17559
11589A67179G447L5869J5586J45974l2777J64301j39903i7528C92122A56977O8795
$$ 167179 7447 43316 58902 204876 172099 336400 196497 -97528 392122 156977 225772
11578B25772E6811a18987A9484d8939A16706a01952A60198J30483A5848P1355
$$ 225772 56811 -118987 19484 -48939 116706 -101952 160198 290681 15848 87203
11568H7203a11457J0632A91957a54246I1459Q3661M0430c200D1583K32568j09626
$$ 87203 -111457 -100825 191957 -154246 91459 175120 215550 -3200 41583 274151 164525
11557A64525J26162j25571a21183N0979G5687M1967J80637a00179A52831K17710
$$ 164525 290687 165116 -121183 -70204 75687 117654 298291 -100179 152831 370541
11547C70541j04746p3552a48329A72980O0773B396J26975R6605B3842J27820J8126
$$ 370541 265795 192243 -148329 172980 233753 2396 129371 225976 23842 151662 169788
11536A69788a53743F228J28075B8081K69267c59025B67709a12373L3604A1539
$$ 169788 -153743 6228 134303 28081 297348 -359025 267709 -112373 -78769 11539
11525b23208E61707A47221b5455A5628a11101d5429A73823L5175Q4400m7237G8108
$$ -223208 561707 147221 -25455 15628 -111101 -45429 173823 208998 293398 246161 78108
11513C6971L6398b76313B7153K08086c25856B71012a24129D48919H7795a08806
$$ 36971 73369 -276313 27153 235239 -325856 271012 -124129 448919 87795 -108806
11502B43398q7644m5552l6933b39102C72908D3661M7542J54409e3935f842I801
$$ 243398 155754 110202 73269 -239102 372908 43661 91203 245612 -53935 -6842 9801
11490A30268c6665q7482o9890A86622d2400a2856r8577C373L19597M371n5883
$$ 130268 -36665 -124147 -194037 186622 -42400 -12856 -111433 3373 322970 327341 271458
11479B71458D3775J08950b0953D641K35103F285J28440k7956J00837m8319F1457
$$ 271458 43775 152725 -20953 4641 239744 6285 134725 106769 207606 159287 61457
11467D693J11719M5206m0175d968k4568A67841J47836n3900C6690d24501b2300
$$ 4693 116412 161618 121443 -4968 -29536 167841 315677 261777 36690 -424501 -22300
11455C94696j30596k0711r4766c31009G276K33882a48012B66527q2063J50474
$$ 394696 264100 243389 148623 -331009 7276 241158 -148012 266527 184464 334938
11445C34938b7118d985D11502j97229N9730J4591O0524A34287P2668G2645g0164
$$ 334938 -27118 -4985 411502 214273 274003 288594 349118 134287 206955 72645 -70164
11433d34330A65581o5144O8319e1098F0694J15685g3169B72190o7649g9336j14583
$$ -434330 165581 100437 168756 -51098 60694 176379 -73169 272190 204541 -79336 -193919
11422a93919A59699p7572k1624c45160A59972c27021C15525n6639d9777j24736
$$ -193919 159699 82127 60503 -345160 159972 -327021 315525 258886 -49777 -174513
11412a74513D75572c09384M5754I15J95389a39616c0904k887F0816e1642k63048
$$ -174513 475572 -309384 -263630 915 196304 -139616 -30904 -33791 60816 -51642 -314690
11401c14690A47046h1520A72970a34394H0698b7047A75838c1131B1041J66522
$$ -314690 147046 -81520 172970 -134394 80698 -27047 175838 -31131 21041 187563
11391A87563J03444a09909m4140D3742K0484a5551k13881A93411B4449J41547
$$ 187563 291007 -109909 -154049 43742 64226 -15551 -229432 193411 24449 165996
11381A65996p8667a95977B5281b64031n5286A30918P9782j02607J27358C3127
$$ 165996 87329 -195977 25281 -264031 -319317 130918 210700 108093 235451 33127
11370C08445a87162A70740n9171j9243C947c854j06987K4066J5985k5026j11585
$$ 308445 -187162 170740 111569 92326 3947 -3854 -110841 -86775 -70790 -95816 -207401
11359b07401p8845A5079O1716l0729J03655L4699i5840A55867d3958p5498a9706
$$ -207401 -286246 15079 76795 46066 149721 184420 -95840 155867 -43958 -119456 -19706
11347g2249A34720g3768I4698h4181j17227A49398o3907M7125O975J09910B0174
$$ -72249 134720 -73768 94698 -84181 -201408 149398 85491 132616 139591 249501 20174
11335G3999l5944P7031m7227N8142C0742Q1890g205A3241a44313A20527m9098
$$ 73999 38055 115086 67859 126001 30742 112632 -7205 13241 -144313 120527 71429
11324G1429j6115a46319K9366r9479f3548C2562b94598B92871a07263A62175E1326
$$ 71429 55314 -146319 -116953 -216432 -63548 32562 -294598 292871 -107263 162175 51326
11312B17266d1257r7941p6350F3876j7350L3325b38645J11465H4401D1361c24735
$$ 217266 -41257 -139198 -215548 63876 46526 79851 -238645 -127180 84401 41361 -324735
11300B69801b16488e1918o7410J436a1508j10512j04243C2941c35001A69540a2820
$$ 269801 -216488 -51918 -119328 -117892 -11508 -122020 -226263 32941 -335001 169540 -12820
11288B31303E0568a97594B66331m8599c7236A06760J4334K6652b01806g6486C40688
$$ 231303 50568 -197594 266331 217732 -37236 106760 121094 147746 -201806 -76486 340688
11276f8224m9995j26703F9364b05179B75267a55847k50413Q2699C5369q406c16373
$$ -68224 -118219 -244922 69364 -205179 275267 -155847 -406260 -323561 35369 26963 -316373
11264c75452a01540M4402n7092c0804k07757P9622C2899j4852L8346a03353A3545
$$ -375452 -101540 -57138 -114230 -30804 -238561 -158939 32899 18047 56393 -103353 13545
11252B14091l3049A3500a30535c1271l39593A09714f158j62717A5210i4547j01540
$$ 214091 181042 13500 -130535 -31271 -370864 109714 -6158 -168875 15210 -94547 -196087
11241a96087G6718a88575N3088L7879j05949A35539b91398I1980e0878A89490
$$ -196087 76718 -188575 -135487 -97608 -203557 135539 -291398 91980 -50878 189490
11230A44967b62852a6286p2196j78287K6192F0764G503J80657D3339A3352a57810
$$ 144967 -262852 -16286 -88482 -266769 -240577 60764 7503 188160 43339 13352 -157810
11218i3842j21210l72471A5282K09528a82335J0405j42531g4568K2139F2272b07286
$$ -93842 -215052 -587523 15282 224810 -182335 -171930 -314461 -74568 -52429 62272 -207286
11206g0042E7050a89220i2222j70899A79045b61079A42193m0590C1129d9806k15506
$$ -70042 57050 -189220 -92222 -263121 179045 -261079 142193 101603 31129 -49806 -265312
11195b65312A94197p3833M6055h5758j7176A42895E1862b39275J14016A78090
$$ -265312 194197 120364 166419 -85758 -102934 142895 51862 -239275 -125259 178090
11184B809d56380a71126o3377j7861e9661A4467b46380j7467C49942i6918c0100
$$ 2809 -456380 -171126 -234503 -252364 -59661 14467 -246380 -263847 349942 -96918 -30100
11172a78279G865d87677C1304M7313P5016F3636K74373d20828J12131g7293A23928
$$ -178279 7865 -487677 31304 78617 153633 63636 338009 -420828 -308697 -77293 123928
11160b26711J11887A28167R7402d2959l27445J37206h6956o3199K0617k3234p1472
$$ -226711 -114824 128167 225569 -42959 -370404 -233198 -86956 -150155 -129538 -152772 -224244
11149b24244k6220a9323A79563a36804H5333a48744A42364b78232Q3886Q2288
$$ -224244 -250464 -19323 179563 -136804 85333 -148744 142364 -278232 -194346 -112058
11139a12058A20452C8111a27239l1932j2606e0801o8518b860A26076E2221g943
$$ -112058 120452 38111 -127239 -159171 -171777 -50801 -119319 -2860 126076 52221 -7943
11127a5404A52786e976E1348e5472j56698C45217j15198h2580A60422A9039g7812
$$ -15404 152786 -5976 51348 -55472 -212170 345217 230019 -82580 160422 19039 -77812
11115b5751r8039e9618j6691B20947m2121e3396A5782b18804C12739a34407e8070
$$ -25751 -123790 -59618 -76309 220947 178826 -53396 15782 -218804 312739 -134407 -58070
11103a17470C4006h3057A88691M33182A30770D2916h9901B5907L66478c2166B99289
$$ -117470 34006 -83057 188691 621873 130770 42916 -89901 25907 392385 -32166 299289
11091a057D20669A52031k2215e1221I5734J72209N8676A25331J2177J90172j08942
$$ -1057 420669 152031 129816 -51221 95734 267943 326619 125331 137508 327680 218738
11080B18738q7283D7835K18236a87671A01504K43643d7644A56061L45643j30293
$$ 218738 131455 47835 266071 -187671 101504 345147 -47644 156061 501704 371411
11070C71411Q7903k10765m9440O8639r4258K48999Q4425O8357j50081k9603J63776
$$ 371411 459314 248549 199109 267748 173490 422489 506914 575271 425190 395587 559363
11059E59363j53044M9785M34681j90369j14841j92377L08799J53126m01753L07818
$$ 559363 406319 456104 890785 700416 585575 393198 701997 855123 453370 761188
11049G61188j342J04534k54577K65198K8436J02791k33838L3157C33701M86664
$$ 761188 759846 864380 609803 875001 903437 1006228 772390 805547 333701 820365
11039H20365k93151k6647J08952k8564O1004l5766k8081J43701J18217M0836k11259
$$ 820365 527214 500567 609519 580955 641959 606193 578112 721813 840030 880866 669607
11028F69607j66649l6854N27190l18940P6265O7429r1370O9727j19832j56444
$$ 669607 502958 466104 993294 674354 750619 818048 726678 796405 676573 520129
11018E20129N3639k08616L03445r9887n477k45802O27964B90192K60061L38029
$$ 520129 573768 365152 668597 568710 563233 317431 945395 290192 550253 888282
11008H88282j82721j10968M2637j26915o1378K26932O6563k68598P9837J31919
$$ 888282 705561 594593 637230 510315 448937 675869 742432 473834 553671 685590
10998F85590j12111L3526J03280P9315j48786J86086j70825j70793K85602j41391
$$ 685590 573479 607005 710285 789600 640814 826900 656075 485282 770884 629493
10988F29493K49915m2485j16377L31755k66716M4672m8074L11171j58876L05456
$$ 629493 879408 836923 720546 1052301 785585 830257 782183 1093354 934478 1239934
10978A239934K75877m3132J13627K13908L67858K46291L5637L06136N0868j8034
$$ 1239934 1515811 1472679 1586306 1800214 2168072 2414363 2450000 2756136 2807004 2788970
10968B788970p02250O01402k02580r55414L55403l17799L18562R5202J38087m01401
$$ 2788970 2086720 2688122 2485542 1530128 1885531 1567732 1886294 1981496 2119583 1718182
10958A718182N12782q1980k73132L94019r622k18226j99159m64625j73997Q7780
$$ 1718182 2230964 2148984 1875852 2269871 2260249 2042023 1842864 1378239 1204242 1292022
10948A292022F22375K66787m0682k30962j45762J42097k07257B00827F5998K34219
$$ 1292022 622375 889162 848480 617518 471756 613853 406596 200827 65998 300217
10938C00217K44128j58383J07166B44516C1665P9953J10454a94272A56291J21389
$$ 300217 544345 385962 493128 244516 31665 111618 222072 -194272 156291 277680
10928B77680b05646B60903Q9859j06556r8618K57980A35118l1721O9180J44474
$$ 277680 -205646 260903 350762 244206 145588 403568 135118 103397 172577 317051
10918C17051b04627A41212C1852a52678o2273F1480d60581B17532c53782E8253
$$ 317051 -204627 141212 31852 -152678 -214951 61480 -460581 217532 -353782 58253
10907c6599B45236c052F3433L04942g8958F0565b73509B117K6103f8971J708j8776
$$ -36599 245236 -3052 63433 368375 -78958 60565 -273509 2117 28220 -68971 -67263 -86039
10895h6039n8569A75685C7834a05963F6852C2134i8937B87258C0135a66509A56530
$$ -86039 -144608 175685 37834 -105963 66852 32134 -98937 287258 30135 -166509 156530
10883b72952f4832b0162A56481M4746a87794j67636G0595a38883a871j0999j19749
$$ -272952 -64832 -20162 156481 201227 -187794 -355430 70595 -138883 -1871 -12870 -132619
10872a32619B55880b92380h1565F5394g98j07033a6893B15716h3279k08000e1020
$$ -132619 255880 -292380 -81565 65394 -798 -107831 -16893 215716 -83279 -291279 -51020
10860c0257F5731K3110c0818A99598c2567G4136M9785J21885i0703j94367j12430
$$ -30257 65731 88841 -30818 199598 -32567 74136 123921 245806 -90703 -285070 -397500
10849c97500A9948J12403f5001L7k48271J33159F8845M0854J63148b41435O5254
$$ -397500 19948 132351 -65001 -64964 -313235 -180076 68845 109699 272847 -241435 -176181
10838a76181A50169O3919a04416j98008P7622b3603I9164m7604Q2994n6151c06388
$$ -176181 150169 214088 -104416 -302424 -224802 -23603 99164 51560 134554 78403 -306388
10826b57690B5313g9568l8964A50318a32597e4098A22852d4476A12920m567h5507
$$ -257690 25313 -79568 -118532 150318 -132597 -54098 122852 -44476 112920 108353 -85507
10814F821B390J53123a10946a0426m19337A55590L5977b64915l9488R5695E7502
$$ 6821 2390 155513 -110946 -10426 -429763 155590 191567 -264915 -304403 -208708 57502
10802C78405a70761C8130f23628a29243b1862k06519C34950b37909f0160A73521
$$ 378405 -170761 38130 -623628 -129243 -21862 -228381 334950 -237909 -60160 173521
10791b27796b3425j22631E3054c5707j18676J3775B79142A03482d2995A82603
$$ -227796 -23425 -146056 53054 -35707 -154383 -140608 279142 103482 -42995 182603
10780A73012a56299C51351A72701q0093k447Q9486E5706M6374C5869a36914B66647
$$ 173012 -156299 351351 172701 92608 90161 179647 55706 102080 35869 -136914 266647
10768f0216n6167l724j57896J09802j39499J05011L4682D4404e26976g0499p1196
$$ -60216 -116383 -120107 -278003 -168201 -307700 -202689 -168007 44404 -526976 -70499 -141695
10757a41695A29176e0718G1412a01590j19691a3771k50011A75874F4049R3563
$$ -141695 129176 -50718 71412 -101590 -221281 -13771 -263782 175874 64049 157612
10747A57612i4876j49776k05A31687e08539b7607j27696o1193e0013j10015G9138
$$ 157612 -94876 -244652 -244857 131687 -508539 -27607 -155303 -216496 -50013 -160028 79138
10735f487A69082M633a39950B31843M571e2982J0908C0721J47855J45186g9932
$$ -6487 169082 173715 -139950 231843 236414 -52982 -42074 30721 178576 323762 -79932
10723B96405e3901D8858b66097J9764A24137J5311m8795J40710m4746H6522a12837
$$ 296405 -53901 48858 -266097 -246333 124137 139448 90653 231363 186617 86522 -112837
10711D6963d316j85362d942C5413J33978b44038a8925j9525j9957K4567j39375
$$ 46963 -4316 -189678 -4942 35413 169391 -244038 -18925 -38450 -58407 -33840 -173215
10700a73215A54718c9262A966a72428B47250j22303a11146A6122f940k03617b7550
$$ -173215 154718 -39262 1966 -172428 247250 124947 -111146 16122 -6940 -210557 -27550
10688a70352A59272a00287n9959D914g3921E8242Q1428c4059B05894e9175H5075
$$ -170352 159272 -100287 -160246 4914 -73921 58242 139670 -34059 205894 -59175 85075
10676f5860I0991a19278k73134a58068a0883p8383E6262a61264K4950p918j3991
$$ -65860 90991 -119278 -392412 -158068 -10883 -89266 56262 -161264 -136314 -144232 -158223
10665a58223p120e7235B27664D8004b38868j41914f2211K9288E5279c48393K8929
$$ -158223 -165343 -57235 227664 48004 -238868 -380782 -62211 -32923 55279 -348393 -319464
10654c19464A04749J17458g6346B07827b45599R9188B06646C8661b3203j53535
$$ -319464 104749 222207 -76346 207827 -245599 -146411 206646 38661 -23203 -176738
10644a76738k7664A40822a70451l04857a92772C15596b77721d2319r0622B16338
$$ -176738 -204402 140822 -170451 -475308 -192772 315596 -277721 -42319 -132941 216338
10633c01450h2213q8063B45874q1874i836j46666l37717A39141D0186J23277k3236
$$ -301450 -82213 -170276 245874 164000 -9836 -156502 -494219 139141 40186 163463 140227
10622A40227J98915G2032g7805A30158P0994h2803D531a29746A03100g4079b4274
$$ 140227 339142 72032 -77805 130158 201152 -82803 4531 -129746 103100 -74079 -24274
10610a91676j22932c2352j48330F822P4508c39371B36758b09458Q0922j8176m3351
$$ -191676 -314608 -32352 -180682 6822 81330 -339371 236758 -209458 -128536 -146712 -190063
10599a90063A72951b67212o9395e3351H7099B7310e3650J6909k59566p0378B03845
$$ -190063 172951 -267212 -336607 -53351 87099 27310 -53650 -36741 -296307 -366685 203845
10587b6493j27519A56342G5882J03030f7563j12495q8419J09024J2515a01E3780
$$ -26493 -154012 156342 75882 178912 -67563 -180058 -268477 -159453 -146938 -101 53780
10575a58952q0204a1224n1116A15467a97789G8100L0797b26560C4504b5718j45033
$$ -158952 -239156 -11224 -62340 115467 -197789 78100 108897 -226560 34504 -25718 -170751
10564a70751C50552A65734b75268H1331A1378J48386b47957j75540J96908A37502
$$ -170751 350552 165734 -275268 81331 11378 159764 -247957 -423497 -226589 137502
10553b95142j32750H965a28446B72488a32829p0428N8315b6856k92370J45149
$$ -295142 -427892 8965 -128446 272488 -132829 -203257 -144942 -26856 -319226 -174077
10543a74077F0218b27471J08163J5467A36906d009q6430a1727k41828i2420n3851
$$ -174077 60218 -227471 -119308 -103841 136906 -4009 -90439 -11727 -253555 -92420 -146271
10532a46271c940B51754a8874G2091i6618a6319B8222d3863c713k52838i5501
$$ -146271 -3940 251754 -18874 72091 -96618 -16319 28222 -43863 -3713 -256551 -95501
10520A29500a59124j35662A03574C8720j6469a2231j03422e3459n3854A09712
$$ 129500 -159124 -294786 103574 38720 22251 -12231 -115653 -53459 -107313 109712
10509B05912a73451B49235h7164c3404B45166J79499B9373L8814J398a88920C3369
$$ 205912 -173451 249235 -87164 -33404 245166 424665 29373 68187 69585 -188920 33369
10497b05316B07886A6885L4392J0276a77086a7324j1309B44487a69075A21446
$$ -205316 207886 16885 51277 61553 -177086 -17324 -28633 244487 -169075 121446
10486b1581j52121A45731J04498o7724L29407m684k6153J09883j24849A96814
$$ -21581 -173702 145731 250229 182505 511912 507228 481075 590958 466109 196814
10475C67640j1439g6718A76481A0875L26b5994q9092M4595M31J7500j90912C11325
$$ 367640 356201 -76718 176481 10875 11201 -25994 -115086 -70491 -70060 -52560 -243472 311325
10462f9040o8456e7141B22959p2856b70943e0177F8577b1924k01120Q8666n8378
$$ -69040 -137496 -57141 222959 150103 -270943 -50177 68577 -21924 -223044 -134378 -192756
10451a92756R1869K5041A08269i2021n9018L9649j79213A03016B9848a15256c6427
$$ -192756 -100887 -75846 108269 -92021 -151039 -111390 -290603 103016 29848 -115256 -36427
10439b20109C4954n2Q5234a37307k00599i99q2327k9436J9485m6509N4443j15747
$$ -220109 34954 34902 120136 -137307 -337906 -999 -83326 -112762 -93277 -139786 -85343 -201090
10427b01090j4274j13439a08931j63757a11504A0527a10739d8693K2382o961A58918
$$ -201090 -215364 -328803 -108931 -272688 -111504 10527 -110739 -48693 -26311 -33272 158918
10415A59210f7084j7435l4221j49341c458p2588j8358a8425j73897A68704E6001
$$ 159210 -67084 -84519 -118740 -268081 -3458 -76046 -94404 -18425 -192322 168704 56001
10403B0992a32355B52386J11615g1463K5857j75997P5108D41524A79621a18485
$$ 20992 -132355 252386 364001 -71463 -45606 -221603 -146495 441524 179621 -118485
10392h3361n9037F7095B8283Q52Q8468l308R6408m4469a18547c1326C20670a7720
$$ -83361 -142398 67095 28283 29135 117603 114295 210703 166234 -118547 -31326 320670 -17720
10379a47027O0320C68276q0529k7664H0448J01433C2889J82457n7050h0401D34761
$$ -147027 -86707 368276 287747 260083 80448 181881 32889 215346 158296 -80401 434761
10367A56013K23061J61735j80993L78236A86779Q0692q5168K72719q765B09809
$$ 156013 379074 540809 359816 738052 186779 267471 182303 455022 446257 209809
10356B44848g985l850A97495J47486J5270k5967J66885n9631o8953j22884K01006
$$ 244848 -7985 -11835 197495 344981 360251 334284 501169 441538 372585 249701 450707
10345D50707A16637J56534J18049m707J5347o5104J25189h3042A04079L6190K83767
$$ 450707 116637 273171 391220 386513 401860 336756 461945 -83042 104079 140269 424036
10334D24036p1596C6385O5507e1515F1400J47479k1695a82785k03056A44863a8250
$$ 424036 352440 36385 101892 -51515 61400 208879 187184 -182785 -385841 144863 -18250
10322B07171a19123C72418K70367B23984M1834F7947c4499F6312J78577C4202
$$ 207171 -119123 372418 642785 223984 265818 67947 -34499 66312 244889 34202
10311B62656O7880d2217A06166M7659n0229h43j10954j01670B15620e1603i757
$$ 262656 330536 -42217 106166 153825 103596 -843 -111797 -213467 215620 -51603 -9757
10299D27989a24818C71758j49373a34898A81295c50386D7393b70211d6747j55805
$$ 427989 -124818 371758 222385 -134898 181295 -350386 47393 -270211 -46747 -202552
10289b02552A66558a76110j03347C00137l2969C4016a36156O6771H2827a10238
$$ -202552 166558 -176110 -279457 300137 267168 34016 -136156 -69385 82827 -110238
10278b91409J28972j36465E7688N6043b00164j2380B2376c10813M0441j04001
$$ -291409 -162437 -298902 57688 113731 -200164 -212544 22376 -310813 -270372 -374373
10268c74373F2235a34530E6131J71271e2192K5624B05549q0601L93904j37014
$$ -374373 62235 -134530 56131 227402 -52192 -26568 205549 124948 518852 381838
10258C81838j48457K97041j43288j6630j45984L7905e86308a539A7243L52359
$$ 381838 233381 530422 387134 370504 224520 262425 -586308 -1539 17243 369602
10248C69602f5059a6845k41721J5331g785b378n6959F4421d5120r2898A53042
$$ 369602 -65059 -16845 -258566 -243235 -7785 -2378 -59337 64421 -45120 -138018 153042
10236C97721A94091q9515J7379h7610B24620J86865b83147A32125b03073R798
$$ 397721 194091 104576 121955 -87610 224620 411485 -283147 132125 -203073 -193275
10226a93275L5283j43291J48367j82208a40210f9030J0159o4982j7975B30532
$$ -193275 -157992 -301283 -152916 -335124 -140210 -69030 -58871 -123853 -141828 230532
10215I9001a49297r1374e5497r2738a5730k19305Q9819j98777g501G8865a29354
$$ 99001 -149297 -240671 -55497 -148235 -15730 -235035 -145216 -343993 -7501 78865 -129354
10203a04003M2871k35230B6381a95541G9342e3136A08868a28850n9255j90519
$$ -104003 -61132 -296362 26381 -195541 79342 -53136 108868 -128850 -188105 -378624
10193c78624E2083e54406g7364j56175A39164J24961a00726C6235c05019E5112
$$ -378624 52083 -554406 -77364 -233539 139164 264125 -100726 36235 -305019 55112
10182d3492p1281o4290g4956l0811l9684I7146m8483b69401L5229O3497E4504
$$ -43492 -114773 -179063 -74956 -105767 -145451 97146 48663 -269401 -234172 -170675 54504
10170F0164P7376a40942A29912b7503j11264A56566a20969c9423A04828i3780
$$ 60164 137540 -140942 129912 -27503 -138767 156566 -120969 -39423 104828 -93780
10159c24332B9995c66009a68401C4151J29245o9561J72102c59918a19709F4948
$$ -324332 29995 -366009 -168401 34151 163396 93835 265937 -359918 -119709 64948
10148b45180C1171M40326A61562j595b2852k56977a7827G6135a66244E01848a46198
$$ -245180 31171 471497 161562 159967 -22852 -279829 -17827 76135 -166244 501848 -146198
10136g2640j4471A94503d6923A97842N8310a03716H8222c7125k72480A41600b22701
$$ -72640 -87111 194503 -46923 197842 256152 -103716 88222 -37125 -309605 141600 -222701
10124a95244Q2170k29947C45943b30648A25678A7655i3997B32531c05604a41267
$$ -195244 -113074 -343021 345943 -230648 125678 17655 -93997 232531 -305604 -141267
10113a42943C0099b6196C341a11623F4974b29909h1540B62316G7842b07827a7201
$$ -142943 30099 -26196 3341 -111623 64974 -229909 -81540 262316 77842 -207827 -17201
10101a22744J3112l05462e436m80792D9834K1136a41205C7266d3975l33630e6973
$$ -122744 -109632 -415094 -5436 -486228 49834 70970 -141205 37266 -43975 -377605 -56973
10089A04054c03472B11627b02722O1368o848j2360M0233B74685b08411i7342j98342
$$ 104054 -303472 211627 -202722 -141354 -148202 -160562 -120329 274685 -208411 -97342 -295684
10078b95684A54975a16127q9062n5301A73294f1759j36304i3660l3895A47399
$$ -295684 154975 -116127 -205189 -260490 173294 -61759 -198063 -93660 -127555 147399
10067A4246J57503b62797a25881J2168i692A07483N8421B2495c0266p3225j87347
$$ 14246 171749 -262797 -125881 -113713 -9692 107483 165904 22495 -30266 -103491 -290838
10056b90838j82095b7023j20557B147h4386B0638Q5800a74972H889a6993l62278
$$ -290838 -472933 -27023 -147580 2147 -84386 20638 106438 -174972 8889 -16993 -379271
10045c79271E784L9713c91512A65502i1243k12618J40340C1283b63198a16655
$$ -379271 5784 45497 -391512 165502 -91243 -303861 -163521 31283 -263198 -116655
10034a52732n872K0511B84817A0209Q6414R2426b39904k22828G1081a23674A5977
$$ -152732 -158604 -138093 284817 10209 96623 189049 -239904 -462732 71081 -123674 15977
10022B97959a6475B28691d3552k00012M5584f0082k28691Q7175h9946B29955h7350
$$ 297959 -16475 228691 -43552 -243564 -197980 -60082 -288773 -201598 -89946 229955 -87350
10010G9631h8014J1595k23875J41371e7609I3897J25073b30893A46063a97714
$$ 79631 -88014 -76419 -300294 -158923 -57609 93897 218970 -230893 146063 -197714
9999A05248m0951c70363C7388g0780I3740b03008Q5399A77725M8799n1941E6046
$$ 105248 64297 -370363 37388 -70780 93740 -203008 -117609 177725 226524 174583 56046
9987I7066a2305j3107j73648A63562d09547h7985I9281a32739O2274l4766j13115
$$ 97066 -12305 -25412 -199060 163562 -409547 -87985 99281 -132739 -70465 -105231 -218346
9976b18346A0411b76932k45324J29979a5013j72072b7834k15952J06893N987G8269
$$ -218346 10411 -276932 -522256 -392277 -15013 -187085 -27834 -243786 -136893 -130906 78269
9964g6258K1929n5765k04113e2609i465k3797A11599a12043K2422A5527J06976
$$ -76258 -54329 -110094 -314207 -52609 -9465 -33262 111599 -112043 -89621 15527 122503
9953A22503L4309c0459k82479a20460l08328a46456j23258J05877M6262m0763
$$ 122503 156812 -30459 -312938 -120460 -428788 -146456 -269714 -163837 -117575 -158338
9943a58338G0973N8936a48907C4120a10275M1592L62k03802a1983B3429P2502
$$ -158338 70973 129909 -148907 34120 -110275 -68683 -68321 -272123 -11983 23429 95931
9932I5931c13563a33329C484b7844l15295A98998b48551G6686d8141I6539l6364
$$ 95931 -313563 -133329 3484 -27844 -343139 198998 -248551 76686 -48141 96539 60175
9921F0175J03875M0793j7231l3360b48813B27114o7954g7867j07306r1084A77851
$$ 60175 164050 204843 187612 154252 -248813 227114 159160 -77867 -185173 -276257 177851
9909f0819A4934a28990A5720h0115k49178f5066B7364d6935A6765b06496B33648
$$ -60819 14934 -128990 15720 -80115 -329293 -65066 27364 -46935 16765 -206496 233648
9897a45606A4055c77641B01609p5778a60939L1484j61220Q4087B8864b53783C5871
$$ -145606 14055 -377641 201609 125831 -160939 -129455 -290675 -206588 28864 -253783 35871
9885c27712P104D56574b05088g7277j29748P7156B9057b48680D4816M0207j3030
$$ -327712 -320608 456574 -205088 -77277 -207025 -129869 29057 -248680 44816 85023 71993
9874G1993l5349b2799k87292A09043N328N6022d99756a42655a2209j5317m8446
$$ 71993 36644 -22799 -310091 109043 114371 170393 -499756 -142655 -12209 -27526 -75972
9863g5972n1888j78471B1564K6560P9198d7321J716j42690g0533A11235l2882
$$ -75972 -127860 -306331 21564 48124 127322 -47321 -45605 -188295 -70533 111235 78353
9852G8353b40409A84044A6004K66411b8108j61790b6268k69434f3396l9657A93463
$$ 78353 -240409 184044 16004 282415 -28108 -189898 -26268 -295702 -63396 -103053 193463
9840a40234e0298j0543C24887I4255a00144B38853J33633A9997d12708I5790l2233
$$ -140234 -50298 -60841 324887 94255 -100144 238853 372486 19997 -412708 95790 63557
9829F3557p529J18842a82519c9436j02313B88687h7356B49500b59437A03141a56886
$$ 63557 56028 174870 -182519 -39436 -141749 288687 -87356 249500 -259437 103141 -156886
9817a48139m6896L0335J5349L7251J9432j75085L3399r9443g2306l9705j59225
$$ -148139 -195035 -164700 -149351 -112100 -92668 -267753 -234354 -333797 -72306 -112011 -271236
9806b71236L8521B41N2116d01730a05542I9850a19500L0513Q172C1735K7429J3854
$$ -271236 -232715 241 52357 -401730 -105542 99850 -119500 -88987 -80815 31735 59164 73018
9794G3018a5888B54651A8388b52359c5015I1470a69407j05373A19192a27968M8514
$$ 73018 -15888 254651 18388 -252359 -35015 91470 -169407 -274780 119192 -127968 -79454
9783g9454j32869A28828a56766b5988k43920O0907A15417j3606L1886P2134d13032
$$ -79454 -212323 128828 -156766 -25988 -269908 -209001 115417 101811 133697 205831 -413032
9771e7407q9225e3320B65699g0169j17994E996c62463A30130i8248E2354L6042
$$ -57407 -146632 -53320 265699 -70169 -188163 5996 -362463 130130 -98248 52354 88396
9760H8396d78742F9287O3984D3284a14703M2844E874J42616c46318n1622d0177
$$ 88396 -478742 69287 133271 43284 -114703 -71859 5874 148490 -346318 -397940 -40177
9748A3448a69226B45547H2340J00345d98428A3860a28172A6897f6061o1488f0488
$$ 13448 -169226 245547 82340 182685 -498428 13860 -128172 16897 -66061 -127549 -60488
9736C317K9828a43954D08983A04394b0688j23106J4445m4876j03009h8685j56463
$$ 3317 33145 -143954 408983 104394 -20688 -143794 -129349 -174225 -277234 -88685 -245148
9725b45148J07414a5456D0544b91101H5319d05751a45338j42997a08738d3098
$$ -245148 -137734 -15456 40544 -291101 85319 -405751 -145338 -288335 -108738 -43098
9714H0501c27515g6315j93349j04549C12977I297J17500f1167D1304P3150b29000
$$ 80501 -327515 -76315 -269664 -374213 312977 9297 126797 -61167 41304 114454 -229000
9702a36881H4752b16017d0999a4464C0992J53900l9938a02975C39808a04483n2392
$$ -136881 84752 -216017 -40999 -14464 30992 184892 144954 -102975 339808 -104483 -156875
9691a56875C4168b2928E1023K3125J86463a43928E0756f0511k89350E7910a37919
$$ -156875 34168 -22928 51023 74148 260611 -143928 50756 -60511 -349861 57910 -137919
9679d8416H3121K7618B8379e8830k26495A73089d290q8325B08033i4055j85739
$$ -48416 83121 110739 28379 -58830 -285325 173089 -4290 -92615 208033 -94055 -279794
9668b79794I729e0392j34484E3193j0653L95890A09560a4864G4627b6946j38470
$$ -279794 9729 -50392 -184876 53193 42540 438430 109560 -14864 74627 -26946 -165416
9657a65416K5397k574A27619O0790J05475H0260B0479a76553d7753E165b08806
$$ -165416 -140019 -142593 127619 188409 293884 80260 20479 -176553 -47753 5165 -208806
9645a83714F016h2565b569k6000A19248i8030r7341A233J16301b96425e8621j73152
$$ -183714 6016 -82565 -2569 -28569 119248 -98030 -195371 1233 117534 -296425 -58621 -231773
9633b31773J01954A47509C5667b06326H3891B0711c98366J2462a22557c4848j11652
$$ -231773 -129819 147509 35667 -206326 83891 20711 -398366 -385904 -122557 -34848 -146500
9622a46500A54532o3676J93229A6120a33042k97021B0692Q2364a24610C10700
$$ -146500 154532 90856 284085 16120 -133042 -430063 20692 103056 -124610 310700
9611A98091J8645i7855n5157m1816A8298m750h2696B71526b25574B0518i9552
$$ 198091 216736 -97855 -153012 -194828 18298 13548 -82696 271526 -225574 20518 -99552
9599c9306p3753m0783C9320J88430n7220a37962a374D8802b52077B67608c41691
$$ -39306 -113059 -153842 39320 227750 170530 -137962 -1374 48802 -252077 267608 -341691
9587F0536a23808m5821M8158n5339G742M6227i6929C5091a3827H3974a06580A1749
$$ 60536 -123808 -169629 -121471 -176810 7742 53969 -96929 35091 -13827 83974 -106580 11749
9574b47596j93781j71071b82155N3671o4351b9935F0319a62278j95781H1586i8675
$$ -247596 -441377 -612448 -282155 -228484 -292835 -29935 60319 -162278 -358059 81586 -98675
9562a638j84230g0221q2714G5219d1644j29461A53455m0229b31637A19462P1b21300
$$ -1638 -185868 -70221 -152935 75219 -41644 -171105 153455 113226 -231637 119462 119533 -221300
9549h7870O820o6585a7628A87267H2116b2983j43493j7564k7610C1323a93084
$$ -87870 -81050 -147635 -17628 187267 82116 -22983 -166476 -184040 -211650 31323 -193084
9537c21951a8414A6097K73746a59823N8139k31606b6142j91777O3743K0240A90874
$$ -321951 -18414 16097 289843 -159823 -101684 -333290 -26142 -217919 -154176 -133936 190874
9525a64798B20026B5685L706a0154j02864a1466B48933a84580h7958l9982q0599
$$ -164798 220026 25685 29391 -10154 -113018 -11466 248933 -184580 -87958 -127940 -208539
9514b08539p0372B9236K35634g5624B5005b8684q2000I2458m2604a05095j60616
$$ -208539 -278911 29236 264870 -75624 25005 -28684 -110684 92458 49854 -105095 -265711
9503b65711N5506A0171c65479a18977o7094D1448c54996A03652b81324g8532A62235
$$ -265711 -210205 10171 -365479 -118977 -186071 41448 -354996 103652 -281324 -78532 162235
9491a59012K6626k2375D4973a5993j98844i0130A02121f4109p898A40251c60635
$$ -159012 -132386 -154761 44973 -15993 -214837 -90130 102121 -64109 -72007 140251 -360635
9479a18664j75380A15011G365K09485F3401a67023g117A10741e5221k05373j0679
$$ -118664 -294044 115011 7365 216850 63401 -167023 -7117 110741 -55221 -260594 -271273
9468b71273A5295a46922b2283j09056B78775a01497p6503J4443j71851J07199
$$ -271273 15295 -146922 -22283 -131339 278775 -101497 -178000 -163557 -335408 -228209
9458b28209H3352b54147D5006d9799B78567c62550J08666O6522A10393a80472
$$ -228209 83352 -254147 45006 -49799 278567 -362550 -253884 -187362 110393 -180472
9447d02469C40669i2488A96620b96942N3041J8781i8474N926j4165F1153a20875
$$ -402469 340669 -92488 196620 -296942 -243901 -225120 -98474 -92548 -106713 61153 -120875
9435I2733C7324c6835n4640j6852k3718j17288C8224f8794j31805l0783c3995
$$ 92733 37324 -36835 -91475 -108327 -132045 -249333 38224 -68794 -200599 -231382 -33995
9423c08127a10058M581j72662C5961b40436B1974a1562m74N845A59016b05326
$$ -308127 -110058 -105477 -278139 35961 -240436 21974 -11562 -12036 -6191 159016 -205326
9411g7708E9545A2081c1790D2324a55147j16009f9522D06416a28392B39938b00430
$$ -77708 59545 12081 -31790 42324 -155147 -271156 -69522 406416 -128392 239938 -200430
9399a83763p2023i8561j93954A19971A5976f666k13785d2293o6159n0338E2861
$$ -183763 -255786 -98561 -292515 119971 15976 -6666 -220451 -42293 -108452 -158790 52861
9387c52555a4721A39639k9267e6260j37963N4816L2646A3014L5620K23899B1421
$$ -352555 -14721 139639 110372 -56260 -194223 -139407 -106761 13014 48634 272533 21421
9375a58417N7724j2670k285B18993f2960H978J54083E127a01085K7004j64181
$$ -158417 -100693 -113363 -115648 218993 -62960 8978 163061 5127 -101085 -74081 -238262
9364b38262i1503o2337f0125A07521c8509k37764B37087D8217a65774B01119d0002
$$ -238262 -91503 -153840 -60125 107521 -38509 -276273 237087 48217 -165774 201119 -40002
9352A08169C4980R0987i5304j88598M5794G1457a39267E3019e48315a71091d3613
$$ 108169 34980 125967 -95304 -283902 -238108 71457 -139267 53019 -548315 -171091 -43613
9340C2081a30632p635A65402j8573i472j77907g5369n1333b1275L873j81559l13634
$$ 32081 -130632 -138267 165402 146829 -9472 -187379 -75369 -126702 -21275 -17402 -198961 -512595
9328e12595b8417C0551P2590a21753A73987k7143c60040B13322H3072a64217N9147
$$ -512595 -28417 30551 103141 -121753 173987 146844 -360040 213322 83072 -164217 -105070
9317a05070m6791j26078M2028P2798E5825K71633a27403A28406D5227J8196a83596
$$ -105070 -151861 -277939 -235911 -163113 55825 327458 -127403 128406 45227 63423 -183596
9305F6857k2130B1717J42913a22627C5721a51813N916M4231l753j54540A83435
$$ 66857 44727 21717 164630 -122627 35721 -151813 -145897 -101666 -105419 -259959 183435
9293e874H2193a66913F405N4250e3851b208k6383j07679D3605J17679a65830B88117
$$ -5874 82193 -166913 6405 60655 -53851 -2208 -28591 -136270 43605 161284 -165830 288117
9280C2529K60939h9959A37228C9289a51368K0961A00143b56802J09394b0068B35824
$$ 32529 293468 -89959 137228 39289 -151368 -130407 100143 -256802 -147408 -20068 235824
9268a6514k2690A32933a3374l9077j23241k8070j19510A1170a71932C23944a95655
$$ -16514 -39204 132933 -13374 -52451 -175692 -203762 -323272 11170 -171932 323944 -195655
9256c55615A32032m1908g6293j76109i5003c3946j39027j54654P1272Q8990C0805
$$ -355615 132032 90124 -76293 -252402 -95003 -33946 -172973 -327627 -256355 -167365 30805
9244f3938b196k72082h9047I6645c54203a09357E6322b42156q6260a59531A05277
$$ -63938 -2196 -274278 -89047 96645 -354203 -109357 56322 -242156 -328416 -159531 105277
9232c91969a9374F3328c72409b6658j23751C1227d075A27767j5919B5363c4036
$$ -391969 -19374 63328 -372409 -26658 -150409 31227 -4075 127767 111848 25363 -34036
9220e3366k11115A77323c28225d113k8482C0389Q6998a02102M1968A78688a68694
$$ -53366 -264481 177323 -328225 -4113 -32595 30389 117387 -102102 -60134 178688 -168694
9208E0689b12337p0925j61358g1246j03223j62207F6210b66505a10041p9208d5939
$$ 50689 -212337 -283262 -444620 -71246 -174469 -336676 66210 -266505 -110041 -189249 -45939
9196E5747b68859e4462p1618n1067r3779P8003A06698c10166B32464A9708a10348
$$ 55747 -268859 -54462 -126080 -177147 -270926 -192923 106698 -310166 232464 19708 -110348
9184a10064l8055j2731a7791O832l3986Q993k08854B3088c79930f8147l93803
$$ -110064 -148119 -160850 -17791 -10959 -44945 -35952 -244806 23088 -379930 -68147 -461950
9173d61950H2803a06977C89048b35807C9426g3653H8294b44871g2274q9457L5857
$$ -461950 82803 -106977 389048 -235807 39426 -73653 88294 -244871 -72274 -161731 -125874
9162a25874B57254a55677P112B55548a29850a6380p8961j8599A49437b89684B22763
$$ -125874 257254 -155677 -148565 255548 -129850 -16380 -95341 -113940 149437 -289684 222763
9150b68229i734q9993j8270k41841N5610G6255a77107h454G6695J12113A395a84760
$$ -268229 -9734 -99727 -117997 -359838 -304228 76255 -177107 -8454 76695 188808 1395 -184760
9137A26721n1046J3974a14207j43548f2402H54b36388E8267J47627d3723a2174
$$ 126721 75675 89649 -114207 -257755 -62402 854 -236388 58267 205894 -43723 -12174
9125A02342h8237I7061c0747F7857a75991A75616d9033F1996h5798L3860D9278
$$ 102342 -88237 97061 -30747 67857 -175991 175616 -49033 61996 -85798 -51938 49278
9113A37962A0372J07457J45405L1018F750b96379k91f8468k57334B04535b44792
$$ 137962 10372 117829 263234 294252 6750 -296379 -296670 -68468 -325802 204535 -244792
9101d5201G2539a36580h473j06906k54161J00537a73E4766b75804B594b11582
$$ -45201 72539 -136580 -8473 -115379 -369540 -269003 -173 54766 -275804 2594 -211582
9089F259K60588G0864e144j2949F8495k4076J6304a00680F1001h3015j62928j8922
$$ 6259 266847 70864 -5144 -18093 68495 44419 60723 -100680 61001 -83015 -245943 -264865
9077b64865f9632o3924m7406B3172R513Q9048h2106c4353p6609p2708A49115a45091
$$ -264865 -69632 -133556 -180962 23172 32685 121733 -82106 -34353 -110962 -183670 149115 -145091
9064a24919F9840g3742j75423C5426b29305D2985a37297B61309b2881G2910J54944
$$ -124919 69840 -73742 -249165 35426 -229305 42985 -137297 261309 -22881 72910 227854
9053B27854i3718j40130J07449O213c7954k4928C06574G1707n017K38264h2283
$$ 227854 -93718 -233848 -126399 -120186 -37954 -62882 306574 71707 66690 304954 -82283
9041I1996A0165h0770k377i594n4328m3007k34328B13873a81961O0885B34005
$$ 91996 10165 -80770 -83147 -9594 -63922 -106929 -341257 213873 -181961 -121076 234005
9029A89773k3841a30460j212K8193B97127b56463d9767a9525n13656K43386d9287
$$ 189773 165932 -130460 -131672 -103479 297127 -256463 -49767 -19525 -533181 -289795 -49287
9017f0569j20372I0642g4930J482a638l26231A33373b6663C11324j47747d7028
$$ -60569 -180941 90642 -74930 -73448 -1638 -327869 133373 -26663 311324 163577 -47028
9005a40960n1485R0152j8571l87506a00439l1666f0888p0345A32405b01633j15261
$$ -140960 -192445 -102293 -120864 -508370 -100439 -132105 -60888 -131233 132405 -201633 -316894
8994c16894O8098g0336F8703c00268D6904L4665g1521A7095a2281B328R820d5868
$$ -316894 -248796 -70336 68703 -300268 46904 81569 -71521 17095 -12281 2328 12148 -45868
8981E1690J52273l0222b42963a2701r2652o6591j9416f0762a5286B09251r4423
$$ 51690 203963 173741 -242963 -12701 -105353 -171944 -191360 -60762 -15286 209251 114828
8970A14828L5563h9083C14929a779j81119e0981j52889j63421B00177a85028P2061
$$ 114828 150391 -89083 314929 -1779 -182898 -50981 -203870 -367291 200177 -185028 -112967
8959a12967J1657n6241K2901N4982A05525c9473l93625A6361P8261b42461f0786
$$ -112967 -101310 -157551 -134650 -79668 105525 -39473 -433098 16361 94622 -242461 -60786
8947a27632H5604N971a78829j74517N7813j71891B2276f6318B55131r5300b63241
$$ -127632 85604 91575 -178829 -353346 -295533 -467424 22276 -66318 255131 159831 -263241
8935b4266C13181N9423A5807P2117a55015f6723B1150L06546J26306k05210R9323
$$ -24266 313181 372604 15807 87924 -155015 -66723 21150 327696 454002 248792 348115
8924C48115N68990J551254N684565M424951C754936I41799m52666p7806j5063
$$ 348115 917105 2468359 8152924 12577875 3754936 941799 489133 411327 396264
8915C96264m3010E1213a28911F1893b56827D37084j21013K01787A45934b67862
$$ 396264 353254 51213 -128911 61893 -256827 437084 316071 517858 145934 -267862
8904B18119A0442d3708H62a84330A41472b083j09919e5118p090r0042B31486B3485
$$ 218119 10442 -43708 862 -184330 141472 -2083 -112002 -55118 -62208 -152250 231486 23485
8891A9887b3035j1619A03666b91450a1371j44698A27815a91112A24406b8735F4600
$$ 19887 -23035 -34654 103666 -291450 -11371 -156069 127815 -191112 124406 -28735 64600
8879C94044i7562D18510a39123j0615E5403l946M101b0713A1853h6051E92792
$$ 394044 -97562 418510 -139123 -149738 55403 51457 55558 -20713 11853 -86051 592792
8867b4197A2737J15017b9571j86340P7452A85473K648e6839F7552M4866d7915
$$ -24197 12737 127754 -29571 -215911 -138459 185473 188121 -56839 67552 112418 -47915
8855c8952k42066F5656J13337J6656L4602c42886J21719b1678k29007h9254k92526
$$ -38952 -281018 65656 178993 195649 230251 -342886 -221167 -21678 -250685 -89254 -381780
$$ [...]
##END NTUPLES=NMR SPECTRUM
##END=
