##TITLE=AC1628_CENAH_8450567_f5dI6OPRq1
##JCAMPDX= 6.0         $$ Bruker NMR JCAMP-DX V2.0
##DATA TYPE= NMR SPECTRUM
##DATA CLASS= NTUPLES
##ORIGIN= BRUKER
##OWNER= Administrator
$$ 1.72 TOPSPIN		Version 2.1
$$ 2014-02-18 15:32:27.126 -0800  Administrator@X
$$ Compression mode = diff/dup
##.OBSERVE FREQUENCY= 400.02188249412
##.OBSERVE NUCLEUS= ^1H
##.ACQUISITION MODE= SIMULTANEOUS (DQD)
##.ACQUISITION SCHEME= undefined
##.AVERAGES= 64
##.DIGITISER RES= 22
##SPECTROMETER/DATA SYSTEM= spect
##.PULSE SEQUENCE= noesygpps1d.comp
##.SOLVENT NAME= COFFEE_meoh
##.SHIFT REFERENCE= INTERNAL, COFFEE_meoh, 1, 14.96107
##AUDIT TRAIL= $$ (NUMBER, WHEN, WHO, WHERE, PROCESS, VERSION, WHAT)
$$ ##TITLE= Audit trail, TOPSPIN		Version 2.1
$$ ##JCAMPDX= 5.01
$$ ##ORIGIN= Bruker BioSpin GmbH
$$ ##OWNER= Administrator
$$ $$ E:\/data/COFFEE/nmr/AC1628_CENAH_8450567_f5dI6OPRq1/12/pdata/1/auditp.txt
$$ ##AUDIT TRAIL=  $$ (NUMBER, WHEN, WHO, WHERE, PROCESS, VERSION, WHAT)
(   1,<2014-02-18 15:32:22.345 -0800>,<Administrator>,<X>,<go>,<TOPSPIN 2.1>,
      <created by zg
	started at 2014-02-18 15:20:53.093 -0800,
	POWCHK enabled, PULCHK disabled,
       configuration hash MD5:
       C8 4E 4E 5D D3 5C D8 9E 9F 52 82 E0 59 8A DE 15
       data hash MD5: 64K
       B5 78 F6 2A F9 22 87 B3 00 13 B2 64 C1 86 F1 45>)
(   2,<2014-02-18 15:32:25.267 -0800>,<Administrator>,<X>,<proc1d>,<TOPSPIN 2.1>,
      <Start of raw data processing
       efp LB = 0.3 FT_mod = 6 PKNL = 1 PHC0 = 0 PHC1 = 0 SI = 128K 
       data hash MD5: 128K
       65 3E 90 A9 3A D6 11 03 89 21 A5 3F CA 2E 97 B9>)
(   3,<2014-02-18 15:32:26.204 -0800>,<Administrator>,<X>,<proc1d>,<TOPSPIN 2.1>,
      <pk PHC0 = -81.09009 PHC1 = 0 
       data hash MD5: 128K
       5F F7 36 22 A0 0B 98 55 84 41 93 8E E2 9D 7C F8>)
(   4,<2014-02-18 15:32:26.579 -0800>,<Administrator>,<X>,<proc1d>,<TOPSPIN 2.1>,
      <abs ABSG = 1 
       data hash MD5: 128K
       E4 98 37 B6 65 6B B9 05 78 9B 8A 37 A2 A2 DB 52>)
(   5,<2014-02-18 15:32:26.689 -0800>,<Administrator>,<X>,<proc1d>,<TOPSPIN 2.1>,
      <abs ABSG = 2 
       data hash MD5: 128K
       52 6B 88 4C 8B 97 9E F4 59 43 76 14 A2 EF 87 86>)
(   6,<2014-02-18 15:32:26.782 -0800>,<Administrator>,<X>,<proc1d>,<TOPSPIN 2.1>,
      <abs ABSG = 3 
       data hash MD5: 128K
       1D 4D 81 C8 56 90 98 51 4B 2A 9C E2 9F 6E CE 9A>)
(   7,<2014-02-18 15:32:26.860 -0800>,<Administrator>,<X>,<proc1d>,<TOPSPIN 2.1>,
      <abs ABSG = 4 
       data hash MD5: 128K
       67 C3 D5 6E C8 CD D9 74 47 02 E1 F1 D5 8E A3 1B>)
(   8,<2014-02-18 15:32:26.923 -0800>,<Administrator>,<X>,<proc1d>,<TOPSPIN 2.1>,
      <abs ABSG = 5 
       data hash MD5: 128K
       3E 2F 20 B7 7B 39 B6 58 58 AD A2 5F 9D C5 93 0B>)
$$ ##END=
$$ 
$$ $$ hash MD5
$$ $$ 6C 0A 39 D6 4A 2E 35 C2 59 83 08 9E A8 1C 97 D7
##$RELAX= 
##$RELAX= 
##$RELAX= 
##$RELAX= 
##$RELAX= 
##$RELAX= 
##$RELAX= 
##$RELAX= 
$$ Bruker specific parameters
$$ --------------------------
##$DU= <E:\>
##$EXPNO= 12
$$ [...]
##$TP07= 0
##$TPNAME0= <>
##$TPNAME1= <>
##$TPNAME2= <>
##$TPNAME3= <>
##$TPNAME4= <>
##$TPNAME5= <>
##$TPNAME6= <>
##$TPNAME7= <>
##$TPOAL= (0..7)
0.5 0.5 0.5 0.5 0.5 0.5 0.5 0.5
##$TPOFFS= (0..7)
0 0 0 0 0 0 0 0
##$TUNHIN= 0
##$TUNHOUT= 0
##$TUNXOUT= 0
##$USERA1= <user>
##$USERA2= <user>
##$USERA3= <user>
##$USERA4= <user>
##$USERA5= <user>
##$V9= 5
##$VALIST= <valist>
##$VCLIST= <CCCCCCCCCCCCCCC>
##$VD= 0
##$VDLIST= <DDDDDDDDDDDDDDD>
##$VPLIST= <PPPPPPPPPPPPPPP>
##$VTLIST= <TTTTTTTTTTTTTTT>
##$WBST= 2048
##$WBSW= 25
##$XGAIN= (0..3)
0 0 0 0
##$XL= 0
##$YL= 0
##$YMAX_a= 6380377
##$YMIN_a= -14029474
##$ZGOPTNS= <>
##$ZL1= 120
##$ZL2= 120
##$ZL3= 120
##$ZL4= 120
##$ABSF1= 14.96107
##$ABSF2= -5.597112
##$ABSG= 5
##$ABSL= 3
##$ALPHA= 0
##$AQORDER= 0
##$ASSFAC= 0
##$ASSFACI= 0
##$ASSFACX= 0
##$ASSWID= 0
##$AUNMP= <proc_prof1d_extract.lims>
##$AXLEFT= 0
##$AXNAME= <>
##$AXNUC= <1H>
##$AXRIGHT= 0
##$AXTYPE= 0
##$AXUNIT= <>
##$AZFE= 0.1
##$AZFW= 0.1
##$BCFW= 0
##$BC_mod= 0
##$BYTORDP= 0
##$COROFFS= 0
##$CY= 15
##$DATMOD= 1
##$DC= 0
##$DFILT= <>
##$DTYPP= 0
##$F1P= 0
##$F2P= 0
##$FCOR= 0.5
##$FTSIZE= 131072
##$FT_mod= 6
##$GAMMA= 0
##$GB= 0
##$INTBC= 1
##$INTSCL= 1
##$ISEN= 128
##$LB= 0.3
##$LEV0= 0
##$LPBIN= 0
##$MAXI= 10000
##$MC2= 0
##$MEAN= 0
##$ME_mod= 0
##$MI= 0
##$NCOEF= 0
##$NC_proc= -2
##$NLEV= 6
##$NOISF1= 0
##$NOISF2= 0
##$NSP= 0
##$NTH_PI= 0
##$NZP= 0
##$OFFSET= 14.96107
##$PC= 1
##$PHC0= -81.09009
##$PHC1= 0
##$PH_mod= 1
##$PKNL= yes
##$PPARMOD= 0
##$PPDIAG= 0
##$PPIPTYP= 0
##$PPMPNUM= 2147483647
##$PPRESOL= 1
##$PSCAL= 4
##$PSIGN= 0
##$PYNMP= <proc.py>
##$REVERSE= no
##$SF= 400.020009607324
##$SI= 131072
##$SIGF1= 0
##$SIGF2= 0
##$SINO= 400
##$SIOLD= 131072
##$SPECTYP= <>
##$SREGLST= <1H.CDCl3>
##$SSB= 0
##$STSI= 131072
##$STSR= 0
##$SW_p= 8223.68421052631
##$SYMM= 0
##$S_DEV= 0
##$TDeff= 65536
##$TDoff= 0
##$TI= <>
##$TILT= no
##$TM1= 0
##$TM2= 0
##$TOPLEV= 0
##$USERP1= <user>
##$USERP2= <user>
##$USERP3= <user>
##$USERP4= <user>
##$USERP5= <user>
##$WDW= 1
##$XDIM= 131072
##$YMAX_p= 450460365
##$YMIN_p= -12560
##$CURPLOT= <Network HP LaserJet P1505>
##$CURPRIN= <$Network HP LaserJet P1505>
##$DFORMAT= <normdp>
##$LAYOUT= <+/1D_H.xwp>
##$LFORMAT= <normlp>
##$PFORMAT= <normpl>
##$SURQMSG= 1
$$ End of Bruker specific parameters
$$ ---------------------------------
##NTUPLES= NMR SPECTRUM
##VAR_NAME=  FREQUENCY,     SPECTRUM/REAL,   SPECTRUM/IMAG
##SYMBOL=    X,             R,               I
##VAR_TYPE=  INDEPENDENT,   DEPENDENT,       DEPENDENT
##VAR_FORM=  AFFN,          ASDF,            ASDF
##VAR_DIM=   131072,        131072,          131072
##UNITS=     HZ,            ARBITRARY UNITS, ARBITRARY UNITS
##FACTOR=    0.0627417313425164, 1,          1
##FIRST=     8223.62146879497, -2157,        -64700
##LAST=      0,             -37,             -66032
##MIN=       0,             -12560,          0
##MAX=       8223.62146879497, 450460365,    0
$$ Real data points
##PAGE= N=1
##DATA TABLE= (X++(R..R)), XYDATA
$$ [...]
63883H28768k5148k3300k1636k0218j8211j5185j1914r245o882m024o54K520N074
63870F79945P224R431J2070J5202J8307K0476K1311K1361K1464K1947K2706K3514
63858H94958K3960K3535K2199K0447J8493J5967J2758R547O893M410J565j333
63846A053399l783o326r946j4425j8394k1138k3337k5721k7949k9471l0588l1882
63834H10439l3024l3081l1929l0549k9726k9030k7518k5140k2908k1616k0845
63823E05073j9575j7522j5415j3942j2970j1962j0756r526q321p099o096n608
63811C66281n485n289m891m489m028l177k039j281j270j547j608j733k455l526
63797C23463m135m077m030m419m665l982k565j443j331k015k826l281l213k665
$$ y = [828768, 803620, 780320, 758684, 738466, 720255, 705070, 693156, 683911, 677029, 673005, 672351, 674871, 679945, 687169, 696600, 708670, 723872, 742179, 762655, 783966, 805327, 826791, 848738, 871444, 894958, 918918, 942453, 964652, 985099, 1003592, 1019559, 1032317, 1041864, 1048757, 1053167, 1054732, 1053399, 1049616, 1043290, 1033344, 1018919, 1000525, 979387, 956050, 930329, 902380, 872909, 842321, 810439, 777415, 744334, 712405, 681856, 652130, 623100, 595582, 570442, 547534, 525918, 505073, 485498, 467976, 452561, 438619, 425649, 413687, 402931, 393405, 385084, 377985, 371889, 366281, 360796, 355507, 350616, 346127, 342099, 338922, 336883, 335602, 334332, 332785, 331177, 329444, 326989, 323463, 319328, 315251, 311221, 306802, 302137, 298155, 295590, 294147, 292816, 290801, 287975, 284694, 281481, 278816]
63783B78816j884j277j079j156j207j108r17o58l24p2k11p71j263j122m88k25
63767B65054r35k074k467j693n40L9K9J6J62M4n19j083j133o77q4L69N63M29K3
63748B55523l82m57p1O08J212J432J321J324J824K688L426L713L567L066K229
63733B81023J194K75j92R1J245K898M161M449M136L960L951L640L203L437M485
63718C21956N444N517M807L590J804j83j291j057n69j063k175k580j927j086o74
63703C30513m41j74r9k11n4M90R10Q78P73J077J682K119K197K130K233K578K853
63686C49454K631J936J274R39N39k91j105j119l19N10P40L71k28n36j09Q02J079
63669C56568M9j364j645p37Rr3k94MJ30p46k267l435l852l758l362k847k617k909
$$ y = [278816, 276932, 275655, 274576, 273420, 272213, 271105, 270188, 269530, 269206, 269134, 268923, 268152, 266889, 265767, 265279, 265054, 264119, 262045, 259578, 257885, 257345, 257384, 257413, 257429, 257591, 257635, 257116, 256033, 254900, 254223, 254139, 254508, 255071, 255500, 255523, 255141, 254684, 254613, 255221, 256433, 257865, 259186, 260510, 262334, 265022, 268448, 272161, 275728, 278794, 281023, 282217, 282492, 282300, 282391, 283636, 286534, 290695, 295144, 299280, 303240, 307191, 310831, 314034, 317471, 321956, 327400, 332917, 337724, 341314, 343118, 342935, 341644, 340587, 340018, 338955, 336780, 334200, 332273, 331187, 330513, 330072, 329898, 329799, 329588, 329534, 330024, 330934, 331812, 332585, 333662, 335344, 337463, 339660, 341790, 344023, 346601, 349454, 352085, 354021, 355295, 356234, 356773, 356482, 355377, 354258, 353939, 354449, 355189, 355560, 355332, 354796, 354687, 355489, 356568, 356617, 355253, 353608, 352871, 352880, 352787, 352493, 352497, 352627, 351881, 349614, 346179, 342327, 338569, 335207, 332360, 329743, 326834]
63651C26834l403l643l600l477l291l003k730k432j776o61M70J215J692K071K109
63636C06375J662J304J763K935L984M343M189L959L880L955M124M358M696N226
63622C56753N936O764P748Q903R967J0647J1157J2092J3564J4981J5927J6767
63610D91206J8061J9770K1511K3181K4863K6307K7005K6635K5161K2708J9622
63599G46030J6309J2766Q584L851l26k788l650m128n069o186o751o683o704p676
63585G37579r883j2894j6033j8902k1290k2765k2837k1586j9707j7707j5475j2895
63573E25605j0368q391o967n753m468k875q18J289K516K516K131K378L202L881
63559E03878M229M603N002N160N461O764R156J1722J3775J5567J7521J9559K1699
$$ y = [326834, 323431, 319788, 316188, 312711, 309420, 306417, 303687, 301255, 299479, 298818, 299288, 300503, 302195, 304266, 306375, 308037, 309341, 311104, 314039, 318023, 322366, 326555, 330514, 334394, 338349, 342473, 346831, 351527, 356753, 362689, 369453, 377201, 386104, 396071, 406718, 417875, 429967, 443531, 458512, 474439, 491206, 509267, 529037, 550548, 573729, 598592, 624899, 651904, 678539, 703700, 726408, 746030, 762339, 775105, 783689, 787540, 787214, 784426, 780776, 776648, 771579, 765393, 758642, 751959, 745255, 737579, 727696, 714802, 698769, 679867, 658577, 635812, 612975, 591389, 571682, 553975, 538500, 525605, 515237, 506846, 499879, 494126, 489658, 486783, 485965, 487254, 489770, 492286, 494417, 496795, 499997, 503878, 508107, 512710, 517712, 522872, 528333, 535097, 544253, 555975, 569750, 585317, 602838, 622397, 644096]
63546F44096K4568K8569L2982L6523L8464L8444L5584K8919J9056Q587J65n471
63534I30486r152j1403j1816j0264p867o137n598n894o938r196j2740j6721k0238
63521G96522k3250k6184k8846l0321k9956k8159k6017k4268k2808k1130j9068
63510E16515j6950j5055j3249j1384r768q859q564q261p525o465n397m532m018
63497C96488l865l723l145k126j066j92M73O53L9r59j420j108p39p49o48m8N01
63480C78366N09N46J300K262K435J974J911K359K317J371M43L24M22l22j946l524
63464C90747m350m421m017l358k682k225k042k044k094j979j422l32R45J873K266
63449C64865K424K707L022K961K512K428L554N719P671Q375Q174Q369R813J2221
$$ y = [644096, 668664, 697233, 730215, 766738, 805202, 843646, 879230, 908149, 927205, 935792, 935957, 930486, 921334, 909931, 898115, 887851, 879984, 873847, 868249, 862355, 855417, 846221, 833481, 816760, 796522, 773272, 747088, 718242, 687921, 657965, 629806, 603789, 579521, 556713, 535583, 516515, 499565, 484510, 471261, 459877, 450109, 441250, 432686, 424425, 416900, 410435, 405038, 400506, 396488, 392623, 388900, 385755, 383629, 382563, 382371, 382844, 383497, 383536, 382577, 381157, 380049, 379310, 378561, 377913, 377865, 378366, 378875, 379421, 380721, 382983, 385418, 387392, 389303, 391662, 393979, 395350, 395793, 396117, 396539, 396217, 394271, 390747, 386397, 381976, 377959, 374601, 371919, 369694, 367652, 365608, 363514, 361535, 360113, 359781, 360726, 362599, 364865, 367289, 369996, 373018, 375979, 378491, 380919, 384473, 390192, 397863, 406238, 414412, 422781, 432594, 444815]
63435D44815J4806J7293K0142K3883K8252L1942L3241L1136K5940J9061J2308
63424G02819P147M129K821K570L377N734R569J3928J7911K1459K4819K7737K9628
63411H73648L0195K9248K6322K1141J4467P823K329j763m517n900o126n879n914
63398I75074o595p926r843j2377j5637j9620k3888k7596l0043l1144l1212l0450
63386G28743k8896k6724k4279k1915j9918j8405j7022j5107j2428r619p410n683
63374E21337l723j204J433L564M923N724O550P925R619J0701J0713J0429J0923
63361E98914J2258J3789J5391J7466J9940K2317K4670K7543L0616L2575L2680
63350H48159L1485K9519K6207K0927J4378Q066K855j187m038n726o803p922q966
$$ y = [444815, 459621, 476914, 497056, 520939, 549191, 581133, 614374, 645510, 671450, 690511, 702819, 709966, 714095, 716916, 719486, 722863, 728597, 738166, 752094, 770005, 791464, 816283, 844020, 873648, 903843, 933091, 959413, 980554, 995021, 1002844, 1005173, 1003410, 998893, 992993, 986867, 980988, 975074, 968479, 960553, 950710, 938333, 922696, 903076, 879188, 851592, 821549, 790405, 759193, 728743, 699847, 673123, 648844, 626929, 607011, 588606, 571584, 556477, 544049, 534430, 527020, 521337, 517614, 516410, 517843, 521407, 526330, 532054, 538604, 546529, 556148, 566849, 577562, 587991, 598914, 611172, 624961, 640352, 657818, 677758, 700075, 724745, 752288, 782904, 815479, 848159, 879644, 909163, 935370, 956297, 970675, 978741, 981596, 980409, 976371, 970645, 963842, 955920, 946954]
63337I46954r409r547j0520j2916j6042j8975k1718k4768k7851k9734k9403k7147
63325G08924k4316k2077k0443j8473j5349j1190o814k963l9J466P89k454p448
63312E79613j2360j5593j6813j6769j6225j5316j3862j1978j0076q384o763n088
63300D30386l561k445j618o95L31R36O70k17j156k022l142m425n088m522l168
63285D00264k107j995k677l566m082l860l010k069j348n60N06J272J020J20k87
63270C77621J74O99N81R6j82j50R8O34J328J803K157L002M296M940M265L225L180
63253D07767M111M935N248N637O423P118P286P183P333P979R016J0103J0912J1612
63239E12663J2884J5036J7383J9038K0132K1552K3730K6267K8631L0613L2180
$$ y = [946954, 937545, 927998, 917478, 904562, 888520, 869545, 847827, 823059, 795208, 765474, 736071, 708924, 684608, 662531, 642088, 623615, 608266, 597076, 590262, 587299, 587260, 588726, 589515, 587061, 579613, 567253, 551660, 534847, 518078, 501853, 486537, 472675, 460697, 450621, 442237, 435474, 430386, 426825, 424380, 422762, 422067, 422398, 423334, 424004, 423787, 422631, 420609, 417467, 413042, 407954, 403432, 400264, 398157, 396162, 393485, 389919, 385837, 381977, 378967, 376898, 375550, 374990, 375496, 376768, 377788, 377908, 377621, 377795, 378494, 379075, 379171, 378989, 378839, 378937, 379571, 380899, 382702, 384859, 387861, 392157, 397097, 401362, 404587, 407767, 411878, 416813, 422061, 427698, 434121, 441239, 448525, 455708, 463041, 471020, 480036, 490139, 501051, 512663, 525547, 540583, 557966, 577004, 597136, 618688, 642418, 668685, 697316, 727929, 760109]
63228G60109L3419L4511L5314L5304L4483L3873L4365L5354L5493L4485L3277
63217A139987L2625L2556L3092L4311L5503L5406L3514L0304K6082K0583J3942
63206A467905O900l36q387j7284k5774l2661l8008m2281m5130m5894m4726m2389
63194A131935l9316l5547l1289k6863k2411j8085j4148j0438o261j419L181O637
63182I35976R359J2443J6064J9364K1779K3567K4936K5627K5674K5777K6355K6730
63170A193651K5927K4136K2649K2219K2015K0559J7395J3276Q880L968j916q473
63158A364286j4883k0752k6244l1425l5910l9246m1285m2217m2467m2421m1918
63147I85518m0293l7258l3536l0142k7223k4238k1068j8232j6008j4046j2012
$$ y = [760109, 793528, 828039, 863353, 898657, 933140, 967013, 1001378, 1036732, 1072225, 1106710, 1139987, 1172612, 1205168, 1238260, 1272571, 1308074, 1343480, 1376994, 1407298, 1433380, 1453963, 1467905, 1474805, 1474469, 1466082, 1448798, 1423024, 1390363, 1352355, 1310074, 1264944, 1219050, 1174324, 1131935, 1092619, 1057072, 1025783, 998920, 976509, 958424, 944276, 933838, 927577, 926158, 929339, 935976, 945335, 957778, 973842, 993206, 1014985, 1038552, 1063488, 1089115, 1114789, 1140566, 1166921, 1193651, 1219578, 1243714, 1266363, 1288582, 1310597, 1331156, 1348551, 1361827, 1370707, 1374675, 1372759, 1364286, 1349403, 1328651, 1302407, 1270982, 1235072, 1195826, 1154541, 1112324, 1069857, 1027436, 985518, 945225, 907967, 874431, 844289, 817066, 792828, 771760, 753528, 737520, 723474, 711462]
63136G11462j0053q457p283o389n474m159k540j446j494j992j597LJ855L210M252
63121F69898N259N990O353O712P117O986O011M740L768L028K345J995K224K649
63107G35075K750K517K238K003J736J302M14r82k143k153j358j227k357l578l683
63092G30554k993k458k097j470q95r40j111l56J202K249K134J737K190L474M678
63077G35898N131M939M710N010N975P279Q510R461J0121J0617J1288J2477J4052
63064H45468J5453J6436J7524J9437K2360K5888K9421L2491L5115L7936M1620
63053A139149M6001N0311N4342N8665O3493O8169P2154P5755P9258Q2045Q3331
63042A872673Q3285Q2699Q1959Q0936P9607P8142P6719P5730P5816P7085P8588
$$ y = [711462, 701409, 692952, 685669, 679280, 673806, 669647, 667107, 665661, 664167, 662175, 660578, 660581, 662436, 665646, 669898, 675157, 681147, 687500, 694212, 701329, 708315, 714326, 719066, 722834, 725862, 728207, 730202, 732426, 735075, 737825, 740342, 742580, 744583, 746319, 747621, 748035, 747053, 744910, 742757, 741399, 740172, 737815, 734237, 730554, 727561, 725103, 723006, 721536, 720641, 719701, 718590, 718234, 719436, 721685, 723819, 725556, 727746, 731220, 735898, 741029, 745968, 750678, 755688, 761663, 768942, 777452, 786913, 797034, 807651, 818939, 831416, 845468, 860921, 877357, 894881, 914318, 936678, 962566, 991987, 1024478, 1059593, 1097529, 1139149, 1185150, 1235461, 1289803, 1348468, 1411961, 1480130, 1552284, 1628039, 1707297, 1789342, 1872673, 1955958, 2038657, 2120616, 2201552, 2281159, 2359301, 2436020, 2511750, 2587566, 2664651, 2743239]
63031B743239P9072P7955P5148P0324O2912N2573L9272K3219N201j3499l1965
63020C183451m9936o6938q1654r2857j00443j04941j06556j05338j01818r6667
63010B276303r0045q1925p2690o2816n2400m1626l1146k1324j1651j740P623J5327
62998A831890K1467K6996L2138L6205L8901M0827M2616M4313M5717M6680M7050
62987B254800M6770M5982M4687M2538L9377L5483L0779K4400J5734N432n422j6610
62975B563950k8445m0546n1994o2280p1151p7979q2287q4624q5798q5532q3069
62964A810245p8867p4401p0306o5950o1007n6234n2360m9151m5967m2539l9047
62953A174416l5991l3918l2705l1391k9431k7622k6841k6374k4917k2770k1417
$$ y = [2743239, 2822311, 2900266, 2975414, 3045738, 3108650, 3161223, 3200495, 3223714, 3228915, 3215416, 3183451, 3133515, 3066577, 2984923, 2892066, 2791623, 2686682, 2580126, 2474788, 2372970, 2276303, 2186258, 2104333, 2031643, 1968827, 1916427, 1874801, 1843655, 1822331, 1810680, 1808940, 1816563, 1831890, 1853357, 1880353, 1912491, 1948696, 1987597, 2028424, 2071040, 2115353, 2161070, 2207750, 2254800, 2301570, 2347552, 2392239, 2434777, 2474154, 2509637, 2540416, 2564816, 2580550, 2585982, 2580560, 2563950, 2535505, 2494959, 2442965, 2380685, 2309534, 2231555, 2149268, 2064644, 1978846, 1893314, 1810245, 1731378, 1656977, 1586671, 1520721, 1459714, 1403480, 1351120, 1301969, 1256002, 1213463, 1174416, 1138425, 1104507, 1071802, 1040411, 1010980, 983358, 956517, 930143, 905226, 882456, 861039]
62942H61039k0985j9961j7736j5652j4825j4447j3195j1162r400q402p851p241
62930G00182o126m401k833k490l236l589k686j449j194j902k639k992l248l652
62916F57745m205m835n264n100m515m282m697n029m554l653l241l579m197m642
62902E95952m782m619m240l775l176k335j535j288j507j410n24O89J462J426N59
62887E70897r13k278k649j916r10l58j88n2J15L21N84N51j85j139j195j84P30
62870E61231P15L40L01J11r68k496l329l094k221j082K3M88J7o42n05K59O81N08
62852E50337M56R37J426J385J107J218J758K078J580L52r15j643j945k286k704
62837E53141k757k288j680j205o85n2J80m71j727k740k859j999o24N21J061J459
$$ y = [861039, 840054, 820093, 802357, 786705, 771880, 757433, 744238, 733076, 723676, 715274, 707423, 700182, 694056, 689655, 686822, 684332, 681096, 677507, 674821, 673372, 672178, 670276, 667637, 664645, 661397, 657745, 653540, 648705, 643441, 638341, 633826, 629544, 624847, 619818, 615264, 611611, 608370, 604791, 600594, 595952, 591170, 586551, 582311, 578536, 575360, 573025, 571490, 570202, 568695, 567285, 566761, 567450, 568912, 570338, 570897, 569984, 567706, 565057, 563141, 562231, 561873, 561685, 561633, 561748, 562069, 562653, 563204, 563019, 561880, 560685, 560501, 561231, 561946, 562286, 562587, 562698, 561730, 559234, 555905, 552811, 550590, 549508, 549531, 550019, 550036, 549394, 548889, 549148, 549829, 550337, 550793, 551730, 553156, 554541, 555648, 556866, 558624, 560702, 562282, 562634, 561719, 560076, 558131, 555845, 553141, 550384, 548096, 546416, 545211, 544526, 544474, 544654, 544183, 542456, 539716, 536857, 534858, 534234, 534755, 535816, 537275]
62821E37275K359L445L725L048K520K974L945M681N311O234P067P087O396N830
62807F01897N957O693P598Q102P870P398P805R484J1487J2737J3266J3664J4024
62794G27982J4281J4996J6803J9355K1826K4181K7083L0682L4453L8237M2611
62783A012490M8095N4610O1799O9388P7143Q4919R2727J00542J08122J15223J21607
62772A946665J26656J29523J30032J28690J25314J18428J06842R1211P3092N3097
62762C029550L1163Q115j4436l5638n5559p3828q9354j01596j10988j17815j21741
62751B347873j22736j21584j18972j14917j09515j03389r7035r0359q3380p6702
62741A309284p0724o5006n8950n2678m6728m1330l6506l2498k9482k7032k4438
$$ y = [537275, 539634, 543079, 546804, 549852, 552372, 555346, 559291, 563972, 569283, 575517, 582584, 589671, 596067, 601897, 607854, 614547, 622145, 630247, 638117, 645515, 653320, 662804, 674291, 687028, 700294, 713958, 727982, 742263, 757259, 774062, 793417, 815243, 839424, 866507, 897189, 931642, 969879, 1012490, 1060585, 1115195, 1176994, 1246382, 1323525, 1408444, 1501171, 1601713, 1709835, 1825058, 1946665, 2073321, 2202844, 2332876, 2461566, 2586880, 2705308, 2812150, 2903361, 2976453, 3029550, 3060713, 3068828, 3054392, 3018754, 2963195, 2889367, 2800013, 2698417, 2587429, 2469614, 2347873, 2225137, 2103553, 1984581, 1869664, 1760149, 1656760, 1559725, 1469366, 1385986, 1309284, 1238560, 1173554, 1114604, 1061926, 1015198, 973868, 937362, 904864, 875382, 848350, 823912]
62730H23912k1506j8677j6404j4678j3144j1420r293o915m797l411k693k024q22
62717F98128R41K889M833O928R180J1155J2583J3946J5960J8530K0975K3304K6495
62704H65847L1110L6395M1347M6067N1351N7348O3329O8670P3381P7879Q2695
62693A495419Q8193R4035R9085J02271J03350J02366R8790R1821Q1262O7564N1280
62682B475436L3141J4326m167k2218l9996n6820p1404q3030r1709r7413j00140
62671A956006j00624r9956r8345r5146r0263q4602p8960p3304o7503o1917n6848
62660A048538n2074m7342m2807l8633l4724l1071k7850k4906k1850j8931j7094
62649F91256j6745j6993j6638j5388j3711j2035j0598r656r186q641p426n550
$$ y = [823912, 802406, 783729, 767325, 752647, 739503, 728083, 718790, 711875, 707078, 703667, 700974, 698950, 698128, 699069, 701958, 706791, 713719, 722899, 734054, 746637, 760583, 776543, 795073, 816048, 839352, 865847, 896957, 933352, 974699, 1020766, 1072117, 1129465, 1192794, 1261464, 1334845, 1412724, 1495419, 1583612, 1677647, 1776732, 1879003, 1982353, 2084719, 2183509, 2275330, 2356592, 2424156, 2475436, 2508577, 2522903, 2518736, 2496518, 2456522, 2399702, 2328298, 2245268, 2153559, 2056146, 1956006, 1855382, 1755426, 1657081, 1561935, 1471672, 1387070, 1308110, 1234806, 1167303, 1105386, 1048538, 996464, 949122, 906315, 867682, 832958, 801887, 774037, 749131, 727281, 708350, 691256, 674511, 657518, 640880, 625492, 611781, 599746, 589148, 579492, 570306, 561665, 554239, 548689]
62637E48689l494j695m24J63J77n3m47j271k526l612l995l878l813l860l608k870
62621E13483j935j110l52N38J521K249K414K241K423L425M862N955O500O969P688
62606E56871Q413Q928R549J0675J2242J3969J5904J8346K1377K4851K8690L2931
62594G62746L7464M2000M6310N0391N4353N8170O1509O3807O4617O3798O1260
62583A366425N6728N0051M1588L1925K1233R424l011j4852k5159l3980m1744m8241
62571A410387n2736n4997n5718n5803n5495n4428n2337m9465m6248m2885l9416
62560H50859l5993l2758k9515k5993k2466j9621j7661j5978j3986j1810r814q021
62548F07243o438n492n487n903n938n416m563l277j465J94P73L82N0K60M44N1
$$ y = [548689, 545195, 543500, 543076, 543239, 543416, 543363, 542916, 541645, 539119, 535507, 531512, 527634, 523821, 519961, 516353, 513483, 511548, 510438, 510086, 510624, 512145, 514394, 516808, 519049, 521472, 524897, 529759, 535714, 542214, 549183, 556871, 565284, 574212, 583761, 594436, 606678, 620647, 636551, 654897, 676274, 701125, 729815, 762746, 800210, 842210, 888520, 938911, 993264, 1051434, 1112943, 1176750, 1241367, 1305165, 1366425, 1423153, 1473204, 1514792, 1546717, 1567950, 1577374, 1574363, 1559511, 1534352, 1500372, 1458628, 1410387, 1357651, 1302654, 1246936, 1191133, 1135638, 1081210, 1028873, 979408, 933160, 890275, 850859, 814866, 782108, 752593, 726600, 704134, 684513, 666852, 650874, 636888, 625078, 615264, 607243, 600805, 595313, 589826, 583923, 577985, 572569, 568006, 564729, 563264, 563458, 564231, 564613, 564663, 564923, 565367, 565418]
62532E65418p20j377j572q85R55L346N129O005O955Q869J1393J3620J5283J6845
62518F49264J8886K1823K5715K9965L3679L6735M0027M4315M9259N3914N7662
62507A061244O0287O1746O2197O1833O0202N6290M9759M1571L2876K3797J3956
62496A585758L784n425j2561j7293j9828k0594j9988j8009j4331q971k629L916
62484A453829J0383J6663K2450K7574L2302L6719M0080M1182L9064L3237K3903
62473A777386J2609J888o754j4303k3020l3920m5993n7399o6545p2306p4406p3865
62461A323372p2319p0594o8338o4994o0503n5085m9037m2886l7217l2124k7323
62450G42952k2770j8753j5298j2103r110o626m684k827p45J317L001M349N650
$$ y = [565418, 564698, 563321, 561749, 560864, 561819, 565165, 570294, 576299, 583254, 592123, 603516, 617136, 632419, 649264, 668150, 689973, 715688, 745653, 779332, 816067, 856094, 900409, 949668, 1003582, 1061244, 1121531, 1183277, 1245474, 1307307, 1367509, 1423799, 1473558, 1515129, 1548005, 1571802, 1585758, 1589542, 1584117, 1571556, 1554263, 1534435, 1513841, 1493853, 1475844, 1461513, 1452542, 1449913, 1453829, 1464212, 1480875, 1503325, 1530899, 1563201, 1599920, 1640000, 1681182, 1720246, 1753483, 1777386, 1789995, 1791883, 1785129, 1770826, 1747806, 1713886, 1667893, 1610494, 1543949, 1471643, 1397237, 1323372, 1251053, 1180459, 1112121, 1047127, 986624, 931539, 882502, 839616, 802399, 770275, 742952, 720182, 701429, 686131, 674028, 664918, 658292, 653608, 650781, 650036, 651353, 654354, 658703, 664353]
62437F64353O972Q027Q339P646O280M980L992K626J99k828n381p196q931j0820
62423F78258j2240j2790j2905j2969j2687j1897j1215j1193j1330j0763r481q174
62411E40614p201o442n905n647n300m471l563l392l848l810k657j115j98P9L33
62396D87477P27R29R57J287K084K825K973K666K462K608K872L004L151L611M331
62381E23964M933N268N675O451P254P452O980O480O445O707O988P435Q227R008
62367F19267R319R401J0034J1560J3586J5639J7606J9520K1504K4026K7628L2107
62355H31197L6469M0032M3068M5980M8410M9715M9830M8862M6231M1093L3782
62344A314669K5934J8916J2705O580M18n241j0001j3976j7479k0725k3839k6784
$$ y = [664353, 671325, 679352, 687691, 695337, 701617, 706597, 710589, 713215, 713414, 710586, 705205, 698009, 689078, 678258, 666018, 653228, 640323, 627354, 614667, 602770, 591555, 580362, 569032, 558269, 548788, 540614, 533413, 526971, 521066, 515419, 510119, 505648, 502085, 498693, 494845, 491035, 488378, 487263, 487065, 487144, 487477, 488204, 489133, 490090, 491377, 493461, 496286, 499259, 501925, 504387, 506995, 509867, 512871, 516022, 519633, 523964, 528897, 534165, 539840, 546291, 553545, 560997, 567977, 574457, 580902, 587609, 594597, 602032, 610259, 619267, 628586, 637987, 648021, 659581, 673167, 688806, 706412, 725932, 747436, 771462, 799090, 831197, 867666, 907698, 950766, 996746, 1045156, 1094871, 1144701, 1193563, 1239794, 1280887, 1314669, 1340603, 1359519, 1372224, 1378804, 1379222, 1373981, 1363980, 1350004, 1332525, 1311800, 1287961, 1261177]
62332A261177k9201l0528l0453k9235k7496k5772k4270k2986k1894k0930j9982
62321I78430j9133j8832j9569k1201k2869k3696k3527k2908k2507k2624k3008
62310G38556k2962k1828j9547j6694j3906j1504r614q266p208o035m749l852l569
62297E88822l412k787j685l85J027K428L393L782M231N416P031Q251Q905R486
62283F34503J0111J0350J0091R872J0080J0506J0773J0707J0203R268Q272P611
62271G52347P099O291N334M839M842M720M284M133M714N826P362R735J3006J6414
62257H50946J9442K2760K7291L2721L7736M1593M4685M7567M9999N1152N0299
62246A276191M7143M1776L4616K6471J8377J1003M145k971j0680j8445k5611l2166
$$ y = [1261177, 1231976, 1201448, 1170995, 1141760, 1114264, 1088492, 1064222, 1041236, 1019342, 998412, 978430, 959297, 940465, 920896, 899695, 876826, 853130, 829603, 806695, 784188, 761564, 738556, 715594, 693766, 674219, 657525, 643619, 632115, 622501, 614235, 607027, 600992, 596243, 592391, 588822, 585410, 582623, 580938, 580553, 581580, 584008, 587401, 591183, 595414, 600830, 607861, 616112, 625017, 634503, 644614, 654964, 665055, 674927, 685007, 695513, 706286, 716993, 727196, 736464, 744736, 752347, 759446, 765737, 771071, 775910, 780752, 785472, 789756, 793889, 798603, 804429, 811791, 821526, 834532, 850946, 870388, 893148, 920439, 953160, 990896, 1032489, 1077174, 1124741, 1174740, 1225892, 1276191, 1323334, 1365110, 1399726, 1426197, 1444574, 1455577, 1459722, 1456751, 1446071, 1427626, 1402015, 1369849]
62234A369849l8298m3555m7203m9170m9957m9705m8139m5424m2230l8826l4959
62223H82383l0777k7089k4342k2090j9803j7530j5470j3480j1449r573q034o901
62211F75845o443o778p064o088l971k259j812j680p63M63R94J150K102L945N496
62196F53137N934N607N263N256N603O137O560O710O760O889O988P048P412Q163
62182G43467Q722Q587Q162Q182Q625Q747Q016O526M781L552L587M817O197O939
62168H38907P618R452J2750J6806K0968K5081K9029L2581L5644L8021L9050L8107
62156A144014L5439L1865K7734K2805J7109J1290O057J714j824n033q709j3270
62144A269191j8108k2083k4703k6345k7390k7646k6717k4583k1671j8552j5586
$$ y = [1369849, 1331551, 1287996, 1240793, 1191623, 1141666, 1091961, 1043822, 998398, 956168, 917342, 882383, 851606, 824517, 800175, 778085, 758282, 740752, 725282, 711802, 700353, 690780, 682746, 675845, 669402, 662624, 655560, 649472, 645501, 643242, 641430, 639750, 638987, 639450, 640444, 641594, 643696, 647641, 653137, 659071, 664678, 669941, 675197, 680800, 686937, 693497, 700207, 706967, 713856, 720844, 727892, 735304, 743467, 752189, 760776, 768938, 777120, 785745, 794492, 802508, 809034, 813815, 817367, 820954, 825771, 831968, 838907, 846525, 855977, 868727, 885533, 906501, 931582, 960611, 993192, 1028836, 1066857, 1105907, 1144014, 1179453, 1211318, 1239052, 1261857, 1278966, 1290256, 1296313, 1298027, 1296203, 1291170, 1282461, 1269191, 1251083, 1229000, 1204297, 1177952, 1150562, 1122916, 1096199, 1071616, 1049945, 1031393, 1015807]
62133A015807j2746r891p245n311m270l851l947m743o027o995p180o866o240m863
62119I25632k645n31O16J197K154L683N433P264Q745Q556N753J307k807n809q210
62104I50338j0037j0388q873o330l944k541k698m349o173o573n464m146l295k250
62090H73277m82J401K660L388L941M227M064L598K992K414K474L829O098Q087
62076I21968R384J0803J2850J4800J5837J6203J6507J6723J6633J6522J6683J6741
62064A101654J6319J5938J6521J8263K0534K2583K3844K3880K2594K0352J7467
62053A319949J3866R564N136J243k067n268q773j2789j7419k2520k7584l2050
62041A221288l5633l8249l9875m0665m0883m0558l9453l7553l5233l2859l0513
$$ y = [1015807, 1003061, 993170, 985925, 980614, 976344, 972493, 968546, 963803, 957776, 950781, 943601, 936735, 930495, 925632, 922987, 922456, 923072, 924269, 926423, 930106, 935539, 942803, 951548, 960104, 965857, 967164, 964357, 958548, 950338, 940301, 929913, 921040, 914710, 910766, 908225, 905527, 901178, 895005, 888432, 882968, 878822, 875527, 873277, 872795, 874196, 876856, 880244, 884185, 888412, 892476, 896074, 899066, 901480, 903954, 907783, 913881, 921968, 931352, 942155, 955005, 969805, 985642, 1001845, 1018352, 1035075, 1051708, 1068230, 1084913, 1101654, 1117973, 1133911, 1150432, 1168695, 1189229, 1211812, 1235656, 1259536, 1282130, 1302482, 1319949, 1333815, 1343379, 1348515, 1349758, 1347691, 1342423, 1333650, 1320861, 1303442, 1280922, 1253338, 1221288, 1185655, 1147406, 1107531, 1066866, 1025983, 985425, 945972, 908419, 873186, 840327, 809814]
62030H09814k8232k6092k4001k1731j9350j7180j5215j3074j0751q946q345q803
62018F08094r452r427q446o968n792n206m637l509k219j643j808j822j168k03
62004E45794P12J688K660L108K904K686K945L337L313K863K198J351M64p3k66
61989E75684o87j598k497l015l589m650n763o307o542p189q169q606q033o949
61975E02090o062n428m548l210k043j975l031l915l315j452K71R91R63N13m86
61960D69363j760k365j902j193j053j121o29K92R48J231J578K045K211J986J914
61945D71545K656M416O714Q513Q993Q458Q089Q568R498J0398J1463J2795J3616
61932E85722J3143J1780J0608J0051R747R420R097Q686P964O948N714M092K084
$$ y = [809814, 781582, 755490, 731489, 709758, 690408, 673228, 658013, 644939, 634188, 625242, 616897, 608094, 598642, 589215, 580769, 573801, 568009, 562803, 558166, 554657, 552438, 550795, 548987, 547165, 545997, 545794, 546506, 548194, 550854, 553962, 556866, 559552, 562497, 565834, 569147, 572010, 574208, 575559, 576023, 575950, 575684, 574997, 573399, 570902, 567887, 564298, 559648, 553885, 547578, 541036, 533847, 525678, 517072, 509039, 502090, 496028, 490600, 486052, 482842, 480799, 478824, 475793, 471878, 468563, 467111, 467382, 468373, 469336, 469849, 469363, 467603, 465238, 463336, 462143, 461090, 459969, 459340, 459632, 460580, 461811, 463389, 465434, 467645, 469631, 471545, 474201, 478617, 485331, 493844, 502837, 511295, 519384, 527952, 537450, 547848, 559311, 572106, 585722, 598865, 610645, 621253, 631304, 641051, 650471, 659568, 668254, 676218, 683166, 688880, 692972, 695056]
61919F95056K32r30j617k376l214l683l576k940j657L33K575M464N943P305Q509
61904G04424R246R529R561R170P957N990L836J920J70j740m062o598q489q798
61890G32116p740o751o843p373p135o094n193m862m795m902n483o463p385q173
61876F42924r089r908j0048r524q989q719q359p749p097o282m881l143j902j239
61862E45995j40J924M100N403O079O917P935Q745R664J1345J3531J5289J6483
61849F53270J7945J9959K1585K2032K1794K1674K1332J9891J7581J5634J4390
61838H67087J2589R136M615M04l019o024q549r925r868q726o786m191j508N68
61824H35803K223M278O704Q391Q683Q152P277N476K211j740n136p791j0305j2738
$$ y = [695056, 695288, 694358, 692741, 690365, 687151, 683468, 679892, 676952, 675295, 675628, 678203, 682667, 688610, 695915, 704424, 713670, 723199, 732760, 741930, 749887, 755877, 759713, 761633, 761803, 760063, 756001, 749403, 740914, 732116, 724376, 717625, 710782, 703409, 696274, 690180, 684987, 680125, 675330, 670428, 664945, 658482, 651097, 642924, 633835, 623927, 613879, 604355, 595366, 586647, 578288, 570539, 563442, 557160, 552279, 549136, 547234, 545995, 545855, 547779, 551879, 557282, 563361, 570278, 578213, 586958, 596622, 607967, 621498, 636787, 653270, 671215, 691174, 712759, 734791, 756585, 778259, 799591, 819482, 837063, 852697, 867087, 879676, 888812, 893427, 893831, 890812, 884788, 876239, 866314, 856446, 847720, 840934, 836743, 835235, 835803, 838026, 842304, 849008, 857399, 866082, 874234, 881511, 886987, 889198, 887458, 882322, 874531, 864226, 851488]
61810H51488j4556j5589j6141j6282j5824j4893j3863j2834j1782j0993j0748
61799F97983j0764j0623j0442j0441j0107q798o986n969o132o354n440l579j996
61786F00352j607k228k918k877k182j537j300j112p01n24j048j829j980j336m60
61771E76713K38P12Q42O01N22J218K410L212L384L568M248N196O032O689P138
61756F22723P280P183O952O297M885L098J757R68q0j960m243o107p128p377p179
61741F27069o960o872o454n252l723k931l211l813l989l715l112j952k20J390
61727E76255K102J858J150M23l5jM35Q28Q89R17J368K163K706K548J857J257J186
61710E97906J436J349N72n82j618k429l133l651l831l755l497k847j785r70j185
$$ y = [851488, 836932, 821343, 805202, 788920, 773096, 758203, 744340, 731506, 719724, 708731, 697983, 687219, 676596, 666154, 655713, 645606, 636808, 629822, 623853, 617721, 611367, 605927, 602348, 600352, 598745, 596517, 593599, 590722, 588540, 587003, 585703, 584591, 583890, 583366, 582318, 580489, 578509, 577173, 576713, 576951, 577663, 578505, 579106, 579628, 580846, 583256, 586468, 589852, 593420, 597668, 602864, 608896, 615585, 622723, 630003, 637186, 644138, 650435, 655320, 658418, 660175, 661143, 661063, 659103, 654860, 648753, 641625, 634248, 627069, 620109, 613237, 606783, 601531, 597808, 594877, 591666, 587853, 583864, 580149, 577037, 575085, 574865, 576255, 578357, 580215, 581365, 581788, 581753, 581752, 582187, 583015, 583904, 584821, 586189, 588352, 591058, 593606, 595463, 596720, 597906, 599342, 600691, 601263, 600681, 599063, 596634, 593501, 589850, 586019, 582264, 578767, 575920, 574135, 573165, 571980]
61695E71980k335l508l979l742l206k905l245l993m218l386k312k284l426m673
61681E24768n187m994m384l618l222l541l919l338j999j247j685k379k337j720
61667D81198j144o81j84K41O43J373K284K560J898J138J046J281J252J262J836
61652D96003K543K541J910J484J564J675J519J352J379J474J570J762J959J888
61638E20623J517J111Q72Q28R81J262J414J254Q96N20%q38j778k402k703l106
61622E20451l862m701n140m977m442l995l885l900l602k928k342k312k800l366
61608D68199l634l516l190l016l313m059m836n161m812l902k817k049j849k049
61594D19996k374k789l267l458l053k342j938j987k149k286k467k373j494j29
$$ y = [571980, 569645, 566137, 562158, 558416, 555210, 552305, 549060, 545067, 540849, 537463, 535151, 532867, 529441, 524768, 519581, 514587, 510203, 506585, 503363, 499822, 495903, 492565, 490566, 489319, 487634, 485255, 482918, 481198, 480054, 479373, 479189, 479430, 480073, 481446, 483730, 486290, 488188, 489326, 490372, 491653, 492905, 494167, 496003, 498546, 501087, 502997, 504481, 506045, 507720, 509239, 510591, 511970, 513444, 515014, 516776, 518735, 520623, 522140, 523251, 524123, 524951, 525932, 527194, 528608, 529862, 530758, 531278, 531278, 530440, 528662, 526260, 523557, 520451, 516589, 511888, 506748, 501771, 497329, 493334, 489449, 485549, 481947, 479019, 476677, 474365, 471565, 468199, 464565, 461049, 457859, 454843, 451530, 447471, 442635, 437474, 432662, 428760, 425943, 423894, 422045, 419996, 417622, 414833, 411566, 408108, 405055, 402713, 400775, 398788, 396639, 394353, 391886, 389513, 388019, 387890]
61580C87890O27K50m75n99k51k41q69j665k017j627n98N08R58N54j32m08j44L75
61562C82136Q66J085Q84M80L82P62J278J664K036K363K235J535Q24N81N34K31
61546C99876j52j45K68P36J104J295J002J72m93j74R43J851K016J924K259K996
61530D15478L511L262K216Q68r6l54k78n83j580k831l463k954j635m92j94l85
61514D10490k68J60N3r38j880j670n53J65j99q84p02N12J785K093J377M11j04
61497D09848r5J83O21J184J644J854K078K636L276L394K821J938J051K34k22J17
61481D32562J108J944K081J809J711J991K519L023L111K526J531O72J21k94n19
61466D55896l74j45l36p76q56o83j020j927k497k238j672j099k1J601K682K486
$$ y = [387890, 388517, 388767, 388292, 387693, 387442, 387201, 386332, 384667, 382650, 381023, 380425, 380933, 381891, 382445, 382313, 381905, 381761, 382136, 383002, 384087, 384971, 385451, 385833, 386595, 387873, 389537, 391573, 393936, 396171, 397706, 398530, 399111, 399645, 399876, 399724, 399579, 399847, 400583, 401687, 402982, 403984, 404156, 403663, 403489, 404432, 406283, 408299, 410223, 412482, 415478, 418989, 422251, 424467, 425335, 425239, 424885, 424607, 424024, 422444, 419613, 416150, 413196, 411561, 411069, 410875, 410490, 410222, 410382, 410435, 409497, 407617, 405947, 405394, 405559, 405360, 404476, 403774, 404286, 406071, 408164, 409541, 409952, 409848, 409753, 409936, 410557, 411741, 413385, 415239, 417317, 419953, 423229, 426623, 429444, 431382, 432433, 432667, 432445, 432562, 433670, 435614, 437695, 439504, 441215, 443206, 445725, 448748, 451859, 454385, 455916, 456588, 456709, 456415, 455896, 455522, 455377, 455041, 454265, 453409, 452726, 451706, 449779, 447282, 445044, 443372, 442273, 442252, 443853, 446535, 449021]
61450D49021J751J431J254N81j83k49J99M26M50P35J047P99K02m2O2oj77M1M76
61431D57818M67M1k23l15p10j203j000j01N60N93P17J538K640L279L225K616J711
61414D71653J025J037J467J509R22K52k02q30j821k607k700k370k050j617q12
61399D62856N4M16J55l68p78q66n64q5J71R6Q9N28J269J896K221K290K084J626
61381D73090J232J302J825K356K599K776L243L880M175L920L466L136K783K250
61367E12033J853J844J699Q26k28k80O69J271Q63M92J170K274K721K887L919N673
61351E39686O808O791O517O746P148P195O963O596N761M210K319P35j72k44N72
61336F07631J943L038L022J651n29k375k833j885o93m40j151k018k540k737k555
$$ y = [449021, 450772, 452203, 453457, 454038, 453855, 453606, 453805, 454231, 454681, 455416, 456463, 457262, 457464, 457422, 457484, 457478, 457301, 457342, 457818, 458285, 458326, 458103, 457788, 457078, 455875, 454875, 454774, 455334, 455927, 456644, 458182, 460822, 464101, 467326, 469942, 471653, 472678, 473715, 475182, 476691, 477613, 477865, 477663, 476833, 475012, 472405, 469705, 467335, 465285, 463668, 462856, 462910, 463326, 463481, 463113, 462335, 461469, 460905, 460820, 460991, 461087, 461176, 461704, 462973, 464869, 467090, 469380, 471464, 473090, 474322, 475624, 477449, 479805, 482404, 485180, 488423, 492303, 496478, 500398, 503864, 507000, 509783, 512033, 513886, 515730, 517429, 518255, 518027, 517747, 518416, 519687, 520550, 521042, 522212, 524486, 527207, 530094, 534013, 539686, 546494, 553285, 559802, 566548, 573696, 580891, 587854, 594450, 600211, 604421, 606740, 607475, 607303, 607059, 607631, 609574, 612612, 615634, 617285, 616756, 614381, 611548, 609663, 608970, 608530, 607379, 605361, 602821, 600084, 597529]
61321E97529j879j037n24k21L31R93J223J279K213M306O375P256P308P795R270
61306F42217J1277J3389J5719J8253K0272K0802J9610J7379J4876J2149Q828N003
61294H19774J298j909m763p270q935r538r645r910j0331j0657j1002j1392j1235
61281G14485j0082q514p425o762n818m519l422k566j370K98J831K764L118K850
61267F74868J830N04j94J34J066K143L366M731O011P117Q119Q832Q921Q409P543
61252G43400O206M154J756k25j582k646l428l588l245k982k987k996l031l361
61238G25445l695l371k462j768j628j559j223q00l18M70J471K394L543N386P357
61223G29242Q324Q410Q901J0047J0446R283P745P313P865Q427Q767R162R413R114
$$ y = [597529, 595650, 594613, 594089, 593868, 594199, 595192, 596415, 597694, 599907, 604213, 610588, 617844, 625152, 632947, 642217, 653494, 666883, 682602, 700855, 721127, 741929, 761539, 778918, 793794, 805943, 814771, 819774, 821072, 819163, 814400, 807130, 798195, 788657, 779012, 769102, 758771, 748114, 737112, 725720, 714485, 704403, 695889, 688464, 681702, 675884, 671365, 667943, 665377, 664007, 664305, 666136, 668900, 672018, 674868, 676698, 677202, 677008, 677142, 678208, 680351, 683717, 688448, 694459, 701576, 709695, 718527, 727448, 735857, 743400, 749606, 753760, 755516, 755291, 753709, 751063, 747635, 744047, 740802, 737820, 734833, 731837, 728806, 725445, 721750, 718379, 715917, 714149, 712521, 710962, 709739, 708939, 708621, 709091, 710562, 712956, 716499, 721885, 729242, 737566, 745976, 754877, 764924, 775370, 784653, 792398, 799711, 807576, 816003, 824770, 833932, 843345, 852459]
61209H52459Q412P613O590N261M107L522L276L218L783N157O664P765Q953J0889
61195I37669J3313J5579J7655J9772K1602K2562K2435K1040J7995J3590R186N865
61183A138263L246N38j972l507m363n617p583r569j1046j2093j2914j3740j5040
61170A044603j6946j8619j9084j8599j8308j8700j9220j9370j9266j9044j8482
61159H38965j7502j6436j5488j4413j2854j0855q876p391o308m789k102J247L759
61146G26957M572M155L115J254j528m270n897o540o957p170o692n644m502l073
61132F87780q46J748L628M601N578P128Q839J0334J1997J4286J7008J9649K1937
61119H13667K3862K5586K7423K9549L1628L3054L3605L3488L2921L2044L1018
$$ y = [852459, 860871, 868484, 875074, 880335, 884442, 887964, 891240, 894458, 898241, 903398, 910062, 917827, 926780, 937669, 950982, 966561, 984216, 1003988, 1025590, 1048152, 1070587, 1091627, 1109622, 1123212, 1132398, 1138263, 1141509, 1142047, 1140075, 1136568, 1132205, 1126588, 1119005, 1109436, 1098390, 1086297, 1073383, 1059643, 1044603, 1027657, 1009038, 989954, 971355, 953047, 934347, 915127, 895757, 876491, 857447, 838965, 821463, 805027, 789539, 775126, 762272, 751417, 742541, 735150, 728842, 724053, 721951, 723198, 726957, 731529, 735684, 738799, 740053, 738525, 734255, 728358, 721818, 714861, 707691, 700999, 695355, 690853, 687780, 686934, 688682, 692310, 696911, 702489, 709617, 718456, 728790, 740787, 755073, 772081, 791730, 813667, 837529, 863115, 890538, 920087, 951715, 984769, 1018374, 1051862, 1084783, 1116827, 1147845]
61108A147845K9821K8160K6070K4164K2714K0937J7903J3885R900O186K035k938
61096A346682q308j3564j8406k2303k4711k6006k7336k9266l1153l2115l1974
61085A081540l1040k9565k7721k5709k3666k1702k0047j8748j7370j5432j3124
61074H37416j1014r228p375n246l043j037M92J227J349J818L343N353O741P440
61060H28236Q277R452J0402J1170J2636J5024J7244J8341J8769J9671K1492K3811
61048A014525K6012K7736K9077L0568L2581L4698L6175L7062L8097L9501M0676
61037A386708M1294M1826M2662M3480M3834M3817M3758M3829M4145M4716M5248
61026A865317M5552M6079M7273M8482M8605M7737M6988M6565M5527M3861M3248
$$ y = [1147845, 1177666, 1205826, 1231896, 1256060, 1278774, 1299711, 1317614, 1331499, 1341399, 1347585, 1349620, 1346682, 1338374, 1324810, 1306404, 1284101, 1259390, 1233384, 1206048, 1176782, 1145629, 1113514, 1081540, 1050500, 1020935, 993214, 967505, 943839, 922137, 902090, 883342, 865972, 850540, 837416, 826402, 817174, 809799, 804553, 801510, 800473, 800965, 802192, 803541, 805359, 808702, 814055, 820796, 828236, 836513, 845965, 856367, 867537, 880173, 895197, 912441, 930782, 949551, 969222, 990714, 1014525, 1040537, 1068273, 1097350, 1127918, 1160499, 1195197, 1231372, 1268434, 1306531, 1346032, 1386708, 1428002, 1469828, 1512490, 1555970, 1599804, 1643621, 1687379, 1731208, 1775353, 1820069, 1865317, 1910869, 1956948, 2004221, 2052703, 2101308, 2149045, 2196033, 2242598, 2288125, 2331986, 2375234]
61015B375234M5037M8791N3630N9746O7516P6319Q5451R5433J07576J23350J44944
61004C283027J74983K14425K62231L18548L86528M69405N68106O84789Q26735
60995G188777J002459J214399J457346J716252J949937K073760J981553J618803
60987B0203286J050145M45014k0046k55032k68167j16051J27383L56062M29942
60978B1952536K37672k18346q06894j348908j720489j892522j899478j792722
60970A2510849j618876j417054j216049j030940q66604p24659o05616n07246m25438
60961D098367l57442l02401k59051k24772j96966j73937j54421j37491j22914
60952B168972j10569r9551q8843p8648o9929o2715n6112n0050m5777m4159m4408
$$ y = [2375234, 2420271, 2469062, 2522692, 2582438, 2649954, 2726273, 2811724, 2907157, 3014733, 3138083, 3283027, 3458010, 3672435, 3934666, 4253214, 4639742, 5109147, 5677253, 6362042, 7188777, 8191236, 9405635, 10862981, 12579233, 14529170, 16602930, 18584483, 20203286, 21253431, 21698445, 21678399, 21423367, 21155200, 21039149, 21166532, 21522594, 21952536, 22190208, 21971862, 21164968, 19816060, 18095571, 16203049, 14303571, 12510849, 10891973, 9474919, 8258870, 7227930, 6361326, 5636667, 5031051, 4523805, 4098367, 3740925, 3438524, 3179473, 2954701, 2757735, 2583798, 2429377, 2291886, 2168972, 2058403, 1958852, 1870009, 1791361, 1721432, 1658717, 1602605, 1552555, 1506778, 1462619, 1418211]
60941A418211m5018m5156m4676m3548m1941m0415l9326l8257l6499l3907l0959
60930I78509k8129k5592k3332k1257j9264j7362j5632j3964j2120j0224q758p919
60918G74956p265o385n525n083m752l806k192p60k39l32j36Q40K195L112L096
60903G47724K374J606J201R78N92P2l74r35k148m125o229p728q518q977r305r383
60887F96825r158q877q771q726q450p887p413p497q178q983r348r069q279p166
60873E79023n938m961m567m680m792m466l645k543j387l93K92P73J341K069K656
60858E48782K866K951L334M020M588M727M446L827K872J809J195J456K417L502
60844E92792M322M807M838M107K544N93j154k453l384m057m585n139n610n473
$$ y = [1418211, 1373193, 1328037, 1283361, 1239813, 1197872, 1157457, 1118131, 1079874, 1043375, 1009468, 978509, 950380, 924788, 901456, 880199, 860935, 843573, 827941, 813977, 801857, 791633, 782875, 774956, 767691, 761306, 755781, 750698, 745946, 742140, 739948, 739188, 738949, 738617, 738481, 739321, 741516, 744628, 747724, 750098, 751704, 752905, 753883, 754475, 754547, 754173, 753238, 751090, 746965, 740736, 733008, 724490, 715513, 706208, 696825, 687667, 678790, 670019, 661293, 652843, 644956, 637543, 630046, 621868, 612885, 603537, 594468, 586189, 579023, 573085, 568124, 563557, 558877, 554085, 549619, 545974, 543431, 542044, 541651, 541943, 542716, 544057, 546126, 548782, 551648, 554599, 557933, 561953, 566541, 571268, 575714, 579541, 582413, 584222, 585417, 586873, 589290, 592792, 597114, 601921, 606759, 610866, 613410, 614003, 612849, 610396, 607012, 602955, 598370, 593231, 587621, 582148]
60830E82148m497l400l171l744m169m133m316m944n093m213l293l401l874l363
60816E26537k172j872k804l638l670l869m952o006n995n439n368n557n033l788
60802D66374k737k323k270k384k645k658k070j369j305j633j436o85l59q17j158
60787D40525o35K63P70J103J981L290M113L849K748J377J58n30l62N54J588K172
60771D62964K366K603K985L136K793K218J799J540J221Q83O87M48j63r23j160
60756D83397p11k07j55l19l64n41j205k031k349k031j510j089p12l48j47k34o46
60739D68798j433k539l711m717n480n864n652m996m531m573m611l975k729j477
60725D12510n94j20n1j91nP89J697K035J773J286O60j16n49j03R12J638J821J895
$$ y = [582148, 577651, 574251, 571080, 567336, 563167, 559034, 554718, 549774, 544681, 540468, 537175, 533774, 529900, 526537, 524365, 522493, 519689, 516051, 512381, 508512, 503560, 497554, 491559, 486120, 480752, 475195, 470162, 466374, 463637, 461314, 459044, 456660, 454015, 451357, 449287, 447918, 446613, 444980, 443544, 442859, 442500, 441683, 440525, 439890, 440153, 440923, 442026, 444007, 447297, 451410, 455259, 458007, 459384, 459542, 459012, 458650, 459204, 460792, 462964, 465330, 467933, 470918, 474054, 476847, 479065, 480864, 482404, 483625, 484508, 485195, 485643, 485480, 484557, 483397, 482686, 482479, 482324, 482005, 481641, 481100, 479895, 477864, 475515, 473484, 471974, 470885, 470173, 469825, 469678, 469444, 468798, 467365, 464826, 461115, 456398, 450918, 445054, 439402, 434406, 429875, 425302, 420691, 416716, 413987, 412510, 411916, 411796, 411745, 411554, 411549, 412338, 414035, 416070, 417843, 419129, 419789, 419673, 419124, 419021, 419933, 421571, 423392, 425287]
60707D25287K051K040J900K072K626L117L371L686M106M113L400K299J302O34
60693D62004M66Q99J501J469O72k5J56R22J356J030L02j93j8Q10J771K206J966
60676D77294J567J557J932K254K190J786J291Q45L26m33j324k068k716l607m652
60661D76242n125m613l713l229l025k379j162Q0J010J703K057J844J401J441K086
60646D64618K730K953K877K558J763N64n51j357k064k687k898k673k501k666k881
60631D57785k790k354j615o46J98N20M28L61L38J36L5N42J377J657J260R98J211
60614D59441J240O70P6L6L36O34J051J500J371N22k49m04m58q97j174p66l00n65
60596D62064j056p41K25P67O83Q77J848K990L597L646L352K720J899J332J186
$$ y = [425287, 427338, 429378, 431278, 433350, 435976, 439093, 442464, 446150, 450256, 454369, 457769, 460068, 461370, 462004, 462470, 463369, 464870, 466339, 467011, 466986, 467142, 468064, 469420, 470450, 470752, 470559, 470541, 471351, 473122, 475328, 477294, 478861, 480418, 482350, 484604, 486794, 488580, 489871, 490716, 491042, 490609, 489285, 487217, 484501, 480894, 476242, 471117, 466504, 462791, 459562, 456537, 454158, 452996, 453076, 454086, 455789, 457846, 459690, 461091, 462532, 464618, 467348, 470301, 473178, 475736, 477499, 478063, 477512, 476155, 474091, 471404, 468506, 465833, 463332, 460666, 457785, 454995, 452641, 451026, 450380, 450578, 451098, 451526, 451887, 452225, 452361, 452396, 452938, 454315, 455972, 457232, 458230, 459441, 460681, 461351, 461427, 461463, 461799, 462433, 463484, 464984, 466355, 466877, 466628, 466224, 465766, 464869, 463695, 462929, 462629, 462064, 461008, 460267, 460492, 461259, 461942, 462819, 464667, 467657, 471254, 474900, 478252, 480972, 482871, 484203, 485389]
60581D85389J002K29j039k034j939o51R82J914K037K288L393M914O053O929Q402
60566E17869J0664J2793J3883J4118J4406J5157J5754J5192J3111J0025O641L192
60554F62805l00l515o044p975r622j0633j0091p784m706k044j29J236K135K792
60540F06125L859N824Q317J0649J2742J5045J7663K0053K1567K1944K1340K0019
60528G85147J7973J4807J0299N076K42l683o943r574j1039j1161j0670j0304r951
60515G60219r242q313p403o236m600k977j924j173j58J043K063L199N095P679
60501G37272J0367J3243J7075K2078K7515L2760L7994M3525M8995N3656N7094
60490A101574N9350O0539O0551N8992N5330M9258M0961L0903J9422O734o745k0322
$$ y = [485389, 486391, 486620, 485581, 483547, 481608, 480957, 481939, 483853, 485890, 488178, 491571, 496485, 502538, 509467, 517869, 528533, 541326, 555209, 569327, 583733, 598890, 614644, 629836, 642947, 652972, 659613, 662805, 662505, 658990, 652946, 644971, 635349, 624716, 614625, 606841, 602135, 600091, 599962, 601198, 603333, 606125, 609984, 615808, 624125, 634774, 647516, 662561, 680224, 700277, 721844, 743788, 765128, 785147, 803120, 817927, 828226, 833302, 833544, 829861, 822918, 813344, 802305, 791144, 780474, 770170, 760219, 750977, 742664, 735261, 729025, 724425, 721448, 719524, 718351, 718193, 719236, 721299, 724498, 729593, 737272, 747639, 760882, 777957, 800035, 827550, 860310, 898304, 941829, 990824, 1044480, 1101574, 1160924, 1221463, 1282014, 1341006, 1396336, 1445594, 1486555, 1517458, 1536880, 1543614, 1536869, 1516547]
60478A516547l3308m5122n5137o2569o6738o7558o5839o2842n9290n4925m9400
60467H93819m3307l7788l3232k9152k5362k2351k0202j8167j5813j3789j2713
60456F21943j2045j0937r569q768q626q468p964p332o623n631m580m024l958l710
60442E19708k997k378k369k566k104q23M15O51j16j008j350j332j465j687j598
60427D98981j217q91n92j41Jp96j872j545N96K721K954J639N55N33R53J105J015
60410E03999R96J229J725K224K326K016J760J725J493R08N57Q90J560K202L018
60395E28628L916L977K837J734J998L131L619L134K579K393K161J824J886K424
60381E66241K954L315L723M002L791L398L434L663L300K417J909K058K196J941
$$ y = [1516547, 1483239, 1438117, 1382980, 1320411, 1253673, 1186115, 1120276, 1057434, 998144, 943219, 893819, 850512, 812724, 779492, 750340, 724978, 702627, 682425, 664258, 648445, 634656, 621943, 609898, 598961, 589392, 580624, 571998, 563530, 555566, 548234, 541611, 535980, 531400, 527376, 523418, 519708, 516711, 514333, 511964, 509398, 507294, 506471, 506886, 507537, 507421, 506413, 505063, 503731, 502266, 500579, 498981, 497764, 496873, 496281, 496140, 496141, 495345, 493473, 491928, 492524, 495245, 498199, 499838, 500393, 500926, 501879, 502984, 503999, 504995, 506224, 507949, 510173, 512499, 514515, 516275, 518000, 519493, 520401, 520958, 521848, 523408, 525610, 528628, 532544, 536521, 539358, 541092, 543090, 546221, 549840, 552974, 555553, 557946, 560107, 561931, 563817, 566241, 569195, 572510, 576233, 580235, 584026, 587424, 590858, 594521, 597821, 600238, 602147, 604205, 606401, 608342]
60367F08342J764K061K488K449J656J71j346j740o03R09J392J163J643L095M317
60352F27761M653M821N496O397P137P809Q238P826O568N213L995K297m4k178l578
60337F92411m818o373p682q095p905p672p339o690o014n633n386n107n003n020
60323F03674m625l788l354l751m079l292j721n32j13J61Q75K070L604N325O988
60308E97442Q470R980J1714J3499J5015J6144J6801J6777J6089J5114J4068J2590
60296G63703J0141O564K036l077q058j1953j4214j5003j4635j3234j1145r193
60284F81932q012p338o490n353m530m515n080n494n323m909m950n561o010n618
60270F02749m596l652l177l228l844m688m770l530j900j368j992k434j889r17
$$ y = [608342, 610106, 612167, 614655, 617104, 618760, 618931, 617585, 615845, 615242, 616151, 617543, 618706, 620349, 623444, 627761, 632414, 637235, 642731, 649128, 656265, 664074, 672312, 680138, 686706, 691919, 695914, 698211, 698167, 695989, 692411, 687593, 681220, 673538, 665443, 657538, 649866, 642527, 635837, 629823, 624190, 618804, 613697, 608694, 603674, 599049, 595261, 591907, 588156, 584077, 580785, 579064, 578532, 578419, 578580, 579455, 581525, 585129, 590454, 597442, 605912, 615892, 627606, 641105, 656120, 672264, 689065, 705842, 721931, 737045, 751113, 763703, 773844, 780408, 782444, 779367, 771309, 759356, 745142, 730139, 715504, 702270, 691125, 681932, 673920, 666582, 660092, 654739, 650209, 645694, 640614, 635120, 629797, 624888, 619938, 614377, 608367, 602749, 598153, 594501, 591324, 588096, 584252, 579564, 574794, 571264, 569364, 567996, 566004, 563570, 561681, 560764]
60256E60764j67M56J055J218Q50O36J087J894K599L179L501L051J803O65M29Q21
60240E83841J046P04j86j407k343k304j479q70q37n40O11J875K359K470L169M379
60224E90488N209N413N561N898O031N879O109P300R105J0575J1123J0996J0880
60211F90567J1225J2009J3035J4031J4407J3490J1544R984R821J0308J0097R269
60199H29787Q931R017Q117N790L464K397K029J266J35p50j484k542l874n171o475
60184H50637p718q308q018p608p856q495q829q784q536p801o381m859l929l455
60170G50060k959k544k551k821l034l219l302k771j619q62j175j759j561r03o74
60155G18306n70L39J707K172J469Q19R96J393J357J220J447J749J675J392J261
$$ y = [560764, 560597, 561053, 562108, 563326, 564176, 564812, 565899, 567793, 570392, 573571, 577072, 580123, 581926, 582591, 583020, 583841, 584887, 585591, 585405, 583998, 581655, 579351, 577872, 577002, 576165, 575625, 576236, 578111, 580470, 582940, 586109, 590488, 595697, 601110, 606671, 612569, 618600, 624479, 630588, 637888, 646993, 657568, 668691, 679687, 690567, 701792, 713801, 726836, 740867, 755274, 768764, 780308, 790292, 800113, 810421, 820518, 829787, 838718, 847735, 855852, 861642, 865106, 867503, 869532, 870798, 870933, 870183, 868699, 866157, 862283, 857112, 850637, 842919, 834611, 826593, 818985, 811129, 802634, 793805, 785021, 776485, 768684, 762303, 757444, 753515, 750060, 747101, 744557, 742006, 739185, 736151, 732932, 729630, 726859, 725240, 724378, 723203, 721444, 719883, 718980, 718306, 717736, 718075, 719782, 721954, 723423, 724242, 725238, 726631, 727988, 729208, 730655, 732404, 734079, 735471, 736732]
60140G36732J225J101J124J710K913M418N869O958P409P118O385N820N884O383
60126H01049O544N859M831M435M834N229N062M713M682M859N045N509O391P085
60112H76127O887N796M143K009l53k126k819l124m117n849p480q444q750q488
60098H43412p815p182o762n993m470k986k707l479l928l216j876q22l47k66l20
60083G91243l31l92r62k283l809m721m919m949n121n279n399n761o507p446q280
60068G25084q664q296p393o746o793o929o373n336m612m333l968l376k948k708
60054F46609k154j063J95J322K363L282L876M205M633N297O001O590P077P409
60040F95642P525P577P643P423O656N647M809L933K437K67j997l796m864n151
$$ y = [736732, 737957, 739058, 740182, 741892, 744805, 749223, 755092, 762050, 769459, 776577, 782962, 788782, 794666, 801049, 807593, 813452, 818283, 822718, 827552, 832781, 837843, 842556, 847238, 852097, 857142, 862651, 869042, 876127, 883014, 888810, 892953, 894962, 894609, 892483, 889664, 886540, 882423, 876574, 869094, 860650, 851900, 843412, 835597, 828415, 821653, 815660, 811190, 808204, 805497, 802018, 798090, 794874, 792998, 792176, 791829, 791563, 791243, 790912, 790520, 789558, 787275, 783466, 778745, 773826, 768877, 763756, 758477, 753078, 747317, 740810, 733364, 725084, 716420, 708124, 700731, 693985, 687192, 680263, 673890, 668554, 663942, 659609, 655641, 652265, 649317, 646609, 644455, 643392, 643587, 644909, 647272, 650554, 654430, 658635, 663268, 668565, 674566, 681156, 688233, 695642, 703167, 710744, 718387, 725810, 732466, 738113, 742922, 746855, 749292, 749559, 747562, 743766, 738902, 733751]
60026G33751m980n079n826o722p191p585q628j0205j1490j2073j2126j1678j0613
60013F19555r356q576q152p345o064n065m694m325l408k376j975k212k342j706
59999E51959l10J141J803J493R26R43J619K457L145L732M277M812N469O171O481
59984E96118O194N767N560N065L585J379o34k085l319m545n551o175o375o029
59970E88955n299m858n048n141m279k840j891j603j266p07m55n22k42N44J209
59955E56557J499J975K879L590L593L243L078L069K894K530K267K461L210L901
59941E96746L343J070j736l403l620l283k859k135j384j273j441n86J522L503
59927E84464M413N055O460Q149Q940Q638P930P139O062M704L335K033P54k75p63
$$ y = [733751, 728771, 723692, 717866, 711144, 703953, 696368, 687740, 677535, 666045, 653972, 641846, 630168, 619555, 610199, 601623, 593471, 586126, 580062, 574997, 570303, 565978, 562570, 560194, 558219, 556007, 553665, 551959, 551649, 552790, 554593, 556086, 557012, 557955, 559574, 562031, 565176, 568908, 573185, 577997, 583466, 589637, 596118, 602312, 608079, 613639, 618704, 622289, 623668, 623034, 620949, 617630, 613085, 607534, 601359, 594984, 588955, 583656, 578798, 573750, 568609, 564330, 561490, 559599, 557996, 556730, 556023, 555568, 555046, 554804, 555348, 556557, 558056, 560031, 562910, 566500, 570093, 573336, 576414, 579483, 582377, 584907, 587174, 589635, 592845, 596746, 600089, 601159, 599423, 596020, 592400, 589117, 586258, 584123, 582739, 581466, 580025, 579439, 580961, 584464, 588877, 593932, 600392, 608541, 617481, 626119, 634049, 641188, 647250, 651954, 655289, 657322, 658076, 657801, 657038]
59912F57038p87o49m69k33J2K03L59M47L29m4n80j140j444j079jJ085J432J218
59894F55697J299K084L291M661O107P204P404O909O575O750P008P098P413Q183
59880G37683R010R459R502R155Q280P023N776M600L281K029J243M72j419m643
59866H01451p869r684j0028r746r416r081q616p792o430m799l573l108l114l054
59852G05141k490j128Q52K528L077K929L332M737O457P921R240J0325J0488R415
59838G72824P591N427K870L68p89J87K546M843O271O668N961M253K035k52k481
59823H18322m438n710o308o800p557q364q968r331r189q178o732n953o247o851
59809G17696p016o700n779l846j405j64j083k906l634k855j714j147j171j537
$$ y = [657038, 656251, 655602, 655133, 654900, 654912, 655115, 655474, 655921, 656250, 656206, 655626, 654486, 653042, 651963, 651962, 653047, 654479, 655697, 656996, 659080, 662371, 667032, 673139, 680343, 687747, 694656, 701231, 707981, 714989, 722087, 729500, 737683, 746693, 756152, 765654, 774809, 783089, 790112, 795888, 800488, 803769, 805798, 807041, 807513, 806094, 801451, 793582, 783898, 773870, 764124, 754708, 745627, 737011, 729219, 722789, 717990, 714417, 711309, 708195, 705141, 702651, 701523, 702375, 704903, 707980, 710909, 714241, 718978, 725435, 733356, 742596, 752921, 763409, 772824, 780415, 785842, 788712, 789080, 788291, 788478, 791024, 795867, 802138, 808806, 814767, 819020, 821055, 820803, 818322, 813884, 808174, 801866, 795066, 787509, 779145, 770177, 760846, 751657, 743479, 736747, 730794, 724547, 717696, 710680, 703980, 698201, 694355, 692950, 692786, 691703, 688797, 685163, 682308, 680594, 679447, 678276, 676739]
59795F76739k044k317k071j636j623k072k394k107j336n97l52n90p92m98Q8K91
59779F56689j73r23j460j554j195o19k66k18J18J120K110K266J999K296K998L105
59763F66293K690K942M086M888M651M242M517N186N897O991Q348Q926Q403Q021
59749G46081Q719R615R442Q376P290O302N260M642M769M913M417L831L792L674
59735H31123K719J645J636K431K881K836K992L283K928J877Q49J52l56m25K80
59720H56851J192J363P69M2p76j975l037l066k317j958k274k398j835j069m93
59705H39019P2N79O69O53J472L231M693M838M066L378L073K878K772K959L284
59690H77636L257K625J654P26q1r60j863k306j990j516j927l368m822n441n595
$$ y = [676739, 674695, 672378, 670307, 668671, 667048, 664976, 662582, 660475, 659139, 658542, 658190, 657600, 656808, 656310, 656398, 656689, 656516, 655593, 654133, 652579, 651384, 650765, 650499, 650281, 650399, 651519, 653629, 655895, 657894, 660190, 663188, 666293, 668983, 671925, 676011, 680899, 685550, 689792, 694309, 699495, 705392, 712383, 720731, 729657, 738060, 746081, 754800, 764415, 773857, 782233, 789523, 795825, 801085, 805727, 810496, 815409, 819826, 823657, 827449, 831123, 833842, 835487, 837123, 839554, 842435, 845271, 848263, 851546, 854474, 856351, 857200, 857352, 856996, 856571, 856851, 858043, 859406, 860175, 860217, 859441, 857466, 854429, 851363, 849046, 847088, 844814, 842416, 840581, 839512, 839019, 839091, 839670, 840339, 840992, 842464, 845695, 850388, 855226, 859292, 862670, 865743, 868621, 871393, 874352, 877636, 880893, 883518, 885172, 885898, 885817, 884857, 882994, 880688, 878698, 877182, 875255, 871887, 867065, 861624, 856029]
59675H56029o094p049q007q740r201r078q168o957o178n878n391m205k438o54
59661G67991N63J025J208J826K913L791M069M166M607N359O203P055P608P296
59647H25680N985M075J654j582n254q143r630j0315j0692j0395r517r261j0166
59634G52439j0795r618p263n553n000m794m580m702n048n151n296o140p387q021
59620F63091p786p200o387n107l851l583m187m403l511k122j096n17j5O22J409
59605F15357K249K955L478L880L872K921J270J32J88O36M92K6q9j99r17j630j302
59588F33319l13k6p24j506k009k668l266k851j426l43n00j295j759j773j647j399
59572F09814r35m31j56k67p86j427j579r90k14J71L43O58P55J22q97j557j758
$$ y = [856029, 849935, 842886, 834879, 826139, 816938, 807860, 799692, 792735, 786557, 780679, 775288, 771083, 768645, 767991, 768554, 769579, 770787, 772613, 775526, 779317, 783386, 787552, 792159, 797518, 803721, 810776, 818384, 825680, 831665, 835740, 837394, 835812, 830558, 822415, 812785, 802470, 791778, 781383, 771866, 762605, 752439, 741644, 732026, 724763, 719210, 714210, 709416, 704836, 700134, 695086, 689935, 684639, 678499, 671112, 663091, 655305, 648105, 641718, 636611, 632760, 629177, 624990, 620587, 617076, 614954, 613858, 613341, 613326, 613948, 615357, 617606, 620561, 624039, 627919, 631791, 634712, 635982, 636114, 636302, 636938, 637430, 637456, 637367, 637168, 636251, 634621, 633319, 633006, 632980, 632256, 630750, 628741, 626073, 622807, 619956, 618530, 618187, 617687, 616392, 614633, 612860, 611213, 609814, 608879, 608448, 608292, 608025, 607239, 605812, 604233, 603243, 603029, 603200, 603543, 604201, 604956, 605078, 604181, 602624, 600866]
59555F00866j744j249m7J120J346R59R98J594K133K593L453M397M621M325M640
59540F30005O036P964J0064J2566J5551J8852K2359K5118K4629J8932R580R14
59528H02570m062n785o081n727m593k782o63J401K740K595R82j250l397n239o587
59513G64122p441q463j0252j2151j2908j2452j1839j1452j0605q997p277n939
59501F44346m909m319m461m837m515l563k850k391j344J97J019P82O87J573K748
59486F18163L319L388L351L215L178L760M750N149M621L960L752L694L673M181
59472F72154N162N676N366N042N257N408M888M030L256K371J384R68J435K193
59458G24590K785L574M860O297P651R137J0558J1090J0452R337Q253O993N502
$$ y = [600866, 599122, 597873, 597826, 598946, 600292, 601251, 602249, 603843, 605976, 608569, 612022, 616419, 621040, 625365, 630005, 636041, 644005, 654069, 666635, 682186, 701038, 723397, 748515, 773144, 792076, 801656, 802570, 798508, 792723, 786642, 780915, 776322, 773540, 772877, 774278, 777018, 779613, 780595, 779345, 775948, 770709, 764122, 756681, 748218, 737966, 725815, 712907, 700455, 688616, 677164, 666559, 657562, 650285, 644346, 639437, 635118, 630657, 625820, 621305, 617742, 614892, 612501, 611157, 611354, 612373, 613155, 613842, 615415, 618163, 621482, 624870, 628221, 631436, 634614, 638374, 643124, 648273, 652894, 656854, 660606, 664300, 667973, 672154, 677316, 682992, 688358, 693400, 698657, 704065, 708953, 712983, 716239, 718610, 719994, 720962, 722397, 724590, 727375, 730949, 735809, 742106, 749757, 758894, 769452, 780542, 790994, 800331, 808584, 815577, 821079]
59445H21079M139K643J57l173n869p094p722q809j0036j0469r825q403o666n346
59431G44606m912m599l115o32J281K014K717M198N802P109R047J2199J5506J7783
59417H09004J9272K0589K1473K1647K1776K2479K3553K4936K6763K7375K3220
59406A062087J2678j157j3137k0468k3165k1803j7167j1134n452J63O629J2333
59394I80407J3384P631k910j3857k1673k5123k4949k2704j9464j5504j1223p713
59382H36302n659m349k647n15J316K631L669M216L881L026K496K473K434K084
59368H51358J674J451J487J828K371K765K910L215M014N111O283P635R105J0251
59354I11458J0981J1886J3258J4579J5522J6679J8620K0845K2388K2872K2449
$$ y = [821079, 825218, 827861, 828018, 824845, 818976, 811882, 804160, 795351, 785315, 774846, 765021, 756618, 749952, 744606, 739694, 735095, 731980, 731348, 732629, 734643, 737360, 741558, 747360, 754469, 763516, 775715, 791221, 809004, 828276, 848865, 870338, 891985, 913761, 936240, 959793, 984729, 1011492, 1038867, 1062087, 1074765, 1073608, 1060471, 1040003, 1016838, 995035, 977868, 966734, 961282, 961445, 968074, 980407, 993791, 1001422, 998512, 984655, 962982, 937859, 912910, 890206, 870742, 855238, 844015, 836302, 830643, 826294, 823647, 823132, 824448, 827079, 830748, 834964, 838845, 841871, 844367, 846840, 849274, 851358, 853032, 854483, 855970, 857798, 860169, 862934, 865844, 869059, 873073, 878184, 884467, 892102, 901207, 911458, 922439, 934325, 947583, 962162, 977684, 994363, 1012983, 1033828, 1056216, 1079088, 1101537]
59343A101537K1316J9880J8677J7527J5471J2139Q328M721R46l374p626j1070
59331A198472j3816j6090j7494j7925j8322j9379k0286j9870j8373j7013j6354
59320A003550j6090j5901j5538j4563j2986j1688j1419j1757j1868j1712j1800
59309H58228j2149j2334j2118j1408j0105q487p168o224m996l151j089J038L597
59296G73634O411Q644J0250J1993J3332J1956O709m82o753j1072j3630j4087j2285
59283G84620r530p289n353k744L47L104N671Q558J1221J2873J4083J5977J8340
59270H49878K0000K0525K0239J9154J7267J5235J3441J1149P895M693K364j67
59258A001673m095q266j0592j1130j1566j2297j2305j1564j1143j1011r901p590
$$ y = [1101537, 1122853, 1142733, 1161410, 1178937, 1194408, 1206547, 1214875, 1219596, 1220542, 1217168, 1209542, 1198472, 1184656, 1168566, 1151072, 1133147, 1114825, 1095446, 1075160, 1055290, 1036917, 1019904, 1003550, 987460, 971559, 956021, 941458, 928472, 916784, 905365, 893608, 881740, 870028, 858228, 846079, 833745, 821627, 810219, 800114, 791627, 784459, 778235, 773239, 770088, 768999, 770037, 773634, 780045, 788689, 798939, 810932, 824264, 836220, 842929, 842447, 835694, 824622, 810992, 796905, 784620, 775090, 767801, 762448, 759704, 760051, 763155, 768826, 777384, 788605, 801478, 815561, 831538, 849878, 869878, 890403, 910642, 929796, 947063, 962298, 975739, 986888, 994783, 999476, 1001840, 1001673, 997578, 989312, 978720, 967590, 956024, 943727, 931422, 919858, 908715, 897704, 887803, 880213]
59246H80213n335l868k629j189K36J723L577N313O282P120Q814J0579J0581Q773
59232I30190P026O251N328L257N04k225m845p074q351r062j0360j2262j3475j3424
59218H71478j3042j3038j2910j2161j1115j0025q673p331o778o890o565n445m393
59205G53112l786k838j252p9j52p80q29j44Q19J805K610K924K925L234L944M503
59189G66016M869N713P057P810P298O307N996O531P311P812P708O904N895N452
59175H58679N525N197M081L039K976L638M122M169M316N048O127O734O122M334
59161I24107K177L29j305l180n421p914j0549j2871j4103j4118j3875j4164j4519
59148H14594j4095j3027j2032j1331j0783j0494j0287r382p684o557o969p785
$$ y = [880213, 874878, 871010, 868381, 867192, 867428, 869151, 872728, 878041, 884323, 891443, 900257, 910836, 921417, 930190, 937216, 943467, 948795, 952052, 952556, 950331, 945486, 938412, 930061, 920999, 910639, 898377, 884902, 871478, 858436, 845398, 832488, 820327, 809212, 799187, 790514, 783183, 776405, 769515, 762950, 757505, 753112, 749326, 746488, 745236, 745157, 745005, 744225, 743396, 743252, 744071, 745876, 748486, 751410, 754335, 757569, 761513, 766016, 770885, 776598, 783655, 791465, 798763, 805070, 811066, 817597, 824908, 832720, 840428, 847332, 853227, 858679, 864204, 869401, 873482, 876521, 879497, 883135, 887257, 891426, 895742, 900790, 906917, 913651, 919773, 924107, 926284, 926613, 925308, 922128, 916707, 908793, 898244, 885373, 871270, 857152, 843277, 829113, 814594, 800499, 787472, 775440, 764109, 753326, 742832, 732545, 723163, 715479, 708922, 701953, 694168]
59136F94168p330n887m969m777m272l287k594k098r30P15J707J997K698M088N286
59121F74515O013O952Q180Q995R535J0775J2619J3709J3513J2974J2675J2098
59109H02553J1040J0143R470Q168O106M347L374K353P36q38j896k919m163m976
59095H43498m931m525m220l835l298k818k158r60O3k74j613k290j893j791k700
59080H06255l579l750m232n856p585q050p531p193p266p160o645n903m971l883
59066G22651l002k713l095m022n098n599n190m486m077l434j933m29k58j100j544
59051F76671j479j905k544j962k41Q23O70P19J480J427j31j421r33J23j66j577
59035F69554k591k763k586k080j054l7L86N90J296K499L816N167O501P572Q495
$$ y = [694168, 686838, 680951, 675982, 671205, 666933, 663646, 661052, 658954, 658024, 658739, 660446, 662443, 665141, 669229, 674515, 680528, 687480, 695660, 704655, 714190, 724965, 737584, 751293, 764806, 777780, 790455, 802553, 813593, 823736, 833206, 841374, 847480, 851827, 855201, 857554, 858290, 857452, 855556, 852637, 848474, 843498, 838567, 834042, 829822, 825987, 822689, 819871, 817713, 816753, 816816, 816542, 814929, 812639, 810746, 808955, 806255, 802676, 798926, 794694, 788838, 781253, 773203, 765672, 758479, 751213, 744053, 737408, 731505, 726534, 722651, 719649, 716936, 713841, 709819, 704721, 699122, 693932, 689446, 685369, 681935, 680002, 679573, 679315, 678215, 676671, 675192, 673287, 670743, 668781, 668540, 669363, 670033, 670752, 672232, 673659, 673528, 672107, 671174, 671297, 671131, 669554, 666963, 664200, 661614, 659534, 658480, 658443, 658829, 659419, 660715, 663214, 667030, 672197, 678698, 686270, 694765]
59020F94765R691J0896J1214J0441R246P818N670L085J205K38q45k311l081k713
59006G55319k255k248j668J64K152L069L240L587M221M959N924O815O821O041
58992G96141N578N616M945L189J675J220Q30l26j424j673j730k085j722J30K469
58977H12833M195N822P980R821J0571J1265J3112J5340J6504J6923J7930J9437
58965I61733K0103J9478J8397J7526J6713J5477J3340J0149O646L974K067n26
58953A105077m639r404j3701j7319k0067k1316k1282k1216k1378k0465j8009j5603
58941I00678j4517j3900j2632j1200j0241q993o862m945m251l876k733j570j476
58928H03482j719j091j23J6l26j83L7n38j294j054k26r7o99j087j044q07J03K054
$$ y = [694765, 704456, 715352, 726566, 737007, 746253, 754071, 759741, 762826, 764031, 764269, 763424, 761113, 758032, 755319, 753064, 750816, 749148, 749312, 751464, 754533, 757773, 761360, 765581, 770540, 776464, 783279, 790100, 796141, 801719, 807335, 812280, 815469, 817144, 818364, 819194, 818868, 817444, 815771, 814041, 811956, 810234, 810364, 812833, 817028, 822850, 830830, 840651, 851222, 862487, 875599, 890939, 907443, 924366, 942296, 961733, 981836, 1001314, 1019711, 1037237, 1053950, 1069427, 1082767, 1092916, 1099562, 1103536, 1105603, 1105077, 1100438, 1091034, 1077333, 1060014, 1039947, 1018631, 997349, 976133, 954755, 934290, 916281, 900678, 886161, 872261, 859629, 848429, 838188, 829195, 822333, 817388, 813137, 809261, 806528, 804958, 803482, 801763, 800672, 800549, 800565, 800239, 800056, 800093, 799555, 798261, 797207, 796981, 796884, 796185, 795098, 794054, 793247, 793350, 795404]
58910G95404L957M439L832L518L971M874O360Q624J0963J2558J3644J4729J5560
58897I02433J5993J6774J8155J8907J8152J6930J6567J6815J7142J8392K1230
58886A097490K4262K5690K5669K5128K3474J9770J5092J1424Q867O118K922m4
58874A285862k987o510r861j1757j2522j3340j3969j3205j1240r573q805q353
58862A163740q032q225q808r474j0618j2515j4248j4992j5560j7035j8655j8850
58850A006728j7622j6160j4915j3815j3495j4360j5240j4796j3570j2830j2349
58839H47576j1269j0135r932j0065r485q906r491j0247r302p099n684n269m203
58826G36489k118m58J51O69J680K750L901N591P256P741P211O868O890O436N539
$$ y = [795404, 799361, 803800, 807632, 811150, 815121, 819995, 826355, 834979, 845942, 858500, 872144, 886873, 902433, 918426, 935200, 953355, 972262, 990414, 1007344, 1023911, 1040726, 1057868, 1076260, 1097490, 1121752, 1147442, 1173111, 1198239, 1221713, 1241483, 1256575, 1267999, 1276866, 1282984, 1285906, 1285862, 1282875, 1276365, 1266504, 1254747, 1242225, 1228885, 1214916, 1201711, 1190471, 1180898, 1172093, 1163740, 1155708, 1147483, 1138675, 1129201, 1118583, 1106068, 1091820, 1076828, 1061268, 1044233, 1025578, 1006728, 989106, 972946, 958031, 944216, 930721, 916361, 901121, 886325, 872755, 859925, 847576, 836307, 826172, 816240, 806175, 796690, 787784, 778293, 768046, 758744, 751645, 745961, 740692, 736489, 734371, 733913, 734064, 734733, 736413, 739163, 743064, 748655, 755911, 763652, 770863, 777731, 784621, 791057, 796596]
58811G96596N179N590O006N860M889K743m6j726j602j490l041n002n409n075o017
58796G97455p673p865o771o618p749q234p348o343n594m042j752k28K61J138K910
58781G31547M469N240N723N801M870L762M046N241N135L031L83j886m191o417
58767G66754p708q338r362j0331r844q313p580p732p068n383m337m264l493j506
58753F71495K3J47J3N45J164J476K039K808L051L236M725P208Q753Q756Q511Q602
58737G32552Q258P556P640Q336Q219P420P658R026R560Q612P807P991Q009P321
58723H45965P023P411P292O588O940Q788J0465J1106J1825J3110J3750J3243J2578
58710I76084J1683Q928M253l2k755n426r066j2382j4526j6870k0308k3387k4785
$$ y = [796596, 801775, 807365, 813371, 819231, 824120, 826863, 826817, 825091, 823489, 821999, 818958, 813956, 808547, 803472, 797455, 789782, 781917, 775146, 768528, 760779, 752545, 745197, 738854, 733260, 729218, 727466, 727238, 727499, 728637, 731547, 736016, 741256, 746979, 752780, 757650, 761412, 765458, 770699, 775834, 778865, 779248, 777362, 773171, 766754, 759046, 750708, 741346, 731015, 721171, 712858, 705278, 697546, 690478, 685095, 680758, 676494, 673001, 671495, 671518, 671665, 671678, 672223, 673387, 674863, 676902, 679710, 682761, 685997, 690722, 697930, 706683, 715439, 723950, 732552, 740810, 748366, 756006, 764342, 772561, 779981, 787639, 796665, 806225, 814837, 822644, 830635, 838644, 845965, 852988, 860399, 867691, 874279, 881219, 890007, 900472, 911578, 923403, 936513, 950263, 963506, 976084, 987767, 996695, 1000948, 1000916, 998161, 992735, 983669, 971287, 956761, 939891, 919583, 896196, 871411]
58697H71411k5361k6028k5901k4239k2094k0435j8605j6112j3962j2777j1533
58686F54364r521p687o792o136n304n168n990o485n927n198m834m095k837k102
58672E76288j908q20J293K608K487K736M476O370P325Q366J0265J1763J1698J0668
58658F53615R132O162J596k798n757p947r779j0227r112q111q047p618o174n163
58644E89772n316n085l534k166k127k122r45M61J191K125L681M353L420K570K952
58629E89230L070J654l5p10j326k669l263j960k82J82L36J383K400K439K646L994
58613E97089N161N031M907N892O526N577M682N424O143M725K438J798K471K436
58599F60300J642J358J246J01j540k210k034k014j830n51J474L412N495P985R996
$$ y = [871411, 846050, 820022, 794121, 769882, 747788, 727353, 708748, 692636, 678674, 665897, 654364, 644843, 637156, 630364, 624228, 618924, 613756, 607766, 601281, 595354, 590156, 585322, 581227, 578390, 576288, 574380, 573560, 574853, 577461, 579948, 582684, 587160, 593530, 600855, 609221, 619486, 631249, 642947, 653615, 662747, 668909, 670505, 667707, 661950, 654003, 644224, 633997, 624885, 616774, 608727, 601109, 594935, 589772, 584456, 579371, 575837, 573671, 571544, 569422, 568477, 568938, 570129, 572254, 575935, 580288, 583708, 586278, 589230, 592300, 593954, 593919, 593209, 591883, 589214, 585951, 583991, 583709, 583891, 584227, 585610, 588010, 590449, 593095, 597089, 602250, 607281, 612188, 618080, 624606, 630183, 634865, 640289, 646432, 651157, 653595, 655393, 657864, 660300, 661942, 663300, 664546, 664647, 663107, 660897, 658863, 656849, 655019, 654468, 655942, 659354, 664849, 672834, 682830]
58584F82830J1119J2567J4985J6829J6802J5946J5463J4528J2365J0363R817R700
58572H43314Q946Q837J0655J3032J4390J6000J9850K5223L0083L4177L8125M1200
58560A103832M2558M3015M3048M0846L4885K6630J8176R261n18q755j2799j3660
58548A326519j4150j4546j3277j0537q213p153p314r438j3892j9002k3021k6551
58536A159425l0679l4237l5421l4577l2914l0156k6038k2315k0455j9065j6276
58525H57292j3024j1126r980q118o205n546n332m421l993n289o536n521l500l159
58511G65542m197m449l856l774l723k369o91o65j723j799q84m31l55L11R21L66
58495G38224m43j53L78j26m70J034L311M437N135P089R484J0649J1498J3800J6640
$$ y = [682830, 693949, 706516, 721501, 738330, 755132, 771078, 786541, 801069, 813434, 823797, 833614, 843314, 852260, 861097, 871752, 884784, 899174, 915174, 935024, 960247, 990330, 1024507, 1062632, 1103832, 1146390, 1189405, 1232453, 1273299, 1308184, 1334814, 1352990, 1362251, 1361733, 1352978, 1340179, 1326519, 1312369, 1297823, 1284546, 1274009, 1265796, 1258643, 1251329, 1241891, 1227999, 1208997, 1185976, 1159425, 1128746, 1094509, 1059088, 1024511, 991597, 961441, 935403, 913088, 892633, 873568, 857292, 844268, 833142, 823162, 815044, 808839, 803293, 797961, 793540, 789547, 784258, 777722, 772201, 768701, 765542, 761345, 756896, 753040, 749266, 745543, 743174, 742483, 741818, 740095, 738296, 737412, 736981, 736626, 736937, 737858, 738224, 737781, 737628, 738006, 737880, 737410, 738444, 741755, 746192, 751327, 758416, 767900, 778549, 790047, 803847, 820487]
58480H20487J8229J9581K2656K6295K7798K7104K5672K2760J6873R540L575j225
58468A039345o761j2265j5306j6048j6411j6169j3745r913o706l678Q00N688Q732
58455I37563J0622J3619J7094J8607J8312J8071J7195J3327O803R6o226j2889
58443A052194j8454k0704k0597k0706k0713j8557j4901j2149j0136p140l980k584
58431H81573j771Q96M200N133M558N990R518J1933J2215J2008J1337Q813N397
58418I71800L144R05l755r314j2043j2164j2947j4523j4192j2220j1572j2165
58406H60954j1123q637p861q874q402n808l925l586k642p32K03L50J881M238M623
58391H10659L205K807L537K995J514J690K930K134l39j066K02M82l91L26K397
$$ y = [820487, 838716, 858297, 880953, 907248, 935046, 962150, 987822, 1010582, 1027455, 1036995, 1040570, 1039345, 1032584, 1020319, 1005013, 988965, 972554, 956385, 942640, 932727, 926021, 922343, 923143, 928831, 937563, 948185, 961804, 978898, 997505, 1015817, 1033888, 1051083, 1064410, 1071213, 1071309, 1065083, 1052194, 1033740, 1013036, 992439, 971733, 951020, 932463, 917562, 905413, 895277, 888137, 884157, 881573, 879802, 880698, 884898, 890031, 894589, 900579, 910097, 922030, 934245, 946253, 957590, 966403, 971800, 974944, 975849, 972094, 962780, 950737, 938573, 925626, 911103, 896911, 884691, 873119, 860954, 849831, 841194, 833333, 824459, 816057, 810249, 806324, 802738, 800096, 799364, 799567, 799917, 801798, 806036, 810659, 813864, 816671, 820208, 823203, 824717, 826407, 829337, 831471, 831132, 830066, 830268, 830750, 830359, 830685, 833082]
58376H33082K811J963L410P160R453R491J0162J1774J1602J0104J0958J4172J5721
58363I51863J4875J5271J7792J9079J8136J7860J8727J7565J3872J0953R474O330
58351A131797J206k192k791l649n578n694l554k182j826O94N231P656P262Q001
58337A134381J1067J3126J3258J4648J7843J9284J8150J7748J8766J8058J5392
58326A311721J4144J4140J1335N933K992L551L020K9j335K11Q15n18J00L474N540
58311A375152N610Q155J4123J8779K0151K1163K1538J6713P232J94j154n45M20
58298A507531M952J2338J6518J6242J6986K0188K0648J7370J6357J9501K1316
58287A689947K0046K1040K5584K7582K5291K4951K8634L0092K7082K5991K9369
$$ y = [833082, 835893, 837856, 841266, 848426, 857879, 867370, 877532, 889306, 900908, 911012, 921970, 936142, 951863, 966738, 982009, 999801, 1018880, 1037016, 1054876, 1073603, 1091168, 1105040, 1115993, 1125467, 1131797, 1133003, 1130811, 1128020, 1124371, 1118793, 1113099, 1109545, 1107363, 1105537, 1106231, 1111462, 1119118, 1126380, 1134381, 1145448, 1158574, 1171832, 1186480, 1204323, 1223607, 1241757, 1259505, 1278271, 1296329, 1311721, 1325865, 1340005, 1351340, 1357273, 1360265, 1363816, 1366836, 1366865, 1365530, 1365741, 1366556, 1366038, 1366138, 1369612, 1375152, 1380762, 1388917, 1403040, 1421819, 1441970, 1463133, 1484671, 1501384, 1508616, 1508810, 1507656, 1507111, 1507531, 1512483, 1524821, 1541339, 1557581, 1574567, 1594755, 1615403, 1632773, 1649130, 1668631, 1689947, 1709993, 1731033, 1756617, 1784199, 1809490, 1834441, 1863075, 1893167, 1920249, 1946240, 1975609]
58276A975609L0916K8068K7473L2325L6282L5815L6637M1831M5727M5674M7736
58265B384093N4402N8961N8463N9680O5754O9719O7927O6788O9413O9155O3457
58254C087812O0146O2668O3425N9283N8822O6102P2487P3112P5862Q5100R2604
58243C857423R4056R8122J09169J17773J18805J21885J32940J42952J46260J52019
58233E091404J65797J78365J84818J95503K15398K32894K42300K56307K82185
58224G044971L07612L25007L46833L80937M14841M41469M75320N25102N76602
58215A0838694O21742O77039P53068Q35057R15416J014212J144111J288654J440671
58206A9528664J626585J865806K145625K466806K871739L394361M028220M779210
$$ y = [1975609, 2006525, 2034593, 2062066, 2094391, 2130673, 2166488, 2203125, 2244956, 2290683, 2336357, 2384093, 2438495, 2497456, 2555919, 2615599, 2681353, 2751072, 2818999, 2885787, 2955200, 3024355, 3087812, 3147958, 3210626, 3274051, 3333334, 3392156, 3458258, 3530745, 3603857, 3679719, 3764819, 3857423, 3951479, 4049601, 4158770, 4276543, 4395348, 4517233, 4650173, 4793125, 4939385, 5091404, 5257201, 5435566, 5620384, 5815887, 6031285, 6264179, 6506479, 6762786, 7044971, 7352583, 7677590, 8024423, 8405360, 8820201, 9261670, 9736990, 10262092, 10838694, 11460436, 12137475, 12890543, 13725600, 14641016, 15655228, 16799339, 18087993, 19528664, 21155249, 23021055, 25166680, 27633486, 30505225, 33899586, 37927806, 42707016]
58198D2707016N696510O811591Q110750R620553J1453489J3711999J6428681J9672166
58190A34212755K3607912K8334150L3704187L9301465M4264968M6845687M4485407
58183C94756531L5213964J9554843R35027j6146802k8555697l5485501l7763827
58176C32508538l6820492l4147014l0987494k8011661k5274744k2601263j9954564
58169A34711306j7432044j5096013j2959541j1061369r438900q064230o883040
58162E3776169n882526n064259m389659l808751l311573k903441k559704k249235
58154B3607021j975663j754374j572306j406710j260614j145331j048757r53009
58146A2490257q64004p93886p32497o64397n96726n43584m99028m50642m04192
$$ y = [42707016, 48403526, 55215117, 63325867, 72946420, 84399909, 98111908, 114540589, 134212755, 157820667, 186154817, 219859004, 259160469, 303425437, 350271124, 394756531, 429970495, 449525338, 450460365, 434313563, 405757866, 370272365, 332508538, 295688046, 261541032, 230553538, 202541877, 177267133, 154665870, 134711306, 117279262, 102183249, 89223708, 78162339, 68723439, 60659209, 53776169, 47893643, 42829384, 38439725, 34630974, 31319401, 28415960, 25856256, 23607021, 21631358, 19876984, 18304678, 16897968, 15637354, 14492023, 13443266, 12490257, 11626253, 10832367, 10099870, 9435473, 8838747, 8295163, 7796135, 7345493, 6941301]
58137F941301l70613l43203l10958k80633k63464k53082k37703k21464k13215
58128D446966k06532j91113j72763j62559j56602j45097j31372j23912j19070
58119C037946j09076r8144r4083r2531q5453p6723p3905p3033o6660n8756n6797
58108B152785n7036n2148m5746m5058m6618m3317l8445l8956m1727l9979l6681
58097A667074l8220m1262l9038l4497l4323l5943l3119k8596k8588l0282k7289
58086A295917k2111k0981k1546j7997j3332j4268j8412j8644j6124j7078k0466
58075A094958k0455j7704j7024j7090j3288p699n799o446n262m436q928j6131
58063I54696j9591j9839k1487k2822j8804j1651q018p913o410m091n735j0372
$$ y = [6941301, 6570688, 6227485, 5916527, 5635894, 5372430, 5119348, 4881645, 4660181, 4446966, 4240434, 4049321, 3876558, 3713999, 3557397, 3412300, 3280928, 3157016, 3037946, 2928870, 2830726, 2736643, 2644112, 2558659, 2481936, 2408031, 2334998, 2268338, 2209582, 2152785, 2095749, 2043601, 1997855, 1952797, 1906179, 1862862, 1824417, 1785461, 1743734, 1703755, 1667074, 1628854, 1587592, 1548554, 1514057, 1479734, 1443791, 1410672, 1382076, 1353488, 1323206, 1295917, 1273806, 1252825, 1231279, 1213282, 1199950, 1185682, 1167270, 1148626, 1132502, 1115424, 1094958, 1074503, 1056799, 1039775, 1022685, 1009397, 1001698, 995899, 989453, 984191, 979755, 970827, 954696, 935105, 915266, 893779, 870957, 852153, 840502, 832484, 824571, 818161, 814070, 808335, 797963]
58051G97963j2480j1717j2277j4013j3101j0105q802q492n872k763l524o542o732
58038F81543m788n440q215q549o652o620p997o805l974m229p299q465p306p795
58024E87409j0184j0658q866q185q777p708n622n933p818p229m623m328o442o621
58010D84415m011k365k990l216k197j854j946l08J985J764k53m81R56Q85m32K03
57994D70155K410K781J524K021L943L507N42j192q99j506l281l229j341j063k884
57979D71488l543k330k186l800m415l346l034l910l631k075j621k030o05K117
57965D37079K507K53j043k80j97j540j643J51J161O07P10J581M01l030n272n015
57949D26430m755n545n264l424k506k996k118Q51K925K705K611M193N731O213
$$ y = [797963, 785483, 773766, 761489, 747476, 734375, 724270, 715468, 706976, 701104, 698341, 694817, 688275, 681543, 676755, 671315, 663100, 654551, 647899, 641279, 633282, 626477, 622503, 618274, 610975, 602510, 595204, 587409, 577225, 566567, 557701, 549516, 540739, 533031, 527409, 521476, 513658, 506429, 501806, 497478, 491036, 484415, 480404, 478039, 475049, 471833, 469636, 467782, 465836, 465528, 467513, 469277, 469024, 468543, 469499, 470384, 469952, 470155, 472565, 475346, 476870, 478891, 482834, 486341, 486883, 485691, 484792, 483286, 480005, 476776, 475435, 474372, 471488, 467945, 465615, 463429, 459629, 455214, 451868, 448834, 444924, 441293, 439218, 437597, 435567, 434962, 437079, 439586, 439839, 438796, 438516, 438319, 436779, 435136, 435287, 436448, 437055, 437765, 439346, 439747, 436717, 431445, 426430, 421675, 416130, 410866, 407442, 404936, 401940, 399822, 400673, 403598, 406303, 408914, 413107, 418838, 425051]
57935D25051P237R312J0443J0018R979J0715R981P256M994M079K215j573m966
57922E04741o445p515r254j0421j0404j0472j0749r639p325o152o488o024m141
57909C99712k983l136k381k5J657J597J524K104J576l45j282m33J2q16q22Q28
57893C96787J943J508J633L443M948N010N474P300Q314P087N444M858L884J491
57879D59124m16l71j54j721m099n598o567p764q451q092p653p473o283l798j819
57864C88865j358j243q37j244k440k217L31L084M281M865N912O627O494O721P797
57849D25638Q243P308O324O011N151L364K246K302J720k04j385m92P37N26k75
57834D67214l90l41p20q10m86r59k190k324j106q70k579l946l301k230k391k786
$$ y = [425051, 432288, 441600, 452043, 462061, 472040, 482755, 492736, 499992, 504986, 509065, 511280, 509707, 504741, 498296, 490781, 481527, 471106, 460702, 450230, 439481, 429842, 422517, 416365, 409877, 403853, 399712, 396729, 393593, 391212, 391187, 392844, 394441, 395965, 398069, 399645, 399300, 398018, 397585, 397597, 396781, 395959, 396787, 398730, 400238, 401871, 405314, 410262, 415272, 420746, 428046, 436360, 443447, 448891, 453749, 457633, 459124, 458708, 458337, 458183, 456462, 452363, 446765, 440198, 432434, 423983, 415891, 408238, 400765, 394482, 390684, 388865, 387507, 386264, 385427, 384183, 381743, 379526, 379857, 382941, 387222, 392087, 397999, 404626, 411120, 417841, 425638, 433881, 441189, 447513, 453524, 458675, 462039, 464285, 466587, 468307, 468103, 466718, 466226, 466963, 467489, 467214, 466824, 466483, 465763, 464953, 464467, 463508, 461318, 458994, 457888, 457018, 454439, 450493, 447192, 444962, 442571, 439785]
57818D39785k319k092k935l376k437j759k693l884l977m161n641p090p077o723
57804C83621p470q409q115p144o439n467m038l665m867n410l588j117k83l75M85
57789C17719J919K383K002J809J637J125J418L489N991O890O184N375N380O379
57775C69700Q252R858R489P329N642N478N360M323L567L608K648j31k449k364
57761D30310j340j502k212j996j559k148k872k379j433j331j462q86m87j114j377
57746D06212J43K145K636K018J686J271j34j675k200k519l574m034k397m1O49
57731D00186j62o92p21j068j146J29J981K864K953L229L238K229J322J973L342
57716D19657L636K986K476J655l67k412k709j886j807k290j816p16p66k089l156
$$ y = [439785, 437466, 435374, 432439, 429063, 426626, 424867, 422174, 418290, 414313, 410152, 404511, 397421, 390344, 383621, 376151, 367742, 359627, 352483, 346044, 340577, 336539, 332874, 328007, 322597, 319009, 317892, 317609, 317234, 317719, 319638, 322021, 324023, 325832, 327469, 328594, 330012, 333501, 339492, 346382, 352566, 357941, 363321, 369700, 377952, 387810, 397299, 404628, 410270, 415748, 421108, 425431, 428998, 432606, 435254, 435123, 432674, 430310, 428970, 427468, 425256, 423260, 421701, 419553, 416681, 414302, 412869, 411538, 410076, 409190, 408703, 407589, 406212, 406355, 408500, 411136, 413154, 414840, 416111, 415977, 414302, 412102, 409583, 406009, 401975, 399578, 399537, 400186, 400024, 399332, 398611, 397543, 396397, 396526, 398507, 401371, 404324, 407553, 410791, 413020, 414342, 416315, 419657, 423293, 426279, 428755, 430410, 430043, 427631, 424922, 423036, 421229, 418939, 417123, 416407, 415641, 413552, 410396]
57701D10396l529m116n013n433n458n698n739m914l974l929m037l200k319k828
57687C50209l805l220j430n83j032j065L7J338K578M601P384R946J2351J5726
57673C93035K0254K5223L0956L8611M8059N7973O7987P8663Q8992R5347R3155
57662A038255P8817N1321J4278k4013n4909p4444q3460q4162p8647o9745o0350
57651F52941n1476m2748l4579k8060k3082j8621j4764j2459j1424j0184q199o261
57639C91084m852l770l177l326l541k961k042j759j827j366o96p08j026o86j57
57624C59190o98k164l310l833m225m177l145k052k232l065k813j482p04r90j311
57609C22989j320j777k682l016k513j977j693j202n88l94m58k93k67q47j339j052
$$ y = [410396, 406867, 402751, 397738, 392305, 386847, 381149, 375410, 370496, 366522, 362593, 358556, 355356, 353037, 350209, 346404, 343184, 341754, 341171, 340139, 339074, 339111, 340449, 343027, 347628, 355012, 364958, 377309, 393035, 413289, 438512, 469468, 508079, 556138, 614111, 682098, 760761, 849753, 945100, 1038255, 1117072, 1168393, 1182671, 1158658, 1103749, 1029305, 945845, 861683, 783036, 713291, 652941, 601465, 558717, 524138, 496078, 472996, 454375, 439611, 427152, 415728, 405544, 397345, 391084, 386232, 382462, 379285, 375959, 372418, 369457, 367415, 365656, 363829, 362463, 361767, 361059, 360033, 359347, 359190, 358492, 356328, 353018, 349185, 344960, 340783, 337638, 335586, 333354, 330289, 327476, 325994, 325290, 324300, 322989, 321669, 319892, 317210, 314194, 311681, 309704, 308011, 306809, 306221, 305827, 305369, 305076, 304809, 303962, 302623, 301571]
57593C01571r21k024l338l193k166k104k895k913k189k320l318l458k434j919
57579B66379k586l111k684k143k111k135k093k449k805k280j486j890l018k750
57565B32838q03N69l3j337j785j532j295j112j068j516j957j373j13L68l1J98
57549B20018J581K858L267L565M176M250L295J970P34n52j294m97J198J815R03
57534B47287J6m9k74j072j342p79p33j710k223j323k12k5m3N79J150J013J016
57517B41276J929K863K790K244K113K016J299N10N19J146J715K120K300J745M82
57502B67067m43m02j75o35j463j979k268k674l052l277l559l739l183j958j063
57487B37197j027j336j635k214k896k764j677o90m82n21l92m83q25p00j18k24
$$ y = [301571, 300650, 298626, 295288, 292095, 289929, 287825, 284930, 282017, 279828, 277508, 274190, 270732, 268298, 266379, 263793, 260682, 257998, 255855, 253744, 251609, 249516, 247067, 244262, 241982, 240496, 238606, 235588, 232838, 232035, 232604, 232571, 231234, 229449, 227917, 226622, 225510, 224442, 222926, 220969, 219596, 219483, 219851, 219820, 220018, 221599, 224457, 227724, 231289, 235465, 239715, 243010, 244980, 245714, 245162, 243868, 243371, 244569, 246384, 247287, 247303, 247254, 246980, 245908, 244566, 243787, 243054, 241344, 239121, 237798, 237586, 237561, 237518, 238097, 239247, 240260, 241276, 243205, 246068, 248858, 251102, 253215, 255231, 256530, 257040, 257559, 258705, 260420, 262540, 264840, 266585, 267067, 266624, 266222, 266047, 265412, 263949, 261970, 259702, 257028, 253976, 250699, 247140, 243401, 240218, 238260, 237197, 236170, 234834, 233199, 230985, 228089, 225325, 223648, 222958, 222476, 221955, 221563, 221080, 220255, 219555, 219437, 219213]
57471B19213j414k503k565k277k485k749k374j662j170p42j52K37K36K73M60K72
57455B00598l13m68O6M41K36J57N96P54R4o24o00j42J67M24P50P87N28N70J004
57436B05025J156R53J176J898K028J130K47J64L03J28K01R27J561J422Q77L72
57420B19568k85q95o04N16J062L18o65q96q05p94j05J615L064L010K058J453J199
57403B28814O37k22j124k300l606l957k785j081k8M52Q31Q49L68K26J036K109
57387B20219K533K428K254J976J727K117K989L200K521K287L100L495K231L09
57373B53386p58j288k289l251k989j823j104j190j390j377j234p43K19J025J197
57358B36391J211J568J850J667J532J778J767J206J087K094L276L554L256K922
$$ y = [219213, 217799, 215296, 212731, 210454, 207969, 205220, 202846, 201184, 200014, 199272, 199120, 199357, 199593, 199866, 200326, 200598, 200285, 199817, 199883, 200324, 200560, 200717, 201313, 202067, 202161, 201537, 200937, 200795, 200962, 201386, 202136, 202923, 203451, 204021, 205025, 206181, 207134, 208310, 210208, 212236, 213366, 213613, 213777, 214080, 214208, 214409, 215336, 216897, 218319, 219196, 219568, 219283, 218388, 217784, 218300, 219362, 219680, 219015, 218119, 217314, 216520, 216415, 218030, 221094, 224104, 226162, 227615, 228814, 229451, 229229, 228105, 225805, 222199, 218242, 215457, 214376, 214348, 214800, 215631, 216480, 216848, 217074, 218110, 220219, 222752, 225180, 227434, 229410, 231137, 233254, 236243, 239443, 241964, 244251, 247351, 250846, 253077, 253386, 252628, 251340, 249051, 245800, 242811, 240988, 239884, 238694, 237304, 235927, 234693, 233950, 234169, 235194, 236391, 237602, 239170, 241020, 242687, 244219, 245997, 247764, 248970, 250057, 252151, 255427, 258981, 262237, 265159]
57344B65159K016L99m06O50K043J684O5p08j48M81O02P21Q06L03m20m69r1k38
57326B72449p76p44k02j01n32o49k84n0P4O71J470J465N44k86l93q6L32Q95J434
57307B75231J689J906K409K798K535J988J911K184K106J597J179J088J253J680
57293C01554K055J670O56L89J548K745K527J741K141L435L753K606J333O59j88
57278C28624j640k877l242l225l496m026m532m895m901m365l553k791j787j90
57264B83104J439K133J880J542J652K109K839L825M649M912M893N098N494N889
57250C31458O524P430P868P340O527O261O178N579M905N073N886O379O279N934
57236D19621N362M611M444N239N854N031L449K850L527M338M727N159N717N957
$$ y = [265159, 267175, 267574, 267168, 267818, 269861, 271545, 271610, 270902, 270754, 271235, 271837, 272558, 273364, 273667, 273247, 272778, 272687, 272449, 271673, 270929, 270727, 270626, 270094, 269445, 269161, 269111, 269185, 269856, 271326, 272791, 273335, 273049, 272656, 272570, 272902, 273797, 275231, 276920, 278826, 281235, 284033, 286568, 288556, 290467, 292651, 294757, 296354, 297533, 298621, 299874, 301554, 303609, 305279, 305935, 306324, 307872, 310617, 313144, 314885, 317026, 320461, 324214, 326820, 328153, 328812, 328624, 326984, 324107, 320865, 317640, 314144, 310118, 305586, 300691, 295790, 291425, 287872, 285081, 283294, 283104, 284543, 286676, 288556, 290098, 291750, 293859, 296698, 300523, 305172, 310084, 314977, 320075, 325569, 331458, 337982, 345412, 353280, 360620, 367147, 373408, 379586, 385165, 390070, 395143, 401029, 407408, 413687, 419621, 424983, 429594, 434038, 439277, 445131, 450162, 453611, 456461, 459988, 464326, 469053, 474212, 479929, 485886]
57222D85886O003O359O733O513O237P077Q916J0438J0979J0948J0588R841R322
57209E95840R889J1269J2453J3318J4441J5510J5564J4627J3547J2334J0379Q235
57197G47406P294P541P490O621O008O134N993N042M254M381M789M888N354O814
57183H30009Q565R640J0257J1205J2524J3690J4496J5094J5567J6005J6574J7093
57171I90719J7073J6444J5758J5482J5655J6420J8232K1202K4764K8138L0871
57160A210758L2870L4376L5806L7211L8050L7907L7156L6366L5509L4422L3548
57149A603979L3319L3238L2471L1162L0172K9848K9956L0487L1464L2158L1687
57138A949941L0350K9409K9514L0251L1155L2241L3482L4600L5576L6708L8252
$$ y = [485886, 491889, 498248, 504981, 511494, 517731, 524808, 533724, 544162, 555141, 566089, 576677, 586518, 595840, 605729, 616998, 629451, 642769, 657210, 672720, 688284, 702911, 716458, 728792, 739171, 747406, 754700, 762241, 769731, 776352, 782360, 788494, 794487, 799529, 803783, 808164, 812953, 817841, 823195, 830009, 838574, 848214, 858471, 869676, 882200, 895890, 910386, 925480, 941047, 957052, 973626, 990719, 1007792, 1024236, 1039994, 1055476, 1071131, 1087551, 1105783, 1126985, 1151749, 1179887, 1210758, 1243628, 1278004, 1313810, 1351021, 1389071, 1426978, 1464134, 1500500, 1536009, 1570431, 1603979, 1637298, 1670536, 1703007, 1734169, 1764341, 1794189, 1824145, 1854632, 1886096, 1918254, 1949941, 1980291, 2009700, 2039214, 2069465, 2100620, 2132861, 2166343, 2200943, 2236519, 2273227, 2311479]
57127B311479M0476M3774M8152N2823N6937O0467O3895O7441P1123P5173P9811
57116B971551Q5006R0877R7901J06407J16465J28521J43286J60774J80546K03104
57106D284438K30011K62478L01226L48056M05958M77576N65633O75298Q13826
57097H364500R86902J197145J446378J736396K066322K431626K826136L242031
57089B4297436L667140M085892M483366M844494N149209N371596N476410N399239
57081F2774782N030464M253608L042912J536355n574j335719k334902l022871
57073F9939055l490702l829127m091919m290715m410255m433291m357288m192672
57065C6843086l953930l657927l325967k979959k636503k307392k002961j730549
$$ y = [2311479, 2351955, 2395729, 2443881, 2496704, 2553641, 2614108, 2678003, 2745444, 2816567, 2891740, 2971551, 3056557, 3147434, 3245335, 3351742, 3468207, 3596728, 3740014, 3900788, 4081334, 4284438, 4514449, 4776927, 5078153, 5426209, 5832167, 6309743, 6875376, 7550674, 8364500, 9351402, 10548547, 11994925, 13731321, 15797643, 18229269, 21055405, 24297436, 27964576, 32050468, 36533834, 41378328, 46527537, 51899133, 57375543, 62774782, 67805246, 72058854, 75101766, 76638121, 76632547, 75296828, 72961926, 69939055, 66448353, 62619226, 58527307, 54236592, 49826337, 45393046, 41035758, 36843086, 32889156, 29231229, 25905262, 22925303, 20288800, 17981408, 15978447, 14247898]
57057A4247898j491436j283456j105528r56872q33787p30943o44735n72716n11468
57048F116957m58125m12772l76441l47902l24644l05420k89304k73890k57163
57039C071296k39787k23168k06740j89569j72830j57965j43922j28958j13686
57030A494671r9664q6404p2624n9061m7115l5848k3250r520L494J4661K2305K1912
57018A123557R215j4153m0724o3080p7708q4065q3168p7594p0351o2928n5463
57007E03538m8357m2141l6456l0997k6783k4712k3621k1844j9786j8849j8635
56996A91357j7573j5841j5104j5558j5542j4031j1660r230o971n089l391p60L475
56983F4082Q046J1037J1971J1048P560J149o168j1499j4121j5061j4456j1619
$$ y = [14247898, 12756462, 11473006, 10367478, 9410606, 8576819, 7845876, 7201141, 6628425, 6116957, 5658832, 5246060, 4869619, 4521717, 4197073, 3891653, 3602349, 3328459, 3071296, 2831509, 2608341, 2401601, 2212032, 2039202, 1881237, 1737315, 1608357, 1494671, 1395007, 1308603, 1235979, 1176918, 1129803, 1093955, 1070705, 1061185, 1064679, 1079340, 1101645, 1123557, 1132772, 1118619, 1077895, 1014815, 937107, 853042, 769874, 692280, 621929, 559001, 503538, 455181, 413040, 376584, 345587, 318804, 294092, 270471, 248627, 228841, 209992, 191357, 173784, 157943, 142839, 127281, 111739, 97708, 86048, 76818, 69847, 64758, 61367, 60607, 64082, 72128, 83165, 95136, 106184, 113744, 114893, 108725, 97226, 83105, 68044, 53588, 41969]
56971D1969p134k437K333P882J3566J8061K1895K6882L3141L8956M3586M7839
56959B86539N1789N4357N5389N5786N4996N0532M0853K7202J2067k606j5273k4501
56947F47130k9796l1908l1974l0926k9397k7306k3928j9283j4840j1694q903m954
56935C82221Q4N386J1263J8256K5120K9723L1197K9241K2414R785o070k0377l0458
56922E07785l6721l9912m0052l7955l5137l1888k7536k2675j8891j6312j3734
56911A86972j1234j0126j0224r675p989o681o449o131n085m180l741k745r80K41
56897A01973L47M48J166J603J423J924M064P182J0614J4779J9667K4033K6997
56884B16220K8664K8382K4344J6251O652j549p566j1767j4016j4246j3235j1461
$$ y = [41969, 34835, 32398, 34731, 42613, 56179, 74240, 96135, 123017, 156158, 195114, 238700, 286539, 338328, 392685, 448074, 503860, 558856, 609388, 650241, 677443, 689510, 686904, 671631, 647130, 617334, 585426, 553452, 522526, 493129, 465823, 441895, 422612, 407772, 396078, 387175, 382221, 382305, 387691, 398954, 417210, 442330, 472053, 503250, 532491, 554905, 564690, 558620, 538243, 507785, 471064, 431152, 391100, 353145, 318008, 286120, 258584, 235909, 217018, 200706, 186972, 175738, 165612, 155388, 145713, 137724, 131043, 124594, 118463, 113378, 109198, 105457, 102712, 101732, 101973, 102320, 102768, 103934, 105537, 106960, 108884, 112948, 120130, 130744, 145523, 165190, 189223, 216220, 244884, 273266, 297610, 313861, 320513, 318964, 311398, 299631, 285615, 271369, 258134, 246673]
56872B46673q348l851M96L376N489Q426J2653J7679K3310K9639L6522M3899N1928
56859D67891N9884O5380O5353N7609M1726J9659m120k4401l8109m5199m6938m4504
56847E74231l9300l2954k6231j8856j0799k757M987J3042K1905L1506M1994N3783
56835F10551O6620P9658R2259J02938J07272R9124P5539L9873l07l7448o6301
56824A169778q4334r1713r0538q3392p2725o1023n0102l9943k9496j8820r160
56813E38532q42P382J6625K6800L7612M9103O0618P0219P5167P2146N7940L2302
56801A043604M05k9677n2531o7253p4441p4384o8706o0772n2844m4638l5825k7783
56789D55155k1604j6289j0495m463J150O840J3311K0232K7080L3640L8463L8381
$$ y = [246673, 238325, 234474, 234970, 238346, 243835, 252261, 264914, 282593, 305903, 335542, 372064, 415963, 467891, 527775, 593155, 658508, 716117, 757843, 777502, 773382, 748981, 710872, 665673, 618735, 574231, 534931, 501977, 475746, 456890, 446091, 443334, 448321, 461363, 483268, 514774, 556768, 610551, 677171, 756829, 849088, 952026, 1059298, 1158422, 1233961, 1273834, 1273527, 1236079, 1169778, 1085444, 993731, 903193, 819801, 747076, 686053, 635951, 596008, 566512, 547692, 538532, 537690, 545072, 561697, 588497, 626109, 675212, 735830, 806049, 881216, 953362, 1011302, 1043604, 1044009, 1014332, 961801, 894548, 820107, 745723, 677017, 616245, 563401, 518763, 482938, 455155, 433551, 417262, 406767, 402304, 403454, 410294, 423605, 443837, 470917, 504557, 543020, 581401]
56777E81401L1131J7640Q34j6346l1054m0667m4593m4844m3475m0649l6163l1258
56765C01957k7324k4111k0756j7534j5088j3027j0745q678p433o600n693n229
56753A39739n585n777m772l138k112j853j832k063k618k778j944p81k67k84j53
56738A03782J15J45N6J21J91J90L92N67n0j269j755j041l90o97j020l88M68N73
56720I9990M92J182K170K487K310K193J742N78l94k58L02K79J96J012K026J848
56704A18155Q25N47J260J569O92n90j230j007k52M66N20j14n98l54P0j0k40M8
56686A19757O25Q70Q99J142J424J419J455J920K434K545K580K874K824J774K51
56671A44793o84q57q50r35r80r39p97m33q6k82q98j086n54N3M38J100K005K210
$$ y = [581401, 612532, 630172, 631006, 614660, 583606, 542939, 498346, 453502, 410027, 369378, 333215, 301957, 274633, 250522, 229766, 212232, 197144, 184117, 173372, 164694, 157261, 150661, 144968, 139739, 134154, 128377, 123605, 120467, 118355, 116502, 114670, 112607, 109989, 107211, 105267, 104486, 104219, 103935, 103782, 103897, 104042, 104098, 104219, 104410, 104600, 104992, 105559, 105509, 104240, 102485, 101444, 101054, 100357, 99337, 98949, 99417, 99990, 100482, 101664, 103834, 106321, 108631, 110824, 112566, 113144, 112750, 112492, 112794, 113073, 113269, 114281, 116307, 118155, 118980, 119527, 120787, 122356, 123048, 122458, 121228, 120221, 119969, 120435, 120955, 120841, 120243, 119889, 119959, 119949, 119709, 119757, 120382, 121252, 122151, 123293, 124717, 126136, 127591, 129511, 131945, 134490, 137070, 139944, 142768, 144542, 144793, 144109, 143252, 142402, 141467, 140487, 139548, 138751, 138318, 138232, 137950, 137052, 135966, 135412, 135465, 135903, 137003, 139008, 141218]
56653A41218J427O70N79N62L30O57J635J892P13o58j014r35j182j090j5J158J497
56636A47444J525J675J018q18k098j451k92o05j695j507r7O71J32p56j363j746
56620A40037j587p19o2l39o58k3O56M9j190j479r35p48q21k43N78N17j08j43K15
56601A32997l7n47k08N91O05J39N09J453J473N28P2M26M53j53l77J57P10J009
56583A39800J462J814J372N32K86M17l3p67o16K40N16J04J13P91J414K139L767
56566A53351N704O327N593N208N958O936P692R106J1564J3995J5187J4654J2120
56553B73395P792L231K73j048k046l075l439l317l661m213l748k541k426l893
56539B51284n147m640k984j693j428j932k469k136r32l23j459l177l457k364j723
$$ y = [141218, 142645, 143315, 143894, 144456, 144786, 145443, 147078, 148970, 149683, 149025, 148011, 147076, 145894, 144804, 144789, 145947, 147444, 148969, 150644, 151662, 150844, 148746, 147295, 147003, 146398, 144703, 143196, 143099, 143770, 143902, 143146, 141783, 140037, 138450, 137731, 137669, 137330, 136672, 136649, 137305, 137354, 136164, 134685, 133750, 133002, 132181, 131938, 132516, 133033, 132925, 132782, 132997, 132960, 132413, 132205, 132796, 133401, 133540, 134049, 135502, 136975, 137503, 137575, 138001, 138454, 138301, 137924, 138081, 138791, 139800, 141262, 143076, 144448, 144980, 145266, 145683, 145650, 144883, 144267, 144507, 145023, 145127, 145240, 146031, 147445, 149584, 153351, 159055, 165382, 170975, 176183, 182141, 189077, 196769, 205875, 217439, 231434, 246621, 261275, 273395, 281187, 284418, 284691, 283643, 281597, 278522, 275083, 271766, 268105, 263892, 260144, 257603, 255177, 251284, 246137, 241497, 238513, 236820, 235392, 233460, 230991, 228855, 227923, 227600, 226141, 222964, 219507, 217143, 215420]
56524B15420k118k404k074j951k278k191j455r35j027j219j289j405j112oQ72
56509A94828J51j492k129j557j315j889k198j877j725j787j317p10j123k048j752
56494A72060l39K93j52J47J635K296J059k87J1J215J797J639J231N53m6M37J867
56477A85416K514J376l93j272j153n93J89Q94J089J109J722K507K167O60n95r37
56461A94700j101j448j383q67o29o37k02L68J52l05L76J691J733N42K02J204J634
56444A96030O57j06L22O60R2j89N00Q15o8q45m83ll32n38J83Q41N20L2J94L14
56424A98596k20n78j05L97K81K08O04P44M33P45J921K525J834J047R91P19l77
56407B09765j063l65P89J367J791K395K302J153J41oj94r32j113j01R37J047Q80
$$ y = [215420, 213302, 210898, 208824, 206873, 204595, 202404, 200949, 200014, 198987, 197768, 196479, 195074, 193962, 193956, 194828, 194979, 193487, 191358, 189801, 188486, 186597, 184399, 182522, 180797, 179010, 177693, 176983, 175860, 173812, 172060, 171721, 172014, 171862, 172009, 173644, 175940, 176999, 176712, 176723, 177938, 179735, 181374, 182605, 183158, 183112, 183549, 185416, 187930, 189306, 188913, 187641, 186488, 185895, 186084, 186978, 188067, 189176, 190898, 193405, 195572, 196232, 195637, 194700, 193599, 192151, 190768, 189901, 189272, 188635, 188433, 188801, 188953, 188648, 189024, 190715, 192448, 192990, 193192, 194396, 196030, 196687, 196581, 196903, 197563, 197655, 197466, 197966, 198781, 198713, 197868, 197385, 197382, 197050, 196512, 196695, 197536, 198056, 198088, 198282, 198596, 198376, 197798, 197693, 198090, 198371, 198579, 199183, 199927, 200360, 201105, 203026, 205551, 207385, 208432, 209423, 210142, 209765, 208702, 208337, 209126, 210493, 212284, 214679, 216981, 218134, 218275, 218269, 218075, 217143, 216030, 215929, 216866, 217913, 218793]
56390B18793R71O92O2L85J764K336J304L78Q14J422J117R22J628J966J053L19
56374B35926R61J579O00r76j358o53J58J118K310K755K053J405J399Q85m55p85
56358B46922Q00K300J992J149J403J777Q52l54k48N10O09O59J635K556K206J496
56342B66264J726K172J774J448K289L228K911K228K546L142K790K232K628L265
56328C00643L157L118L869M039K700J834L369N628N731L841K062P27r79k252j797
56313C35690n61k58l21P62K232K348J725K301L743M049L086K667L555M909O187
56298C72114P254P330O051M793M874N474N231M536M258L766K589K168L503M858
56284D38799M589M344O444R767J1522J1613J1899J2478J2140J1387J1707J2680
$$ y = [218793, 219764, 220456, 220518, 220903, 222667, 225003, 226307, 226685, 227499, 228921, 230038, 230960, 232588, 234554, 235607, 235926, 236887, 238466, 239066, 238090, 236732, 236079, 236237, 237355, 239665, 242420, 244473, 245878, 247277, 248162, 247707, 246922, 247722, 250022, 252014, 253163, 254566, 256343, 257195, 256841, 256593, 257103, 257712, 258371, 260006, 262562, 264768, 266264, 267990, 270162, 271936, 273384, 275673, 278901, 281812, 284040, 286586, 289728, 292518, 294750, 297378, 300643, 303800, 306918, 310787, 314826, 317526, 319360, 322729, 328357, 334088, 337929, 339991, 340718, 339739, 337487, 335690, 335129, 334871, 334550, 335312, 337544, 339892, 341617, 343918, 347661, 351710, 354796, 357463, 361018, 365927, 372114, 379368, 386698, 392749, 397542, 402416, 407890, 413121, 417657, 421915, 425681, 428270, 430438, 433941, 438799, 443388, 447732, 454176, 463943, 475465, 487078, 498977, 511455, 523595, 534982, 546689, 559369]
56272E59369J3004J3324J5058J7398J8592J9105K0509K2347K3346K4531K7745
56261G74328L2121L5362L7712M1296M6417N1762N7527O5002P3820Q2736R2331
56250A390414J03909J16668J29058J41739J55936J70087J81577J90650J99046
56241B779084K05855K08539K07003K02741J94800J80611J60189J35725J07656
56232D382203P5153L9909N490k6846n8000q7172j11994j32094j48812j61774j69508
56221C606555j73047j75050j75669j72987j67223j60595j53459j44515j34568
56212B149442j26099j19252j12012j04174r7293r1092q3898p6353p0670o6400
56202A202199o1062n4710m9749m6316m2148l7014l3020l0399k7172k3233k0604
$$ y = [559369, 572373, 585697, 600755, 618153, 636745, 655850, 676359, 698706, 722052, 746583, 774328, 806449, 841811, 879523, 920819, 967236, 1018998, 1076525, 1141527, 1215347, 1298083, 1390414, 1494323, 1610991, 1740049, 1881788, 2037724, 2207811, 2389388, 2580038, 2779084, 2984939, 3193478, 3400481, 3603222, 3798022, 3978633, 4138822, 4274547, 4382203, 4457356, 4497265, 4502755, 4475909, 4417909, 4330737, 4218743, 4086649, 3937837, 3776063, 3606555, 3433508, 3258458, 3082789, 2909802, 2742579, 2581984, 2428525, 2284010, 2149442, 2023343, 1904091, 1792079, 1687905, 1590612, 1499520, 1415622, 1339269, 1268599, 1202199, 1141137, 1086427, 1036678, 990362, 948214, 911200, 878180, 847781, 820609, 797376, 776772]
56191G76772j9437j7807j5650j4826j5081j4015j1382r463q963q411p640p871
56179F26226q426p362n273m444m535l372j520j465k640k188l74r6j140k76K646
56164E85761M243L707L937N791O671N873O091Q285J0045J0295J0803J1964J1894
56151F85360J0867J1834J5361J8728K1005K4210K8669L2276L5339M1057N0068
56140I74774N9589O8799P9785R2178J02435J09517J15585J19758J17240J06591
56130A946251R2306P8355O4773N2374M4691M2386M0898L6252K8645J8751N885
56119B451567q058j8280k3212k6312l0206l4260l9477m9686o5331q1398r3894
56108A981453j03241j09452j09830j03953r5449q6369p5164o2199n1491m4545
$$ y = [776772, 757335, 739528, 723878, 709052, 693971, 679956, 668574, 659111, 650148, 641737, 634097, 626226, 617800, 610438, 605165, 600721, 596186, 592814, 591294, 589829, 587189, 585001, 584627, 584531, 583391, 583115, 585761, 590004, 593711, 597648, 603439, 610110, 615983, 622074, 630359, 640404, 650699, 661502, 673466, 685360, 696227, 708061, 723422, 742150, 763155, 787365, 816034, 848310, 883649, 924706, 974774, 1034363, 1103162, 1182947, 1275125, 1377560, 1487077, 1602662, 1722420, 1839660, 1946251, 2038557, 2116912, 2181685, 2234059, 2278750, 2321136, 2362034, 2398286, 2426931, 2445682, 2451567, 2443509, 2425229, 2402017, 2375705, 2345499, 2311239, 2271762, 2222076, 2156745, 2075347, 1981453, 1878212, 1768760, 1658930, 1554977, 1459528, 1373159, 1297995, 1235796, 1184305, 1139760]
56098A139760l8193l0902k5462k2994k0374j6164j3187j2566j1188p732n193m815
56086I30990l614n27J260P46J417M430O070M835M266N827N977L494K571N169P433
56071I80344P331Q589J3210J7295J8303J9305K1912K2323J8776J5768J6512J8175
56059A177843J8677K0794K5222K7143K4354K1264K0543J8582J3755J0912J2662
56048A391751J4474J3504J3861J7837K0624J9427J8977K2129K3928K1296J9506
56037A597314K2396K5178K3980K3429K7471L1608L1787L2120L6184L9622L9062
56026A930151L9337M3951M7569M6128M4985M8734N2420N1469N0661N4449N8097
56015B467951N7499N7821O3167O7861O7449O7835P3842P9516P9893Q1004Q7754
$$ y = [1139760, 1101567, 1070665, 1045203, 1022209, 1001835, 985671, 972484, 959918, 948730, 940998, 935805, 930990, 927376, 926849, 928109, 928855, 930272, 934702, 940772, 945607, 949873, 955700, 961677, 965171, 967742, 972911, 980344, 987675, 996264, 1009474, 1026769, 1045072, 1064377, 1086289, 1108612, 1127388, 1143156, 1159668, 1177843, 1196520, 1217314, 1242536, 1269679, 1294033, 1315297, 1335840, 1354422, 1368177, 1379089, 1391751, 1406225, 1419729, 1433590, 1451427, 1472051, 1491478, 1510455, 1532584, 1556512, 1577808, 1597314, 1619710, 1644888, 1668868, 1692297, 1719768, 1751376, 1783163, 1815283, 1851467, 1891089, 1930151, 1969488, 2013439, 2061008, 2107136, 2152121, 2200855, 2253275, 2304744, 2355405, 2409854, 2467951, 2525450, 2583271, 2646438, 2714299, 2781748, 2849583, 2923425, 3002941, 3082834, 3163838, 3251592]
56004C251592R3604R3388R4278J02368J10704J12844J15622J25594J35766J39398
55994D375158J43752J55999J68958J75507J83305J99859K17181K27433K39000
55985F086152K60340K83200K99482L18627L49630L82682M08365M37442M80716
55976I306636N27907N68971O16748O84302P60441Q33707R18976J032325J162598
55967A6412611J298569J460208J670356J921724K208416K562689L021515L586897
55959C4142985M261389N087162O101440P295571Q679121J0341947J2386047J4848802
55951A03144464J7777848K1318644K5604675L0577877L5941436M1030158M4377944
55944C19773046M3574839L6328321K2372196M392000j3261909k7015071l5496679
$$ y = [3251592, 3345196, 3438584, 3532862, 3635230, 3745934, 3858778, 3974400, 4099994, 4235760, 4375158, 4518910, 4674909, 4843867, 5019374, 5202679, 5402538, 5619719, 5847152, 6086152, 6346492, 6629692, 6929174, 7247801, 7597431, 7980113, 8388478, 8825920, 9306636, 9834543, 10403514, 11020262, 11704564, 12465005, 13298712, 14217688, 15250013, 16412611, 17711180, 19171388, 20841744, 22763468, 24971884, 27534573, 30556088, 34142985, 38404374, 43491536, 49592976, 56888547, 65567668, 75909615, 88295662, 103144464, 120922312, 142240956, 167845631, 198423508, 234364944, 275395102, 319773046, 363347885, 399676206, 422048402, 426440402, 413178493, 386163422, 350666743]
55937C50666743l9163019l9183554l6772631l3028070k8820684k4678979k0855624
55930A28164182j7489241j4648536j2299269j0351527q745121p443720o382978
55923E0803790n490089m735794m116243l602901l155555k765184k440158k165867
55915B2331999j916861j693617j510307j359109j220123j093982r92721r09396
55907A1635883q26840p46530o80937o26593n70860n16471m74308m40026m01544
55898F351774l62038l32905l11243k85946k59147k40675k27742k10309j90588
55889C931181j77837j69414j55781j39135j28901j23481j13904j01187r3206q8491
55879B639844p9564o8621o4204o5603o5412o3959o6651p0730o9103o4153o3639
$$ y = [350666743, 311503724, 272320170, 235547539, 202519469, 173698785, 149019806, 128164182, 110674941, 96026405, 83727136, 73375609, 64630488, 57186768, 50803790, 45313701, 40577907, 36461664, 32858763, 29703208, 26938024, 24497866, 22331999, 20415138, 18721521, 17211214, 15852105, 14631982, 13538000, 12545279, 11635883, 10809043, 10062513, 9381576, 8754983, 8184123, 7667652, 7193344, 6753318, 6351774, 5989736, 5656831, 5345588, 5059642, 4800495, 4559820, 4332078, 4121769, 3931181, 3753344, 3583930, 3428149, 3289014, 3160113, 3036632, 2922728, 2821541, 2728335, 2639844, 2560280, 2491659, 2427455, 2361852, 2296440, 2232481, 2165830, 2095100, 2025997, 1961844, 1898205]
55868A898205o5961o3318n6575n3203n2932m8957m1477l7078l6084l2981k8012
55857A381627k6647k8641k8778k7165k8134l0460k9168k5468k4749k6373k5510
55846A080534k3078k3781k6119k4625k0378j9214k0928k0212j6996j6030j7297
55835H51876j6421j3591j2823j3366j1022o940o084q085q732r295j4841k4020
55823G06656k9855l0459k9944k9067k4219j5843r084n362j491K561L154O78j42
55810E37583J722K664J897K541M975O316O779R489J3731J5433J4516J4751J6174
55797F48571J4861J0411O614M216J18n821j0124j2318j5406j9183j9944j7490
55785E84505j5628j4987j2197p151m288n403p505q960j1397j4404j4624j1669
$$ y = [1898205, 1832244, 1768926, 1712351, 1659148, 1606216, 1557259, 1515782, 1478704, 1442620, 1409639, 1381627, 1354980, 1326339, 1297561, 1270396, 1242262, 1211802, 1182634, 1157166, 1132417, 1106044, 1080534, 1057456, 1033675, 1007556, 982931, 962553, 943339, 922411, 902199, 885203, 869173, 851876, 835455, 821864, 809041, 795675, 784653, 777713, 771629, 763544, 754812, 745517, 730676, 706656, 676801, 646342, 616398, 587331, 563112, 547269, 538185, 532823, 531332, 533893, 537047, 537725, 537583, 539305, 541969, 543866, 546407, 551382, 557698, 564477, 573966, 587697, 603130, 617646, 632397, 648571, 663432, 673843, 680457, 684673, 684791, 678970, 668846, 656528, 641122, 621939, 601995, 584505, 568877, 553890, 541693, 534542, 530254, 524851, 517346, 508386, 496989, 482585, 467961, 456292]
55773D56292q949p328l846K058O960R381J1428J3115J0990M321k805p426j0675
55760D73516j3395j4022j2578j1721j2085j1097q009n521n046m873m245m792o708
55747C59424p948q235r499j1397j1121q571p020p575p612n753l806k673j018Q94
55733B68090P84j113j738n56m82k435l735l278l316m697n184m110l918n279n391
55718B23642l098j084j011q55Q14K197K124K385M067N329N021M715N259M910K929
55703B57344J281R12j00k744m984n359n235n653n377l891k931l273l242k020j100
55688B13628j014j45J724K365J245J055L259N774O792P324Q135P843O069M831
55674B68885M798L721P26j496j084q3o41j577j267p44j206j405j66J165J259J270
$$ y = [456292, 447343, 440015, 436169, 438227, 445187, 454568, 465996, 479111, 490101, 494422, 491617, 484191, 473516, 460121, 446099, 433521, 421800, 409715, 398618, 390609, 385088, 380042, 375169, 370924, 366132, 359424, 351476, 343241, 333742, 322345, 311224, 302653, 295633, 288058, 280446, 274693, 270887, 268214, 267196, 268090, 268874, 267761, 266023, 265467, 264985, 262550, 258815, 255537, 252221, 247524, 242340, 238230, 234312, 229033, 223642, 220544, 219460, 218449, 217594, 218408, 220605, 222729, 225114, 229181, 234510, 239531, 244246, 249505, 254415, 257344, 258625, 259537, 259437, 256693, 251709, 246350, 241115, 235462, 230085, 226194, 223263, 219990, 216748, 214728, 213628, 212614, 212469, 214193, 216558, 217803, 218858, 222117, 227891, 234683, 242007, 250142, 257985, 264054, 268885, 273683, 277404, 278130, 276634, 275550, 275467, 274826, 273249, 271982, 271238, 270032, 268627, 268461, 269626, 270885, 272155]
55658B72155K421L637L783L785M429M499L165J780J399R69k42j085j177k311n232
55643B91975p791q385q450r462j0256r607q741q875q828p448o005n868o016n177
55629A81066m157l909l525k287j455j874k113j106k56q27j558j152q00j813l028
55614A51206k971k458k700k840j805o73p91j349j082o02q61j105n21j26q87j710
55598A28725j352n69m26l48K10J50j142k065j385n16j036j889j380j50K77J98
55582A17302O38J142Q74M87P22P11k70r67j11J260J528R35N13J82j64M64K234
55565A27480L277K365R26M85J63j069j898r82K19k60j515j415j26O90Q62J247
55549A30449J598J305J154J938K685K402K143L020L762K829J439J699L041L300
$$ y = [272155, 274576, 278213, 281996, 285781, 290210, 294709, 297874, 299654, 301053, 302022, 301780, 300695, 299518, 297207, 291975, 284184, 275799, 267349, 257887, 247631, 238024, 229283, 220408, 211580, 204132, 198127, 192259, 186243, 181066, 176909, 173000, 169475, 167188, 165733, 163859, 161746, 160640, 160384, 159557, 157999, 156847, 156047, 154234, 151206, 148235, 145777, 143077, 140237, 138432, 137759, 136968, 135619, 134537, 133935, 133074, 131969, 131448, 131322, 130435, 128725, 127373, 126804, 126378, 126030, 126240, 126390, 125248, 123183, 121798, 121282, 120246, 118357, 116977, 116827, 117104, 117302, 117940, 119082, 119956, 120443, 121165, 121876, 121606, 120639, 120528, 121788, 123316, 124251, 124764, 124946, 124782, 125246, 127480, 130757, 133122, 134048, 134533, 134696, 133627, 131729, 130747, 130966, 130706, 129191, 127776, 127650, 128340, 129202, 130449, 132047, 133352, 134506, 136444, 139129, 141531, 143674, 146694, 150456, 153285, 154724, 156423, 159464, 162764]
55535A62764K310J661J744J649J263J088P08m47j689k348l235m894n857m902l546
55520A46269l762m753m593l674l575l890l149j895j762k335j994j034j016j574
55506A07263r94M55Q22j90r72r44j039j338r25l2J34l78m79l32r97k012j797m29
55488I5816L91J45k9K94K99j56k17K13M05M42J008J638J188Ml97K45O96L66j73
55469A02178o86j421j873j301l29k10p47p16p4J53j21j34o5p34j720j804j099
55452H9297p33o48J80J527K025J429P82M15k02p77l88N97Q14Q2m99n71o68o19
55434I2043J56R24M24q00r64O9P36N47O02J178J176L23k49j42k85r45j152n67
55416I3074n3L7L72R99J059M58J03J42k03q57p92JL62M0l5K00l20j574k111j495
$$ y = [162764, 165074, 166735, 168479, 170128, 171391, 172479, 173187, 172740, 171051, 168703, 165468, 160574, 154717, 149815, 146269, 142507, 137754, 133161, 129487, 125912, 122022, 118873, 116978, 115216, 112881, 110887, 109853, 108837, 107263, 106269, 106724, 107546, 107356, 106384, 105440, 104401, 103063, 102138, 102106, 102240, 101862, 101383, 101051, 100054, 98042, 96245, 95816, 96207, 96352, 96323, 96617, 96916, 96760, 96543, 96756, 97161, 97603, 98611, 100249, 101437, 101441, 101044, 101289, 101985, 102351, 102178, 101492, 100071, 98198, 96897, 96568, 96358, 95611, 94895, 94821, 94974, 94853, 94719, 94654, 93920, 92200, 90396, 89297, 88564, 87916, 88096, 89623, 91648, 93077, 93859, 94274, 94072, 93295, 92907, 93504, 94318, 94400, 93901, 93330, 92662, 92043, 92199, 93123, 93547, 92747, 91783, 91852, 92588, 93135, 93737, 94915, 96091, 96414, 96165, 96023, 95738, 94793, 93641, 93074, 93021, 93058, 93430, 94429, 95488, 95946, 96049, 96191, 95988, 95131, 94339, 94340, 94702, 94742, 94707, 94907, 94587, 93013, 90902, 89407]
55396H9407j015j271j173j91M20k26j080r13j33K99M19O12N64on14l11L62Q74
55378H6124J027R45Q06Q59J066Q30l8n20K14J046J92j957l090k138l86P69J270
55361H7019J317O66l21n71P6N80M70M38P37N40m95j490j768j668j445p74J44M57
55343H3912J48K88J162J661J123L72J66Ro00j021n61K74N72L11J60N30J248J718
55325I1472J265j6r02l99P41R34j2q81j049j022j010n43K83P05O55Q49J307J228
55307I3605M98m7j19k38m28j23N10O51L04J54m8j101k365k157l77J201J647J838
55289I3405K229J956Q44J90O05R27L29l46l16k38p48j209r95n56l35LL82l4j199
55270I4894j728r66PK95M12O75K30j096j771p21R04J484J068N23m0o54o21L13
$$ y = [89407, 88392, 87121, 85948, 85757, 86177, 85951, 84871, 83958, 83825, 84124, 84543, 85155, 85719, 85713, 85199, 84888, 85250, 86124, 87151, 88096, 88902, 89761, 90827, 91657, 91619, 91099, 91313, 92359, 92551, 90594, 87504, 85366, 84980, 85749, 87019, 88336, 89002, 88681, 88110, 88186, 88766, 89236, 89674, 90411, 90951, 90456, 88966, 87198, 85530, 84085, 83311, 83455, 83912, 84060, 84348, 85510, 87171, 88294, 88666, 88832, 88841, 88241, 87220, 86659, 86933, 87505, 87816, 87976, 88506, 89754, 91472, 92737, 92721, 91819, 91420, 92161, 93095, 93083, 92202, 91153, 90131, 89121, 88578, 88861, 89566, 90221, 91070, 92377, 93605, 94103, 94056, 93937, 93699, 93271, 93148, 93658, 94309, 94613, 94767, 94719, 93618, 91253, 89096, 88719, 89920, 91567, 93405, 95634, 97590, 98434, 98624, 99229, 100156, 100485, 100139, 99823, 99585, 98837, 97628, 96633, 96077, 95742, 95745, 96127, 96093, 94894, 93166, 92200, 92207, 92502, 92914, 93589, 93819, 92723, 90952, 90231, 91135, 92619, 93687, 94210, 94170, 93516, 92895, 93208]
55252I3208J052P26P2R6N32P89J179J916K077R47o29j503j833k212k289j611q54
55235I1663q19j041o69N3M10N15P94R65P20N90R89J217N64m00p75p77j086j492
55217I1421j382r47p12m80J78Q82R20L21l72q42q77k37O89R22K57l21j87N3m3
55198H9243J87J089J638R89j1j89K02L54M66J010J348O56m41o79j5N60O22N17
55180I7546L69J08k7J03L5m30n83J21J049J370J312J374J247N90K6J14J84n21
55162A03987j282q98L65J175J034N23Q5k24j98J84L29j08m25K1N84L51l03m28
55144A04772j76m00j008j035j76Q94J515J449O13o79j540j429q45m32o4M54O03
55127A02516J0o86q52r05j293j403o48K17K39j28J40Q47J083Q24O45M67j1k17
$$ y = [93208, 94260, 94986, 95058, 95154, 95686, 96475, 97654, 99570, 101647, 102594, 101965, 100462, 98629, 96417, 94128, 92517, 91663, 90844, 89803, 89134, 89187, 89597, 90112, 90906, 91871, 92591, 93181, 94170, 95387, 95951, 95551, 94776, 93999, 92913, 91421, 90039, 89092, 88380, 87900, 88078, 88960, 89880, 90201, 89829, 88987, 88110, 87873, 88562, 89484, 89741, 89420, 89233, 89286, 89243, 89430, 90519, 92157, 93146, 93135, 92946, 93148, 93502, 93968, 94978, 96326, 96982, 96541, 95862, 95847, 96407, 97029, 97546, 97915, 98023, 97996, 98099, 98134, 97704, 97121, 97242, 98291, 99661, 100973, 102347, 103594, 104184, 104210, 104324, 104508, 103987, 102705, 101807, 102172, 103347, 104381, 104904, 104989, 104765, 104567, 104751, 105080, 104972, 104547, 104568, 105152, 105503, 105200, 104772, 104596, 104196, 103188, 102153, 101977, 102871, 104386, 105835, 106448, 105769, 104229, 102800, 101955, 101523, 101459, 101913, 102516, 102526, 101840, 100988, 100083, 98790, 97387, 96739, 96956, 97195, 97067, 97207, 98054, 99137, 99961, 100606, 101073, 101062, 100845]
55109A00845M80J477J722J324R82O48R3rQ32J490O77q31j268n57M0L56J221K224
55091A11746J945N09l10J55O39L01q0J33L16k2k49J37O07O98Q33J349J753J605
55073A22065J230J019Q50O49P08J029J135P71J88m44j123j516j252o60l96m04
55057A23849j98Nm01j100j144n67l70p90j006p82r38j673j854q16L74M11m31r27
55039A11642o93l49k70j04N40J435J984J862J322Q14L15n46j635k116j507m49
55023A12245J32J08j13l13k86L72J393J553K81j120j099n9L93j33o78q04r24r40
55005A10008k78O79Q61L76M97J496K086J513O75N34P02L72l96j031j239r00M1
54988A15996J142J683J563J282R07N0j040j465j052o29o64o99m55l72n91m83K46
$$ y = [100845, 101325, 102802, 104524, 105848, 106830, 107478, 107571, 107562, 108394, 109884, 110561, 109730, 108462, 107905, 107945, 108301, 109522, 111746, 113691, 114200, 113890, 114045, 114684, 114985, 114905, 115038, 115354, 115332, 115083, 115220, 115827, 116525, 117358, 118707, 120460, 122065, 123295, 124314, 125164, 125813, 126521, 127550, 128685, 129456, 129644, 129200, 128077, 126561, 125309, 124649, 124253, 123849, 123651, 123656, 123255, 122155, 121011, 120444, 120074, 119284, 118278, 117496, 116558, 114885, 113031, 112215, 112589, 113000, 112569, 111642, 110949, 110600, 110330, 110226, 110766, 112201, 114185, 116047, 117369, 118183, 118498, 117952, 116317, 114201, 112694, 112245, 112377, 112485, 112372, 112059, 111773, 112145, 113538, 115091, 115372, 114252, 113153, 113094, 113487, 113354, 112676, 111872, 110948, 110008, 109730, 110409, 111270, 111646, 112143, 113639, 115725, 117238, 117913, 118447, 119149, 119521, 119125, 118094, 116855, 115955, 115996, 117138, 118821, 120384, 121666, 122573, 122623, 121583, 120118, 119066, 118437, 117773, 117074, 116619, 116247, 115656, 115173, 115419]
54971A15419R57J117J021J036R88P59O71P55N43Lj76L10Q33Q88Q42J020J003M28
54953A28417j29J37J121J930J857Q39n99j663j876j500j099p61k98M4j09m25k20
54936A25666L99P19O70Q38J237J295J145J643K809L515L232K895L494M842O280
54921A60679P598Q572Q704Q058P538P641P618O475M100J007k257n009o608p217
54907B06899p640q072p893p003o236n950n361l961k559k018j952j625j258j452
54893A43919j892j726q51J0L15J18j70K9J109K713L886M172M117M394N080O006
54877A71229P162Q320Q938Q876Q503P817O241L703J056j097l106n264o980p710
54863B07688p871q011p776o629m991l882l675l940m169m103l736l382l388l499
$$ y = [115419, 116376, 117493, 118514, 119550, 120538, 121297, 121968, 122723, 123266, 123269, 123093, 123403, 124236, 125124, 125966, 126986, 127989, 128417, 128288, 128425, 129546, 131476, 133333, 134172, 133573, 131910, 130034, 128534, 127435, 126674, 126376, 126420, 126311, 125886, 125666, 126065, 126784, 127454, 128292, 129529, 130824, 131969, 133612, 136421, 139936, 143168, 146063, 149557, 154399, 160679, 168277, 176849, 185553, 193611, 201149, 208790, 216408, 222883, 226983, 227990, 225733, 220724, 214116, 206899, 199259, 191187, 183294, 176291, 170055, 164105, 158744, 154783, 152224, 150206, 148254, 146629, 145371, 143919, 142027, 140301, 139450, 139460, 139775, 139893, 139723, 139752, 140861, 143574, 147460, 151632, 155749, 160143, 165223, 171229, 178391, 186711, 195649, 204525, 213028, 220845, 227086, 230789, 231845, 230748, 227642, 222378, 215398, 207688, 199817, 191806, 184030, 177401, 172410, 168528, 164853, 160913, 156744, 152641, 148905, 145523, 142135, 138636]
54849A38636l116k367k139k584k617j537k22O9o45j387j583j303p71l11k86l97
54833A17440L11K082L683L826K680J303K25n81r79r09q69j230j458r26p8J72j58
54816A24534k33K98R58J247J080N81L9j16J46K38j89n96m07L3L6k33q4M80P72
54797A28584N02J23M3J77K63J91L6Q7N91J205J163L69k48qN02L90j38k27K16N67
54777A34388P12J202K221L240L833M095M260M446M877N721O672P151P112P186
54763A97116P887Q851R028P568M678J534q71k636m345n824o410o374o855p984
54749A95363q346p097n420m777m759m034k639j740j527j012J7M65k42j103r17
54734A52232J20R23J005Q22R27J318J647J877K512M004N924P228P515P517P933
$$ y = [138636, 135520, 133153, 131014, 128430, 125813, 124276, 124054, 124123, 123478, 122091, 120508, 119205, 118434, 118123, 117837, 117440, 117751, 119833, 123516, 127342, 130022, 131325, 131550, 130969, 129990, 129081, 128212, 126982, 125524, 124598, 124520, 124692, 124534, 124301, 124599, 125557, 126804, 127884, 128465, 128504, 128388, 128534, 128772, 128583, 127987, 127580, 127613, 127649, 127416, 127332, 127812, 128584, 129086, 129209, 129252, 129429, 129692, 129883, 129919, 130006, 130597, 131802, 132965, 133334, 133086, 133078, 133580, 133970, 133832, 133605, 133821, 134388, 135100, 136302, 138523, 141763, 145596, 149691, 153951, 158397, 163274, 168995, 175667, 182818, 189930, 197116, 205003, 213854, 222882, 230450, 235128, 236662, 235791, 233155, 228810, 222986, 216576, 210202, 203347, 195363, 187017, 179920, 174500, 169723, 164964, 160930, 158291, 156551, 155024, 154012, 154029, 154494, 154252, 153149, 152232, 152352, 153275, 154280, 155102, 156029, 157347, 158994, 160871, 163383, 167387, 173311, 180539, 188054, 195571, 203504]
54719B03504Q400Q158P195N961M306J661j810n050p144p977p923p462p021o713
54705A88085o236n420m607m114l682l007k418k294k199j472l81J72J7k20l29q39
54689A51056j943k985l370l214k797k005p52N32J243J159M79l76r04q27m16k36
54673A34644m80q15r62j029j182j290j066m29L51P74M91k43o45k09P33J440J542
54656A31625J136L81n35j165j059l28M24P32O41M42K57m7n90j119j029p1J050
54639A30745J331P59K86L85M03j70o56k00Q21J308R58L82l4m48q25q08l86K8K43
54620A34122M35N41K13m52p78m34J6j61q68j253p14L96J131R77L93J33K85K77
54602A34259j50n77o16l80n0M36R44R95N13J24K39M37K67M6K59P17R92J121J210
$$ y = [203504, 211904, 220062, 227257, 233218, 237524, 239185, 237375, 232325, 225181, 217204, 209281, 201819, 194798, 188085, 181849, 176429, 171822, 167708, 164026, 161019, 158601, 156307, 154108, 152636, 152255, 152427, 152444, 152224, 151895, 151056, 149113, 146128, 142758, 139544, 136747, 134742, 133990, 134522, 135765, 136924, 137403, 137027, 136123, 135296, 134880, 134644, 134164, 133349, 132387, 131358, 130176, 128886, 127820, 127391, 127742, 128516, 129007, 128764, 128119, 127910, 128643, 130083, 131625, 132761, 133142, 132607, 131442, 130383, 130055, 130479, 131211, 131852, 132294, 132551, 132504, 131914, 130795, 129766, 129695, 130745, 132076, 132835, 133121, 133506, 133909, 133739, 133083, 132883, 133704, 135012, 135970, 136352, 136318, 135870, 135045, 134237, 133851, 133879, 134122, 134557, 135098, 135311, 134859, 134081, 133647, 133663, 133502, 132634, 131381, 130667, 131063, 132194, 133171, 133564, 133697, 133982, 134259, 134109, 133532, 132916, 132536, 132486, 132922, 133866, 134861, 135374, 135498, 135737, 136174, 136441, 136487, 136746, 137463, 138455, 139576, 140786]
54583A40786Q73m4p96o54q7%k70j12M04M40j13m78l71l76p34q36l78Q1J02Q6M40
54562A37963P70N82J71J00K41M9l60k18P78J842K010J281N32L63N26N08J96k75
54544A47059q70j266p30Q68K225J916M00m05K80J267J439J150R76M93n34j086
54528A53182l33P52O40n85j626k006k165k064j224K2O83N18J23k10n58n39K72
54511A44882J120P03q52j982j779q65n8N52Q77N56j14j01Q37J544J011k33r10
54494A45188n30M35J344J790J607R74L00j68m86p33q66q27n30N8N66L64n01j028
54476A46957n11N24J285J884K586K632J258o13j248m49M63Q72J423K265K443J517
54460A63288L44k42l04n2N17Q41J21j178j508n08L04j46r42q51k60k73q93j312
$$ y = [140786, 141659, 141615, 140819, 140165, 140078, 140078, 139808, 139696, 140100, 140540, 140427, 139949, 139578, 139202, 138468, 137632, 137254, 137335, 137437, 137523, 137963, 138733, 139315, 139486, 139586, 139827, 139876, 139516, 139298, 140076, 141918, 143928, 145209, 145741, 146104, 146630, 147138, 147334, 147059, 146189, 144923, 144193, 145061, 147286, 149202, 149602, 149197, 149477, 150744, 152183, 153333, 154309, 154802, 154268, 153182, 152849, 153601, 154241, 153656, 152030, 150024, 147859, 145795, 144571, 144593, 145276, 145794, 145917, 145707, 145149, 144610, 144882, 146002, 146705, 145853, 143871, 142092, 141227, 141169, 141721, 142598, 143154, 143040, 142939, 143776, 145320, 146331, 146098, 145188, 144658, 145093, 146437, 148227, 149834, 150808, 151108, 150940, 150454, 149721, 148855, 148028, 147498, 147556, 148122, 148486, 147985, 146957, 146446, 146970, 148255, 150139, 152725, 155357, 156615, 156002, 154754, 154305, 154768, 155640, 157063, 159328, 161771, 163288, 163632, 163390, 163086, 163034, 163551, 164392, 164513, 163335, 161827, 161319, 161623, 161477, 160535, 159684, 159424, 159151, 158258, 156946]
54442A56946j230r13m63K3J19l25p35n72m3M50Q76J113P11k77j025j106j057j163
54424A51329p03P48K184K395J578P25J16m31n28K41J145J039J21k43M76J242R48
54407A62382k64j444j874j464o25l5r1m42l32M98J537K188K365K343K258J991
54391A68991J481R66P22O23K98j85k34K75M84k87j286j230j37P70J011J343K139
54374A75744K521J725L52n31o68l22M29J400J980J947K056L050M413M933M219
54359B03248L072K496K723L086K581R06j020j970j891j833k370k966l083k927
54345B00052k718k280j795j928k566k538j386l83p92k002k505j983j260p85l53
54330A74778O1K77M49P08O27j15q84q66l17p8k22k42k61q37j670j684n98N76Q97
$$ y = [156946, 155716, 154803, 154340, 154363, 154482, 154157, 153422, 152850, 152807, 153257, 154133, 155246, 155957, 155680, 154655, 153549, 152492, 151329, 150626, 151374, 153558, 155953, 157531, 158256, 158372, 157941, 157413, 157654, 158799, 159838, 159959, 159716, 160192, 161434, 162382, 162118, 160674, 158800, 157336, 156711, 156676, 156585, 156143, 155811, 156309, 157846, 160034, 162399, 164742, 167000, 168991, 170472, 171438, 172160, 172783, 173081, 172896, 172662, 172937, 173421, 173134, 171848, 170618, 170481, 171251, 172262, 173605, 175744, 178265, 179990, 180342, 179811, 179143, 178821, 179250, 180650, 182630, 184577, 186633, 189683, 194096, 199029, 203248, 206320, 208816, 211539, 214625, 217206, 218112, 217092, 215122, 213231, 211398, 209028, 206062, 202979, 200052, 197334, 195054, 193259, 191331, 188765, 186227, 184841, 184458, 183666, 181664, 179159, 177176, 175916, 175131, 174778, 174839, 175116, 175565, 176273, 176900, 176785, 175901, 175035, 174718, 174640, 174418, 174176, 173915, 173078, 171408, 169724, 169126, 169702, 170599]
54311A70599N26J31k7o8q9j51m09r82j734k255k028r17M82J287J283R94P10J05
54293A67457q63j405r05J54Q78J087J146J185J207J441J852J728N74r50j703j429
54277A71454p75k61L3P0j37k87j79JJ80P12J605K057J489N27J42L13M34M29N45
54258A78352N05j6m81j27P74J320J317J152P56j59j071j181p54p29j139j256j063
54241A76200j209j478r17K90P06j17q35l72N40Q07O63R94J801K434K631K409J547
54224A86094N7j199j205J4J450K099J589K42j039j308n19L70M95p6q82j791k665
54207A81726k929k146q05J68M78N30O38P19P12O92O56M86K06k4j45j46Q9O00R97
54188A82502P48j40r74j089n05K59Q20J173J332J143O34L35P58J549J630N25q92
$$ y = [170599, 171125, 171256, 171229, 171161, 171072, 170921, 170512, 169530, 167796, 165541, 163513, 162596, 163078, 164365, 165648, 166642, 167352, 167457, 166594, 165189, 164284, 164438, 165316, 166403, 167549, 168734, 169941, 171382, 173234, 174962, 175536, 174586, 172883, 171454, 170679, 170418, 170451, 170521, 170384, 170097, 169918, 169919, 170099, 170811, 172416, 174473, 175962, 176489, 176631, 176944, 177378, 177807, 178352, 178857, 178841, 178360, 178233, 179007, 180327, 181644, 182796, 183552, 183393, 182322, 181141, 180387, 179658, 178519, 177263, 176200, 174991, 173513, 172596, 172886, 173592, 173475, 172640, 172268, 172808, 173615, 174278, 175272, 177073, 179507, 182138, 184547, 186094, 186151, 184952, 183747, 183761, 185211, 187310, 188899, 189141, 188102, 186794, 186275, 186645, 187140, 187064, 186182, 184391, 181726, 178797, 176651, 175846, 176014, 176492, 177022, 177660, 178379, 179091, 179783, 180439, 180925, 181131, 181107, 180962, 180816, 180905, 181505, 182502, 183250, 183110, 182136, 181047, 180542, 180801, 181621, 182794, 184126, 185269, 185903, 186238, 186996, 188545, 190175, 190700, 189808]
54171A89808j342p23j26l59r87j113o21k00l67q54j108j030r32r45p98k99K32
54154A78236L36nm26p04r04j095j232j292j159n63M58J202J042L84J63M45M11
54137A75297j16j98P31J828K006J352O98L06j56p92j324j523j238m05O19J115
54121A78200R16O63O48K10j009j899j101J058K857L225K573J818J479J632J995
54106A93265K055J711J560K002K458K197J600J663K541L467L954M218M488M646
54092B31825M476L615J595j380l983m956m515l821l435l229l256l532l262j643
54078B04499O63K050K049J694J850K371K995L794M423M175L124K268K078J870
54064B39903R87k83j319j870j881j414r80j121j549j494r80p33p33j26J136J853
$$ y = [189808, 188466, 187743, 187617, 187258, 186271, 185158, 184537, 184337, 183970, 183116, 182008, 180978, 180046, 179101, 178303, 178004, 178236, 178572, 178567, 178141, 177437, 176533, 175438, 174206, 172914, 171755, 171192, 171650, 172852, 173894, 174278, 174441, 174886, 175297, 175181, 174983, 175714, 177542, 179548, 180900, 181598, 181904, 181748, 180956, 179632, 178109, 176871, 176466, 177085, 178200, 179116, 179779, 180427, 180637, 179628, 177729, 176628, 177686, 180543, 183768, 186341, 188159, 189638, 191270, 193265, 195320, 197031, 198591, 200593, 203051, 205248, 206848, 208511, 211052, 214519, 218473, 222691, 227179, 231825, 236301, 239916, 241511, 240131, 236148, 231192, 226677, 222856, 219421, 216192, 212936, 209404, 206142, 204499, 205162, 207212, 209261, 210955, 212805, 215176, 218171, 221965, 226388, 230563, 233687, 235955, 238033, 239903, 240890, 240607, 239288, 237418, 235537, 234123, 233143, 232022, 230473, 228979, 227999, 227266, 226533, 226407, 227543, 229396]
54048B29396J371P03J088K353L446L898M009M173M659N592O677P360P605P945
54034B90275Q588R061R023Q686Q274P751P300P217P105O188M654L697L748L767
54020C85334K940J941J732K007J733O46p69k231l801n344o538p197p265o858o533
54005C49797o908p726q040p620p309p537p465o281m545l404l127l233l422l594
53991B69586l392k647j912j817k119k073j486r12r68j821l002l507k590p57N22
53976B41105M79k18o40o84n60q8P66J383J266P61M14J91n7k1N56J410K338L560
53958B51961M933N707N784O258P820R589J0560J1181J2086J2173R741N187Q47
53945C53827j743k981l571l420k464j281k67Q55K205L282L748L952M229M303L787
$$ y = [229396, 230767, 231470, 232558, 234911, 238357, 242255, 246264, 250437, 255096, 260688, 267365, 274725, 282330, 290275, 298863, 307924, 316947, 325633, 333907, 341658, 348958, 356175, 363280, 369468, 374122, 377819, 381567, 385334, 388274, 390215, 391947, 393954, 395687, 396333, 395564, 393333, 389532, 384188, 377650, 370453, 363188, 356330, 349797, 342889, 335163, 327123, 319503, 312194, 304657, 297192, 290911, 286366, 282962, 279835, 276602, 273180, 269586, 266194, 263547, 261635, 259818, 257699, 255626, 254140, 253228, 252260, 250439, 247437, 243930, 241340, 240583, 241105, 241584, 241366, 240726, 240042, 239482, 239394, 240160, 241543, 242809, 243570, 243984, 244175, 244118, 244097, 244653, 246063, 248401, 251961, 256894, 262601, 268385, 274643, 282463, 292052, 302612, 313793, 325879, 338052, 347793, 352980, 353827, 352084, 349103, 345532, 342112, 339648, 338367, 338100, 338955, 341160, 344442, 348190, 352142, 356371, 360674, 364461]
53930C64461K877K156K058K653L683M615N056N135N305N820O608P458Q017P896
53916D33798P303P241Q455J0386J1703J1814J1224J0622J0190R741Q905P261M856
53903E53499K461Q08l04j537k875l767m227m930o080o985p024o491o200o743q247
53888D91358j0311j2044j2704j2455j2045j1729j1037r797q655q273q420q298
53876C65590p501o317n282m748m706m868m958n005n261n778o241o221n584m669
53862B88451m073m121m420m188l184k100j730k019k225j876j167n79m46p97j337
53847B54189j588j378j070j040j129q68k22L08K68l40j204j928k177j841j132
53832B38848m48j22k67p09j010p73lR52J762K245K265J934J776K112K426J998
$$ y = [364461, 367338, 369494, 371552, 374205, 377888, 382503, 387559, 392694, 397999, 403819, 410427, 417885, 425902, 433798, 441101, 448342, 456797, 467183, 478886, 490700, 501924, 512546, 522736, 532477, 541382, 548643, 553499, 555960, 556768, 556464, 554927, 552052, 548285, 544058, 539128, 533048, 526063, 519039, 512548, 506348, 499605, 491358, 481047, 469003, 456299, 443844, 431799, 420070, 409033, 399236, 390581, 382308, 373888, 365590, 358089, 351772, 346490, 341742, 337036, 332168, 327210, 322205, 316944, 311166, 304925, 298704, 293120, 288451, 284378, 280257, 275837, 271649, 268465, 266365, 264635, 262616, 260391, 258515, 257348, 256769, 256323, 255526, 254189, 252601, 251223, 250153, 249113, 247984, 247116, 246894, 247202, 247470, 247130, 245926, 243998, 241821, 239980, 238848, 238400, 238278, 238011, 237302, 236292, 235519, 235516, 236468, 238230, 240475, 242740, 244674, 246450, 248562, 250988, 252986]
53816B52986J181J066J827K328J829J066J017J539K004K481L352M395N160N811
53802B88042O711P615Q074Q271Q611Q906Q798Q553Q475Q028O559M646L576L641
53788C88506L929L746L203K479J464K61q32j936l350m690n196m928m849n537o650
53773C65620p722q646r215r012q040o860n855m966m217l896m034m328m632m918
53759B79279m804l975l012k929l668l976l104j809j246j560k081k270k017j427
53745B41401p88m74n43o93o88n54l39j08j44o34j141j008l33J04L3K7M35P53N18
53726B35824J88M95J319J809J479P52L88O42J085J215J113J242J591J498O58k66
53710B51032n33l52k70k0J027K484L142K675K109K379L262M041M440M519M342
$$ y = [252986, 254167, 255233, 257060, 259388, 261217, 262283, 263300, 264839, 266843, 269324, 272676, 277071, 282231, 288042, 294753, 302368, 310442, 318713, 327324, 336230, 345028, 353581, 362056, 370084, 376643, 381289, 384865, 388506, 392435, 396181, 399384, 401863, 403327, 403588, 402756, 400820, 397470, 392780, 387584, 382656, 377807, 372270, 365620, 357898, 349252, 340037, 331025, 322985, 316125, 310270, 305304, 301087, 297191, 293157, 288829, 284197, 279279, 274475, 270500, 267488, 264559, 260891, 256915, 253811, 252002, 250756, 249196, 247115, 244845, 242828, 241401, 240613, 240139, 239596, 238903, 238215, 237661, 237322, 237214, 237070, 236436, 235295, 234287, 233954, 234058, 234091, 234118, 234553, 235306, 235824, 236012, 236507, 237826, 239635, 241114, 241866, 242254, 242896, 243981, 245196, 246309, 247551, 249142, 250640, 251298, 251032, 250499, 250147, 249877, 249857, 250884, 253368, 256510, 259185, 261294, 263673, 266935, 270976, 275416, 279935, 284277]
53695B84277M108M065L986L383K309J395Q96M64N0J33P29J006M07n28j028j106
53679C04546j142j019l87N35J090R40L44k34m48k91j03k20m96m85j63J9j43k81
53661C02062n3M13Q28J017Q30K49k29L0R24J601J551J089O08P0m60m97J72J018
53643C11223J387J191O85Q5k83M4J051K051K426K225J814J335Q56N78O35J038
53627C28341J873L083M008L901K998K346K356K433K374K992M699O375O615N490
53613C79884M180L305K642K130K166K809L385L150K058Q34M02J031J909J896Q40
53598D12621k48l91M36J678K761L038K058L84o11l75J31r5p18r43q96j173j531
53581D16126j274n81l61q36j374j654k052k695l012k520j463m30J68J71l01p93
$$ y = [284277, 288385, 292450, 296436, 299819, 302128, 303523, 304419, 304883, 304933, 305066, 305795, 306801, 307208, 306680, 305652, 304546, 303404, 302385, 301998, 302533, 303623, 304563, 304907, 304673, 304225, 303934, 303831, 303611, 303115, 302630, 302467, 302486, 302343, 302062, 302009, 302422, 303250, 304267, 305097, 305346, 305117, 305147, 306071, 307672, 309223, 310312, 310920, 310990, 310530, 310033, 310205, 311223, 312610, 313801, 314486, 314571, 314288, 314332, 315383, 317434, 319860, 322085, 323899, 325234, 326090, 326668, 327303, 328341, 330214, 333297, 337305, 341206, 344204, 346550, 348906, 351339, 353713, 356705, 361404, 367779, 374394, 379884, 384064, 387369, 390011, 392141, 394307, 397116, 400501, 403651, 405709, 406543, 406945, 407976, 409885, 411781, 412621, 412373, 411982, 412418, 414096, 416857, 419895, 421953, 422337, 421726, 421351, 421482, 421387, 420669, 419726, 418830, 417657, 416126, 414852, 414271, 413910, 413074, 411700, 410046, 407994, 405299, 402287, 399767, 398304, 397874, 398042, 398213, 397912, 397119]
53565C97119r66j135j840k863l203k229m48J102J825J775J258N75J8j74P9O14
53549C91507J104J288J177R72P91O49P21J289K316L270L573L074K088J274J384
53534D16477K651M233M823M103L219L505N101P036Q325Q655Q429Q427R190J0423
53520E04597J1308J1513J1445J1464J1462J1466J1963J3193J4650J5797J6739
53509F45597J7835J9121K0522K2033K3219K3354K2592K2221K2969K3748K3071
53498H86282K1147J9551J9112J9228J9019J8212J6949J5649J5011J5387J6193
53487A081740J6587J6552J6579J6629J6399J6331J7165J8468J8880J8093J7377
53476A270800J7618J7934J6979J4841J2669J0965R183O886M472K511R15q88l134
$$ y = [397119, 396153, 395018, 393178, 390315, 387112, 384883, 384435, 385537, 387362, 389137, 390395, 390970, 390988, 390814, 390893, 391507, 392611, 393899, 395076, 396048, 396839, 397488, 398209, 399498, 401814, 405084, 408657, 411731, 413819, 415093, 416477, 419128, 423361, 428184, 432287, 435506, 439011, 444112, 451148, 459473, 468128, 476557, 484984, 494174, 504597, 515905, 527418, 538863, 550327, 561789, 573255, 585218, 598411, 613061, 628858, 645597, 663432, 682553, 703075, 725108, 748327, 771681, 794273, 816494, 839463, 863211, 886282, 907429, 926980, 946092, 965320, 984339, 1002551, 1019500, 1035149, 1050160, 1065547, 1081740, 1098327, 1114879, 1131458, 1148087, 1164486, 1180817, 1197982, 1216450, 1235330, 1253423, 1270800, 1288418, 1306352, 1323331, 1338172, 1350841, 1361806, 1370989, 1377875, 1382347, 1384858, 1385773, 1384885, 1381751]
53463A381751n314o799p623q398r367r923r430q259p583q190r862j1840j3551
53450A265612j4849j5847j6618j7032j6975j6744j6838j7207j7056j5849j4075
53439A086522j2538j1242r556p313n074l383k317j802j754j854j631r69j85M28
53425A027332R10J480K239L053L609L816M223N681Q283J1070J3091J4384J5459
53412A114630J6400J7071J7756J8847K0225K1602K3169K5139K6968K7880K8016
53401A357703K8244K9002L0186L1968L4642L7696M0068M1543M2949M4783M6548
53390A765332M7736M8546M9275M9785M9971M9972M9640M8524M6771M5252M4334
53379B295138M3316M1550L9369L7286L4996L2009K8583K5214K1583J6959J1520
$$ y = [1381751, 1376437, 1369638, 1362015, 1353617, 1344250, 1334327, 1324897, 1316638, 1309055, 1300865, 1291003, 1279163, 1265612, 1250763, 1234916, 1218298, 1201266, 1184291, 1167547, 1150709, 1133502, 1116446, 1100597, 1086522, 1073984, 1062742, 1053186, 1045873, 1040799, 1037416, 1035099, 1033297, 1031543, 1029689, 1028058, 1027089, 1026904, 1027332, 1028242, 1029722, 1031961, 1035014, 1038623, 1042439, 1046662, 1052343, 1060626, 1071696, 1084787, 1099171, 1114630, 1131030, 1148101, 1165857, 1184704, 1204929, 1226531, 1249700, 1274839, 1301807, 1329687, 1357703, 1385947, 1414949, 1445135, 1477103, 1511745, 1549441, 1589509, 1631052, 1674001, 1718784, 1765332, 1813068, 1861614, 1910889, 1960674, 2010645, 2060617, 2110257, 2158781, 2205552, 2250804, 2295138, 2338454, 2380004, 2419373, 2456659, 2491655, 2523664, 2552247, 2577461, 2599044, 2616003, 2627523]
53368B627523O375K199j527n763j0870j6422k1729k6351l0298l3801l6833l9000
53356B413503m0074m0445m0723m1040m1030m0425l9304l7698l5401l2449k9651
53345A995263k8176k8475k9846l1242l2293l3174l3673l3057l1095k8636k6695
53334A658901k5377k4119k2647k1071j9326j7224j5035j3384j2543j2313j2587
53323A463275j3491j4901j6398j7749j8932j9655j9442j8368j7169j6416j5934
53312A274820j5229j4035j2405j0628r221q526q184p454o148m768l632k400p04
53299A171486J283L175M858O414P960R740J1944J4251J6043J7232J8398J9866
53287A302650K1213K1978K2270K2268K1659K0163J8257J6818J6117J5564J4330
$$ y = [2627523, 2633898, 2636097, 2634570, 2628807, 2617937, 2601515, 2579786, 2553435, 2523137, 2489336, 2452503, 2413503, 2373429, 2332984, 2292261, 2251221, 2210191, 2169766, 2130462, 2092764, 2057363, 2024914, 1995263, 1967087, 1938612, 1908766, 1877524, 1845231, 1812057, 1778384, 1745327, 1714232, 1685596, 1658901, 1633524, 1609405, 1586758, 1565687, 1546361, 1529137, 1514102, 1500718, 1488175, 1475862, 1463275, 1449784, 1434883, 1418485, 1400736, 1381804, 1362149, 1342707, 1324339, 1307170, 1290754, 1274820, 1259591, 1245556, 1233151, 1222523, 1213302, 1204776, 1196592, 1189138, 1182990, 1178222, 1174590, 1172190, 1171486, 1172769, 1175944, 1180802, 1187216, 1195176, 1204916, 1216860, 1231111, 1247154, 1264386, 1282784, 1302650, 1323863, 1345841, 1368111, 1390379, 1412038, 1432201, 1450458, 1467276, 1483393, 1498957, 1513287]
53276A513287J1982Q784N583L119J269p48l221n548p208q598j0408j2675j4996
53263A480622j7248j9382k0880k1242k0878k0757k1150k1451k1297k1176k1570
53252A253591k2128k2097k1304k0302j9684j9563j9638j9539j9170j8846j9009
53241A032311j9674k0289k0315j9796j9103j8313j7194j5876j4973j4763j4614
53230H37401j3733j2309j1286j0993j0647r507p943o908o801p357q376r896j1680
53217G09965j3191j4186j4936j5753j6578j7105j7050j6293j5020j3712j2764
53206E43377j2151j1608j1042j0495r877r076q235p572p104o873p207q269r513
53193D24355j0135r990r539q972q017o622n235m286l846l891m312m705m653m362
$$ y = [1513287, 1525269, 1534053, 1539636, 1542755, 1544024, 1543276, 1540055, 1534507, 1527299, 1518701, 1508293, 1495618, 1480622, 1463374, 1443992, 1423112, 1401870, 1380992, 1360235, 1339085, 1317634, 1296337, 1275161, 1253591, 1231463, 1209366, 1188062, 1167760, 1148076, 1128513, 1108875, 1089336, 1070166, 1051320, 1032311, 1012637, 992348, 972033, 952237, 933134, 914821, 897627, 881751, 866778, 852015, 837401, 823668, 811359, 800073, 789080, 778433, 768926, 760983, 754075, 747274, 739917, 731541, 721645, 709965, 696774, 682588, 667652, 651899, 635321, 618216, 601166, 584873, 569853, 556141, 543377, 531226, 519618, 508576, 498081, 488204, 479128, 470893, 463321, 456217, 449344, 442137, 433868, 424355, 414220, 404230, 394691, 385719, 377702, 371080, 365845, 361559, 357713, 353822, 349510, 344805, 340152, 335790]
53179C35790m409m815m985m677m351m273m023l232k255j675j570j614j550j232
53165B91129n75J87N68M17J01j07m28j091j876k359k381j995j343p43n03m22L3
53148B78612Q76J358R06j83j196j722j632r03J32P88O85J12n05j061j444j310
53132B73513o20P2L11K89L77N22N91P95J285J768J976K112K299K122J333N77O26
53115B89948J221J450J052N99N03N97O53O04L38k02o81p56o55q13r95o09J59L37
53097B92750m44j375j616j328j096r71p11n23p79j216j111l31M30O04L77J77j
53080B82836l15n44l13K22N16M43M48P44R03N73J59L17J031J600J385K76j318
53063B88963k607k823j971r79o50p82p28m42l05k63PK82J31n6O02K004K982K917
$$ y = [335790, 331381, 326566, 321581, 316904, 312553, 308280, 304257, 301025, 298770, 297095, 295525, 293911, 292361, 291129, 290554, 290741, 291309, 291726, 291827, 291720, 291292, 290201, 288325, 285966, 283585, 281590, 280247, 279504, 279001, 278579, 278612, 279488, 280846, 281752, 281569, 280373, 278651, 277019, 276116, 276248, 277036, 277721, 277833, 277328, 276267, 274823, 273513, 272893, 272965, 273276, 273565, 273942, 274464, 275055, 275850, 277135, 278903, 280879, 282991, 285290, 287412, 288745, 289322, 289948, 291169, 292619, 293671, 294270, 294773, 295370, 296023, 296627, 296965, 296763, 296082, 295326, 294671, 293858, 292863, 292254, 292413, 292750, 292306, 290931, 289315, 287987, 286891, 285920, 285209, 284686, 283907, 282691, 281580, 281249, 281679, 282283, 282660, 282837, 282836, 282521, 281977, 281664, 281886, 282402, 282845, 283293, 284037, 284940, 285513, 285672, 285989, 287020, 288620, 290005, 290281, 288963, 286356, 283533, 281562, 280583, 279933, 279151, 278423, 277981, 277676, 277413, 277420, 277702, 277833, 277777, 278379, 280383, 283365, 286282]
53045B86282K425K078J562N83k99n34m81p01j075j214j195j118o28L86J129P94
53029B87994k49r20p87k46L62R92J463J478J136Q55Q48R62R46O25P3k14K89J297
53011B96904J842J498Q84N62K59k97o49m50k84o56r13k29Q79J263R14P21Q69P59
52993C03876M55P00J400J449N01l44j82M71P20O84J005J648K015J917J755J836
52977C19906K048K153K104K021J958J723J012j06j005j085m20M13J009J272J181
52962C34184Q82Q27J202J422P58n41j463j600j578j967k489k569k194j769j556
52947C21549j493j440j333j207j140j110j020r68j246j816k096j681r10l50j0
52932C03729L14L46j83o89l43N31O59l90j537j699j102o32n70n07j51K87L64j21
$$ y = [286282, 288707, 290785, 292347, 292930, 292631, 292097, 291616, 290915, 289840, 288626, 287431, 286313, 285685, 286071, 287200, 287994, 287745, 286825, 286038, 285792, 286154, 287146, 288609, 290087, 291223, 292078, 292926, 293888, 294834, 295459, 295532, 295318, 295607, 296904, 298746, 300244, 301128, 301690, 301949, 301652, 301003, 300553, 300269, 299613, 298700, 298471, 299350, 300613, 301527, 302248, 303117, 303876, 304331, 305031, 306431, 307880, 308381, 308037, 307855, 308326, 309046, 309730, 310735, 312383, 314398, 316315, 318070, 319906, 321954, 324107, 326211, 328232, 330190, 331913, 332925, 332819, 331814, 330729, 330309, 330722, 331731, 333003, 334184, 335066, 335893, 337095, 338517, 339275, 338734, 337271, 335671, 334093, 332126, 329637, 327068, 324874, 323105, 321549, 320056, 318616, 317283, 316076, 314936, 313826, 312806, 311838, 310592, 308776, 306680, 304999, 304089, 303739, 303729, 304043, 304389, 304206, 303517, 303174, 303705, 304364, 303974, 302437, 300738, 299636, 299004, 298434, 297927, 297776, 298063, 298427, 298306]
52914B98306q11r73l42L74L68q1l7N70P62L8q23r61o20n32p29p38m82k79j10M27
52894B93327J368K101J991J096J73k3N38J175J301J074J037J254J203M99o46j691
52878C05777k153j788q09P7K98O8L1L54O78R46J553K595L546L924L762L261K528
52861C24648J809J402J137M60p51k000k927l698m395m683m391l896l572l341l090
52846B92712k966k949k711k280k225k734l069k529j446o48l50k40k02l10l46o2
52830B67645K81K94K33O84J567K142K033J613J223P18L8l60j00M09M54L5j51K89
52812B79047Q76R83O94N79P45P15K95M3M35R75P03n14j693j865j087k12O4k33
52794B80550o32q10q58r32q57l73K96O21N22M24L83q8r69j320n76N17J073J396
$$ y = [298306, 297495, 296522, 296180, 296554, 296922, 296841, 296804, 297374, 298136, 298174, 297351, 296390, 295770, 295238, 294509, 293771, 293289, 293010, 292900, 293327, 294695, 296796, 298787, 299883, 300056, 300033, 300571, 301746, 303047, 304121, 305158, 306412, 307615, 308114, 307468, 305777, 303624, 301836, 301027, 301104, 301402, 301470, 301501, 301855, 302533, 303479, 305032, 307627, 311173, 315097, 318859, 322120, 324648, 326457, 327859, 328996, 329456, 328705, 326705, 323778, 320080, 315685, 311002, 306611, 302715, 299143, 295802, 292712, 289746, 286797, 284086, 281806, 279581, 276847, 273778, 271249, 269803, 269155, 268805, 268565, 268363, 268053, 267707, 267645, 267926, 268220, 268453, 269137, 270704, 272846, 274879, 276492, 277715, 278433, 278471, 278111, 278011, 278420, 278874, 278909, 278758, 279047, 279923, 280906, 281600, 282179, 282924, 283639, 283934, 283977, 284412, 285387, 286090, 285576, 283883, 282018, 280931, 280719, 280783, 280550, 279918, 279108, 278250, 277318, 276461, 276088, 276384, 277005, 277527, 277951, 278334, 278246, 277277, 275957, 275381, 275898, 276971, 278367]
52776B78367K015K226J006r25j706r39j26k12m04O5N46K36m45p30p63r27q98l29
52758B76057K37K29J18O25J396J558J102P34O81O19N59Q16J243J382J279J416
52742B90051J886K342K653K957L150K973K518K085J649J019M11K57N51R44J287
52727C16733J589J611J201P95Q83J105O02p22j986k410k026j285n94l25o87j376
52711C13108j751j489p69M2N61M16k92p22j42R85J404O66l72p73o23n65q14j061
52693C07809r76m74L25J096J426J140M27m54j355k041k026r90P09K031J987N07
52677C09141j382k370k008r72k64l07q83j494j637j048p9M43O7p25j135r75o03
52660B93769k10L71J201K038K601K788K676K540K697L111L264K736J746Q22J78
$$ y = [278367, 280382, 282608, 283614, 282689, 280983, 280044, 279918, 279706, 279302, 279367, 279913, 280149, 279704, 278974, 278211, 277284, 276386, 276057, 276294, 276523, 276641, 277266, 278662, 280220, 281322, 282056, 282737, 283356, 283915, 284731, 285974, 287356, 288635, 290051, 291937, 294279, 296932, 299889, 303039, 306012, 308530, 310615, 312264, 313283, 313694, 313951, 314502, 315446, 316733, 318322, 319933, 321134, 321929, 322812, 323917, 324519, 323797, 321811, 319401, 317375, 316090, 315496, 315171, 314484, 313108, 311357, 309868, 309099, 309141, 309702, 310118, 309826, 309104, 308962, 309947, 311351, 312017, 311645, 310872, 310249, 309684, 308870, 307809, 306833, 306359, 306684, 307780, 309206, 310346, 310773, 310319, 308964, 306923, 304897, 303907, 304616, 306647, 308634, 309141, 307759, 305389, 303381, 302409, 302145, 301838, 300955, 299461, 297824, 296776, 296697, 297140, 297207, 296482, 295347, 294372, 293769, 293559, 293930, 295131, 297169, 299770, 302558, 305234, 307774, 310471, 313582, 316846, 319582, 321328, 322150, 322328]
52645C22328k92o56r15j154j308j079m18R3j10p05q01pJ187K052K294K194K408
52628C25111L418M942O097O449O399O118M759J600k419n394o619p090p704q012
52614C27655p187n415l687k591j804p55N51J426J267L90k22k11l02j019j580r78
52598C05538K92P27m5q84r66p51o78k80P49J548J232K85j40J29L29R1j96j88O9
52579C06861O09J512K326K259J214Q6l06j43j70o41j100j125q79q39j133j370
52563C07161j177p31n61q29j065p42L6O32O31K55j0l3j51o49j308j575j178l56
52545B98350M95J206J704J780J307N17j54m99n68l79P8O00Q78R46J133J471J523
52528C10388J048N45P68J750K656K694J916J045O16N63N84O06P22Q89R95J191
$$ y = [322328, 322036, 321380, 320465, 319311, 318003, 316924, 316506, 316599, 316489, 315784, 314983, 314976, 316163, 318215, 320509, 322703, 325111, 328529, 333471, 339568, 346017, 352416, 358534, 363293, 364893, 362474, 357080, 350461, 343371, 335667, 327655, 320468, 315053, 311366, 308775, 306971, 306216, 306767, 308193, 309460, 309850, 309628, 309417, 309115, 308096, 306516, 305538, 305830, 306557, 306512, 305628, 304662, 303911, 303233, 302953, 303702, 305250, 306482, 306767, 306627, 306756, 307085, 307176, 306980, 306792, 306861, 307470, 308982, 311308, 313567, 314781, 314867, 314561, 314418, 314248, 313607, 312507, 311382, 310503, 309664, 308531, 307161, 305984, 305253, 304692, 303863, 302798, 302056, 302092, 302724, 303355, 303610, 303600, 303567, 303416, 302767, 301459, 299884, 298706, 298350, 298845, 300051, 301755, 303535, 304842, 305359, 305205, 304706, 304138, 303759, 303837, 304437, 305315, 306261, 307394, 308865, 310388, 311436, 311981, 312749, 314499, 317155, 319849, 321765, 322810, 323426, 323989, 324573, 325179, 325901, 326790, 327785, 328976]
52512C28976J718K477L081L484M066M853N105M034J866l00j568j999k365l333
52498C50095m783n797n532m173k766k033j770j576j505j583j315l74O22P56N7
52483C18323o27p96o03j94M08P74K98q03j465j061q1P85J595K718L923M474L997
52466C31665K962K292K647L934N368O105N876M945L631K084L88j364l056m384
52452C63093m930m733m459m584m632l857k501j650j867k589k948k598j662n27
52438C19556J86M1n49o20J64J080J238M89o25j369j202k66N09L52k59r1J132K362
52420C22128K704K431K124J715J015N16Q67J880K714K813K285J681J749K990N046
52405C54658O855P821Q441R426J0606J1161J0522Q485M976M23l892o617p552p648
$$ y = [328976, 330694, 333171, 336252, 339736, 343802, 348655, 353760, 357794, 359660, 359360, 357792, 355793, 353428, 350095, 345312, 339515, 333983, 329810, 327044, 325011, 323241, 321665, 320160, 318577, 317262, 316888, 317510, 318266, 318323, 317696, 316900, 316297, 316103, 316511, 317285, 317583, 316780, 315315, 314254, 314173, 314958, 316553, 319271, 323194, 327668, 331665, 334627, 336919, 339566, 343500, 348868, 354973, 360849, 365794, 369425, 371509, 371897, 370533, 367477, 363093, 358163, 353430, 348971, 344387, 339755, 335898, 333397, 331747, 329880, 327291, 324343, 321745, 320083, 319556, 319742, 319783, 319234, 318614, 318778, 319858, 321096, 321585, 320960, 319591, 318389, 318123, 318632, 318984, 318725, 318634, 319766, 322128, 324832, 327263, 329387, 331102, 332117, 332633, 333500, 335380, 338094, 340907, 343192, 344873, 346622, 349612, 354658, 361513, 369334, 377775, 387201, 397807, 408968, 419490, 427975, 432951, 433374, 429482, 422865, 415313, 407665]
52391D07665p783p979p723o653m820k672q02L42O50L00k97n07R0J179J998K302
52375C75290K596L261L953M231M272M474M781M894M819M682M288L362K100R81
52361D27984J96l92r05j378j834k076j757r52k96j27J00R50J970K222J640J078
52345D26423J137J631K221K844L432L792M016M498N338O130O538O803P483Q856
52331D91142J0667J2272J3112J3264J3465J4397J6064J8051K0094K1975K3169
52320F67672K3243K2547K1861K1382K0690J9831J9688K0900K2949K4769K5843
52309I11375K6304K6322K6018K5837K6334K7389K8083K7683K6504K5448K4807
52298A202104K3981K2399K0320J8330J6362J3756J0225O276K597n47l191n443
$$ y = [407665, 399882, 391903, 384180, 377527, 372707, 370035, 369233, 369575, 370225, 370525, 370228, 369721, 369811, 370990, 372988, 375290, 377886, 381147, 385100, 389331, 393603, 398077, 402858, 407752, 412571, 417253, 421541, 424903, 427003, 427984, 428180, 427788, 426883, 425505, 423671, 421595, 419838, 418886, 418590, 418463, 418563, 419513, 421483, 423705, 425345, 426423, 427560, 429191, 431412, 434256, 437688, 441480, 445496, 449994, 455332, 461462, 468000, 474803, 482286, 491142, 501809, 514081, 527193, 540457, 553922, 568319, 584383, 602434, 622528, 644503, 667672, 690915, 713462, 735323, 756705, 777395, 797226, 816914, 837814, 860763, 885532, 911375, 937679, 964001, 990019, 1015856, 1042190, 1069579, 1097662, 1125345, 1151849, 1177297, 1202104, 1226085, 1248484, 1268804, 1287134, 1303496, 1317252, 1327477, 1333753, 1336350, 1335803, 1332612, 1327169]
52286A327169p471r370j0754j1105j0728j0722j1500j1936j0719q167n786m289
52274A214622l038j457L9R16J583K967N343Q145J0671J2603J3888J4513J4600
52261A295395J4557J5000J6323J8296K0194K1465K2169K2617K2801K2472K1654
52250A512943K0613J9341J7379J4351J0421O211K386o84l118n427p967j0453j2230
52237A563766j3057j3412j3991j5056j6266j7004j6879j6138j5514j5516j5831
52226A395102j5705j4821j3533j2273j1095r928q892q159p600o898n922m865l980
52213A271431l233k238o61J303K977L853M120M431N197O298P308P833P628O770
52199A323017N729N109N244O029P054P841Q116Q133Q537R635J0799J0943R609
$$ y = [1327169, 1319698, 1310328, 1299574, 1288469, 1277741, 1267019, 1255519, 1243583, 1232864, 1224697, 1218911, 1214622, 1211584, 1210127, 1210166, 1211082, 1212665, 1215632, 1220975, 1229120, 1239791, 1252394, 1266282, 1280795, 1295395, 1309952, 1324952, 1341275, 1359571, 1379765, 1401230, 1423399, 1446016, 1468817, 1491289, 1512943, 1533556, 1552897, 1570276, 1584627, 1595048, 1601259, 1603645, 1602961, 1599843, 1594416, 1586449, 1575996, 1563766, 1550709, 1537297, 1523306, 1508250, 1491984, 1474980, 1458101, 1441963, 1426449, 1410933, 1395102, 1379397, 1364576, 1351043, 1338770, 1327675, 1317747, 1308855, 1300696, 1293096, 1286198, 1280276, 1275411, 1271431, 1268198, 1265960, 1265299, 1266602, 1269579, 1273432, 1277552, 1281983, 1287180, 1293478, 1300786, 1308619, 1316247, 1323017, 1328746, 1333855, 1339099, 1345128, 1352182, 1360023, 1368139, 1376272, 1384809, 1394444, 1405243, 1416186, 1425795]
52186A425795P337N000K949R21j544m616p936j0692j2138j2172j1391j0579j0228
52173A360706j0389j0702j0577r568p829o032m760l987l182j867n9J767L046L593
52159A300160L722L864M121M165L574K246N71p92j385j263q45m95l26k47K5Q42
52143A317937K148L135K927J722P15N97P24J98p03q74J74J931L804N679P558R375
52127A357047J1344J3923J7120K0308K3021K5480K8011L0369L2115L3410L4803
52116A626951L6323L7190L6667L4909L2763L0942K9553K8318K6903K4995K2407
$$ y = [1425795, 1433132, 1438132, 1441081, 1442002, 1440458, 1435842, 1427906, 1417214, 1405076, 1392904, 1381513, 1370934, 1360706, 1350317, 1339615, 1329038, 1319470, 1311641, 1305609, 1300849, 1296862, 1293680, 1291813, 1291754, 1293521, 1296567, 1300160, 1303882, 1307746, 1311867, 1316032, 1319606, 1321852, 1322423, 1321631, 1320246, 1318983, 1318138, 1317643, 1317317, 1317070, 1317095, 1317937, 1320085, 1323220, 1326147, 1327869, 1328584, 1329181, 1329905, 1330103, 1329400, 1328526, 1328700, 1330631, 1334435, 1340114, 1347672, 1357047, 1368391, 1382314, 1399434, 1419742, 1442763, 1468243, 1496254, 1526623, 1558738, 1592148, 1626951, 1663274, 1700464, 1737131, 1772040, 1804803, 1835745, 1865298, 1893616, 1920519, 1945514, 1967921]
$$ [...]
##END NTUPLES=NMR SPECTRUM
##END=
