##TITLE=AC1629_CENAH_8450611_OBMjHVTgJl
##JCAMPDX= 6.0         $$ Bruker NMR JCAMP-DX V2.0
##DATA TYPE= NMR SPECTRUM
##DATA CLASS= NTUPLES
##ORIGIN= BRUKER
##OWNER= Administrator
$$ 1.72 TOPSPIN		Version 2.1
$$ 2014-02-18 16:04:58.876 -0800  Administrator@X
$$ Compression mode = diff/dup
##.OBSERVE FREQUENCY= 400.02188249412
##.OBSERVE NUCLEUS= ^1H
##.ACQUISITION MODE= SIMULTANEOUS (DQD)
##.ACQUISITION SCHEME= undefined
##.AVERAGES= 64
##.DIGITISER RES= 22
##SPECTROMETER/DATA SYSTEM= spect
##.PULSE SEQUENCE= noesygpps1d.comp
##.SOLVENT NAME= COFFEE_meoh
##.SHIFT REFERENCE= INTERNAL, COFFEE_meoh, 1, 14.96108
##AUDIT TRAIL= $$ (NUMBER, WHEN, WHO, WHERE, PROCESS, VERSION, WHAT)
$$ ##TITLE= Audit trail, TOPSPIN		Version 2.1
$$ ##JCAMPDX= 5.01
$$ ##ORIGIN= Bruker BioSpin GmbH
$$ ##OWNER= Administrator
$$ $$ E:\/data/COFFEE/nmr/AC1629_CENAH_8450611_OBMjHVTgJl/12/pdata/1/auditp.txt
$$ ##AUDIT TRAIL=  $$ (NUMBER, WHEN, WHO, WHERE, PROCESS, VERSION, WHAT)
(   1,<2014-02-18 16:04:54.017 -0800>,<Administrator>,<X>,<go>,<TOPSPIN 2.1>,
      <created by zg
	started at 2014-02-18 15:53:24.610 -0800,
	POWCHK enabled, PULCHK disabled,
       configuration hash MD5:
       C8 4E 4E 5D D3 5C D8 9E 9F 52 82 E0 59 8A DE 15
       data hash MD5: 64K
       FE 6F 68 70 0F DF 7A F1 9F F8 0B CE 11 56 77 02>)
(   2,<2014-02-18 16:04:56.907 -0800>,<Administrator>,<X>,<proc1d>,<TOPSPIN 2.1>,
      <Start of raw data processing
       efp LB = 0.3 FT_mod = 6 PKNL = 1 PHC0 = 0 PHC1 = 0 SI = 128K 
       data hash MD5: 128K
       75 BA CF 5C 61 6C 43 82 7C A9 E3 09 B8 07 49 AB>)
(   3,<2014-02-18 16:04:57.954 -0800>,<Administrator>,<X>,<proc1d>,<TOPSPIN 2.1>,
      <pk PHC0 = -81.7218 PHC1 = 0 
       data hash MD5: 128K
       9F AD 97 B4 83 BB D9 DB D6 19 CC 1F 4A AF EE F3>)
(   4,<2014-02-18 16:04:58.360 -0800>,<Administrator>,<X>,<proc1d>,<TOPSPIN 2.1>,
      <abs ABSG = 1 
       data hash MD5: 128K
       CB A0 59 26 03 70 C3 CD F3 93 E8 B3 F1 B5 39 6C>)
(   5,<2014-02-18 16:04:58.470 -0800>,<Administrator>,<X>,<proc1d>,<TOPSPIN 2.1>,
      <abs ABSG = 2 
       data hash MD5: 128K
       14 5F A2 68 AF 2F AE 0B FE A3 90 50 FC 68 BF FA>)
(   6,<2014-02-18 16:04:58.532 -0800>,<Administrator>,<X>,<proc1d>,<TOPSPIN 2.1>,
      <abs ABSG = 3 
       data hash MD5: 128K
       34 E5 A3 3F 28 33 22 9D 34 71 00 6D 93 44 A3 1D>)
(   7,<2014-02-18 16:04:58.610 -0800>,<Administrator>,<X>,<proc1d>,<TOPSPIN 2.1>,
      <abs ABSG = 4 
       data hash MD5: 128K
       C2 DE 19 64 1E 6D AE EC 69 87 61 3B 0A D2 5B FD>)
(   8,<2014-02-18 16:04:58.704 -0800>,<Administrator>,<X>,<proc1d>,<TOPSPIN 2.1>,
      <abs ABSG = 5 
       data hash MD5: 128K
       95 6E BC 7F 77 FD 33 74 87 0C 3A 05 8C C2 96 77>)
$$ ##END=
$$ 
$$ $$ hash MD5
$$ $$ FA D9 E8 B6 29 50 DB 31 4F 36 CE AA 4B 0A 25 9F
##$RELAX= 
##$RELAX= 
##$RELAX= 
##$RELAX= 
##$RELAX= 
##$RELAX= 
##$RELAX= 
##$RELAX= 
$$ Bruker specific parameters
$$ --------------------------
##$DU= <E:\>
##$EXPNO= 12
$$ [...]
##$TP07= 0
##$TPNAME0= <>
##$TPNAME1= <>
##$TPNAME2= <>
##$TPNAME3= <>
##$TPNAME4= <>
##$TPNAME5= <>
##$TPNAME6= <>
##$TPNAME7= <>
##$TPOAL= (0..7)
0.5 0.5 0.5 0.5 0.5 0.5 0.5 0.5
##$TPOFFS= (0..7)
0 0 0 0 0 0 0 0
##$TUNHIN= 0
##$TUNHOUT= 0
##$TUNXOUT= 0
##$USERA1= <user>
##$USERA2= <user>
##$USERA3= <user>
##$USERA4= <user>
##$USERA5= <user>
##$V9= 5
##$VALIST= <valist>
##$VCLIST= <CCCCCCCCCCCCCCC>
##$VD= 0
##$VDLIST= <DDDDDDDDDDDDDDD>
##$VPLIST= <PPPPPPPPPPPPPPP>
##$VTLIST= <TTTTTTTTTTTTTTT>
##$WBST= 2048
##$WBSW= 25
##$XGAIN= (0..3)
0 0 0 0
##$XL= 0
##$YL= 0
##$YMAX_a= 6322841
##$YMIN_a= -13538468
##$ZGOPTNS= <>
##$ZL1= 120
##$ZL2= 120
##$ZL3= 120
##$ZL4= 120
##$ABSF1= 14.96108
##$ABSF2= -5.597102
##$ABSG= 5
##$ABSL= 3
##$ALPHA= 0
##$AQORDER= 0
##$ASSFAC= 0
##$ASSFACI= 0
##$ASSFACX= 0
##$ASSWID= 0
##$AUNMP= <proc_prof1d_extract.lims>
##$AXLEFT= 0
##$AXNAME= <>
##$AXNUC= <1H>
##$AXRIGHT= 0
##$AXTYPE= 0
##$AXUNIT= <>
##$AZFE= 0.1
##$AZFW= 0.1
##$BCFW= 0
##$BC_mod= 0
##$BYTORDP= 0
##$COROFFS= 0
##$CY= 15
##$DATMOD= 1
##$DC= 0
##$DFILT= <>
##$DTYPP= 0
##$F1P= 0
##$F2P= 0
##$FCOR= 0.5
##$FTSIZE= 131072
##$FT_mod= 6
##$GAMMA= 0
##$GB= 0
##$INTBC= 1
##$INTSCL= 1
##$ISEN= 128
##$LB= 0.3
##$LEV0= 0
##$LPBIN= 0
##$MAXI= 10000
##$MC2= 0
##$MEAN= 0
##$ME_mod= 0
##$MI= 0
##$NCOEF= 0
##$NC_proc= -2
##$NLEV= 6
##$NOISF1= 0
##$NOISF2= 0
##$NSP= 0
##$NTH_PI= 0
##$NZP= 0
##$OFFSET= 14.96108
##$PC= 1
##$PHC0= -81.7218
##$PHC1= 0
##$PH_mod= 1
##$PKNL= yes
##$PPARMOD= 0
##$PPDIAG= 0
##$PPIPTYP= 0
##$PPMPNUM= 2147483647
##$PPRESOL= 1
##$PSCAL= 4
##$PSIGN= 0
##$PYNMP= <proc.py>
##$REVERSE= no
##$SF= 400.020009604383
##$SI= 131072
##$SIGF1= 0
##$SIGF2= 0
##$SINO= 400
##$SIOLD= 131072
##$SPECTYP= <>
##$SREGLST= <1H.CDCl3>
##$SSB= 0
##$STSI= 131072
##$STSR= 0
##$SW_p= 8223.68421052631
##$SYMM= 0
##$S_DEV= 0
##$TDeff= 65536
##$TDoff= 0
##$TI= <>
##$TILT= no
##$TM1= 0
##$TM2= 0
##$TOPLEV= 0
##$USERP1= <user>
##$USERP2= <user>
##$USERP3= <user>
##$USERP4= <user>
##$USERP5= <user>
##$WDW= 1
##$XDIM= 131072
##$YMAX_p= 446311193
##$YMIN_p= -11707
##$CURPLOT= <Network HP LaserJet P1505>
##$CURPRIN= <$Network HP LaserJet P1505>
##$DFORMAT= <normdp>
##$LAYOUT= <+/1D_H.xwp>
##$LFORMAT= <normlp>
##$PFORMAT= <normpl>
##$SURQMSG= 1
$$ End of Bruker specific parameters
$$ ---------------------------------
##NTUPLES= NMR SPECTRUM
##VAR_NAME=  FREQUENCY,     SPECTRUM/REAL,   SPECTRUM/IMAG
##SYMBOL=    X,             R,               I
##VAR_TYPE=  INDEPENDENT,   DEPENDENT,       DEPENDENT
##VAR_FORM=  AFFN,          ASDF,            ASDF
##VAR_DIM=   131072,        131072,          131072
##UNITS=     HZ,            ARBITRARY UNITS, ARBITRARY UNITS
##FACTOR=    0.0627417313425164, 1,          1
##FIRST=     8223.62146879497, 2268,         -66001
##LAST=      0,             4937,            -65865
##MIN=       0,             -11707,          0
##MAX=       8223.62146879497, 446311193,    0
$$ Real data points
##PAGE= N=1
##DATA TABLE= (X++(R..R)), XYDATA
$$ [...]
61639E04303J230K193K942K875K126J173K32o44j144q97j43J95n74k089l293l636
61623E04849l511l547l778l879l893m154m513m272l227k246k244k941l313l080
61609D56251k989l508m071l972l396l062l239l635l943m022l782l296k977l168
61595D07191l635l773l301k476j740j357j345j482j505j437j504j611j230j98
61581C80597P43O89l24j443k026k132k043j856j596j317j022p04m35j69L70J241
61565C68573J913J763Q80n3n25m76J0P60J395J695K001K675L346L276K512J872
61549C91617J712J494Q21J50L2K18Q9m17p98o98k25L01O70Q58J006J258J644K157
61531D01889K808L381L395K632J536O56n5q59j471j477j309j815k777k946j894
$$ plain form
61639 504303 505533 507726 510668 513543 515669 516842 517074 516430 515286 514389 514246 514441 513867 511778 508485 504849
61623 504849 501338 497791 494013 490134 486241 482087 477574 473302 470075 467829 465585 462644 459331 456251
61609 456251 453262 449754 445683 441711 438315 435253 432014 428379 424436 420414 416632 413336 410359 407191
61595 407191 403556 399783 396482 394006 392266 390909 389564 388082 386577 385140 383636 382025 380795 380597
61581 380597 381340 382029 381705 380262 378236 376104 374061 372205 370609 369292 368270 367566 367131 366962 367332 368573
61565 368573 370486 372249 373129 373076 372551 372075 372085 372845 374240 375935 377936 380611 383957 387233 389745 391617
61549 391617 393329 394823 395644 395794 395826 396044 396133 395716 394918 394220 393995 394296 394966 395824 396830 398088 399732 401889
61531 401889 404697 408078 411473 414105 415641 416297 416242 415383 413912 412435 411126 409311 406534 403588 401694
61516D01694p27m68o95n52k33m08q23o32J69O45K90m13q86j150j387j420r69j20
61498C91915P81J490J977K307K500K515K374K281K491K907L054K577J685R58Q17
61483D22629J292K084K726K891K707K623K842L168L433L739M025L820K824J460
61469D62263M57l5n29j384k269k518j899r02l15m76j071j635k068k446k555k152
61453D40466j528j311j560j584r00J32Q40J018Q59M94om52o48n98l87p0K86O10
61435D35661R49J256J206N99m1P3Q75J439J250P99O52O03K63j75k59P0O69J531
61417D47420K496L047K884K324J737J087L70j2J03K29rk65k02k82r83j814j916
61400D56214j280n03K47J112J713J469O32K5j43k95m13l1O79R13N38L94R08J318
$$ plain form
61516 401694 400967 400499 399804 399252 399019 398611 397788 397156 397325 397970 398260 397847 396961 395811 394424 393004 392035 391915
61498 391915 392696 394186 396163 398470 400970 403485 405859 408140 410631 413538 416592 419169 420854 421812 422629
61483 422629 423921 426005 428731 431622 434329 436952 439794 442962 446395 450134 454159 457979 460803 462263
61469 462263 462720 462685 462156 460772 458503 455985 454086 453184 452869 452393 451322 449687 447619 445173 442618 440466
61453 440466 438938 437627 436067 434483 433583 433715 434555 435573 436432 436926 436920 436468 435820 435222 434835 434765 435051 435661
61435 435661 436610 437866 439072 439671 439630 439703 440578 442017 443267 444066 444718 445321 445584 445409 445150 445220 445889 447420
61417 447420 449916 452963 455847 458171 459908 460995 461365 461353 461456 461685 461676 461411 461209 460927 459944 458130 456214
61400 456214 454934 454431 454678 455790 457503 458972 459604 459629 459486 459191 458778 458747 459426 460339 460877 461271 462179 463497
61382D63497Q57o4m77r5O67J521K484L488M281M718M846M810M852N141N466N271
61366E11263M297K976K015J665J613J496J324J319J497J557J289R86J171J940
61352E36408K870L638M406N335O128O392O141N545M527L023J473M64K0l47r18
61337E85105j456j555j032n9P84P95j71j500k460k888k946k740k510k682l084
61322E61601k675q85J231K132J862J872K851L946M335M500N321O776Q173R225
61308F10265J0250J1615J3357J5201J6722J7674J8179J8337J7753J6005J3453
61297G78811J0973Q801O373L447N75j852m261o990r343j0290r837r088r078r920
61283G38321j0986j1534j1224j0311r330q500p614o549n531m700l744k301n75
$$ plain form
61382 463497 464354 464290 463813 463718 464385 465906 468390 471878 476159 480877 485723 490533 495385 500526 505992 511263
61366 511263 515560 518536 520551 522216 523829 525325 526649 527968 529465 531022 532311 533297 534468 536408
61352 536408 539278 542916 547322 552657 558785 565177 571318 576863 581390 584413 585886 586350 586370 586023 585105
61337 585105 583649 582094 581062 581003 581787 582582 582411 580911 578451 575563 572617 569877 567367 564685 561601
61322 561601 558926 558041 559272 561404 563266 565138 567989 571935 576270 580770 586091 592867 601040 610265
61308 610265 620515 632130 645487 660688 677410 695084 713263 731600 749353 765358 778811
61297 778811 789784 798585 804958 808405 808980 807128 802867 795877 786534 776244 766407 757319 748241 738321
61283 738321 727335 715801 704577 694266 684936 676436 668822 662273 656742 652042 648298 645997 645422
61270F45422P92J354J213Q48P38J032J460J672J711K014K925M346N885P115P709
61255F86236P568O906O006M828L194J312j71q84j171j633k384l002l114k854k665
61240F98172k754k836k603k279k368k838k989k391j452o79N2J042K036K721L589
61225F84423N364P663R183R350Q976R077R714J0345J0594J0395R842R248Q968
61212H03142Q943Q754Q250P651P056O334N599N179N051M896M876N565O884P917
61198H96097Q227Q630J0115J2529J5017J7185J9084K0355K0209J8291J5139J1720
61186A072598Q725O259L951J501q57k620l850n268p327r569j1286j2421j3445
61173A026391j4604j5713j6539j6973j6994j6720j6417j6280j6289j6421j6779
$$ plain form
61270 645422 646214 647568 648781 649629 650367 651399 652859 654531 656242 658256 661181 665527 671412 678527 686236
61255 686236 693804 700710 706716 711544 714738 716050 715879 714995 713824 712191 709807 706805 703691 700837 698172
61240 698172 695418 692582 689979 687700 685332 682494 679505 677114 675662 674983 675035 676077 678113 680834 684423
61225 684423 689787 697450 706633 715983 724959 734036 743750 754095 764689 775084 784926 794174 803142
61212 803142 812085 820839 829089 836740 843796 850130 855729 860908 865959 870855 875731 881296 888180 896097
61198 896097 904324 912954 923069 935598 950615 967800 986884 1007239 1027448 1045739 1060878 1072598
61186 1072598 1081323 1087582 1091533 1093034 1092177 1089557 1085707 1080439 1073112 1063543 1052257 1039836 1026391
61173 1026391 1011787 996074 979535 962562 945568 928848 912431 896151 879862 863441 846662
61162H46662j7310j7669j7549j7017j6257j5257j3875j2165j0359q629o949n113
61150F88513k922n30J479K581K864K775K451J648L05j296k960m628n952o299n459
61135F72570l933k379j075k4Q75J873L279N148P307R647J2022J3986J5235J6239
61121G50770J7787J9889K1796K3187K4568K6306K8052K9462L0734L2028L2905
61110A037484L2822L1694K9731K7217K4626K2369K0224J7647J4794J2376J0265
61099A281249P242K583k896p909j1988j5243j7748j9924k2625k5923k8467k8948
61087A109403k7742k6265k5216k4252k3029k1601k0121j8726j7571j6381j4441
61076H74058j1566q626o526n129l743k066r5K258M726O582P676Q849J0521J1792
$$ plain form
61162 846662 829352 811683 794134 777117 760860 745603 731728 719563 709204 700575 693626 688513
61150 688513 685591 685061 686540 689121 691985 694760 697211 698859 699164 697868 694908 690280 684328 678029 672570
61135 672570 668637 666258 665183 665159 666034 667907 671186 676334 683641 693288 705310 719296 734531 750770
61121 750770 768557 788446 810242 833429 857997 884303 912355 941817 972551 1004579 1037484
61110 1037484 1070306 1102000 1131731 1158948 1183574 1205943 1226167 1243814 1258608 1270984 1281249
61099 1281249 1288491 1291074 1288178 1280269 1268281 1253038 1235290 1215366 1192741 1166818 1138351 1109403
61087 1109403 1081661 1055396 1030180 1005928 982899 961298 941177 922451 904880 888499 874058
61076 874058 862492 853866 847340 842211 838468 836402 836307 838565 843291 849873 857549 866398 876919 888711
61062H88711J2024J2321J4009J6443J8010J8812K0384K2967K5027K5867K6842
61051A101417K9257L2526L5325L7388L9301M1315M3289M5146M6690M7478M7496
61040A546628M7478M7944M8333M7683M5876M3723M1896M0199L7951L4901L1629
61029B014241K8886K6599K3959K0699J7729J5904J4728J3090J0871Q925P761P387
61017B210779Q295J1380J6637K3010K9815L7381M6033N5510O5757P7441R1367
61006B673405J08357J30132J59328J98044K47310L08481L84281M78151N93899
60997E281388P36369R09878J113128J335249J556171J746050J859587J836608
60989A6374428J627172J236174P49060L02766J4401p5838n747J47527K98126L57682
$$ plain form
61062 888711 900735 913056 927065 943508 961518 980330 1000714 1023681 1048708 1074575 1101417
61051 1101417 1130674 1163200 1198525 1235913 1275214 1316529 1359818 1404964 1451654 1499132 1546628
61040 1546628 1594106 1642050 1690383 1738066 1783942 1827665 1869561 1909760 1947711 1982612 2014241
61029 2014241 2043127 2069726 2093685 2114384 2132113 2148017 2162745 2175835 2186706 2195631 2203392 2210779
61017 2210779 2219074 2230454 2247091 2270101 2299916 2337297 2383330 2438840 2504597 2582038 2673405
61006 2673405 2781762 2911894 3071222 3269266 3516576 3825057 4209338 4687489 5281388
60997 5281388 6017757 6927635 8040763 9376012 10932183 12678233 14537820 16374428
60989 16374428 18001600 19237774 19986834 20289600 20304001 20228163 20222416 20369943 20668069 21025751
60979B1025751K46017p1018n43975j050649j459918j697517j763639j703648j570361
60970A1411043j405225j235702j076523r31942q00965o82787n78067m87102m09040
60961C803690l43001k88605k45099k10669j82983j60091j40735j24178j09964
60952A998365r7665q6694p6454o6768n8067n0974m5715m2040l9702l8742l9039
60941A356505l9875m0316l9984l9158l8159l7017l5732l4348l2628l0224k7422
60930I61642k5164k3877k2710k0519j7420j4710j3260j2580j1656j0199q735p692
60918G73120o843n743m440l498l274l431l316k702j904j201n08K93J017J453J743
60903G40766K173K568K273Q76j219l109m285n049o010p287q456r213r770j0445
$$ plain form
60979 21025751 21271768 21200750 20656775 19606126 18146208 16448691 14685052 12981404 11411043
60970 11411043 10005818 8770116 7693593 6761651 5960686 5277899 4699832 4212730 3803690
60961 3803690 3460689 3172084 2926985 2716316 2533333 2373242 2232507 2108329 1998365
60952 1998365 1900700 1814006 1737552 1670784 1612717 1561743 1516028 1473988 1434286 1395544 1356505
60941 1356505 1316630 1276314 1236330 1197172 1159013 1121996 1086264 1051916 1019288 989064 961642
60930 961642 936478 912601 889891 869372 851952 837242 823982 811402 799746 789547 780812 773120
60918 773120 766277 760534 756094 752596 749322 745891 742575 739873 737969 736768 736260 736553 737570 739023 740766
60903 740766 742939 745507 747780 748656 747437 744328 740043 734994 728984 721697 713241 704028 694258 683813
60889F83813j1114j1375j1054j0301r344q401p762p585p664p693p657p631p350
60876E68882o503n439m979n298n539m902l718k982k989k926j941k22J168J506
60862E24118J215J309K185L270L873M012M121M329M479M613M863M995M595L793
60848E75770L240L271L573L812M102M488M485L562J855Q0j241k216l263m583n899
60833E91036o668o560n813n043m710m789m886m651m141l833m059m434m182l277
60819E23990k714l265m370m868m591m463n107o101o639o409n651m888m616m768
60805D55540m566l463k122j716k298k720k300j576j139p46j86m2q26j852j894
60790D28094o37J129K494L053K893K471K371K738L120L168L029K824K264J330
$$ plain form
60889 683813 672699 661324 650270 639969 630625 622224 614462 606877 599213 591520 583863 576232 568882
60876 568882 562379 556940 551961 546663 541124 536222 532504 529522 526533 523607 521666 521444 522612 524118
60862 524118 525333 526642 528827 532097 535970 539982 544103 548432 552911 557524 562387 567382 571977 575770
60848 575770 579010 582281 585854 589666 593768 598256 602741 606303 608158 608238 606997 604781 601518 596935 591036
60833 591036 584368 577808 571995 566952 562242 557453 552567 547916 543775 539942 535883 531449 527267 523990
60819 523990 521276 518011 513641 508773 504182 499719 494612 488511 481872 475463 469812 464924 460308 455540
60805 455540 450974 447511 445389 443673 441375 438655 436355 434779 433640 432894 432708 432666 431840 429988 428094
60790 428094 427457 428586 431080 434133 437026 439497 441868 444606 447726 450894 453923 456747 459011 460341
60776D60341P34R98J524J413Q03N71Q57R51N73L07N42Q11N85J2n54j169j905k325
60758D65069j965j117n50n64p58q02r10j342j818j786j177m96j98j74m7L34P75
60741D52474R61N37p90k875m926o060o075n451m579l436k061r57o79j189j844
60726D13050j962j319k16P80J242J135P13L29L16Q42J625K081J990J823K031K310
60710D26770K097J511J209J408J770K200K923L651L614K687J800J672J860J546
60696D56718P46J65K39P85J246J018j32j564k159j596q10p63j286j567j318q20
60680D48902k09N85J428K022K327K516K690K912L245L473L152K283J439Q03k67
60665D77301k092l715m009l307k970l458l853l320k123r42nP67J286J408J250
$$ plain form
60776 460341 461075 462073 463597 465010 465813 466384 467241 468192 468765 469072 469614 470425 471010 471022 470468 469299 467394 465069
60758 465069 463104 461987 461437 460873 460115 459313 458403 457061 455243 453457 452280 451784 451586 451412 451365 451699 452474
60741 452474 453435 453972 453182 450307 445381 439321 433246 427795 423216 419780 417719 416762 416083 414894 413050
60726 413050 411088 409769 409553 410333 411575 412710 413423 413752 414068 414910 416535 418616 420606 422429 424460 426770
60710 426770 428867 430378 431587 432995 434765 436965 439888 443539 447153 449840 451640 453312 455172 456718
60696 456718 457464 457629 457868 458653 459899 460917 460785 459221 457062 455466 454656 453893 452607 451040 449722 448902
60680 448902 448693 449278 450706 452728 455055 457571 460261 463173 466418 469891 473043 475326 476765 477568 477301
60665 477301 475209 471494 467485 464178 461208 457750 453897 450577 448454 447512 447507 448274 449560 450968 452218
60650D52218J153J434K168L013L390L058K376J733R66k35j664k794l460l796l750
60635D55810l217k539k197k094j696q74k1N11N94J14p56j236p08K75N84J09j81
60618D42478K04O31N76M06M76L99q1k95M11J481J753R11l42j305j702j360k53
60601D44388J073J688J216K11l92j45N72Q74K60o91p78M33K067L059L344L428
60585D60607L260K400J055J12M4M84R59J404J709J533R22N30Q69J767K872M160
60569D84687N524O529P143Q204J0352J2886J4489J4832J4593J4054J2705J0375
60557F16373P678M989J944j519m450n947o305o375o320n775m778l679k434q67
60543E82535O15J491K204L804O454R185J1333J3336J5819J8634K1160K2941K3672
$$ plain form
60650 452218 453371 454805 456973 459986 463376 466434 468810 470543 471509 471274 469610 466816 463356 459560 455810
60635 455810 452593 450054 447857 445763 444067 443193 443172 443683 444277 444391 443635 442399 441691 441966 442550 442659 442478
60618 442478 442682 443313 443889 444295 444771 445170 445089 444794 445205 446686 448439 449350 449008 447703 446001 444641 444388
60601 444388 445461 447149 448365 448576 448184 448039 448611 449485 449745 449054 448276 448709 450776 453835 457179 460607
60585 460607 463867 466267 467322 467434 467478 467962 468921 470325 472034 473567 474489 475019 475888 477655 480527 484687
60569 484687 490211 496740 503883 512087 522439 535325 549814 564646 579239 593293 605998 616373
60557 616373 624051 629040 630984 629465 625015 619068 612763 606388 600068 594293 589515 585836 583402 582535
60543 582535 583150 584641 586845 590649 597103 606288 617621 630957 646776 665410 686570 709511 733183
60530G33183K3082K1252J8528J4999J0479N248J48m232p839j0444j1504j1194
60518G81706j0656j0613j0462r472q107p283o895o186n123m322l792k842j276
60505F94677L82J965M036O995J0558J4434J8735K3367K7812L1983L6587M2033
60493I13564M7393N1275N3471N5000N6463N7010N5271N0902M4770L7772K9888
60482A452779K0544R584k366j4399k5835l6289m5531n3385n9570o3541o4726o3121
60470A054144n9488n4895n0055m5173m0176l5032k9990k5568k2188j9770j7914
60459F53895j6418j5325j4486j3487j2150j0725r415q066o565n234m565m696n262
60446E27501n581n101l921k834k485k524k108j183n63p00j117j275j271j358j476
$$ plain form
60530 733183 756265 777517 796045 811044 821523 826771 826919 822687 814848 804404 792900 781706
60518 781706 771050 760437 749975 740503 732396 725113 718218 712032 706909 702587 698795 695953 694677
60505 694677 695059 697024 701060 708055 718613 733047 751782 775149 802961 834944 871531 913564
60493 913564 960957 1012232 1065703 1120703 1177166 1234176 1289447 1340349 1385119 1422891 1452779
60482 1452779 1473323 1482907 1480541 1466142 1440307 1404018 1358487 1305102 1245532 1181991 1117265 1054144
60470 1054144 994656 939761 889706 844533 804357 769325 739335 713767 691579 671809 653895
60459 653895 637477 622152 607666 594179 582029 571304 561889 553823 547258 542024 537459 532763 527501
60446 527501 521920 516819 512898 510064 507579 505055 502947 501764 501201 500501 499384 498109 496838 495480 494004
60431D94004j540j638j592j047k43J0m80j010j166j319j467p53J007K433K294
60416D87493J229O33O18L72j29k06K19P08J344K353L047K597J651J641K560K927
60400E09057K166J427J631K145K064J621J496J675J774J845K170K635K897K843
60386E37446K619K562L059M052M740M447L683L525L973L921K950K082K308L286
60372E84653L973L870L151K242J642J631J783J336K91m59l40K56P66J159J513
60357F07467J677J725K074K834L618M337N469P167Q799R738R962R577Q502O900
60343F89846N186L297P63k132m325n491o510p816q472p808o824o755p114o571
60329F29274n199m407m828n625n892n656n294m935m677m605m457l804k647j329
$$ plain form
60431 494004 492464 490826 489234 488187 487944 487954 487474 486464 485298 483979 482512 481759 482766 485199 487493
60416 487493 488722 489355 489973 490345 490216 490010 490229 490937 492281 494634 497681 500278 501929 503570 506130 509057
60400 509057 511223 512650 514281 516426 518490 520111 521607 523282 525056 526901 529071 531706 534603 537446
60386 537446 540065 542627 545686 549738 554478 558925 562608 566133 570106 574027 576977 579059 581367 584653
60372 584653 588626 592496 595647 597889 599531 601162 602945 604281 604572 604113 603773 604029 604795 605954 607467
60357 607467 609144 610869 612943 615777 619395 623732 629201 636368 645167 654905 664867 674444 682946 689846
60343 689846 695032 698329 699092 696960 692635 687144 680634 672818 664346 656538 649714 642959 635845 629274
60329 629274 624075 619668 614840 609215 603323 597667 592373 587438 582761 578156 573699 569895 567248 565919
60315E65919R4J776L440M538N138O031P767J0035J2166J3831J5097J6130J6960
60302F78922J7259J6492J4625J2514J1054R912P751L847j023n536r138j1981j4020
60289G30678j4880j4580j3789j2992j1783r539o661m569m178m841n193m754m147
60276F18772l955m035m044m039m263m754n321n651n435m701l989l788l764l157
60262E57876j910p88k46L5L16K98j41m81l84k73m92n14K73J475K220K352K338
60245E61954K232J631N88k04k96J6K13J13j81m98o61n85l77j74P5N12J148J889
60227E67395K660L304L587L586L798M556N506O004N937N838O221P115Q204R215
60213F42926J0058J0745J1261J1562J1741J2023J2379J2339J1569J0494R867R779
$$ plain form
60315 565919 566013 567789 571229 575767 580905 586936 594703 604738 616904 630735 645832 661962 678922
60302 678922 696181 712673 727298 739812 750866 760778 768529 772376 771353 765817 756679 744698 730678
60289 730678 715798 701218 687429 674437 662654 653115 646454 641885 637707 632866 627673 622919 618772
60276 618772 614817 610782 606738 602699 598436 593682 588361 582710 577275 572574 568585 564797 561033 557876
60262 557876 555966 555178 554932 554967 555283 555581 555440 554959 554575 554302 553810 553296 553569 555044 557264 559616 561954
60245 561954 564186 565817 566405 566201 565905 565921 566134 566247 566066 565568 564907 564322 563945 563771 563846 564358 565506 567395
60227 567395 570055 573359 576946 580532 584330 588886 594392 600396 606333 612171 618392 625507 633711 642926
60213 642926 652984 663729 674990 686552 698293 710316 722695 735034 746603 757097 766964 776743
60201G76743R635R181Q814Q678Q161O766M883L238J986Q71j59j038j996l361n015
60186H27387o440p262p517p526p672q056q372q320q059p862p420o230m722m075
60172G27854m597n130m600l386k530k271k140j936j826j879k106k669l417l639
60158F85728k849j489k90N86J208J301P95M42R86K034K544K240J664J157O50L13
60142F97020M75R45J264J619K679M469O117O943P108P087P077P093P145P171P074
60127G71286O909O689O146N100L902L145L001L269L819M535N096N354N656O263
60113H40170O751O543N743M794L634K010L17q29j699l141n155o786p539p904q211
60098H28698p966o820n384m424l858l134k251j742j823k045j878j352j026j337
$$ plain form
60201 776743 786378 795559 804373 813051 821212 827978 832861 836099 838085 838956 838797 837759 835763 832402 827387
60186 827387 820947 813685 806168 798642 790970 782914 774542 766222 758163 750301 742881 736651 731929 727854
60172 727854 723257 718127 713527 710141 707611 705340 703200 701264 699438 697559 695453 692784 689367 685728
60158 685728 682879 681390 681100 681686 682894 684195 684990 685432 686418 688452 690996 693236 694900 696057 696707 697020
60142 697020 697495 698440 699704 701323 704002 708471 714588 721531 728639 735726 742803 749896 757041 764212 771286
60127 771286 778195 784884 791030 796130 800032 803177 806178 809447 813266 817801 822897 828251 833907 840170
60113 840170 846921 853464 859207 864001 867635 869645 869962 869133 867434 864293 859138 852352 844813 836909 828698
60098 828698 820732 813912 808528 804104 800246 797112 794861 793119 791296 789251 787373 786021 784995 783658
60084G83658k063k572k657k792l315l753l476k728k439l127m477n892o917p265
60070G30185p017o837p319q159q493q040p305o701o148n647n465n498n106m011
60056F38439k828k265k190j943j258m48K31R99K189L699N006N753O182O771P508
60041F65845P875P572O870O082N162M178L614L695L760K909J100q86k327l047
60027G12402l270l434l974m850n601o178p215r008j0715j1375j1117j0683j0193
60014F14789r331q371p891p710p123o121n364m925m155k871j691j015o30m56p53
59999E46382j283j201j76J143K070K640L061L165K825K409K425L130M505O126
59985E77221P062O573N031L512K455J434K58o78j328k259l618m718n104n269n717
$$ plain form
60084 783658 781595 779023 776366 773574 770259 766506 763030 760302 757863 754736 750259 744367 737450 730185
60070 730185 723168 716331 709012 700853 692360 684320 677015 670314 664166 658519 653054 647556 642450 638439
60056 638439 635611 633346 631156 629213 627955 627507 627738 628737 630926 634625 639631 645384 651566 658337 665845
60041 665845 673720 681292 688162 694244 699406 703584 707198 710893 714653 717562 718662 717776 715449 712402
60027 712402 709132 705698 701724 696874 691273 685095 677880 668872 658157 646782 635665 624982 614789
60014 614789 605458 597087 589196 581486 574363 568242 562878 557953 553798 550927 549236 548221 547591 547135 546382
59999 546382 545099 543898 543722 544865 546935 549575 552636 555801 558626 561035 563460 566590 571095 577221
59985 577221 584283 590856 595887 599399 601854 603288 603546 602868 601540 599281 595663 590945 585841 580572 574855
59970E74855o056n637m555l447k625j964j299n97O8N30Q12J367K531L809M288
59955E62080L815L044K326J456O27N39J207J647J339R78J199J465J085N08N96
59940E83911J133J092J49j001j701j965k025j912j580r78P1J745L885N950P349
59925E94123P852P772P662P623P077N623L827K511J450k71k554l943l390j536
59911F33826K81J474K114K162J604R04N61M54J90k04m31m87n74o80o15l02K66
59894F40543J139K219L237M102M926N669O170O601P265P860P679O809O338O938
59880G17495P987Q589Q696Q632Q294P589P027P000O866N625L222N50j590k921
59866G93061l527l888m779o467q200r017q794q011o924n610m415l602k867j966
$$ plain form
59970 574855 568799 563162 558607 555160 552535 550571 549272 548675 548743 549273 550085 551452 553983 557792 562080
59955 562080 565895 568939 571265 572721 573348 573887 575094 576741 578080 579058 580257 581722 582807 583315 583911
59940 583911 585044 586136 586285 585284 583583 581618 579593 577681 576101 575123 575194 576939 580824 586774 594123
59925 594123 601975 609747 617409 625032 632109 637732 641559 644070 645520 645249 642695 638752 635362 633826
59911 633826 634107 635581 637695 639857 641461 642365 642926 643380 643570 643366 642935 642448 641874 641194 640579 640277 640543
59894 640543 641682 643901 647138 651240 656166 661835 668005 674606 681871 689731 697410 704219 710557 717495
59880 717495 725482 734071 742767 751399 759693 767282 774309 781309 788175 793800 797022 797572 795982 793061
59866 793061 789534 785646 780867 774400 766200 757183 748389 740378 733454 727844 723429 719827 716960 714994
59852G14994j445j908k783k755j428L21J700K892M328N848O981P586P743P290
59838G49364N889L590J185j28L53K149M000N078N549N832N705M618K687Q06k66
59823G96411o64j166k316l886n115n609n840o518p542q020p419o202n177m661
59809G26276m513m560m672m744m797m832m542l586k264j332j087j254j817l079
59795F79197m622n234m455l288k722k411j719j192j787l180m032l740k846j863
59781F36106p74K58P36N96L60L74M93O80J161J813K038J612J232J808L362M906
59765F56761N330M431L129K588L054L810M296M809N811O972P536P382P185P520
59751G30614Q280Q924R018Q494P669O905O201N315M395M034M400M752M277L071
$$ plain form
59852 714994 713549 711641 708858 706103 704675 704996 706696 709588 713916 719764 726745 734331 742074 749364
59838 749364 755253 758843 760028 759900 760253 762402 766402 771480 777029 782861 788566 793184 795871 796677 796411
59823 796411 795747 794581 792265 788379 783264 777655 771815 765297 757755 749735 742316 736114 730937 726276
59809 726276 721763 717203 712531 707787 702990 698158 693616 690030 687766 686434 685347 684093 682276 679197
59795 679197 674575 669341 664886 661598 658876 656465 654746 653554 651767 648587 644555 640815 637969 636106
59781 636106 635332 635590 636326 636922 637282 637656 638149 638829 639990 641803 643841 645453 646685 648493 651855 656761
59765 656761 662091 666522 669651 672239 675293 679103 683399 688208 694019 700991 708527 715909 723094 730614
59751 730614 738894 747818 756836 765330 772999 779904 786105 791420 795815 799849 804249 809001 813278 816349
59737H16349J847R46K22k99k85L58J209J742J855J905K255K738K726J996J321
59722H36885J536K221K098Q59l59o18l23k59m09n05q81j844k807l016k617k202
59706H27759j724q02L27J104J618K349L134L307K747K030J613J545J839K428K895
59691H52169K911K714K558J998N47j246k231k104j645j596j978k509k987l358
59677H43243l927n228p153q574q635q020q018q604q515p139n258l850l097k733
59663G54492k546k257j600o70L23J613L527N723P416Q330Q666Q386P387O240N729
59648H10759N606M804K958P22j511m080o960r282j0452j0910j1212j1211j0657
59635G48574r910r310q492o959n049l689l374l823m453m891n176n657o584p711
$$ plain form
59737 816349 818196 819142 819364 819065 818780 819138 820347 822089 823944 825849 828104 830842 833568 835564 836885
59722 836885 838421 840642 842740 843599 843240 842622 842299 842040 841631 841126 840245 838401 835594 832578 829961 827759
59706 827759 826035 825233 825560 826664 828282 830631 833765 837072 839819 841849 843462 845007 846846 849274 852169
59691 852169 855080 857794 860352 862350 862897 861651 859420 857316 855671 854075 852097 849588 846601 843243
59677 843243 839316 834088 826935 818361 809726 801706 793688 785084 776569 769430 764172 760322 757225 754492
59663 754492 751946 749689 748089 747419 747742 749355 752882 758605 766021 774351 783017 791403 798790 805030 810759
59648 810759 816365 821169 824127 824849 823338 819258 812298 803016 792564 781654 770442 759231 748574
59635 748574 738664 729354 720862 713903 708854 705165 701791 697968 693515 688624 683448 677791 671207 663496
59621F63496q446q411p620o304m868l931l831m132m062l454k717k021j082J75
59607F02792J367K228K832L143K880K120J493J489J817J771J026l0o11j89R26
59592F25054J779J691R00M9n85j061j339j375j387j470j275o68l57j083k394l018
59576F13461k441j366o72n55p59q89n32L45J071Q87j05j113j610j540q42L77J359
59559F05076J213N4j084j470j225o91m6M83O81O49N34J80l94m88N01K120L549
59542F09642M846O542Q378R704J0921J3149J6481J9760K1994K2617K0501J4693
59530G79228O549n58m551o265p169p111n404k761o42N16J098R39m84k842n006
59515G45537o299o903p245p618q240r103r829j0036r722r058q176p331o846o576
$$ plain form
59621 663496 655050 646639 639019 632715 627847 623916 620085 615953 611891 608437 605720 603699 602617 602792
59607 602792 604159 606387 609219 612362 615242 617362 618855 620344 622161 623932 624958 624928 624317 624128 625054
59592 625054 626833 628524 629424 629473 628888 627827 626488 625113 623726 622256 620981 620313 619956 618873 616479 613461
59576 613461 611020 609654 608982 608427 607668 606779 606247 606592 607663 608550 608445 607332 605722 604182 603340 603717 605076
59559 605076 606289 606343 605259 603789 602564 601873 601827 602310 602991 603640 604174 604354 603960 603472 603973 606093 609642
59542 609642 614488 621030 629408 639112 650033 663182 679663 699423 721417 744034 764535 779228
59530 779228 785777 785219 780668 774403 767234 760123 754719 751958 751316 751832 752930 753869 753385 750543 745537
59515 745537 739238 732335 725090 717472 709232 700129 690300 680264 670542 661484 653308 645977 639131 632555
59501F32555n956m828l767l176k681j791o67J77N60N95L92J41J78N99J134J616
59485F15081K211K984L733M362M951N332N148M528M110M204M511M793N184N587
59471F76719N551N033M609M526M233L257J929Q48J55k41k36K64J129K314L921
59456G14011N757P256Q124Q545Q700Q572Q310Q201Q124P642O655N320L382M77
59442H09076k872n505o992p864q436q493q255q375q639p888n822l686k552j950
59428G21747r65L50J465K406L549N039O969R422J1908J3624J4657J6001J7954
59415H24126J9703K0955K2604K5001K6966K7552K7234K6059K1924J2816J82j1609
59403A043513j8946k1039j8877j3837p290k26O909J3246J6532J4356O578m088
$$ plain form
59501 632555 626599 621771 618004 614828 612147 610356 609689 609866 610426 611021 611413 611554 611732 612331 613465 615081
59485 615081 617292 620276 624009 628371 633322 638654 643802 648330 652440 656644 661155 665948 671132 676719
59471 676719 682270 687303 691912 696438 700671 703928 705857 706705 706860 706619 706383 706647 707776 710090 714011
59456 714011 719768 727024 735148 743693 752393 760965 769275 777476 785600 793242 799897 805217 808599 809076
59442 809076 806204 800699 793707 785843 777407 768914 760659 752284 743645 735757 729935 726249 723697 721747
59428 721747 720782 721132 722597 725003 728552 733591 740560 749982 761890 775514 790171 806172 824126
59415 824126 843829 864784 887388 912389 939355 966907 994141 1020200 1042124 1054940 1055122 1043513
59403 1043513 1024567 1003528 984651 970814 963524 963298 970207 983453 999985 1014341 1020919 1016831
59391A016831j3981k0583k3149k2347j9591j6237j3126j0645q754o851m371j857
59379H55339o56j105j822j460l19N12P83R13R22N67J33P5J98Rl30j36Q82K382
59361H56887L789M563M538M387N132O845Q603R986J1650J3864J5701J6512J7040
59348I79497J8116J9312J9995K0578K1429K1591K0084J7669J5739J4087J1397
59337A179494P425L180o36l942o462q175j0152j3277j6440j7713j7158j6741j7398
59324A062005j8068j7881j7516j7737j8031j7539j6289j4892j3799j3275j3357
59313H83621j3476j2921j1860j1150j1048j0954j0487r889r221q140o693n392
59301G62390m250k615k54K258M518O821R289J1197J1581J0033O652J846l469q000
$$ plain form
59391 1016831 1002850 982267 959118 936771 917180 900943 887817 877172 868418 861567 857196 855339
59379 855339 854683 853578 851756 850296 849977 850489 851272 852185 853107 853674 853807 853882 854080 854089 853759 853623 854505 856887
59361 856887 860676 865239 869777 874164 879296 886141 894744 904730 916380 930244 945945 962457 979497
59348 979497 997613 1016925 1036920 1057498 1078927 1100518 1120602 1138271 1154010 1168097 1179494
59337 1179494 1186919 1190099 1189463 1185521 1179059 1170884 1160732 1147455 1131015 1113302 1096144 1079403 1062005
59324 1062005 1043937 1026056 1008540 990803 972772 955233 938944 924052 910253 896978 883621
59313 883621 870145 857224 845364 834214 823166 812212 801725 791836 782615 774475 767782 762390
59301 762390 758140 755525 755271 757529 762047 768868 778157 789354 800935 810968 817620 819466 815997 807997
59287H07997j0812j1751j1144r503p443n397l317j021J306L399N404P543R549
59274G74810J1082J2464J4218J6044J7060J7021J6584J6374J6378J6187J5235
59263I43457J2922R248N129J522j542m429o879q400r317j0370j1372j1316r900
59250H98753q013o668o133o089n904m778k476J92K241L693N185O777Q023Q940
59236H93743R776J0132R418Q012O807N659L577M63k614n044p278r505j0976j1245
59222I00925j1052j1394j2392j3476j4021j3607j2324j1017j0513j0467r785q251
59210G62626o794n997n344m329l313k741k280j381j47Q42J292J459J863K807L958
59195G42521M562M459M525N507O744P003O263N738O201P229Q114Q540Q277P190
$$ plain form
59287 807997 797185 785434 774290 764787 757344 751947 748630 747609 748915 752314 757718 765261 774810
59274 774810 785892 798356 812574 828618 845678 862699 879283 895657 912035 928222 943457
59263 943457 956379 965627 970756 972278 970736 966307 959428 951028 941711 931341 919969 908653 898753
59250 898753 890740 884072 877939 871850 865946 861168 858692 858884 861125 864818 870003 876780 884803 893743
59236 893743 903519 913651 923069 931081 937888 943547 947124 947587 944973 939929 932651 923146 912170 900925
59222 900925 889873 878479 866087 852611 838590 824983 812659 801642 791129 780662 770877 762626
59210 762626 755832 749835 744491 740162 736849 734108 731828 730447 730300 731142 732434 733893 735756 738563 742521
59195 742521 747083 751542 756067 761574 768318 775321 781584 787322 793523 800752 808866 817406 825683 832873
59181H32873N765M861M748M957N043M727L591J641L2P9J482K592K515J921J624
59166H78451J515J238Q68N13rp81j747l093m988o977q464r714j1317j2871j3357
59151H09267j2855j2515j2675j2375j1065r515q480p711o854o278o296o518o541
59138F89589o554o718o699o307n848n422m632l322j924p47L17J190J546J636K250
59123F48355L553M789N501O173P284Q554R589J0509J1509J2409J2978J3156J2855
59110G67214J2118J1423J1103J0593R116P017N293M069K662J161M34M28j01j757
59096H40773l689n044n927o487o321n352m252l432k598j651j006o80k53K4p21
59081G93384k424l899m617n285o288o974p027p072p294o889n647m586m246l811
$$ plain form
59181 832873 838638 843499 848247 853204 858247 862974 866565 868206 868238 868317 869799 872391 874906 876827 878451
59166 878451 879966 881204 882072 882585 882576 881795 880048 876955 871967 864990 856526 846812 835495 822624 809267
59151 809267 796412 783897 771222 758847 747782 738267 729787 722076 715222 708944 702648 696130 689589
59138 689589 683035 676317 669618 663311 657463 652041 647409 644087 642163 641416 641733 642923 644469 646105 648355
59123 648355 651908 656697 662198 668371 675655 684209 693798 704307 715816 728225 741203 754359 767214
59110 767214 779332 790755 801858 812451 821567 828584 833877 837946 840608 841769 842203 842631 842530 840773
59096 840773 837084 832040 826113 819626 813305 807953 803701 800269 797671 796020 795014 794334 794081 794105 793384
59081 793384 790960 787061 782444 777159 770871 763897 756870 749798 742504 735615 729968 725382 721136 717325
59067G17325k869k531l588m976n305m804m428m099l240k227j905k218k432k293
59053F70410k015j594j020o92r11j338j486j261p05Q3N38J13o06l95O21R02j30
59036F60514j151j119q35j301j921j608n18N83J662K967M167N069O250P976R426
59021F90161J0015J0409J1179J1501J0423Q452O583M757K490J70j555k864l982
59008G57739m249l289k221k208k572j871j49J384K355L365M500N214N509N953
58994G69460O538O632N969M865L671K700K294K309K000J006j62j095k027k762
58980H01398k286k79J997L485M821O935R288J0879J1997J3456J4945J5653J5863
58967I08152J6415J7273J7896J8339J8693J8178J6338J4222J2922J1657Q991N205
$$ plain form
59067 717325 714456 711925 708337 703361 698056 693252 688824 684725 681485 679258 677353 675135 672703 670410
59053 670410 668395 666801 665781 665089 664178 662840 661354 660093 659388 659471 660009 660122 659516 659121 659742 660644 660514
59036 660514 659363 658244 657409 656108 654187 652579 652061 652644 654306 657273 661440 666509 672759 680735 690161
59021 690161 700176 710585 721764 733265 743688 752140 758723 763480 765970 766140 764585 761721 757739
59008 757739 753490 750201 747980 745772 743200 741329 741180 742564 744919 748284 752784 757998 763507 769460
58994 769460 775998 782630 788599 793464 797135 799835 802129 804438 806438 807444 807282 806187 804160 801398
58980 801398 799112 798833 800830 804315 809136 816071 825359 836238 848235 861691 876636 892289 908152
58967 908152 924567 941840 959736 978075 996768 1014946 1031284 1045506 1058428 1070085 1079076 1084281
58955A084281J657j549n373r729j3451j6186j8437k0008k0152j9322j8921j9152
58943I23658j8744j7017j4839j3193j2048j0875r325p208m762k888k270k370k152
58930H05967j451p87k58K71M31m6m87k12J66k98j201j452j106j031j168p44J11
58913G96705N78P72J515K618L020K625K439K908L637M745O878R649J1726J2805
58899H62620J4033J6126J8313J9577J9760J9158J8065J7078J6851J7317J7952
58888A056850J8863K0563K2690K3965K3692K2330K0578J8629J6368J3568R975
58877A268071N868K159p19l499o764r632j0923j0928j0749j0520r670q466p714
58864A186514p386o934o663p275q492r558j0681j2428j4256j5246j5820j6869
$$ plain form
58955 1084281 1085938 1084389 1079016 1069287 1055836 1039650 1021213 1001205 981053 961731 942810 923658
58943 923658 904914 887897 873058 859865 847817 836942 827617 820409 815647 812759 810489 808119 805967
58930 805967 804516 803729 803471 803742 804173 804127 803640 803428 803594 803296 802095 800643 799537 798506 797338 796594 796705
58913 796705 797283 798055 799570 802188 805208 807833 810272 813180 816817 821562 828440 838089 849815 862620
58899 862620 876653 892779 911092 930669 950429 969587 987652 1004730 1021581 1038898 1056850
58888 1056850 1075713 1096276 1118966 1142931 1166623 1188953 1209531 1228160 1244528 1258096 1268071
58877 1268071 1273939 1276098 1275379 1271880 1265116 1255484 1244561 1233633 1222884 1212364 1202694 1194228 1186514
58864 1186514 1179128 1172194 1165531 1158256 1149764 1140206 1129525 1117097 1102841 1087595 1071775 1054906
58852A054906j7735j7084j5413j4508j4604j4296j3277j2836j3365j3723j3439
58841H94626j3412j3831j3558j2291j1378j1581j1918j1489j0812j0347r376p375
58829G57258n129l509k330j194k87L33J126K126K744K986L687N127O556P489Q170
58814G85153Q487P888O728O184O311N810M204K652J863R00r80k887l812m259n128
58799H19114o079o236n692n303n545o365p541q580q799q031o729n200l404j592
58785G34018k28Q22K038L243L909M390N475O731O906O073N645N921N412L209K78
58770G93842k335m878p530r338r668r465r810j0328j0068r054p981p028n949m700
58756F85710l462k511k275k780l018j965k30O35N32R22K290L312L197L090M242
$$ plain form
58852 1054906 1037171 1020087 1004674 990166 975562 961266 947989 935153 921788 908065 894626
58841 894626 881214 867383 853825 841534 830156 818575 806657 795168 784356 774009 764633 757258
58829 757258 752129 748620 746290 745096 744809 745142 746268 748394 751138 754124 757811 762938 769494 776983 785153
58814 785153 793640 801528 808256 814440 820751 826561 830765 833417 835280 836180 835200 832313 828501 824242 819114
58799 819114 813035 806799 801107 795804 790259 783894 776353 767773 758974 750943 744214 739014 735610 734018
58785 734018 733790 734612 736650 739893 743802 748192 753667 760398 767304 773377 779022 784943 790355 793564 793842
58770 793842 791507 786629 779099 769761 760093 750628 740818 730490 720422 711368 703387 696359 690410 685710
58756 685710 682248 679737 677462 674682 671664 669699 669469 670104 670636 671558 673848 677160 680357 683447 687689
58741F87689O212P909R034R653R550Q968Q794R179R106Q102P150P101P376P193
58727H03016O877O976P199P173P290P965Q831R497J0197J1133J2019J2823J3885
58714I24881J4904J4976J4009J2911J1859R868O581L009j44l449p276j0908j3960
58701I77261j7157k0816k3988k6045k7611k8907k8734k6344k2935k0113j7973
58690G16638j5881j3893j2261j0694r174q405q388p877o286m865m759n193m865
58677F04097l965l451l326l019k561k182j494k35J036J920L015M869P052R113
58663F10869J1312J3442J4218J2887J0315P455M005k29l987n975o603p047p542
58650F53120p836q235q872q929p836o402n568m999m031k966k254j431j52Q40R97
$$ plain form
58741 687689 693901 701810 710844 720497 730047 739015 747809 756988 766094 774196 781346 788447 795823 803016
58727 803016 809893 816869 824068 831241 838531 846496 855327 864824 875021 886154 898173 910996 924881
58714 924881 939785 954761 968770 981681 993540 1003408 1009989 1012998 1012854 1009405 1002129 991221 977261
58701 977261 960104 939288 915300 889255 861644 832737 804003 777659 754724 734611 716638
58690 716638 700757 686864 674603 663909 654735 646330 637942 630065 623779 618914 614155 608962 604097
58677 604097 600132 596681 593355 590336 587775 585593 584099 583864 584900 586820 589835 594704 601756 610869
58663 610869 622181 635623 649841 662728 673043 680498 684503 684274 680287 674312 667709 660662 653120
58650 653120 645284 637049 628177 619248 611412 605010 599442 594443 590412 587446 585192 583761 583609 584449 585446
58635E85446J216K365L625L724K942K361J953R96k82r46q70p57r88j400j781j761
58619E95843p99R96K699L816M801N804O159N781N696O294O472N587M775N036N425
58604F64385M633L122K154J763J217N91L09j1q99j892k275k201j952j066P34K634
58588F71246L887M986O619Q464J0020J1619J3537J5102J5638J5329J4342J2416
58576H03205J0101Q846Q965R066Q494Q548J0115J2134J3802J6325K0718K5701
58564I56020K9700L3228L7252M0801M2252M1663L9841L6414L0831K3983J6891
58553A328876R120M20p366j2109j3996j4370j3462j1212r036q407q856r382j0690
58540A219530j3915j8291k2282k5846k9458l2110l2576l1534l0257k8323k4917
$$ plain form
58635 585446 586662 589027 592652 596376 599318 601679 603632 604628 604346 603400 602530 601773 600785 599385 597604 595843
58619 595843 595044 596040 598739 602555 607356 613160 619319 625100 630796 637090 643562 649149 653924 658960 664385
58604 664385 669018 672140 674294 676057 677274 677865 678174 678163 677264 675372 673097 670896 668944 667878 668612 671246
58588 671246 675133 680119 686738 695202 705222 716841 730378 745480 761118 776447 790789 803205
58576 803205 813306 822152 831117 840183 848677 857225 867340 879474 893276 909601 930319 956020
58564 956020 985720 1018948 1056200 1097001 1139253 1180916 1220757 1257171 1288002 1311985 1328876
58553 1328876 1337996 1338416 1331050 1318941 1304945 1290575 1277113 1265901 1256865 1248458 1239602 1230220 1219530
58540 1219530 1205615 1187324 1165042 1139196 1109738 1077628 1045052 1013518 983261 954938 930021
58529I30021k1175j8771j7223j4970j2181j0142q822p378o164n883n758m839m047
58516G92668m579n399m795l306k588k453j780j206k032l347l138j602n65l44J07
58501G55641O41L18l26j53J77n86j519r56K81K40l75P58L316M700M584N431Q245
58484G80417J1229J3146J4937J7310J9554K1397K3474K5364K5580K3894K1510
58473I97812J8601J4059P935J814l474q393j2756j5411j6088j5565j3996j1058
58461I43480p579m918k833N3L878P648J1227J5044J8286J9636J9383J8624J6902
58448A058831J2905O912L64o241j2700j7406j8964j8701j8795j8832j7007j3782
58436I36584j1219r480p206m614k983j703P76L671M999N334O961R709J1263J1222
$$ plain form
58529 930021 908846 890075 872852 857882 845701 835559 826737 819359 813195 807312 801554 796715 792668
58516 792668 788089 782690 777895 774589 772001 769548 767768 766562 764530 761183 758045 756443 755878 755534 755641
58501 755641 756282 756600 756274 756121 756298 755712 754193 753237 753518 753758 753383 754141 757457 762157 766741 772172 780417
58484 780417 791646 804792 819729 837039 856593 877990 901464 926828 952408 976302 997812
58473 997812 1016413 1030472 1038407 1040221 1036747 1028354 1015598 1000187 984099 968534 954538 943480
58461 943480 935901 930983 928150 928203 932081 939729 950956 966000 984286 1003922 1023305 1041929 1058831
58448 1058831 1071736 1078648 1079012 1072771 1060071 1042665 1023701 1005000 986205 967373 950366 936584
58436 936584 925365 915885 908679 904065 901082 899379 900155 903826 908825 914159 921120 930829 942092 953314
58422I53314J1181J1088R195N533J894j461n519r248j0415r541r358j0436j0984
58409I25243j0746j1163j1804j0725q379p168p082n862l509k353k483j474R40
58396H43435K334K100K211L061K908K035K803M937N302L266J761K092K234J350
58382H81829J366K776L340K411K193L402L916L082L079M616N613N537O684R575
58368I39419J1507J1260J1126J2599J4209J5157J6840J9192J9844J8517J7947
58357A107617J8806J8092J4328J0036P200M574J277j142k025k840l556k075J237
58344A171529L000K386K484M606O145N910O483R089J1226J1659J2879J6181J9104
58331A282681K0099K0951K2279K1625J8396J5673J4679J2536P973M110K860J934
$$ plain form
58422 953314 964495 975583 984778 990311 992205 990744 985225 975977 965562 956021 946663 936227 925243
58409 925243 914497 903334 891530 880805 872426 865258 858176 852314 848805 846452 843969 842495 843435
58396 843435 845769 847869 850080 853141 856049 858084 860887 865824 871126 874392 876153 878245 880479 881829
58382 881829 883195 885971 889311 891722 893915 897317 901233 904315 907394 912010 917623 923160 929844 939419
58368 939419 950926 962186 973312 985911 1000120 1015277 1032117 1051309 1071153 1089670 1107617
58357 1107617 1126423 1144515 1158843 1168879 1176079 1180653 1181930 1180788 1178763 1175923 1172367 1170292 1171529
58344 1171529 1174529 1176915 1179399 1184005 1190150 1196060 1202543 1211632 1222858 1234517 1247396 1263577 1282681
58331 1282681 1302780 1323731 1346010 1367635 1386031 1401704 1416383 1428919 1436892 1441002 1443862 1445796
58319A445796P7p7K635N051N312O066R043J1702J2480J3947J7327J9234J7395
58306A565988J4390J2357R393M736K094L878P218R295J1455J4688J6508J5964
58294A687964J6257J8844K0538J9888K0403K3741K5986K4755K3633K5317K6770
58283A934096K5707K5384K8159L0697L0372L0139L2195L3339L1609L0874L3725
58272B266296L6481L6428L7107M1055M4487M4850M6300N1736N6792N7932N8994
58261B778458O3261O6750O6161O5683O8705P0591O7345O3728O4986O8087O8988
58250C512743P0874P6978Q3023Q5155Q7702R4729J01918J05231J09233J18012
58240D445598J26618J30671J35511J46178J57544J64386J71795J85061J99021
$$ plain form
58319 1445796 1445873 1445796 1448431 1453482 1458794 1464860 1473903 1485605 1498085 1512032 1529359 1548593 1565988
58306 1565988 1580378 1592735 1602128 1606864 1608958 1612836 1620054 1629349 1640804 1655492 1672000 1687964
58294 1687964 1704221 1723065 1743603 1763491 1783894 1807635 1833621 1858376 1882009 1907326 1934096
58283 1934096 1959803 1985187 2013346 2044043 2074415 2104554 2136749 2170088 2201697 2232571 2266296
58272 2266296 2302777 2339205 2376312 2417367 2461854 2506704 2553004 2604740 2661532 2719464 2778458
58261 2778458 2841719 2908469 2974630 3040313 3109018 3179609 3246954 3310682 3375668 3443755 3512743
58250 3512743 3583617 3660595 3743618 3828773 3916475 4011204 4113122 4218353 4327586 4445598
58240 4445598 4572216 4702887 4838398 4984576 5142120 5306506 5478301 5663362 5862383
58231E862383K08453K19073K36660K55428K69254K84034L06516L31513L53096
58222H326410L77316M10394M46026M78423N15639N65195O19573O71559P30060
58213A3140595Q04099Q86132R69187J064750J184254J320006J465757J638144
58205B2472924J854740K110413K401496K753282L196144L737868M392776N216541
58197D8136184O278816P628352R324935J1478132J4210149J7606639K1732832
58190A36396039K6615454L2088234L7639907M2428443M5331060M4897503L9556946
58183D04953586K8509553J2848054m317801j9258583k9495042l4622751l5755767
58176C22861249l4484967l2181258k9713380k7383416k5083912k2641027k0061282
$$ plain form
58231 5862383 6070836 6289909 6526569 6781997 7051251 7335285 7641801 7973314 8326410
58222 8326410 8703726 9114120 9560146 10038569 10554208 11119403 11738976 12410535 13140595
58213 13140595 13944694 14830826 15800013 16864763 18049017 19369023 20834780 22472924
58205 22472924 24327664 26438077 28839573 31592855 34788999 38526867 42919643 48136184
58197 48136184 54415000 62043352 71368287 82846419 97056568 114663207 136396039
58190 136396039 163011493 195099727 232739634 275168077 320499137 365396640 404953586
58183 404953586 433463139 446311193 441993392 422734809 393239767 358617016 322861249
58176 322861249 288376282 256195024 226481644 199098228 174014316 151373289 131312007
58169A31312007j7491927j5063527j2847810j0900671r253245p876112o710464
58162E1168251n725252m909426m232540l655295l163775k757852k419408k123095
58154B2181608j865323j653431j477565j319640j179023j064271r69176q79992
58146A1773187p97193p28443o68651o07459n48350n00787m61064m19297l78076
58137F663867l46239l21133k94491k69359k54173k45526k33209k17491k05885
58128D276361j97311j84573j68747j56853j48476j37869j26095j18641j14031
58119B923765j06689r7916r2770q9449q2762p4738p0974o9782o5600n9794n7572
58108B055719n7412n4058m9012m7618m8580m6584m2823m2683m5197m4748m1412
$$ plain form
58169 131312007 113820080 98756553 85908743 75008072 65754827 57878715 51168251
58162 51168251 45442999 40533573 36301033 32645738 29481963 26724111 24304703 22181608
58154 22181608 20316285 18662854 17185289 15865649 14686626 13622355 12653179 11773187
58146 11773187 10975994 10247551 9578900 8971441 8423091 7922304 7461240 7041943 6663867
58137 6663867 6317628 5996495 5702004 5432645 5178472 4932946 4699737 4482246 4276361
58128 4276361 4079050 3894477 3725730 3568877 3420401 3282532 3156437 3037796 2923765
58119 2923765 2817076 2719160 2626390 2536941 2454179 2379441 2308467 2238685 2173085 2113291 2055719
58108 2055719 1998307 1944249 1895237 1847619 1799039 1752455 1709632 1666949 1621752 1577004 1535592
58097A535592m0063m0779l9489l6566l5797l6125l3245k8243k6120k6804k5741
58086A166620k2488k0715k0646j9220j6943j7155j9222j9588j8592j9357k1069
58075I51625k0364j8175j8188j9639j8714j6062j5737j7592j7837j6541j7503
58064G55273k0853k2577k1307j9352j7180j3109q256n828n557m546l130m141o908
58051F02529p915o937o712p051n258j989o15j014l7K062J824p10j696l62k07k536
58035E63376m454m291l797m002l786l434m848p460q515p922q274r710r539p418
58021D75926o126o476o224m806m424n573n917m640l717l859l375j920j330j847
58007D15692j470L1M13q48j496n33L52K63M41J293J542J090J453K613K813J880
$$ plain form
58097 1535592 1495529 1454750 1415261 1378695 1342898 1306773 1273528 1245285 1219165 1192361 1166620
58086 1166620 1144132 1123417 1102771 1083551 1066608 1049453 1030231 1010643 992051 972694 951625
58075 951625 931261 913086 894898 875259 856545 840483 824746 807154 789317 772776 755273
58064 755273 734420 711843 690536 671184 654004 640895 632639 626811 621254 616708 613578 609437 602529
58051 602529 594614 587677 580965 573914 568656 566667 566052 565038 565001 567063 568887 568177 566481 566119 565912 563376
58035 563376 558922 554631 550834 546832 543046 539612 534764 527304 518789 510867 502593 492883 483344 475926
58021 475926 469800 463324 457100 452294 447870 442297 436380 431740 428023 424164 420789 418869 417539 415692
58007 415692 414222 414253 414666 413818 412322 411789 412141 412404 412845 414138 415680 416770 418223 420836 423649 425529
57991D25529J471J610M65k013l754m253n085o389o494n430n168n829n336l407
57977C75917k241k556k618j854j797k637k453p85N04P34J278K268K046P34O98
57962C67238K375L262K175J075J325J601Q47M3l36j493l591m844m632m566n262
57947C55217n111l419j827j237l54J408K526K368K636M317N968O473O894Q029
57933C83888Q788Q519Q403R037R029P478N451L664J155k332n059n999o500p720
57919D17802q659q308p618p720q043p716p090o564n562l858k267j119K08J553
57905C45039J730P37R5K39j98j737l035l311l419l592k689o92N82N10Q72K685
57889C33816M417M799M944N989O922O600N838N663N394M247L137L087L336K620
$$ plain form
57991 425529 427000 428610 429075 427062 423308 419055 413970 407581 401087 395657 390489 384660 379324 375917
57977 375917 373676 371120 368502 366648 364851 362214 359761 358976 359480 360214 361492 363760 365806 366540 367238
57962 367238 369613 372875 375050 376125 377450 379051 379898 379941 379605 378112 374521 369677 365045 360479 355217
57947 355217 350106 346687 344860 343623 343269 344677 347203 349571 352207 356524 362492 368965 375859 383888
57933 383888 392676 401195 409598 418635 427664 435142 440593 444257 445412 443080 438021 432022 425522 417802
57919 417802 409143 400835 393217 385497 377454 369738 362648 356084 350522 346664 344397 343278 343486 345039
57905 345039 346769 347506 347601 347840 347642 345905 342870 339559 336140 332548 329859 329167 329749 330259 331131 333816
57889 333816 338233 343032 347976 353965 360887 367487 373325 378988 384382 388629 391766 394853 398189 400809
57875D00809J080m53j729k571k547k098k435l479l605k314j120r77q89j29L44
57860C77887q5l39K57O40J04k22N78J675K349L378N091O064N411M426M297M083
57844D15594K667R00K2l28p86o44N82J607J252M32M78R12O81K72O56J369J399
57827D27065R57P69O02mo03q07j238k233k879k587k329k985l835m027m109m638
57811C97119m849m251m084n429p270q102q200q523q667p801o542n993n834n116
57797C06458m019l283k710j829j118j063r21K7R72Q84L45M68R93J071J053J802
57781B99130K921L441L587M318N542O315O331O031N732N631O039O584O084M219
57767C71905K357J614J285L26p92j129j033j290j536j014l5O96J315K055K255
$$ plain form
57875 400809 401889 401436 399707 397136 394589 392491 390056 386577 382972 380658 379538 378561 377672 377543 377887
57860 377887 377802 377463 377720 378360 378464 378242 378820 380495 382844 386222 391313 397377 402788 407214 411511 415594
57844 415594 418261 419161 419183 418855 418069 417425 418007 419614 420866 421298 421776 422688 423369 423641 424297 425666 427065
57827 427065 428022 428791 429393 429389 428786 427979 426741 424508 421629 419042 416713 413728 409893 405866 401757 397119
57811 397119 392270 388019 383935 378506 371236 363134 354934 346411 337744 329943 323401 317408 311574 306458
57797 306458 302439 299156 296446 294617 293499 292436 291515 291542 292514 293398 293743 294211 295204 296275 297328 299130
57781 299130 302051 305492 309079 313397 318939 325254 331585 337616 343348 348979 355018 361602 367686 371905
57767 371905 374262 375876 377161 377487 376695 375566 374533 373243 371707 370693 370658 371354 372669 374724 376979
57752C76979J545R27J318J989J907J484J575J820J616J504J945J907N13j013j071
57737C94945l21n60j758k435k298k279k438k003j266j301j885j610j58J239J701
57722C77573J523J129O36M01P49J149Q78K48J47N87R00Q77O75P4r25j423q37j06
57704C84255l96j254j501j261j455j944j852j372j465k104k453k560l165m084
57690C57389m303l685l083k862k655k403k296j925q41K97N91O54J973M703P595
57675C49149J0093J3040J7221K2553K8900L6502M5403N5311O5842P6059Q3880
57664H03953Q6605Q1735O7142M2070R535k3348m9413o5790p3530p4377o9830o2280
57652F72472n4389m7155m0294l4177k9588k5905k1680j6962j3207j0801q651o320
$$ plain form
57752 376979 378524 379451 380769 382758 384665 386149 387724 389544 391160 392664 394609 396516 397029 396016 394945
57737 394945 394624 394064 392306 389871 387573 385294 382856 380853 379587 378286 376401 374791 374633 375872 377573
57722 377573 379096 380225 380861 381262 382011 383160 384038 384286 384433 385020 385920 386797 387472 387546 386621 385198 384361 384255
57704 384255 383859 382605 381104 379843 378388 376444 374592 373220 371755 369651 367198 364638 361473 357389
57690 357389 353086 349401 346318 343456 340801 338398 336102 334177 333336 333633 334224 334878 336851 341554 349149
57675 349149 359242 372282 389503 412056 440956 477458 522861 578172 644014 720073 803953
57664 803953 890558 972293 1039435 1081505 1091040 1067692 1018279 952489 878959 804582 734752 672472
57652 672472 618083 570928 530634 496457 466869 440964 419284 402322 389115 378314 369663 363343
57640C63343m679m118l858l418l171l093k471j220j62L28O67R25O07k46r90j454
57624C36990j942k234j939j646k271l366l621k920k317k055j431o57r26k250l126
57609C04289k780k091j746j211j43O87O80K17l98j456k695l007k096j241j632
57594B85377k912l982m339m007l112k080j536j538j579j498j584j744j515r86
57580B52965p21o76l15J83j6j024k038k696l343l898l733k946k542k968l606l911
57564B18715l908l439k170n91J95Mk89k41k45l79j70K89L55J81O76J878K779L075
57546B16715L531M315M469L610K589J932J079j47p69j32J014J668J720J303K74
57531B43171j062j806j687j418j354r44k0O10M92K81N67J015J238J430J597J299
$$ plain form
57640 363343 358664 354546 350688 347270 344099 341006 338535 337315 337153 337481 338148 339073 339680 339434 338444 336990
57624 336990 335048 332814 330875 329229 326958 323592 319971 317051 314734 312679 311248 310591 309665 307415 304289
57609 304289 301509 299418 297672 296461 296318 297005 297685 297902 297504 296048 293353 290346 288250 287009 285377
57594 285377 282465 278483 274144 270137 267025 264945 263409 261871 260292 258794 257210 255466 253951 252965
57580 252965 252244 251568 251253 251436 251420 250396 248358 245662 242319 238421 234688 231742 229200 226232 222626 218715
57564 218715 214807 211368 209198 208607 208802 208806 208517 208276 208031 207652 207482 207771 208126 208307 208983 210861 213640 216715
57546 216715 220246 224561 229030 232640 235229 237161 238240 238093 237324 237192 238206 239874 241594 242897 243171
57531 243171 242109 240303 238616 237198 235844 234900 234880 235490 235982 236263 236830 237845 239083 240513 242110 243409
57515B43409O76O24J351J935J826J612J788J961J855J857K015J714R32N74Q91
57500B65020Q18m01k107l332l856l610k437j031p54j774k683k586k195k154j943
57485B34975j262r76j579k191k112j961k185j955p41M29O78P90J584K103J071
57470B26668q43k016k249k527l068l152k506j557o67r3j16m31j39P91J102J69
57454B09366q08o79j86m97j098q33m0J58n7L02J065J221Q43Q91J317J146M19L24
57436B12854J232K028J814J049O33Q56J497K175K402J939J191P27N38L09P6k9
57420B31291k57q12j282j279j193j486j680r76M51J592J830J361P18M65R30J641
57404B31314J507K53j029j376j251j507j905j754j258j076j019m43N46J300J694
$$ plain form
57515 243409 244085 244709 246060 247995 249821 251433 253221 255182 257037 258894 260909 262623 263555 264129 265020
57500 265020 265838 265437 263330 259998 256142 252532 250095 249064 248310 246536 243853 241267 239072 236918 234975
57485 234975 233713 232737 231158 228967 226855 224894 222709 220754 220013 220442 221120 221910 223494 225597 226668
57470 226668 225825 223809 221560 219033 215965 212813 210307 208750 208083 207990 207874 207443 207304 208095 209197 209366
57454 209366 208558 207879 207693 207196 206098 205265 205225 205383 205326 205628 206693 207914 208757 209648 210965 212111 212530 212854
57436 212854 214086 216114 217928 218977 219610 220466 221963 224138 226540 228479 229670 230397 230935 231244 231320 231291
57420 231291 231034 230222 228940 227661 226468 224982 223302 222326 222777 224369 226199 227560 228278 228743 229673 231314
57404 231314 232821 233074 232045 230669 229418 227911 226006 224252 222994 221918 220899 220456 221002 222302 223996
57389B23996J909J711R58M40J027K374L469M072M530M733M376L867L717L449K329
57374B66957Q15j9j43m22j045j482j750k351l004k848j914j176j055j067r70j111
57358B47415j407j174k15Q23J370J428J159P24N62R92J639J992K226K577K360
57343B62471Q11j298k237j566n48k44m26n14m40j36O81J731K060J187j57q74o09
57326B59892J43O18M13q4m5O46J003K82q10j078n37j63k17L0J018K277L129L208
57308B69725K467J354P39Q94R82L78j29M81J703K257K090K138K536K594K322K323
57292B94854K383J862J343K068L656M363L839L586M179M205K831J453J481K175
57278C34278K087J304P08J46j002k206k339j527j072j638k639l250l082k020l05
$$ plain form
57389 223996 225905 227616 228574 229014 230041 232415 235884 239956 244486 249219 253595 257462 261179 264628 266957
57374 266957 267772 267753 267610 267188 266143 264661 262911 260560 257556 254708 252794 251618 250563 249496 248526 247415
57358 247415 246008 244834 244619 245442 246812 248240 249399 250123 250685 251677 253316 255308 257534 260111 262471
57343 262471 263282 261984 259747 258181 257633 257389 256963 256449 256009 255873 256554 258285 260345 261532 261375 260501 259892
57326 259892 260035 260653 261066 260982 260937 261583 262586 262868 262058 260980 260443 260280 260063 260093 261111 263388 266517 269725
57308 269725 272192 273546 274285 275179 276161 276539 276410 276891 278594 280851 282941 285079 287615 290209 292531 294854
57292 294854 297237 299099 300442 302510 306166 310529 314368 317954 322133 326338 329169 330622 332103 334278
57278 334278 336365 337669 338377 338523 337521 335315 332976 331449 330377 328739 326100 322850 319768 317748 317443
57263C17443J146J399O39P4M88J400J891J852J998K732L501L547L051K955L647
57248C47763M469M771M713M561L995K882K096K542L771M562M556M280L899L157
57234D02017K356K203K596K698K292J999K133K331K379K441K493K469K857M029
57220D37293N191N307M963N695P527Q809Q851Q884R895J1116J1557J1497J1511
57207E48096J1207J0054Q425O887N303L542K093J197K57j014j749j201n1N13M83
57192E94042Q36K123M067O168Q023R398J0477J1743J3287J4755J6143J7924K0074
57179G29060K1862K2900K3584K4130K4183K3830K3903K4738K5698K6516K7893
57168I98297L0018L1761L2375L2860L4489L6908L9024M0883M3250M5910M7804
$$ plain form
57263 317443 318589 319988 320627 320701 321189 322589 324480 326332 328330 331062 334563 338110 341161 344116 347763
57248 347763 352232 357003 361716 366277 370272 373154 375250 377792 381563 386125 390681 394961 398860 402017
57234 402017 404373 406576 409172 411870 414162 416161 418294 420625 423004 425445 427938 430407 433264 437293
57220 437293 442484 447791 452754 458449 465976 474785 483636 492520 502415 513531 525088 536585 548096
57207 548096 559303 569357 577782 584669 589972 593514 595607 596804 597061 596047 594298 593097 593046 593559 594042
57192 594042 594878 597001 601068 607236 615259 624657 635134 646877 660164 674919 691062 708986 729060
57179 729060 750922 773822 797406 821536 845719 869549 893452 918190 943888 970404 998297
57168 998297 1028315 1060076 1092451 1125311 1159800 1196708 1235732 1276615 1319865 1365775 1413579
57157A413579M8643M9136M9759N0273N0411N0200M9719M9157M8899M9005M9018
57146A957799M8801M9131N0713N3209N5898N8747O1931O4865O6617O7090O6956
57135B601757O6741O6648O6905O7411O7405O6233O4202O2091O0249N8892N8745
57124C307279O0326O2742O4007O2645N8771N4107N1521N3918O2519P6073R1864
57113D005772J07092J19470J27960J34051J41386J52955J69028J88515K11456
57104E357685K39183K73067L14655L66428M31121N10897O08674P29543Q78970
57095I710223J059768J272220J516200J790236K087937K397303K703993K993465
57087B5531345L250685L462719L624765L739356L801323L778876L611904L236535
$$ plain form
57157 1413579 1462222 1511358 1561117 1611390 1661801 1712001 1761720 1810877 1859776 1908781 1957799
57146 1957799 2006600 2055731 2106444 2159653 2215551 2274298 2336229 2401094 2467711 2534801 2601757
57135 2601757 2668498 2735146 2802051 2869462 2936867 3003100 3067302 3129393 3189642 3248534 3307279
57124 3307279 3367605 3430347 3494354 3556999 3615770 3669877 3721398 3775316 3837835 3913908 4005772
57113 4005772 4112864 4232334 4360294 4494345 4635731 4788686 4957714 5146229 5357685
57104 5357685 5596868 5869935 6184590 6551018 6982139 7493036 8101710 8831253 9710223
57095 9710223 10769991 12042211 13558411 15348647 17436584 19833887 22537880 25531345
57087 25531345 28782030 32244749 35869514 39608870 43410193 47189069 50800973 54037508
57079E4037508K622317J797796Q48698j10248r74804j682195k219647k610645
57071E1708780k891572l092997l231832l312152l330520l282887l170495l001804
57063B6394521k790192k550572k297629k045008j803693j580520j378768j200067
57055A0748072j045001r12307p99095p02661o21431n53982m98023m50882m10398
57046D754292l74919l43050l13853k86825k61571k37966k16597j98064j81710
57037B339737j66052j50703j36632j24119j11886r9075q6769p6342o7268n7788
57027A263103m7039l5423k3617j2453l247K945N906N172q59j3150k9668m6017
57015A065653n8451o5507o7403o5312o1118n6510n1987m7334m2735l8513l4326
$$ plain form
57079 54037508 56659825 58457621 59306319 59196071 58221267 56539072 54319425 51708780
57071 51708780 48817208 45724211 42492379 39180227 35849707 32566820 29396325 26394521
57063 26394521 23604329 21053757 18756128 16711120 14907427 13326907 11948139 10748072
57055 10748072 9703071 8790764 7991669 7289008 6667577 6113595 5615572 5164690 4754292
57046 4754292 4379373 4036323 3722470 3435645 3174074 2936108 2719511 2521447 2339737
57037 2339737 2173685 2022982 1886350 1762231 1650345 1551270 1464501 1388159 1320891 1263103
57027 1263103 1216064 1180641 1157024 1144571 1141324 1144269 1150175 1155347 1154488 1141338 1111670 1065653
57015 1065653 1007202 941695 874292 808980 747862 691352 639365 592031 549296 510783 476457
57004D76457k9815k5717k3046k1409j9468j6980j4972j3900j3030j1909j0956
56993B75255j0256r016o837m470k715j397J17K156M901Q392J1865J3775J3096
56980B94866J0093N592J23n767j1093j4905j6876j7143j5970j3860j1552r560
56968A93948p887o357m875l288j317J242M448Q285J2527J6661K0314K3434K5601
56955B82736K5486K1715J4297M725n135j3720j9793k2776k3241k2376k0885j8881
56943B02152j6493j3917j1005p584m047q00K630P043J2241J7275K1911K6720L1503
56930B67629L4701L4656L0607K2358J0283l732j6392k5022k9210l0223k9490k7967
56918B38198k6180k4079k1293j7954j4959j2971j1591r967p921o074m952m356
$$ plain form
57004 476457 446642 420925 397879 376470 357002 340022 325050 311150 298120 286211 275255
56993 275255 264999 255983 249146 244676 241961 240564 240681 242837 247738 256130 267995 281770 294866
56980 294866 304959 310551 310674 304907 293814 278909 262033 244890 228920 215060 203508 193948
56968 193948 186061 179704 174829 171541 170224 171466 175914 184199 196726 213387 233701 257135 282736
56955 282736 308222 329937 344234 348959 343824 330104 310311 287535 264294 241918 221033 202152
56943 202152 185659 171742 160737 153153 149106 148306 150936 157979 170220 187495 209406 236126 267629
56930 267629 302330 336986 367593 389951 400234 396502 380110 355088 325878 295655 266165 238198
56918 238198 212018 187939 166646 148692 133733 120762 109171 99204 91283 85209 80257 75901
56906G5901l637k456j219n67m61j41P73J738K306L043M659O725Q270R366J1018
56891A15318J3595J6481J9240K2036K4714K6514K6956K5998K3110J7319Q826l91
56879C39716q155j3680j7171j8746j8491j7028j5182j3190j0640p153k852J729
56867A99157O156J0654J6017K2700L0284L8183M6296N4238O0202O1600N6842M5873
56855F48202K9534R612j0574k7110l7666m2255m2057l8477l3243k7905k2650j6515
56843C88896r047r37P196J5612K4772L4962M6782O0714P5617Q8725R7467J00280
56831I31039R5241P9744N3046J8609j7028m7486o8696p9547q1797p8786p3080
56820G31259o5333n5675m5227l5465k6733j8307r515m5J0346K1653L3307M4645
$$ plain form
56906 75901 72264 69808 68589 68022 67561 67420 68193 69931 72237 75280 79939 86664 94934 104300 115318
56891 115318 128913 145394 164634 186670 211384 237898 264854 290852 313962 331281 340107 339716
56879 339716 331561 317881 300710 281964 263473 246445 231263 218073 207433 200280 197428 199157
56867 199157 205313 215967 231984 254684 284968 323151 369447 423685 483887 545487 602329 648202
56855 648202 677736 687348 676774 649664 611998 569743 527686 489209 455966 428061 405411 388896
56843 388896 379849 378912 386108 401720 426492 461454 508236 568950 644567 733292 830759 931039
56831 931039 1026280 1106024 1159070 1177679 1160651 1113165 1044469 964922 883125 804339 731259
56820 731259 665926 610251 565024 529559 502826 484519 475004 474959 485305 506958 540265 584910
56808E84910N5280O4438P0154O9624O0426M1732J5391j3779l9710n8153o8211
56797G82102p1177o8873o3322n6623m9926m2972l5338k7514k0182j3214o236M55
56785C27180O452J2284J8897K6251L3072L7672L8424L3911K3661Q999p283k2198
56773E37322l3554m0342m2810m2121l9573l6135l2526k9195k5998k2540j9018
56762A73510j6191j4248j2500j0464q606p518p034o608n984n058l716k266j471
56749G1846j625k103k225j987j655j228p58n39o11o10m71o00j044j283j124j006
56733E2977j004m77P48J777J822J227P13L70Q7J23O20J166J475J811K237K278
56717F7950J828J539J720J782J397J215J689K107J718R33N56O06P19R37J294J366
$$ plain form
56808 584910 640190 704628 774782 844406 904832 946564 961955 948176 908466 850313 782102
56797 782102 710925 642052 578730 522107 472181 429209 393871 366357 346175 332961 326725 327180
56785 327180 333632 345916 364813 391064 424136 461808 500232 534143 557804 566803 559520 537322
56773 537322 503768 463426 420616 378495 338922 302787 270261 241066 215068 192528 173510
56762 173510 157319 143071 130571 120107 111501 103983 96949 90341 84357 79299 75583 73317 71846
56749 71846 70221 68118 65893 63906 62251 61023 60265 59726 59115 58505 58034 57434 56390 55107 53983 52977
56733 52977 51973 51496 52244 54021 55843 57070 57783 58153 58240 58363 58983 60149 61624 63435 65672 67950
56717 67950 69778 71317 73037 74819 76216 77431 79120 81227 82945 83878 84434 85040 85759 86696 87990 89356
56701H9356J001P19P54N62m7l75j38j56q87j443j105n42m61k82M86R17K08n73
56683H7994RJ438K149J919J627J383Q15N65J511K785K497M35j637k348j920j053
56667I8169j08N52P52J046J926K689K284J032K25L12P10J093J482J412N07l82
56651A13701j70O95R38O42R34J684J515K67n40j16M69K11l55l83m5R0L5J6l4j43
56631A19411j18J0k2j45j47l08j037k000k522k609k635k330j271p2K27k82o79
56614A03471q42j256j578j010k8O6o26o15N31J587J815J879K147J890R07K18L62
56597A08918M75p3o78q81j249j968j978o38J005J712J723J838J879J263K97k80
56581A11365m28m81k65M95J377J707J529J388J527J813K140K430K563K613K831
$$ plain form
56701 89356 90357 91076 91830 92392 92345 91970 91832 91676 90789 89346 88241 87699 87238 86956 87442 88359 88567 87994
56683 87994 88003 89441 91590 93509 95136 96519 97334 97899 99410 102195 104692 105127 103490 101142 99222 98169
56667 98169 98061 98613 99365 100411 102337 105026 107310 108342 108567 108879 109589 110682 112164 113576 114083 113701
56651 113701 113531 114226 115164 115806 116740 118424 119939 120206 119666 119550 120019 120230 119875 119492 119447 119537 119572 119588 119554 119411
56631 119411 119293 119303 119281 119136 118989 118681 117644 115644 113122 110513 107878 105548 104277 104205 104432 104150 103471
56614 103471 102629 101373 99795 98785 98757 98823 98197 97582 98113 99700 101515 103394 105541 107431 108338 108556 108918
56597 108918 109393 109320 108642 107761 106512 104544 102566 101928 102933 104645 106368 108206 110085 111348 111645 111365
56581 111365 110937 110456 110191 110686 112063 113770 115299 116687 118214 120027 122167 124597 127160 129773 132604
56566A32604L151L231L185L665N037P035R338J1806J3998J5206J5125J3883J1463
56553B48727P914M104J280k89j363k360k935k973k888k773k260j442r01p48o80
56538B40413j015k336m026m585l738k786k565k544k404k774l713m050l222k336
56524A98319k381k665k164j267r64j216j349j368j727k343k789k968k873k233
56510A70012j101k52l85j282k189k492j848l99Q35O95o43j806k048j874j621q55
56494A52747L09P25j07j136j338j039p98k06J098K342K664K378K203K022J441
56479A63305P93N45M43J21q1K20O25O24L86J54l08r72j139n39Kj48m30k31n9n31
56459A62780j072p71J96J009J437J625J351N48QM58J438J960J832J456R05J40
$$ plain form
56566 132604 135755 138986 142171 145836 150873 157908 167246 179052 193050 208256 223381 237264 248727
56553 248727 256641 260745 262025 261736 260373 258013 255078 252105 249217 246444 244184 242742 241841 241093 240413
56538 240413 239398 237062 233036 228451 224713 221927 219362 216818 214414 211640 207927 203877 200655 198319
56524 198319 195938 193273 191109 189842 188878 187662 186313 184945 183218 180875 178086 175118 172245 170012
56510 170012 168911 168659 168274 166992 164803 162311 160463 160064 160899 161594 160951 159145 157097 155223 153602 152747
56494 152747 153056 153781 153674 152538 151200 150161 149363 149157 150255 152597 155261 157639 159842 161864 163305
56479 163305 164098 164643 165086 165207 165126 165346 165971 166595 166981 167135 166827 165855 164716 164177 164179 164031 163601 163370 163311 162780
56459 162780 161708 160937 161133 162142 163579 165204 166555 167103 167111 167569 169007 170967 172799 174255 175160 175300
56443A75300l65j43N30J119J621K123K213J553N56j80o34r57r07l26L68P28P36
56426A83335L58n50j472j387k58O57N92K74M96Q74R34J189K061K708K172Q65j79
56409A92669p63j237j516j401j139p90J78J753K764K390J444J086J174R28M06
56394A97946J16l1l41m86j32K82L33L89P47Q55M26K90J090J997J925J199P94P68
56376B08167O27M89P44J140J334J596K029J941R97O4o5J54J62M02J155J492P95
56359B23223J28O61J723J938J301O44Q9l92k8J466K640K158R43O60J005N50n67
56342B38142r04k05M89P96J221J676J669J644K436L598M004L745L785M109L931
56327B70136L454L616M314M534M099L650L093J762O5p08k42M85P76P71O03K07
$$ plain form
56443 175300 174935 174792 175322 176441 178062 180185 182398 183951 184507 184327 183693 182736 181829 181503 181871 182599 183335
56426 183335 183693 183143 181671 180284 180026 180683 181275 181549 182045 182919 183853 185042 187103 189811 191983 192848 192669
56409 192669 191906 190669 189153 187752 186613 185823 186001 187754 190518 192908 194352 195438 196612 197540 197946
56394 197946 198062 198031 197690 197204 197072 197354 197687 198076 198823 199678 200104 200394 201484 203481 205406 206605 207399 208167
56376 208167 208794 209283 210027 211167 212501 214097 216126 218067 219064 219128 219063 219217 219379 219781 220936 222428 223223
56359 223223 223351 224012 225735 227673 228974 229618 229707 229315 229287 230753 233393 235551 236494 237154 238159 238709 238142
56342 238142 237238 237033 237522 238318 239539 241215 242884 244528 246964 250562 254566 258311 262096 266205 270136
56327 270136 273590 277206 281520 286054 290153 293803 296896 298658 298723 298015 297773 298258 299034 299805 300408 300615
56311C00615p2J42M91M42K24K88M97Q31J971M009N626N941O116P378Q689Q301
56295C51489O748O087O846P820Q379Q844Q996Q280P277P145P817Q439R073J0198
56281D63438J1133J0869R972R753J0166J0335J0518J1460J2531J2731J2870J4379
56269F00155J6629J7892J8381J9730K1861K3211K3844K5541K8692L1878L4796
56258H62610L8894M4695N0940N6960O3682P1795Q0966R1200J02978J15793J28471
56247A708984J41100J54633J68607J81339J92326K02200K10349K14850K14860
56238C389248K10762K01947J86918J65793J40329J11376P8703M3476Q331k5244
56228D511639n7195q6509j11222j31166j47997j62060j71838j76935j78901j78556
$$ plain form
56311 300615 300543 300685 301176 301618 301842 302130 302627 303458 305429 309438 315064 321005 327121 334499 343188 351489
56295 351489 358237 364324 371170 378990 387369 396213 405209 413489 420766 427911 435728 444167 453240 463438
56281 463438 474571 485440 495412 505165 515331 525666 536184 547644 560175 572906 585776 600155
56269 600155 616784 634676 653057 672787 694648 717859 741703 767244 795936 827814 862610
56258 862610 901504 946199 997139 1054099 1117781 1189576 1270542 1361742 1464720 1580513 1708984
56247 1708984 1850084 2004717 2173324 2354663 2546989 2749189 2959538 3174388 3389248
56238 3389248 3600010 3801957 3988875 4154668 4294997 4406373 4485076 4528552 4536883 4511639
56228 4511639 4454444 4367935 4256713 4125547 3977550 3815490 3643652 3466717 3287816 3109260
56218C109260j75207j69175j62423j55839j48324j39392j30257j21651j13001
56209A793991j04435r7217r1376q5301p8441p2079o6752o1339n5402n0055m5701
56198I85893m1306l6636l2924l0532k8239k5513k3248k1651j9836j7850j6625
56187F91533j5565j3006r523p777q330q636p125n295m671m616m392m621n342n201
56173E87433l821k575k033j126K98Q02J26p6Q17J506J695K842N047O273N869N742
56157F08819O799P426O916P133R135J1230J2144J3164J5331J7458J8711K0485
56145G54751K3960K8346L3111L9216M6828N4482O1934P0800Q0994Q9684R5194
56134A379300R8694J00381R7610Q8950P7078O5511N5404M7224M2203L9836L6960
$$ plain form
56218 3109260 2934053 2764878 2602455 2446616 2298292 2158900 2028643 1906992 1793991
56209 1793991 1689556 1592339 1500963 1415662 1337221 1265142 1198390 1137051 1081649 1031594 985893
56198 985893 944587 907951 875027 844495 816256 790743 767495 745844 726008 708158 691533
56187 691533 675968 662962 653439 645662 637332 628696 621571 616276 611605 606989 602597 597976 592634 587433
56173 587433 583612 581037 579004 577878 578176 578978 579104 579028 579845 581351 583046 585888 590935 597208 603077 608819
56157 608819 615618 623044 629960 637093 646228 657458 669602 682766 698097 715555 734266 754751
56145 754751 778711 807057 840168 879384 926212 980694 1042628 1113428 1194422 1284106 1379300
56134 1379300 1477994 1578375 1675985 1764935 1842013 1907524 1962928 2010152 2052355 2092191 2129151
56123B129151L1486K4410J6674P348l155j1654j6316j9292k3348k9020l6736m7910
56111B021638o1685p4078q2639q8563r2439r1995q6433p8883p1773o3777n4042
56100A175331m5193l9039l3404k6602k0987j8488j6613j2733q614o722n649l255
56088I38032r34n22j51K536N874P044O840P604Q951R320R348J0176J0853J0639
56074A025610J1144J3225J4774J4612J5128J7900K0387K0369J9761K0388K0078
56063A213376J7036J4068J4123J5339J4905J3995J4495J4646J2586J0520J0799
56052A365888J1504J0477R820J1779J4129J4499J5053J7995K0663K0361J9748
56041A531916K1955K4672K4675K3923K5309K6765K5611K4400K6222K8609K8471
$$ plain form
56123 2129151 2160637 2185047 2201721 2209069 2205914 2194260 2177944 2158652 2135304 2106284 2069548 2021638
56111 2021638 1959953 1885875 1803236 1714673 1622234 1530239 1443806 1364923 1293150 1229373 1175331
56100 1175331 1130138 1091099 1057695 1031093 1010106 991618 975005 962272 953658 946936 941287 938032
56088 938032 937098 936576 936425 938961 944835 951879 958719 966323 975274 984594 993942 1004118 1014971 1025610
56074 1025610 1036754 1049979 1064753 1079365 1094493 1112393 1132780 1153149 1172910 1193298 1213376
56063 1213376 1230412 1244480 1258603 1273942 1288847 1302842 1317337 1331983 1344569 1355089 1365888
56052 1365888 1377392 1387869 1397689 1409468 1423597 1438096 1453149 1471144 1491807 1512168 1531916
56041 1531916 1553871 1578543 1603218 1627141 1652450 1679215 1704826 1729226 1755448 1784057 1812528
56030A812528K8572L2343L6852L7905L7782M0571M4250M4921M4660M7351N0859
56019B258594N1301N1049N4395N9192O0961O1427O4695O8921P0204P0919P5506
56008B947164Q1843Q5332Q7576R2430R7731R9864J02004J08665J16762J21486
55998C940857J25969J35261J46053J52838J58812J69738J82547J91520K00055
55989E403650K14319K31075K44324K57889K78341L01757L21373L41781L70961
55980G965470M05094M36618M70139N13936N63369O10317O61130P26310Q00754
55971A3153137Q74712R55913J058812J180685J312308J463496J652453J879259
55963B3530775K138286K447922K838438L321761L908205M643783N595333O811732
$$ plain form
56030 1812528 1841100 1873443 1910295 1948200 1985982 2026553 2070803 2115724 2160384 2207735 2258594
56019 2258594 2309895 2360944 2415339 2474531 2535492 2596919 2661614 2730535 2800739 2871658 2947164
56008 2947164 3029007 3114339 3201915 3294345 3392076 3491940 3593944 3702609 3819371 3940857
55998 3940857 4066826 4202087 4348140 4500978 4659790 4829528 5012075 5203595 5403650
55989 5403650 5617969 5849044 6093368 6351257 6629598 6931355 7252728 7594509 7965470
55980 7965470 8370564 8807182 9277321 9791257 10354626 10964943 11626073 12352383 13153137
55971 13153137 14027849 14983762 16042574 17223259 18535567 19999063 21651516 23530775
55963 23530775 25669061 28116983 30955421 34277182 38185387 42829170 48424503 55236235
55955E5236235Q342469J0282530J2752202J5844127J9629056K4159120K9344544
55948A75590283L4788559L9763696M3256113M3898442M0045160L0512770J5792025
55941D23647048j444156j7408098k9138705l5686880l7803858l6881897l4205049
55934B31078405l0743334k7137505k3700702k0519316j7617268j5025494j2751269
55927H3583517j0773385r080825p670900o511313n546278m739368m076624l533455
55919C1651369l073834k679951k351825k079250j841170j630228j452077j302137
55911A5240897j166257j042072r37647q50829p70421o95593o34315n84502n35517
55902H023744m86701m46376m14091l81072l46992l19590k98635k76073k51454
$$ plain form
55955 55236235 63578704 73861234 86613436 102457563 122086619 146245739 175590283
55948 175590283 210378842 250142538 293398651 337297093 377342253 407855023 423647048
55941 423647048 422202892 404794794 375656089 339969209 302165351 265283454 231078405
55934 231078405 200335071 173197566 149496864 128977548 111360280 96334786 83583517
55927 83583517 72810132 63729307 56058407 49547094 44000816 39261448 35184824 31651369
55919 31651369 28577535 25897584 23545759 21466509 19625339 17995111 16543034 15240897
55911 15240897 14074640 13032568 12094921 11244092 10473671 9778078 9143763 8559261 8023744
55902 8023744 7537043 7090667 6676576 6295504 5948512 5628922 5330287 5054214 4802760
55893D802760k32025k18176k03203j86893j75297j67537j56515j42335j31854
55884C188925j25142j15383j02126r1978q5917p8260o8812o4098o5482o7221o7211
55873B257295o8962p2100p1585o7515o5525o6291o4401n8787n4584n3336n0650
55862A563559m5173m1008l9626l7794l5070l5081l7814l8539l5949l3904l3731
55851A149870l2250k8715k6461k6296k5223k2963k2844k5006k5539k3437k1916
55840H69220k1806k0337j7421j6419j7582j7296j4957j3995j4950j4133j0613
55829F89711q064q191q576q540j0877j5989k0314k2286k4095k5911k4288j8290
55817D94290j1668p035l052R58K992K778K976M282M314K912L321O483R293J0328
$$ plain form
55893 4802760 4570735 4352559 4149356 3962463 3787166 3619629 3463114 3320779 3188925
55884 3188925 3063783 2948400 2846274 2754296 2668379 2590119 2521307 2457209 2391727 2324506 2257295
55873 2257295 2188333 2116233 2044648 1977133 1911608 1845317 1780916 1722129 1667545 1614209 1563559
55862 1563559 1518386 1477378 1437752 1399958 1364888 1329807 1291993 1253454 1217505 1183601 1149870
55851 1149870 1117620 1088905 1062444 1036148 1010925 987962 965118 940112 914573 891136 869220
55840 869220 847414 827077 809656 793237 775655 758359 743402 729407 714457 700324 689711
55829 689711 681647 673456 664880 656340 645463 629474 609160 586874 562779 536868 512580 494290
55817 494290 482622 475587 472535 473493 476485 479263 482239 486521 490835 493747 497068 503551 512844 523172
55803E23172J2082J5609J8096J7922J7237J7292J5979J2211Q177N058R16m947
55791F58804r915j2527j4728j7578j8968j7787j6166j5319j3374r687p209p929
55779D97617r742j0374j0707j1719j1702r303o100l638q56L216P134R619J1455
55766D54900J2743J1271N881j187p269j1970j5249j5954j4251j2570j2095j1142
55754C83108q844p388q405j0135j0497j0266j0820j1318j0557r464r281r213q003
55741B58917o060m300k616j035m75r58j090n30p51k165l006k396j985k864l536
55726B25150k661j459j501k322k912l448l908l169j189J11k29n89L69J494J584
55711B05321J657K920M526N278N609O029N535L433J017l52j225k548l886m649
$$ plain form
55803 523172 535254 550863 568959 586881 604118 621410 637389 649600 657777 662835 663751 658804
55791 658804 648889 636362 621634 604056 585088 567301 551135 535816 522442 512755 505546 497617
55779 497617 487875 477501 466794 455075 443373 434070 427970 424332 423476 426692 433826 443445 454900
55766 454900 467643 478914 484795 483608 476339 464369 449120 433166 418915 406345 394250 383108
55754 383108 374264 366876 358471 348336 337839 327573 316753 305435 294878 285414 276133 266920 258917
55741 258917 252857 248557 245941 244906 244431 243473 242383 241853 241102 238937 235931 233535 231550 228686 225150
55726 225150 222489 221030 219529 217207 214295 210847 206939 203770 202581 202692 202463 201874 202243 203737 205321
55711 205321 206978 209898 214424 219702 225311 231340 236875 240308 241325 240973 239748 237200 233314 228665
55697B28665n337o123n991m720l859m216m375l215j887j603j453k07J424K169
55683A89272K336K889L826M869O296P782P998O655N244M617L642J520n88j594
55669B44764k098k560k022l03P05k61j641j504k90O64J520K838L760L393K637
55654B49602K772L421L565L296L015K276Q73l29j020k327m641o404o604o616p816
55639B33063r177r176q396q160q096p155n747m917m581m232m244m742m645l465
55625A46330k536k773k918j819p22j081j805j133J75J44j049j633j364j555k463
55610A23798l006k747k210j509m71K55j34j151j740j896k190k359j813r85p02
55595A01140r01j072j252j367o77Q29J657Q47l61m11K31K95J5L20P50K35p96j064
$$ plain form
55697 228665 223328 217205 211214 206494 202635 198419 194044 190829 188942 187339 185886 185679 187103 189272
55683 189272 191608 194497 198323 203192 209488 217270 225268 231923 237167 241784 245426 246946 246358 244764
55669 244764 242666 240106 238084 237781 238486 238225 236584 235080 234790 235454 236974 239812 243572 246965 249602
55654 249602 252374 255795 259360 262656 265671 267947 268820 268491 267471 265144 260503 254099 247495 240879 233063
55639 233063 223886 214710 206314 198154 190058 182903 177156 172239 167658 163426 159182 154440 149795 146330
55625 146330 143794 141021 138103 136284 135562 134481 132676 131543 131718 131862 130813 129180 127816 126261 123798
55610 123798 120792 118045 115835 114326 113855 114110 113976 112825 111085 109189 106999 104640 102827 101842 101140
55595 101140 100239 99167 97915 96548 95871 96700 98357 99204 98843 98432 98663 98958 98973 99293 100043 100278 99482 98418
55577I8418n24p8J49N77Q62M96Q2M37J113J320J481K267K917K366J222Q62J166
55560A15133R21o6r56j403j549j103k3O01r9j159j180m89k93m35O1R66J252J029
55542A11208J225J818K164K521L477M284L693K083R83P83O59M09N04N52m22k182
55526A33759l360l394k987k788k863l248l797l821l034k313k387k539j929j281
55512I4018j627k360k318j930k290k844k268j028p83j492j491l52N39M29Q8P4
55496G4365L5L4P44J897K272J566Q09O24N29J67j44l15o05p71l14L71L88j69m24
55477H1059k42k28l68j07M18O17O87J131J368M58j031j601j146r28j325j480j197
55460G6085j274j722j452j71J055J475J426J154M27m11m64K67P79O42L63J93r7
$$ plain form
55577 98418 97894 97816 97965 98542 99404 99900 99982 100419 101532 102852 104333 106600 109517 111883 113105 113967 115133
55560 115133 116054 115988 115032 113629 112080 110977 110954 111555 111456 110297 109117 108628 108335 107900 107961 108927 110179 111208
55542 111208 112433 114251 116415 118936 122413 126697 130390 132473 133456 134239 134898 135307 135811 136363 135941 133759
55526 133759 130399 127005 124018 121230 118367 115119 111322 107501 104467 102154 99767 97228 95299 94018
55512 94018 92391 90031 87713 85783 83493 80649 78381 77353 76570 75078 73587 73235 73774 74203 74291 74365
55496 74365 74400 74434 75178 77075 79347 80913 81722 82346 82875 83042 82898 82583 81978 81207 80893 81264 81652 81483 81059
55477 81059 80817 80589 80221 80114 80532 81149 81836 82967 84335 84793 83762 82161 81015 80087 78762 77282 76085
55460 76085 74811 73089 71637 71466 72521 73996 75422 76576 77003 76592 76128 76395 77174 77816 78179 78372 78275
55443G8275k01L68R97O47j97n8J006J407P82N56J205J190l76j953j787l61P38
55426H2238J090J262J313P76l12j389k068k280k094j706j234m72O20J293P88m17
55410G7408j107j006q50q72n37J70N20L13J38J66o4m70l86J40K85K4K51J045J261
55391G6429M17l98k47L00K58l38q71j082r89o13k46k72m23r9M39K23p97j464j041
55372F9186m9Q75J746K419K205R59l81r47q23m20J16N20L65j63k80K21O67O41
55354G6857M62L22q3p27j006p40m86n68n90k18L79J007J535J480N09n96o10M46
55336G7373J279J135M54k67r94j386r09M2M06P0r6R5p3n63l66O29J142M54o34
55317G7791j301j707j883j212K25J217J182R72J203J176L26o40j024j233j657
$$ plain form
55443 78275 78074 78442 79439 80086 79889 79831 80837 82244 83026 83582 84787 85977 85601 83648 81861 81500 82238
55426 82238 83328 84590 85903 86679 86367 84978 82910 80630 78536 76830 75596 75124 75744 77037 77825 77408
55410 77408 76301 75295 74445 73573 73036 73206 73726 74039 74177 74343 74279 73809 73423 73563 73848 73872 74123 75168 76429
55391 76429 76846 76448 76201 76501 76759 76421 75550 74468 73479 72866 72620 72348 71925 71826 72265 72488 71691 70227 69186
55372 69186 69137 70012 71758 74177 76382 77341 76960 76013 75190 74770 74886 75406 75771 75608 75328 75549 76216 76857
55354 76857 77319 77641 77558 76831 75825 75085 74599 74031 73441 73223 73602 74609 76144 77624 78133 77537 76927 77373
55336 77373 78652 79787 80241 79974 78980 77594 76685 76727 77133 77203 77107 77202 77129 76566 76200 76829 77971 78425 77791
55317 77791 76490 74783 72900 71688 71913 73130 74312 75284 76487 77663 77989 77349 76325 75092 73435
55302G3435j694q96M5M50O53R71Q69J56k26L26R35P01J90K57M48m4p52o03L62
55283G5583J195J449J299P84j8n56m44j15o4L7O08J131P67l53j269j344p03R4
55265G8081M01k4n65l32N57J040O92K35J96K19J58N83J490J800J008J30N6J50
55247H5875m00r74o47P9O5n64p54l01ok55o08p14p46r21j182j282q70Q9Q65O36
55227G7385j55o6J235K222J593P0p70n26O2M29M19j03q94j158n59J22O8m19n90
55208G8365l84j79j2J97K67J77K39M03K03k15m8O40O43m17j166n30N77P34J05
55189G9599l01l62n15n90k81m9k80l25M21J284J381J095J211J465J222Q13P70
55172H6558N88l05j093p01L28O72L51L06M57l3r03r40P3J140J672J874J698Q39
$$ plain form
55302 73435 71741 70845 70890 71340 71993 72964 73833 73989 73763 74089 75024 75725 75915 76172 76620 76576 75824 75221 75583
55283 75583 76778 78227 79526 80310 80292 79736 79292 79177 79113 79150 79758 80889 81656 81303 80034 78690 77987 78081
55265 78081 78482 78458 77893 77561 78118 79158 79850 80085 80281 80500 80658 81241 82731 84531 85539 85669 85725 85875
55247 85875 85475 84501 83854 83933 83998 83434 82680 82379 82373 82118 81510 80796 80050 79129 77947 76665 75795 75884 76749 77385
55227 77385 77230 77164 78399 80621 82214 82284 81514 80988 81050 81479 81898 81795 80901 79743 79184 79306 79374 78955 78365
55208 78365 77981 77802 77790 77987 78254 78431 78670 79073 79276 79061 79013 79653 80296 79879 78713 78183 78760 79494 79599
55189 79599 79298 78936 78421 77831 77550 77501 77221 76896 77317 78601 79982 81077 82288 83753 84975 85788 86558
55172 86558 87146 86841 85748 85047 85375 86047 86398 86704 87161 87128 86225 85285 85358 86498 88170 90044 91742 92581
55154I2581k61p90q55j143j525j280m77J35M51Q39R94M11k92p8O42M40p76j550
55136H7466j101j94M12Q75J271J139N02P9N2k01q66j302j243j177j224p92J64
55119H3860O46k5j227j874j513l03J275K390K364J505Q04O32M64k4m11k50L66
55102H8679J087J500J146Q2p14l90N29Q72N80N48R13Q60K76J39Q92J698J820J610
55084A02127J557J334N57l58p29n21k07j61m12o32k68P65J646J509P10M13R32
55067A08262J416J203N76Q7p8J18N23N30l54j599k189k042j862j671p36Q77J934
55050A04995J660O81j06n82r25j042j033j275j644j467o50N0K39M29Q93J000L45
55033A01568l81m35j35j70m51m18q6O5r3k37j74j5J5k40p09r77n68M48J473J954
$$ plain form
55154 92581 92320 91530 90675 89532 88007 86727 86250 86385 86836 87675 88669 89080 88788 88710 89352 89792 89016 87466
55136 87466 86365 86171 86583 87458 88729 89868 90370 90449 90501 90300 89434 88132 86889 85712 84488 83696 83860
55119 83860 84506 84481 83254 81380 79867 79564 80839 83229 85593 87098 87902 88534 88998 88974 88563 88313 88679
55102 88679 89766 91266 92412 92494 91780 91390 91919 92791 93371 93919 94832 95692 95968 96107 96999 98697 100517 102127
55084 102127 103684 105018 105575 105217 104488 103967 103760 103599 103187 102555 102287 103052 104698 106207 106917 107330 108262
55067 108262 109678 110881 111457 111544 111466 111584 112107 112637 112283 110684 108495 106453 104591 102920 102184 103061 104995
55050 104995 106655 107336 107230 106648 105723 104681 103648 102373 100729 99262 98612 98662 98901 99330 100223 101223 101568
55033 101568 101187 100752 100617 100447 99996 99578 99492 99557 99464 99227 99053 99038 99053 98813 98104 97127 96559 97007 98480 100434
55013A00434J651N49q84j607r60L26Q60L72j35m2Q1l44q99q79k80L89P48P04M24
54994A00508L77Q62J448J431Q53L62J09l26q57q42k65K6l40o53k60N33J146J482
54976A05594J559J209N66J70J52M5k82l44L3L32L25N51J325K041K028J374N45
54959A17223r7j36O29J414J005m95j523j206m93l81l59L96J270J082j5q25q87
54942A16602p39o28j48P78J472J322M57m69q60o00j65o0j14L38J401K394K869
54925A23850L242L939M655M976N146N641O467P412Q426R193Q892P027M162J304
54911B04332j048k874m212n262o389p493p907p385o538n821m833l279j905j571
54897A37815j947k053j632j163q48n03j84j43k56k14k8J66N71J415K358K864K944
$$ plain form
55013 100434 102085 102634 101750 100143 99183 99509 100369 100741 100606 100564 100645 100301 99402 98523 98243 98632 99380 100084 100508
54994 100508 100885 101747 103195 104626 105479 105841 105950 105624 104767 103925 103660 103686 103346 102693 102433 102966 104112 105594
54976 105594 107153 108362 108928 109098 109250 109295 109013 108669 108702 109034 109359 109910 111235 113276 115304 116678 117223
54959 117223 117126 116990 117619 119033 120038 119543 118020 116814 116321 115940 115581 115977 117247 118329 118314 117489 116602
54942 116602 115863 115235 115087 115865 117337 118659 119116 118647 117787 117187 117022 116962 116848 117186 118587 120981 123850
54925 123850 127092 131031 135686 140662 145808 151449 157916 165328 173754 182947 191839 198866 203028 204332
54911 204332 203284 200410 196198 190936 184547 177054 169147 161762 155224 149403 144570 141291 139386 137815
54897 137815 135868 133815 132183 131020 130172 129669 129485 129342 129086 128872 128844 129010 129581 130996 133354 136218 139162
54880A39162L063L554M522N934P390Q189Q123P733P300O220M011J319r23k767
54866B02830m769o698p711p578o820n848m834m257m563n291n390m507l296k439
54852A28829k010j827j781j721j530j323j209j034p53p29j110j312q34j89j80
54837A11287n35l12M20N20m85j587j700r67j95L19P70J142J133O58ln25q02r17
54819A08221r90r50n41K93J096J266P01j00o13o92m37K0N54J067J491J703J477
54802A13566P16k58q35o18J73P75O09j4j28O24J317R11j89n98N9O92M85J6J10
54783A17413M98M47kk65j21L09J038J950K556K696K943L659M248M197M147M925
54767A50638O124O765O990P732Q941R429Q592P012N238L062L39k441m844o872
$$ plain form
54880 139162 142225 145779 150301 156235 163625 171814 179937 187670 194970 201190 205201 206520 205597 202830
54866 202830 198061 191363 183652 176074 169254 163406 158572 154315 149752 144461 139071 134564 131268 128829
54852 128829 126819 124992 123211 121490 119960 118637 117428 116394 115641 114912 113802 112490 111656 111467 111287
54837 111287 110752 110440 110860 111380 110895 109308 107608 106641 106446 106765 107535 108677 109810 110468 110465 109940 109138 108221
54819 108221 107231 106281 105740 106033 107129 108395 109096 108996 108383 107691 107254 107274 107828 108895 110386 112089 113566
54802 113566 114282 114024 113189 112571 112744 113519 114128 114114 113986 114610 115927 116838 116649 116051 116110 116802 117287 117303 117413
54783 117413 117911 118358 118356 118091 117970 118279 119317 121267 123823 126519 129462 133121 137369 141566 145713 150638
54767 150638 156762 163527 170517 178249 187190 196619 205211 212223 217461 220523 220862 218421 213577 206705
54753B06705q361q770p997o810o043n785n589n081m209l309k894k965k697j423
54739A34772K35J036P79M07M54L96j54o38m41K66J033J824K655L229L473L943
54723A53269N054O358P096P129O827O363N569M323K669P18j298l045m376n392
54709A91264o100o322o093n783n591n317m799m243l832l369k654j858j286j007
54695A33010r63j136j321j119n00m7k63q44j063p44m13n51j027j368j324j061
54679A19266q88q48o34j8P55J178J092Q47Q16R82J049P95K42l52o61o36o01p32
54661A21652o42N1Q97R67J05q25j137j109j183j115n07L46Q72J105J373J341K97
54644A22488j528k796k539j223O2Q37J242J276P81Km94n59n73p26o74k09K46K53
$$ plain form
54753 206705 198344 189574 181577 174767 168724 162939 157350 152269 148060 144751 141857 138892 136195 134772
54739 134772 135007 136043 136822 137229 137683 138079 137925 137287 136846 137112 138145 139969 142624 145853 149326 153269
54723 153269 158323 164681 171777 178906 185733 192096 197665 201988 204657 205375 204077 201032 196656 191264
54709 191264 185164 178842 172749 166966 161375 156058 151259 147016 143184 139815 137161 135303 134017 133010
54695 133010 132047 130911 129590 128471 127971 127924 127661 126817 125754 125010 124597 124046 123019 121651 120327 119266
54679 119266 118378 117530 116896 116878 117633 118811 119903 120750 121566 122548 123597 124392 124634 124282 123621 122985 122384 121652
54661 121652 121010 121061 121958 122925 123030 122205 121068 119959 118776 117661 117154 117500 118372 119477 120850 122191 122488
54644 122488 120960 118164 115625 114402 114464 115301 116543 117819 118600 118602 118108 117549 116976 116250 115576 115367 115613 115866
54626A15866Q2K58N95L81m54j041p37jK96K1k61k08K5K75N70Q30Q34O65P15J096
54606A19807J352J037L73L8M09J172J725J731J282O32m9o20q76o99l59l37p80
54589A25838j250j244p91l48k29l51m58l83q1L82P97R17O11mn74o44k3R04J365
54570A24434R16p5q30r07m70N1L72M40L37J96J50L30P51J202J402J362J361J418
54552A32440J020j29j352j615q84j73j23k55P1O79J047J167J248J085L88m48o52
54535A33514q7O54J078J202J175J007P49N73N47N42M09O6m39q68r71q84j024j351
54517A35892j260n54pl03r13p77R8O85N03K23M67Q28N62k76r74j140j034j007
54499A31013j001p72m68o38j460k139j563K72J988K371J707J180J268J405J028
$$ plain form
54626 115866 115948 116206 116801 117182 116728 115687 114950 114949 115245 115266 115005 114797 114822 115097 115667 116497 117331 117996 118711 119807
54606 119807 121159 122196 122569 122607 123016 124188 125913 127644 128926 129558 129509 128889 128013 127314 126955 126618 125838
54589 125838 124588 123344 122553 122205 121976 121625 121167 120784 120703 121085 121882 122799 123410 123406 122832 122188 122165 123069 124434
54570 124434 125350 125275 124445 123538 123068 123119 123491 123931 124268 124464 124614 124944 125695 126897 128299 129661 131022 132440
54552 132440 133460 133331 131979 130364 129480 129307 129184 128929 129000 129679 130726 131893 133141 134226 134614 134166 133514
54535 133514 133427 134081 135159 136361 137536 138543 139292 139865 140412 140954 141363 141429 140990 140122 139151 138267 137243 135892
54517 135892 134632 134078 134071 133768 132855 132078 132176 132861 133364 133587 134054 134882 135444 135168 134194 133054 132020 131013
54499 131013 130012 129240 128772 128134 126674 124535 122972 123244 125232 127603 129310 130490 131758 133163 134191
54484A34191K65m47q59q90n67r1L25P01J072J196Q05J58j44J76Q74J650K381K914
54466A43710L026K658J965J119L59K5J67K89r8p16p96j30N63M52n61j829k549
54449A47654k319j414n11m2P8K6k40o46p89m76j23j47k76l1M83Q63J132J510J700
54430A46432J235L50k39l27k78k07J24N84O95L65m7m14q48j048n29M04P74K47
54412A47273m43n73k06K89P37Q97M87k06m56j17K02J79K28O30R86J001R18P73
54394A52599J36q38j007K62J949K639K321J945J700R50l10j191j263j178j538
54379A57176j897j429j71R72J179M29o06j054l60J307L095M102M118L661L306
54364A73828L148L003K875K886K899K648K263K129K158J721N88n96j225j557k088
$$ plain form
54484 134191 134456 134009 133150 132260 131693 131602 131927 132628 133700 134896 135701 135859 135715 135891 136765 138415 140796 143710
54466 143710 146736 149394 151359 152478 152837 152862 153029 153318 153220 152504 151708 151578 152141 152593 152032 150203 147654
54449 147654 145335 143921 143410 143368 143446 143472 143232 142586 141797 141321 141198 141051 140775 140744 141227 142090 143222 144732 146432
54430 146432 147667 148017 147778 147451 147173 146966 147090 147674 148369 148734 148687 148273 147425 146377 145848 146252 147026 147273
54412 147273 146830 146257 146051 146340 147077 147974 148461 148255 147799 147682 147884 148063 148291 148921 149907 150908 151826 152599
54394 152599 152735 151897 150890 151152 153101 155740 158061 160006 161706 162656 162346 161155 159892 158714 157176
54379 157176 155279 153850 153679 154651 155830 156259 155653 154599 154239 155546 158641 162743 166861 170522 173828
54364 173828 176976 179979 182854 185740 188639 191287 193550 195679 197837 199558 200146 199550 198325 196768 194680
54349A94680k597k617k461k934m063m927m758l663k243j068n66p65j193j408j547
54334A57870j826j869j291n69m35n86j25P77R13q3j059r96k15N31J172J819K057
54317A56085J527O81J68J9o4r8j9n0l77q37j299j795k007j333K4P92J74r46j137
54298A49508k91M47L50j90n33o24o99p19l97L41J096J341J019O57O69P96O60N00
54280A53931P49J093Q11j4n19m02j84p2L38R00O61n62j440q30O31J479J269O39
54262A58478J64L5L57R23J112P08L42N37Q38O43K47K40M43L38Q2J49L69K46r3
54243A66158j65o7j88l47j05L18L53J13J82N64Q07R23J194J193K43j126j413k25
54225A68412J040J077L49J36O86J151J007O81P05Q39L38j031k535l195k784j923
$$ plain form
54349 194680 192083 189466 187005 184071 180008 175081 170323 166660 164417 163349 162783 162018 160825 159417 157870
54334 157870 156044 154175 152884 152315 151880 151294 151169 151946 152859 152776 151717 150721 150506 151037 152209 154028 156085
54317 156085 157612 158293 158461 158480 158416 158318 158299 158249 157872 157035 155736 153941 151934 150601 150625 151417 151591 150645 149508
54298 149508 149217 149664 150014 149824 149291 148667 147968 147249 146852 147193 148289 149630 150649 151306 151975 152771 153431 153931
54280 153931 154680 155773 156584 156570 156051 155649 155465 155393 155731 156631 157292 156730 155290 154460 155091 156570 157839 158478
54262 158478 158642 158677 159034 159957 161069 161777 162119 162656 163494 164137 164384 164624 165067 165405 165487 165636 166005 166251 166158
54243 166158 165993 165926 165738 165391 165286 165604 165957 166070 166252 166816 167623 168546 169740 170933 171176 170050 168637 168412
54225 168412 169452 170529 170878 171014 171700 172851 173858 174539 175244 176083 176421 175390 172855 169660 166876 164953
54209A64953j166n24M8K16k44r31j280j200q80l04M42Q20M14l10n02p3K90K13
54191A59982P9K91O77P73M18j17l61q9M27O92P06R86J728K333K208J594J120R37
54173A74384Q13O70M77q5j133k061k193j679j155p26n9O92R33N21j09q00j805
54156A66685k945l362k461o78J000J892J922J405P66K82j8j85j84p5o3k00l19
54139A63462m06o68r66o88L25J233J234O48L44M55M51J99N9J01N0q7k2K01L17
54120A66242M63R98J724K022J773J455J266Q89K68o4L44J279K160K588K513K171
54104A88091J882J762J749J959K616L379L400K467J474J080P05l44j461j679j400
54089B05680j787k683k650j233L00Q01O36P20J174J539J546J163M32l23p05p42
$$ plain form
54209 164953 163787 163263 163311 163527 163283 162352 161072 159872 158992 158688 159130 159950 160364 160054 159552 159479 159769 159982
54191 159982 160061 160352 161029 161802 162220 162103 161742 161653 162080 162772 163478 164464 166192 168525 170733 172327 173447 174384
54173 174384 175197 175867 176344 176259 175126 173065 170872 169193 168038 167312 167253 167945 168878 169399 169290 168490 166685
54156 166685 163740 160378 157917 157239 158239 160131 162053 163458 164224 164506 164488 164303 164119 164044 163981 163781 163462
54139 163462 163056 162388 161422 160734 161059 162292 163526 164174 164518 164973 165424 165623 165682 165783 165833 165746 165724 165925 166242
54120 166242 166705 167703 169427 171449 173222 174677 175943 176832 177100 177036 177380 178659 180819 183407 185920 188091
54104 188091 189973 191735 193484 195443 198059 201438 204838 207305 208779 209859 210564 210220 208759 207080 205680
54089 205680 203893 201210 198560 197327 197627 198428 199064 199784 200958 202497 204043 205206 205638 205315 204610 203868
54073B03868p80q04n92m12p38j204q38M92J778K233K005J332J10j262j704q05
54057B02679M74J106J226J414J532J149N00K28M58Q92J508K533L787M614M526
54042B28626L692K920L137M610O503P618P614P173O971P069P392Q012Q700Q804
54028C18841Q042O927O037N353M559L653K825K153J672J477J459J243N42o43k145
54013C61995l620m564m848n115n964o941p106o574o407o932p204o508n321m357
53999B80534l678l250l384l917l886k863j829j892k758l397l566l647l476k522
53985B36469j122m61j088k169k443j569l08M15M55M53Q81J322J144O04N10Q19
53969B33912O00k73m97R01L059M482N069N875P375R035J0429J1702J2748J2796
$$ plain form
54073 203868 203088 202284 201692 201280 200542 199338 198500 198992 200770 203003 205008 206340 206450 205188 203484 202679
54057 202679 203153 204259 205485 206899 208431 209580 210080 210308 210766 211658 213166 215699 219486 224100 228626
54042 228626 232318 235238 238375 242985 249488 257106 264720 271893 278864 285933 293325 301337 310037 318841
54028 318841 326883 333810 339847 345200 349759 353412 356237 358390 360062 361539 362998 364241 364783 364140 361995
54013 361995 358375 353811 348963 343848 337884 330943 323837 317263 310856 303924 296720 290212 284891 280534
53999 280534 276856 273606 270222 266305 262419 259556 257727 255835 253077 249680 246114 242467 238991 236469
53985 236469 235347 234886 233798 231629 229186 227617 227309 227724 228179 228632 229513 230835 231979 232583 233093 233912
53969 233912 234512 234239 233742 234643 237702 242184 247253 253128 260503 269538 279967 291669 304417 317213
53955C17213J1138P805L451j016m615o639p090o630n977n388m718l758k549j292
53941B89935LJ601L484N030N713O016O861Q148Q666P712O026M694L917L339K904
53926C64049K771K810K889L222L948M754N390O103P120Q113Q681Q923R060R034
53912D46867Q944R303J0161J0600R755P949O077M322K369M61p51j327k005l035
53898E09690l831m020m031m410n044n519n884o686q225j0007j1153j1410j1464
53885D18006j1936j2373j1872j0526r406q965q453p294o041n419n199m805m345
53872C11372m226m333m364m467m806m972m612m158m153m328m153l795l704l659
53858B51642l227k672k474k336j731j054j056j439j241n26m47j447k588k857k217
$$ plain form
53955 317213 328351 336156 339607 338591 333976 327337 320247 313617 307640 302252 297534 293776 291227 289935
53941 289935 289938 291539 295023 300053 305766 311782 318643 326791 335457 343169 349195 353889 357806 361145 364049
53926 364049 366820 369630 372519 375741 379689 384443 389833 395936 403056 411169 419850 428773 437833 446867
53912 446867 455811 465114 475275 485875 495630 503579 509656 513978 516347 516808 516057 514730 512725 509690
53898 509690 505859 501839 497808 493398 488354 482835 476951 470265 462040 452033 440880 429470 418006
53885 418006 406070 393697 381825 371299 361893 352928 344475 337181 331140 325721 320522 315717 311372
53872 311372 307146 302813 298449 293982 289176 284204 279592 275434 271281 266953 262800 259005 255301 251642
53858 251642 248415 245743 243269 240933 239202 238148 237092 235653 234412 233886 233439 231992 229404 226547 224330
53843B24330j146r4L75j12r92j110j36J066J634J509Q71k99j693k421j880l95
53827B19507J166K099K060J251M99N28J009R58K13k86J27J007J610J812J777J497
53811B36834J107J086J579K080K287K778M179O054P257P278O795O861P800Q892
53797C02867R132Q386P627P648P853P032N223L824L576L549K677J362O53M71j53
53782C71727j426k482k819l092m102n693p094p845q002p692o961o049n385n217
53768B97868n421n728n974o049n796n123m189l272k507j949j828k331l099l344
53754B41258k749j909j562j687j704j349q59m96l24m02p54j134j188q23k29M09
53738B24498Q88Q88L50k53l94k06k44o49j014j014o42N7R73J652J691J375J338
$$ plain form
53843 224330 223184 223090 223465 223353 222361 221251 221115 222181 223815 225324 226195 225896 224203 221782 219902 219507
53827 219507 220673 222772 224832 226083 226582 227110 228119 229077 229290 229004 229131 230138 231748 233560 235337 236834
53811 236834 237941 239027 240606 242686 244973 247751 251930 257984 265241 272519 279314 286175 293975 302867
53797 302867 311999 320385 328012 335660 343513 350545 355768 359592 363168 366717 369394 370756 371409 371880 371727
53782 371727 370301 367819 365000 361908 357806 352113 345019 337174 329172 321480 314519 308470 303085 297868
53768 297868 292447 286719 280745 274696 268900 263777 259588 256316 253809 251860 250032 247701 244602 241258
53754 241258 238509 236600 235038 233351 231647 230298 229439 228943 228619 228217 227463 226329 225141 224318 224089 224498
53738 224498 225386 226274 226624 226371 225977 225771 225527 224878 223864 222850 222208 222265 223238 224890 226581 227956 229294
53721B29294J545J347O76L76R52J741J828J217N20rm71o42j29Q85J622J658J381
53704B43791J374J671J850J722J620K005K935M027M885N388N516N113M085K707
53690B88689J471O16O3k51k60k1J71J22n3j33j18k08m88p59p18l83k46p99j805
53671B84890k330j712l51P33R59O34M58Q28J527J861J243r8j211j414r89n77k64
53654B84187K33P70Q49M69K67O05J044R58L20l21m44j5N63Q33Q19J029J774K621
53636B96561K889K572K308K453K648K425J812J209R82J254J880K420K456K069
53622C25938J831K204L066L893M250M029L368K515J757J433J772K526K946K472
53608C64000J517J039J283J586J533J663K442L317L431K840K217J762J262R90
$$ plain form
53721 229294 230839 232186 232862 233238 234190 235931 237759 238976 239496 239487 239016 238374 238245 239130 240752 242410 243791
53704 243791 245165 246836 248686 250408 252028 254033 256968 260995 265880 271268 276784 281897 285982 288689
53690 288689 290160 290776 290839 290588 290328 290307 290478 290600 290547 290414 290296 290088 289600 288841 288123 287740 287494 286695 284890
53671 284890 282560 280848 280497 281230 282189 282823 283281 284109 285636 287497 288740 288642 287431 286017 285028 284451 284187
53654 284187 284420 285190 286039 286508 286775 287380 288424 289382 289702 289381 288937 288922 289485 290318 291137 292166 293940 296561
53636 296561 299450 302022 304330 306783 309431 311856 313668 314877 315859 317113 318993 321413 323869 325938
53622 325938 327769 329973 333039 336932 341182 345211 348579 351094 352851 354284 356056 358582 361528 364000
53608 364000 365517 366556 367839 369425 370958 372621 375063 378380 381811 384651 386868 388630 389892 390882
53594C90882J491K451K659J439m64j717j737j088p81j261j882j654o42j49j023
53579C86524k371k710j925j162j074j225j182j157j343j523j572j564j329n85
53565C65802L29O91M97N11R90J241P28j29o36o37l14K46Q76J268J381J427J368
53548C75639R64M27L88R82J662K046K264K329K008J562J775K749L496L221K394
53533D03906K059K639L854N254O400O977P177P538Q233Q931R522J0221J0829J0728
53519E04268R974R522R934J0709J1380J2363J3980J5502J6101J6186J6876J8492
53507F65287K0318K1568K1965K1651K1122K0989K1249K1150K0202J8953J8331
53496H92785J8515J8994J9259J9048J8295J7369J6898J6913J6660J5706J4711
$$ plain form
53594 390882 392373 394824 397483 398922 398458 396741 395004 393916 393135 391874 389992 388338 387696 387547 386524
53579 386524 384153 381443 379518 378356 377282 376057 374875 373718 372375 370852 369280 367716 366387 365802
53565 365802 366131 366822 367319 367830 368820 370061 370789 370660 370024 369387 369073 369319 370195 371463 372844 374271 375639
53548 375639 376603 377030 377418 378400 380062 382108 384372 386701 388709 390271 392046 394795 398291 401512 403906
53533 403906 405965 408604 412458 417712 424112 431089 438266 445804 454037 462968 472490 482711 493540 504268
53519 504268 514242 523764 533698 544407 555787 568150 582130 597632 613733 629919 646795 665287
53507 665287 685605 707173 729138 750789 771911 792900 814149 835299 855501 874454 892785
53496 892785 911300 930294 949553 968601 986896 1004265 1021163 1038076 1054736 1070442 1085153
53485A085153J4544J5144J5881J6531J7184J7615J7518J7132J6952J6985J6753
53474A267392J5887J4327J2279J0272Q846P799O276L994J732J19j293l131n133
53461A339366o780q301j0017j1345j1532j0993j0847j1349j1826j1999j2316j3070
53449A208991j4053j5044j5845j6079j5670j5330j5711j6344j6331j5723j5084
53438A037777j3985j1444p856n070m068l842l095j882r15k33N28J243J604J871
53424I90633K512L441M208M756N450O504P850R408J1125J2851J4464J5988J7380
53411A106570J8391J8940J9451K0463K1976K3465K4516K5215K5887K6650K7390
53400A358914K8152K9376L1592L4754L8054M0522M1889M2740M3904M5677M7559
$$ plain form
53485 1085153 1099697 1114841 1130722 1147253 1164437 1182052 1199570 1216702 1233654 1250639 1267392
53474 1267392 1283279 1297606 1309885 1320157 1329003 1336802 1343078 1347072 1348804 1348923 1347630 1344499 1339366
53461 1339366 1332586 1324285 1314268 1302923 1291391 1280398 1269551 1258202 1246376 1234377 1222061 1208991
53449 1208991 1194938 1179894 1164049 1147970 1132300 1116970 1101259 1084915 1068584 1052861 1037777
53438 1037777 1023792 1012348 1004492 999422 995354 991512 988417 986535 985620 985387 985915 987158 988762 990633
53424 990633 993145 996586 1000794 1005550 1011000 1017504 1025354 1034762 1045887 1058738 1073202 1089190 1106570
53411 1106570 1124961 1143901 1163352 1183815 1205791 1229256 1253772 1278987 1304874 1331524 1358914
53400 1358914 1387066 1416442 1448034 1482788 1520842 1561364 1603253 1645993 1689897 1735574 1783133
53389A783133M8720M8803M8291M7953M7980M7899M7283M6179M4779M3163M1496
53378B295679M0028L8585L6492L3423K9939K6767K3828K0414J6170J1429O682
53367B579436K072k571p508j2753j7936k2641k6877l0927l4652l7467l9171m0185
53355B308820m0821m0928m0571m0265m0031l8958l6490l3562l1626l1020l1072
53344A903476l1327l1808l2389l2832l3175l3265l2245k9535k6143k3952k3538
53333A573267k3638k2838k1010j8863j6886j5118j3518j2208j1543j1896j3135
53322A392614j4512j5457j6117j6752j7040j6657j6084j6005j6203j5938j5138
53311A216711j4257j3194j1363q931o891n837n401m973m213k864r46R17K133L098
$$ plain form
53389 1783133 1831853 1880656 1928947 1976900 2024880 2072779 2120062 2166241 2211020 2254183 2295679
53378 2295679 2335707 2374292 2410784 2444207 2474146 2500913 2524741 2545155 2561325 2572754 2579436
53367 2579436 2581508 2578937 2571429 2558676 2540740 2518099 2491222 2460295 2425643 2388176 2349005 2308820
53355 2308820 2267999 2227071 2186500 2146235 2106204 2067246 2030756 1997194 1965568 1934548 1903476
53344 1903476 1872149 1840341 1807952 1775120 1741945 1708680 1676435 1646900 1620757 1596805 1573267
53333 1573267 1549629 1526791 1505781 1486918 1470032 1454914 1441396 1429188 1417645 1405749 1392614
53322 1392614 1378102 1362645 1346528 1329776 1312736 1296079 1279995 1263990 1247787 1231849 1216711
53311 1216711 1202454 1189260 1177897 1168966 1162075 1156238 1150837 1145864 1141651 1138787 1137841 1138758 1140891 1143989
53297A143989M623O614Q349R863J1841J4136J5832J6954J8594K0920K2506K2357
53285A316578K1253K0301J9358J7937J6539J5900J5633J4818J3378J1836J0148
53274A493679P784M773J736r31l268n340p251r273j1472j3484j5160j6919j8934
53261A405940k0509k1049k1162k1853k2960k3416k2894k2231k2099k2143k1722
53250A163902k0771j9627j8612j8004j8074j8764j9600k0114k0176j9898j9452
53239I50810j9076j8914j8814j8471j7810j7040j6262j5304j4013j2502j0948
53228G71656r381p860o720o418p010p994q768r195r585j0177j0935j1825j2942
53215F52846j4187j5122j5482j5536j5638j5622j5029j3803j2325j0910r668q717
$$ plain form
53297 1143989 1148612 1155226 1163575 1173438 1185279 1199415 1215247 1232201 1250795 1271715 1294221 1316578
53285 1316578 1337831 1358132 1377490 1395427 1411966 1427866 1443499 1458317 1471695 1483531 1493679
53274 1493679 1501463 1506236 1507972 1507041 1503773 1498433 1491182 1481909 1470437 1456953 1441793 1424874 1405940
53261 1405940 1385431 1364382 1343220 1321367 1298407 1274991 1252097 1229866 1207767 1185624 1163902
53250 1163902 1143131 1123504 1104892 1086888 1068814 1050050 1030450 1010336 990160 970262 950810
53239 950810 931734 912820 894006 875535 857725 840685 824423 809119 795106 782604 771656
53228 771656 762275 754415 747695 741277 734267 726273 717505 708310 698725 688548 677613 665788 652846
53215 652846 638659 623537 608055 592519 576881 561259 546230 532427 520102 509192 499524 490807
53203D90807q090p629p348p643q544r174q772p997q201r377j0032r327q190p753
53189C72730p787p492o916o570o243n356m170l599l842m080l704l048k677k538
53175C04708k253j842j766k316l168l625l292k469j800j560j406r09j62K91L3
53160B78464p77j495j577j107o55n54n84m73l85n22o26m27k41m94q52o66p9J23
53142B67073k24m93l84l12m48m16k39m93j105j027J65J408J697J570K043K799
53126B71614K721J688O57J16l18p64o17M51J775K369J953J132Q27J493K542K767
53110B90406J618r4j155j263j005q46q23r55j175j072l46M42L97m84j226j227
53094B81192r56j060j379j301p68m38q74j776k199j573m43J07j87m58k3N45K45
$$ plain form
53203 490807 482717 475088 467740 460097 451553 442379 433607 425610 417409 408032 398000 388673 380483 372730
53189 372730 364943 357451 350535 343965 337722 332366 328196 324597 320755 316675 312971 309923 307246 304708
53175 304708 302455 300613 298847 296531 293363 289738 286446 283977 282177 280617 279211 278302 278140 278431 278464
53160 278464 277687 276192 274615 273508 272853 272299 271715 271242 270857 270335 269709 269282 269041 268547 267695 267029 266950 267073
53142 267073 266849 266356 265972 265660 265212 264796 264557 264064 262959 261932 262097 263505 265202 266772 268815 271614
53126 271614 274335 276023 276680 276796 276478 275714 275097 275548 277323 279692 281645 282777 283604 285097 287639 290406
53110 290406 292024 291930 290775 289512 288507 287661 286838 285883 284708 283636 283290 283732 284129 283645 282419 281192
53094 281192 280236 279176 277797 276496 275728 275290 274416 272640 270441 268868 268425 268532 268345 267887 267864 268409 268654
53077B68654q30j546j229l51K66L42P0k51l63k14j64o08j307j517j002l97l71
53060B59182p94j080r94p24l81J11P01J137J249J073O42k8o73p72q8R05J474J480
53042B62420J462J716J841J446Q75O31M71k19j221j568r59k38j56l51j12M83Q34
53025B67355P26L96J2l16l17J05N21N51M87P70J168J099O18L89O35Q11M27l36
53007B75101r76j207j070q16p06o80l02O38J620J912J420O79R4l33n98n57k15
52990B74004K33O56R43Q28L16O8P48J964K569K125J443J415J949K354K254J673
52974B95542P66j33n13k59N0j10l62R5J287K270K237J386N35K00K90M58M13M9
52956C04201m84q47q57p76r96j484j818j819j781j890j868j487j110j127j218
$$ plain form
53077 268654 267824 266278 265049 264698 264964 265306 265376 265125 264762 264548 264384 263776 262469 260952 259950 259553 259182
53060 259182 258388 257308 256314 255590 255209 255320 256021 257158 258407 259480 260122 260094 259421 258649 258561 259466 260940 262420
53042 262420 263882 265598 267439 268885 269760 270391 270862 270643 269422 267854 266895 266657 266501 266150 266038 266521 267355
53025 267355 268081 268477 268489 268173 267856 267961 268482 269033 269520 270290 271458 272557 273175 273564 274199 275010 275437 275101
53007 275101 274125 272918 271848 271032 270326 269646 269344 269982 271602 273514 274934 275613 275707 275374 274776 274219 274004
52990 274004 274237 274893 275836 276664 276980 277048 277796 279760 282329 284454 285897 287312 289261 291615 293869 295542
52974 295542 296308 296175 295662 295403 295453 295343 294981 295076 296363 298633 300870 302256 302791 302991 303281 303739 304152 304201
52956 304201 303717 302870 302013 301237 300241 298757 296939 295120 293339 291449 289581 288094 286984 285857 284639
52941B84639q25k28l63j417k357k198j153j27M04N04K73k20o77p96o18l88k24
52924B74229j67k85m45l51j01k72j082j823j693q52n1M42R18J319J161L68l92
52907B70923m98p4K55M3o20j173j047k61M65N54L51O02J251J361M32p35r38j6
52889B70875J070J533J600J864K136J563m9j592j771o11P27J370J376J030L74
52874B81495m12q09o00j46K80R11J882K787L267L488L613L353K587J863J638J450
52858C06647N74q90k205k986l326l323l136l209l718m051l597k787k569k991l207
52843B65226k819k415k595l125l334k873j969j185r67j116q60K31J636K509K642
52828B48986K378J922J296O94L04J5k59l15q8M7o1N8O45J066P89L11K34J66l93
$$ plain form
52941 284639 283814 283586 283223 281806 279449 277251 276098 275971 276375 276879 277152 276932 276255 275459 274841 274453 274229
52924 274229 274062 273777 273332 272981 272880 272608 271526 269703 268010 267158 267107 267549 268467 269786 270947 271315 270923
52907 270923 270425 270351 270606 270649 270029 268856 267809 267548 268013 268567 268918 269520 270771 272132 272564 271829 270891 270875
52889 270875 271945 273478 275078 276942 279078 280641 280592 279000 277229 276618 277345 278715 280091 281121 281495
52874 281495 281083 280274 279674 279528 279808 280719 282601 285388 288655 292143 295756 299109 301696 303559 305197 306647
52858 306647 307221 306331 304126 301140 297814 294491 291355 288146 284428 280377 276780 273993 271424 268433 265226
52843 265226 262407 259992 257397 254272 250938 248065 246096 244911 243944 242828 241968 242199 243835 246344 248986
52828 248986 251364 253286 254582 255276 255580 255595 255336 255021 254933 254980 254919 254977 255622 256688 257477 257788 258022 258188 257795
52809B57795p46L3J347J799J283Q20N15m66j875k238j205k52l68o81k38L14k9
52792B55808q35r60k60M68O84L79l03r57r49k16N03P67J073J766K144J466K39
52775B60817m22k55K11O53R63O87n03j913k379j720r25p64r52p98j52N87J035
52758B54170J098Q63M53L4k00j23J20L46P20J543K428K368J231M93J483L341L986
52741B74354K960J815J688K031K138K255K365J491o06k243j761J77J536J535J015
52726B90750O91M13K6k53l28k61Q8O75Q35M8j103j641j576j719k238k486k132
52709B79789j552r75j86P46J263J049M12k23o72q11n68j39K28O41J215J489R01
52692B82607l00j245j539j414r05K20J519J806N41j348k501k492j829j034k87
$$ plain form
52809 257795 257049 257082 258429 260228 261511 262331 262846 262380 260505 258267 257062 256810 256442 255761 255523 255837 255808
52792 255808 254973 254013 253753 254221 254905 255284 254981 254024 253075 252859 253362 254129 255202 256968 259112 260578 260817
52775 260817 260395 260140 260351 261004 261967 262654 262151 260238 257859 256139 255214 254450 253498 252700 252548 253135 254170
52758 254170 255268 256131 256584 256618 256418 256295 256415 256761 257481 259024 261452 263820 265051 265544 267027 270368 274354
52741 274354 277314 279129 280817 282848 284986 287241 289606 291097 290491 288248 286487 286664 288200 289735 290750
52726 290750 291441 291854 291880 291627 291299 291038 291126 291801 292636 292684 291581 289940 288364 286645 284407 281921 279789
52709 279789 278237 277262 277076 277822 279085 280134 280546 280323 279651 278840 278272 278133 278361 279002 280217 281706 282607
52692 282607 282307 281062 279523 278109 277204 277424 278943 280749 281290 279942 277441 274949 273120 272086 271799
52677B71799L27O00L37m55j394j822j429p08m26o13n41J93J085J435J205Q20O11
52660B71024P27J283K114K621K339J529Q68O16N45N99J078J997K690K477J434
52645B93941K15p60j444j710j281l13M66M82j13p74j125q83K38K038L625M288
52629B96890M429N060O455P936Q798Q823P846N585K112j901n528p879q363p327
52615C22936o211o233o879o613n026l282k324j850j426j323j611j529o58J77P4
52600B78222o03r11p08l79J14R38J614J587J177J029R77M29l59n31N6O52P66O38
52582B84708N32M33M35P84J348J620J327O45j24o55o84m42o52j465j887j027M64
52565B85360J150P29J35n3j92m41k89M20R11N09l95q84o28q2J35k18q33j118p73
$$ plain form
52677 271799 272126 272726 273063 272608 271214 269392 267963 267255 266829 266216 265675 265868 266953 268388 269593 270413 271024
52660 271024 271751 273034 275148 277769 280108 281637 282505 283121 283666 284265 285343 287340 290030 292507 293941
52645 293941 294156 293396 291952 290242 288961 288648 289114 289596 289483 288709 287584 286701 286939 288977 292602 296890
52629 296890 301319 306379 312834 320770 329568 338391 346237 351822 353934 352033 346505 338626 330263 322936
52615 322936 316725 310492 303613 297000 291974 288692 286368 284518 283092 281769 280158 278629 277971 278148 278222
52600 278222 277619 276708 276000 275621 275735 276673 278287 279874 281051 282080 283057 283486 283127 282596 282652 283304 284070 284708
52582 284708 285240 285673 286108 286892 288240 289860 291187 291832 291708 291053 290369 289927 289275 287810 285923 284896 285360
52565 285360 286510 287239 287374 287321 287129 286688 286399 286819 287730 288239 287844 286960 286332 286250 286385 286167 285334 284216 283443
52546B83443j14L85O30O89M11k18o88n23l8J31%N0K77K15j58l10MN47J117J651
52526B87501J828J404Q35P51R19N75k46o62k86L60R14J613K437K851K776K898
52510C06468L542M093M036L706L523L237K529J643P76m44k250m033n026n191m855
52495C11754m052k919k199k418k942k659j514n15k68k91Q7Q15J376J487J226O95
52479B97663%n96p43l54K65P43J031J292J524J574J557J872K589L231L471L648
52463C18767M147M643M533L823L078K588K191J666P53r45l336n316n718m682l418
52448C22774k664k259k030k087k157j739j099j088j686j836j136n40q45j478j544
52433B98586j135p78l64M25J246J580J605J714J607P86l24o84lR62J444J382J104
$$ plain form
52546 283443 283329 283714 284344 285033 285444 285226 284538 284015 283977 284108 284108 284158 284435 284650 284492 284182 284186 284733 285850 287501
52526 287501 289329 290733 291568 292319 293238 293813 293567 292905 292619 292979 293893 295506 297943 300794 303570 306468
52510 306468 310010 314103 318139 321845 325368 328605 331134 332777 333553 333109 330859 326826 321800 316609 311754
52495 311754 307702 304783 302584 300166 297224 294565 293051 292536 292268 291977 292064 292879 294255 295742 296968 297663
52479 297663 297663 297067 296324 295970 296235 296978 298009 299301 300825 302399 303956 305828 308417 311648 315119 318767
52463 318767 322914 327557 332090 335913 338991 341579 343770 345436 346189 345244 341908 336592 330874 326192 322774
52448 322774 320110 317851 315821 313734 311577 309838 308739 307651 305965 304129 302993 302453 301608 300130 298586
52433 298586 297451 296673 296309 296734 297980 299560 301165 302879 304486 305272 304948 304264 304261 305223 306667 308049 309153
52416C09153Q94R39J247J609J870K200K845L811M948O158P251P982Q497R313J0471
52401C79188J1091J0217P882M837J584j771m921p241q303q221p484o660o073n530
52387C58595m577l199j969j314r83n42K9N11Q73J118J141J133J698L036M389M866
52371C64805M546M264M523N186N897O219N532L618J253l65q31o72m03r3J21j68
52355D03432j013j796j886j308m98L35J248K175K776K794K355J864J624J685K013
52340D15800K664L565M339M650M699N070O063P440Q864J0180J1257J1922J2297
52327E08810J2860J4005J5681J7534J9143K0214K0830K1473K2356K2874K2280
52316G18060K0905J9973K0148K1012K2019K3137K4259K4933K5147K5551K6423
$$ plain form
52416 309153 310047 310986 312233 313842 315712 317912 320757 324568 329516 335674 342925 350907 359404 368717 379188
52401 379188 390279 400496 408378 413215 414799 413028 408107 400866 392563 384342 376858 370198 364125 358595
52387 358595 354018 350819 348850 347536 346553 346011 346040 346551 347424 348542 349683 350816 352514 355550 359939 364805
52371 364805 369351 373615 378138 383324 389221 395440 400972 404590 405843 405478 404647 403975 403572 403479 403600 403432
52355 403432 402419 400623 398737 397429 396931 397266 398514 400689 403465 406259 408614 410478 412102 413787 415800
52340 415800 418464 422029 426368 431018 435717 440787 446850 454290 463154 473334 484591 496513 508810
52327 508810 521670 535675 551356 568890 588033 608247 629077 650550 672906 695780 718060
52316 718060 738965 758938 779086 800098 822117 845254 869513 894446 919593 945144 971567
52305I71567K7166K7377K7504K7784K7485K6075K4376K3422K2751K1056J8150
52294A244713J5066J2312R194N056L42l824o558p728q002q419r416j0472j1018
52281A221246j1272j1648j1784j1023r493p815n995l530n46K065L737M733N620
52268A164295O788Q396J0114J1161J1358J1751J3317J5411J6660J7120J8133K0083
52256A324587K1771K2354K2439K2636K2382K1069J9239J7625J5806J2857Q817
52245A531582M586P52k626n392p316q678j0105j1830j3590j5095j6245j6984j7434
52232A411625j7965j8768j9436j9360j8504j7361j6264j5121j3846j2683j1931
52221A230386j1525j1048j0198r165q357p698o490m307j836l09p5k22K42J366
$$ plain form
52305 971567 998733 1026110 1053614 1081398 1108883 1134958 1159334 1182756 1205507 1226563 1244713
52294 1244713 1259779 1272091 1281285 1286341 1286683 1282859 1276301 1268573 1260571 1252152 1242736 1232264 1221246
52281 1221246 1209974 1198326 1186542 1175519 1166026 1158211 1152216 1148686 1148140 1150205 1153942 1158675 1164295
52268 1164295 1171083 1179479 1189593 1200754 1212112 1223863 1237180 1252591 1269251 1286371 1304504 1324587
52256 1324587 1346358 1368712 1391151 1413787 1436169 1457238 1476477 1494102 1509908 1522765 1531582
52245 1531582 1536168 1536920 1534294 1528902 1521586 1512908 1502803 1490973 1477383 1462288 1446043 1429059 1411625
52232 1411625 1393660 1374892 1355456 1336096 1317592 1300231 1283967 1268846 1255000 1242317 1230386
52221 1230386 1218861 1207813 1197615 1188450 1180093 1172395 1165905 1161598 1159762 1159453 1159378 1159156 1159398 1160764
52207A160764K597L621M470N118N437N442N348N394N682O130O459O457O264O260
52193A235443O694P542Q616R517R647Q714P120N487L826J746o89k888m578o027
52179A290170p420q627r743j0974j1858j1472r890q469q095p930o761m871l546
52166A180514l142k734j532K66K178M035N639O523O419N555M262K559M78j506
52152A209514k666k655j817q16j9P04J559K393K945L367M004M649M608L688K574
52137A232032J847J315P50O54J581L144M515N698P447J0070J3124J6263J9596
52124A318036K3019K6007K8258L0005L1486L2682L3687L4690L5338L4888L3313
52113A661409L1631L0620K9820K8319K6041K3681K1736K0233J9069J8043J6798
$$ plain form
52207 1160764 1163361 1166982 1171452 1176570 1182007 1187449 1192797 1198191 1203873 1210003 1216462 1222919 1229183 1235443
52193 1235443 1242137 1249679 1258295 1267812 1277459 1286173 1293293 1298780 1302606 1304352 1303663 1300775 1296197 1290170
52179 1290170 1282750 1274123 1264380 1253406 1241548 1230076 1220186 1211717 1203622 1195692 1188931 1184060 1180514
52166 1180514 1177372 1174638 1173106 1173372 1175550 1179585 1185224 1191747 1198166 1203721 1207983 1210542 1211020 1209514
52152 1209514 1206848 1204193 1202376 1201560 1201541 1202245 1203804 1206197 1209142 1212509 1216513 1221162 1225770 1229458 1232032
52137 1232032 1233879 1235194 1235944 1236598 1238179 1241323 1245838 1251536 1258983 1269053 1282177 1298440 1318036
52124 1318036 1341055 1367062 1395320 1425325 1456811 1489493 1523180 1557870 1593208 1628096 1661409
52113 1661409 1693040 1723660 1753480 1781799 1807840 1831521 1853257 1873490 1892559 1910602 1927400
52102A927400J5306J4102J3422J2495J0509P969O064M707K346j962p306j2321
52090A992731j6796k1065k4665k6751k7519k7948k8267k7694k5897k3649k1654
52079A720826j9619j7103j4484j2308j0150p108l351k18J388K127L396N813Q928
52066A658137J2053J4907J7448J9574K1200K2423K3352K3783K3355K2160K0928
52055A879320K0379K0414K0194J9027J6893J4053J0560O389J818k663o790j0626
52043A988968j4242j7506k0224k2354k3983k5179k5896k6127k6098k6203k6576
52032A734580k6759k6115k4607k2956k1952k1785k2091k2379k2247k1547k0603
52021A481539k0080k0287k0758k0662j9592j7804j5936j4642j4216j4272j4017
$$ plain form
52102 1927400 1942706 1956808 1970230 1982725 1993234 2001203 2007267 2011974 2014320 2012358 2005052 1992731
52090 1992731 1975935 1954870 1930205 1903454 1875935 1847987 1819720 1792026 1766129 1742480 1720826
52079 1720826 1701207 1684104 1669620 1657312 1647162 1640054 1636703 1636485 1637873 1640000 1643396 1649209 1658137
52066 1658137 1670190 1685097 1702545 1722119 1743319 1765742 1789094 1812877 1836232 1858392 1879320
52055 1879320 1899699 1920113 1940307 1959334 1976227 1990280 2000840 2007229 2009047 2006384 1999594 1988968
52043 1988968 1974726 1957220 1936996 1914642 1890659 1865480 1839584 1813457 1787359 1761156 1734580
52032 1734580 1707821 1681706 1657099 1634143 1612191 1590406 1568315 1545936 1523689 1502142 1481539
52021 1481539 1461459 1441172 1420414 1399752 1380160 1362356 1346420 1331778 1317562 1303290 1289273
52010A289273j3144j2242j2015j2413j2940j3580j4776j6559j8305j9498k0223
51999A123578k0684k0633j9647j7753j5482j3412j1854j0924j0649j0920j1474
51988I60146j2124j3018j4450j6321j7942j8715j8890j9238j9985k0543k0332
51977G68588j9416j8102j6535j4955j3769j2859j1383q859n980l669j748O56L623
51964F45592O295Q064R059R360Q693P083N080L004N73k396n436p842r248r591
51950F68290q941p606o018m346k504n53J380L629O759J0633J4287J6958J8744
51937G10712K0051K0971K1589K2258K3130K3709K3322K1639J8493J3569O757j386
51925I24814r891j7899k4753k9865l2873l3778l2814l0465k7598k5110k3142k1064
$$ plain form
52010 1289273 1276129 1263887 1251872 1239459 1226519 1212939 1198163 1181604 1163299 1143801 1123578
51999 1123578 1102894 1082261 1062614 1044861 1029379 1015967 1004113 993189 982540 971620 960146
51988 960146 948022 935004 920554 904233 886291 867576 848686 829448 809463 788920 768588
51977 768588 749172 731070 714535 699580 685811 672952 661569 652710 646730 643061 641313 641969 645592
51964 645592 651887 659951 669010 678370 687063 694146 699226 702230 702803 700407 694971 687129 677881 668290
51950 668290 659349 651743 645725 641379 638875 638322 639702 643331 650090 660723 675010 691968 710712
51937 710712 730763 751734 773323 795581 818711 842420 865742 887381 905874 919443 926200 924814
51925 924814 914923 897024 872271 842406 809533 775755 742941 712476 684878 659768 636626 615562
51913F15562j8476j5784j3495j1464r199o538l597n02K382M333N028N168N763
51900E59181O838P345O396M145J421j194l782o719r963j2777j4325j4468j3741
51887E08357j2649j1299r761q178o392l979j019J717L614M882N980O933P643Q318
51873D94167R073R420Q865P730O707N775M205J663j190l318m163l838k870j776
51859E30450p58K59J215J834K040K120K290K380K215J914J479N05j287l510n551
51844E37595p180q349q862q774q688q972q981p873n947m350l546k909j898p55
51830D50511J79J106K253L210L268K175L84j350k472k967l255l607l720l109j831
51815D40775n49J37J70n5j5N08J071Q76k35j319j355m67L64N85M72M14M59O13
$$ plain form
51913 615562 597086 581302 567807 556343 547144 540606 537009 536507 538889 543222 548250 553418 559181
51900 559181 566019 573364 579760 583905 585326 584132 580350 573631 563668 550891 536566 522098 508357
51887 508357 495708 484409 474648 466470 460078 456099 455080 456797 460411 465293 471273 478206 485849 494167
51873 494167 503240 512660 521525 529255 535962 541737 545942 547605 546415 543097 538934 535096 532226 530450
51859 530450 529692 529951 531166 533000 535040 537160 539450 541830 544045 545959 547438 547943 546656 543146 537595
51844 537595 530415 522066 513204 504430 495742 486770 477789 469916 463969 459619 456073 453164 451266 450511
51830 450511 450690 451796 454049 457259 460527 462702 463086 461736 459264 456297 453042 449435 445715 442606 440775
51815 440775 440226 440363 440533 440478 440463 440971 442042 442918 442683 441364 440009 439542 439906 440491 440963 441377 441836 442449
51797D42449R18J140R39M16jk73p62j519k094k178j935j518q57rP82J446K016
51780D38960K205J691Q70O01J023J436J573K148L622N280O205O557P218Q486R835
51765D97710J0635J0517R290P059M341J593j082l575n520o826p988r304j0188
51752D96662r963r005q294q092p832p235o596n977n019l800k948k578j795O9K384
51737D19981L977M561M747M968N101N052M975M759L921K300M95p14j125j059p26
51722D61213r0P49J346J205J57j524l179l994l506k098q17m54r31j643k146k248
51706D42040j726m74J092K234K701K972L489M014L937L053J669K10r74j584j532
51691D61121j122p60n04k07l0m05j390k395k795k585k261k269k724l359l660l199
$$ plain form
51797 442449 443367 444507 445446 445862 445861 445588 444826 443307 441213 439035 437100 435582 434725 434716 435498 436944 438960
51780 438960 441165 442856 443726 444327 445350 446786 448359 450507 454129 459409 465614 472171 479389 487875 497710
51765 497710 508345 518862 528152 535211 539552 541145 540063 536488 530968 524142 516154 506850 496662
51752 496662 486699 477694 469400 461308 453476 446241 439645 433668 428649 424849 421901 419323 417528 417597 419981
51737 419981 423958 428519 433266 438234 443335 448387 453362 458121 462042 464342 464837 464123 462998 461939 461213
51722 461213 461123 461872 463218 464423 464580 463056 459877 455883 452377 450279 449462 449008 448077 446434 444288 442040
51706 442040 440314 439840 440932 443166 445867 448839 452328 456342 460279 463332 465001 465211 464237 462653 461121
51691 461121 459999 459239 458735 458528 458498 458093 456703 454308 451513 448928 446667 444398 441674 438315 434655 431456
51675D31456k167j324j149j231q71J8R78J825K793L870M691N222N941O933P407
51660D64392O569M622K440N18j196k659l521l469k404l78K226M667O459P755Q562
51645D94583P924M852J4m441p030q092q571q602p813o307m522k609o01J068J824
51630D51677J609Q36r0q54j168j035q08p17o84q60j754l319m534m595m039l953
51614D25712m390m514l989l321k901k612k422k551k814k611j709n03O77J901L176
51599C97129M234M966N567O263P245Q872J1177J3184J3512J1783Q782N157R21
51586D98792l500o747p799p157o105n240m267k819q94J265L306N043O893R627
51572D80398J3299J6748J8694J9016J8655J8516J8892J9590K0177K0333K0374
$$ plain form
51675 431456 429289 427965 426816 425585 424714 424732 425710 427535 430328 434198 438889 444111 450052 456985 464392
51660 464392 470961 475583 478023 478541 477345 474686 471165 467696 465292 464914 467140 471807 478266 486021 494583
51645 494583 502507 507359 507373 502932 495902 487810 479239 470637 462824 456517 451995 449386 448785 449853 451677
51630 451677 453286 454122 454032 453178 452010 450975 450167 449450 448766 447906 446152 442833 438299 433704 429665 425712
51614 425712 421322 416808 412819 409498 406597 403985 401563 399012 396198 393587 391878 391375 392052 393953 397129
51599 397129 401363 406329 411896 418159 425404 434276 445453 458637 472149 483932 492714 497871 498792
51586 498792 495292 488545 480746 473589 467484 462244 457977 455158 454264 455529 458835 463878 470771 480398
51572 480398 493697 510445 529139 548155 566810 585326 604218 623808 643985 664318 684692
51561F84692K1163K3255K6355K9897L3676L7401M0087M0528L8219L3430K6612
51550A035315J8224Q922o63j0103j8817k5881l0800l4104l6554l7985l7675l5628
51538G94251l2641k9149k5000k0427j6325j3165j0523q139o726p005q452r801
51526F06898j0550j1204j2095j2727j2479j1418j0089q838p716o877o655p088
51514D89162p626p498o475n120m254m120m202l890l249k951l395m112m281l730
51500D24259l038k631k185j258j29M98N24O01J193J975K338K182J905J871K104
51485D30209K352K299J838J210O90J38q70k348l672m195l811k853j770j112j282
51470D16823k075k781l057l299l837m265m000l181k412j894j383q47n43n35o22
$$ plain form
51561 684692 705855 729110 755465 785362 819038 856439 896526 937054 975273 1008703 1035315
51550 1035315 1053539 1062461 1061798 1051695 1032878 1006997 976197 942093 905539 867554 829879 794251
51538 794251 761610 732461 707461 687034 670709 657544 647021 638882 632156 625151 616699 606898
51526 606898 596348 585144 573049 560322 547843 536425 526336 517498 509782 502905 496250 489162
51514 489162 481536 474038 467563 462443 458189 454069 449867 445977 442728 439777 436382 432270 427989 424259
51500 424259 421221 418590 416405 415147 415018 415516 416040 416641 417834 419809 422147 424329 426234 428105 430209
51485 430209 432561 434860 436698 437908 438598 438736 437866 435518 431846 427651 423840 420987 419217 418105 416823
51470 416823 414748 411967 408910 405611 401774 397509 393509 390328 387916 386022 384639 383792 383249 382714 382092
51455C82092p08p60n42J30R33J433J789K521L560M266M529N133O728Q990J1145
51440D31239J2842J4105J4703J4136J2150R107N849L289J859J286J015P01P8j412
51426E20947m125p297r402r751r118q507p981p237o573o376o178n184l569k347
51412D27302j958j827j429r06m40J56Q26J009N45K30Q33K016K856L069L058L015
51396D38355K770K422K362K652L023L613M993P197R475J1264J2920J4967J7324
51383E33337J9869K3196K8012L3888L9486M4058M8029N2000N5766N8572N9800
51372I96013N9006N5611M8959L8695K5188R905m788j6986k6701l5445m3962n1018
51360A054477n4920n5670n4754n3185n0730m7126m3019l9213l5635l1666k7128
$$ plain form
51455 382092 381384 380624 380082 380212 381145 382578 384367 386888 390448 394714 399243 404376 411104 420094 431239
51440 431239 444081 458186 472889 487025 499175 508282 514131 517420 519279 520565 521580 522281 522359 520947
51426 520947 516822 509525 500123 490372 481254 472747 464766 457529 450956 444580 438402 433218 429649 427302
51412 427302 425344 423517 422088 421182 420742 420898 421724 422733 423278 423508 424341 426357 429213 432282 435340 438355
51396 438355 441125 443547 445909 448561 451584 455197 460190 467387 476862 488126 501046 516013 533337
51383 533337 553206 576402 604414 638302 677788 721846 769875 821875 877641 936213 996013
51372 996013 1055019 1110630 1159589 1198284 1223472 1233377 1228589 1211603 1184902 1149457 1105495 1054477
51360 1054477 999557 943887 889133 835948 785218 738092 695073 655860 620225 588559 561431
51349E61431k2500j8333j4924j2426j0856j0010r600r417r210q522p053n147l577
51336D19856k739k316j802j082l68J99N85P44O80N21K95j91r96j709j869j689
51320D08119j801k290k473j916j115p66q01o49j78L18P93J440K025J976J271N68
51304D04521K22j95j018j731j660j013o36q94j355j532j472j513j808k172k270
51289C85474j951j395q71l24N13J574K442L084M027N426O438O288N523N362N873
51274D27483N801M377K387J062N83L34M2l0K18N85J022J681K420K736K305J307
51258D54313J33r97j993k808l471m055m473m458l943l276k941l082l384l433l112
51243D09020k684k493k590k664k393j831j295r39o32k96p4OK84J084K186K987
$$ plain form
51349 561431 538931 520598 505674 493248 482392 472382 462782 453365 444155 435633 428580 423433 419856
51336 419856 417117 414801 412999 411917 411549 411748 412333 413077 413757 414278 414573 414382 413386 411677 409808 408119
51320 408119 406318 404028 401555 399639 398524 397758 396957 396308 396130 396448 397241 398681 400706 402682 403953 404521
51304 404521 404743 404548 403530 401799 400139 399126 398490 397596 396241 394709 393237 391724 389916 387744 385474
51289 385474 383523 382128 381257 380933 381446 383020 385462 388546 392573 397999 404437 410725 416248 421610 427483
51274 427483 433284 437661 440048 441110 441693 442027 442069 442039 442257 442842 443864 445545 447965 450701 453006 454313
51258 454313 454446 453449 451456 448648 445177 441122 436649 432191 428248 424972 422031 418949 415565 412132 409020
51243 409020 406336 403843 401253 398589 396196 394365 393070 392131 391499 391203 391129 391135 391419 392503 394689 397676
51227C97676L127K695J875P97k46q58j009j146j516j713j191q0R08J252J110J033
51211D02714J411K110K500K054J080N84J074J869K013J556J372J904K796L602
51197D28639M084L858K642J013M4j30m62j381j937j292j39K92j0j96j74n77j361
51180D32913j641j161p04p71q35m51p2j18J3J041K352K501J065q15j856j908j593
51163D27960j270p62R6J042J584J454Q61L06J11R4j61p60j301j370j046q00r41
51146D25097j358j785k120k300k099j340l10L02J09m87o88j15Q56J563J692J458
51130D18475J199J009P46L78J46L16Q96J672K391K841K864K521K136J970J920
51115D41480J761J605J727K062K208J973J545J102O94N71J103K181L126L414L217
$$ plain form
51227 397676 400803 403498 405373 406170 405924 405066 404057 402911 401395 399682 398491 398411 399319 400571 401681 402714
51211 402714 404125 406235 408735 410789 411869 412453 413527 415396 417409 418965 420337 422241 425037 428639
51197 428639 432723 436581 439223 440236 440280 440150 439688 438307 436370 435078 434939 435231 435221 435025 434851 434274 432913
51180 432913 431272 430111 429407 428636 427801 427350 427278 427160 427173 428214 430566 433067 434132 433317 431461 429553 427960
51163 427960 426690 425928 426024 427066 428650 430104 430965 431271 431382 431476 431315 430555 429254 427884 426838 426038 425097
51146 425097 423739 421954 419834 417534 415435 414095 413785 414087 414196 413709 413021 412906 413762 415325 417017 418475
51130 418475 419674 420683 421429 421807 421953 422269 423165 424837 427228 430069 432933 435454 437590 439560 441480
51115 441480 443241 444846 446573 448635 450843 452816 454361 455463 456157 456728 457831 460012 463138 466552 469769
51100D69769K967K862K910L024K825J926O96R9L51L85o43j941k087j006P5M37
51084D82649N35P75P77K62k37j06M08O27L67l4l73p47j084j000k05J046K089K504
51066D88253K631L294M814O568P824Q839J0649J3711J7198J9811K0949K0878K0024
51053F45443J8354J5560J1833Q340O531O751P878Q551Q351P431N624K845j9j811
51039G51662k763m361p151r648j0018q129n368l061j938k551n190r212j3077j5309
51025F53886j5365j3740j1461r341p445n327k841m53J423K954M535O264Q108J0197
51011F21394J2459J4231J4788J4146J2944J1617J0215Q855P852P231O509N211
50999G47452L401J561R6r38j707k317k701k801k655k193j098P83K948M563N500
$$ plain form
51100 469769 472736 475598 478508 481532 484357 486283 486979 487078 487429 487814 487171 485230 483143 482137 482212 482649
51084 482649 483184 483959 484736 484998 484761 484655 485063 485690 486057 486023 485650 484903 483819 482819 482614 483660 485749 488253
51066 488253 490884 494178 498992 505560 513384 522223 532872 546583 563781 583592 604541 625419 645443
51053 645443 663797 679357 691190 699530 706061 712812 720690 729241 737592 745023 750647 753492 753473 751662
51039 751662 748899 744538 737387 727739 717721 709592 704224 701163 699225 696674 691484 682272 669195 653886
51025 653886 638521 624781 613320 603979 596534 591207 588366 587913 589336 592290 596825 603089 611197 621394
51011 621394 633853 648084 662872 677018 689962 701579 711794 720649 728501 735732 742241 747452
50999 747452 750853 752414 752510 751572 749865 747548 744847 742046 739391 737198 736100 736883 739831 744394 749894
50984G49894O638Q872J2099J5400J8014J9942K1772K4061K6598K8272K8122K6701
50972I86385K5825K6683K8877L1703L5553M1095M7667N3792N9115O4688P1082
50961A472465P7359Q2452Q6569R0538R4285R6742R6986R4840R0531Q4307P6470
50950B443544O7396N7462M7085L6724K6736J7327Q813J663l914q214j1630j4262
50938B668730j6190j7825j9547k1138k2067k2339k2550k3128k4001k5166k7149
50927B427630l0522l5181m0385m5390m9955n4341n8957o3756o7879p0125p0097
50916A841042o8640o6903o5113o2645n9099n4920n0886m7371m4144m0722l6838
50905A243761l2824k9500k7463k6432k5544k4168k2170j9598j6662j3998j2264
$$ plain form
50984 749894 756532 765404 777503 792903 810917 830859 852631 876692 903290 931562 959684 986385
50972 986385 1012210 1038893 1067770 1099473 1135026 1176121 1223788 1277580 1336695 1401383 1472465
50961 1472465 1549824 1632276 1718845 1809383 1903668 2000410 2097396 2192236 2282767 2367074 2443544
50950 2443544 2510940 2568402 2615487 2652211 2678947 2696274 2705087 2706750 2702836 2694622 2682992 2668730
50938 2668730 2652540 2634715 2615168 2594030 2571963 2549624 2527074 2503946 2479945 2454779 2427630
50927 2427630 2397108 2361927 2321542 2276152 2226197 2171856 2112899 2049143 1981264 1911139 1841042
50916 1841042 1772402 1705499 1640386 1577741 1518642 1463722 1412836 1365465 1321321 1280599 1243761
50905 1243761 1210937 1181437 1153974 1127542 1101998 1077830 1055660 1036062 1019400 1005402 993138
50894I93138j1265j0090q341o653n615m884l911k957k539k309j410K16J728K667
50880I37775L494M728O235P655Q907J0011J0880J1651J2749J4306J5924J7240
50868A061555J8422J9797K1397K3183K5373K8130L1149L3953L6497L9178M2337
50857A380971M6064N0510N6083O3246P2029Q1867R2034J02390J13501J25827J38955
50846B323477J52000J64534J76643J88116J98317K06948K14207K19701K21766
50837D065709K18472K09091J94108J74111J49385J20646Q9558N8151K7860n34
50827E306557k6177m7729o3976p4728q0607q1933p8376p0124n8858m6969l6069
50816D641011k7055k1271k0428k5071l4032m5840n9921p5971r2899j09243j24234
$$ plain form
50894 993138 981873 971783 963442 956789 951174 946290 942379 939422 936883 934574 933164 933380 935108 937775
50880 937775 941269 945997 952232 959887 968794 978805 989685 1001336 1014085 1028391 1044315 1061555
50868 1061555 1079977 1099774 1121171 1144354 1169727 1197857 1229006 1262959 1299456 1338634 1380971
50857 1380971 1427035 1477545 1533628 1596874 1668903 1750770 1842804 1945194 2058695 2184522 2323477
50846 2323477 2475477 2640011 2816654 3004770 3203087 3410035 3624242 3843943 4065709
50837 4065709 4284181 4493272 4687380 4861491 5010876 5131522 5221080 5279231 5307091 5306557
50827 5306557 5280380 5232651 5168675 5093947 5013340 4931407 4853031 4782907 4724049 4677080 4641011
50816 4641011 4613956 4592685 4572257 4547186 4513154 4467314 4407393 4331422 4238523 4129280 4005046
50805D005046j37816j49836j59714j66787j70550j70746j67576j61607j53307
50796B567107j42940j31159j19172j07892r7227q6681p6250o6320n7063m8483
50786A633920m0758l4037k8112k2811j8456j5426j3495j2108j1069j0485j0182
50775A416981r775r246q967r189r876j0925j2147j3222j4010j4700j5321j5401
50763A274202j4689j3846j3806j4548j5136j4845j3696j1951r730p216m762k653
50751A137324r62M85K232M896Q329J1604J4340J7510K2075K7318L1732L5255L9304
50738A351442M4539M9996N4863N9838O5916P2769P9221Q4734Q9628R4242R8638
50727B145826J02841J06713J09714J11320J11544J10640J08536J04861R9274R1326
$$ plain form
50805 4005046 3867230 3717394 3557680 3390893 3220343 3049597 2882021 2720414 2567107
50796 2567107 2424167 2293008 2173836 2065944 1968717 1882036 1805786 1739466 1682403 1633920
50786 1633920 1593162 1559125 1531013 1508202 1489746 1474320 1460825 1448717 1437648 1427163 1416981
50775 1416981 1407206 1397960 1388993 1379804 1369928 1359003 1346856 1333634 1319624 1304924 1289603 1274202
50763 1274202 1259513 1245667 1231861 1217313 1202177 1187332 1173636 1161685 1151955 1144739 1139977 1137324
50751 1137324 1136362 1136847 1139079 1143975 1152304 1163908 1178248 1195758 1217833 1245151 1276883 1312138 1351442
50738 1351442 1395981 1445977 1500840 1560678 1626594 1699363 1778584 1863318 1952946 2047188 2145826
50727 2145826 2248667 2355380 2465094 2576414 2687958 2798598 2907134 3011995 3111269 3202595
50717C202595Q0215O5251M6655K5608L551j8221l8311n5024o6752p2723p3392
50706C099452p0056o3997n5965m6461l6306k6606j8220j1543o863m669n526r847
50694B743393j7715k8596m1225n4097o6195p7084q6365r3350r7345r8060r5805
50683A987556r1446q6013p9983p3123o5349n7398n0106m3327l6308k8972k1960
50672A353571j5455r043k918J884M995P542J0675J3946J5957J6140J5126J3741
50660A426161J2434J1450J0893J0603J0473J0736J1487J2190J2231J1760J1441
50649A551859J1579J2086J3167J5243J8151K1043K3448K5802K8696L1932L4773
50638A787779L6879L8665M0696M2978M4935M6001M6089M5503M4530M3446M2748
$$ plain form
50717 3202595 3282810 3348061 3394716 3420324 3423875 3405654 3367343 3312319 3245567 3172844 3099452
50706 3099452 3029396 2965399 2909434 2862973 2826667 2800061 2781841 2770298 2763435 2758766 2753240 2743393
50694 2743393 2725678 2697082 2655857 2601760 2535565 2458481 2372116 2278766 2181421 2083361 1987556
50683 1987556 1896110 1810097 1730114 1656991 1591642 1534244 1484138 1440811 1404503 1375531 1353571
50672 1353571 1338116 1329073 1326155 1328039 1333034 1340576 1351251 1365197 1381154 1397294 1412420 1426161
50660 1426161 1438595 1450045 1460938 1471541 1482014 1492750 1504237 1516427 1528658 1540418 1551859
50649 1551859 1563438 1575524 1588691 1603934 1622085 1643128 1666576 1692378 1721074 1753006 1787779
50638 1787779 1824658 1863323 1904019 1946997 1991932 2037933 2084022 2129525 2174055 2217501 2260249
50627B260249M3024M4298M5815M6527M5507M1646L3567K0606M076j2765k6278
50616B546272l4117l5925l3098k7907k2365j7408j2951q677m695j593M5M1j356
50603B346266l894p676j2937j9581k7116l5028m2905n0171n6081o0185o2542o3426
50591A904724o3159o2238o1162n9849n7766n4919n2218n0318m8592m5870m1984
50580A306649l7857l4205l0845k7295k3426j9344j5158j1139p674m827k165P25
50568A093439L748O466Q582J0172J1556J3057J4783J6650J8542K0311K1635K2203
50556A261144K2279K2684K3804K4862K4798K3700K2733K2560K2555K1870K0666
50545A513655J9797J9646J9860K0125K0701K2080K4380K7271L0356L3556L7093
$$ plain form
50627 2260249 2303273 2347571 2393386 2439913 2485420 2527066 2560633 2581239 2585315 2572550 2546272
50616 2546272 2512155 2476230 2443132 2415225 2392860 2375452 2362501 2353824 2349129 2347536 2347581 2347622 2346266
50603 2346266 2342372 2334696 2321759 2302178 2275062 2240034 2197129 2146958 2090877 2030692 1968150 1904724
50591 1904724 1841565 1779327 1718165 1658316 1600550 1545631 1493413 1443095 1394503 1348633 1306649
50580 1306649 1268792 1234587 1203742 1176447 1153021 1133677 1118519 1107380 1099706 1094879 1092714 1093439
50568 1093439 1097187 1103653 1112235 1122407 1133963 1147020 1161803 1178453 1196995 1217306 1238941 1261144
50556 1261144 1283423 1306107 1329911 1354773 1379571 1403271 1426004 1448564 1471119 1492989 1513655
50545 1513655 1533452 1553098 1572958 1593083 1613784 1635864 1660244 1687515 1717871 1751427 1788520
50534A788520M1160M5598M9955N3797N6998N9827O2912O6954P2312P8726Q5595
50523B462354R2361R8503J03340J06237J07096J06265J03840R9355R2310Q2755
50513C454416P1117N7709M2789K6912J0844n011k0779l6560n1813o5415p6273
50502C407936q3812q7971q8830q6322q0294p0848n8638m4761l0272j5789j577
50491B758822J1972K4070L3701L9975M2176L9708L2333K0545N422j2058l1249
50480B965417n1179o9882q5020r5365j01454j04632j05668j04540j01246r6339
50470B050092r0581q4461p8261p2425o7418o3248n9353n5156n0576m5899m1268
50459A341446l6548l1611k6550k1472j6296j0956n794j456J839M806Q462J2868
$$ plain form
50534 1788520 1829680 1875278 1925233 1979030 2036028 2095855 2158767 2225721 2298033 2376759 2462354
50523 2462354 2554715 2653218 2756558 2862795 2969891 3076156 3179996 3279351 3371661 3454416
50513 3454416 3525533 3583242 3626031 3652943 3663787 3658776 3637997 3601437 3549624 3484209 3407936
50502 3407936 3324124 3236153 3147323 3061001 2980707 2909859 2851221 2806460 2776188 2760399 2758822
50491 2758822 2770794 2794864 2828565 2868540 2910716 2950424 2982757 3003302 3008724 2996666 2965417
50480 2965417 2914238 2844356 2759336 2663971 2562517 2457885 2352217 2247677 2146431 2050092
50470 2050092 1959511 1875050 1796789 1724364 1656946 1593698 1534345 1479189 1428613 1382714 1341446
50459 1341446 1304898 1273287 1246737 1225265 1208969 1198013 1192219 1190763 1192602 1197408 1205870 1218738
50447A218738J6891J9510K1195K3433K6992L1203L4985L7905L9776L9826L7042
50436A547496L1327K3822J6026Q963L056j595n010p197q233q548q817r344r701
50423A572245r385q507p460o173m349k123K24L017O897J1729J6700K1504K6562
50410A620881L1881L6705M0649M4232M7760N0560N1987N2376N2239N1202M8670
50399B129142M4978M0888L6321L0522K3282J5069O055m051j5178k6642l7703m7704
50387B194979n5777o1160o3853o4368o2829n9132n3807m7843m1536l4415k6482
50376A623777j8587j1245m028L317R938J4668J7092J7196J4635R237J876o035
50364A671841j3756k1296k8385l4175l8038m0094m0753m0163l8275l5083l0744
$$ plain form
50447 1218738 1235629 1255139 1276334 1299767 1326759 1357962 1392947 1430852 1470628 1510454 1547496
50436 1547496 1578823 1602645 1618671 1627634 1630690 1629095 1624085 1616888 1608655 1600107 1591290 1581946 1572245
50423 1572245 1562860 1554353 1546893 1540720 1536371 1534248 1534472 1537489 1544386 1556115 1572815 1594319 1620881
50410 1620881 1652762 1689467 1730116 1774348 1822108 1872668 1924655 1977031 2029270 2080472 2129142
50399 2129142 2174120 2215008 2251329 2281851 2305133 2320202 2326257 2322206 2307028 2280386 2242683 2194979
50387 2194979 2139202 2078042 2014189 1949821 1886992 1827860 1774053 1726210 1684674 1650259 1623777
50376 1623777 1605190 1593945 1589917 1593234 1603172 1617840 1634932 1652128 1666763 1676000 1677876 1671841
50364 1671841 1658085 1636789 1608404 1574229 1536191 1496097 1455344 1415181 1376906 1341823 1311079
50353A311079k5706k0812j6948j4450j3112j2801j3803j6354k0044k3856k6729
50342A106464k7990k7472k5446k2411j8775j4731j0500o608l757k218j426l48
50330I44782J567L850N569O422P134Q523J0396J1639J1510J0510R817J0063J0982
50317A052764J2026J2793J2827J1610R203O562M735L863L330K756K295K059J825
50304A138648J552J702K745M651P131J0032J3256J6578J9911K3568K7951L3122
50292A300847L8860M4846N0321N3474N1565M2095K4611J960k0325l6872m5517
50281A505865m7735m6195m2517l7414l1736k6309k1217j6279j1997r093p309n645
50269A202419l863k667k265j805o97M42Q65R80J806L577N647P475Q997J0124J0608
$$ plain form
50353 1311079 1285373 1264561 1247613 1233163 1220051 1207250 1193447 1177093 1157049 1133193 1106464
50342 1106464 1078474 1051002 1025556 1003145 984370 969639 959139 952531 948774 946556 945130 944782
50330 944782 946349 950199 955768 962190 969324 977847 988243 999882 1011392 1021902 1031719 1041782 1052764
50317 1052764 1064790 1077583 1090410 1102020 1111223 1117785 1122520 1126383 1129713 1132469 1134764 1136823 1138648
50304 1138648 1140200 1141902 1144647 1149298 1156429 1166461 1179717 1196295 1216206 1239774 1267725 1300847
50292 1300847 1339707 1384553 1434874 1488348 1539913 1582008 1606619 1608579 1588254 1551382 1505865
50281 1505865 1458130 1411935 1369418 1332004 1300268 1273959 1252742 1236463 1224466 1215373 1208064 1202419
50269 1202419 1198556 1195889 1193624 1191819 1191122 1191564 1192429 1193409 1195215 1198792 1204439 1211914 1220911 1231035 1241643
50254A241643J0505J0266J0234J0371J0622J1169J2186J3456J4477J4878J4626
50243A374433J3776J2196R626O085K075j747m985p495r108r586q840o984m290
50230A365156j317R65J575R7l360q605j5302k2427k8384l2039l3413l3249l2199
50217A157498l0649k8901k7090k5098k2854k0646j8842j7421j6037j4499j2957
50206I22504j1693j0837j0274r698q838p693o553n681n174n023n171n351n178
50193H25340m546l794l362l368l610l757l506k815k151k197l069m087m535m502
50179G76041m584n014n449n506n123m369l289k112j218p79n61k83M3K54L78N96
50163G39025R50J310J640K063K577K923K896K688K719L193M081N429P349R609
$$ plain form
50254 1241643 1252148 1262414 1272648 1283019 1293641 1304810 1316996 1330452 1344929 1359807 1374433
50243 1374433 1388209 1400405 1410031 1416116 1418191 1416444 1411459 1403964 1394856 1385270 1376430 1369446 1365156
50230 1365156 1363839 1364804 1366379 1366476 1363116 1354511 1339209 1316782 1288398 1256359 1222946 1189697 1157498
50217 1157498 1126849 1097948 1070858 1045760 1022906 1002260 983418 965997 949960 935461 922504
50206 922504 910811 899974 889700 880002 871164 863471 856918 851237 846063 841040 835869 830518 825340
50193 825340 820794 817000 813638 810270 806660 802903 799397 796582 794431 792234 789165 785078 780543 776041
50179 776041 771457 766443 760994 755488 750365 745996 742707 740595 739377 738598 738037 737754 737797 738051 738429 739025
50163 739025 739975 741285 742925 744988 747565 750488 753384 756072 758791 761984 766065 771494 778843 788452
50149G88452J1568J2769J3365J3808J4359J5107J6218J7817J9774K1869K4058
50138I69164K6238K8004K8996K9449L0018L1156L2845L4839L6763L8136L8621
50127A324229L8135L6362L2435K5637J6428O247l587j2373j9687k5293k9412l2406
50115A356715l4159l4374l3368l1746k9373k5750k1555j8549j7418j6874j5645
50104A077904j4279j3954j4477j4768j4733j5174j6023j6137j5049j3670j2872
50093I16768j2291j1076r137p096n426m096k785j162Q16K712L913M297M398M843
50079H84678N791O924P794Q186Q397Q975R965J0633J0393R643R196R007Q256O660
50065A004498M938L727K769J498j10j678k939l762m019l827l615l628l722l802
$$ plain form
50149 788452 800020 812789 826154 839962 854321 869428 885646 903463 923237 945106 969164
50138 969164 995402 1023406 1052402 1081851 1111869 1143025 1175870 1210709 1247472 1285608 1324229
50127 1324229 1362364 1398726 1431161 1456798 1473226 1479473 1475886 1463513 1443826 1418533 1389121 1356715
50115 1356715 1322556 1288182 1254814 1223068 1193695 1167945 1146390 1127841 1110423 1093549 1077904
50104 1077904 1063625 1049671 1035194 1020426 1005693 990519 974496 958359 943310 929640 916768
50093 916768 904477 893401 884264 877168 871742 867646 864861 863699 864515 867227 871140 875437 879835 884678
50079 884678 890469 897393 905187 913373 921770 930745 940710 951343 961736 971379 980575 989582 997838 1004498
50065 1004498 1009436 1013163 1015932 1017430 1017320 1015642 1012703 1008941 1004922 1001095 997480 993852 990130 986328
50051I86328m104m701n108m822l946k878j683j86J570L421N467P838J0206J2035
50037I99437J3278J4376J5537J6401J6571J6158J5673J5545J5784J5986J5750
50026A170496J5196J4881J4968J4837J3942J2783J2388J2902J3433J3323J2808
50015A321957J2118J0708Q099M968K704K038K591L564M238L871J795k139p473
50002A369039j3477j9345k4148k7180k8405k8260k7032k4893k2474k0695j9768
49991A113362j8933j7542j5922j4821j4425j4505j5082j6312j7822j8753j8612
49980I30633j7757j6982j6798j7021j6843j5485j3059j0621r076q338p799p303
49968G73551p070o936o413n476m667m347m359m400m213l383j604P10K762M395
$$ plain form
50051 986328 982224 977523 972415 967593 963647 960769 959086 958900 960470 963891 969358 977196 987402 999437
50037 999437 1012715 1027091 1042628 1059029 1075600 1091758 1107431 1122976 1138760 1154746 1170496
50026 1170496 1185692 1200573 1215541 1230378 1244320 1257103 1269491 1282393 1295826 1309149 1321957
50015 1321957 1334075 1344783 1352882 1357850 1360554 1362592 1365183 1368747 1372985 1376856 1378651 1376512 1369039
50002 1369039 1355562 1336217 1312069 1284889 1256484 1228224 1201192 1176299 1153825 1133130 1113362
49991 1113362 1094429 1076887 1060965 1046144 1031719 1017214 1002132 985820 967998 949245 930633
49980 930633 912876 895894 879096 862075 845232 829747 816688 806067 796991 788653 780854 773551
49968 773551 766481 759545 753132 747656 742989 738642 734283 729883 725670 722287 720683 721393 724155 728550
49954G28550O151Q151R676J0306J0631J1272J1734J1045R117O856N096M034L528
49941H36147L218K511J047p47k025k614l283m808p123r533j1561j3291j4902j6045
49927G56991j5922j4267j1971j0285r378q309o527m679l476k518j054O28J505
49914F70738J347J000J194J851K659L534M368N055O032P982J0652J2675J3161
49901G42248J2909J3282J4294J4624J3453J1496R937Q955P713N598K917L23k061
$$ plain form
49954 728550 734701 742852 752528 762834 773465 784737 796471 807516 816633 823489 828585 832619 836147
49941 836147 839365 841876 842923 842176 840151 837537 834254 829446 822323 812790 801229 787938 773036 756991
49927 756991 741069 726802 714831 704546 695168 686859 680332 675653 672177 669659 668605 669233 670738
49914 670738 672085 673085 674279 676130 678789 682323 686691 691746 697778 705760 716412 729087 742248
49901 742248 755157 768439 782733 797357 810810 822306 832243 841198 848911 854509 857426 857749 855688
$$ [...]
##END NTUPLES=NMR SPECTRUM
##END=
