##TITLE=AC1630_CENAH_8450699_BVz0JcE8hV
##JCAMPDX= 6.0         $$ Bruker NMR JCAMP-DX V2.0
##DATA TYPE= NMR SPECTRUM
##DATA CLASS= NTUPLES
##ORIGIN= BRUKER
##OWNER= Administrator
$$ 1.72 TOPSPIN		Version 2.1
$$ 2014-02-18 16:37:42.722 -0800  Administrator@X
$$ Compression mode = diff/dup
##.OBSERVE FREQUENCY= 400.02188249412
##.OBSERVE NUCLEUS= ^1H
##.ACQUISITION MODE= SIMULTANEOUS (DQD)
##.ACQUISITION SCHEME= undefined
##.AVERAGES= 64
##.DIGITISER RES= 22
##SPECTROMETER/DATA SYSTEM= spect
##.PULSE SEQUENCE= noesygpps1d.comp
##.SOLVENT NAME= COFFEE_meoh
##.SHIFT REFERENCE= INTERNAL, COFFEE_meoh, 1, 14.96107
##AUDIT TRAIL= $$ (NUMBER, WHEN, WHO, WHERE, PROCESS, VERSION, WHAT)
$$ ##TITLE= Audit trail, TOPSPIN		Version 2.1
$$ ##JCAMPDX= 5.01
$$ ##ORIGIN= Bruker BioSpin GmbH
$$ ##OWNER= Administrator
$$ $$ E:\/data/COFFEE/nmr/AC1630_CENAH_8450699_BVz0JcE8hV/12/pdata/1/auditp.txt
$$ ##AUDIT TRAIL=  $$ (NUMBER, WHEN, WHO, WHERE, PROCESS, VERSION, WHAT)
(   1,<2014-02-18 16:37:38.018 -0800>,<Administrator>,<X>,<go>,<TOPSPIN 2.1>,
      <created by zg
	started at 2014-02-18 16:26:08.189 -0800,
	POWCHK enabled, PULCHK disabled,
       configuration hash MD5:
       C8 4E 4E 5D D3 5C D8 9E 9F 52 82 E0 59 8A DE 15
       data hash MD5: 64K
       1B 0A 56 A6 7B AC 45 66 1B 93 D8 B4 CF 01 67 08>)
(   2,<2014-02-18 16:37:40.925 -0800>,<Administrator>,<X>,<proc1d>,<TOPSPIN 2.1>,
      <Start of raw data processing
       efp LB = 0.3 FT_mod = 6 PKNL = 1 PHC0 = 0 PHC1 = 0 SI = 128K 
       data hash MD5: 128K
       1D 85 8F 49 D9 15 E1 C8 1E 26 EA 7A 21 14 DD 3E>)
(   3,<2014-02-18 16:37:41.831 -0800>,<Administrator>,<X>,<proc1d>,<TOPSPIN 2.1>,
      <pk PHC0 = -82.11731 PHC1 = 0 
       data hash MD5: 128K
       C4 50 16 AF BC 21 49 B0 F3 5F 8F 49 A6 14 0B 6E>)
(   4,<2014-02-18 16:37:42.190 -0800>,<Administrator>,<X>,<proc1d>,<TOPSPIN 2.1>,
      <abs ABSG = 1 
       data hash MD5: 128K
       5E 78 E7 90 EF 27 5A 5E 8C B0 27 31 F9 8F 7B 66>)
(   5,<2014-02-18 16:37:42.300 -0800>,<Administrator>,<X>,<proc1d>,<TOPSPIN 2.1>,
      <abs ABSG = 2 
       data hash MD5: 128K
       83 C4 A0 41 AD 3C 5B E4 DD A0 0D C9 17 9F 2A 01>)
(   6,<2014-02-18 16:37:42.378 -0800>,<Administrator>,<X>,<proc1d>,<TOPSPIN 2.1>,
      <abs ABSG = 3 
       data hash MD5: 128K
       33 C4 5B C1 45 8C 2F F4 9E 48 B9 41 34 99 88 F1>)
(   7,<2014-02-18 16:37:42.456 -0800>,<Administrator>,<X>,<proc1d>,<TOPSPIN 2.1>,
      <abs ABSG = 4 
       data hash MD5: 128K
       DE 25 F5 7D 7B FC DA 01 44 6B 14 61 A0 20 10 C6>)
(   8,<2014-02-18 16:37:42.550 -0800>,<Administrator>,<X>,<proc1d>,<TOPSPIN 2.1>,
      <abs ABSG = 5 
       data hash MD5: 128K
       98 CB 1A 0F B4 D9 FC 6F 19 2A 0F 8C 78 81 C2 DF>)
$$ ##END=
$$ 
$$ $$ hash MD5
$$ $$ 43 98 F0 BB B6 01 39 0A F5 FD 94 45 7B 34 82 A5
##$RELAX= 
##$RELAX= 
##$RELAX= 
##$RELAX= 
##$RELAX= 
##$RELAX= 
##$RELAX= 
##$RELAX= 
$$ Bruker specific parameters
$$ --------------------------
##$DU= <E:\>
##$EXPNO= 12
$$ [...]
##$TP07= 0
##$TPNAME0= <>
##$TPNAME1= <>
##$TPNAME2= <>
##$TPNAME3= <>
##$TPNAME4= <>
##$TPNAME5= <>
##$TPNAME6= <>
##$TPNAME7= <>
##$TPOAL= (0..7)
0.5 0.5 0.5 0.5 0.5 0.5 0.5 0.5
##$TPOFFS= (0..7)
0 0 0 0 0 0 0 0
##$TUNHIN= 0
##$TUNHOUT= 0
##$TUNXOUT= 0
##$USERA1= <user>
##$USERA2= <user>
##$USERA3= <user>
##$USERA4= <user>
##$USERA5= <user>
##$V9= 5
##$VALIST= <valist>
##$VCLIST= <CCCCCCCCCCCCCCC>
##$VD= 0
##$VDLIST= <DDDDDDDDDDDDDDD>
##$VPLIST= <PPPPPPPPPPPPPPP>
##$VTLIST= <TTTTTTTTTTTTTTT>
##$WBST= 2048
##$WBSW= 25
##$XGAIN= (0..3)
0 0 0 0
##$XL= 0
##$YL= 0
##$YMAX_a= 5954247
##$YMIN_a= -12151399
##$ZGOPTNS= <>
##$ZL1= 120
##$ZL2= 120
##$ZL3= 120
##$ZL4= 120
##$ABSF1= 14.96107
##$ABSF2= -5.597112
##$ABSG= 5
##$ABSL= 3
##$ALPHA= 0
##$AQORDER= 0
##$ASSFAC= 0
##$ASSFACI= 0
##$ASSFACX= 0
##$ASSWID= 0
##$AUNMP= <proc_prof1d_extract.lims>
##$AXLEFT= 0
##$AXNAME= <>
##$AXNUC= <1H>
##$AXRIGHT= 0
##$AXTYPE= 0
##$AXUNIT= <>
##$AZFE= 0.1
##$AZFW= 0.1
##$BCFW= 0
##$BC_mod= 0
##$BYTORDP= 0
##$COROFFS= 0
##$CY= 15
##$DATMOD= 1
##$DC= 0
##$DFILT= <>
##$DTYPP= 0
##$F1P= 0
##$F2P= 0
##$FCOR= 0.5
##$FTSIZE= 131072
##$FT_mod= 6
##$GAMMA= 0
##$GB= 0
##$INTBC= 1
##$INTSCL= 1
##$ISEN= 128
##$LB= 0.3
##$LEV0= 0
##$LPBIN= 0
##$MAXI= 10000
##$MC2= 0
##$MEAN= 0
##$ME_mod= 0
##$MI= 0
##$NCOEF= 0
##$NC_proc= -2
##$NLEV= 6
##$NOISF1= 0
##$NOISF2= 0
##$NSP= 0
##$NTH_PI= 0
##$NZP= 0
##$OFFSET= 14.96107
##$PC= 1
##$PHC0= -82.11731
##$PHC1= 0
##$PH_mod= 1
##$PKNL= yes
##$PPARMOD= 0
##$PPDIAG= 0
##$PPIPTYP= 0
##$PPMPNUM= 2147483647
##$PPRESOL= 1
##$PSCAL= 4
##$PSIGN= 0
##$PYNMP= <proc.py>
##$REVERSE= no
##$SF= 400.020009608794
##$SI= 131072
##$SIGF1= 0
##$SIGF2= 0
##$SINO= 400
##$SIOLD= 131072
##$SPECTYP= <>
##$SREGLST= <1H.CDCl3>
##$SSB= 0
##$STSI= 131072
##$STSR= 0
##$SW_p= 8223.68421052631
##$SYMM= 0
##$S_DEV= 0
##$TDeff= 65536
##$TDoff= 0
##$TI= <>
##$TILT= no
##$TM1= 0
##$TM2= 0
##$TOPLEV= 0
##$USERP1= <user>
##$USERP2= <user>
##$USERP3= <user>
##$USERP4= <user>
##$USERP5= <user>
##$WDW= 1
##$XDIM= 131072
##$YMAX_p= 418497635
##$YMIN_p= -11629
##$CURPLOT= <Network HP LaserJet P1505>
##$CURPRIN= <$Network HP LaserJet P1505>
##$DFORMAT= <normdp>
##$LAYOUT= <+/1D_H.xwp>
##$LFORMAT= <normlp>
##$PFORMAT= <normpl>
##$SURQMSG= 1
$$ End of Bruker specific parameters
$$ ---------------------------------
##NTUPLES= NMR SPECTRUM
##VAR_NAME=  FREQUENCY,     SPECTRUM/REAL,   SPECTRUM/IMAG
##SYMBOL=    X,             R,               I
##VAR_TYPE=  INDEPENDENT,   DEPENDENT,       DEPENDENT
##VAR_FORM=  AFFN,          ASDF,            ASDF
##VAR_DIM=   131072,        131072,          131072
##UNITS=     HZ,            ARBITRARY UNITS, ARBITRARY UNITS
##FACTOR=    0.0627417313425164, 1,          1
##FIRST=     8223.62146879497, 993,          -59369
##LAST=      0,             2547,            -59745
##MIN=       0,             -11629,          0
##MAX=       8223.62146879497, 418497635,    0
$$ Real data points
##PAGE= N=1
##DATA TABLE= (X++(R..R)), XYDATA
$$ [...]
63917D480358k31634k41236k45962k46441k43382k37627k29646k19510k07294
63908B377626j93171j77443j60691j43746j27400j12247r8691q6594p5273o4419
63898A137951n4870m7691m2609l8265l3961l0220k7584k5944k5131k5055k5019
63887G61602k4016k2088k0330j9165j7739j5578j3539j2318j1132q928o061l651
63875E87057j904o5K330N078P851J0318J2121J3372J4826J6879J8851J9942K0366
63862G27022K0884K1552K1773K1286K0355J9181J7818J6420J4984J3104J0464
63851I24843P300L878L9m194q065j0879j2948j5013j7160j9028k0629k2201k3660
63838G82283k5006k6746k9024l0791l0949k9906k8826k7779k5963k3553k1786
$$ plain form
63917 4480358 4248724 4007488 3761526 3515085 3271703 3034076 2804430 2584920 2377626
63908 2377626 2184455 2007012 1846321 1702575 1575175 1462928 1364237 1277643 1202370 1137951
63898 1137951 1083081 1035390 992781 954516 920555 890335 862751 836807 811676 786621 761602
63887 761602 737586 715498 695168 676003 658264 642686 629147 616829 605697 596769 590708 587057
63875 587057 585153 585088 587418 592496 600347 610665 622786 636158 650984 667863 686714 706656 727022
63862 727022 747906 769458 791231 812517 832872 852053 869871 886291 901275 914379 924843
63851 924843 932143 936021 936060 931866 923801 912922 899974 884961 867801 848773 828144 805943 782283
63838 782283 757277 730531 701507 670716 639767 609861 581035 553256 527293 503740 481954
63827D81954k1010k0159j8486j6525j4881j3317j1749j0870j0917j0826r611p851
63815C15752o743o328n704m644l825l570l375k856k374k372k649k702k407k089
63801B64114k057k307k691l117l502l616l179k267j417j109j234j333j230j114
63787B33941j147j371j932k781l213k394o28N74J75j121j815j368m37K65N87N43
63771B17878J08m33n25o9L61K27k97o48n70k44O9K21J31j46l58k84k5R6l3j65
63751B15294rM05P57P62M52J80L12Q07J210J176R45J036J463J684J454J318J876
63734B31122K889L557L581L331L002K319J326P81J252K180K524K176K094K934
63720B65068M093M478L843K971K532K267J481J45r58j259j175j512k349k995k976
$$ plain form
63827 481954 460944 440785 422299 405774 390893 377576 365827 354957 344040 333214 323603 315752
63815 315752 309009 302681 296977 292333 288508 284938 281563 278707 276333 273961 271312 268610 266203 264114
63801 264114 262057 259750 257059 253942 250440 246824 243645 241378 239961 238852 237618 236285 235055 233941
63787 233941 232794 231423 229491 226710 223497 221103 220475 221049 221224 220103 218288 216920 216483 216748 217335 217878
63771 217878 217986 217553 217028 216959 217320 217547 217250 216602 216032 215788 215857 216078 216209 216063 215705 215421 215396 215492 215459 215294
63751 215294 215285 215690 216447 217209 217661 217841 218153 218960 220170 221346 222291 223327 224790 226474 227928 229246 231122
63734 231122 234011 237568 241149 244480 247482 249801 251127 251908 253160 255340 257864 260040 262134 265068
63720 265068 269161 273639 277482 280453 282985 285252 286733 286878 285920 284661 283486 281974 279625 276630 273654
63705B73654k533k068j621j116o92m02K4P31J396J694J849K247K788L074L075
63690B82100L033K888K359J576J008P36M19M1L4M77P83N84L22M74P11M47j56l92
63672B97444r6K35L29M78P71P56J75m12l45J76L57j21q69j561k287l004l263k891
63654B85872k477k652l203l400l031k505k091j670j282j250j545j593j043k11
63640B57919M84J089J680J914J595J282J683K677L571M131M673N203N298M942
63626B98141M741M966N127M918M901N677O852P622Q084R092J0860J2585J3673
63613C97239J4594J6026J7724J8944J9618K0377K1486K2498K3025K3110K2583
63602F17224K0736J7209J2725Q381M598J256j547l586n079o262o667n829m672
$$ plain form
63705 273654 271121 269053 267432 266316 265624 265222 265246 265977 267373 269067 270916 273163 275951 279025 282100
63690 282100 285133 288021 290380 291956 292964 293700 294119 294160 294194 294671 295454 296038 296360 296834 297545 297992 297836 297444
63672 297444 297348 297583 297912 298390 299161 299917 300092 299680 299335 299511 299868 299747 298878 297317 295030 292026 288763 285872
63654 285872 283395 280743 277540 274140 271109 268604 266513 264843 263561 262311 260766 259173 258130 257919
63640 257919 258403 259492 261172 263086 264681 265963 267646 270323 273894 278025 282698 287901 293199 298141
63626 298141 302882 307848 312975 317893 322794 328471 335323 342945 351029 360121 370981 383566 397239
63613 397239 411833 427859 445583 464527 484145 504522 526008 548506 571531 594641 617224
63602 617224 637960 655169 667894 676275 680873 682129 680582 676996 671917 665655 658988 653159 648487
63589F48487n006p271r935j1677j3081j5348j8185k0163k0598j9917j8552j6570
63577D72184j4380j2592j1107r216o874m909l782k930j703j98J225K570L845M682
63563D16815M850M726M788M985N093N313O044P265Q647J0111J1789J3587J5245
63550E19258J6838J8784K1257K3903K6241K8145K9643L0316K9075K4953J8197
63539G86610J0459L554j820n982r134j0856j0793r302p208n281m174m424o125
63526G25524q798j1856j5087j8464k1662k4075k5235k5083k4018k2684k1582k0665
63514D86315j9535j8068j6558j5175j3685j1942j0287r099q243p308o247n338
63502C44830m726m288l911l604l325k947k371j569o28J26K53l45j224j842k015
$$ plain form
63589 648487 643481 636210 626275 614598 601517 586169 567984 547821 527223 507306 488754 472184
63577 472184 457804 445212 434105 424889 418015 413106 409324 406394 404691 404493 405718 408288 412133 416815
63563 416815 421665 426391 431179 436164 441257 446570 452614 459879 468526 478637 490426 504013 519258
63550 519258 536096 554880 576137 600040 626281 654426 684069 714385 743460 768413 786610
63539 786610 797069 800623 798803 792821 783687 772831 762038 752736 745528 740247 736073 731649 725524
63526 725524 716726 704870 689783 671319 649657 625582 600347 575264 551246 528562 506980 486315
63514 486315 466780 448712 432154 416979 403294 391352 381065 371966 363723 356415 350168 344830
63502 344830 340104 335816 331905 328301 324976 322029 319658 318089 317461 317587 317840 317495 316271 314429 312414
63487C12414j844j386o72J81J063J935K622K852K655K454K448K272J659R97P97
63472C30447Q49N05m07j512k557l489l990l648k685j901j707j774j730j630j542
63457C03229j253p71n28p11p75j45R47J817K267K678L294L919M369M796N405O167
63441C34705O982P979R471J1570J3923J5975J7562J9136K1211K3554K5107K4769
63429E31944K2237J8103J3435R237O080M050L126L499N301Q105J1145J4090J7199
63416F67551K0508K3348K4958K5237K4474K2719J9850J6040J1636O737J437l516
63404H60979o887q017p457o414n785n853o609q140j0691j4352j8663k2643k5430
63391G14038k6864k7332k7155k6354k4924k3043k0991j9058j7411j5889j4032
$$ plain form
63487 312414 310570 309184 308512 308693 309756 311691 314313 317165 319820 322274 324722 326994 328653 329650 330447
63472 330447 331296 331801 331394 329882 327325 323836 319846 316198 313513 311612 309905 308131 306401 304771 303229
63457 303229 301976 301205 300677 299966 299191 299046 299993 301810 304077 306755 310049 313968 318337 323133 328538 334705
63441 334705 341687 349666 359137 370707 384630 400605 418167 437303 458514 482068 507175 531944
63429 531944 554181 572284 585719 594956 601036 605086 608212 611711 617012 625117 636262 650352 667551
63416 667551 688059 711407 736365 761602 786076 808795 828645 844685 856321 863058 864495 860979
63404 860979 854092 846075 838618 832204 826419 820566 813957 805817 795126 780774 762111 739468 714038
63391 714038 687174 659842 632687 606333 581409 558366 537375 518317 500906 485017 470985
63380D70985j1686r321p431n738l656j380K11Q99J589L042M814O048O816P874
63366D63066R424J0926J2089J3283J4763J6131J7034J7932J9674K2362K5039K6614
63354F68337K6911K6629K6292K5490K3305J9384J4349R148M349J85l130n478p062
63341H28709q143q693q606q209q251r287j1340j4099j7148j9998k2208k3578k4127
63328F45022k3866k2807k1117j9082j6846j4459j2109r986p962n712l332j587
63316D86157j393l162o528j0423j3442j4627j4115j2812j1356r751q086o951o622
63303C66889o332n050k959j401j191j567j275k41M54J41o55j138j351j808k484
63288C40032k846k818k847k970k570j511p78j244k321k632j763n19L88R98J387
$$ plain form
63380 470985 459299 449978 442547 436809 433153 431773 431984 432883 434472 437514 442328 448376 455192 463066
63366 463066 472490 483416 495505 508788 523551 539682 556716 574648 594322 616684 641723 668337
63354 668337 695248 721877 748169 773659 796964 816348 830697 839845 844194 844379 841249 835771 828709
63341 828709 820566 811873 803267 795058 786807 777520 766180 752081 734933 714935 692727 669149 645022
63328 645022 621156 598349 577232 558150 541304 526845 514736 504750 496788 491076 487744 486157
63316 486157 484764 481602 475074 464651 451209 436582 422467 409655 398299 388548 380462 373511 366889
63303 366889 360557 355507 352548 351147 349956 348389 347114 346873 347327 347468 346813 345675 344324 342516 340032
63288 340032 337186 334368 331521 328551 325981 324470 323692 322448 320127 317495 315732 315213 315601 316599 317986
63273C17986J261O34J55K98P20Q58P60Q47J229J706K154K522K656K481K237K218
63257C40722K430K663K710K475K195K554M084O248P727P937P724Q181R325J0476
63243D17451J1342J2121J2880J3602J4549J6006J7870J9994K2613K5806K8884
63232F13118L1048L2403L3559L4558L5042L5228L5699L6222L5884L4608L3481
63221I90850L3252L3442L3384L3271L3511L3831L3773L3533L3453L2886L0489
63210A355675K5632J8951J1389L194n849j5489k4683l2307l8105m2701m6605m9459
63198A159643n0563m9866m7968m5282m1717l7242l2248k7214k2405j7937j3782
63187G73419r700n624j986Q72L480O615R965J2366J3565J4619J6154J7323J7336
$$ plain form
63273 317986 319247 319881 320036 320334 321054 321912 322672 323519 324748 326454 328608 331130 333786 336267 338504 340722
63257 340722 343152 345815 348525 351000 353195 355749 359833 366081 373808 381745 389469 397650 406975 417451
63243 417451 428793 440914 453794 467396 481945 497951 515821 535815 558428 584234 613118
63232 613118 644166 676569 710128 744686 779728 814956 850655 886877 922761 957369 990850
63221 990850 1024102 1057544 1090928 1124199 1157710 1191541 1225314 1258847 1292300 1325186 1355675
63210 1355675 1381307 1400258 1411647 1414841 1408992 1393503 1368820 1336513 1298408 1255707 1209102 1159643
63198 1159643 1109080 1059214 1011246 965964 924247 887005 854757 827543 805138 787201 773419
63187 773419 763719 758095 756109 756981 760461 767076 777041 789407 802972 817591 833745 851068 868404
63174H68404J6956J7400J8445J8853J8214J7248J6386J5227J3420J1102Q378N202
63162A045235J817j483n083r709j5186k0392k4643k8279l1530l3737l4230l3329
63150H09451l1813k9912k7459k4668k2089j9984j8194j6472j4577j2285r743p587
63138E74668o283n522m705l760l059k647k129j298l91L18Q09J138J356J616K059
63123E52170K534K852L258M206N544O413O188N148M029L299L074L341L814L938
63109F09808L452K777K462K467K378K056J625J003O0q70j262j200j253j536j570
63094F20397j245j144j508j645r46R7O27P23J118J880K311K098J762J778J967
63079F28270K107K477L430M844O336P709Q877R700J0196J0635J1165J1689J2306
$$ plain form
63174 868404 885360 902760 921205 940058 958272 975520 991906 1007133 1020553 1031655 1040033 1045235
63162 1045235 1047052 1045569 1040486 1030777 1015591 995199 970556 942277 910747 877010 842780 809451
63150 809451 777638 747726 720267 695599 673510 653526 635332 618860 604283 591998 582255 574668
63138 574668 568385 562863 558158 554398 551339 548692 546563 545265 544874 545192 546001 547139 548495 550111 552170
63123 552170 554704 557556 560814 565020 570564 576977 583165 588313 592342 595641 598715 602056 605870 609808
63109 609808 613260 616037 618499 620966 623344 625400 627025 628028 628088 627218 625956 624756 623503 621967 620397
63094 620397 619152 618008 616500 614855 613909 614006 614633 615356 616474 618354 620665 622763 624525 626303 628270
63079 628270 630377 632854 636284 641128 647464 655173 664050 673750 683946 694581 705746 717435 729741
63066G29741J3529J5629J8012J9776K0811K1918K3851K6659L0085L4115L8791
63055I92917M3634M7765N0803N3453N6908O1634O6961P1897P6017P9410Q2077
63044A683476Q3839Q4728Q5025Q4913Q4419Q3714Q3120Q2748Q2491Q2308Q2191
63033B602972Q1848Q0800P8793P5644P0604O2538N0978L6504J9919J595j7972
63022C144223l7677n6375p3517q8692j01063j09891j15288j17728j17216j13653
63012B213123j07766j00737r2891q3695p3173o2451n2552m3338l4121k4824j6033
63001A521542q279j654M136R568J4922J9805K3412K5512K6826K8094K9199K9706
62989A722789K9927L0615L1708L2086L0832K8230K5114K1635J7117J0960L298
$$ plain form
63066 729741 743270 758899 776911 796687 817498 839416 863267 889926 920011 954126 992917
63055 992917 1036551 1084316 1135119 1188572 1245480 1307114 1374075 1445972 1521989 1601399 1683476
63044 1683476 1767315 1852043 1937068 2021981 2106400 2190114 2273234 2355982 2438473 2520781 2602972
63033 2602972 2684820 2765620 2844413 2920057 2990661 3053199 3104177 3140681 3160600 3162195 3144223
63022 3144223 3106546 3050171 2976654 2887962 2786899 2677008 2561720 2443992 2326776 2213123
63012 2213123 2105357 2004620 1911729 1828034 1754861 1692410 1639858 1596520 1562399 1537575 1521542
63001 1521542 1513263 1511609 1515745 1525313 1540235 1560040 1583452 1608964 1635790 1663884 1693083 1722789
62989 1722789 1752716 1783331 1815039 1847125 1877957 1906187 1931301 1952936 1970053 1981013 1984311
62978A984311n274j4266k3419l2467m0971m8453n4570n9135o2048o3281o3025
62967A517402o1644n9460n6553n2982m9123m5586m2698m0215l7660l4827l1847
62956A004807k9024k6764k5457k5029k4735k3831k2443k1375k0960k0640j9815
62945G44734j8562j7219j5773j4199j2933j2364j2074j1265r857q533p636o777
62933E97542n644m598m099l946l509k479j186l03l50j237k246k646k384j928j606
62918E59381j468j651k239k839k938k790l203m308n292n635n745n964n802m836
62904E04671l680l216l429l724l898m010l757k938k187k182k400j742k83P36P82
62889D68743O97J170J689J586J179J106J193Q65K35m3J78L67K04J9K28O70P54
$$ plain form
62978 1984311 1979037 1964771 1941352 1908885 1867914 1819461 1764891 1705756 1643708 1580427 1517402
62967 1517402 1455758 1396298 1339745 1286763 1237640 1192054 1149356 1109141 1071481 1036654 1004807
62956 1004807 975783 949019 923562 898533 873798 849967 827524 806149 785189 764549 744734
62945 744734 726172 708953 693180 678981 666048 653684 641610 630345 620488 611955 604319 597542
62933 597542 591898 587300 583201 579255 575746 573267 572081 571778 571428 570191 567945 565299 562915 560987 559381
62918 559381 557913 556262 554023 551184 548246 545456 542253 537945 532653 527018 521273 515309 509507 504671
62904 504671 500991 497775 494346 490622 486724 482714 478957 476019 473832 471650 469250 467508 467225 467961 468743
62889 468743 469440 470610 472299 473885 475064 476170 477363 478228 478463 478420 478598 478965 479169 479188 479416 480086 480840
62872D80840O1j181k194k308j617r30q61j155j129n97q8o5l05k79N8J60l45j080
62854D66985j306p85O1P94J396J912K081J599O22l20p98p37l62j23m51j313k154
62837D67101k555k656k662k283j257j37J92k20l75K50R53Q58J54k17K82J411K677
62820D61516L636L879L306K567K738M200O084P132P022O603O775P500Q012P820
62806E38790P193O840P358Q873J0854J2355J2812J2675J2837J3545J4341J5099
62794F73572J6272J7954J9553K0951K3129K6897L1606L6120M0520M5786N2105
62783A004465N8751O5589P3451Q2622R1986J00230J07235J13784J20465J27142
62773A945720J32941J36434J36325J32419J25460J15801J02787Q5847O5621M3544
$$ plain form
62872 480840 480901 479720 477526 475218 473601 472671 471810 470655 469526 468929 468841 468776 468471 468192 468250 468410 468065 466985
62854 466985 465679 464894 464955 465749 467145 469057 471138 472737 473359 473039 472241 471504 471142 471019 470568 469255 467101
62837 467101 464546 461890 459228 456945 455688 455551 455743 455523 455148 455398 456351 457209 457363 457146 457428 458839 461516
62820 461516 465152 469031 472337 474904 477642 481842 487926 495058 502080 508683 515458 522958 530970 538790
62806 538790 545983 552823 560181 569054 579908 592263 605075 617750 630587 644132 658473 673572
62794 673572 689844 707798 727351 748302 771431 798328 829934 866054 906574 952360 1004465
62783 1004465 1063216 1128805 1202256 1284878 1376864 1477094 1584329 1698113 1818578 1945720
62773 1945720 2078661 2215095 2351420 2483839 2609299 2725100 2827887 2913734 2979355 3022899
62763C022899K0711k338k5133m7139o7871q6683j02544j14497j22355j26769j28600
62752B219681j28375j26210j22198j16838j10921j04778r7889q9781q1129p3372
62742A168190o7115o1620n5981n0158m4581l9477l4974l1288k8332k5579k2714
62731G06371k0029j7830j5873j3825j1802j0074q611p309o215n243m059k625j374
62718E81502m85M77J792L108M182N499P503R807J1863J3859J6213J8703K0984
62705F95007K3489K6897L1016L5157L9250M3559M7609N0690N3372N7123O2143
62694A165312O6790O9669P1249P2661P3732P3026O9405O2782N3666M2665L0382
62683A851339J7383M062r331k2585l5464m7496n7860o5758p1004p3969p5075p4642
$$ plain form
62763 3022899 3043610 3041272 3016139 2969000 2901129 2814446 2711902 2597405 2475050 2348281 2219681
62752 2219681 2091306 1965096 1842898 1726060 1615139 1510361 1412472 1322691 1241562 1168190
62742 1168190 1101075 1039455 983474 933316 888735 849258 814284 782996 754664 729085 706371
62731 706371 686342 668512 652639 638814 627012 616938 608327 601018 594803 589560 585501 582876 581502
62718 581502 581017 581494 583286 586394 590576 596075 603578 613385 625248 639107 655320 674023 695007
62705 695007 718496 745393 776409 811566 850816 894375 941984 992674 1046046 1103169 1165312
62694 1165312 1232102 1301771 1373020 1445681 1519413 1592439 1661844 1724626 1778292 1820957 1851339
62683 1851339 1868722 1872784 1863453 1840868 1805404 1757908 1700048 1634290 1563286 1489317 1414242 1339600
62671A339600p3173p1175o8614o5025o0373n5310n0486m6031m1891l8213l5032
62660G34277l2075k9092k6140k3297k0483j7771j5480j3711j2240j1087j0670
62649E22231j1004j1189j0334q625p025o096n637n243m706l911k828j670p25m0
62635D43198M46O28M17J4l56q90j826k744k889k256j721j816j975j430l50N28
62619D26978J034J671K577L211L229L198L920N375O828P776Q340Q754R013R242
62605E01146R989J1720J4195J6712J8961K1316K4327K8102L2368L6865M1510M6275
62593H03486N1055N5600N9584O2740O5007O6347O6419O4602O0555N4613M7444
62582A457452L9242K9492J7712M357r223k1738l2682m2091m9805n5379n8701o0385
$$ plain form
62671 1339600 1266427 1195252 1126638 1061613 1001240 945930 895444 849413 807522 769309 734277
62660 734277 702202 673110 646970 623673 603190 585419 569939 556228 543988 532901 522231
62649 522231 511227 500038 489704 481079 474054 467958 462321 457078 452372 448461 445633 443963 443238 443198
62635 443198 443644 444272 444689 444703 444347 443457 441631 438887 435998 433742 432021 430205 428230 426800 426450 426978
62619 426978 428012 429683 432260 435471 438700 441898 445818 451193 458021 465797 474137 482891 491904 501146
62605 501146 511135 522855 537050 553762 572723 594039 618366 646468 678836 715701 757211 803486
62593 803486 854541 910141 969725 1032465 1097472 1163819 1230238 1294840 1355395 1410008 1457452
62582 1457452 1496694 1526186 1543898 1548255 1539032 1517294 1484612 1442521 1392716 1337337 1278636 1218251
62570A218251o1198o1242n9948n6993n2933m8813m5212m1904l8400l4641l0966
62559F86001k7593k4364k1100j8007j5507j3813j2745j1995j1339j0629r760q696
62547E00453p451o013m430k976k011j632j578j529j377j178j014r52j053j341
62533D65918j776k172k069r55J037K854L452L114L256M803P236R537J1491J3549
62519E19275J5815J7893J9672K1659K4381K7827L1520L4917L7678L9814M1576
62508H32027M3046M3887M3659M2280L9926L6590L2093K6541K0468J4372Q341K219
62496A185449l912r502j3767j6158j6696j5745j3580j0319o234j734L082Q400
62484A089284J3999J9061K3038K6347K9654L2786L4756L4679L2070K6626J8569
$$ plain form
62570 1218251 1157053 1095811 1035863 978870 925937 877124 831912 790008 751608 716967 686001
62559 686001 658408 634044 612944 594937 579430 565617 552872 540877 529538 518909 509149 500453
62547 500453 493002 486989 482559 479583 477572 475940 474362 472833 471456 470278 469264 468312 467259 465918
62533 465918 464142 461970 459901 458946 459983 462837 466289 469403 472659 477462 484698 494235 505726 519275
62519 519275 535090 552983 572655 594314 618695 646522 678042 712959 750637 790451 832027
62508 832027 875073 918960 962619 1004899 1044825 1081415 1113508 1140049 1160517 1174889 1183230 1185449
62496 1185449 1181537 1172035 1158268 1142110 1125414 1109669 1096089 1085770 1079536 1077802 1080884 1089284
62484 1089284 1103283 1122344 1145382 1171729 1201383 1234169 1268925 1303604 1335674 1362300 1380869
62473A380869R200L14p274j4183k1397k9226l7336m5073n1421n5328n6597n6174
62461A016374n5158n3758n1502m8212m4267m0092l5690l0882k5801k1066j7315
62450E92631j4574j2245r865p607n695l695j082J716L631M448N114O289P409P696
62436E74171P385P213P235O888N870M179J582k010n758q400r680j0539j1721j2890
62422E53525j3404j3191j2492j1352r958q992q906r111q569p090n492m549m350
62409D36069m725n542o318o187m831l098k116j983j839j133k24L18N20Q06J345
62394D01062J933K299K377K320K370K572K636K232J539J202J650K660L699M504
62380D35055N140N740O355O885P052O724O316O500P294P943P972P901Q417R283
$$ plain form
62473 1380869 1390069 1390383 1383109 1368926 1347529 1318303 1280967 1235894 1184473 1129145 1072548 1016374
62461 1016374 961216 907458 855956 807744 763477 723385 687695 656813 631012 609946 592631
62450 592631 578057 565812 555947 548340 542645 538950 537868 539584 543215 547663 552777 559066 566475 574171
62436 574171 581556 588769 596004 602892 608762 612941 614523 612513 606755 598355 588675 578136 566415 553525
62422 553525 540121 526930 514438 503086 493128 484136 475230 466119 457550 450460 444968 440419 436069
62409 436069 431344 425802 419484 413297 408466 405368 403252 401269 399430 398297 398073 398391 398911 399717 401062
62394 401062 402995 405294 407671 409991 412361 414933 417569 419801 421340 422542 424192 426852 430551 435055
62380 435055 440195 445935 452290 459175 466227 472951 479267 485767 493061 501004 508976 516877 525294 534577
62366E34577R788J0021J0884J2836J5355J7777K0148K2886K6099K9508L2791L5783
62354G78453L8463M0824M2637M3430M2845M0928L7800L3284K7352K0714J4463
62343A161193R024M030q28n399r592j3626j7476k0608k2668k3980k5042k5822
62331A009206k5944k5222k3789k1906j9928j8197j6774j5482j4391j3932j4348
62320G99293j5359j6573j7938j9494k1002k2088k2477k1922k0251j7835j5622
62309E88732j4318j3703j3071j2064j0724r049p062n146l817l141k708k186j559
62296D90184q84j99L05M38M15Q28J959L346M133L857K787J617Q81O75Q08J094
62280E12244J420J665J706J570J418J352J361J416J557J844K388L291M490N725
$$ plain form
62366 534577 544365 554386 565270 578106 593461 611238 631386 654272 680371 709879 742670 778453
62354 778453 816916 857740 900377 943807 986652 1027580 1065380 1098664 1126016 1146730 1161193
62343 1161193 1170217 1174247 1173419 1168020 1158428 1144802 1127326 1106718 1084050 1060070 1035028 1009206
62331 1009206 983262 958040 934251 912345 892417 874220 857446 841964 827573 813641 799293
62320 799293 783934 767361 749423 729929 708927 686839 664362 642440 622189 604354 588732
62309 588732 574414 560711 547640 535576 524852 515803 508741 503595 499778 496637 493929 491743 490184
62296 490184 489300 489101 489406 489844 490259 491087 493046 496392 500525 504382 507169 508786 509667 510342 511150 512244
62280 512244 513664 515329 517035 518605 520023 521375 522736 524152 525709 527553 529941 533232 537722 543447
62266E43447O871Q126R675J1370J3075J5134J8041K1718K5605K9404L3276L7324
62254G73066M1408M5370M8938N1440N2213N1329M9294M6067M1199L4918K8134
62243A263376K1245J3909O291n99o367j1968j8232k4652l0416l5611m0428m4066
62231A092482m5670m5658m4923m3357m0518l7148l4449l2168k9053k5111k1772
62220F92655j9748j8267j6792j5810j5390j4558j2889j1364j0666r918q208o234
62208E32811n182m847m251l388k916k552j401L38J441J568J735K567L324L222
62194E22469K691K646L304M357N667P026P825P739P430P806Q717R136Q592P650
62180F13055O967O540O155N913N913N839N383M887N035O023P454R019J0858J3213
$$ plain form
62266 543447 550318 558444 568119 579489 592564 607698 625739 647457 673062 702466 735742 773066
62254 773066 814474 859844 908782 960222 1012435 1063764 1113058 1159125 1200324 1235242 1263376
62243 1263376 1284621 1298530 1304821 1304222 1297855 1285887 1267655 1243003 1212587 1176976 1136548 1092482
62231 1092482 1046812 1001154 956231 912874 872356 835208 800759 768591 739538 714427 692655
62220 692655 672907 654640 637848 622038 606648 592090 579201 567837 557171 547253 539045 532811
62208 532811 527629 522782 518531 515143 512227 509675 508274 508612 510053 511621 513356 515923 519247 522469
62194 522469 525160 527806 531110 535467 541134 548160 555985 563724 571154 578960 587677 596813 605405 613055
62180 613055 620022 626562 632717 638630 644543 650382 655765 660652 665687 671710 679164 688183 699041 712254
62166G12254J6123J9516K3253K6847K9546L0990L1545L1678L1194K9463K6316
62155A008725K2237J7691J2653P079J499l254o862r783j2621j5482j8075k0250
62143I83557k2096k3494k3943k3051k1012j8396j5678j3198j1283r902q387o126
62131G86991l485j475n05r6O6k87j049j276m04Q40J550K130L588N753P391Q037
62115H07769Q565R579J0231R185O206K348r93k945l520l494l610l780l438k688
62101H29415k438l201m407n264n640n678n145l787j948j66J512L231M575M808
62087H05867L836K431J471J288J653K032J984J606J564K334L604M750N669O718
62073H46807Q062R570J1199J2862J4040J4198J3626J3209J3299J3512J3787J4756
$$ plain form
62166 712254 728377 747893 771146 797993 827539 858529 890074 921752 952946 982409 1008725
62155 1008725 1030962 1048653 1061306 1068385 1069884 1066630 1059768 1049985 1037364 1021882 1003807 983557
62143 983557 961461 937967 914024 890973 869961 851565 835887 822689 811406 801504 793117 786991
62131 786991 783506 782031 781526 781430 781496 781209 780160 778884 778480 779320 780870 783000 786588 792341 799732 807769
62115 807769 816334 825913 836144 845329 851535 853883 852890 849945 846425 842931 839321 835541 832103 829415
62101 829415 826977 823776 819369 814105 808465 802787 797642 793855 791907 791741 793253 796484 801059 805867
62087 805867 809703 812134 813605 814893 816546 818578 820562 822168 823732 826066 829670 834420 840089 846807
62073 846807 854869 864439 875638 888500 902540 916738 930364 943573 956872 970384 984171 998927
62061I98927J6585J8197J8376J7238J5799J4392J2316R050N075J197k316n648
62049A119188q920j2064j5033j7855k0626k3503k6529k9370l1517l2821l3569
62038H67381l3862l3321l1663k9194k6437k3600k0802j8455j6839j5495j3777
62027F03936j1857j0487r669q463o422m439l566l570l419k830k528l080m140m974
62013E24492n143m545l334j985j130j020j307j453j198o72j99l5k0L69J309K159
61997E06288K109J287O52O74P55K17p62j611k319l271m386n164n570o256p588
61982D75055q929r275q413p146o360o144n914n265m456l982l809l318k105o12
61968C99327K82K45j48j39L58Q28R50R79J204J357R84K43j49J10M58K87j98m30
$$ plain form
62061 998927 1015512 1033709 1052085 1069323 1085122 1099514 1111830 1120880 1125955 1127152 1124836 1119188
62049 1119188 1110268 1098204 1083171 1065316 1044690 1021187 994658 965288 933771 900950 867381
62038 867381 833519 800198 768535 739341 712904 689304 668502 650047 633208 617713 603936
62027 603936 592079 581592 571923 563460 557038 552599 549033 545463 542044 539214 536686 533606 529466 524492
62013 524492 519349 514804 511470 509485 508355 507335 506028 504575 503377 502705 502506 502471 502451 502820 504129 506288
61997 506288 508397 509684 510336 511010 511765 511982 511220 509609 507290 504019 499633 494469 488899 482643 475055
61982 475055 466126 456851 448438 441292 434932 428788 422874 417609 413153 409171 405362 402044 399939 399327
61968 399327 399609 399854 399706 399567 399925 400753 401703 402682 403886 405243 406227 406470 406321 406431 406889 407176 406978 406548
61950D06548m21o25r49o28P06K457L864M915O002P102P840Q193Q555R163R911
61935D72633J0680J1394J1705J1127R789Q563Q103Q028P481O296N048M090L074
61922E78011J633N7j143j957k794l802m662m972m478l069r35J277K993M456O359
61907E66974Q613J0131J0240R721R769J0331J0239Q828O663M599K825J081p37
61894F59277k554m261n633o380o515o396o167n527m321l043k417k613l194l691
61880E96565l993m314n009o311p930r080r216q700q331q274p868o585m826l382
61866E02746k511j867j208o66k71L00J257K331L183L957N018O382P831R461J1478
61851E47421J3508J4832J5497J6436J8029J9245J8919J7348J5764J4580J3135
$$ plain form
61950 406548 406127 405502 404553 403925 404631 407088 410952 415867 421869 428971 436811 445004 453559 462722 472633
61935 472633 483313 494707 506412 517539 527328 535891 543994 552022 559503 565799 570847 574937 578011
61922 578011 579644 579701 578558 576601 573807 570005 565343 560371 555893 552824 551889 553166 556159 560615 566974
61907 566974 575587 585718 595958 605679 615448 625779 636018 644846 651509 656108 658933 660014 659277
61894 659277 656723 652462 646829 640449 633934 627538 621371 615844 611523 608480 606063 603450 600256 596565
61880 596565 592572 588258 583249 576938 569008 559928 550712 542012 533681 525407 517539 510954 506128 502746
61866 502746 500235 498368 497160 496494 496223 496523 497780 500111 503294 507251 512269 518651 526482 535943 547421
61851 547421 560929 575761 591258 607694 625723 644968 663887 681235 696999 711579 724714
61840G24714J1022Q633O243L513L35k612m660n956o926p434o973n430l166o06
61826G10697J863L835N173O185P139P756P471O080L829J100j661m031o023q272
61812G41141j1277j4532j6843j7552j7101j6322j5585j4750j3683j2536j1640
61801E79320j1191j1003j0602r671q383p169o258n550m879m178l437k695k145
61788D92159k017k339k779k827k168r87P6N17N07O29R75R74L10l33m6R96J669
61771D85316J374P82Q61J617K263K404K475K969L653L869L482L205L772M977N868
61756E28887N842N248M663M059L020J619M35k97j063k321l770m719m938m842m934
61741E26889n399o028o303n696m257k792k080j965j692j067o69p57o90N0Q83Q75
$$ plain form
61840 724714 735736 744369 750612 754125 754460 751848 747188 741232 734306 726872 719899 714469 711303 710697
61826 710697 712560 716395 721568 727753 734892 742648 750119 756199 760028 761128 759467 755436 749413 741141
61812 741141 729864 715332 698489 680937 663836 647514 631929 617179 603496 590960 579320
61801 579320 568129 557126 546524 536853 528470 521301 515043 509493 504614 500436 496999 494304 492159
61788 492159 490142 487803 485024 482197 480029 479042 479118 479635 480142 480771 481746 482720 483030 482697 482651 483647 485316
61771 485316 486690 487472 488333 489950 492213 494617 497092 500061 503714 507583 511065 514270 518042 523019 528887
61756 528887 534729 539977 544640 548699 551719 553338 553773 553476 552413 550092 546322 541603 536665 531823 526889
61741 526889 521490 515462 509159 503463 499206 496414 494334 492369 490677 489610 488941 488184 487494 487544 488427 489302
61725D89302J30l37M0Q97J766K578L158L090K440J920J900J890J427R05Q41R51
61709E12898O42J8m57q76j604k325k349j804j529j717j697j263j199j930k580
61694D92228k132r58l59q69j761k189k175k340l007l801m059l602k965k731k808
61679D56472k654k157j757j668j568j279j196j623k157k155j595j047r05j048
61665D33663j128r67p09o58r04j142j086r08q92p77j02Q42J192Q53P95J552K297
61648D31921K091J354J175J705K169K252K438K944L213K725J712P94L06J54L7
61633D56990k64o55q46p99r11j405j897j954j850k216l102l870m017l591k901
61618D26712k279k108k539l140l258k730j945j226o59m27q71k043l565m976n916
$$ plain form
61725 489302 489432 489095 489135 490032 491798 494376 497534 500624 503064 504984 506884 508774 510201 511106 511947 512898
61709 512898 513540 513558 513101 512225 510621 508296 505947 504143 502614 500897 499200 497937 496738 494808 492228
61694 492228 490096 489138 488779 487910 486149 483960 481785 479445 476438 472637 468578 464976 462011 459280 456472
61679 456472 453818 451661 449904 448236 446668 445389 444193 442570 440413 438258 436663 435616 434711 433663
61665 433663 432535 431568 430859 430201 429297 428155 427069 426161 425269 424492 424390 425232 426424 427277 428072 429624 431921
61648 431921 434012 435366 436541 438246 440415 442667 445105 448049 451262 453987 455699 456493 456799 456953 456990
61633 456990 456726 456071 455225 454426 453515 452110 450213 448259 446409 444193 441091 437221 433204 429613 426712
61618 426712 424433 422325 419786 416646 413388 410658 408713 407487 406828 406401 405530 403487 399922 394946 389030
61603C89030o070n420m481l880l654l446l239l342l630l525k949k585k846l144
61589C36819k680j629q95q80j077r04n91q23j761k680k748k004j243j017j111
61574C14776j132j053r08m22N10J257J068J19o73q26o36l50K46J164J809J675
61558C16624J028N17L85L77K59R8J17M32Q86J172J270J600K404L149L010J990
61542C35318R74N48L69n2m96m38J27P70J341K049K860L311L040K201J256M36l66
61525C53248j241j996k391k533k749k929k491j264lM57K77J64K07r8o65p38j92
61508C35063O5m84r90n06M86P27K1n87l64K95P24Q68R69R87P91M88K37kk33j88
61488C38367L07R32J180J011Q70J055J397J594J565J360J031P48Q03J241J664
$$ plain form
61603 389030 382960 377540 373059 369179 365525 362079 358840 355498 351868 348343 345394 342809 339963 336819
61589 336819 334139 332510 331615 330735 329658 328754 328163 327340 325579 322899 320151 318147 316904 315887 314776
61574 314776 313644 312591 311683 311261 311771 313028 314096 314215 313542 312716 312080 311730 311976 313140 314949 316624
61558 316624 317652 318169 318554 318931 319190 319288 319405 319837 320723 321895 323165 324765 327169 330318 333328 335318
61542 335318 336292 336840 337209 337157 336661 336223 336350 337120 338461 340510 343370 346681 349721 351922 353178 353614 353248
61525 353248 352007 350011 347620 345087 342338 339409 336918 335654 335651 336108 336385 336549 336756 336658 335993 335255 335063
61508 335063 335128 334644 333654 333148 333634 334361 334382 333795 333431 333726 334450 335318 336287 337274 338065 338553 338790 338788 338555 338367
61488 338367 338674 339606 340786 341797 342667 343722 345119 346713 348278 349638 350669 351417 352220 353461 355125
61473C55125J692J384R38K14r02j848j803q97k21m15q34o64j85j72n44m98J57
61456C50527P45Q23P27Q28R73R77J078J424J604J181M17L0L39J006J540J778J841
61439C67838J821J669J346J025R90J252J440J296J093J291J873K335K326J937
61425C89532J437J003P79Q45J051J116R92Q86R12R13O39jq35j381j157k95L82
61408C96818K10n66j292j750k062k038j453p49o83j207j540j396j301j534j584
61393C77873j130o41n11k96N10J467J689J104N03M80Q10R21O40L85P22J693K649
61376C88868K975K821K807L064L188L083L138L370L194K342J349P04J79m69p84
61361D19829k29R03J866K395K715K953L108L353L835M341M621M788N062N335N385
$$ plain form
61473 355125 356817 358201 359139 359353 358451 356603 354800 353903 353682 353267 352433 351769 351584 351412 350868 350370 350527
61456 350527 351272 352095 352822 353650 354623 355600 356678 358102 359706 360887 361304 361334 361673 362679 364219 365997 367838
61439 367838 369659 371328 372674 373699 374689 375941 377381 378677 379770 381061 382934 385269 387595 389532
61425 389532 390969 391972 392751 393596 394647 395763 396755 397641 398553 399466 400105 400104 399269 397888 396731 396436 396818
61408 396818 397028 396462 395170 393420 391358 389320 387867 387118 386435 385228 383688 382292 380991 379457 377873
61393 377873 376743 376102 375591 375295 375805 377272 378961 380065 380568 381048 381858 382779 383419 383804 384526 386219 388868
61376 388868 391843 394664 397471 400535 403723 406806 409944 413314 416508 418850 420199 420903 421082 420613 419829
61361 419829 419600 420503 422369 424764 427479 430432 433540 436893 440728 445069 449690 454478 459540 464875 470260
61346D70260N177M689L808K808K417K861L340L049K310K004K254K468K353K107
61332E11905J747J073K89j12j13k29p18j284j553j388q41k21j15o94j150n01J087
61315E07182K490L115L491M221N137N841O467P462Q930J0589J2127J3368J4274
61302F04694J4885J5137J4744J3492J1531R153O416L361M43j809l472n025o501
61289F77049p384p469p308p565q301r055r311q890q127p672p640p228n704l697
61275E71698k649k914l217k334n37J077J967K270K120J637J251J392J972K661
61261E76394L510M721O005O786P001P147P379P130N874L909K047P64m7o94j392
61246F36534k299l415m345m450l587k491k009k069j849j048m29p81j786k353j834
$$ plain form
61346 470260 475437 480126 483934 486742 489159 492020 495360 498409 500719 502723 504977 507445 509798 511905
61332 511905 513652 514725 515014 514902 514789 514560 513842 512558 511005 509617 508776 508555 508440 507746 506596 506095 507182
61315 507182 509672 512787 516278 520499 525636 531477 537944 545406 554336 564925 577052 590420 604694
61302 604694 619579 634716 649460 662952 674483 683636 690052 693413 693856 692047 688575 683550 677049
61289 677049 669665 662196 654888 647323 639022 629967 620656 611766 603639 595967 588327 581099 575395 571698
61275 571698 569049 566135 562918 560584 560047 561124 563091 565361 567481 569118 570369 571761 573733 576394
61261 576394 579904 584625 590630 597416 604417 611564 618943 626073 631947 635856 637903 638667 638620 637926 636534
61246 636534 634235 630820 626475 622025 618438 615947 613938 611869 610020 608972 608543 607762 605976 603623 601789
61231F01789m92J048K326L158L705M399N398O250O465O357O673P458P972P835
61217F70341P621P985Q724R095Q732P902P114O711O599O208N071L545K611K749
61203G61008L439L984M317M751N434O528Q398J0993J3436J4863J5509J6268J7272
61190H86200J7622J6558J4187J0999P369L783R38r33k446m254o114p235p481p640
61176I21553q480r931j1391j2493j3245j3699j3848j3832j3884j4047j4126j4070
61164G68507j4078j4236j4272j3978j3584j3367j3108j2332j1024r595q136o288
61152F24509m056k170j182o73P9J018J478J189L74j049l384o061p608p383o623
61137E88458o880p815p577n315k228J70J820L520N278O332O597P070Q598J0832
$$ plain form
61231 601789 601297 602345 604671 607829 611534 615933 621331 627581 634046 640403 647076 654534 662506 670341
61217 670341 677962 685947 694671 703766 712498 720400 727514 734225 740824 747032 752103 755648 758259 761008
61203 761008 764447 768431 772748 777499 782933 789461 797859 808852 822288 837151 852660 868928 886200
61190 886200 903822 920380 934567 945566 952935 956718 957656 956723 954277 950023 943909 936674 929193 921553
61176 921553 913073 903142 891751 879258 866013 852314 838466 824634 810750 796703 782577 768507
61164 768507 754429 740193 725921 711943 698359 684992 671884 659552 648528 638933 630797 624509
61152 624509 620453 618283 617101 616428 616507 617525 619003 620192 620566 619517 616133 610072 602464 595081 588458
61137 588458 581578 573763 566186 560871 558643 558813 560633 564153 569431 575763 582360 589430 598028 608860
61123F08860J2867J4470J6213J8519K1007K2863K3773K4328K5423K7182K8654
61112H44159K8811K7722K6438K5745K5357K4470K2674K0154J7256J4255J1366
61101A088407Q618N742K386j573n957j0488j4853j8689k1741k4028k5769k7110
61089I54945k8021k8393k8145k7326k6168k4982k3936k2989k2007k0896j9535
61078F82547j7798j5699j3400j1086q980p476o903o988o869n901m348k956j996
61065E72147j091Q2J262J935K020K018K517L553M617N313N948P167R012J0688
61051F27188J1550J2017J3073J4961J6907J8252J9345K0859K2584K3564K3493
61040H23793K3276K3845K4937K5669K5965K6511K7395K7744K7114K6407K6747
$$ plain form
61123 608860 621727 636197 652410 670929 691936 714799 738572 762900 788323 815505 844159
61112 844159 872970 900692 927130 952875 978232 1002702 1025376 1045530 1062786 1077041 1088407
61101 1088407 1097025 1102767 1105153 1103580 1097623 1087135 1072282 1053593 1031852 1007824 982055 954945
61089 954945 926924 898531 870386 843060 816892 791910 767974 744985 722978 702082 682547
61078 682547 664749 649050 635650 624564 615584 608108 601205 594217 587348 581447 577099 574143 572147
61065 572147 571056 571138 572400 574335 576355 578373 580890 584443 589060 594373 600321 607488 616500 627188
61051 627188 638738 650755 663828 678789 695696 713948 733293 754152 776736 800300 823793
61040 823793 847069 870914 895851 921520 947485 973996 1001391 1029135 1056249 1082656 1109403
61029A109403K8063K9444L0455L1307L2098L2647L2911L2921L2539L1969L2258
61018A456015L4508L8764M4462N1608O0556P0852Q1436R2154J04298J19937J41639
61007B296229J72372K14272K67661L32390M09298M98555N98008P06638Q29027
60998F324450R71669J134090J308308J485887J652147J762408J735227J497925
60990A7872111J058938N31735P3288k08887k96022k27153n9287J32097K39396
60981A9116216J53094j66849o48211j144104j520217j715812j741551j642221
60973A0690345j467428j261174j057165q74194p17510n86311m78872l92161l21437
60964C534093k62947k15539j78652j50298j28029j10483r6900q6139p7108o9472
$$ plain form
61029 1109403 1137466 1166910 1197365 1228672 1260770 1293417 1326328 1359249 1391788 1423757 1456015
61018 1456015 1490523 1529287 1573749 1625357 1685913 1756765 1838201 1930355 2034653 2154590 2296229
61007 2296229 2468601 2682873 2950534 3282924 3692222 4190777 4788785 5495423 6324450
60998 6324450 7296119 8430209 9738517 11224404 12876551 14638959 16374186 17872111
60990 17872111 18931049 19462784 19536072 19327185 19031163 18804010 18744723 18876820 19116216
60981 19116216 19269310 19102461 18454250 17310146 15789929 14074117 12332566 10690345
60973 10690345 9222917 7961743 6904578 6030384 5312874 4726563 4247691 3855530 3534093
60964 3534093 3271146 3055607 2876955 2726657 2598628 2488145 2391245 2305106 2227998 2158526
60954B158526o3127n7577n2353m7537m3490m0463l8615l7952l8238l9468m2047
60943A657659m5712m8697m9275m7952m6876m7049m7437m6980m5920m4718m3076
60932A143967m0795l8479l6600l4746l2386k9702k7149k4948k3300k2257k1154
60921H12451j9142j6592j4873j4351j3776j2190j0276r175q932q846q365p068
60909F68865m730k013k26K33K67M82L94j99m32J23M99j00r35j129j338k577m300
60892F52884n137m973m835n186n586n815o025o094n837n678o200p228q211r055
60878E67024r718r574q257o683o024o079n825n219n117n535n406m258k923k266
60864D84140k158k047j773j412r09j80P08J573K155K291K165K077J745N57j145
$$ plain form
60954 2158526 2095399 2037822 1985469 1937932 1894442 1853979 1815364 1777412 1739174 1699706 1657659
60943 1657659 1611947 1563250 1513975 1466023 1419147 1372098 1324661 1277681 1231761 1187043 1143967
60932 1143967 1103172 1064693 1028093 993347 960961 931259 904110 879162 855862 833605 812451
60921 812451 793309 776717 761844 747493 733717 721527 711251 702076 693144 684298 675933 668865
60909 668865 664135 662122 661896 662129 662396 662878 663272 663073 662641 662764 663263 663163 662228 661099 659761 657184 652884
60892 652884 647747 642774 637939 632753 627167 621352 615327 609233 603396 597718 591518 584290 576079 567024
60878 567024 557306 547732 539475 532792 526768 520689 514864 509645 504528 498993 493587 489329 486406 484140
60864 484140 481982 479935 478162 476750 475841 475661 476369 477942 480097 482388 484553 486630 488375 488932 487787
60849D87787j956j253k20j48n69k84N65Q30K74l33p70j523k519l082l118l116
60833D70565k931j990p03k89r37j490j224o47j88N32J483J669N98o62q52j13N57
60816D63378P22N78J54o52j584k252k642k908k942k660k354k389k681k926l137
60801D35705l587m218m471l811k351j011p91j784k986l417l184l123l572l997
60787C93402l775k881j823j266j644k708l578l585k933k211j593j006o76p38p19
60772C62266j20O40Q00N44Q10J877L102M092N067N919N965N025L850L073K491
60757D05401J840J470J755K345K567K155J325M65N0L67J090J459J083K83n02j153
60741D22000j768k530l698n206o320o323n540n033n205n469n334n013m696m038
$$ plain form
60849 487787 485831 484578 484358 484210 483641 483357 483922 484752 485026 484693 483923 482400 479881 476799 473681 470565
60833 470565 467634 465644 464941 464652 463715 462225 461001 460354 460166 460698 462181 463850 464448 463786 462934 462821 463378
60816 463378 464100 464678 464832 464180 462596 460344 457702 454794 451852 449192 446838 444449 441768 438842 435705
60801 435705 432118 427900 423429 419618 417267 416256 415465 413681 410695 407278 404094 400971 397399 393402
60787 393402 389627 386746 384923 383657 382013 379305 375727 372142 369209 366998 365405 364399 363723 362985 362266
60772 362266 362146 362786 363586 364130 364940 366817 369919 374011 379078 384997 390962 395987 399837 402910 405401
60757 405401 407241 408711 410466 412811 415378 417533 418858 419323 419373 419740 420830 422289 423372 423655 423153 422000
60741 422000 420232 417702 414004 408798 402478 396155 390615 385582 380377 374908 369574 364561 359865 355827
60727C55827k842j602r79j079j474j551q77K77Q27J6j370j765q13L07O25M39L35
60710C44301K34n4k12P2N73J011J393J579J206M16o4P3L84O41J207K064K479K193
60692C59496K029K648L554M051M285M528M364L530K845L254M504N622O247O495
60678D17452O136M957L580K889K886K953K859K636J865J69j819l051l452l752
60664D36308m169m336m395m899n552n292l967k759k512k608k119j185m84m8N85
60649C92568J393J841J720J384J215J250J310J141M25q99k338l166l189k876k711
60634C89068k606k229j603j071p20l13J90M73M62N85J101J490J109J89m14m23
60618C85288m15q51j409j519r94j7J033J645J537J135J120J391J125Q9q48r12
$$ plain form
60727 355827 352985 351383 350404 349325 347851 346300 345423 345700 346527 346543 345173 343408 342595 342902 343527 343966 344301
60710 344301 344535 344481 344269 344341 344914 345925 347318 348897 350103 350519 350455 350528 350912 351553 352760 354824 357303 359496
60692 359496 361525 364173 367727 371778 376063 380591 384955 388485 391330 394584 399088 404710 410957 417452
60678 417452 423588 428545 432125 435014 437900 440853 443712 446348 448213 448382 446563 443512 440060 436308
60664 436308 432139 427803 423408 418509 412957 407665 403698 400939 398427 395819 393700 392515 392031 391983 392568
60649 392568 393961 395802 397522 398906 400121 401371 402681 403822 404247 403348 401010 397844 394655 391779 389068
60634 389068 386462 384233 382630 381559 380839 380526 380716 381189 381651 382236 383337 384827 385936 386125 385711 385288
60618 385288 384873 384022 382613 381094 380100 380083 381116 382761 384298 385433 386553 387944 389069 389158 388310 387398
60602C87398m29p3K45R59J787J931J258N43N38J259K172K769K819K425J861J336
60586D08798R36P34O46K61o84j597j473k30J011J341J127J241J900K821L949N239
60570D26020O211O502O627P423Q907J0371J1413J2225J2905J3111J2479J0895
60558E45089Q433N388K262o67l619o625q876r376q204o486n073l754j956L19K569
60543E09424M460O155P952R799J1268J2189J3093J4597J6346J7214J6792J5937
60531F55226J5353J4211J1129O161R39l141o032q256r816j0312r751q753p948
60518F39010p353o502n206m037l666l807l442k206q86j19O39K162M139N684O876
60503F21286Q769J1899J5690J9412K2996K6714L0715L5082L9791M4389M8209N1034
$$ plain form
60602 387398 386969 386896 387141 388100 389887 391818 393076 393619 394157 395416 397588 400357 403176 405601 407462 408798
60586 408798 409734 410468 411114 411375 410691 409094 407621 407391 408402 409743 410870 412111 414011 416832 420781 426020
60570 426020 432231 438733 445360 452783 461690 472061 483474 495699 508604 521715 534194 545089
60558 545089 553522 558910 561172 560505 556886 550261 541385 532009 523805 517319 512246 508492 506536 506855 509424
60543 509424 513884 520039 527991 537790 549058 561247 574340 588937 605283 622497 639289 655226
60531 655226 670579 684790 695919 702080 703019 699878 693846 685590 675774 665462 655711 646958 639010
60518 639010 631657 625155 619949 615912 612246 608439 604997 602791 601905 601786 602425 604587 608726 614410 621286
60503 621286 630055 641954 657644 677056 700052 726766 757481 792563 832354 876743 924952 975986
60491I75986N3086N4146N3255M9640M3544L5851K7135J7476O968m032j5162k6199
60479A271694l6729m5819n2349n5859n6895n6355n4618n1544m7231m2299l7479
60468G34517l3232k9786k7041k4435k1438j8318j5849j4196j2729j1118r877r370
60456E07128r058q257p072o023n283m834m774m851m313k927j661j521k203k650
60442D41701k522k243j955j367n00K73P84R81N47o32j874k400k397k568k836k461
60426D20531j329j69M81O96N75J29k44K6Q09J401J571J762K197K550K615K541
60410D36142K294J618O21j84n12m29J10J108K016K156J671J309J274J160R05R69
60394D52228J518K234K940L500L295J937N15P53K685M396M519L757L347L351L253
$$ plain form
60491 975986 1029072 1083218 1136473 1186113 1229657 1265508 1292643 1310119 1317087 1313055 1297893 1271694
60479 1271694 1234965 1189146 1136797 1080938 1024043 967688 913070 861526 814295 771996 734517
60468 734517 701285 671499 644458 620023 598585 580267 564418 550222 537493 526375 516498 507128
60456 507128 498070 489813 482741 476718 471435 466601 461827 456976 452663 449736 448075 446554 444351 441701
60442 441701 439179 436936 434981 433614 433114 433387 434171 435152 435699 435067 433193 430793 428396 425828 422992 420531
60426 420531 419202 419033 419514 420210 420785 420914 420670 420696 421505 422906 424477 426239 428436 430986 433601 436142
60410 436142 438436 440054 440675 440491 439979 439550 439660 440768 442784 444940 446611 447920 449194 450354 451259 452228
60394 452228 453746 455980 458920 462420 465715 467652 468167 468920 471605 476001 480520 484277 487624 490975 494228
60379D94228L165L396L536L014K080J434J332J621K184K753K741J904P62j17p21
60364E23312j149j131n71L2L12N74J104J548J583J622K139K910L595M491N865
60349E46236P173P799Q060Q482Q598P506N370L209J344p63l135m943n814o370
60335E82752p067p394o789n616m657m162m033m400n316o159o040m914l756l478
60321E08971l920m126l395j963p02k37l70l58K86J410K628L913N494P292Q867
60306E23790J0076J1379J3122J4811J5655J5611J5208J4347J2176Q488M368P98
60294F59829k610o625j0745j3596j4693j4707j4075j2564j0338q257o717n193
60282E39709l448k315k527l499m119m249m633n532o270o167n370m635m494m747
$$ plain form
60379 494228 497393 500789 504325 507339 509419 510853 512185 513806 515990 518743 521484 523388 524150 524033 523312
60364 523312 522163 521032 520461 520493 520805 521379 522483 524031 525614 527236 529375 532285 535880 540371 546236
60349 546236 553409 561208 569268 577750 586348 593854 599224 602433 603777 603014 599879 594936 589122 582752
60335 582752 575685 568291 561502 555886 551229 547067 543034 538634 533318 527159 521119 516205 512449 508971
60321 508971 505051 500925 497530 495567 494865 494628 494258 493900 494186 495596 498224 502137 507631 514923 523790
60306 523790 533866 545245 558367 573178 588833 604444 619652 633999 646175 654663 659031 659829
60294 659829 657219 650594 639849 626253 611560 596853 582778 570214 559876 551619 544902 539709
60282 539709 536261 533946 531419 527920 523801 519552 514919 509387 503117 496950 491580 486945 482451 477704
60268D77704m697l942k806j842j131m60j0j62o99r28o66l61r1O51J844K578K329
60251D67311J777J650J561Q24j71l66M98J616K163J893R69j51q23q52q17j251
60235D75831j795j799j343r08l05J083L048M490M752M265L662L052K466K320K910
60220E01729L872M671N316O239P551Q845R656R938J0015J0175J0361J0303R934
60207F08605R534R364R304R066Q621Q145P624O852N858N060M805M861M549L404
60193G05652J665L7j061j844k715l632m220m398m513m853n420o184p102p721p390
60178F46301o158m986m601m584m121l315l056l626m185l898l010k447k643l088
60164E92583l015k270j422j135j482j874j608n42P15J312J038O37R87J892K194
$$ plain form
60268 477704 473007 469065 466259 464417 463286 462826 462816 462654 461955 461027 460361 460000 459909 460560 462404 464982 467311
60251 467311 469088 470738 472299 473123 472952 472586 473084 474700 476863 478756 479725 479574 478751 477899 477082 475831
60235 475831 474036 472237 470894 469986 469681 470764 473812 478302 483054 487319 490981 494033 496499 498819 501729
60220 501729 505601 510272 515588 521827 529378 538223 547879 557817 567832 578007 588368 598671 608605
60207 608605 618139 627503 636807 645873 654494 662639 670263 677115 682973 688033 692838 697699 702248 705652
60193 705652 707317 707354 706293 704449 701734 698102 693882 689484 684971 680118 674698 668514 661412 653691 646301
60178 646301 640143 635157 630556 625972 621851 618536 615480 611854 607669 603771 600761 598314 595671 592583
60164 592583 589568 587298 585876 584741 583259 581385 579777 579235 579950 581262 582300 582937 583924 585816 588010
60149E88010J375M31O48J837K667K544K192K287K489K281K006K366L349M258M629
60134F23369M683M904N482O050N944M929L662L012L027L012K647K378K568K983
60120F78650L365L851M474M850M772M484M061L174J890R46O56K63r05k340l237
60105G08954l836m878o064o314n463m706n064o128o685o110m881l939l722l778
60091F37386l363k378j433r43o31j81J81J56k9r7l45j238k553l487l496k784k126
60074F12639k393l796n440o114n808n680o239o478n527m234m057n005n785n582
60060E40501m618l360k217j756k098k286j323L15J272J307J466K294L169L648
60046E36314M169N014N723O062O570P443P801O864N169L831L061K191Q74m66j329
$$ plain form
60149 588010 589385 589816 590464 592301 594968 597512 599704 601991 604480 606761 608767 611133 614482 618740 623369
60134 623369 628052 632956 638438 644488 650432 655361 659023 662035 665062 668074 670721 673099 675667 678650
60120 678650 682015 685866 690340 695190 699962 704446 708507 711681 713571 714517 715173 715436 714531 712191 708954
60105 708954 705118 700240 694176 687862 682399 677693 672629 666501 659816 653706 648825 644886 641164 637386
60091 637386 634023 631645 630212 629269 628638 628457 628638 628794 628765 628668 628323 627085 624532 621045 617549 614765 612639
60074 612639 610246 606450 601010 594896 589088 583408 577169 570691 565164 560930 556873 551868 546083 540501
60060 540501 535883 532523 530306 528550 526452 524166 522843 523158 524430 525737 527203 529497 532666 536314
60046 536314 540483 545497 551220 557282 563852 571295 579096 585960 591129 594960 598021 600212 601086 600620 599291
60031E99291j694j913k382l319m610n858o651o820o508o145o195o644o880o342
60017E27330n221m170l491l093l068l672m712n532n800n837n990o139n957n302
60003D59346m201k787j361k62M44Q94J159J348J727K335K649K271J803K345L983
59988D71693N526N937N380M615L949L233K403J547O28m35j558k518l199l629l943
59973D89629m259m522m524m157l589k980k302j586j072q06m68M6K73k2j65N64
59957D60060J741K326K148J915J862J478P04L26Q25J678K242K498K565K202J387
59942D85957P10O33P95N31l35j561k870l750l441j738M23J764J912J530J328J449
59926D83337J700K063K800M115N762P093P707P894Q221Q760R066Q801Q019O911
$$ plain form
60031 599291 597597 595684 593302 589983 585373 579515 572864 566044 559536 553391 547196 540552 533672 527330
60017 527330 522109 517939 514448 511355 508287 504615 499903 494371 488571 482734 476744 470605 464648 459346
60003 459346 455145 452358 450997 450735 451179 452073 453232 454580 456307 458642 461291 463562 465365 467710 471693
59988 471693 477219 483156 488536 493151 497100 500333 502736 504283 504911 504476 502918 500400 497201 493572 489629
59973 489629 485370 480848 476324 472167 468578 465598 463296 461710 460638 459832 459364 459410 459683 459661 459496 460060
59957 460060 461801 464127 466275 468190 470052 471530 472234 472560 473385 475063 477305 479803 482368 484570 485957
59942 485957 486667 487300 488095 488626 488291 486730 483860 480110 476669 474931 475354 477118 479030 480560 481888 483337
59926 483337 485037 487100 489900 494015 499777 506870 514577 522471 530692 539452 548518 557319 565338 572249
59912E72249N731M861M380L663K090J40r15o02J91M39M7n69j185j617j504q09
59896E86590j22Q1O9L06O65P36O61J059K176L525M392M460L975L460L224L141
59880F18398K969K811K926L210L264K980K588K104J285K41n21r09j496k637l844
59865F33369m394m252l925l734l612l377k889k121j249n59o7N24J379K288K940
59850F10321L205L097K815K841L605M924O121O684O436N190K847j4k252l181l037
59835F49602k374j503o81k93n15j222k302l687m956n571n602n650n873n776n131
59820E98466m309l503k395j043k77n71j168j018j19O66P12%j189k373k987k910
59804E75982k646k566k367j641o25J10L83L15j17r09j680j969j754j354j006q70
$$ plain form
59912 572249 577980 582841 587221 590884 592974 593114 592199 591597 591788 592227 592274 591705 590520 588903 587399 586590
59896 586590 586468 586549 586618 586924 587589 588325 588986 590045 592221 595746 600138 604598 608573 612033 615257 618398
59880 618398 621367 624178 627104 630314 633578 636558 639146 641250 642535 642776 642255 641346 639850 637213 633369
59865 633369 628975 624723 620798 617064 613452 610075 607186 605065 603816 603257 603190 603714 605093 607381 610321
59850 610321 613526 616623 619438 622279 625884 630808 636929 643613 650049 655239 658086 658072 655820 652639 649602
59835 649602 647228 645725 645044 644751 644236 643014 640712 637025 632069 626498 620896 615246 609373 603597 598466
59820 598466 594157 590654 588259 587216 586939 586368 585200 584182 584063 584729 585441 585441 584252 581879 578892 575982
59804 575982 573336 570770 568403 566762 566137 566247 566630 566945 566828 565919 564239 562270 560516 559162 558156 557286
59788E57286j101j651k204k548k755k834k637k295k217k463k586k370k109j853
59774E25663j130J58J224J437J273J598K454L263L745L983L936L628L522M053
59760E58807M963N656O036O487P241Q204R102R517R159Q445Q236Q565Q271O595
59746F65284M482L367L235K912J967J142R60J003P77M40L18L19J58k04n42n68
59730F85050j57M36O83M04L0j3R9j0k72l88l65l35k04qk24j069j854j752j001
59711F79050n27n98o68m32j47J39P87J878K948L589L734L358K589K119K732M138
59695G04689N087M903M254M029M014L318J712j07j413k158k682l112l267k980
59681G16287k406j902j739k032k854m149n607o856p826q549q683p818o333n321
$$ plain form
59788 557286 556185 554534 552330 549782 547027 544193 541556 539261 537044 534581 531995 529625 527516 525663
59774 525663 524533 524691 525915 527352 528625 530223 532677 535940 539685 543668 547604 551232 554754 558807
59760 558807 563770 569426 575462 581949 589190 597394 606496 616013 625172 633617 641853 650418 658689 665284
59746 665284 669766 673133 676368 679280 681247 682389 683349 684352 685129 685569 685887 686206 686364 686160 685618 685050
59730 685050 684893 685329 686012 686416 686446 686433 686532 686522 686250 685862 685497 685162 684958 684950 684726 683657 681803 680051 679050
59711 679050 678523 677925 677257 676825 676678 676817 677604 679482 682430 686019 689753 693111 695700 697819 700551 704689
59695 704689 709776 714679 718933 722962 726976 730294 732006 731899 730486 728328 725646 722534 719267 716287
59681 716287 713881 711979 710240 708208 705354 701205 695598 688742 680916 672367 663684 655866 649533 644212
59667F44212n300n490m845l342j763o62j1M43J005J923L035L866M409N263O513
59652F49256P142O375M975M288M298L758K057j04j993l728n554p165q204q843
59638F46558r432r880r768q871p369n748m523l878l515l056k566k514l217m475
59624E67746n621n961n398m686m688n324n720n438m929m563m016l113k347k026
59610E03916j671r52m24m35j86J008K279K313J343P41R40J171J058R98J057P70
59594E13926J89j55l24p95j210p03L93O60k37r32n49jl62j175j407j106j034j338
59576E03840j604j698j702j461r31o11r19j462j522j028m91k22j25l6Q3J37j17
59559D90131p61j285r69Q3R05R06N80O26J016J351J552J621J382J043J512L291
$$ plain form
59667 644212 638912 633422 628577 625235 623472 622810 622799 623242 624247 626170 629205 633071 637480 642743 649256
59652 649256 656398 662773 667748 672036 676334 680092 682149 682045 680052 676324 670770 663605 655401 646558
59638 646558 637126 627246 617478 608607 601238 595490 590967 587089 583574 580518 577952 575438 572221 567746
59624 567746 562125 556164 550766 546080 541392 536068 530348 524910 519981 515418 511402 508289 505942 503916
59610 503916 502245 501293 500869 500434 500248 501256 503535 505848 507191 507932 508872 510043 511101 512099 513156 513926
59594 513926 514115 513960 513636 512841 511631 510928 511321 511981 511744 510812 510263 510262 509900 508725 507318 506212 505178 503840
59576 503840 502236 500538 498836 497375 496444 495833 494914 493452 491930 490902 490411 490189 490064 490028 490111 490248 490131
59559 490131 489370 488085 487116 487199 488104 489010 489590 490216 491232 492583 494135 495756 497138 498181 499693 502984
59543E02984N503O849P355Q295J0400J3044J5416J7675K0252K2282K1598J6643
59531F68296Q368j66o141q840r283q574p127n161l120j378l6P83Q12M7j075k205
59515F25200l521n384p696r777j0876j0772r959r171q678q191p491o785o160n206
59501E15533l680k146j352j212j138j051j231j388r18o9J93l26o65j32Q06J447
59485E02671J894K562L341L808L861L733L665L889M525N292N698N666N476N066
59471E61147M112K904K320K585K870K484J757J277J058J031J568K850M296N385
59457E97644O461P926R161R211Q269P503P458P461O734N401M074L001J945O76
59443F82925p72k252l784n524p413q987r676r304q111o452m731l488l065l138
$$ plain form
59543 502984 508487 515336 522691 530986 541386 554430 569846 587521 607773 630055 651653 668296
59531 668296 676664 676498 670357 661517 652234 643660 636533 631372 628252 626874 626838 627621 628433 628480 627405 625200
59515 625200 621679 616295 608599 598822 587946 577174 567215 558044 549366 541175 533684 526899 520739 515533
59501 515533 511853 509707 508355 507143 506005 504954 503723 502335 501417 501348 501541 501215 500550 500418 501224 502671
59485 502671 504565 507127 510468 514276 518137 521870 525535 529424 533949 539241 544939 550605 556081 561147
59471 561147 565259 568163 570483 573068 575938 578422 580179 581456 582514 583545 585113 587963 592259 597644
59457 597644 604105 612031 621192 630403 638672 646175 653633 661094 667828 673229 677303 680304 682249 682925
59443 682925 682153 679901 676117 670593 663180 654193 644517 635213 627102 620650 615919 612431 609366 606228
59429F06228k973k244j234k28Q98K412M476P106J0010J2514J4211J5558J7282
59416F84016J9264K0706K1331K1637K2030K2505K3041K3065K0535J3216J707r971
59404H83082j7817k1004k0974j8686j4200q089j620M267Q720R905N836l107j3504
59391G92809k1444k5261k5579k3640k0338j6418j2596r235o262l632j593l31M67
59378F26947J373K524L495L998M317M842N441N742N790N938O248O544O941P674
59364F97814Q508Q865Q672Q421Q400Q467Q642R206J0041J0617J0834J1214J2036
59351H21737J2922J3530J4010J4437J4486J4118J3886J4156J4434J3962J2537
59340I74215J0382P710M744J846p85l229n569p773r956j2161j3955j4801j4908
$$ plain form
59429 606228 603255 601011 599777 599549 600447 602859 607335 614441 624451 636965 651176 666734 684016
59416 684016 703280 723986 745317 766954 788984 811489 834530 857595 878130 891346 893053 883082
59404 883082 865265 844261 823287 804601 790401 782312 780692 784959 793679 803584 809420 806313 792809
59391 792809 771365 746104 720525 696885 676547 660129 647533 638298 632036 628404 626811 626480 626947
59378 626947 628320 630844 634339 638337 642654 647496 652937 658679 664469 670407 676655 683199 690140 697814
59364 697814 706322 715187 723859 732280 740680 749147 757789 766995 777036 787653 798487 809701 821737
59351 821737 834659 848189 862199 876636 891122 905240 919126 933282 947716 961678 974215
59340 974215 984597 992307 997051 998897 998112 994883 989314 981541 971585 959424 945469 930668 915760
59327I15760j4974j5079j4643j3593j2571j1789j0691r116p800p196o758n972
59315G85578n191m843m687m477m556n039n249m650l625k685j657l79O15R23J079
59300G41157J732K759L811M954N871N347K579j615n886r890j3680j6317j6555
59287G04267j4666j2289j0476q853o719m065j484L95J423K251L768N914P670Q688
59273F75824J0000J2358J4802J5923J5776J5332J4706J3238J0931Q476O172L929
59261H17467K022O14j115m049p496r787j0495j0757j1395j1975j1873j1166j0069
59248G19926q569o921n635m701l546j930j99J496L350N140O075N773M823M135
59234G19217M129M523M565L519J516l30j213j747l048m964o171n982n124m590
$$ plain form
59327 915760 900786 885707 871064 857471 844900 833111 822420 813304 805504 798308 791550 785578
59315 785578 780387 775544 770857 766380 761824 756785 751536 746886 743261 740576 738919 738540 739155 740078 741157
59300 741157 742889 745648 749459 754413 760284 765631 768210 766595 760709 750819 737139 720822 704267
59287 704267 689601 677312 666836 657983 651264 647199 645715 646110 647533 649784 653552 659466 667136 675824
59273 675824 685824 698182 712984 728907 744683 760015 774721 787959 798890 807366 813538 817467
59261 817467 819489 820103 818988 814939 807443 797656 787161 776404 765009 753034 741161 729995 719926
59248 719926 711357 704436 698801 694100 690554 688624 688425 689921 693271 698411 704486 710259 715082 719217
59234 719217 723346 727869 732434 735953 737469 737139 735926 734179 731131 726167 719996 714014 708890 704300
59220G04300m525m515m319m016l821l915m109l844k777j312j55L73L20j60o74
59205F66851p25m66o56j396j650q37Qk98j198j243k51P25J210J610J976J832J258
59188F66750R22R79J058J319K307L754M733M999N114N171M635L550K784K827L357
59173G14259M081N004N809O035N980O450P494Q423R042R731J0239R651P760N437
59159H15395L374J491l44k085m058o627r199j0654j0919j0912j0956j0572r972
59146G33962j0120j1007j1347j0596r857j0055j0529j0204r082p814o774o164
59134F20413o109o089n273l852l024l183l275k478j279k45J047K957M779N765
59120F00154O184O574O843O968P629R143J0595J1021J0814J0943J1463J1639J1065
$$ plain form
59220 704300 699775 695260 690941 686925 683104 679189 675080 671236 668459 667147 666992 667365 667685 667525 666851
59205 666851 666126 665660 665004 663608 661958 661121 661129 660831 659633 658390 658139 658864 660074 661684 663660 665492 666750
59188 666750 667672 668651 669709 671028 673335 677089 681822 686821 691935 697106 701741 705291 708075 710902 714259
59173 714259 718340 723344 729153 735188 741168 747618 755112 763535 772577 782308 792547 802198 809958 815395
59159 815395 818769 820260 819916 817831 813773 807146 797947 787293 776374 765462 754506 743934 733962
59146 733962 723842 712835 701488 690892 681035 670980 660451 650247 641165 633351 626577 620413
59134 620413 614304 608215 602942 599090 596066 592883 589608 587130 585851 585606 586653 589610 594389 600154
59120 600154 606338 612912 619755 626723 634352 643495 654090 665111 675925 686868 698331 709970 721035
59107G21035R835Q061N945L897K061J95j594k739l239l953n225o154n991n356
59093G16778n206n337m927l907k848j974j203p72r31j348j575j763k359l344m350
59078F74934n125n515n466n387n886o678o606n288l873l552m080m631n112n694
59064F02041n793m769l146k056j766j706j620j719j890j727j232q05o39o47p56
59049E71770p56k87M93P20j6q03n55M35R02K95q51j947k833l294k934j750l00
59032E58289P39R83N42J22N50J842L107L782M386N555O987Q018Q693R360R691
59017F22646R025P486N864M507L116J580K05q54j723k378k618k500k295j972j187
59002F38902K12J894L318M129M455M886N806O616O161M232K026P41L18J22J42
$$ plain form
59107 721035 730870 738931 744876 748773 750834 751029 749435 746696 743457 739504 734279 728125 722134 716778
59093 716778 711572 706235 701308 697401 694553 692579 691376 690604 689673 688325 686750 684987 682628 679284 674934
59078 674934 669809 664294 658828 653441 647555 640877 634271 628983 625110 621558 617478 612847 607735 602041
59064 602041 596248 591479 588333 586277 584511 582805 581185 579466 577576 575849 574617 573812 573173 572526 571770
59049 571770 571014 570727 571220 571940 571924 571121 570566 571001 571903 572198 571347 569400 566567 563273 560339 558589 558289
59032 558289 559028 560011 560553 560675 561225 563067 566174 569956 574342 579897 586884 594902 603595 612955 622646
59017 622646 631671 639157 645021 649528 652644 654224 654429 653575 651852 649474 646856 644356 642061 640089 638902
59002 638902 639114 641008 644326 648455 652910 657796 663602 670218 676379 680611 682637 683378 683696 683818 683960
58987F83960P22J538J746J092J71m26o21n50j42Q24K460M588O753Q621J0271J1807
58971G32814J2914J3315J3568J4479J5786J6394J6060J5686J5672J5201J3791
58960H95680J2255J1208R814P133L762Q34j775m932q507j1569j3911j5993j7589
58947H66410j7916j7139j6533j6809j7290j6997j5784j4070j2166j0177q165o182
58935F97182m415l289l101l548l864l470k353j003o9J82J44L08M71J26m42l16
58919F72543N83J181Q15J78J29N04Q56J385K317L133L358L442L970M709N269O078
58903G10450P634R420J0580J1191J1883J2697J3250J3613J4060J4366J4292J4337
58891H57773J5052J6067J6699J7099J7872J8985J9937K0518K0487J9097J6011
$$ plain form
58987 683960 684682 686220 687966 689058 689229 688803 688182 687632 687490 688314 690774 695362 702115 710736 721007 732814
58971 732814 745728 759043 772611 787090 802876 819270 835330 851016 866688 881889 895680
58960 895680 907935 919143 928957 936090 939852 940686 938911 933979 925472 913903 899992 883999 866410
58947 866410 848494 831355 814822 798013 780723 763726 747942 733872 721706 711529 703364 697182
58935 697182 692767 689478 686377 682829 678965 675495 673142 672139 672070 672252 672396 672704 673175 673301 672859 672543
58919 672543 673126 674307 675122 675300 675429 675933 676789 678174 680491 683624 686982 690424 694394 699103 704372 710450
58903 710450 718084 727504 738084 749275 761158 773855 787105 800718 814778 829144 843436 857773
58891 857773 872825 888892 905591 922690 940562 959547 979484 1000002 1020489 1039586 1055597
58880A055597J2208Q890N998K861l22k881n025p370r539j0583j0610j0577j0622
58867A018025j0004q624p309o570o271o482p406q493q878q820r491j1148j2733
58854I05796j3412j3479j3472j3444j3364j3329j3152j2503j1645j1171j1071
58843G65754j0764j0080r384q838q448q633r687j0816j0818r723q630p960p018
58830F44955n471m010l196k656j822o48O59J908K723K902L034M014N764P233P744
58815F63133P561P089O387N613N119M908M630M210L817L293K256Q06n93j798k951
58800G13480l991m888n993p348q079p472o224n607n785o047o278o766o936n895
58786F26171m077k831k284j208Q54K877M044M702N299N738O106O662O743N140
$$ plain form
58880 1055597 1067805 1076695 1082693 1085554 1085232 1082351 1077326 1069956 1060417 1049834 1039224 1028647 1018025
58867 1018025 1008021 999397 992088 985518 979247 972765 965359 956866 947988 939168 929677 918529 905796
58854 905796 892384 878905 865433 851989 838625 825296 812144 799641 787996 776825 765754
58843 765754 754990 744910 735526 726688 718240 709607 699920 689104 678286 668563 659933 651973 644955
58830 644955 639484 635474 632278 629622 627800 627152 627811 629719 632442 635344 638378 642392 648156 655389 663133
58815 663133 670694 677783 684170 689783 694902 699810 704440 708650 712467 715760 718016 718822 718229 716431 713480
58800 713480 709489 704601 698608 691260 683181 675709 669485 663878 658093 652046 645768 639002 632066 626171
58786 626171 622094 619263 616979 615771 616625 619502 623546 628248 633547 639285 645391 652053 658796 663936
58772F63936J983j081l134m948p159q935r338q778q182p706p158o768o633o133
58758E79966m772l053j843j345j179r65m55L65J023J052Q94J538L084M544N284
58743E84138N687O112O302O245O583P513Q198P971P315P013P036O928O715O724
58729F80480O932P047O859O277N347M513M293M570M727M627M863N825P142Q294
58715G61796R184R893J0285J0123R219P517N321L172J135j399m630p704r890j1721
58701G92301j3941j6068j7279j8096j9545k1120k1341k0132j8803j7719j5882
58690E92375j3113j0656r141p773o110n054n207n769n866n661n474n049m393m099
58676D99010m140l550j964l13O15J229K084K946L519M089M893N822P066Q890J0492
$$ plain form
58772 663936 665919 664838 661704 656756 649597 640662 631324 622546 614364 606658 599500 592732 586099 579966
58758 579966 575194 572141 570298 568953 567774 566809 566354 566719 567742 568794 569688 571226 574310 578854 584138
58743 584138 589825 595937 602239 608484 615067 622580 630778 638749 646064 653077 660113 667041 673756 680480
58729 680480 687412 694459 701318 707595 712942 717455 721748 726318 731045 735672 740535 746360 753502 761796
58715 761796 770980 780873 791158 801281 810500 818017 823338 826510 827645 826246 821616 813912 804022 792301
58701 792301 778360 762292 745013 726917 707372 686252 664911 644779 625976 608257 592375
58690 592375 579262 568606 559465 551692 545582 540528 535321 529552 523686 518025 512551 507502 503109 499010
58676 499010 494870 491320 489356 489043 489658 490887 492971 495917 499436 503525 508418 514240 521306 530196 540688
58661E40688J0472Q772O787N161L039J8k848m717o072p296p752p225o722o834
58647E25471o719n787m925m861m710l542k166j839k136j632n6J537K357K565K631
58632D96188K828L073K955K295J700J744J754O54r65j286K3J275J478J634K515
58617E17865L173K885K705L675M975N412N297N375N212M208L151L060L423L098
58603E73514K170J565J391J088N59P8l84q13q07l96l47q22p82M66K174L523M930
58586E87107O953R045J0513J1624J2710J3212J2683J1762J1117J0482R623R044
58574G15875Q796P958O455N893P413J0032J2454J4977J8235K1511K3981K6283
58562H79863K9123L1566L2414L2185L1844L0615K6935K0861J3832O816J88n262
$$ plain form
58661 540688 551160 559932 566719 571880 574919 574937 572089 567372 561300 554004 546252 539027 532305 525471
58647 525471 518752 512965 508040 503179 498469 494927 492761 490922 488786 487154 487098 488635 490992 493557 496188
58632 496188 499016 502089 505044 507339 509039 510783 512537 513191 512226 510940 510963 512238 513716 515350 517865
58617 517865 521038 523923 526628 530303 535278 540690 545987 551362 556574 560782 563933 566993 570416 573514
58603 573514 575684 577249 578640 579728 580287 580365 579981 579168 578361 577965 577618 576796 576014 576480 578654 582177 587107
58586 587107 594060 603105 613618 625242 637952 651164 663847 675609 686726 697208 706831 715875
58574 715875 724671 732629 739084 744977 752390 762422 774876 789853 808088 829599 853580 879863
58562 879863 908986 940552 972966 1005151 1036995 1067610 1094545 1115406 1129238 1136054 1136242 1130980
58550A130980q902j1116j2318j1933r754p296o299o764p863r724j2804j6423j9648
58537I90136k2749k6221k9198l0329k9485k7328k4146k0428j7339j5215j2832
58526G34866r594o987o274o310n544m561m532m634l521j989j709k312k279j800
58512F72820k176l153l434l125l276l523k749j460j113j501j307p40j102k091
58498F42070k079q66J88O32J184J755J573J166J921L727N192O053P252Q836J0059
58483F88663J1286J3545J6271J7852J8282J8932J9800J9454J7752J6095J4699
58472H72631J2001P244J589l741q397j1850j3358j3401j3246j2847j0950p358
58460G98317l266O88M752Q531J1122J2845J4845J6894J7582J6694J5250J3175
$$ plain form
58550 1130980 1122078 1110962 1098644 1086711 1076957 1069661 1063362 1056598 1048735 1039011 1026207 1009784 990136
58537 990136 967387 941166 911968 881639 852154 824826 800680 780252 762913 747698 734866
58526 734866 725272 718285 712011 705701 700157 695596 691064 686430 682909 680920 679211 676899 674620 672820
58512 672820 670644 667491 664057 660932 657656 654133 651384 649924 648811 647310 646003 645263 644161 642070
58498 642070 639991 639125 639313 639945 641129 642884 644457 645623 647544 651271 656463 662516 669768 678604 688663
58483 688663 699949 713494 729765 747617 765899 784831 804631 824085 841837 857932 872631
58472 872631 884632 891876 893465 889724 881327 869477 856119 842718 829472 816625 805675 798317
58460 798317 795051 795739 800491 809022 820144 832989 847834 864728 882310 899004 914254 927429
58448I27429R147L129l069q105j2156j5385j7322j8032j8109j7246j4562j0612
58436H05107p237n236l723j935q4J636L267M464N092O124Q276J0350J0746J0059
58422H46906J0044J0521R604O777L367K19k939n977q339j0305j2230j3081j1884
58409H22683j0026r611j0153r558p810o759o693o131m801l802k916r17J516K326
58395G47348J696J872L236L763K848K322K975L267K359J517J605J791J653K032
58381G80284L087L891M443N693P191P346O373O340P887R454J0056J0242J0141
58368H72428R287Q526R279J0827J1206J0712J1404J3218J4054J3661J3904J4831
58356A013337J4302J1901R517P584M598R89o28O0L13q88j229N15K348K830L292
$$ plain form
58448 927429 936576 939705 936636 928531 916375 900990 883668 865636 847527 830281 815719 805107
58436 805107 797870 792634 788911 786976 786892 788528 791795 796259 801351 807475 815751 826101 836847 846906
58422 846906 856950 867471 877075 883852 887219 887438 884499 878522 870183 859878 847648 834567 822683
58409 822683 812657 803046 792893 783335 775525 768766 762073 755942 751141 747339 744423 743506 745022 747348
58395 747348 749044 750916 754152 757915 760763 763085 766060 769327 771686 773203 774808 776599 778252 780284
58381 780284 783371 787262 791705 797398 804589 811935 818308 824648 832535 841989 852045 862287 872428
58368 872428 881715 890241 899520 910347 921553 932265 943669 956887 970941 984602 998506 1013337
58356 1013337 1027639 1039540 1049057 1056641 1061239 1062228 1061600 1061660 1061973 1061085 1059856 1060371 1062719 1065549 1068841
58341A068841M761O153O927Q351J0704J2476J3397J4994J7192J7870J6821J6418
58329A214905J7280J7013J4436J1346Q846N810K201J04M3N5l60P25L575N777O608
58314A308364Q323J1772J4972J7243K0458K4822K7906K9210L1028L3317L2616
58303A560031K7795K2129J7890J3867R924Q685J0429J1511J0337R874J1879J3758
58291A728109J3726J3917J5676J6805J6190J6184J7806J8654J8029J8860K2043
58280A915999K4356K4554K5767K9152L1253L0553L0451L2652L4047L3481L4943
58269B247208M0159M4761M5820M6679N0105N3279N3997N5189N8663O1086O0636
58258B817582O0937O3730O4832O2194O0640O3361O6206O5924O6402P0812P5362
$$ plain form
58341 1068841 1073602 1079755 1086682 1095033 1105737 1118213 1131610 1146604 1163796 1181666 1198487 1214905
58329 1214905 1232185 1249198 1263634 1274980 1283826 1289636 1291837 1291941 1291984 1292039 1291679 1292404 1295979 1301756 1308364
58314 1308364 1316687 1328459 1343431 1360674 1381132 1405954 1433860 1463070 1494098 1527415 1560031
58303 1560031 1587826 1609955 1627845 1641712 1651636 1660321 1670750 1682261 1692598 1702472 1714351 1728109
58291 1728109 1741835 1755752 1771428 1788233 1804423 1820607 1838413 1857067 1875096 1893956 1915999
58280 1915999 1940355 1964909 1990676 2019828 2051081 2081634 2112085 2144737 2178784 2212265 2247208
58269 2247208 2287367 2332128 2377948 2424627 2474732 2528011 2582008 2637197 2695860 2756946 2817582
58258 2817582 2878519 2942249 3007081 3069275 3129915 3193276 3259482 3325406 3391808 3462620 3537982
58247C537982P7079Q0079Q7509R5025R9016J03528J12072J20487J25153J30261
58237D568191J39580J49102J55385J62839J75069J87565J96815K07695K23809
58228F166050K40015K52857K68340K90557L13367L32723L55873L88318M23485
58219I031585M56126M93395N41162N92611O42956P01583P76167Q59356R45785
58210A5040726J046945J173631J320281J483793J680425J925703K217118K558266
58202B8446888K981193L523354M204911N053577O126637P477368R119962J1050883
58194G7984773J3272274J5767475J8500620K1477191K4737121K8217763L1676542
58187B31633759L4783196L7093123L7683821L4961749K7399315J4942672l04633
$$ plain form
58247 3537982 3615061 3695140 3782649 3877674 3976690 4080218 4192290 4312777 4437930 4568191
58237 4568191 4707771 4856873 5012258 5175097 5350166 5537731 5734546 5942241 6166050
58228 6166050 6406065 6658922 6927262 7217819 7531186 7863909 8219782 8608100 9031585
58219 9031585 9487711 9981106 10522268 11114879 11757835 12459418 13235585 14094941 15040726
58210 15040726 16087671 17261302 18581583 20065376 21745801 23671504 25888622 28446888
58202 28446888 31428081 34951435 39156346 44209923 50336560 57813928 66933890 77984773
58194 77984773 91257047 107024522 125525142 147002333 171739454 199957217 231633759
58187 231633759 266416955 303510078 341193899 376155648 403554963 418497635 418193002
58180D18193002j5045896k6602609l3954427l7427574l7846796l6056973l2859599
58173A98399128k8976510k4946692k1107228j7660790j4707949j2245309j0209591
58166F8545059q541761p193602o101895n201203m454847l844316l339666k907354
58158B6960415k535576k225465j965778j738364j539167j372166j230340j101757
58150A3251802r86639q90443q07411p27590o52875n90202n35999m82548m32904
58141G145191l94481l63917l32733l02320k79723k63638k47570k32077k21418
58132D507314k12584j99583j84544j73427j64772j53397j41046j32817j26888
58123C018256j18062j07841j01177r6756r0159q3095p9948p8496p3487o6444o2759
$$ plain form
58180 418193002 403147106 376544497 342590070 305162496 267315700 231258727 198399128
58173 198399128 169422618 144475926 123368698 105707908 90999959 78754650 68545059
58166 68545059 60003298 52809696 46707801 41506598 37051751 33207435 29867769 26960415
58158 26960415 24424839 22199374 20233596 18495232 16956065 15583899 14353559 13251802
58150 13251802 12265163 11374720 10567309 9839719 9186844 8596642 8060643 7578095 7145191
58141 7145191 6750710 6386793 6054060 5751740 5472017 5208379 4960809 4728732 4507314
58132 4507314 4294730 4095147 3910603 3737176 3572404 3419007 3277961 3145144 3018256
58123 3018256 2900194 2792353 2691176 2594420 2504261 2421166 2341218 2262722 2189235 2122791 2060032
58112B060032o1829n8967n4540n2546n2439n0697m8230m8223m8914m6386m2353
58101A494908m1372m2508m1382l8419l7373l7613l5515l1926l0721l1330k9920
58090A096829k6745k5258k5124k3025j9442j7880j8313j7810j6770j8075k0947
58079H67440k1906k1214k2079k4168k4106k2053k1584k3187k3588k1643j9492
58068F22420j7836j5247j2172j0638r826o719j128M209Q308J2315J5675J6384
58056F05745J4846J3304J1764Q457L818L7k617n221o993o644n862p137r267r315
58042F04915p868p829r081r198q518r573j1935j2520j0811r250q644p692o710
58029D85286p434r230r807r435j0160j1325j0368p755o490o871o333m515l763
$$ plain form
58112 2060032 1998203 1939236 1884696 1832150 1779711 1729014 1680784 1632561 1583647 1537261 1494908
58101 1494908 1453536 1411028 1369646 1331227 1293854 1256241 1220726 1188800 1158079 1126749 1096829
58090 1096829 1070084 1044826 1019702 996677 977235 959355 941042 923232 906462 888387 867440
58079 867440 845534 824320 802241 778073 753967 731914 710330 687143 663555 641912 622420
58068 622420 604584 589337 577165 566527 556701 549982 548854 553063 561371 573686 589361 605745
58056 605745 620591 633895 645659 654116 657934 657971 655354 650133 643140 636496 630634 623497 614230 604915
58042 604915 597047 589218 580137 570939 562421 552848 540913 528393 517582 508332 499688 491996 485286
58029 485286 477852 468622 458815 449380 439220 427895 417527 409772 403282 396411 390078 385563 381800
58016C81800m418m210k776k330l246l344k104j512k083k093j327j541k677k621
58002C45518j245p64j459j129O07J464P62M87J289J392M05K41J172R45j005k306
57986C46374j898j747k966l853l349k951l576l828l022k713l562l781k402j133
57972C05593j290j614r03j71m92j033q31l54MP89J797J739O83L75J250J571N17
57955C07630m93o23j017k169k631j790j286k146k933k383j475j266q86N79K222
57940B89333L055L742N070O361O881P204P844Q122P657P348P697P697O519M756
57926C79286L036R57j589l666m808n749o839p359p121p033p286o810n291l886
57912C15842l139k038j3J974L176M076M851M713L606K656K172J090p18j740j355
$$ plain form
58016 381800 377382 373172 370396 368066 364820 361476 359372 357860 355777 353684 352357 350816 348139 345518
58002 345518 344273 343509 342050 340921 341528 342992 343754 344241 345530 346922 347327 347568 348740 349685 348680 346374
57986 346374 344476 342729 339763 335910 332561 329610 326034 322206 319184 316471 312909 309128 306726 305593
57972 305593 304303 302689 301786 301615 301123 300090 299259 298905 298909 299698 301495 303234 303917 304292 305542 307113 307630
57955 307630 307137 306514 305497 303328 300697 298907 297621 295475 292542 290159 288684 287418 286532 287111 289333
57940 289333 292388 296130 301200 307561 314442 321646 329490 337612 345269 352617 360314 368011 374530 379286
57926 379286 382322 383279 381690 378024 373216 367467 360628 353269 346148 339115 331829 325019 319728 315842
57912 315842 312703 310665 310652 312626 315802 319878 324729 329442 333048 335704 337876 338966 338248 336508 335153
57897C35153r77j600k243j965j420j239q07J26N37j2l98p5j77j298k103j556o67
57880C19279o01q25o50q31k030l261l467l232l409l495k872k289k631l301l276
57865B83109k679k056j174K32J603K471L278M309M945M854M742N150N659O007
57851C20450O576P072O309M181K259J519R66n18k466l892m573m505l607k702l148
57836C23921m669n411m786m263m543m352l153k531l356l928k813j307j037j194
57822B76578l29Q45Q40M5k79l38r30j371o02N78N33p36k042l144m544n865o300
57805B52939o157o222o140n032l201j841j439j625j989k049j222K16J088J128
57791B18454J567K912L753L087K239K783M062M603M636N214N964N864N385N762
$$ plain form
57897 335153 334176 332576 330333 328368 326948 325709 324902 325028 325565 325553 325155 325080 324903 323605 321502 319946 319279
57880 319279 318678 317853 317203 316372 314342 311081 307614 304382 300973 297478 294606 292317 289686 286385 283109
57865 283109 280430 278374 277200 277432 279035 281506 284784 289093 294038 298892 303634 308784 314443 320450
57851 320450 327026 334098 340407 344588 346847 348366 349332 348814 346348 342456 337883 333378 329771 327069 323921
57836 323921 319252 313841 309055 304792 300249 295897 292744 290213 286857 282929 280116 278809 277772 276578
57822 276578 276249 277094 277934 277979 277700 277362 276432 275061 274459 275037 275570 274834 272792 269648 265104 259239 252939
57805 252939 246782 240560 234420 229388 226187 224346 222907 221282 219293 217244 216022 216238 217326 218454
57791 218454 220021 222933 226686 229773 232012 234795 238857 243460 248096 253310 259274 265138 270523 276285
57777B76285O806P279O953O530O086N197M091L266K463J338L62j76j066k795m406
57762C18213n145n902p393q319p348n666n280n828n418l856k571j924r89K38P87
57747B53599P83J479L109M527N053N024M586L550K382J838J724J347Q71Q36Q80
57732B91588M39J52R40K179K520K146K350L243L648L031J917O10q55j798j602
57717C10508j036j286k109k525k770l707m894n249n164n842o844o603n220m427
57703B52832m726m843m265l979m278m054k945k205k644l407l549l258k869k092
57689B03718q71K05Q04J123J098O26N89K093M554O187O654P576J0064J3443J6910
57674B74773K0793K5549L0936L6881M3855N1804N9855O7489P4697Q0416Q1897
$$ plain form
57777 276285 283091 290370 297323 303853 309939 315136 319227 322493 324956 326294 326656 326480 325414 322619 318213
57762 318213 313068 307166 299773 291454 284106 278440 273160 267332 261914 258058 255487 253563 252574 252812 253599
57747 253599 254382 255861 258970 263497 268550 273574 278160 281710 284092 285930 287654 289001 289872 290708 291588
57732 291588 292027 292179 293119 295298 297818 299964 302314 305557 309205 312236 314153 314763 313908 312110 310508
57717 310508 309472 308186 306077 303552 300782 297075 292181 286932 281768 275926 269082 262479 257259 252832
57703 252832 248106 243263 238998 235019 230741 226687 223742 221537 218893 215486 211937 208679 205810 203718
57689 203718 202847 203052 203856 204979 206077 206703 207292 209385 213939 220126 226780 234356 244420 257863 274773
57674 274773 295566 321115 352051 388932 432787 484591 544446 611935 686632 767048 848945
57663H48945P6021O0521L4653P99l4301o2250p8400q3831q1965p5134o4994n3997
57651D86067m4450l6881l0580k5045k0177j5841j2098r327p545o203n032m296
57639B68592l914l261k163j235q31n90l17l29n85n26j57k57j077j908k248k456
57623B46738k789k875k588k445k728l066l245l427l373k529j278q61j585k234
57609B11715j870j087q67j176j375j199p15m3L88Q2o63r42o22n77j247j966k169
57592A95667k306k977l963m637m682m076l025k116j800j728j312q49j002j422
57578A59772j215o79j026k248k960k702k637l357l760k975j894j702k168k377
57564A28072k158j831j470j184j206j171l56Q74J171L11k45L39J060J052J200
$$ plain form
57663 848945 924966 985487 1020140 1020939 986638 924388 845988 762157 680192 605058 540064 486067
57651 486067 441617 404736 374156 349111 328934 313093 300995 291668 284123 277920 272888 268592
57639 268592 264678 261417 259254 258019 257188 256598 256281 255952 255367 254841 254684 254427 253350 251442 249194 246738
57623 246738 243949 241074 238486 236041 233313 230247 227002 223575 220202 217673 216395 215534 213949 211715
57609 211715 209845 208758 207891 206715 205340 204141 203426 203383 203771 203853 203190 202248 201626 201049 199802 197836 195667
57592 195667 193361 190384 186421 181784 177102 173026 170001 167885 166085 164357 163045 162196 161194 159772
57578 159772 158557 157878 156852 154604 151644 148942 146305 142948 139188 136213 134319 132617 130449 128072
57564 128072 125914 124083 122613 121429 120223 119052 118696 119570 120741 121052 120807 121146 122206 123258 124458
57549A24458K380L624L574K652K080J692N13j153j871j097L51J654K585K946K564
57534A46952J819J255P41j89j362k135k304k170j831j100k6R87J553J500R77N25
57518A45192O13R08O36k05o36m3J014J701J851J651J186P41P31R61P26K4k86N3
57500A56818J73m79j289j666j995k613l015k890k929l571l974l307k190j693j661
57485A23719j202k98K00k01j213k226k573j908q35n02j061j434j052p77j300j882
57469A05455j696j252j307j386o85L83Q75P87O57L90k30n96j19N78N30j18o60
57452A01606j076j545j457m15N79L90l24j15Q91J274O42K1M0K96M74O49N29k06
57434A02253q70m95N37R60O48N69P96L15q86j344l19R93J299R74J023J338J032
$$ plain form
57549 124458 126838 130462 134036 136688 138768 140460 140973 139820 137949 136852 137203 138857 141442 144388 146952
57534 146952 148771 150026 150767 150578 149216 147081 144777 142607 140776 139676 139650 140637 142190 143690 144667 145192
57518 145192 145805 146713 147349 147144 146508 146465 147479 149180 151031 152682 153868 154609 155340 156301 157027 157051 156765 156818
57500 156818 156991 156512 155223 153557 151562 148949 145934 143044 140115 136544 132570 129263 127073 125380 123719
57485 123719 122517 122219 122419 122218 121005 118779 116206 114298 113463 112961 111900 110466 109414 108637 107337 105455
57469 105455 103759 102507 101200 99814 99129 99512 100387 101174 101831 102221 101991 101395 101276 101854 102384 102266 101606
57452 101606 100530 98985 97528 97113 97692 98082 97758 97643 98534 99808 100450 100471 100511 100807 101281 101930 102459 102253
57434 102253 101383 100888 101425 102385 103033 103602 104398 104713 103827 102483 102164 103157 104456 105430 106453 107791 108823
57417A08823k2j003j247r27o81q49j107q25M6P57P18L63M99J108J465J209N61
57400A08888l16j408k341k542j917q98J37R55J300J195J139J387J412P99K04N50
57384A08544J649K507K713K541K042J127L36L50P86O00l39j175j539j956k645
57369A15541l041k778k257j899j702j664j837j825j097m1K32n42j258q86L18J376
57353I6640J771J693J594J834K350K572J984Q02l00j002j381j393r54m17k75m01
57337A05117l06nM1j68j45J84L49J39j26k52m31p66j081j258j279j010m87k07
57319I8309m75p69m25K89N72L99M49R09J246J118O71n4j085j937j937j159l18
57302I5803J78L09j09j025j508o87P73J364Q74N07Q27J076P76N79R03J041M43
$$ plain form
57417 108823 108801 107798 106551 105624 104943 104094 102987 102162 102208 102965 103683 104046 104545 105653 107118 108327 108888
57400 108888 108572 107164 104823 102281 100364 99466 99603 100558 101858 103053 104192 105579 106991 107790 107994 108544
57384 108544 110193 112700 115413 117954 119996 121123 121459 121809 122595 123195 122856 121681 120142 118186 115541
57369 115541 112500 109722 107465 105566 103864 102200 100363 98538 97441 97400 97632 97090 95832 94946 95264 96640
57353 96640 98411 100104 101698 103532 105882 108454 110438 111240 110940 109938 108557 107164 106210 105793 105518 105117
57337 105117 104811 104806 104847 104679 104534 104718 105067 105206 105080 104828 104397 103631 102550 101292 100013 99003 98516 98309
57319 98309 97834 97065 96640 96929 97501 97900 98349 99258 100504 101622 102293 102239 101154 99217 97280 96121 95803
57302 95803 95981 96290 96181 95156 93648 92961 93734 95098 95972 96479 97306 98382 99158 99737 100640 101681 102124
57285A02124k19o1P46J436J724J731J487J098R09J022J115J017J009J282J616
57270A18036J821J892J653R40K49L95J274J783J295M36R6L39O68P31M99K49N27
57253A32883J487K293J943P11j59j43J35K49N14R02P21j34p10m14J63M77R72K089
57235A43979L200L429K828K029J384J114J560K588L451L848M497N920P428Q098
57221A95353Q140Q445R246J0092J0728J1278J1864J2597J3630J4676J4936J4086
57209C35071J2864J2068J1479J0489R298Q612Q377P616N519K216j521m904p584
57196D09600r807j1955j3839j4760j4483j3622j2708j1508r746q003p129p026
57184B75014o712n584m120l221l160l267k669j315q5K96J85L64Q48J114J325K241
$$ plain form
57285 102124 101905 101844 102590 104026 105750 107481 108968 110066 110975 111997 113112 114129 115138 116420 118036
57270 118036 119857 121749 123402 124342 124591 124986 126260 128043 129338 129774 129870 130209 130877 131608 132107 132356 132883
57253 132883 134370 136663 138606 139317 139158 139015 139150 139399 139913 140815 141536 141402 140692 140278 140441 140918 141890 143979
57235 143979 147179 150608 153436 155465 156849 157963 159523 162111 165562 169410 173907 179827 187255 195353
57221 195353 203493 211938 221184 231276 242004 253282 265146 277743 291373 306049 320985 335071
57209 335071 347935 360003 371482 381971 391269 399881 408258 415874 421393 423609 422088 417184 409600
57196 409600 399793 387838 373999 359239 344756 331134 318426 306918 297172 289169 282040 275014
57184 275014 268302 262718 258598 255377 252217 248950 246281 244966 244881 245177 245362 245726 246574 247688 249013 251254
57168B51254L807M912N036N113O181P963R490J0499J1354J2215J2992J3857J5066
57155C69739J6413J7427J7944J8150J8201J8172J8207J8440J8893J9558K0362
57144E71506K1088K1579K2007K2504K2767K2597K2709K4044K6288K8037K8670
57133H33796K9108L0330L2122L3757L5120L6474L7760L8728L9292L9345L8790
57122A224622L8029L7978L9169M1430M4519M8526N3513N9606O7539P8074R0633
57111A823638J03562J16270J30042J46286J65062J86072K10045K38289K71757
57102C391023L11489L59310M17335M87341N71337O72153P92769R35264J100151
57093I038172J285210J483812J684980J876162K046518K188752K299560K378574
$$ plain form
57168 251254 255061 259973 265009 270122 276303 284266 293756 304255 315609 327824 340816 354673 369739
57155 369739 386152 403579 421523 439673 457874 476046 494253 512693 531586 551144 571506
57144 571506 592594 614173 636180 658684 681451 704048 726757 750801 777089 805126 833796
57133 833796 862904 893234 925356 959113 994233 1030707 1068467 1107195 1146487 1185832 1224622
57122 1224622 1262651 1300629 1339798 1381228 1425747 1474273 1527786 1587392 1654931 1733005 1823638
57111 1823638 1927200 2043470 2173512 2319798 2484860 2670932 2880977 3119266 3391023
57102 3391023 3702512 4061822 4479157 4966498 5537835 6209988 7002757 7938021 9038172
57093 9038172 10323382 11807194 13492174 15368336 17414854 19603606 21903166 24281740
57085B4281740K425388K436734K405731K319658K153177J866950J427889Q46099
57077D0163366J94069m21186r17616j279598j548713j778754j995881k189833
57069C0225854k331708k397492k380763k291347k147252j968080j772115j574609
57061A3362488j386251j213128j058281r22908q06596p07756o24421n54486m95552
57052E593109m45444m02839l66756l35568l07357k81135k56897k34625k14076
57043B748412j95319j78530j63176j48269j33516j19470j06613r4907q4154p4040
57033A450418o3953n3562m3464l4483k6544j8984j1702n066P96N312O174M34j2466
57020A192910k9450m5900n8298o5037o6156o3044n7663n1422m4993l9090l4495
$$ plain form
57085 24281740 26707128 29143862 31549593 33869251 36022428 37889378 39317267 40163366
57077 40163366 40357435 39936249 39018633 37739035 36190322 34411568 32415687 30225854
57069 30225854 27894146 25496654 23115891 20824544 18677292 16709212 14937097 13362488
57061 13362488 11976237 10763109 9704828 8781920 7975324 7267568 6643147 6088661 5593109
57052 5593109 5147665 4744826 4378070 4042502 3735145 3454010 3197113 2962488 2748412
57043 2748412 2553093 2374563 2211387 2063118 1929602 1810132 1703519 1608612 1524458 1450418
57033 1450418 1386465 1332903 1289439 1254956 1228412 1209428 1197726 1192660 1193456 1198768 1204942 1205376 1192910
57020 1192910 1163460 1117560 1059262 994225 928069 865025 807362 755940 710947 671857 637362
57009F37362l1141k8130k5062k2600k1295k0593j9573j8104j6748j5960j5852
56998D02304j6377j7222j7751j7462j6402j4989j3508j1944j0176q185o129m170
56986B47989k223j0K450M630N882N776L982L34m592r364j2666j4171j4270j3455
56972B00292j2318j1540j1036r588o174j435K871N734P576R295J1382J3899J6702
56959B15660J9496K1942K3695K4188K2815J9527J4811Q856J512o512j3231j6955
56947C35804j7756j6701j4435j1253p810m700j844Q27K806L991N513Q333J1708
56934B94483J4323J6382J9088K2406K4793K4905K2241J6341O979m644j6066k5162
56922D16069l0857l2738l1280k8217k5288k2573j9199j5419j2568j1060r919q415
$$ plain form
57009 637362 606221 578091 553029 530429 509134 488541 468968 450864 434116 418156 402304
56998 402304 385927 368705 350954 333492 317090 302101 288593 276649 266473 258288 252159 247989
56986 247989 245766 245756 248206 252836 258718 264494 268476 268810 264218 254854 242188 228017 213747 200292
56972 200292 187974 176434 165398 155810 149636 148201 151072 156806 164382 173677 185059 198958 215660
56959 215660 235156 257098 280793 304981 327796 347323 362134 370990 372502 365990 352759 335804
56947 335804 318048 301347 286912 275659 267849 263149 261305 262132 264938 268929 274442 282775 294483
56934 294483 308806 325188 344276 366682 391475 416380 438621 454962 461941 457297 441231 416069
56922 416069 385212 352474 321194 292977 267689 245116 225917 210498 197930 186870 176951 168536
56910A68536o799n352m028l139l003k896j701K81J641J969K168K596K697K615
56896A55585L381M967O050O340P318R825J2575J4227J5360J7184J9501K1135K1332
56883C14780J9609J5345Q750J509m644r320j2706j4398j4061j2438j0475q050
56871B73901m573l14L914P894J1907J5942J9910K4181K9014L3843L8071M2103
56859D95793M6469M9881M9197M1779K7686R677q519k3931l4979m1068m2093l8691
56847E31201l2509k5415j8242j0787k885N113J2976K0816K8638L6357M4298N2853
56835F42414O1519O9158P5077P8573P7222O7193M6561J7812j3437m1621o3022
56824A017449p5915q0430p8120p0986o0891m9737l9213k9814k0766j1398k039
$$ plain form
56910 168536 161737 156385 152357 149218 146215 143319 141618 141899 143540 145509 147677 150273 152970 155585
56896 155585 158966 163933 169983 176323 183641 193466 206041 220268 235628 252812 272313 293448 314780
56883 314780 334389 349734 358484 359993 355349 346029 333323 318925 304864 292426 281951 273901
56871 273901 269328 269014 272928 280822 292729 308671 328581 352762 381776 415619 453690 495793
56859 495793 542262 592143 641340 683119 710805 720482 711963 688032 653053 611985 569892 531201
56847 531201 498692 473277 455035 444248 441363 446476 459452 480268 508906 545263 589561 642414
56835 642414 703933 773091 848168 926741 1003963 1071156 1117717 1135529 1122092 1080471 1017449
56824 1017449 941534 861104 782984 711998 651107 601370 562157 532343 511577 500179 498140
56813D98140O761J5136K3444L1507L8899M5460N1026N4807N5207N0028L7257J6860
56801I24532p936l1903n0811o2871o7903o6593o0779n2953m4640l6059k7543k0057
56789C94484j3840p925j651M439R814J4849J9758K3853K6624K8368K8747K5968
56777E53488J8615P525n180j7907k9417l7868m1691m1150l7974l3759k9462k5824
56765B79396k3094k0574j7445j3914j0940r048p977p171o122m657l318k984l673
56752A48479m288l972l101k494k333k278k052j463n33J18k47j325k012j940j722
56737A18837j536q24J91L86k67l25O59J073k7r81j6J790K071P34k00L35J428K077
56719A25405K301K364K264K069J870J458Q60P53J506K310K209J407O38o1q38j098
$$ plain form
56813 498140 504901 520037 543481 574988 613887 659347 710373 765180 820387 870415 907672 924532
56801 924532 916596 884693 833882 771011 703108 636515 575736 522783 478143 442084 414541 394484
56789 394484 380644 372719 371068 375507 385321 400170 419928 443781 470405 498773 527520 553488
56777 553488 572103 579628 574448 556541 527124 489256 447565 406415 368441 334682 305220 279396
56765 279396 256302 235728 218283 204369 193429 184381 176404 169233 163111 158454 155136 152152 148479
56752 148479 144191 140219 137118 134624 132291 130013 127961 126498 125965 126083 125836 124511 122499 120559 118837
56737 118837 117301 116477 116668 117054 116787 116462 117121 118194 118167 117186 117170 118960 121031 121765 121565 121900 123328 125405
56719 125405 127706 130070 132334 134403 136273 137731 138591 139344 140850 143160 145369 146776 147414 147353 146515 145417
56703A45417l19O68O34k13n96o1O14O78M9j037k119k499j969j151n31J83J043
56686A38791J227L78m48k59L28L23J37O91J592J800J467J409J398N78p57j451
56670A47204j201n78K35J226J655R92L13J000K401K598J307J53P1L35L04L59P14
56653A59088Q55O06M97P59J051J309J731J897J191N4m16j22P0o9%J75k91j215
56635A67170j474q61n44j185j991k082j710j449j250q26l07n7l40j188k126k250
56619A47530j260j22O2n33j039j246j338j010j26L72k48r17j37J562K380K035
56603A45965J766J765R30p07j526q67j9l1l36k52j43l29l54o0k4l10j61N28Q42
56584A46677M88L24O94Q04L45K12P74J030M59J91J157K395K407J298L65L19R24
$$ plain form
56703 145417 145098 145766 146400 146187 145591 145530 146144 146822 146871 145834 143715 141216 139247 138096 137565 137748 138791
56686 138791 140018 140396 139948 139689 140017 140340 140477 141168 142760 144560 146027 147436 148834 149412 148655 147204
56670 147204 146003 145425 145660 146886 148541 149533 149846 150846 153247 155845 157152 157305 157376 157711 158015 158374 159088
56653 159088 159943 160549 161046 161805 162856 164165 165896 167793 168984 169038 168622 168500 168570 168501 168501 168676 168385 167170
56635 167170 165696 164835 164291 163106 161115 159033 157323 155874 154624 153798 153491 153434 153094 151906 149780 147530
56619 147530 146270 146148 146210 145677 144638 143392 142054 141044 140918 141290 141042 140125 139988 141550 143930 145965
56603 145965 147731 149496 150426 149719 148193 147326 147307 147276 146940 146688 146545 146216 145862 145802 145778 145468 145307 145835 146677
56584 146677 147165 147489 148183 148987 149332 149544 150318 151348 151807 151998 153155 155550 157957 159255 159620 159939 160863
56567A60863J776K565L055L499M482N921O901P050P213Q184R457R828Q725O436
56553B45955L621R65j130k749m054m749m542l849l304k876k369k285l002l587
56539B12045k963j896k027l179l547k617j750j580j086J17P29L2p77o33l03p18
56523A89847j212p88Q7L08j95p29r33p39j21L36l06j823k636j922p00j30l2P0
56505A78382j72r44j402r53k79o9J25P18R41J76p04o27m7k1m25l92N0J88o7k18
56485A74260j53l2L44J165J926J977J393P01K08J15O36J456J708J121N69Q41J667
56468A89902K409K870K872J961K61j223j828j923j886j382l74K55j00p52p99l40
56452A89923R3M79Q51P69O2n84n44j09J87L39M61L87J97L59Q79J117Q40N14L20
$$ plain form
56567 160863 162639 165204 168259 171758 176240 182161 189062 196112 203325 211509 220966 230794 239519 245955
56553 245955 249576 250541 249411 246662 242608 237859 233317 229468 226164 223288 220919 218634 215632 212045
56539 212045 209082 207186 205159 201980 198433 195816 194066 192486 191400 191517 192246 192278 191501 190868 190565 189847
56523 189847 188635 187847 187934 188242 188047 187318 186385 185646 185525 185861 185555 183732 181096 179174 178474 178344 178312 178382
56505 178382 178210 177266 175864 174911 174632 174563 174688 175406 176347 176523 175819 175192 175145 175124 174699 174307 174357 174545 174478 174260
56485 174260 174107 174075 174419 175584 177510 179487 180880 181581 181789 181904 182540 183996 185704 186825 187394 188235 189902
56468 189902 192311 195181 198053 200014 200275 199052 197224 195301 193415 192033 191659 191914 191814 191062 190263 189923
56452 189923 190016 190495 191346 192115 192177 191593 191049 190940 191127 191466 191927 192314 192511 192870 193749 194866 195706 196220 196540
56433A96540l4l66j11M15L35k2N81J862J963M49p04j96O80M34k59k43j7m15p37
56414B00155o8Q42Q70M39M71N91J19k99J17N45j12j122r86J27Q89R95J160J482
56396B06215J477J241J110P99J99J97J292K304K001J076Q55J091P89L61Q34J688
56380B23529J547O03K85Q27J098P49O21J016J214Q21K31k15l94L1R93J415N33
56363B34904o36n90M55J077R76J063J582J759J280O69K60O0M19J554K629K560
56347B50021J581Q30P38R65J463K266K644J891O46J20L59N61O76J297K255K775
56331B71088K788K809K739K142J489J752K869L779L872L379K517J383M16O3J72
56316C03257M24R03J506J549Q26K50M90R02Q39R39J949L283M069M542N121N220
$$ plain form
56433 196540 196506 196140 196029 196444 196779 196757 197338 199200 201163 201612 200908 200712 201392 201826 201567 201324 201307 200892 200155
56414 200155 200087 200929 201799 202238 202709 203300 203419 203120 203237 203782 203670 202548 201562 201689 202578 203573 204733 206215
56396 206215 207692 208933 210043 210842 211041 211238 212530 214834 216835 217911 218766 219857 220646 221007 221841 223529
56380 223529 225076 225679 225964 226791 227889 228638 229259 230275 231489 232310 232541 232326 231932 231963 232956 234371 234904
56363 234904 234268 233678 234133 235210 236186 237249 238831 240590 241870 242539 242799 242859 243278 244832 247461 250021
56347 250021 251602 252432 253170 254135 255598 257864 260508 262399 263045 263165 263524 264085 264761 266058 268313 271088
56331 271088 273876 276685 279424 281566 283055 284807 287676 291455 295327 298706 301223 302606 303022 303085 303257
56316 303257 303681 304584 306090 307639 308465 308715 309205 310107 310946 311885 313834 317117 321186 325728 330849 336069
56300C36069M461L873M299M778M111K869K138J563N94L48J924L973M353L411L235
56285C81999M314N391O007O845P870Q391Q693R490J0334J0497J0809J2374J4176
56272D97190J4460J3815J4319J6098J7466J8099J9336K1401K3126K4525K6996
56261G06831L0670L4119L7000M0619M5587N1142N7089O4190P2389Q0856Q9955
56250A310447J00897J13294J25301J36378J47581J58901J68772J76492J82783
56241B620846J87398J88525J85117J77714J66450J50391J29389J04590P6740M5960
56231D033120J3565j8043m7660p5455j00650j21356j37099j49299j58644j64190
56221C074289j65570j63981j60365j54638j47282j39692j32341j24447j15888
$$ plain form
56300 336069 340530 344403 348702 353480 357591 360460 362598 364161 364755 365103 367027 371000 375353 378764 381999
56285 381999 386313 391704 397711 404556 412426 420817 429510 439000 449334 459831 470640 483014 497190
56272 497190 511650 525465 539784 555882 573348 591447 610783 632184 655310 679835 706831
56261 706831 737501 771620 808620 849239 894826 945968 1003057 1067247 1139636 1220492 1310447
56250 1310447 1411344 1524638 1649939 1786317 1933898 2092799 2261571 2438063 2620846
56241 2620846 2808244 2996769 3181886 3359600 3526050 3676441 3805830 3910420 3987160 4033120
56231 4033120 4046685 4028642 3980982 3905527 3804877 3683521 3546422 3397123 3238479 3074289
56221 3074289 2908719 2744738 2584373 2429735 2282453 2142761 2010420 1885973 1770085
56212A770085j07607r9836r1946q4284p8078p3143o7845o1759n6260n2024m8031
56201I49272m3517l8985l4920l1301k8539k6917k5205k1956j8100j5922j5520
56190F48390j4826j3052j1407j0287q737o916o202o382n684m023l265l731l572
56177E50306k306j730k422k560j373n87j061j071M49J833J622J031J634K875L619
56162E50259M157N048N754N843N909O268O386O351P116Q656R865J0684J2222J4450
56148F58968J6239J7999K1525K6756L1658L5864M1346M8741N6199O2828P0114
56137A088237P8679Q6665R2522R6378R7518R3709Q4596P2931O1224N0026M0441
56126A942926L4792L3060L1743K7904K1658J3539K931r144j9099k4802k8021l1338
$$ plain form
56212 1770085 1662478 1562642 1470696 1386412 1308334 1235191 1167346 1105587 1049327 997303 949272
56201 949272 905755 866770 831850 800549 772010 745093 719888 697932 679832 663910 648390
56190 648390 633564 620512 609105 598818 590081 583165 576963 570581 564897 560874 557609 553878 550306
56177 550306 548000 546270 543848 541288 539915 539328 538267 537196 537645 539478 541100 542131 543765 546640 550259
56162 550259 554416 559464 565218 571061 576970 583238 589624 595975 603091 611747 621612 632296 644518 658968
56148 658968 675207 693206 714731 741487 773145 809009 850355 899096 955295 1018123 1088237
56137 1088237 1166916 1253581 1346103 1442481 1539999 1633708 1718304 1791235 1852459 1902485 1942926
56126 1942926 1977718 2010778 2042521 2070425 2092083 2105622 2108553 2099409 2080310 2055508 2027487 1996149
56114A996149l5557m1403n0428o2213p3577q2185q8156r1071q9016q2236p4109
56103A226198o6572n8064m7794l8279l1459k5896k0186j5636j3191j1116q214
56092H89791o086n737n251l219j293r83j128o65n57q34N98L931O054N587N468
56077H85676P928J0906J2295J3707J6836J9930K1203K2295K5039K8179L0221L2133
56065A126348L4184L3864L0051K5677K3219K1202J8052J5443J4592J3389J0509
56054A366530Q339Q508Q657P087O185P681Q934P859P031Q862J1206J1861J2951
56041A481691J6430J9703K0271K0320K2309K4294K4246K4436K6978K9497K9824
56030A739999L0333L2988L5012L4331L4179L7191M0191M0089L9625M1764M3953
$$ plain form
56114 1996149 1960592 1919189 1868761 1806548 1732971 1650786 1562630 1471559 1382543 1300307 1226198
56103 1226198 1159626 1101562 1053768 1015489 984030 958134 937948 922312 909121 898005 889791
56092 889791 883705 877968 872717 869498 868205 867222 866094 865429 864872 864038 864636 868567 874621 880208 885676
56077 885676 893604 904510 916805 930512 947348 967278 988481 1010776 1035815 1063994 1094215 1126348
56065 1126348 1160532 1194396 1224447 1250124 1273343 1294545 1312597 1328040 1342632 1356021 1366530
56054 1366530 1374869 1383377 1392034 1399121 1405306 1412987 1421921 1429780 1436811 1445673 1456879 1468740 1481691
56041 1481691 1498121 1517824 1538095 1558415 1580724 1605018 1629264 1653700 1680678 1710175 1739999
56030 1739999 1770332 1803320 1838332 1872663 1906842 1944033 1984224 2024313 2063938 2105702 2149655
56019B149655M3716M4255M8367N2519N3327N4177N8733O3752O5352O6528P1157
56008B771538P6430P8683Q0835Q6278R1554R3098R5033J01833J09562J13205J16218
55997C814267J23705J32598J38239J44110J55044J67279J75535J83450J96508
55988E230735K11433K23390K36518K56070K77604K95689L15460L43197L73971
55979G764067M01658M32280M73454N20043N65176O15506O79564P51722Q25279
55970A3028749R10344J019715J148777J290214J456653J666407J920174K217596
55962B4658629K584758L059110L661485M412504N360741O559602Q027879R762393
55954F8087101J1766746J4031424J6519066J9219628K2175381K5371147K8627978
$$ plain form
56019 2149655 2193371 2237626 2285993 2338512 2391839 2446016 2504749 2568501 2633853 2700381 2771538
56008 2771538 2847968 2926651 3007486 3093764 3185318 3278416 3373449 3475282 3584844 3698049 3814267
55997 3814267 3937972 4070570 4208809 4352919 4507963 4675242 4850777 5034227 5230735
55988 5230735 5442168 5665558 5902076 6158146 6435750 6731439 7046899 7390096 7764067
55979 7764067 8165725 8598005 9071459 9591502 10156678 10772184 11451748 12203470 13028749
55970 13028749 13939093 14958808 16107585 17397799 18854452 20520859 22441033 24658629
55962 24658629 27243387 30302497 33963982 38376486 43737227 50296829 58324708 68087101
55954 68087101 79853847 93885271 110404337 129623965 151799346 177170493 205798471
55947B05798471L1662899L4114405L5245377L3640200K7661109J6726949K288359
55940C87137769j2623687k4983376l3102062l6822114l6925521l4532481l0763310
55933A77385218k6528189k2405884j8683375j5484516j2838673j0690101q941025
55926F1813455p515117o362785n427390m649364l997212l460689l018373k639668
55918B4742857k311550k035559j802894j596354j411926j255732j123328j002408
55910A2203106q91926p99271p22026o50341n83996n30074m86730m45312m05643
55901F687787l74017l48683l21880k93918k71400k53649k34126k13351j97620
55892D179143j86507j73743j59072j47674j39199j28519j16270j07916j03267
$$ plain form
55947 205798471 237461370 271575775 306821152 340461352 368122461 384849410 387137769
55940 387137769 374514082 349530706 316428644 279606530 242681009 208148528 177385218
55933 177385218 150857029 128451145 109767770 94283254 81444581 70754480 61813455
55926 61813455 54298338 47935553 42508163 37858799 33861587 30400898 27382525 24742857
55918 24742857 22431307 20395748 18592854 16996500 15584574 14328842 13205514 12203106
55910 12203106 11311180 10511909 9789883 9139542 8555546 8025472 7538742 7093430 6687787
55901 6687787 6313770 5965087 5643207 5349289 5077889 4824240 4590114 4376763 4179143
55892 4179143 3992636 3818893 3659821 3512147 3372948 3244429 3128159 3020243 2916976
55883B916976r6936q8479q2501p9621p6431p3454p4165p6905p6357p2391o9415
55872B050321o7957o4872o0789n9249n9284n6626n1623m8495m7443m4794m0354
55861A448835l7462l6328l4225l1642l1561l3170l2794l0516k9482k9506k7699
55850A094450k4724k3961k5060k4674k2973k3206k5262k5803k4553k4377k5430
55839H24427k4998k2973k1862k1615j9993j7618j7174j8029j7174j5029j4691
55828F13271j5924j5608j3784j3344j3920j1933o978k404O62M288Q391J0150R354
55815E52221Q999R698Q761N657L345L123K985K079K162L585M322M042M816O882
55801F22677P825O961O408O973O868N313L521J523k116o841j0287j2314j4887
$$ plain form
55883 2916976 2820040 2731561 2649060 2569439 2493008 2419554 2345389 2268484 2192127 2119736 2050321
55872 2050321 1982364 1917492 1856703 1797454 1738170 1681544 1629921 1581426 1533983 1489189 1448835
55861 1448835 1411373 1375045 1340820 1309178 1277617 1244447 1211653 1181137 1151655 1122149 1094450
55850 1094450 1069726 1045765 1020705 996031 973058 949852 924590 898787 874234 849857 824427
55839 824427 799429 776456 754594 732979 712986 695368 678194 660165 642991 627962 613271
55828 613271 597347 581739 567955 554611 540691 528758 521780 519376 520038 524326 532717 542867 552221
55815 552221 561220 570918 579679 585336 588681 591804 594789 596868 599030 602615 606937 610979 615795 622677
55801 622677 630502 637463 643871 650844 657712 663025 666546 668069 665953 659112 648825 636511 621624
55788F21624j7568j7471j4403j1681j0913j0203q582p900r029j0157j0261j0539
55776D82917j1048r715o191l113j975r41J750N268Q185R937R221M348l410r856
55762D75377j2640j3368j4022j4341j3772j2989j2198j0637q698p888p968p047
55750C39809n165m602n844o615n860n303n790n563l631j747j319j346r55j184
55736B84885k569l645l452l047l110k638j379q92j732k265j683j562k819l864
55722B50228l433k758l100l555l082k384k068j116R80K744L094L181M126M993
55708B47850M766M306M468M209K380j88k140l482m521m657l812l405m217m926
55694B36631m351l508l703m225l683k288j032J16J574K799L158L221L803M644
$$ plain form
55788 621624 604056 586585 572182 560501 549588 539385 530803 522903 513874 503717 493456 482917
55776 482917 471869 462154 455963 452850 450875 449934 451684 456952 465137 475074 484295 488643 485233 475377
55762 475377 462737 449369 435347 421006 407234 394245 382047 371410 362712 354824 346856 339809
55750 339809 334644 330042 324198 317583 311723 306420 300630 295067 291436 289689 288370 287024 286069 284885
55736 284885 282316 278671 275219 272172 269062 266424 265045 264153 262421 260156 258473 256911 254092 250228
55722 250228 246795 244037 240937 237382 234300 231916 229848 228732 229712 232456 235550 238731 242857 247850
55708 247850 252616 256922 261390 265599 267979 267791 265651 262169 257648 252991 249179 245774 241557 236631
55694 236631 232280 228772 225069 220844 217161 214873 213841 213957 215531 218330 221488 224709 228512 233156
55680B33156N128N304N288M786M075M124M849M734L133J424P72M57m19j131p72
55665B74908jM2m79p76p58n62J93J554K694L120L260L220K314O78k41J69O13m2
55647B89906j217k228l691n947p708p844p207p223p815q139q113p905p082n694
55633B02093m981n633o436n994m756l916l427k556j472q85q01q59j161j659j636
55618A55921q45k34n97j416k008k611l371l427k322j112q46r92o26j20k95q72
55602A34227j111j126j286j209n91j49n30j113j100q46r36q97k06M11Q4n84n03
55585A22535Q2J91r9M4N63O08J1n44o35l62K03R42J401J338J152J165J079P32
55567A30406O64J158J551J281Q52R44J292J278Q37Q0j080k181k160r36J6l64j170
$$ plain form
55680 233156 238284 243588 248876 253662 257737 261861 266710 271444 274577 276001 276773 277230 276811 275680 274908
55665 274908 274907 274949 274470 273694 272936 272374 272567 274121 276815 279935 283195 286415 288729 289407 289166 289335 289948 289906
55647 289906 288689 286461 282770 276823 269115 261271 254064 246841 239026 230887 222774 214869 207787 202093
55633 202093 197112 191479 185043 179049 174293 170377 166950 164394 162922 162037 161236 160377 159216 157557 155921
55618 155921 155076 154842 154245 152829 150821 148210 144839 141412 139090 137978 137132 136140 135514 135394 135099 134227
55602 134227 133116 131990 130704 129495 128904 128755 128225 127112 126012 125166 124230 123333 123127 123538 123622 123038 122535
55585 122535 122617 122808 122709 122753 123316 123924 123935 123391 122756 122394 122597 123539 124940 126278 127430 128595 129674 130406
55567 130406 131070 132228 133779 135060 135912 136856 138148 139426 140263 140343 139263 137082 134922 133986 134002 133638 132468
55550A32468j000%P14Q53R65J355J943K626K960K328J124Q02J879L063L134K570
55534A57784K238J800P01m51q97j057j548j899j602j436k229l249l351k848k765
55519A39191l051k991k722k747k753k251j756j876k042j585j171j623k180j702
55505A08741p98q43j539j479o86m90j096j301p36m53r72j409r72LQ94J506J668
55488A00038J131J72n68q50q49n74q1Q3m21r61p63j36O2k05l26j51L0K25N30O30
55468I7016L96L22N52L24o42j202n65J18n01j632j553m04K30QrM37N01M9j14P6
55448I3407j13n77m13K15P9j051j916j683q71j23N02Q72P80P58J459K199J651
55431I5175L2j020r02o02n76KJ302J970J089l86j084q68l28K70O91M97k09o79
$$ plain form
55550 132468 131468 131468 132182 133035 134000 135355 137298 139924 142884 145212 146336 147138 149017 152080 155214 157784
55534 157784 160022 161822 162523 162072 161175 160118 158570 156671 155069 153633 151404 148155 144804 141956 139191
55519 139191 136140 133149 130427 127680 124927 122676 120920 119044 117002 115417 114246 112623 110443 108741
55505 108741 107943 107100 105561 104082 103396 102906 101810 100509 99773 99320 98348 96939 95967 95970 96864 98370 100038
55488 100038 101169 101341 100773 99923 99074 98500 98419 98502 98081 97120 96357 96221 96283 96078 95752 95601 95631 95856 96386 97016
55468 97016 97412 97734 98286 98610 97968 96766 96201 96319 95818 94186 92633 92229 92459 92467 92458 92895 93396 93445 93331 93407
55448 93407 93294 92717 92304 92519 92598 91547 89631 87948 87077 86954 87456 88328 89108 89866 91325 93524 95175
55431 95175 95207 94187 93285 92683 92107 92109 93411 95381 96470 96084 95000 94132 93804 94074 94765 95262 95053 94374
55413I4374o15m86m39J8Q33J075L64m50n98l63k39j10J10pn77j007r52q31r16
55394H9184p84k26J88K2l26l72k17MN06J156J182J94j128j871j786j064O9J172
55376H5903J688J662J632J605R56l46j405j648j506j380r40n9N31K97j53o5L27
55359H7099M30M12P76J226R99J32m38r7P19J144Q12R4m18n22n29p53j066j104
55341H8916p36j13N21Q09M53j90j73P36J399P45o11j203p44j46J77O40J159J001
55323I2640J80l64l45n80j378j786j139j81J36K1J33L73K86PL1M14Q26J006P70
55304I1050K7p81q49j5R20J162P14l1p88j231j079o36n30o48j42J122K043J702
55286I2010N51l05l04N01J749K600K054J60j663k137j411m89k0j33p46j430j529
$$ plain form
55413 94374 93759 93273 92834 92852 93685 94760 95124 94674 94076 93713 93474 93364 93474 93467 92890 91883 90931 90100 89184
55394 89184 88400 88174 88362 88384 88058 87686 87469 87473 87979 89135 90317 90511 89383 87512 85726 84662 84731 85903
55376 85903 87591 89253 90885 92490 93446 93100 91695 90047 88541 87161 86221 86162 86693 86990 86837 86772 87099
55359 87099 87529 87941 88717 89943 90942 91074 90636 90539 91258 92402 93214 93308 92890 92368 91839 91086 90020 88916
55341 88916 88180 88067 88588 89397 89850 89660 89487 90223 91622 92367 91756 90553 89809 89663 89840 90480 91639 92640
55323 92640 92820 92456 92111 91531 90153 88367 87228 87047 87183 87204 87337 87710 87996 88003 88034 88448 89274 90280 91050
55304 91050 91077 90296 89447 89432 90352 91514 92228 92197 91409 90178 89099 88463 87933 87285 87143 88265 90308 92010
55286 92010 92561 92256 91952 92453 94202 96802 98856 99016 97353 95216 93805 93316 93296 93163 92417 90987 89458
55269H9458r56l65j54M3N15Q92Q94P99P00J79o58q11R9R11N21m14n95j19p0m84
55249I0385k64Q55J682J246Q9o59p10n42m28j95K26M82J75n76j146j043m52J7
55231H9142L2k27m27l48J00P93J301J304J042R85J139J054M75m64j487k099j642
55214I0673j65J096J014J57j9O32Q43Q1o45n36j55j59j90K81R36J237J210R96
55196I7287M63j68l53l13r97k280k565j037R37J719J500J289J037K79m07k52J12
55179I6251m54j603k011j426o49J34J281K224J847M75k69J81O05J01o36o77k09
55162I5165K11O50J241J492R82J41l90o45r78j266j072m12K27M86M50M06M76M60
55144I7624M4o89j146q68k09Q2j74m77m56l51n20r26j209j021k52P26J211Q38
$$ plain form
55269 89458 88502 88137 87983 88026 88541 89433 90327 91126 91826 92005 91347 90536 90635 91546 92067 91653 91058 90939 90869 90385
55249 90385 90121 90976 92658 93904 93993 93334 92624 92082 91654 91459 91685 92167 92342 91766 90620 89577 89125 89142
55231 89142 89174 88947 88520 88172 88272 89065 90366 91670 92712 93697 94836 95890 96365 95901 94414 92315 90673
55214 90673 90508 91604 92618 92775 92756 93388 94231 94312 93667 93131 92976 92817 92627 92908 93844 95081 96291 97287
55196 97287 97750 97582 97229 96916 95919 93639 91074 90037 90974 92693 94193 95482 96519 96798 96391 96139 96251
55179 96251 95797 94194 92183 90757 90108 90242 91523 93747 95594 96069 95800 95981 96586 96687 96051 95374 95165
55162 95165 95376 96026 97267 98759 99741 99882 99492 98847 97869 96603 95531 95119 95346 95832 96282 96688 97164 97624
55144 97624 97668 96979 95833 94965 94756 94838 94664 94187 93731 93380 92860 91934 90725 89704 89452 90178 91389 92227
55126I2227R6j89J51N23M26L1j56O0L99L86j15o50o19o6L43K50O9K03M01L14K01
55105I4285M07O17M41L18R45J974K246J406L74J10O18J368J997K255J899J029
55089A12289J73k23j72Q2L19L52J29j36k57l85p02r35p38l87m88r24q55O6J151
55070A08359J596J364Q52K67k56l44J85Q81J089P53L67J96k9o07j350j787j713
55053A09823j354j007p47n41m71n73o37m74l42o36j162j225o60k27n81j346j730
55036I6110j582j228o17N06J688J949J094J91L04J244J909J626P71J27j9l5l41
55019A03697q10r30m74K73Q57J040P53O1o79r79p63m21k14qJ89M3m21m88L18J420
54999A02464J937J890J907K039J689P62M4J90Q13R58K41o71p55J65J036P50l73
$$ plain form
55126 92227 92323 92134 92285 92808 93234 93265 93109 93169 93568 93954 93839 93189 92570 92504 92847 93097 93166 93369 93770 94084 94285
55105 94285 94692 95309 95750 96068 97013 98987 101233 102639 103013 103123 103741 105109 107106 109361 111260 112289
55089 112289 112462 112239 112067 112149 112468 112820 112949 112813 112556 112171 111469 110534 109796 109409 108921 107997 107142 107208 108359
55070 108359 109955 111319 112171 112438 112182 111838 112023 112904 113993 114746 115113 115309 115280 114673 113323 111536 109823
55053 109823 108469 107462 106715 106174 105703 105130 104493 104019 103677 103041 101879 100654 99994 99767 99186 97840 96110
55036 96110 94528 93300 92683 93189 94877 96826 97920 98111 98415 99659 101568 103194 103965 104092 104073 104038 103697
55019 103697 102887 101957 101483 101756 102613 103653 104406 104467 103788 102809 102046 101625 101411 101403 101592 101635 101214 100726 101044 102464
54999 102464 104401 106291 108198 110237 111926 112688 112732 112922 113735 114693 114934 114263 113508 113673 114709 115459 115086
54982A15086r20l55K51l0n06o5R60J343R41P50J086J126M34l01m47l33m57o93
54964A17870p52p51p64m84K16Q99J151J087R05M95j00m06j78R0j48p05j020r32
54946A16473o26k08J77J24m55q58l57O73J085N08j65l1O60J023Q16O24R59J701
54928A22123K530L325L964M192M127M457N610O942P486P345P512Q166Q149O568
54914B02496M074J832n6k219m620o498p459p742p532o845o075n754n716n311m504
54899A38071l958l865l556k531j177j15M86P02N81M97J052K226L127L087K591
54884A37218K606L293L930L841L106K484K851M443O465P668P537O585N427M082
54870B01536K449Q74l14j405k897m702o240p169p556p456o858n996n228m626m012
$$ plain form
54982 115086 114166 113811 114062 114032 113526 113461 114421 115764 116705 117455 118541 119667 120101 119800 119353 119020 118563 117870
54964 117870 117118 116367 115603 115119 115335 116234 117385 118472 119377 119872 119772 119366 119188 119278 119130 118425 117405 116473
54946 116473 115847 115639 115816 115940 115485 114627 114270 114943 116028 116536 116371 116340 117000 118023 118839 119463 120422 122123
54928 122123 124653 127978 131942 136134 140261 144718 150328 157270 164756 172101 179613 187779 195928 202496
54914 202496 206570 208402 208346 206127 201507 195009 187550 179808 172276 165431 159356 153602 147886 142575 138071
54899 138071 134113 130248 126692 124161 122984 122869 123355 124057 124638 125135 126187 128413 131540 134627 137218
54884 137218 139824 143117 147047 150888 153994 156478 159329 163772 170237 177905 185442 192027 197454 201536
54870 201536 203985 204859 204545 203140 200243 195541 189301 182132 174576 167120 160262 154266 149038 144412 140400
54855A40400l410l053k905k572j888j224r78j046j042r40j059j458j689j412r79
54840A14745j072j784k324j838l61J134J645J090L83M34J041J060j08j499j664
54825A10882n05O59R16P18P30O78J1r62j428j187n74K60J258J892J595O66l2k28
54807A15349l03l10J68J094J716J501O93k09q39p59K90J599J816N39r61j216k77
54790A19891N78N07j22m68j58N64J211J423J125N18J3O5P83J628J881J589J626
54773A32654K487L492L787L711M307N696O841P023O684O576O797P017O995O557
54759B10624N466L656J294j471m413o929q396q884q962q757p880o387m988m105
54745A49868l408k627k036j762j378o54j50m08j029j196p38j49J86L17M46P03
$$ plain form
54855 140400 136990 133937 131032 128460 126572 125348 124370 123324 122282 121342 120283 118825 117136 115724 114745
54840 114745 113673 111889 109565 107727 107366 108500 110145 111235 111618 112052 113093 114153 114045 112546 110882
54825 110882 110377 111036 111952 112670 113400 114078 114089 113127 111699 110512 109938 110198 111456 113348 114943 115609 115577 115349
54807 115349 115046 114736 114904 115998 117714 119215 119908 119699 118860 118101 118391 119990 121806 122345 121384 120168 119891
54790 119891 120469 120976 120854 120386 120228 120792 122003 123426 124551 125069 125082 125147 125930 127558 129439 131028 132654
54773 132654 135141 138633 142420 146131 150438 156134 162975 169998 176682 183258 190055 197072 204067 210624
54759 210624 216090 219746 221040 219569 215156 208227 199831 190947 181985 173228 165348 158961 153973 149868
54745 149868 146460 143833 141797 140035 138657 138003 137853 137445 136416 135220 134482 134333 134519 134836 135282 135985
54729A35985J152J784K611L769N232O468O892O671O518O572O260N402M625M161
54715B04102L118O91k431m724n632n981o705p767q360p843o378m842l971l605
54701A39672l019j996j041m96q6L99N92K08m15q98j421k162k626k200j113k23
54685A23175o1n10j200j716j615q23J17N53M13R7q7r4L1J77K05J91L62O08M57
54666A20280k35r66j264j214r75l29P32J465J131O9o42m81J16N23N65L94J29k16
54648A19082o54j040r98l14N65Q00J78n86p61l95N3L77N22L42j45n58o49o11n75
54629A14633k67M31J006R46M12r2m19o48o95m92k45q0J40L81L06q1j92K38P36
54610A16018R26J098J343J057R9m89Q5R34P24k74o97k32J67L0o9J94L28M2k57
$$ plain form
54729 135985 137137 138921 141532 145301 150533 157001 163893 170564 177082 183654 189914 195316 199941 204102
54715 204102 207220 207911 205480 200756 195124 189143 182438 174671 166311 158468 152090 147248 143277 139672
54701 139672 136653 134657 133616 133120 133034 133433 134025 134233 133818 132920 131499 129337 126711 124511 123398 123175
54685 123175 123114 122604 121404 119688 118073 117250 117367 117920 118333 118430 118343 118249 118280 118457 118662 118853 119215 119823 120280
54666 120280 120045 119079 117815 116601 115626 115297 116029 117494 118625 118694 118052 117571 117687 118210 118775 119169 119298 119082
54648 119082 118428 117388 116390 116076 116641 117441 117619 117033 116272 115877 115930 116307 116829 117171 117026 116468 115819 115208 114633
54629 114633 114366 114797 115803 116749 117161 117069 116650 116002 115307 114815 114570 114490 114630 115011 115317 115236 115044 115282 116018
54610 116018 116944 118042 119385 120442 120541 120052 120137 121071 121795 121521 120824 120592 120759 120789 120720 120914 121242 121284 121027
54591A21027k45p6K35Q53J416J147Q0p34n88O2M26L01j54q24j396j384p97k39
54573A19110l2K01P21J090Q34K60K7K95O98R36R28O80L11R9J39J20l07r66j217
54554A23927o32M50J146Q67p0p58o40J0N52O30L63K27P83K080L221L090J745L83
54536A37374k28n23r37j003l75J79j16p07o40j95l17r02j031o06l42l23M8O01
54518A29957M33m94j083p80k22K7J41J02n55j549j718p00L84N88L67M56O25L87
54500A26366L5j2r7o35j215j251r46p71n21K69J395K209K435K155J454O27K41
54483A31738L49J85o83j469j228k62M03M93N75Q41P90J35o49q71l00P08J517J768
54465A34040J730J878K045J551L54o77r07o72m14lM99L68o18j363r62k72p08j939
$$ plain form
54591 121027 120782 120706 120941 121794 123210 124357 124437 123703 123115 123177 123603 123904 123750 122926 121530 120146 119349 119110
54573 119110 119078 119279 120000 121090 121924 122184 122211 122506 123204 124140 125068 125748 126059 126158 126297 126417 126110 125144 123927
54554 123927 123295 123745 124891 125758 125688 124930 124290 124300 124852 125482 125845 126072 126855 128935 132156 135246 136991 137374
54536 137374 137146 136623 135686 134683 134308 134487 134371 133664 133024 132829 132512 131610 130579 129973 129631 129308 129356 129957
54518 129957 130390 129896 128813 128033 127811 127838 127979 128081 127526 125977 124259 123559 123943 124531 124898 125354 125979 126366
54500 126366 126401 126389 126292 125657 124442 123191 122245 121474 120953 121222 122617 124826 127261 129416 130870 131497 131738
54483 131738 132087 132272 131589 130120 128892 128630 129033 129526 130101 130942 131732 131867 131218 130347 130047 130755 132272 134040
54465 134040 135770 137648 139693 141244 141598 140921 140014 139342 138928 138925 139424 139792 139174 137811 136849 136577 135869 133930
54447A33930k238j000N36J147R42N33O1m68p70p97r65j407j526q14M14J413J809
54430A30800J654J087K94m13p79p43l12M43J230J664J655J412J050N43Q8J06O35
54413A40414J063P46k09j040j119n09K25O53Q23R77J122J123J058J109J051L90
54397A47877p73j497j030K57J381J814J659J128M17j42l30l97o16p54m26J98N44
54380A49310L62k29j085j831j619J0K093L044K506J612J239J036N62L85J185K399
54364A60979K762J938Q86N87J058J717K185K461K628K727K809K907K904K577J858
54349A92983R82K19m50j257k232l087l584l747l643l266k902l049l713m050l391
54334A55813k234j637j763j820j383r38r08r39n90j08N6O2L54P88P34P7m64k10
$$ plain form
54447 133930 131692 130692 131228 132375 133317 133850 133911 133443 132673 131876 130911 129504 127978 127164 127578 128991 130800
54430 130800 132454 133541 133835 133422 132643 131900 131588 132031 133261 134925 136580 137992 139042 139585 139673 139779 140414
54413 140414 141477 142223 142014 140974 139855 139346 139571 140224 141047 142024 143146 144269 145327 146436 147487 147877
54397 147877 147104 145607 144577 144834 146215 148029 149688 150816 151233 151091 150761 150364 149748 148994 148568 148766 149310
54380 149310 149672 149443 148358 146527 144908 144918 147011 150055 152561 154173 155412 156448 157010 157395 158580 160979
54364 160979 163741 165679 166565 167152 168210 169927 172112 174573 177201 179928 182737 185644 188548 191125 192983
54349 192983 193965 194184 193734 192477 190245 187158 183574 179827 176184 172918 170016 166967 163254 159204 155813
54334 155813 153579 151942 150179 148359 146976 146038 145130 144191 143601 143493 143549 143611 143965 144753 145487 145564 145100 144890
54316A44890O48J263J122N31J86L81P51P26R3q91j688j744r12J95N52j75j107
54299A44821j180m89m9k65m53nO59Q34O30O86J084J272R54M78J56j91p50j117
54281A47075o82M13J205R47L8m05J46J094J510J133L71m17j142j616j515q67j93
54264A47095J46M09R65J520J401N85n7J49P75Q79L50O8O32J491J717J191N32J48
54246A59996q6l02m50o47j055j338r81k48j21q54j440j022j35J88q8k91l03m90
54228A50333o77k55O85J376J563J758K126K105J448P18L69P1n02j013j111j155
54212A57839j614k190k214j581p89k41l2j65n02o41k55N46J416K103K353J824
54196A55857N53p79j438j371j006o26k50L5J53K29L76M79M33L83L63N5o40j066
$$ plain form
54316 144890 145538 146801 147923 148454 148640 149021 149772 150498 150591 149700 148012 146268 145356 145551 146103 145928 144821
54299 144821 143641 143152 143103 142838 142385 142380 143039 143873 144503 145189 146273 147545 148499 148977 149133 148942 148192 147075
54281 147075 146393 146806 148011 148958 148996 148591 148737 149831 151341 152474 152845 152428 151286 149670 148155 147288 147095
54264 147095 147241 147650 148615 150135 151536 152121 152064 152213 152988 153867 154217 154285 154917 156408 158125 159316 159848 159996
54246 159996 159910 159608 159158 158511 157456 156118 155137 154889 154768 153914 152474 151452 151317 151505 151417 151126 150823 150333
54228 150333 149656 149401 150086 151462 153025 154783 156909 159014 160462 161180 161549 161620 161118 160105 158994 157839
54212 157839 156225 154035 151821 150240 149451 149210 149178 149013 148511 147870 147615 148161 149577 151680 154033 155857
54196 155857 156410 155631 154193 152822 151816 151190 150940 150975 151128 151357 151733 152212 152645 153028 153391 153446 152806 151740
54178A51740n20O53J298Q28j86q03o30Q8Q05J019N89j06n93q31j069j323j395
54161A49564j330j322j214o60J59N32J67l87n23l26k21k68k58j74j95k45K6P93
54143A44118J709K037J292j73j243j093j17N98O62P03J165J537J222O18N27Q76
54127A54438Q87L95J82P00J254R46l9o44k77N43Q84M46j92j71P93K115K838K516
54109A67614J559O38Pm56o79l60L90Q19L76n00q57n20k85o95j131o51O48J744
54091A67661K023J872J857J939J812J486J171R45R85J731L291M874N423M770L651
54076B05491K603J433p4j511k239k118j499q15m14n00r13j150r30n74n71r27j261
54059A94031j332j108m83N24J321J106k9q26j68J571K917K978K365K289L079L899
$$ plain form
54178 151740 151220 151873 153171 153999 153813 153010 152380 152468 153273 154292 154881 154775 154182 153351 152282 150959 149564
54161 149564 148234 146912 145698 145038 145197 145729 145896 145509 144986 144660 144439 144171 143913 143739 143544 143299 143325 144118
54143 144118 145827 147864 149156 148983 147740 146647 146530 147128 147790 148493 149658 151195 152417 153035 153562 154438
54127 154438 155325 155720 155902 156602 157856 158802 158763 158119 157842 158385 159269 159715 159523 159352 160145 162260 165098 167614
54109 167614 169173 169811 169818 169362 168683 168323 168713 169532 169908 169408 168551 168031 167746 167051 165920 165269 165917 167661
54091 167661 169684 171556 173413 175352 177164 178650 179821 180766 181751 183482 186773 191647 197070 201840 205491
54076 205491 208094 209527 209453 207942 205703 203585 202086 201271 200857 200357 199444 198294 197364 196790 196219 195292 194031
54059 194031 192699 191591 191108 191632 192953 194059 194030 193204 193036 194607 197524 200502 202867 205156 208235 212134
54043B12134L899L303L138M065N707P190Q039Q397Q568Q676Q801R078R538R904
54029C10437R760Q880P409N767M398L480K765J797M32r43j740j788j558j768k763
54014C44565m194n353n802n781n910o530p389p939p883p353o688o158n917n990
54000B55678o151n881m762l048j672j407k021k541k426k106k212k561k401j507
53986B14982n82m47j176k192k840k757j938p76J26M72M80M29J88m51j128j133
53970B01257l69L22J36o24q61n6J097J550J119O02P28J349J774J693J497J671
53954B12885K133K410K363K448L131M228N126N518N692N997O479P159Q344J0162
53940B84075J2042J3223J3769J4590J6143J7589J7538J5389J1671P289K877j203
$$ plain form
54043 212134 216033 219336 222474 226539 232246 239436 247475 255872 264440 273116 281917 290995 300533 310437
54029 310437 320197 329077 336486 342253 346651 350131 352896 354693 355125 354182 352442 350654 349096 347328 344565
54014 344565 340371 335018 329216 323435 317525 310995 303606 295667 287784 280431 273743 267585 261668 255678
54000 255678 249527 243646 238884 235836 234164 232757 230736 228195 225769 223663 221451 218890 216489 214982
53986 214982 214400 213953 212777 210585 207745 204988 203050 202274 202400 202872 203352 203781 203969 203518 202390 201257
53970 201257 200888 201210 201346 200722 199861 199805 200902 202452 203571 204173 204901 206250 208024 209717 211214 212885
53954 212885 215018 217428 219791 222239 225370 229598 234724 240242 245934 251931 258410 265569 273913 284075
53940 284075 296117 309340 323109 337699 353842 371431 388969 404358 416029 423318 426195 424992
53928D24992m551o615o983n894m311l109k166p09J370L190M186N021O480Q081
53914D18982Q667Q119P528P607P930P780P060O010M739L315J827J26j952l952
53900D83786n026n061m923n264n749n958o306p393q925r972j0130r732r219q846
53886C81282q910r548j0361j0616r954q647p259o308o040o195o193n834n547n633
53872B74237n635n044m236m012m304m193l272k298k120k555k740k301j687j417
53858B28423j418j281r92j084j894k928l297k790k033j558j176n88l8P3j03j53
53842B07163j07k82n66m39K31Q92R94N94K39L93R47J255Q02r3o22n55n05p98q23
53823B08720k6J051J487J253R11N53M9k2J063K719L426K777K023K231L005L504
$$ plain form
53928 424992 420441 413826 406843 400949 396638 393529 391363 390654 392024 395214 399400 404421 410901 418982
53914 418982 427649 435768 443296 450903 458833 466613 473673 479683 484422 487737 489564 489690 487738 483786
53900 483786 478760 473699 468776 463512 457763 451805 445499 438106 429181 419209 409079 399347 390128 381282
53886 381282 372372 362824 352463 341847 331893 323246 315987 309679 303639 297444 291251 285417 279870 274237
53872 274237 268602 263558 259322 255310 251006 246813 243541 241243 239123 236568 233828 231527 229840 228423
53858 228423 227005 225724 224732 223648 221754 218826 215529 212739 210706 209148 207972 207384 207346 207419 207316 207163
53842 207163 207056 206774 206208 205769 206000 206892 207886 208480 208719 209112 210059 211314 212116 212023 211401 210846 210341 209543 208720
53823 208720 208694 209745 211232 212485 213396 213949 213998 213976 215039 217758 221184 223961 225984 228215 231220 234724
53807B34724L743M133M608M965N494O464P432P793P656P548P490P056O196N432
53793C20734N182N253N090M296K971J688R61O52J44q57j981k809l367l862m296
53778C29799m683n236o044o797p161p194p161p173p158o952o288n111l951l498
53764B45392l692l740l246k696k559k625k651k918l506l737l047k000j495j439
53750B06041j072l64o8m40p84m96K22Q50J150J026L63o70j498j591r56p3M66L39
53732B02445k54p59q98r29j021p34L28J609K067J547J041J395K399L330L782L680
53716B19028K965J812Q13M94P26Q93O09K9m48n11k7R64K180L139L457L170K698
53699B41991K416K348K349K432K674K950L106L294L670L752K772R03n52o61NK27
$$ plain form
53807 234724 238467 242600 247208 252173 257667 264131 271563 279356 287012 294560 302050 309106 315302 320734
53793 320734 325916 331169 336259 340555 343526 345214 346175 346827 346971 346114 344133 341324 337957 334095 329799
53778 329799 325116 319880 313836 307039 299878 292684 285523 278350 271192 264240 257952 252841 248890 245392
53764 245392 241700 237960 234714 232018 229459 226834 224183 221265 217759 214022 210975 208975 207480 206041
53750 206041 204969 204605 204537 204097 203313 202817 203039 203889 205039 206065 206428 205758 204260 202669 201713 201640 202106 202445
53732 202445 202191 201432 200534 199605 198584 197850 198178 199787 201854 203401 204442 205837 208236 211566 215348 219028
53716 219028 221993 223805 224618 225112 225838 226731 227340 227369 226921 226410 226383 227347 229527 232666 236123 239293 241991
53699 241991 244407 246755 249104 251536 254210 257160 260266 263560 267230 270982 273754 274657 274105 273444 273449 273676
53683B73676l03r29j124r17m78K9L43L76M04M86M4j178k196j843n11K73l0m45
53665B65677k50R1J45L72R77J046j08j537j703n28O81J000O61K30q0k57m12q66
53647B65139j678k157j530q6J012J131P48N57O76R65J493K285L057L503L516L028
53631B81659J965O87k4K22R38J377J380J247J125J012J167J904K924L408K949
53616C03940K129J902K522L390L872M063M511N317N830N459M622M333M825N120
53602C61835M354L056K467K790K905J927L54p25r54p65n29k89j34k40m60m43j83
53585C74966n5k47n68r46j586k385k672j962p62r2l36r34j214j173j280j775k360
53568C54619k487j884p85L06J023J300J153N47m09j279j554j136m51K8K83O89
$$ plain form
53683 273676 273373 272444 271320 270403 269925 269954 270297 270673 271077 271563 271607 270429 268233 266390 265879 266152 266122 265677
53665 265677 265427 265518 265663 266035 267012 268058 267950 266413 264710 264182 264863 265863 266524 266754 266674 266417 266005 265139
53647 265139 263461 261304 259774 259688 260700 261831 262579 263136 263812 264777 266270 268555 271612 275115 278631 281659
53631 281659 283624 284311 284287 284509 285447 286824 288204 289451 290576 291588 292755 294659 297583 300991 303940
53616 303940 306069 307971 310493 313883 317755 321818 326329 331646 337476 342935 347557 351890 356715 361835
53602 361835 366189 369245 371712 374502 377407 379334 379688 378963 378009 377244 376715 376426 376292 376052 375592 375149 374966
53585 374966 374911 374664 374096 373150 371564 369179 366507 364545 363783 363691 363355 362421 361207 360034 358754 356979 354619
53568 354619 352132 350248 349463 349769 350792 352092 353245 353792 353383 352104 350550 349414 348963 348991 349274 349963
53552C49963J389J903J589N37l12j70O95J430J705J892K205K330K103J895K060
53537C71214K422K661K804L001L173L305L621M117M348M231M567N996P849Q924
53523D32233R144R487J0280J0698J0187R356Q977Q959R000R492J0989J3154J5102
53510E67058J6495J7642J8632J9198J9390J9667K0151K0387K0092J9584J9180
53499G77476J8629J7586J6352J5579J5375J5190J4655J4106J4040J4419J4783
53488I48190J4927J5025J5157J5091J4697J4307J4393J4975J5558J5614J5046
53477A112980J4198J3573J3406J3388J2815J1182Q657N933L666K102J040K2j395
53464A211567l304n414p352q924j0021j0489j0318r797r327r145r330r868j0594
$$ plain form
53552 349963 351352 353255 354844 355381 355069 354899 355594 357024 358729 360621 362826 365156 367259 369154 371214
53537 371214 373636 376297 379101 382102 385275 388580 392201 396318 400666 404897 409464 415460 423309 432233
53523 432233 441377 450864 461144 471842 482029 491385 500362 509321 518321 527813 538802 551956 567058
53510 567058 583553 601195 619827 639025 658415 678082 698233 718620 738712 758296 777476
53499 777476 796105 813691 830043 845622 860997 876187 890842 904948 918988 933407 948190
53488 948190 963117 978142 993299 1008390 1023087 1037394 1051787 1066762 1082320 1097934 1112980
53477 1112980 1127178 1140751 1154157 1167545 1180360 1191542 1200199 1206132 1209798 1211900 1212940 1212962 1211567
53464 1211567 1208263 1202849 1195497 1186573 1176552 1166063 1155745 1145948 1136621 1127476 1118146 1108278 1097684
53451A097684j1329j2193j3469j4880j5557j5155j4539j4673j5157j4729j3079
53440I42924j1212r893q737p164n419m021k900j679m82K24L35J67P1L38J201K496
53424H96249L576M020M200M726N635O627P796R443J1320J2775J3621J4253J4842
53411A009083J5127J5250J5992J7726J9681K0876K1443K2370K4017K5626K6398
53400A233589K6549K6994K8318L0408L2825L5146L7004L8245L9200M0442M2111
53389A610831M3700M4668M5012M5000M4573M3457M1754L9926L8259L6659L5078
53378B068917L3629L2159L0209K7633K4881K2263J9306J5319J0426N527J261k575
53366B288955o510j0749j5149j9534k3749k7568l0833l3623l6079l8050l9081
$$ plain form
53451 1097684 1086355 1074162 1060693 1045813 1030256 1015101 1000562 985889 970732 956003 942924
53440 942924 931712 921819 913082 905918 900499 896478 893578 891899 891417 891641 891976 892143 892214 892552 893753 896249
53424 896249 899825 903845 908045 912771 918406 925033 932829 942272 953592 966367 979988 994241 1009083
53411 1009083 1024210 1039460 1055452 1073178 1092859 1113735 1135178 1157548 1181565 1207191 1233589
53400 1233589 1260138 1287132 1315450 1345858 1378683 1413829 1450833 1489078 1528278 1568720 1610831
53389 1610831 1654531 1699199 1744211 1789211 1833784 1877241 1918995 1958921 1997180 2033839 2068917
53378 2068917 2102546 2134705 2164914 2192547 2217428 2239691 2258997 2274316 2284742 2290269 2291530 2288955
53366 2288955 2282445 2271696 2256547 2237013 2213264 2185696 2154863 2121240 2085161 2047111 2008030
53355B008030l8942l8024l7038l6260l5249l3502l1224k9250k8200k7896k7651
53344A644794k6970k6019k5455k5780k6651k6983k5996k3992k1850j9878j7689
53333A377531j5192j3062j1914j1442j0813r653q325p504p666q844j0522j1995
53321A250599j3037j4005j5113j5928j5898j5071j3936j2849j2050j1873j2286
53310A098553j2431j1295q899o308m426l224k281j498r86o81l48K19J207K802
53296A050404M949P288R510J1596J3560J5116J5950J6277J6859J8235J9932K0694
53284A220370J9738J7732J6203J5824J5630J4275J1703R133P421O035L902Q05
53272A358771k373m713o205p644r708j2225j4392j5628j6114j6469j7101j8024
$$ plain form
53355 2008030 1969088 1931064 1894026 1857766 1822517 1789015 1757791 1728541 1700341 1672445 1644794
53344 1644794 1617824 1591805 1566350 1540570 1513919 1486936 1460940 1436948 1415098 1395220 1377531
53333 1377531 1362339 1349277 1337363 1325921 1315108 1305455 1297130 1289626 1281960 1273116 1262594 1250599
53321 1250599 1237562 1223557 1208444 1192516 1176618 1161547 1147611 1134762 1122712 1110839 1098553
53310 1098553 1086122 1074827 1065928 1059620 1055194 1051970 1049689 1048191 1047205 1046524 1046176 1046395 1047602 1050404
53296 1050404 1055353 1062641 1072151 1083747 1097307 1112423 1128373 1144650 1161509 1179744 1199676 1220370
53284 1220370 1240108 1257840 1274043 1289867 1305497 1319772 1331475 1340608 1348029 1354064 1357966 1358771
53272 1358771 1356398 1351685 1345480 1337836 1328128 1315903 1301511 1285883 1269769 1253300 1236199 1218175
53260A218175j9027j9834k0212k0287k0536k1252k2019k2124k1322k0016j8700
53249I92846j7686j7180j7203j7334j7048j6411j6016j6129j6293j6032j5481
53238H10033j5022j4629j3991j3090j2233j1571j0922j0078r070q065p120o186
53226F78056n312m781m936n755o780p585q262r202j0465j1721j2767j3768j4848
53213E61874j5754j6070j5656j4783j3969j3520j3108j1936r792p693o922p423
53201D15248p873p442o720o630p186p874q524r073q979p856o421n914o499p001
53187C11256o366m825l463l096l663m354m215l046j688j138j437j856k002k131
53173B67976k335k220j611j007r77j476k052k335k146j513q94r00j496j888j518
$$ plain form
53260 1218175 1199148 1179314 1159102 1138815 1118279 1097027 1075008 1052884 1031562 1011546 992846
53249 992846 975160 957980 940777 923443 906395 889984 873968 857839 841546 825514 810033
53238 810033 795011 780382 766391 753301 741068 729497 718575 708497 699427 691362 684242 678056
53226 678056 672744 667963 663027 657272 650492 642907 634645 625443 614978 603257 590490 576722 561874
53213 561874 546120 530050 514394 499611 485642 472122 459014 447078 437286 429593 422671 415248
53201 415248 407375 399933 393213 386583 379397 371523 362999 353926 344947 337091 330670 324756 318257 311256
53187 311256 304890 300065 296602 293506 289843 285489 281274 278228 276540 275402 273965 272109 270107 267976
53173 267976 265641 263421 261810 260803 259826 258350 256298 253963 251817 250304 249410 248510 247014 245126 243608
53158B43608p64l08k21j56n9j60m65p42q33o46o2P13J056O56Q8L8K76N3o35j086
53138B40351j067j082j298j139l59L46L14j13k43j12j77l23pP88J432J537J372
53121B40220J306J314J178Q47M40J81L16Q52J389J449J031N47K59L3l34q81j559
53104B48588k222k557k370j975j914k190k198j545n60K09O40Q76R12O93L76J18
53088B34881j77n42o25j11O47R10M50j68l59j15K62O53J060J289R91N0j158j870
53070B36068j446kJ450J760P94m16q26m35L2J69J83K42J18l29p44o80j71L76P08
53051B36851Q19P05L89J62L84R83J433J304O84rl60j34N04Q78L85o36j054l30
53033B42958P36J028N56K39N16R50J102J049Q89M42j97m18J12Q27Q95K34n21q53
$$ plain form
53158 243608 242844 242536 242315 242159 242100 241940 241475 240733 239900 239254 239192 239905 240961 241617 241705 241743 242019 242072 241437 240351
53138 240351 239284 238202 236904 235765 235406 235752 236066 235953 235710 235598 235421 235098 235091 235879 237311 238848 240220
53121 240220 241526 242840 244018 244865 245305 245486 245802 246654 248043 249492 250523 251070 251329 251362 251028 250147 248588
53104 248588 246366 243809 241439 239464 237550 235360 233162 231617 231057 231266 231906 232782 233694 234387 234763 234881
53088 234881 234704 234162 233537 233426 234073 234983 235433 235265 234906 234791 235053 235706 236766 238055 239046 239096 237938 236068
53070 236068 234622 234620 236070 237830 238624 238208 237382 236947 236979 237148 237331 237573 237691 237362 236618 235938 235767 236143 236851
53051 236851 237670 238375 238764 238926 239310 240293 241726 243030 243714 243705 243345 243211 243715 244593 244978 244342 243288 242958
53033 242958 243694 244722 245278 245517 246033 246983 248085 249134 250023 250465 250268 249850 249962 250789 251684 251918 251397 250544
53015B50544o81p7Q20J599J776J329P56N14O00P68Q47P57M18r3m34l14J25M03
52997B59657K53o7j61k7J6j16j04K85Q51J235J368J355J192R15Q34J110J395J274
52979B71265J008J190J754K017J726J392J389J443J353J405J637J400L77o13o09
52964B88134J08M83J93j93l45n14p31n87n5K67l3o35j083j359j606j812k000k328
52946B75904k667k563j855j040o77p13o59k10M62Q20L68p68j655j423l83L09J77
52929B63427q0J21K84k31j007j160o82l39l76k64K38N92L33k50o30p68r16j055
52911B57237r22m25K56R18J379J342N56q17k041k271j303J09Q81O18m7k48J95
52894B55417P77J010Q26M28J07K07Q08J427J441R17N92P95Q95K13q77j376r86
$$ plain form
53015 250544 249863 249786 250606 252205 253981 255310 256066 256580 257180 257948 258795 259552 259970 259877 259443 259129 259254 259657
52997 259657 259910 259843 259682 259655 259671 259555 259451 259736 260587 261822 263190 264545 265737 266652 267486 268596 269991 271265
52979 271265 272273 273463 275217 277234 278960 280352 281741 283184 284537 285942 287579 288979 289356 288743 288134
52964 288134 288242 288725 288918 288725 288380 287866 287135 286548 286493 286760 286727 286092 285009 283650 282044 280232 278232 275904
52946 275904 273237 270674 268819 267779 267102 266389 265730 265520 265982 266802 267170 266402 264747 263324 262941 263250 263427
52929 263427 263347 263468 263752 263521 262514 261354 260672 260333 259957 259693 259931 260523 260856 260606 259976 259208 258292 257237
52911 257237 256315 255890 256146 257064 258443 259785 260341 259524 257483 255212 253909 254018 254899 255517 255470 255222 255417
52894 255417 256194 257204 258030 258458 258565 258772 259580 261007 262448 263365 263957 264752 265647 265860 264983 263607 262621
52877B62621m39m07p40q84o25j25M42Q86J020R97J338K182K794K364J187M08N40
52860B73559R21Q12L91J65k2p16j768k340k076j702k150l439m731n299n099m481
52844B42025l656k629j579r54j007j342j255n54J52K00l64r36j070p90l55O9N05
52827B26460J124J972K652K514J360k01j314j602j172l31M40O29L17K80R15J439
52811B35482R81Q7J10J202K023J702R07N30L56j74q01j000j065j572k171j944
52795B34653q64J35M89N80P43O62M8o39p25j78M08N17J59j97m2O66J336J323P07
52776B39781J99K32M86M39O6k68l67l99n87r32j196j134p59l51j46j12j35l21
52758B34496p68j135q94o5P19J083J343J834K167J745P70K32P45J848K603K580
$$ plain form
52877 262621 262182 261775 261035 260151 259526 259401 259843 260729 261749 262746 264084 266266 269060 271424 272611 273019 273559
52860 273559 274480 275292 275683 275848 275826 275110 273342 271002 268926 267224 265074 261635 256904 251605 246506 242025
52844 242025 238369 235740 234161 233207 232200 230858 229603 229049 229201 229401 229037 228101 227031 226241 225886 225955 226460
52827 226460 227584 229556 232208 234722 236082 235881 234567 232965 231793 231462 231902 232531 232848 233128 234043 235482
52811 235482 236463 236550 236660 237862 239885 241587 242494 243024 243380 243206 242405 241405 240340 238768 236597 234653
52795 234653 233789 233924 234413 234993 235736 236398 236446 235807 235082 234904 235312 235829 235988 235791 235749 236415 237751 239074 239781
52776 239781 239980 240212 240698 241137 241203 240935 240568 240169 239582 238650 237454 236320 235561 235210 235064 234952 234817 234496
52758 234496 233728 232593 231699 231634 232353 233436 234779 236613 238780 240525 241295 241527 242272 244120 246723 249303
52742B49303K066J503J091Q56Q55J139J602J943J896J472R42O01N52P45J113J510
52726B69189J605J056k6r59j107o05k07l32o08n36l02m82j126j577j354p07j81
52709B61741K8L9q7k91l50j40Q6rl14l76j4M69O67M33j75r15j279p34O78K113
52689B61570K597J892O21m28j014j387j691j600q37J33L12o65j993k597k347j859
52673B50707j434q19p8J89k32o69m77J9J64L9K26O88P93M42L38Q15J169P07r1
52654B52496j17R13K200K926K902K177P72q81j769j258J9P07K29o60q69k35M96
52637B60048P40P48J071J613J672R95L36N69J508K222K455K916L900M412L366
52622B88571J123j038k588m010n352n698m493k557j159n85l01j9N0k09o25j067
$$ plain form
52742 249303 251369 252872 253963 254819 255674 256813 258415 260358 262254 263726 264668 265269 265821 266566 267679 269189
52726 269189 270794 271850 271824 270865 269758 269153 268946 268614 268006 267470 267168 266686 265560 263983 262629 261922 261741
52709 261741 261769 261808 261721 261430 261080 260940 261026 261017 260703 260327 260313 260782 261449 261882 261707 260792 259513 258779 259457 261570
52689 261570 264167 266059 266680 266252 265238 263851 262160 260560 259723 259856 260168 259503 257510 254913 252566 250707
52673 250707 249273 248454 248376 248565 248333 247664 247187 247206 247370 247409 247635 248323 249116 249558 249896 250711 251880 252587 252496
52654 252496 252379 253292 255492 258418 261320 263497 264269 263388 261619 260361 260380 261087 261316 260656 259787 259552 260048
52637 260048 260788 261536 262607 264220 265892 266887 267223 267792 269300 271522 273977 276893 280793 285205 288571
52622 288571 289694 288656 286068 282058 276706 271008 266515 263958 262799 262214 261913 261894 261944 261735 261110 260043
52606B60043j436j407p57J39O26O17N84O48L43m89j180j073m55j43l33m56j71
52589B55100J15J0j00M90J680K477K189J246N05O9o07j569k027j444l87J59Ok70
52571B57642k95k02j07J68O17P82K40q46j843k208j880j287r32q72o88k12K4n00
52553B47601j329j413n71J90R1l72k93K97O08L85J93M58Q61Q75M50n1l13l00k11
52534B47156l47p83j150r48j10R01J657K078K175J831J078L29M3K64P01J149J602
52517B57626K014K179J871J072J20l03L84J985L507M135M059L951L853L142J616
52502B91211r4j417k478l474m029l793l225l004l000k567j776j377j513j408o70
52487B57386K0J0k70j14K56J65k22q1P13J268R02p9r07j032j95J481L165L743
$$ plain form
52606 260043 258607 257200 256443 256582 257208 257825 258409 259057 259400 258911 257731 256658 256203 256060 255727 255271 255100
52589 255100 255215 255225 255125 255615 257295 259772 261961 263207 263712 263781 263174 261605 259578 258134 257747 257906 257912 257642
52571 257642 257347 257145 257038 257206 257823 258605 258845 257999 256156 253948 252068 250781 249849 248977 248289 248077 248101 247601
52553 247601 246272 244859 244288 244478 244569 244197 243904 244201 244809 245194 245387 245845 246706 247581 248031 247980 247667 247367 247156
52534 247156 246809 246026 244876 243928 243818 244719 246376 248454 250629 252460 253538 253867 253910 254174 254875 256024 257626
52517 257626 259640 261819 263690 264762 264882 264579 264963 266948 270455 274590 278649 282600 286453 289595 291211
52502 291211 291117 289700 287222 283748 279719 275926 272701 269697 266697 264130 262354 260977 259464 258056 257386
52487 257386 257406 257416 257146 257032 257288 257453 257231 257150 257863 259131 260033 259954 259047 258015 257820 259301 262466 266209
52469B66209K983J791J100J013J330K118L221L862L583L089L250L575K770O92
52455C00586j320k282k660l258l980m391m640m951m768l508j807r71j214j468
52441B59368j004l35j43k57k18j42l35n89n67n03p26q15n0J308K089J704R41Q74
52423B60600J526K023J789J115N77L28Q8k26j48Q18K401L631L950L837M051M631
52407B90991N233O065P622R568J0744J0453R057P046M352R70k431n117o975q120
52393C39458q320p459o171n258m723m001k942j931j211o82l08j44J1M40J033J435
52377B99227J663K054K691L369M061M866N524N591N178M881M908M808M216L317
52363C56354K320J136j79j152j455j334j129p79j69M08N91N06N47P84R29Q26O19
$$ plain form
52469 266209 269192 270983 272083 273096 274426 276544 279765 283627 287210 290299 293549 297124 299894 300586
52455 300586 299266 296984 294324 291066 287086 282695 278055 273104 268336 264828 263021 262050 260836 259368
52441 259368 258364 258029 257886 257629 257411 257269 256934 256345 255778 255275 254549 253734 253684 254992 257081 258785 259726 260600
52423 260600 262126 264149 265938 267053 267630 267958 268046 267820 267672 268490 270891 274522 278472 282309 286360 290991
52407 290991 296224 302289 309911 319479 330223 340676 349733 356779 361131 362101 359670 354553 347578 339458
52393 339458 331138 323679 317508 312250 307527 303526 300584 298653 297442 296760 296452 296308 296319 296759 297792 299227
52377 299227 300890 302944 305635 309004 313065 317931 323455 329046 334224 339105 344013 348821 353037 356354
52363 356354 358674 359810 359631 358479 357024 355690 354561 353782 353613 354021 354612 355118 355665 356449 357378 358204 358823
52346C58823N85R68J854L013M041M809N560O300O514N935N333N834P462Q983R461
52331D35475R447J0128J1696J3184J3891J4305J5359J7216J9316K1278K3106K4548
52319F28949K4926K4028K2655K1906K2106K2850K3782K4865K5993K6818K7001
52308H95879K6407K5141K3651K2608K2296K2226K1727K0731J9600J8416J6977
52297A135659J5315J3601J1594Q970O054L489J100j980n752q921j0466j0894j1334
52284A146435j2073j2658j2833j2564j1632r996q238o837n296k860O0K179L101
52271A056788L888N574P913J0027J1681J3254J4826J5961J6423J6643J7257J8306
52259A208541J9134J9090J8284J7523J7478J8020J8392J7848J6125J3627J1184
$$ plain form
52346 358823 359408 360376 362230 365243 369284 374093 379653 385953 392467 398402 403735 409569 417031 426014 435475
52331 435475 444922 455050 466746 479930 493821 508126 523485 540701 560017 581295 604401 628949
52319 628949 653875 677903 700558 722464 744570 767420 791202 816067 842060 868878 895879
52308 895879 922286 947427 971078 993686 1015982 1038208 1059935 1080666 1100266 1118682 1135659
52297 1135659 1150974 1164575 1176169 1185139 1191193 1194682 1195782 1193802 1188050 1179129 1168663 1157769 1146435
52284 1146435 1134362 1121704 1108871 1096307 1084675 1074679 1066441 1059604 1054308 1051448 1051508 1053687 1056788
52271 1056788 1060676 1066250 1074163 1084190 1095871 1109125 1123951 1139912 1156335 1172978 1190235 1208541
52259 1208541 1227675 1246765 1265049 1282572 1300050 1318070 1336462 1354310 1370435 1384062 1395246
52248A395246R347P616M784L40m704q865j1764j4120j6373j8114j8961j9293j9703
52235A285436k0165k0296k0152k0244k0724k0996k0329j8734j6983j5780j5064
52224A075969j4208j2894j1486j0536j0086r666q833p432n473l165j101k8r5n41
52210I80425l79O27J938L049L971M789N153M660L661L144L646M627N178N068M772
52195A034329M781N261O202P381Q182Q013O884N278L483J594Kq81j508k949n406
52180A080646p720q868r224r717j0300j0227r408q545p961p216n976m577l456
52167I77451k606j783q49K76J667L157M290M696M394L739L213L090L106K668J637
52152A008146O94N01P93Q31N08L59O84J320K251L601M916N304M561L524K981K937
$$ plain form
52248 1395246 1404593 1412209 1416993 1417333 1412629 1403764 1392000 1377880 1361507 1343393 1324432 1305139 1285436
52235 1285436 1265271 1244975 1224823 1204579 1183855 1162859 1142530 1123796 1106813 1091033 1075969
52224 1075969 1061761 1048867 1037381 1026845 1016759 1007093 998260 990828 985355 982190 981089 981061 980966 980425
52210 980425 980046 980673 982611 985660 989631 994420 999573 1004233 1007894 1011038 1014684 1019311 1024489 1029557 1034329
52195 1034329 1039110 1044371 1050573 1057954 1066136 1074149 1081033 1086311 1089794 1091388 1091390 1090509 1089001 1086052 1080646
52180 1080646 1072926 1064058 1054834 1045117 1034817 1024590 1015182 1006637 998676 991460 985484 980907 977451
52167 977451 974845 973062 972213 972489 974156 977313 981603 986299 990693 994432 997645 1000735 1003841 1006509 1008146
52152 1008146 1008840 1009341 1010134 1010965 1011473 1011832 1012516 1013836 1016087 1019688 1024604 1029908 1034469 1037993 1040974 1043911
52136A043911L156L738M646N437O037P252R773J3110J6207J8773K1335K4191K7094
52123A204660K9857L2490L4691L5907L6089L5842L5620L5293L4657L3879L3111
52112A582096L2089L0485K8303K5639K2446J8976J6067J4351J3309J1733R248
52101A804742O710M935L574J750p04l289n876q915j2509j6001j8824k1225k3640
52088A710728k5837k7216k7703k7646k7028k5509k3302k1214j9505j7385j4153
52077A454230j0352p166m951l005o75J980M701P554J0629J3582J5884J7441J8625
52064A518477J9799K0975K1972K2685K3170K3518K3633K3187K1912K0007J8010
52053A757345J6123J3856J0624O631K724o67m019p944j2245j6155j9237k1647
$$ plain form
52136 1043911 1047067 1050805 1055451 1060888 1066925 1074177 1083950 1097060 1113267 1132040 1153375 1177566 1204660
52123 1204660 1234517 1267007 1301698 1337605 1373694 1409536 1445156 1480449 1515106 1548985 1582096
52112 1582096 1614185 1644670 1672973 1698612 1721058 1740034 1756101 1770452 1783761 1795494 1804742
52101 1804742 1811452 1816387 1819961 1821711 1821007 1817718 1811842 1802927 1790418 1774417 1755593 1734368 1710728
52088 1710728 1684891 1657675 1629972 1602326 1575298 1549789 1526487 1505273 1485768 1468383 1454230
52077 1454230 1443878 1436712 1431761 1428756 1428081 1430061 1434762 1442316 1452945 1466527 1482411 1499852 1518477
52064 1518477 1538276 1559251 1581223 1603908 1627078 1650596 1674229 1697416 1719328 1739335 1757345
52053 1757345 1773468 1787324 1797948 1804579 1807303 1806636 1802617 1794673 1782428 1766273 1747036 1725389
52041A725389k3660k5290k6450k7092k7148k6701k6187k6109k6411k6486k5953
52030A437902k5048k4084k2948k1530k0265j9796k0190k0871k1228k0993k0037
$$ plain form
52041 1725389 1701729 1676439 1649989 1622897 1595749 1569048 1542861 1516752 1490341 1463855 1437902
52030 1437902 1412854 1388770 1365822 1344292 1324027 1304231 1284041 1263170 1241942 1220949 1200912
$$ [...]
##END NTUPLES=NMR SPECTRUM
##END=
