##TITLE=AC1632_CEHAH_8493842_NxJCE5YjTH
##JCAMPDX= 6.0         $$ Bruker NMR JCAMP-DX V2.0
##DATA TYPE= NMR SPECTRUM
##DATA CLASS= NTUPLES
##ORIGIN= BRUKER
##OWNER= Administrator
$$ 1.72 TOPSPIN		Version 2.1
$$ 2014-02-18 17:43:09.786 -0800  Administrator@X
$$ Compression mode = diff/dup
##.OBSERVE FREQUENCY= 400.02188249412
##.OBSERVE NUCLEUS= ^1H
##.ACQUISITION MODE= SIMULTANEOUS (DQD)
##.ACQUISITION SCHEME= undefined
##.AVERAGES= 64
##.DIGITISER RES= 22
##SPECTROMETER/DATA SYSTEM= spect
##.PULSE SEQUENCE= noesygpps1d.comp
##.SOLVENT NAME= COFFEE_meoh
##.SHIFT REFERENCE= INTERNAL, COFFEE_meoh, 1, 14.96089
##AUDIT TRAIL= $$ (NUMBER, WHEN, WHO, WHERE, PROCESS, VERSION, WHAT)
$$ ##TITLE= Audit trail, TOPSPIN		Version 2.1
$$ ##JCAMPDX= 5.01
$$ ##ORIGIN= Bruker BioSpin GmbH
$$ ##OWNER= Administrator
$$ $$ E:\/data/COFFEE/nmr/AC1632_CEHAH_8493842_NxJCE5YjTH/12/pdata/1/auditp.txt
$$ ##AUDIT TRAIL=  $$ (NUMBER, WHEN, WHO, WHERE, PROCESS, VERSION, WHAT)
(   1,<2014-02-18 17:43:05.083 -0800>,<Administrator>,<X>,<go>,<TOPSPIN 2.1>,
      <created by zg
	started at 2014-02-18 17:31:35.520 -0800,
	POWCHK enabled, PULCHK disabled,
       configuration hash MD5:
       C8 4E 4E 5D D3 5C D8 9E 9F 52 82 E0 59 8A DE 15
       data hash MD5: 64K
       0D BC 66 D0 E0 D6 73 00 F6 E6 95 9F 44 E5 01 A2>)
(   2,<2014-02-18 17:43:07.958 -0800>,<Administrator>,<X>,<proc1d>,<TOPSPIN 2.1>,
      <Start of raw data processing
       efp LB = 0.3 FT_mod = 6 PKNL = 1 PHC0 = 0 PHC1 = 0 SI = 128K 
       data hash MD5: 128K
       D5 DA 08 4E 49 94 C6 AC D4 14 90 38 68 A2 30 01>)
(   3,<2014-02-18 17:43:08.895 -0800>,<Administrator>,<X>,<proc1d>,<TOPSPIN 2.1>,
      <pk PHC0 = -82.86987 PHC1 = 0 
       data hash MD5: 128K
       DB 87 2C 6D CA 28 D8 C5 4A AC A4 EC 6E 5D E0 61>)
(   4,<2014-02-18 17:43:09.270 -0800>,<Administrator>,<X>,<proc1d>,<TOPSPIN 2.1>,
      <abs ABSG = 1 
       data hash MD5: 128K
       FB BE 77 9D F6 28 7F 6F 98 DE DB 30 BD 95 35 1E>)
(   5,<2014-02-18 17:43:09.364 -0800>,<Administrator>,<X>,<proc1d>,<TOPSPIN 2.1>,
      <abs ABSG = 2 
       data hash MD5: 128K
       75 2C 59 57 45 69 9E 1D EF C9 ED 33 77 65 20 1F>)
(   6,<2014-02-18 17:43:09.458 -0800>,<Administrator>,<X>,<proc1d>,<TOPSPIN 2.1>,
      <abs ABSG = 3 
       data hash MD5: 128K
       D2 94 B8 27 C2 52 93 41 86 ED B8 0F 2B 48 78 0E>)
(   7,<2014-02-18 17:43:09.536 -0800>,<Administrator>,<X>,<proc1d>,<TOPSPIN 2.1>,
      <abs ABSG = 4 
       data hash MD5: 128K
       AB C1 4A BC 89 0F E7 50 56 1F 52 53 2A BD 20 99>)
(   8,<2014-02-18 17:43:09.614 -0800>,<Administrator>,<X>,<proc1d>,<TOPSPIN 2.1>,
      <abs ABSG = 5 
       data hash MD5: 128K
       9A 92 9E 1C E7 92 CC EB 7F 61 6E 61 94 28 CF 75>)
$$ ##END=
$$ 
$$ $$ hash MD5
$$ $$ 1C 4E 9D A5 91 8C AD 51 6A 5B F9 75 F6 9A 91 CD
##$RELAX= 
##$RELAX= 
##$RELAX= 
##$RELAX= 
##$RELAX= 
##$RELAX= 
##$RELAX= 
##$RELAX= 
$$ Bruker specific parameters
$$ --------------------------
##$DU= <E:\>
##$EXPNO= 12
$$ [...]
##$TP07= 0
##$TPNAME0= <>
##$TPNAME1= <>
##$TPNAME2= <>
##$TPNAME3= <>
##$TPNAME4= <>
##$TPNAME5= <>
##$TPNAME6= <>
##$TPNAME7= <>
##$TPOAL= (0..7)
0.5 0.5 0.5 0.5 0.5 0.5 0.5 0.5
##$TPOFFS= (0..7)
0 0 0 0 0 0 0 0
##$TUNHIN= 0
##$TUNHOUT= 0
##$TUNXOUT= 0
##$USERA1= <user>
##$USERA2= <user>
##$USERA3= <user>
##$USERA4= <user>
##$USERA5= <user>
##$V9= 5
##$VALIST= <valist>
##$VCLIST= <CCCCCCCCCCCCCCC>
##$VD= 0
##$VDLIST= <DDDDDDDDDDDDDDD>
##$VPLIST= <PPPPPPPPPPPPPPP>
##$VTLIST= <TTTTTTTTTTTTTTT>
##$WBST= 2048
##$WBSW= 25
##$XGAIN= (0..3)
0 0 0 0
##$XL= 0
##$YL= 0
##$YMAX_a= 6234744
##$YMIN_a= -13238412
##$ZGOPTNS= <>
##$ZL1= 120
##$ZL2= 120
##$ZL3= 120
##$ZL4= 120
##$ABSF1= 14.96089
##$ABSF2= -5.597292
##$ABSG= 5
##$ABSL= 3
##$ALPHA= 0
##$AQORDER= 0
##$ASSFAC= 0
##$ASSFACI= 0
##$ASSFACX= 0
##$ASSWID= 0
##$AUNMP= <proc_prof1d_extract.lims>
##$AXLEFT= 0
##$AXNAME= <>
##$AXNUC= <1H>
##$AXRIGHT= 0
##$AXTYPE= 0
##$AXUNIT= <>
##$AZFE= 0.1
##$AZFW= 0.1
##$BCFW= 0
##$BC_mod= 0
##$BYTORDP= 0
##$COROFFS= 0
##$CY= 15
##$DATMOD= 1
##$DC= 0
##$DFILT= <>
##$DTYPP= 0
##$F1P= 0
##$F2P= 0
##$FCOR= 0.5
##$FTSIZE= 131072
##$FT_mod= 6
##$GAMMA= 0
##$GB= 0
##$INTBC= 1
##$INTSCL= 1
##$ISEN= 128
##$LB= 0.3
##$LEV0= 0
##$LPBIN= 0
##$MAXI= 10000
##$MC2= 0
##$MEAN= 0
##$ME_mod= 0
##$MI= 0
##$NCOEF= 0
##$NC_proc= -2
##$NLEV= 6
##$NOISF1= 0
##$NOISF2= 0
##$NSP= 0
##$NTH_PI= 0
##$NZP= 0
##$OFFSET= 14.96089
##$PC= 1
##$PHC0= -82.86987
##$PHC1= 0
##$PH_mod= 1
##$PKNL= yes
##$PPARMOD= 0
##$PPDIAG= 0
##$PPIPTYP= 0
##$PPMPNUM= 2147483647
##$PPRESOL= 1
##$PSCAL= 4
##$PSIGN= 0
##$PYNMP= <proc.py>
##$REVERSE= no
##$SF= 400.020009679869
##$SI= 131072
##$SIGF1= 0
##$SIGF2= 0
##$SINO= 400
##$SIOLD= 131072
##$SPECTYP= <>
##$SREGLST= <1H.CDCl3>
##$SSB= 0
##$STSI= 131072
##$STSR= 0
##$SW_p= 8223.68421052631
##$SYMM= 0
##$S_DEV= 0
##$TDeff= 65536
##$TDoff= 0
##$TI= <>
##$TILT= no
##$TM1= 0
##$TM2= 0
##$TOPLEV= 0
##$USERP1= <user>
##$USERP2= <user>
##$USERP3= <user>
##$USERP4= <user>
##$USERP5= <user>
##$WDW= 1
##$XDIM= 131072
##$YMAX_p= 429506479
##$YMIN_p= -11742
##$CURPLOT= <Network HP LaserJet P1505>
##$CURPRIN= <$Network HP LaserJet P1505>
##$DFORMAT= <normdp>
##$LAYOUT= <+/1D_H.xwp>
##$LFORMAT= <normlp>
##$PFORMAT= <normpl>
##$SURQMSG= 1
$$ End of Bruker specific parameters
$$ ---------------------------------
##NTUPLES= NMR SPECTRUM
##VAR_NAME=  FREQUENCY,     SPECTRUM/REAL,   SPECTRUM/IMAG
##SYMBOL=    X,             R,               I
##VAR_TYPE=  INDEPENDENT,   DEPENDENT,       DEPENDENT
##VAR_FORM=  AFFN,          ASDF,            ASDF
##VAR_DIM=   131072,        131072,          131072
##UNITS=     HZ,            ARBITRARY UNITS, ARBITRARY UNITS
##FACTOR=    0.0627417313425164, 1,          1
##FIRST=     8223.62146879497, -449,         -64405
##LAST=      0,             1773,            -64538
##MIN=       0,             -11742,          0
##MAX=       8223.62146879497, 429506479,    0
$$ Real data points
##PAGE= N=1
##DATA TABLE= (X++(R..R)), XYDATA
$$ [...]
63908B945821k29024k13111j96091j77816j58357j38914j21230j06245r3763q3089
63898A428181p3557o4743n6803n0452m6108m3169m0549l7814l5385l3805l3096
63887I12700l2719l1777k9650k6729k4290k3025k2102k0211j7213j4050j1232
63876F59702q363n181k136L60K595N069P794J0442J2853J5011J6848J8329J9694
63863G53017K1248K2959K4391K5118K5212K5170K5319K5362K4744K3326K1309
63852A017175J8626J5046J0887P000L733N43k957o355r362j2593j6600k0777k4169
63839I80197k6878k9598l2141l3686l4305l4939l5738l5660l4124l1962l0180
63828F20986k8657k6708k4301k2081k0571j9796j9324j8386j6442j3877j1718
$$ y = [2945821, 2716797, 2503686, 2307595, 2129779, 1971422, 1832508, 1711278, 1605033, 1511270, 1428181, 1354624, 1289881, 1233078, 1182626, 1136518, 1093349, 1052800, 1014986, 979601, 945796, 912700, 879981, 848204, 818554, 791825, 767535, 744510, 722408, 702197, 684984, 670934, 659702, 651339, 646158, 644022, 644382, 646977, 652046, 659840, 670282, 683135, 698146, 714994, 733323, 753017, 774265, 797224, 821615, 846733, 871945, 897115, 922434, 947796, 972540, 995866, 1017175, 1035801, 1050847, 1061734, 1068734, 1072467, 1073010, 1070053, 1063698, 1054336, 1041743, 1025143, 1004366, 980197, 953319, 923721, 891580, 857894, 823589, 788650, 752912, 717252, 683128, 651166, 620986, 592329, 565621, 541320, 519239, 498668, 478872, 459548, 441162, 424720, 410843, 399125]
63817C99125j0463r672q863q153p730p360o892o582o475o029m966l947l678l801
63803C04514l408k448j771j842k180k247k262k752l657m301m201l588l043k790
63789B64024k589k274k080k214k386k203j820j702j828j644r53k56p9m31j101
63774B40464j920k466k096p64N80R09K74l85l88P0K95j74j102j673j205P0J167
63757B31656J393R51L94q1m60n14o9N46P77M77j1l11k24L05J078J640J704J497
63739B40748J471J757K155K523K804K831K475J944J654J760K098K526L085L706
63725B73537M080L941L467L172L404L916M027L350K196J178N30Q9j78j10J52R3
63709C06844n57j485k274k783k860k227j037j58k61r03j029k97N98R00O33M19
$$ y = [399125, 388662, 378990, 370127, 361974, 354244, 346884, 339992, 333410, 326935, 320906, 315940, 311993, 308315, 304514, 301106, 298658, 296887, 295045, 292865, 290618, 288356, 285604, 281947, 277646, 273445, 269857, 266814, 264024, 261435, 259161, 257081, 254867, 252481, 250278, 248458, 246756, 244928, 243284, 242331, 242075, 241996, 241565, 240464, 238544, 236078, 233982, 233218, 233798, 234707, 234981, 234596, 234208, 234278, 234573, 234399, 233297, 231624, 230419, 230489, 231656, 233049, 234000, 234394, 234313, 233853, 233339, 233270, 233816, 234593, 235070, 235059, 234748, 234524, 234829, 235907, 237547, 239251, 240748, 242219, 243976, 246131, 248654, 251458, 254289, 256764, 258708, 260362, 262122, 264220, 266746, 269831, 273537, 277617, 281558, 285025, 288197, 291601, 295517, 299544, 302894, 305090, 306268, 306798, 306887, 306709, 306599, 306751, 306844, 306287, 304802, 302528, 299745, 296885, 294658, 293621, 293463, 293202, 292299, 291270, 290973, 291571, 292471, 293104, 293523]
63693B93523P09J311J571J157O72J113K487L464K951J595R45J369J757J350Q30
63678C16804J072J673J521M52n49p14l06N2K36M45N92M08jj35J82L84k83j833
63660C20000l410m039l512k496j931k266l190m013m228l769k823j672p10k89l34
63645B81318l63r6J68M9k30q7O32J517K209K637K773K619K561L091M029M623M651
63628C12101M829N677O625O801O287N908O087O592P259Q210R344J0282J0992J1930
63614D18924J3334J4824J5994J7007J8269J9766K1047K1823K2334K3100K4315
63603F30737K5337K4872K1913J6752J0928O043K641K87j556k955l738m004m237
63590G23020m958o340q145r999j1766j3592j5578j7501j8945j9687j9823j9510
$$ y = [293523, 294232, 295543, 297114, 298271, 298943, 300056, 302543, 306007, 308958, 310553, 311498, 312867, 314624, 315974, 316804, 317876, 319549, 321070, 321522, 320973, 320259, 319953, 320005, 320241, 320686, 321278, 321686, 321685, 321550, 321732, 322116, 321833, 320000, 316590, 312551, 309039, 306543, 304612, 302346, 299156, 295143, 290915, 287146, 284323, 282651, 281941, 281652, 281318, 280955, 280859, 281027, 281076, 280846, 280759, 281391, 282908, 285117, 287754, 290527, 293146, 295707, 298798, 302827, 307450, 312101, 316930, 322607, 329232, 336033, 342320, 348228, 354315, 360907, 368166, 376376, 385720, 396002, 406994, 418924, 432258, 447082, 463076, 480083, 498352, 518118, 539165, 560988, 583322, 606422, 630737, 656074, 680946, 702859, 719611, 730539, 736582, 739223, 739510, 737954, 734999, 731261, 727257, 723020, 718062, 711722, 703577, 693578, 681812, 668220, 652642, 635141, 616196, 596509, 576686, 557176]
63578E57176j8767j7571j5979j4017j1675r219p275o153n194l378p00J585K411
63565D51244K134J937K480L533M651N586O218O587O974P581Q287R058J0225J1906
63551E38401J3562J4811J6324J9019K2584K5922K8872L2240L5695L7031L4220
63540H18681K7432J8436Q931K53o212r657j0617j0297r343p939o656o227o669
63527H00116p546q956j1481j5090j8952k2341k5005k6642k6878k6050k5182k4712
63515E61281k3897k1960j9338j7164j5799j4549j2823j0969r724r198q791p999
63503C89070o946o044n399m815m158l448k700k007j677j886k224k081j481j052
63489C43152j017q69k17N71R29Q12M95J59NL11R35J306J268J378J886K093J411
$$ y = [557176, 538409, 520838, 504859, 490842, 479167, 469948, 462673, 456520, 451326, 447948, 447248, 448833, 451244, 453378, 455315, 457795, 461328, 465979, 471565, 477783, 484370, 491344, 498925, 507212, 516270, 526495, 538401, 551963, 566774, 583098, 602117, 624701, 650623, 679495, 711735, 747430, 784461, 818681, 846113, 864549, 873480, 873733, 867521, 857864, 847247, 836950, 827607, 819668, 813012, 806785, 800116, 792570, 783614, 772133, 757043, 738091, 715750, 690745, 664103, 637225, 611175, 585993, 561281, 537384, 515424, 496086, 478922, 463123, 448574, 435751, 424782, 415058, 405860, 397069, 389070, 382124, 376080, 370681, 365866, 361708, 358260, 355560, 353553, 351876, 349990, 347766, 345685, 344204, 343152, 342135, 341266, 341049, 341620, 342549, 343361, 343856, 344015, 344020, 344331, 345266, 346572, 347840, 349218, 351104, 353197, 354608]
63472C54608M32O2J45r6o73j014j221j909k860l107k552k250k694k974k294j345
63456C30258j288j974k157j118O21K060K633K470K218K524L348L984M024M109
63442C51712N186P181Q971R793J0237J1501J3973J6954J9808K2781K6249K9449
63430E33795L0585K8498K3841J8340J3313R205O102M120L364L950N993R217J2877
63417G03200J6397J9901K3585K6833K8607K8488K6714K3377J8469J2726P463L259
63405I39019m20l894o385p038o268n528n905p467r719j2301j5181j8493k2096
63392H18324k5360k7528k8364k8213k7507k6549k5655k4911k3733k1356j8003
63381E41145j4938j2999j1663r990p880n844l975j948K08J997L143L947M883O147
$$ y = [354608, 355040, 355102, 355247, 355151, 354478, 353464, 352243, 350334, 347474, 344367, 341815, 339565, 336871, 333897, 331603, 330258, 328970, 326996, 324839, 323721, 324342, 326402, 329035, 331505, 333723, 336247, 339595, 343579, 347603, 351712, 356898, 364079, 373050, 382843, 393080, 404581, 418554, 435508, 455316, 478097, 504346, 533795, 564380, 592878, 616719, 635059, 648372, 657577, 663679, 667799, 671163, 675113, 681106, 690323, 703200, 719597, 739498, 763083, 789916, 818523, 847011, 873725, 897102, 915571, 928297, 935760, 939019, 938599, 934705, 928320, 921282, 915014, 909486, 903581, 896114, 886395, 874094, 858913, 840420, 818324, 792964, 765436, 737072, 708859, 681352, 654803, 629148, 604237, 580504, 559148, 541145, 526207, 513208, 501545, 491555, 483675, 477831, 473856, 471908, 472116, 474113, 477256, 481203, 486086, 492233]
63367D92233P644R130J0413J1565J2836J4279J5697J7159J9108K1671K4189K5952
63355F81876K7141K8428K9805L0422K9618K7511K4390K0183J4883R071L598j049
63343I25877m649o852p454p029o695p112q122r590j1944j5449j9328k2357k4173
63330G75123k5302k5990k5817k4705k3407k2416k1073j8498j4919j1300p959m495
63318E49242j099R76N22k496o988j1454j4614j6005j6132j5781j5072j3643j1596
63305D25860r618q048o528m828l401k715k512k226j738j307r92o16k43l88j499
63290C79201l226m339l804k138j126j742k800k555j151l66j002j901j900j420
63276C49731j340j422q83J74R92J246J077M43n59j070k72J323K349K393K367K994
$$ y = [492233, 499877, 509007, 519420, 530985, 543821, 558100, 573797, 590956, 610064, 631735, 655924, 681876, 709017, 737445, 767250, 797672, 827290, 854801, 879191, 899374, 914257, 923328, 926926, 925877, 921228, 914376, 906922, 899893, 893198, 886086, 877964, 868374, 856430, 840981, 821653, 799296, 775123, 749821, 723831, 698014, 673309, 649902, 627486, 606413, 587915, 572996, 561696, 553737, 549242, 548143, 549119, 549641, 547145, 540157, 528703, 514089, 498084, 481952, 466171, 451099, 437456, 425860, 416242, 408194, 401666, 396838, 393437, 390722, 388210, 385984, 384246, 382939, 381947, 381331, 381088, 380700, 379201, 375975, 371636, 367832, 365694, 364568, 362826, 360026, 357471, 356320, 355954, 354952, 353051, 351151, 349731, 348391, 346969, 346086, 346260, 347252, 348498, 349575, 350018, 349459, 348389, 348117, 349440, 351789, 354182, 356549, 359543]
63260C59543L844M244M351M715N314N599N295M733M456M814N768O891P618P775
63246D34960P900Q748J0477J2384J3654J4195J4641J5627J7350J9766K2777K5987
63234F18466K8683L0563L2146L4046L5963L7039L7119L6978L7183L7392L7000
63223A002578L6031L5040L4536L4734L5564L6696L7751L8605L9141L8849L7149
63212A406674L4138L0331K5644J9403J1554L048n402j4119k3414l2453l9917m5365
63200A370122m9240n1853n3011n2448n0096m6165m1332l6598l2495k8699k4668
63189I03517k0300j5692j0810n870j481K100N363Q689J1664J3882J5767J7833
63177I24662J9654K0450K0371K0249K0423K0580K0498K0028J8753J6609J4594
$$ y = [359543, 363387, 367631, 371982, 376697, 382011, 387610, 392905, 397638, 402094, 406908, 412676, 419567, 427185, 434960, 442860, 451608, 462085, 474469, 488123, 502318, 516959, 532586, 549936, 569702, 592479, 618466, 647149, 677712, 709858, 743904, 779867, 816906, 854025, 891003, 928186, 965578, 1002578, 1038609, 1073649, 1108185, 1142919, 1178483, 1215179, 1252930, 1291535, 1330676, 1369525, 1406674, 1440812, 1471143, 1496787, 1516190, 1527744, 1530792, 1525390, 1511271, 1487857, 1455404, 1415487, 1370122, 1320882, 1269029, 1216018, 1163570, 1113474, 1067309, 1025977, 989379, 956884, 928185, 903517, 883217, 867525, 856715, 850845, 849364, 851464, 856827, 865516, 877180, 891062, 906829, 924662, 944316, 964766, 985137, 1005386, 1025809, 1046389, 1066887, 1086915, 1105668, 1122277, 1136871]
63166A136871J3656J2999J0677O073O83l889p780j2202j7735k3772k9164l2950
63154A053467l4888l5565l5842l5995l5653l4427l2235k9211k5800k2856k0956
63143G10039j9650j8029j5912j3815j1831r470o748m514l340k786k210j690j684
63130E98360k187k602k253q82J059K630L280L438L794M264M344M220M612N490
63116F27567N996N823N633N744N474M348L062K486K470K345K034J879J842J640
63102F78343J339J179J121J051J084J147P27l57j358j429p78k43k2L65R73J148
63086F84290N59j27N1J338L113M565N378N892O646P693Q489Q575Q192Q084Q752
63071G61490J0108J1615J2695J3159J3411J4089J5430J7209J9273K1684K4353
$$ y = [1136871, 1150527, 1163526, 1174203, 1180276, 1180959, 1177070, 1169290, 1157088, 1139353, 1115581, 1086417, 1053467, 1018579, 983014, 947172, 911177, 875524, 841097, 808862, 779651, 753851, 730995, 710039, 690389, 672360, 656448, 642633, 630802, 621332, 614584, 610070, 606730, 603944, 601734, 600044, 598360, 596173, 593571, 591318, 590436, 591495, 594125, 597405, 600843, 604637, 608901, 613245, 617465, 622077, 627567, 633563, 639386, 645019, 650763, 656237, 660585, 663647, 666133, 668603, 670948, 672982, 674861, 676703, 678343, 679682, 680861, 681982, 683033, 684117, 685264, 685991, 685634, 684276, 682847, 682069, 681826, 681804, 682169, 683142, 684290, 684849, 684722, 684773, 686111, 689224, 693789, 699167, 705059, 711705, 719398, 727887, 736462, 744654, 752738, 761490, 771598, 783213, 795908, 809067, 822478, 836567, 851997, 869206, 888479, 910163, 934516]
63060I34516K7030K9887L3493L7838M2044M5513M8885N3203N8559O4213O9652
63049A444833P4726P9018Q2027Q4037Q5945Q8007Q9458Q9661Q8973Q8164Q7507
63038B382356Q6923Q6695Q7352Q8838R0215R0345Q8831Q6072Q2377P7154O9094
63027C316252N7287M1934K3973M295j6394l7238n7259p5662r1819j04967j14357
63016B946045j19891j22218j21969j19140j13507j05521r6378q7084p7664o7590
63006A915083n6843m6153l6112k6506j6919p679M14P155J3043J8229K2185K4786
62994A810683K6942K9482L1923L3203L3323L3352L3861L4277L3935L2875L1167
62983B165023K8193K3315J6838R638J991o525j6050k5951l5462m4293n2364n9321
$$ y = [934516, 961546, 991433, 1024926, 1062764, 1104808, 1150321, 1199206, 1252409, 1310968, 1375181, 1444833, 1519559, 1598577, 1680604, 1764641, 1850586, 1938593, 2028051, 2117712, 2206685, 2294849, 2382356, 2469279, 2555974, 2643326, 2732164, 2822379, 2912724, 3001555, 3087627, 3170004, 3247158, 3316252, 3373539, 3415473, 3439446, 3443741, 3427347, 3390109, 3332850, 3257188, 3165369, 3060402, 2946045, 2826154, 2703936, 2581967, 2462827, 2349320, 2243799, 2147421, 2060337, 1982673, 1915083, 1858240, 1812087, 1775975, 1749469, 1732550, 1724871, 1725285, 1732440, 1745483, 1763712, 1785897, 1810683, 1837625, 1867107, 1899030, 1932233, 1965556, 1998908, 2032769, 2067046, 2100981, 2133856, 2165023, 2193216, 2216531, 2233369, 2243007, 2244998, 2238473, 2222423, 2196472, 2161010, 2116717, 2064353, 2005032]
62971B005032o4745o8597p1091p2176p1530o9061o5245o0870n6649n2926m9516
62960A302626m5850m1667l7588l4587l2790l1343k9628k8033k7021k6111k4554
62949I43454k2649k1452k1236k1182k0640j9883j9271j8586j7554j6364j5203
62938G29434j3815j2105j0593r732r155q246p036n978n144m324l608l201k805
62925F33692j968j039r34j839k802k885k219j574j401j646k176k916l674m203
62911F02416m463m650m950n354n659n602n106m429l970l833l753l490l109k764
62897E41284k281j339n5Q54P75q5q94j105q95p04o90q54j253j756j872j276l88
62880E27466P8K9QL10O87R41J198J452J415J004N22Q6n30j276j645j489j389j736
$$ y = [2005032, 1940287, 1871690, 1800599, 1728423, 1656893, 1587832, 1522587, 1461717, 1405068, 1352142, 1302626, 1256776, 1215109, 1177521, 1142934, 1110144, 1078801, 1049173, 1021140, 994119, 968008, 943454, 920805, 899353, 878117, 856935, 836295, 816412, 797141, 778555, 761001, 744637, 729434, 715619, 703514, 692921, 683189, 674034, 665788, 658752, 652774, 647630, 643306, 639698, 636497, 633692, 631724, 630685, 629751, 627912, 625110, 622225, 620006, 618432, 617031, 615385, 613209, 610293, 606619, 602416, 597953, 593303, 588353, 582999, 577340, 571738, 566632, 562203, 558233, 554400, 550647, 547157, 544048, 541284, 539003, 537664, 537609, 538463, 539238, 539153, 538259, 537154, 536259, 535555, 534865, 534011, 532758, 531002, 529130, 527854, 527466, 527544, 527573, 527581, 527891, 528578, 529519, 530717, 532169, 533584, 534588, 535110, 535196, 534666, 533390, 531745, 530256, 528867, 527131]
62862E27131k027j716j218j326j864j828p82N46J218J127R22J186J787J962J184
62847E26302Lm15K07P77L17o71j029o31l58o67j145j441j737k130k324k133j685
62830E11240j006o7P02P12J78N6P51J597J950K105K718L802M834N435N552N316
62814E45875N125N465O348P214P632P739P767P680P630Q141R357J0545J0960J0932
62800F58410J1458J2930J4802J6418J7599J8448J9107J9835K1004K2884K5568
62789H58463K9014L3016L7297M1863M7082N3217O0081O7446P5414Q4026R2792
62778A479711J01182J09429J18200J27396J35826J42239J46223J47836J46710
62769B654752J41934J32696J18948J01435Q1216N9019L5053R505j6774m2283o5536
$$ y = [527131, 525104, 523388, 522170, 520844, 518980, 517152, 516370, 516916, 518134, 519261, 520183, 521369, 523156, 525118, 526302, 526305, 525890, 526097, 526874, 527191, 526520, 525491, 524860, 524502, 523835, 522690, 521249, 519512, 517382, 515058, 512925, 511240, 510234, 510167, 510869, 511581, 511759, 511815, 512566, 514163, 516113, 518218, 520936, 524738, 529572, 535007, 540559, 545875, 551000, 556465, 562813, 570027, 577659, 585398, 593165, 600845, 608475, 616616, 625973, 636518, 647478, 658410, 669868, 682798, 697600, 714018, 731617, 750065, 769172, 789007, 810011, 832895, 858463, 887477, 920493, 957790, 999653, 1046735, 1099952, 1160033, 1227479, 1302893, 1386919, 1479711, 1580893, 1690322, 1808522, 1935918, 2071744, 2213983, 2360206, 2508042, 2654752, 2796686, 2929382, 3048330, 3149765, 3230981, 3290000, 3325053, 3334558, 3317784, 3275501, 3209965]
62758C209965q5601j02119j15131j24949j31883j35944j37035j35471j32082j27622
62748A982128j22295j15979j08735j00873r2728q4614p6886o9816o3386n7435
62738A089381n1974m7119m2725l8361l3814k9478k5916k3188k0807j8395j6058
62727G41546j4011j2161j0315q677p561o717n376l231r88M60J123J777K933M457
62713F83259O183Q277J0716J2968J4618J6039J7979K0719K4066K8007L2703L7857
62701I13391M2645M6679N0486N4692N9144O3352O7466P2073P7070Q1428Q4194
62690A612620Q5139Q4136Q0594P4015O4729N3482M0573K6062J0573m864j9810
62679B107249l4471m8492o0490o9359p5516q0103q3377q4672q3865q1859p9316
$$ y = [3209965, 3124364, 3022245, 2907114, 2782165, 2650282, 2514338, 2377303, 2241832, 2109750, 1982128, 1859833, 1743854, 1635119, 1534246, 1441518, 1356904, 1280018, 1210202, 1146816, 1089381, 1037407, 990288, 947563, 909202, 875388, 845910, 819994, 796806, 775999, 757604, 741546, 727535, 715374, 705059, 696382, 688821, 682104, 676728, 673497, 672509, 672969, 674092, 675869, 678802, 683259, 689442, 697719, 708435, 721403, 736021, 752060, 770039, 790758, 814824, 842831, 875534, 913391, 956036, 1002715, 1053201, 1107893, 1167037, 1230389, 1297855, 1369928, 1446998, 1528426, 1612620, 1697759, 1781895, 1862489, 1936504, 2001233, 2054715, 2095288, 2121350, 2131923, 2127059, 2107249, 2072778, 2024286, 1963796, 1894437, 1818921, 1738818, 1655441, 1570769, 1486904, 1405045, 1325729]
62668A325729p5828p0933o5366o0425n6351n2220m7421m2463l8029l4041l0158
62657G52494k6655k4059k2207k0338j8113j5940j4244j2972j1978j1339j1043
62646E63606j0700r951q863p782o925o356o062n816n155l813k020l03Q54J115
62632D91829M24o90j385j346j111j211j402j257j053j379k044k159j306P6J536
62617D77522L069M528N320N142M539M318M765N798P348R033R963R668R099R949
62603E70061J2803J6526J9657K1999K4518K8064L2555L7298M1859M6466N1654
62592I03460N7490O3234O7873P0964P2752P3486P2886P0336O5310N7508M6962
62581A622261L4384K1128Q346l895j6183k8445l9519m8238n4505n8976o2028o3576
$$ y = [1325729, 1249901, 1178968, 1113602, 1053177, 996826, 944606, 897185, 854722, 816693, 782652, 752494, 725839, 701780, 679573, 659235, 641122, 625182, 610938, 597966, 585988, 574649, 563606, 552906, 542955, 534092, 526310, 519385, 513029, 506967, 501151, 495996, 492183, 490163, 489860, 490714, 491829, 492253, 491563, 490178, 488832, 487721, 486510, 485108, 483851, 482798, 481419, 479375, 477216, 475910, 475986, 477522, 480591, 485119, 490439, 495581, 500120, 504438, 509203, 515001, 522349, 531382, 541345, 551013, 560112, 570061, 582864, 599390, 619047, 641046, 665564, 693628, 726183, 763481, 805340, 851806, 903460, 960950, 1024184, 1092057, 1163021, 1235773, 1309259, 1382145, 1452481, 1517791, 1575299, 1622261, 1656645, 1677773, 1686119, 1682224, 1666041, 1637596, 1598077, 1549839, 1495334, 1436358, 1374330, 1310754]
62569A310754o3681o2767o1132n8782n5760n2286m8481m4363m0233l6530l3145
62558G53594k9445k5298k1527j8900j7103j5342j3504j2014j0833r520q198p520
62546E64390p444o940n333l254j758j061p52p51j212j741j510l89O88P16k82j374
62530E31993j654r01M49J774K805L900N680Q288J1083J3163J4260J5101J6842
62517F22783K0054K4192K8064L0957L3267L5994L9588M3511M6887M9346N1006
62506A025649N1800N1224M8874M4971M0084L4437K7730J9704J0741J862n818j1682
62494A339576j5802j8639k0406k0774j9247j5811j1060n725k53N173J0484J5672
62482A243188K0714K5517K9975L4037L7310L8634L6605L0913K2902J4516O822
$$ y = [1310754, 1247073, 1184306, 1123174, 1064392, 1008632, 956346, 907865, 863502, 823269, 786739, 753594, 724149, 698851, 677324, 658424, 641321, 625979, 612475, 600461, 589628, 580108, 571910, 564390, 556946, 550006, 544673, 541419, 539661, 538600, 537848, 537097, 535885, 534144, 532634, 532245, 532933, 533649, 533367, 531993, 530339, 529438, 529887, 531661, 534466, 538366, 544046, 552334, 563417, 576580, 590840, 605941, 622783, 642837, 667029, 695093, 726050, 759317, 795311, 834899, 878410, 925297, 974643, 1025649, 1077449, 1128673, 1177547, 1222518, 1262602, 1297039, 1324769, 1344473, 1355214, 1357076, 1351258, 1339576, 1323774, 1305135, 1284729, 1263955, 1244708, 1228897, 1217837, 1212112, 1211859, 1217032, 1227516, 1243188, 1263902, 1289419, 1319394, 1353431, 1390741, 1429375, 1465980, 1496893, 1519795, 1534311, 1541133]
62471A541133l73p819j6157k5622l5787m5497n3419n8799o1652o2431o1717o0068
62459A051792n7826n5035n1726m8068m4043l9291l3740k8221k3807k0568j7509
62448F31958j3932j0383p867o481n171k915J93L138N130O330P354Q329Q859Q752
62434F33294Q230P322N737L580J562m3k022n072q562j1223j2740j3713j4345j4213
62420E77792j3313j2283j1429j0454r339q571q195p604o604n838n692n590n004
62407D67876m388m386m707m510l516k122p58L14Q22P24L55J2k43j25R15K785M348
62390D53396M636L988L329K836K132J505J870L512N595P028P323O639N617N133
62376E14539N616O540P059P065P111P482P916Q232Q531Q822R094R760J1316J3475
$$ y = [1541133, 1540760, 1532941, 1516784, 1491162, 1455375, 1409878, 1356459, 1297660, 1236008, 1173577, 1111860, 1051792, 993966, 938931, 887205, 839137, 795094, 755803, 722063, 693842, 670035, 649467, 631958, 618026, 607643, 599776, 593295, 588124, 585209, 585402, 588540, 593670, 600000, 607354, 615683, 624542, 633294, 641524, 648846, 654583, 658163, 659725, 659682, 657660, 652588, 644026, 632803, 620063, 606350, 592005, 577792, 564479, 552196, 540767, 530313, 520974, 512403, 504208, 496604, 490000, 484162, 478470, 472880, 467876, 463488, 459102, 454395, 449885, 446369, 444247, 443489, 443803, 444625, 445349, 445704, 445716, 445473, 445348, 446263, 449048, 453396, 458032, 462020, 465349, 468185, 470317, 471822, 473692, 477204, 482799, 489827, 497150, 503789, 509406, 514539, 520155, 526695, 533754, 540819, 547930, 555412, 563328, 571560, 580091, 588913, 598007, 607767, 619083, 632558]
62362F32558J5354J6794J8683K1705K5412K9061L2698L6727M0773M3789M5313
62351I58867M5871M6003M5347M3031L8689L2786K6066J9137J2595P071K677j352
62339A276788n920j0918j5342j8610k1205k3724k5870k6871k6558k5386k3682
62328A052702k1538j9284j7472j6357j5838j5863j6445j7294j8018j8655j9635
62317H56303k1095k2737k4248k5358k5528k4340k2335k0779k0165j9519j7666
62306F12533j4774j2035j0153q710p043n207l852l369l427l291k525j260J22J362
62292E38371K312K846L031L251L732M152L999L362K878K900L111L054K715K400
62278E82114K357K642L047L075K250P03p22j171m33J067K701M002M887N721O999
$$ y = [632558, 647912, 664706, 683389, 705094, 730506, 759567, 792265, 828992, 869765, 913554, 958867, 1004738, 1050741, 1096088, 1139119, 1177808, 1210594, 1236660, 1255797, 1268392, 1275463, 1278140, 1276788, 1270868, 1259950, 1244608, 1225998, 1204793, 1181069, 1155199, 1128328, 1101770, 1076384, 1052702, 1031164, 1011880, 994408, 978051, 962213, 946350, 929905, 912611, 894593, 875938, 856303, 835208, 812471, 788223, 762865, 737337, 712997, 690662, 669883, 649718, 630199, 612533, 597759, 585724, 575571, 566861, 559818, 554611, 550759, 547390, 543963, 540672, 538147, 536887, 537009, 538371, 540683, 543529, 546560, 549811, 553543, 557695, 561694, 565056, 567934, 570834, 573945, 576999, 579714, 582114, 584471, 587113, 590160, 593235, 595485, 596188, 595466, 594295, 593862, 594929, 597630, 601632, 606519, 612240, 619239]
62263F19239Q873J1096J3450J6017J8973K2372K6190L0381L4806L9280M3671M7744
62251I32092N0922N2479N2111N0090M6821M2393L6673K9714K2049J4593Q016K082
62239A340035m205j1522j9552k7494l4776m0838m4815m6275m6006m5172m3840
62228I75540m1206l7252l3036k9234k5460k1434j7740j4877j2513j0376q968q603
62216G14841q477p695o624o258o705p286p769q394q893q648p893p675q314q750
62202F05460p911o030m216l140k618k154j515q20k84J13O74J594K695L749M810
62187E90407N870O475O268N770N979P030P955P962P359O874O523N731M411L349
62173F77963L408M586O096P308Q435J0172J2832J6144J9837K3948K8276L2063
$$ y = [619239, 628112, 639208, 652658, 668675, 687648, 710020, 736210, 766591, 801397, 840677, 884348, 932092, 983014, 1035493, 1087604, 1137694, 1184515, 1226908, 1263581, 1293295, 1315344, 1329937, 1337953, 1340035, 1335830, 1324308, 1304756, 1277262, 1242486, 1201648, 1156833, 1110558, 1064552, 1019380, 975540, 934334, 897082, 864046, 834812, 809352, 787918, 770178, 755301, 742788, 732412, 723444, 714841, 706364, 698669, 692045, 685787, 679082, 671796, 664027, 655633, 646740, 638092, 630199, 622524, 614210, 605460, 597549, 591519, 587303, 584163, 581545, 579391, 577876, 577056, 576772, 576885, 577559, 579153, 581848, 585597, 590407, 596277, 602752, 609020, 614790, 620769, 627799, 635754, 643716, 651075, 657949, 664472, 670203, 674614, 677963, 681371, 685957, 692053, 699361, 707796, 717968, 730800, 746944, 766781, 790729, 819005, 851068]
62161H51068L4685L6321L7370L7444L5638L1727K6484K0808J5150R893N520K066
62149A144174j156m889r246j3846j8230k1968k4721k6376k6963k6346k4418k1589
62137I24426j8634j5892j3084j0079p318n206l625k403j749j741j864j607j195
62124H40029j131j281r66J48J799L661N554P141P966Q041P947Q113Q135P151M792
62109I07099J712r43k582l555m452n217n389n047m927n359n772n540m799l919
62095H51310k769j141N32J734K806M437O316P276O910O130N819N783N489N131
62081I05763N256N794O207O462P148Q570J0172J1169J1523J2039J3385J5182J6254
62068A034924J5907J4713J3843J3868J4550J5557J6841J8313J9711K0872K1591
$$ y = [851068, 885753, 922074, 959444, 996888, 1032526, 1064253, 1090737, 1111545, 1126695, 1136588, 1142108, 1144174, 1143018, 1138129, 1128883, 1115037, 1096807, 1074839, 1050118, 1023742, 996779, 970433, 946015, 924426, 905792, 889900, 876816, 866737, 859419, 854213, 850588, 848185, 846436, 844695, 842831, 841224, 840029, 838898, 837617, 836651, 836799, 838598, 842259, 847813, 854954, 862920, 870961, 878908, 887021, 895156, 902307, 907099, 908811, 907868, 905286, 901731, 897279, 892062, 886673, 881626, 876699, 871340, 865568, 860028, 855229, 851310, 848541, 847400, 847932, 849666, 852472, 856909, 863225, 870501, 877411, 883541, 889360, 895143, 900632, 905763, 911019, 916813, 923020, 929482, 936630, 945200, 955372, 966541, 978064, 990103, 1003488, 1018670, 1034924, 1050831, 1065544, 1079387, 1093255, 1107805, 1123362, 1140203, 1158516, 1178227, 1199099, 1220690]
62057A220690K1189J8878J4871J0512O925L950Q15k662o127r567j3426j7851k2371
62044A225826k6378k9650l2294l4469l6144l7081l7106l6411l5387l4120l2423
62033H54363l0451k8742k7353k5503k2631j9406j6994j5618j4476j3024j1592
62022F28573j0737j0521j0571j0421r715q444p060o016n342m905m920n537o152
62009E28232n835m596l449l001k670j686k71P29J041J180J655K479L457M509N524
61994E27298O131N875M721L281K292J849J331K50j124k274l203m245n341o008
61980E30833o028n651n189m802m633m677m593m191l902m177m579m290l502l203
61966D67416l547l459k350j151r12j274j169m02L23N42L08l10j213j941k049j654
$$ y = [1220690, 1241879, 1260757, 1275628, 1286140, 1293065, 1297015, 1297830, 1295168, 1289041, 1279474, 1266048, 1248197, 1225826, 1199448, 1169798, 1137504, 1103035, 1066891, 1029810, 992704, 956293, 920906, 886786, 854363, 823912, 795170, 767817, 742314, 719683, 700277, 683283, 667665, 653189, 640165, 628573, 617836, 607315, 596744, 586323, 576608, 568164, 561104, 555088, 549746, 544841, 539921, 534384, 528232, 522397, 517801, 514352, 511351, 508681, 506995, 506724, 507453, 508494, 509674, 511329, 513808, 517265, 521774, 527298, 533429, 539304, 544025, 547306, 549598, 551447, 552778, 553028, 551904, 549630, 546427, 542182, 536841, 530833, 524805, 519154, 513965, 509163, 504530, 499853, 495260, 491069, 487167, 482990, 478411, 474121, 470619, 467416, 463869, 460410, 458060, 456909, 455997, 454723, 453554, 453152, 453475, 454017, 454325, 454015, 452802, 450861, 448812, 447158]
61950D47158j069k00J099K385L095L474M250N535O734P549Q244Q920R219R033
61936E15426Q831R008R292R176Q651Q198Q099P993P270N935M842M626M594L375
61922F15316Q34j537k616l134m386o150p053o520n236l790k123l35J047J922K846
61907E79085M127N417O467P419Q174Q214P401O181M734K722K04j950l120l656
61893F31419m123m525m778n214n891o065n149l732k862k669k514k237k392l214
61879E76054m166m686m844n031n395n730n736n289m645m260m212l967l026j720
61865E13347q85p28m27R24L224N438O703P153P554Q302R108R692J0419J1814J3698
61850F05336J5332J6392J7276J8296J9169J9487J9185J8232J6290J3274R810O692
$$ y = [447158, 446089, 445889, 446988, 449373, 452468, 455942, 460192, 465727, 472461, 480010, 488254, 497174, 506393, 515426, 524257, 533265, 542557, 551733, 560384, 568582, 576681, 584674, 591944, 597879, 602721, 607347, 611941, 615316, 616150, 614613, 611997, 608863, 604477, 598327, 591274, 584754, 579518, 575728, 573605, 573270, 574317, 576239, 579085, 583212, 588629, 595096, 602515, 610689, 618903, 626304, 632485, 637219, 639941, 640145, 638195, 635075, 631419, 627296, 622771, 617993, 612779, 606888, 600823, 595674, 591942, 589080, 586411, 583897, 581660, 579268, 576054, 571888, 567202, 562358, 557327, 551932, 546202, 540466, 535177, 530532, 526272, 522060, 518093, 515067, 513347, 512462, 511734, 511307, 512231, 515455, 520893, 527596, 534749, 542303, 550605, 559713, 569405, 579824, 591638, 605336, 620668, 637060, 654336, 672632, 691801, 711288, 730473, 748705, 764995, 778269, 788079, 794771]
61838G94771L974J092k163n184p107p617p176o650o535o499n797m193k195k77
61824G38444J739M084O250P260O731N229L505J693n61l396o350q688j0160j1248
61810G34532j2524j3915j4873j5202j5201j4981j4195j2753j1283j0450j0118
61799E89037r653q854q116p762p654p408o731n586m182k880j950j535j769k579
61785E12378l317l087j802m53M7j35l46n51j099j701j504l32R70J630J792J972
61769E04462K197K150J881J849K368L279M174M720M849M749M772N107N548N643
61755E57748N224M630M355M418M291L468J967J73j554k941l685l773l752m248
61741E66321n112n530n084m288l819l618l068j862m26M10J30r26j704j438m64
$$ y = [794771, 798745, 799837, 797674, 792490, 785383, 777766, 770590, 763940, 757405, 750906, 745109, 740916, 738721, 738444, 740183, 744267, 750517, 757777, 764508, 769737, 773242, 774935, 774374, 770978, 764628, 755940, 745780, 734532, 722008, 708093, 693220, 678018, 662817, 647836, 633641, 620888, 609605, 599155, 589037, 579384, 570530, 562414, 554652, 546998, 539590, 532859, 527273, 523091, 520211, 518261, 516726, 514957, 512378, 509061, 505974, 504172, 503719, 503766, 503631, 503285, 502734, 501635, 499934, 498430, 498098, 499068, 500698, 502490, 504462, 506659, 508809, 510690, 512539, 514907, 518186, 522360, 527080, 531929, 536678, 541450, 546557, 552105, 557748, 562972, 567602, 571957, 576375, 580666, 584134, 586101, 586274, 584720, 581779, 578094, 574321, 570569, 566321, 561209, 555679, 550595, 546307, 542488, 538870, 535802, 533940, 533514, 533924, 534054, 533128, 531424, 529986, 529522]
61726E29522L39P98J474K419K770K065J108R02J302J517J456J681K255K529K106
61711E54243J332P05L73K78K98J70l31j048j621j960k209k328k168j890j835j926
61695E40083j743j242r91j417k188k565k219j510j062j104j298j269j224j673
61681E18578k480k741j966q97o21j213j882k109k005j733j337j121j435k076k424
61666D92538k314k096j874j338m85J86L79L77M42M39L17L60O18O15P3n43o78n21
61648D86495o69j120j170l01J149K331K641K125J244L87l68r95j231p79K18J132
61632D91089J360P48l59j332j587j064l80k77q97j761k444k954l449l929m293
61617D68471m484m441m134l678l277l037k912k815k716k647k728l041l369l350
$$ y = [529522, 529861, 530659, 532133, 534552, 537322, 539387, 540495, 541397, 542699, 544216, 545672, 547353, 549608, 552137, 554243, 555575, 556280, 556653, 556931, 557229, 557399, 557068, 556020, 554399, 552439, 550230, 547902, 545734, 543844, 542009, 540083, 538340, 537098, 536107, 534690, 532502, 529937, 527718, 526208, 525146, 524042, 522744, 521475, 520251, 518578, 516098, 513357, 511391, 510494, 509873, 508660, 506778, 504669, 502664, 500931, 499594, 498473, 497038, 494962, 492538, 490224, 488128, 486254, 484916, 484431, 484617, 484996, 485373, 485815, 486254, 486571, 486931, 487549, 488164, 488237, 487694, 487016, 486495, 485826, 484706, 483536, 483235, 484384, 486715, 489356, 491481, 492725, 493112, 492744, 491749, 490518, 489739, 489957, 491089, 492449, 493197, 492838, 491506, 489919, 488855, 488475, 488198, 487301, 485540, 483096, 480142, 476693, 472764, 468471, 463987, 459546, 455412, 451734, 448457, 445420, 442508, 439693, 436977, 434330, 431602, 428561, 425192, 421842]
61603D21842k991k714k685k548k146k030k685l646m090l992l936l979l630k872
61589C77898k354k384k568k572k536k522k224j629j220j241j318j174j099j316
61575C51741j452j105n10j52j12k26n28j048j467j427j054p78p77q19n41K47J363
61558C41355K203K218J569R79P99O20op91j067n93K27P79P37L20J72P25J630K084
61540C53960J795J189P27M69M88J048K069K836K689J715N58k03l44p0J8n54j522
61523C66868k091j924j448j148j086j157j262j069l30M10K90m86o67K53J189J043
61507C57385J54o24j297k177k727k242j210p59r53q18J5Q63J240J456J762J847
61491C51915J602J500J830K118J769Q59l1m67l88nL39M61N45Q97J494K083K621
$$ y = [421842, 418851, 416137, 413452, 410904, 408758, 406728, 404043, 400397, 396307, 392315, 388379, 384400, 380770, 377898, 375544, 373160, 370592, 368020, 365484, 362962, 360738, 359109, 357889, 356648, 355330, 354156, 353057, 351741, 350289, 349184, 348674, 348522, 348410, 348184, 347656, 346608, 345141, 343714, 342660, 341882, 341105, 340286, 339745, 339992, 341355, 343558, 345776, 347345, 348324, 349123, 349743, 349737, 348946, 347879, 347286, 347513, 348292, 349029, 349349, 349521, 350246, 351876, 353960, 355755, 356944, 357671, 358140, 358628, 359676, 361745, 364581, 367270, 368985, 369543, 369340, 368996, 368926, 368944, 368390, 366868, 364777, 362853, 361405, 360257, 359171, 358014, 356752, 355683, 355353, 355763, 356053, 355567, 354900, 355153, 356342, 357385, 357539, 356915, 355618, 353441, 350714, 348472, 347262, 346503, 345550, 344732, 344747, 345610, 346850, 348306, 350068, 351915, 353517, 355017, 356847, 358965, 360734, 361593, 361562, 361095, 360707, 360702, 361041, 361502, 362047, 362944, 364438, 366521, 369142]
61474C69142L195L536L155K047Q44J06k30n53j044j566j855j700j133m66l4Q3
61458C73527lj65k66j70M3L5k80n17l05J76N58P92R92J069J019J233J886K382
61440C82006K097J444J315J643J455M86k68L3R56J562J641J653J830K000K004
61425D01857J865J651J464J431J484J343R47O86R69J721K445K745K623K349K108
61410D27688J718Q52l65j198j116n96o04j348k063k098j638j174p91l68q8k84
61394D16527r39j588j724j217m65j02l23n70j95O33J125R73O89P35R03Q96R44
61377D16302J360J911K108J960J900K130K399K376J955J335R61J177J677J703
61363D41254J037M81P96J576J807J383J237J852K555K603K328K604L583M639N372
$$ y = [369142, 372337, 375873, 379028, 381075, 381919, 382025, 381795, 381242, 380198, 378632, 376777, 375077, 373944, 373478, 373444, 373527, 373524, 373359, 373093, 372923, 372966, 373001, 372721, 372204, 371899, 372075, 372633, 373425, 374417, 375486, 376505, 377738, 379624, 382006, 384103, 385547, 386862, 388505, 389960, 390446, 390178, 390211, 391167, 392729, 394370, 396023, 397853, 399853, 401857, 403722, 405373, 406837, 408268, 409752, 411095, 412042, 412728, 413697, 415418, 417863, 420608, 423231, 425580, 427688, 429406, 430258, 429893, 428695, 427579, 426983, 426379, 425031, 422968, 420870, 419232, 418058, 417267, 416899, 416811, 416527, 415588, 414000, 412276, 411059, 410594, 410492, 410169, 409599, 409404, 410037, 411162, 412135, 412824, 413559, 414462, 415358, 416302, 417662, 419573, 421681, 423641, 425541, 427671, 430070, 432446, 434401, 435736, 436697, 437874, 439551, 441254, 442291, 442772, 443568, 445144, 446951, 448334, 449571, 451423, 453978, 456581, 458909, 461513, 465096, 469735, 475107]
61348D75107N982O618O940O608N816N036M466L965L372K675J975J496J479J811
61334E33346J892J294M40K05P57J258R17n0p71p27q5P03J247J294R18O32J040
61317E44310K235L707M826N331N441N610O172P136Q378R963J1947J3864J4921
61304F43841J5048J5202J6134J7202J7100J5556J3456J1310Q453M272m57m086
61292G73031n787o288o966q499j0440j1865j2320j2138j1937j2030j2307j2471
61280F49983j2128j0947r086p292o191n520m498k940j482o29j01O45J611K299
61266E93724K344J890J438J513K282L446M559N504O484P635Q801R703R921Q956
61252F68200O724M094K358J889J768R65m47j590j926j716j482j424j387j119n26
$$ y = [475107, 481089, 487707, 494647, 501255, 507071, 512107, 516573, 520538, 523910, 526585, 528560, 530056, 531535, 533346, 535238, 536532, 536972, 537177, 537934, 539192, 540109, 540059, 539288, 538561, 538476, 539179, 540426, 541720, 542638, 543270, 544310, 546545, 550252, 555078, 560409, 565850, 571460, 577632, 584768, 593146, 603109, 615056, 628920, 643841, 658889, 674091, 690225, 707427, 724527, 740083, 753539, 764849, 773302, 777574, 777117, 773031, 767244, 760956, 753990, 745491, 735051, 723186, 710866, 698728, 686791, 674761, 662454, 649983, 637855, 626908, 617822, 610530, 604339, 598819, 594321, 591381, 589899, 589270, 589169, 589814, 591425, 593724, 596068, 597958, 599396, 600909, 603191, 606637, 611196, 616700, 623184, 630819, 639620, 649323, 659244, 668200, 674924, 679018, 681376, 683265, 685033, 685998, 685551, 683961, 682035, 680319, 678837, 677413, 676026, 674907, 674381]
61237F74381K16Q19J122J116Q04K76p4K18J202K498L830N204O494P309P577P836
61221G20828Q573R513R982R746R197Q812Q739Q830Q781Q324P517O779O469O474
61207H38564O354N774M673L301K235K090K912M052M869N385O052P119Q555J0277
61193I12212J2129J3800J5128J6189J6747J5989J3381R577N866K866L96j599k954
61180A029727m027n540p437q832r486j0266j1601j2565j2487j2542j4271j7010
61168I03663j8355j7275j5351j4503j4792j5175j5301j5545j5854j5672j4790
61157G31050j3502j2035j0434q889p569o293m834l378k173r60N40J857K256J909
61143F67545J677J663R65q67k993m372m940n152m996m201k942j598j01J761L627
$$ y = [674381, 674597, 675416, 676538, 677654, 678458, 678734, 678660, 678878, 680080, 682578, 686408, 691612, 698106, 705415, 712992, 720828, 729401, 738914, 748896, 758642, 767839, 776651, 785390, 794220, 803001, 811325, 818842, 825621, 832090, 838564, 844918, 850692, 855365, 858666, 860901, 862991, 865903, 869955, 874824, 880209, 886261, 893380, 901935, 912212, 924341, 938141, 953269, 969458, 986205, 1002194, 1015575, 1025152, 1031018, 1033884, 1034280, 1032681, 1029727, 1025700, 1020160, 1012723, 1003891, 994405, 984139, 972538, 959973, 947486, 934944, 920673, 903663, 885308, 868033, 852682, 838179, 823387, 808212, 792911, 777366, 761512, 745840, 731050, 717548, 705513, 695079, 686190, 678621, 672328, 667494, 664116, 661943, 660983, 661523, 663380, 665636, 667545, 669222, 670885, 671850, 670983, 667990, 663618, 658678, 653526, 648530, 644329, 641387, 639789, 639688, 641449, 645076]
61128F45076M808N292N891P310R448J1732J3781J5616J7472J9501K1549K3297
61116H00773K4627K5774K6874K7718K8111K8244K8357K8241K7458K6010K4378
61105A096565K2831K0992J8269J4596J0733P611N333K854r89o088j1151j5246
61093A166310j8744k2361k5841k8190k8990k8853k8674k8893k9382k9673k9257
61082H67452k7936k5946k3598k0996j8338j6109j4624j3581j2471j1221j0103
61071F72529r212q453p809p176o123m335k226o24J21M20R44K115L899N675O500
61056F46245N990M920M560N494P357R447J1297J2833J4365J6215J8094J9232J9535
61043G95584K0031K1611K3739K5151K5517K5589K5892K6172K6192K6267K6878
$$ y = [645076, 649884, 655176, 661067, 668377, 677825, 689557, 703338, 718954, 736426, 755927, 777476, 800773, 825400, 851174, 878048, 905766, 933877, 962121, 990478, 1018719, 1046177, 1072187, 1096565, 1119396, 1140388, 1158657, 1173253, 1183986, 1191597, 1196930, 1199784, 1198795, 1192707, 1181556, 1166310, 1147566, 1125205, 1099364, 1071174, 1042184, 1013331, 984657, 955764, 926382, 896709, 867452, 839516, 813570, 789972, 768976, 750638, 734529, 719905, 706324, 693853, 682632, 672529, 663317, 654864, 647055, 639879, 633756, 629421, 627195, 626571, 626692, 627112, 628056, 630171, 634070, 639745, 646245, 652235, 657155, 661715, 667209, 674566, 684013, 695310, 708143, 722508, 738723, 756817, 776049, 795584, 815615, 837226, 860965, 886116, 911633, 937222, 963114, 989286, 1015478, 1041745, 1068623]
61032A068623K8134K9692L0944L1456L1538L2115L3553L5099L5889L5993L5935
61021A428971L5816L5799L6814L9757M4397N0007N6509O4015P1816P9200Q6826
61010B029927R6082J07660J22240J41916J69096K04477K48108L02060L69746M53014
61000D244326N52890O73211Q20267R98060J205707J434617J655015J799353J775185
60991A5158631J523303J079883N75946J62209p3868j27405l8109J39357L24754
60982A8724701M04249K75282p9311n65629j036523j380263j563041j608071j555072
60973A1616322j439745j292028j135253r83280q42125p14736o02607n04990m20302
60964C681256l48346k89471k42274k04154j73471j49425j30491j14808j01587
$$ y = [1068623, 1096757, 1126449, 1157393, 1188849, 1220387, 1252502, 1286055, 1321154, 1357043, 1393036, 1428971, 1464787, 1500586, 1537400, 1577157, 1621554, 1671561, 1728070, 1792085, 1863901, 1943101, 2029927, 2126009, 2233669, 2355909, 2497825, 2666921, 2871398, 3119506, 3421566, 3791312, 4244326, 4797216, 5470427, 6290694, 7288754, 8494461, 9929078, 11584093, 13383446, 15158631, 16681934, 17761817, 18337763, 18499972, 18426104, 18298699, 18260590, 18399947, 18724701, 19128950, 19404232, 19324921, 18759292, 17722769, 16342506, 14779465, 13171394, 11616322, 10176577, 8884549, 7749296, 6766016, 5923891, 5209155, 4606548, 4101558, 3681256, 3332910, 3043439, 2801165, 2597011, 2423540, 2274115, 2143624, 2028816, 1927229]
60955A927229r0522q0333o9619n8739m9189m1420l4674k8741k4280k1540k0018
60944A408154j9311j9157j8862j7827j6392j5137j3820j2010j0289r445r014p958
60932A238932o421n298m474l040j137R4L59N68J219J860K175K272J868N37j095
60917A228419j858j853k403l909n314o020o885q617j0569j1839j2580j3332j3982
60904A129258j4156j4074j4275j4814j5244j5187j4684j4156j4029j4200j4191
60893I70248j4103j4732j6129j6899j5967j4351j3763j4097j3936j3122j2911
60882H10238j3544j3694j2742j1780j1682j1772j1233j0366r608q612p277o471
60870F81457o775p382p235o444n765n437n273n199n007m285l213k740l354m353
$$ y = [1927229, 1836707, 1756374, 1686755, 1628016, 1578827, 1537407, 1502733, 1473992, 1449712, 1428172, 1408154, 1388843, 1369686, 1350824, 1332997, 1316605, 1301468, 1287648, 1275638, 1265349, 1255904, 1246890, 1238932, 1232511, 1227213, 1222739, 1219699, 1218562, 1218656, 1219015, 1219583, 1220802, 1222662, 1224837, 1227109, 1228977, 1229514, 1228419, 1226561, 1224708, 1222305, 1218396, 1213082, 1207062, 1200177, 1191560, 1180991, 1169152, 1156572, 1143240, 1129258, 1115102, 1101028, 1086753, 1071939, 1056695, 1041508, 1026824, 1012668, 998639, 984439, 970248, 956145, 941413, 925284, 908385, 892418, 878067, 864304, 850207, 836271, 823149, 810238, 796694, 783000, 770258, 758478, 746796, 735024, 723791, 713425, 703817, 695205, 687928, 681457, 674682, 667300, 660065, 653621, 647856, 642419, 637146, 631947, 626940, 622655, 619442, 616702, 613348, 608995]
60856F08995m861m867m701m367l945l893m301m524m123l485l038k614k121j968
60842E56187k315k696k967l665m845n553n236m719m895n344n199m600m245m138
60828D95770l817l298k827k143r15M71J347J621J549J179O68N74J028J268P96
60813D93271L82R36J929K064J122J09k14k5J85J31k90q80j204j282j759k839l592
60796D88044l188k220j925k486l144l528l851m030l775l403l495l836l654k996
60782D42513k764l255l659l278k468k012k132k433k487k237k087k471l120l027
60768D05083j609L68J667K038K221K677L104L107K720K207J835J814K073K223
60754D31528K140K164K297J882P50Q9J061K972M016L646K947K673K269J206K4
$$ y = [608995, 604134, 599267, 594566, 590199, 586254, 582361, 578060, 573536, 569413, 565928, 562890, 560276, 558155, 556187, 553872, 551176, 548209, 544544, 539699, 534146, 528910, 524191, 519296, 513952, 508753, 504153, 499908, 495770, 491953, 488655, 485828, 483685, 482770, 483241, 484588, 486209, 487758, 488937, 489605, 490179, 491207, 492475, 493271, 493653, 494589, 496518, 498582, 499704, 499813, 499599, 499574, 499759, 499890, 499600, 498720, 497516, 496234, 494475, 491636, 488044, 484856, 482636, 480711, 478225, 475081, 471553, 467702, 463672, 459897, 456494, 452999, 449163, 445509, 442513, 439749, 436494, 432835, 429557, 427089, 425077, 422945, 420512, 418025, 415788, 413701, 411230, 408110, 405083, 403474, 403842, 405509, 407547, 409768, 412445, 415549, 418656, 421376, 423583, 425418, 427232, 429305, 431528, 433668, 435832, 438129, 440011, 440761, 440850, 441911, 444883, 448899, 452545, 455492, 458165, 460434, 461640, 461664]
60739D61664o32j158k391m325o041o696o228n303m725m728m809m501m092m133
60725D01902m403m112l082k063j657j600j358r26p04r03j302j468j168p34p72
60710C75650j213j119M0J338J424L21p67j193j349j354o48P64J755J512O18P3
60694C75852n6j62k5Q49K134K902K878K723L063L821M624N286N690N633N112M505
60678D24829M203M177M195M356N034O119O741O189M891L904L427K577R07o69j117
60663D79763q92j361k874m331m715m147l345k716k336k215k180j892j290p41n75
60648D44153p03q94j036j023o62J7O11O75J08r04k087l165l853l954l463k668
60632D21152k056j945k078j888j252n78m9O64J549J840J111J90J21O02N24k13
$$ y = [461664, 461032, 459874, 457483, 453158, 447117, 440421, 434193, 428890, 424165, 419437, 414628, 410127, 406035, 401902, 397499, 393387, 390305, 388242, 386585, 384985, 383627, 382701, 381997, 381094, 379792, 378324, 377156, 376422, 375650, 374437, 373318, 373358, 374696, 376120, 376441, 375674, 374481, 373132, 371778, 371130, 371894, 373649, 375161, 375779, 375852, 375796, 375634, 375609, 376458, 378592, 381494, 384372, 387095, 390158, 393979, 398603, 403889, 409579, 415212, 420324, 424829, 429032, 433209, 437404, 441760, 446794, 452913, 459654, 465843, 470734, 474638, 478065, 480642, 481549, 480880, 479763, 478871, 477510, 474636, 470305, 465590, 461443, 458098, 455382, 453046, 450831, 448651, 446759, 445469, 444728, 444153, 443450, 442556, 441520, 440497, 439835, 439852, 440463, 441138, 441246, 440342, 438255, 435090, 431237, 427283, 423820, 421152, 419096, 417151, 415073, 413185, 411933, 411355, 411306, 411970, 413519, 415359, 416470, 416660, 416781, 417383, 417907, 417694]
60616D17694n36M1O32L15o45j281j022M5J385K211J979J008J36l70r19j556j594
60599D17523o27P91J850K313K321J990J600J513J533R68k03r21l97P72J466J463
60583D33955J264R91M17k02k45K68O32N52N89J287K387L280L883M695O132Q056
60567D67941R955J1383J2257J2822J3434J4204J4684J3938J1327P369L428L02
60555E93044k480n463p890q415p085n544m956m610l152n11K154L993N234O499
60541E60818Q063R849J1691J3428J4953J6258J7327J7966J7793J6400J3604R691
60529G27841N357J268k277n141p082q023q386q661q779q401p667o982o197m912
60515F51958l583l288l996m120k528q2J600K234K755L670M699N855P745J0649
$$ y = [417694, 417158, 417199, 417831, 418146, 417501, 416220, 415198, 415243, 416628, 418839, 420818, 421826, 421962, 421592, 420673, 419117, 417523, 416896, 417687, 419537, 421850, 424171, 426161, 427761, 429274, 430807, 431775, 431572, 430651, 430254, 431026, 432492, 433955, 435219, 436210, 436627, 436425, 436180, 436448, 437080, 437632, 438221, 439508, 441895, 445175, 449058, 453753, 459885, 467941, 477896, 489279, 501536, 514358, 527792, 541996, 556680, 570618, 581945, 589314, 592742, 593044, 590564, 585101, 577211, 568796, 561711, 556167, 551211, 546601, 543449, 542938, 545092, 549085, 554319, 560818, 568881, 578730, 590421, 603849, 618802, 635060, 652387, 670353, 688146, 704546, 718150, 727841, 733198, 734466, 732189, 727048, 719966, 711943, 703557, 694896, 686117, 677716, 670049, 663067, 656870, 651958, 648375, 645087, 641091, 636971, 634443, 634361, 635961, 638195, 640950, 644620, 649319, 655174, 662919, 673568]
60501F73568J4203J8220K2997K8508L3925L8496M2446M6448N0504N3813N5669
60490A078797N6053N5185N2846M8392M1330L1634J9639N947q378k1914l3548m2996
60478A282987n0408n5675n8407n8504n6393n2742m8260m3628l9184l4805l0511
60467G54470k6952k4648k2956k0704j7901j5793j4953j4354j2960j1290j0497
60456E61462j0553j0315r095p301n628m382l564l049k661k404k504k872k858k030
60442D92246r24m34o42q70p44n62o34r01j300j949k810l497l640l213k505j941
60426D65680j764j704j154J5J100J367R88O96Q25J200J729K392K776K371J408
60411D77925P12O38P48O60N97P99R89Q25M55K81M16O96R55J085J044R96J204J692
$$ y = [673568, 687771, 705991, 728988, 757496, 791421, 829917, 872363, 918811, 969315, 1023128, 1078797, 1134850, 1190035, 1242881, 1291273, 1332603, 1364237, 1383876, 1389823, 1381445, 1359531, 1325983, 1282987, 1232579, 1176904, 1118497, 1059993, 1003600, 950858, 902598, 858970, 819786, 784981, 754470, 727518, 702870, 679914, 659210, 641309, 625516, 610563, 596209, 583249, 571959, 561462, 550909, 540594, 531499, 524198, 518570, 514188, 510624, 507575, 504914, 502510, 500006, 497134, 494276, 492246, 491322, 490888, 490246, 489376, 488632, 488070, 487436, 486535, 485235, 483286, 480476, 476979, 473339, 470126, 467621, 465680, 463916, 462212, 461058, 461073, 462173, 463540, 464528, 465224, 466049, 467249, 468978, 471370, 474146, 476517, 477925, 478637, 479275, 480023, 480683, 481280, 482079, 483068, 483893, 484348, 484629, 485045, 485741, 486696, 487781, 488825, 489821, 491025, 492717]
60393D92717K222K713L260L706L631L047K652K982L619L692L026K318K270K860
60379E34715L504L707L479L285L542M056M117L305K100J376J404J700J852J975
60365E74117K192K087J197j86j140j090k33R99K394L704M446M449M274M661N703
60350F07574P027Q560J0403J1995J2240J0733Q304N952L780J400j120l373n273
60337F78202o986q320q858q681q354q134p716o948o228n946n883n616n165m920
60323E80447m991n058m872m549m246l852l222k516j993j540p08O97K352L935N525
60308E55409P351R358J1379J3427J5521J7463J9190K0935K2442K2390J9498J4226
60296G48589Q343K784l001r228j4532j7429j8130j7925j7381j6165j4277j2284
$$ y = [492717, 494939, 497652, 500912, 504618, 508249, 511296, 513948, 516930, 520549, 524241, 527267, 529585, 531855, 534715, 538219, 541926, 545405, 548690, 552232, 556288, 560405, 563710, 565810, 567186, 568590, 570290, 572142, 574117, 576309, 578396, 579593, 579407, 578267, 577177, 576944, 577943, 580337, 584041, 588487, 592936, 597210, 601871, 607574, 614601, 623161, 633564, 645559, 657799, 668532, 676836, 682788, 686568, 687968, 686848, 683475, 678202, 671216, 662896, 654038, 645357, 637003, 628869, 621153, 614205, 607977, 602031, 596148, 590532, 585367, 580447, 575456, 570398, 565526, 560977, 556731, 552879, 549657, 547141, 545148, 543608, 542900, 543597, 545949, 549884, 555409, 562760, 572118, 583497, 596924, 612445, 629908, 649098, 670033, 692475, 714865, 734363, 748589, 756932, 759716, 756715, 747487, 732955, 715526, 697396, 679471, 662090, 645925, 631648, 619364]
60284F19364j0386q256n914m028l140l173l731m395m719m548m308m512n012n300
60270E47942n368n528n560m918l821l209l329l333k635j773j374j098l66M91O90
60255E06811K21j72o4L22P61J317J958K431K646K763K759K342J383J91p88j284
60239E23597j231p46k14q4l87o15k36P01J610J949J740J489J659K244K846L179
60223E37501L287L386L612M036M715N536O188O484O669P123P811Q256Q204Q006
60209F20814Q182Q769R326R505R345Q982Q480Q017P938Q259Q387P747O607N745
60195G36103N275M398K625O77l86n37o84j350k211k903l605m517n384n928o268
60180G15305o574o627o249n792n781o121o252n937n462n009m354l389k484k046
$$ y = [619364, 608978, 600722, 594808, 590780, 587640, 584467, 580736, 576341, 571622, 567074, 562766, 558254, 553242, 547942, 542574, 537046, 531486, 526568, 522747, 519538, 516209, 512876, 510241, 508468, 507094, 505996, 505630, 506121, 506811, 507032, 506860, 506796, 507118, 507879, 509196, 511154, 513585, 516231, 518994, 521753, 524095, 525478, 525669, 524881, 523597, 522366, 521620, 521406, 521322, 520935, 520320, 520084, 520785, 522395, 524344, 526084, 527573, 529232, 531476, 534322, 537501, 540788, 544174, 547786, 551822, 556537, 562073, 568261, 574745, 581414, 588537, 596348, 604604, 612808, 620814, 628996, 637765, 647091, 656596, 665941, 674923, 683403, 691420, 699358, 707617, 716004, 723751, 730358, 736103, 741378, 745776, 748401, 749078, 748692, 748155, 747471, 746121, 743910, 741007, 737402, 732885, 727501, 721573, 715305, 708731, 702104, 695855, 690063, 684282, 678161, 671909, 665972, 660510, 655501, 651147, 647758, 645274, 643228]
60166F43228j970j836j526j353j625k158k326j656m75K15k12j098j138oJ164J241
60150F28469N37J93N86J100J363J768K533L063K759J961J523J761K348L065M076
60135F57105N483O954P914P938P054N789M785M257L958L739L694L647L092K085
60121G27494J602K331L560M029L686L620M337N007M709L567K346J522J096Q26
60107G69732K46j042k790m215m961n477o208o903p107o964o908o910o472n360
60093F98661l947k832k273j992j499p34k55n55j296j633j248n80p4K43L67J08
60077F80461n44j337k210l307m474n329n926o624p248p179o503o139o437o634
60063F10570o176n630n620n731n286m480l865l339k531j627r89m94j5M3l80k42
$$ y = [643228, 641258, 639422, 637896, 636543, 634918, 632760, 630434, 628778, 628303, 628518, 628306, 627208, 626070, 626064, 627228, 628469, 629006, 629199, 629785, 630885, 632248, 634016, 636549, 639612, 642371, 644332, 645855, 647616, 649964, 653029, 657105, 662588, 669542, 677456, 685394, 692448, 698237, 703022, 707279, 711237, 714976, 718670, 722317, 725409, 727494, 729096, 731427, 734987, 739016, 742702, 746322, 750659, 755666, 760375, 763942, 766288, 767810, 768906, 769732, 769978, 768936, 766146, 761931, 756970, 751493, 745285, 738382, 731275, 724311, 717403, 710493, 704021, 698661, 694714, 691882, 689609, 687617, 686118, 685384, 685129, 684574, 683278, 681645, 680397, 679817, 679743, 679986, 680353, 680461, 679917, 678580, 676370, 673063, 668589, 663260, 657334, 650710, 643462, 636283, 629780, 623641, 617204, 610570, 604394, 598764, 593144, 587413, 582127, 577647, 573782, 570443, 567912, 566285, 565296, 564802, 564787, 564830, 564450, 564208]
60047E64208J369L725N287N676N750O050O382O738P397Q052P935O877N363L670
60033F44479J842L50l52q49k136l957n001m974n097o185p457p936p849p930q079
60018E78869p627o410m935l809l447l945m876n489n455n043m570m068l563l129
60004E12503k630j967j581j925k495k218r66K73Q59J163J502J507J119J186K309
59989E08639L807M614M638M571M789N089N086M403K886J027l09r68j730l048m270
59974E39224m629m344m057l872l612l470l605l558k880j907j182m97O05J766K215
59959E06197K016J995K409K630K286J875J946K264K234J770J359J400J686J654
59945E33721J101N60P33J523K034J652P53O8k44n19q99j135r21j56R27J723J645
$$ y = [564208, 565577, 569302, 574589, 580265, 586015, 592065, 598447, 605185, 612582, 620634, 628569, 635446, 640809, 644479, 646321, 646671, 646319, 645470, 643334, 639377, 634376, 629402, 624305, 618120, 610663, 602727, 594878, 586948, 578869, 571242, 564832, 559897, 556088, 552641, 548696, 543820, 538331, 532876, 527833, 523263, 519195, 515632, 512503, 509873, 507906, 506325, 504400, 501905, 499687, 498721, 498994, 499853, 501016, 502518, 504025, 505144, 506330, 508639, 512446, 517060, 521698, 526269, 531058, 536147, 541233, 545636, 548522, 549549, 549240, 548272, 546542, 543494, 539224, 534595, 530251, 526194, 522322, 518710, 515240, 511635, 508077, 505197, 503290, 502108, 501611, 502216, 503982, 506197, 508213, 510208, 512617, 515247, 517533, 519408, 521354, 523618, 525852, 527622, 528981, 530381, 532067, 533721, 534822, 535382, 536115, 537638, 539672, 541324, 542077, 542145, 541901, 541382, 540483, 539348, 538427, 538271, 539198, 540921, 542566]
59928E42566R04N28J274K806M289N376O255P052P690Q077Q072P582P005P169Q314
59913F24959R467R410P986N960L947K091N69l94r50j500k117k621l084l761m535
59898F45427m958m834m249l201j657J3J209J770K004K085K030K206L164M715N793
59883F51517N688N014N026O165P637Q342P896O754N615M860M434M038L268J785
59869G28039l33k400l619l947m172m950o033o713o721o340n833n237m657m397
59855F62687m596m947m855l904k279p03K50Q01J704L272M992O181O593O221M983
59840F76400K968P05j196k336k312p18K060M553N354M424K735R39r02k528l379
59825F86767l486l721m662n714n846m937l921l541l463k781j254M04J423J754
$$ y = [542566, 543470, 543998, 545272, 548078, 552367, 557743, 563998, 571050, 578740, 586817, 594889, 602471, 609476, 616645, 624959, 634426, 643836, 651822, 657782, 661729, 663820, 664389, 663995, 663045, 661545, 659428, 656807, 653723, 649962, 645427, 640469, 635635, 631386, 628185, 626528, 626541, 627750, 629520, 631524, 633609, 635639, 637845, 641009, 645724, 651517, 657205, 662219, 667245, 673410, 681047, 689389, 697285, 704039, 709654, 714514, 718948, 722986, 726254, 728039, 727706, 725306, 721687, 717740, 713568, 708618, 702585, 695872, 689151, 682811, 676978, 671741, 667084, 662687, 658091, 653144, 648289, 644385, 642106, 641403, 641653, 642454, 644158, 647430, 652422, 658603, 665196, 671417, 676400, 679368, 680073, 678877, 676541, 674229, 673511, 675571, 680124, 685478, 689902, 692637, 693576, 692674, 690146, 686767, 683281, 679560, 674898, 669184, 663338, 658401, 654480, 650939, 647476, 644695, 643441, 643845, 645268, 647022]
59811F47022J662R76o07k625m039m410m266m158l982l563l167l009k872k679k817
59796F07466l349l538k902k141k143k571k435j704j250j306j147m96j37o73j547
59781E80127j808j311n81K3N17R32J231J480J743J886J777J591J716K271K906
59766E94500L153K976K775K863L070L060K888K891L137L430L813M562N512O028
59752F44658N930N855O240O547O096N170M598M547M437L898L177K614K325K346
59738G08438K586K703K368J677J003O16O46J104J605J514Q05K88M81P36K56n57
59722G26269o77n2L30n8p02j049j167j305j432j417j194p26l17o62j890k778j971
59705G09202J69J888K322K312K768L385L523L330L279L300L099K809K700K644
$$ y = [647022, 648684, 649660, 649053, 646428, 642389, 637979, 633713, 629555, 625573, 622010, 618843, 615834, 612962, 610283, 607466, 604117, 600579, 597677, 595536, 593393, 590822, 588387, 586683, 585433, 584127, 582980, 582484, 582347, 581674, 580127, 578319, 577008, 576427, 576450, 576967, 577899, 579130, 580610, 582353, 584239, 586016, 587607, 589323, 591594, 594500, 597653, 600629, 603404, 606267, 609337, 612397, 615285, 618176, 621313, 624743, 628556, 633118, 638630, 644658, 650588, 656443, 662683, 669230, 675326, 680496, 685094, 689641, 694078, 697976, 701153, 703767, 706092, 708438, 711024, 713727, 716095, 717772, 718775, 719391, 720037, 721141, 722746, 724260, 725065, 725353, 725834, 726570, 726826, 726269, 725592, 725540, 725870, 725812, 725110, 724061, 722894, 721589, 720157, 718740, 717546, 716820, 716503, 715841, 713951, 711173, 709202, 709371, 711259, 713581, 715893, 718661, 722046, 725569, 728899, 732178, 735478, 738577, 741386, 744086, 746730]
59691G46730K361J844J143J73q44j255q53m35r05k090l034l243l113l246l828
59676G29405m719n679o436o799o854o904p102p213o824n829m638l767l198k488
59662F50955j578j033j094j018K5J646K661K709K608L082L925M673N254N556N067
59647F83438L573J771N81M2o56k180m385o525p851q116p706p234o936o615o106
59632F25095n514m946m283l393k369j535j354k132l553m675m813m320m056m198
59618E73954m193l792l432l484l730l819l698l317k407r06P60K096K925L264L098
59603E53319K472J595P63L79P66J653K013J072o20j748j765j257q10l32L29R08
59587E58737J148J088P53N4p90j382j790k360k768k208p66L46L38k22n94j012
$$ y = [746730, 749091, 750935, 752078, 752251, 751407, 750152, 749299, 748864, 747959, 745869, 742835, 739592, 736479, 733233, 729405, 724686, 719007, 712571, 705772, 698918, 692014, 684912, 677699, 670875, 665046, 660408, 656641, 653443, 650955, 649377, 648344, 647250, 646232, 646257, 647903, 650564, 653273, 655881, 658963, 662888, 667561, 672815, 678371, 683438, 687011, 688782, 689363, 689405, 688749, 686569, 682184, 675659, 667808, 659692, 651986, 644752, 637816, 631201, 625095, 619581, 614635, 610352, 606959, 604590, 603055, 601701, 599569, 596016, 591341, 586528, 582208, 578152, 573954, 569761, 565969, 562537, 559053, 555323, 551504, 547806, 544489, 542082, 541176, 541936, 544032, 546957, 550221, 553319, 555791, 557386, 558149, 558528, 559294, 560947, 562960, 564032, 563412, 561664, 559899, 558642, 557832, 557500, 557829, 558737, 559885, 560973, 561726, 561780, 560990, 559608, 557818, 555458, 552690, 550482, 549716, 550062, 550400, 550178, 549584, 548572]
59571E48572j904k793k926k490k245k286k030j270m48M8J81m1n49q81m09R42K410
59554E31881L014K315Q04m11m83M26J449K042K417K909L481M070M949O398Q316
59539E73577J0425J2640J5033J7670K0313K1821K0161J4182N620j731n422o191
59527F98098n992n452m126k258p73N7O22Q33P7j576l162m101m799n771o857p642
59511F47178q100q434q658q699q625q540q321p678o506n120m119l834l887l526
59497E53131k511j400q45q31q55o11k57q1j25p8M63J498K480K969L189L565L881
59480E63582L669L297L721M978N957O056O038O560O849N864M028K726K432K440
59466F28197K226J968J725J202N25M47J354K655L505L816M214N237O796Q327R296
$$ y = [548572, 546668, 543875, 540949, 538459, 536214, 533928, 531898, 530628, 530180, 530228, 530409, 530368, 529819, 528938, 528529, 529471, 531881, 534895, 537210, 538014, 537603, 537120, 537546, 538995, 541037, 543454, 546363, 549844, 553914, 558863, 565261, 573577, 584002, 596642, 611675, 629345, 649658, 671479, 691640, 705822, 711442, 709711, 704289, 698098, 692106, 686654, 682528, 680270, 679497, 679554, 680176, 681009, 681086, 679510, 676348, 672247, 667448, 661677, 654820, 647178, 639078, 630644, 621986, 613287, 604662, 596122, 587801, 580123, 573617, 568497, 564378, 560544, 556657, 553131, 550620, 549220, 548375, 547544, 546689, 546078, 545821, 545740, 545615, 545537, 546000, 547498, 549978, 552947, 556136, 559701, 563582, 567251, 570548, 574269, 579247, 585204, 591260, 597298, 603858, 610707, 616571, 620599, 623325, 625757, 628197, 630423, 632391, 634116, 635318, 635843, 636290, 637644, 640299, 643804, 647620, 651834, 657071, 663867, 672194, 681490]
59451F81490R554R244Q492P432O435N870N522M608K611j71l061n610p619q953
59437G15844r589r591q940p737o516n818n390m504l161k170j797j245J67K119
59423F51672M018N853P703R350J0913J3051J5852J8323J9694K0427K1356K2676
59411H20888K4480K6850K8268K5283J5776K105j0499j8442k1486k0864j7637j2791
59399H41931p086n20O581J1833J1837N624m088j3431k0162k3818k4726k3777k2090
59386G38108k0047j7202j3536j0008p361n328l468k045j316p35L47J673K506K716
59372F64304K898L539M518N349N643N466N296N543O153O955Q082R530J0591J0538
59358G54405R867J0004J1577J3737J5374J6278J6803J7183J7600J8312J9249J9893
$$ y = [681490, 691044, 700288, 708780, 716212, 722647, 728517, 734039, 738647, 741258, 741087, 738026, 732416, 724797, 715844, 706255, 696664, 687724, 679987, 673471, 667653, 662263, 657759, 654598, 652428, 650631, 649386, 649553, 651672, 655690, 661543, 669246, 678596, 689509, 702560, 718412, 736735, 756429, 776856, 798212, 820888, 845368, 872218, 900486, 925769, 941545, 943650, 933151, 914709, 893223, 872359, 854722, 841931, 834845, 834325, 840906, 852739, 864576, 870200, 866112, 852681, 832519, 808701, 783975, 760198, 738108, 718061, 700859, 687323, 677315, 669954, 664626, 661158, 659113, 657797, 657062, 657409, 659082, 661588, 664304, 667202, 670741, 675259, 680608, 686251, 691717, 697013, 702556, 708709, 715664, 723746, 733276, 743867, 754405, 764272, 774276, 785853, 799590, 814964, 831242, 848045, 865228, 882828, 901140, 920389, 940282]
59346I40282J9915J9471J8635J7073J4688J2116J0091Q541O661L744k02m383p760
59333A058872r902j1415j3142j4995j6102j6095j5696j5770j6308j6571j5910
59322H96966j4304j2343j0841j0137r849r507r165q929q303o762m813l593l363
59309G85057l241k465j138M01K015L424M269M842N907P498Q885R956J1458J3208
59295H50076J3112R231K298m774r704j2343j3632j4109j3720j2512j0994r721
59283G73208q693p373n435l353j818p84M84K418M747P077R250J1093J2370J3146
59269H06337J3626J3628J2902J1945J1633J1791J1065Q568M937J316j963n111
59257I00674q069j0542j2374j3393j3387j2679j2143j2167j2100j1210r656q047
$$ y = [940282, 960197, 979668, 998303, 1015376, 1030064, 1042180, 1052271, 1060812, 1067473, 1071217, 1071015, 1066632, 1058872, 1048970, 1037555, 1024413, 1009418, 993316, 977221, 961525, 945755, 929447, 912876, 896966, 882662, 870319, 859478, 849341, 839492, 829985, 820820, 811891, 803588, 796826, 792013, 788420, 785057, 781816, 779351, 778213, 778614, 780629, 784053, 788322, 793164, 799071, 806569, 815454, 825410, 836868, 850076, 863188, 872419, 874717, 869943, 860239, 847896, 834264, 820155, 806435, 793923, 782929, 773208, 764515, 757142, 751707, 748354, 746536, 745752, 746236, 748654, 753401, 760478, 769728, 780821, 793191, 806337, 819963, 833591, 846493, 858438, 870071, 881862, 892927, 901495, 906432, 907748, 905785, 900674, 892605, 882063, 869689, 856296, 842909, 830230, 818087, 805920, 793820, 782610, 772954, 764907]
59245G64907o631n429m577l927k858j094P35J981K951M207N409N601M521K901
59231G68697J555O62p7j060k326l341l575l489m242o011p390p141n892n141n164
59216G16065m959l973k724j787j166p38m98k09M14J100J344J322J759K735L451
59201G12136L369K894K649K731L016L486L883L692K886K179K018J858J039o4n37
59186G47235k50R5J70M10J024J441J220R09J290K109K370J845J507K203L503M383
59170G71464M604M831N584O654P594Q263Q730R004R029Q721P915O499M654K728
59156H66274Q39j238l544n583o712o836o540o506o857p172p091o793o695o881
59142G88665p089p221p354p342o958o528o744p533p806o909n541m695m302l780
$$ y = [764907, 758276, 752847, 748270, 744343, 741485, 740391, 741126, 743107, 746058, 750265, 755674, 761275, 765796, 768697, 770252, 770914, 770837, 769777, 767451, 764110, 760535, 757046, 752804, 746793, 739403, 732262, 726370, 721229, 716065, 711106, 707133, 704409, 702622, 701456, 700718, 700220, 700011, 700425, 701525, 702869, 704191, 705950, 708685, 712136, 715505, 718399, 721048, 723779, 726795, 730281, 734164, 737856, 740742, 742921, 744939, 746797, 747836, 747772, 747235, 746985, 747080, 747250, 747660, 748684, 750125, 751345, 752254, 753544, 755653, 758023, 759868, 761375, 763578, 767081, 771464, 776068, 780899, 786483, 793137, 800731, 808994, 817724, 826728, 835757, 844478, 852393, 858892, 863546, 866274, 867113, 865875, 862331, 856748, 850036, 843200, 836660, 830154, 823297, 816125, 809034, 802241, 795546, 788665, 781576, 774355, 767001, 759659, 752701, 746173, 739429, 731896, 724090, 717181, 711640, 706945, 702643, 698863]
59128F98863l216k968k611j489l5P42R80J861L733N651P016Q358J0045J1493J2246
59113G50669J2750J3315J3320J2276J0836R803Q822O987M365J956L47q14k102
59100H42530l647n158o297o999p487p892p941p456p010p319p922p413n321k927
59086G51741j749j913k562l160l684m041m063l878l773l922m392n133n772n844
59072F97855n424m977m567l905l266l409m312m969m831m495m433m144l294k632
59058F39197k821l239k947k176j758j725j546j259j267j339r12j35L03K58J37
59043F18771%m73j193j575j260l84O45J233P91m89j501j482r98q74o85O47K981
59026F14154M813N143M605M571N686P516R145R953J0014R710Q949P177M426J774
$$ y = [698863, 695647, 692679, 690068, 688579, 688544, 689286, 690266, 692127, 695860, 701511, 708527, 716885, 726930, 738423, 750669, 763419, 776734, 790054, 802330, 813166, 822969, 831791, 838778, 843143, 845099, 845446, 844632, 842530, 838883, 833725, 827428, 820429, 812942, 805050, 797109, 789653, 782643, 775324, 767402, 759989, 754668, 751741, 749992, 748079, 745517, 742357, 738673, 734632, 730569, 726691, 722918, 718996, 714604, 709471, 703699, 697855, 692431, 687454, 682887, 678982, 675716, 672307, 667995, 663026, 658195, 653700, 649267, 645123, 641829, 639197, 636376, 633137, 630190, 628014, 626256, 624531, 622985, 621726, 620459, 619120, 618208, 618073, 618376, 618634, 618771, 618771, 618298, 617105, 615530, 614270, 613886, 614531, 615764, 616555, 616066, 614565, 613083, 612085, 611211, 610526, 611173, 614154, 618967, 624110, 628715, 633286, 638972, 646488, 655633, 665586, 675600, 685310, 694259, 701436, 705862, 707636]
59012G07636K31l51p38j184j491j744k201k678k705k135j113K38J728K973L790
58997G00256M318M458L896L056L087M240N191M798L750L353L509L129J990Q86
58983G49917K55p5m7N99J630K658L938N798P665Q777R539J0962J2955J4477J5281
58968H44329J6133J7258J7895J7636J7106J6929J6946J6701J5902J4297J1818
58957A022950Q900N984K890n98l941o652r438j3149j6920j8972j9269j9632k0901
58944I11252k1650k0483j8061j5878j4190j2290j0054q132o919o225n678n017
58932G66675m108l074k135j277m22J34j1n93p84k54M78Q13O70K80j0J90Q61J221
58914G58654O34l47o52k97k09n27k70J061K803M372O072Q112R928J1112J2163
$$ y = [707636, 707867, 707516, 706778, 705594, 704103, 702359, 700158, 697480, 694775, 692640, 691527, 691765, 693493, 696466, 700256, 704574, 709032, 712928, 715984, 719071, 723311, 728502, 733300, 737050, 740403, 743912, 747041, 749031, 749917, 750172, 750097, 750050, 750649, 752279, 754937, 758875, 764673, 772338, 781115, 790654, 801616, 814571, 829048, 844329, 860462, 877720, 895615, 913251, 930357, 947286, 964232, 980933, 996835, 1011132, 1022950, 1031850, 1037834, 1040724, 1040126, 1036185, 1029533, 1020095, 1006946, 990026, 971054, 951785, 932153, 911252, 889602, 869119, 851058, 835180, 820990, 808700, 798646, 790514, 783595, 777370, 771692, 766675, 762567, 759493, 757358, 756081, 755659, 755793, 755782, 755189, 754405, 754151, 754629, 755442, 756112, 756392, 756382, 756572, 757433, 758654, 759288, 758941, 758289, 757992, 757783, 757256, 756986, 758047, 760850, 765222, 771294, 779406, 789334, 800446, 812609]
58899H12609J3543J4775J5154J4814J4407J4218J4204J4479J5139J5981J6836
58888I76159J7923J9486K1280K2704K3240K2609K0755J7878J4289J0267O287L059
58876A175936Q18j243m183p993j1683j4447j6091j6451j5407j3540j1871j0764
58864A053081r794q753p928p308o493n653n705p106r149j0802j1628j1758j1582
58851I39422j1662j2237j2723j2323j1238j0427j0232j0086r718r637j0144j0784
58839H08211j1131j1313j1425j1217j0666j0076r485q629p663p034o513n320l483
58826F94256k001j385r78o1J268K706M217N533O139O159O371O896O865N906M916
58811G46807M767N124N179M752M013K892J438J30p79j697k980m396n624o631p257
$$ y = [812609, 826152, 840927, 856081, 870895, 885302, 899520, 913724, 928203, 943342, 959323, 976159, 994082, 1013568, 1034848, 1057552, 1080792, 1103401, 1124156, 1142034, 1156323, 1166590, 1172877, 1175936, 1176754, 1175511, 1171328, 1163335, 1151652, 1137205, 1121114, 1104663, 1089256, 1075716, 1063845, 1053081, 1043287, 1034534, 1026606, 1019298, 1012805, 1007152, 1001447, 994341, 985192, 974390, 962762, 951004, 939422, 927760, 915523, 902800, 890477, 879239, 868812, 858580, 848494, 838776, 829139, 818995, 808211, 797080, 785767, 774342, 763125, 752459, 742383, 732898, 724269, 716606, 709572, 703059, 697739, 694256, 692255, 690870, 689892, 689831, 691099, 693805, 698022, 703555, 709694, 715853, 722224, 729120, 735985, 741891, 746807, 751574, 756698, 761877, 766629, 770642, 773534, 774972, 775102, 774323, 772626, 769646, 765250, 759626, 752995, 745738]
58796G45738p192o673o443o663o686o277o148o764p470p310o045l967j497P06
58782F67309J991K532L187M319N450O158O342N627L706J452K18k02j439l913o015
58767F96722o631o782p679q784r067q856q902q722p371n117k972j218L17J213
58753F16151J033M31M57J118J700K044K533L144L577M032M961O332P804R247J0498
58738F75062J1114J1033J0881J0964J0646R518Q370Q090Q275P904O829N668M688
58725G89042L809L209L050K928K420J827J731K206L039M209N532O474O902P445
58711H43823Q407R026Q398O475L580k02m423p971j0237j1862j3593j5214j6361
58698G99846j7401j8630j9534j9759j9830j9974j9258j7037j4285j2249j0709
$$ y = [745738, 738546, 731873, 725430, 718767, 712081, 705804, 699656, 692892, 685422, 678112, 672067, 668100, 666603, 667309, 669300, 671832, 675019, 679338, 684788, 690946, 697288, 702915, 706621, 708073, 708291, 708089, 706650, 702737, 696722, 690091, 683309, 675630, 666846, 657779, 648923, 640021, 631299, 623928, 618811, 615839, 614621, 614938, 616151, 617184, 617615, 618072, 619190, 620890, 622934, 625467, 628611, 632188, 636220, 641181, 647513, 655317, 664564, 675062, 686176, 697209, 708090, 719054, 729700, 739218, 747588, 755678, 763953, 771857, 778686, 784354, 789042, 792851, 796060, 799110, 802038, 804458, 806285, 808016, 810222, 813261, 817470, 823002, 829476, 836378, 843823, 852230, 861256, 869654, 876129, 879709, 879507, 875084, 867113, 856876, 845014, 831421, 816207, 799846, 782445, 763815, 744281, 724522, 704692, 684718, 665460, 648423, 634138, 621889, 611180]
58687F11180q883p084o146n910n730n735o237o508n637m125l205k972k569j783
58673E38656j160q04l25L09R29J848L357M999O314P722R585J1067J1145J0101
58659F03743Q827P277M900J971q51l612o372q131q007o947o572o911o771n941
58645E66603n265m865m078k967k249j797q67L02P56O66J203K466L159K657J875
58630E57599J706J875J776J343P17n6p00q32n11m5N60J345J994K451L353M908
58614E77483O017N705M749M521M911M866M424M431M697M232L167K651K802K524
58600F37180J423L24k92q42j456j658j405j149o88O62K652M141M755N301O458
58585F55406Q184J0332J2663J4336J4621J4063J3682J3332J2142J0291Q779P712
$$ y = [611180, 602297, 595213, 589067, 583157, 577427, 571692, 565455, 558947, 553310, 549185, 545980, 543008, 540439, 538656, 537496, 536692, 536367, 536676, 537605, 539453, 542810, 547809, 554123, 561845, 571430, 582497, 593642, 603743, 612570, 619847, 624747, 626718, 625867, 622255, 615883, 607752, 599745, 592798, 586226, 579315, 572544, 566603, 561338, 556473, 552395, 549428, 547179, 545382, 544515, 544817, 545573, 546239, 547442, 549908, 553067, 555724, 557599, 559305, 561180, 562956, 564299, 565016, 564960, 564260, 563428, 562917, 562872, 563432, 564777, 566771, 569222, 572575, 577483, 583500, 589205, 593954, 598475, 603386, 608252, 612676, 617107, 621804, 626036, 629203, 631854, 634656, 637180, 638603, 638927, 638635, 637793, 636337, 634679, 633274, 632125, 631437, 632099, 634751, 638892, 643647, 648948, 655406, 663590, 673922, 686585, 700921, 715542, 729605, 743287, 756619, 768761, 779052, 787831, 795543]
58573G95543O452N329N448O805Q285R639J1728J4641J7360J9634K2491K6359L0163
58560I79877L2788L4084L4064L2361K8902K4078J8083J1140M361r00m558p409
58548A186871r381r685q573p364o678o183o188p773j1109j5085j8820k2224k5051
58535A032757k6863k7982k8943k9149k7562k4610k1682j8956j5568j1783q960
58524G90699p283n679m070l532l921l581k005o83o78j326j906k635l382l278k385
58509G44355j993k566l075k965k993l519l671k901j795q35Q6N84n2j258j556p94
58493G15052k34k26J94J194J889K420L973O346P974Q758J0239J2421J3406J3069
58479G96475J3974J7258K0529K1544K1183K0848J9528J5745J0378N282O86l962
$$ y = [795543, 801995, 807324, 812772, 819577, 827862, 837501, 849229, 863870, 881230, 900864, 923355, 949714, 979877, 1012665, 1046749, 1080813, 1113174, 1142076, 1166154, 1184237, 1195377, 1199738, 1198838, 1194280, 1186871, 1177490, 1167805, 1159232, 1151868, 1145190, 1139007, 1132819, 1125046, 1113937, 1098852, 1080032, 1057808, 1032757, 1005894, 977912, 948969, 919820, 892258, 867648, 845966, 827010, 811442, 799659, 790699, 783416, 777737, 773667, 770135, 766214, 762633, 760628, 759945, 759267, 757941, 756035, 753400, 750018, 746740, 744355, 742362, 739796, 736721, 733756, 730763, 727244, 723573, 720672, 718877, 718042, 718128, 718712, 718660, 717402, 715846, 715052, 714818, 714592, 714786, 715980, 717869, 720289, 724262, 730608, 738582, 747340, 757579, 770000, 783406, 796475, 810449, 827707, 848236, 869780, 890963, 911811, 931339, 947084, 957462, 962744, 963430, 959468]
58467I59468q057j0690j2139j2915j2544j0730q309n878k882P33L673N404P299
58454H92433J0287J3192J4783J5622J6211J5217J1443O021Q28l879q567j2640
58442I70951j5268j6729j7332j6442j4039j1771j0812j0016p899n050k914j493
58430H41186L3J597K805M118O034Q075R775J1403J2695J2413J0340Q064O483M343
58416I39364P03l016n182o340p647q624q404p758p844q223p961p444p357p110
58402H47157o024m835m376l985k816j459p41j67Q64J741J969K336L274L607K541
58387H39086J312J247J754J813J896K633L234K966K733L479M567N264O220P801
58373H86005Q732Q115P181P305P939Q126Q308R061R797J0296J1605J3918J5665
$$ y = [959468, 951411, 940721, 928582, 915667, 903123, 892393, 884084, 878206, 875324, 876057, 879730, 885134, 892433, 902720, 915912, 930695, 946317, 962528, 977745, 989188, 995209, 996037, 992158, 983591, 970951, 955683, 938954, 921622, 905180, 891141, 879370, 868558, 858542, 850643, 845593, 842679, 841186, 841219, 842816, 845621, 849739, 855773, 863848, 873623, 885026, 897721, 910134, 920474, 928538, 935021, 939364, 940067, 937051, 931869, 925529, 917882, 909258, 900854, 893096, 885252, 877029, 869068, 861624, 854267, 847157, 841133, 836298, 831922, 827937, 825121, 823662, 822921, 822754, 823618, 825359, 827328, 829664, 832938, 836545, 839086, 840398, 841645, 843399, 845212, 847108, 849741, 852975, 855941, 858674, 862153, 866720, 871984, 878204, 886005, 894737, 902852, 910033, 917338, 925277, 933403, 941711, 950772, 960569, 970865, 982470, 996388, 1012053]
58360A012053J6140J6706J7840J7665J5212J2388J0690Q777N595K947K292J908
58348A140213R4j481p27J150J969K198L144L986L865M532P482J0725J1851J2096
58334A201097J3885J6446J7591J7783J8691J9540J8580J6521J4898J2809Q872
58323A376713M645K506J748L34j166j050p0J7j97O64J709J725K224N019Q850J2007
58307A415678J5826K1711K7192K9284K9386L0458L1662L0578K8446K8209K9192
58296A717622K8717K7239K6907K6737K4283K0662J8995J9185J8945J8499J9598
58285A967389K1470K2468K3836K7246L0610L1284L1179L3515L6872L7903L7640
58274B301412L9273M1964M2825M2913M5170M8494M9901N0485N3060N6276N7432
$$ y = [1012053, 1028193, 1044899, 1062739, 1080404, 1095616, 1108004, 1118694, 1127471, 1133066, 1136013, 1138305, 1140213, 1140307, 1138826, 1138099, 1139249, 1141218, 1143416, 1146560, 1150546, 1154411, 1158943, 1166425, 1177150, 1189001, 1201097, 1214982, 1231428, 1249019, 1266802, 1285493, 1305033, 1323613, 1340134, 1355032, 1367841, 1376713, 1381358, 1383864, 1385612, 1385946, 1384780, 1383730, 1383660, 1383677, 1383480, 1384144, 1385853, 1387578, 1389802, 1394821, 1403671, 1415678, 1431504, 1453215, 1480407, 1509691, 1539077, 1569535, 1601197, 1631775, 1660221, 1688430, 1717622, 1746339, 1773578, 1800485, 1827222, 1851505, 1872167, 1891162, 1910347, 1929292, 1947791, 1967389, 1988859, 2011327, 2035163, 2062409, 2093019, 2124303, 2155482, 2188997, 2225869, 2263772, 2301412, 2340685, 2382649, 2425474, 2468387, 2513557, 2562051, 2611952, 2662437, 2715497, 2771773, 2829205]
58263B829205N8573O3006O8372P0314P0343P2613P5619P5138P2812P3334P5418
58252C604747P4465P2168P4175P9889Q3902Q6220R1575R9771J06296J11462J19494
58241D604164J29529J37110J43404J53194J65088J73823J80814J91889K06091
58232F085106K17680K27626K41718K58939K73721K87990L08498L33854L57275
58223H592407L80369M10460M46291M80868N16421N61091O12977O64012P17336
58214A3382232P83231Q60215R39420J025427J132123J260062J400312J558835
58206B2341857J752926J985384K248556K552798K923113L370482L899414M543573
58198D5618103N359808O389097P662611R243394J1215541J3634472J6541425K0020874
$$ y = [2829205, 2887778, 2950784, 3019156, 3089470, 3159813, 3232426, 3308045, 3383183, 3455995, 3529329, 3604747, 3679212, 3751380, 3825555, 3905444, 3989346, 4075566, 4167141, 4266912, 4373208, 4484670, 4604164, 4733693, 4870803, 5014207, 5167401, 5332489, 5506312, 5687126, 5879015, 6085106, 6302786, 6530412, 6772130, 7031069, 7304790, 7592780, 7901278, 8235132, 8592407, 8972776, 9383236, 9829527, 10310395, 10826816, 11387907, 12000884, 12664896, 13382232, 14165463, 15025678, 15965098, 16990525, 18122648, 19382710, 20783022, 22341857, 24094783, 26080167, 28328723, 30881521, 33804634, 37175116, 41074530, 45618103, 50977911, 57367008, 65029619, 74273013, 85488554, 99123026, 115664451, 135685325]
58190A35685325K4165987K8955688L4164589L9243591M3029510M3595425L8912518
58183C87752633K8302899J3450947k253679j5647045k5263126l1249906l4345723
58176C20747000l5170885l4213702l1999977k9055806k5792458k2499367j9382165
58169A22632640j6556871j4054592j1875285j0020625q472327p182437o106333
58162D8364170n219832m495364l891333l377175k944472k584072k274988k003699
58154B1573235j772333j579443j412027j263036j137515j034616r41369q50797
58146A1582099p69514p01163o38299n76721n22546m78675m38242l97579l62787
58137F696573l37587l16633k96052k79082k66375k51914k33373k16109k02657
$$ y = [135685325, 159851312, 188807000, 222971589, 262215180, 305244690, 348840115, 387752633, 416055532, 429506479, 427252800, 411605755, 386342629, 355092723, 320747000, 285576115, 251362413, 219362436, 190306630, 164514172, 142014805, 122632640, 106075769, 92021177, 80145892, 70125267, 61652940, 54470503, 48364170, 43144338, 38648974, 34757641, 31380466, 28435994, 25851922, 23576934, 21573235, 19800902, 18221459, 16809432, 15546396, 14408881, 13374265, 12432896, 11582099, 10812585, 10111422, 9473123, 8896402, 8373856, 7895181, 7456939, 7059360, 6696573, 6358986, 6042353, 5746301, 5467219, 5200844, 4948930, 4715557, 4499448, 4296791]
58128D296791j88567j72546j60183j53313j45796j34325j23875j18031j13065
58119B987090j06049j00101r7138r3608q7519q2092p8805p4431o8241o4334o3632
58108B071140o1387n5939n2019n1925n1380m7886m5286m5962m6109m3133m0550
58097A529564m0985m1096l8064l4752l3808l2674k9107k5851k5218k4404k0798
58086A182807j7019j6163j6689j6295j6451j8968k2082k3850k5541k8265l0017
58075I51467k9312k7883k6859k4407k0043j6974j6934j7064j5034j3014j3065
58064G30878j2924j0073o111l353p75K884N426M468J499q66k866n579p808q249
58050F86551q251r231r808q397o278n381n309n073n303o351o708n649m973n893
$$ y = [4296791, 4108224, 3935678, 3775495, 3622182, 3476386, 3342061, 3218186, 3100155, 2987090, 2881041, 2780940, 2683802, 2590194, 2502675, 2420583, 2341778, 2267347, 2199106, 2134772, 2071140, 2009753, 1953814, 1901795, 1849870, 1798490, 1750604, 1705318, 1659356, 1613247, 1570114, 1529564, 1488579, 1447483, 1409419, 1374667, 1340859, 1308185, 1279078, 1253227, 1228009, 1203605, 1182807, 1165788, 1149625, 1132936, 1116641, 1100190, 1081222, 1059140, 1035290, 1009749, 981484, 951467, 922155, 894272, 867413, 843006, 822963, 805989, 789055, 771991, 756957, 743943, 730878, 717954, 707881, 701770, 698417, 697642, 700526, 705952, 710420, 711919, 711053, 708187, 702608, 694800, 686551, 678300, 669069, 659261, 650864, 644586, 639205, 633896, 628823, 623520, 617169, 610461, 604812, 599839, 593946]
58036E93946o835o461o045o604o576m868l435m245o197p450q336r571j0119r257
58022D97947q369q449q229o875n915o337o392m685k739k211k167j439j130k180
58008D30830l062k349j227j074r66P0Q03K73l4J049J920J077q9m6j13j935m183
57991D20944m696l850l112k352j208r80k405l605k956j933k416l401l216k766
57977C82048l534m361l542k219k417l288k688j047m11p92o87j95n20j231r64n2
57961C54100K40K63J209K561K900K405K141J732K27j634k411k441k970l678l312
57946C51332k011q35J49J301J987J805J977L444M862M836M643O170Q496R490R477
57931D07123J0246J1352J0700Q332O445N760M801K814P24r76k866m776n599n195
$$ y = [593946, 587111, 580650, 574605, 568001, 561425, 556557, 553122, 548877, 542680, 535230, 526894, 517323, 507204, 497947, 489578, 481129, 472900, 466025, 460110, 453773, 447381, 442696, 439957, 437746, 435579, 434140, 433010, 430830, 427768, 425419, 424192, 423118, 422152, 422222, 423025, 423298, 423264, 424313, 426233, 427310, 427221, 427175, 427062, 425127, 420944, 416248, 412398, 409286, 406934, 405726, 404746, 402341, 398736, 395780, 393847, 391431, 388030, 384814, 382048, 378514, 374153, 370611, 368392, 365975, 362687, 359999, 358952, 358541, 357749, 357062, 356867, 356347, 355116, 354152, 354100, 354340, 354603, 355812, 358373, 361273, 363678, 365819, 367551, 367778, 366144, 363733, 361292, 358322, 354644, 351332, 349321, 348486, 348635, 349936, 351923, 353728, 355705, 359149, 364011, 368847, 373490, 379660, 388156, 397646, 407123, 417369, 428721, 439421, 447753, 454198, 459958, 464759, 467573, 468297, 467321, 464455, 459679, 454080, 448885]
57917D48885m735m949n556o229o697o232m613l046k609k519j553l20k20j004j413
57902C97190j481k140l119l414l263l628m235m106l493l334l377k811k062j918
57888C54809j670k67J377J589P97Q10J754K158J771J713K078J754O11l70j054
57873C67860k111l157l115k350k218k644k283j091m55p43q73m32j69k02K38J161
57857C47416J763K029K620L247L063K540K806L392K825J366P03R39L94j215k038
57842C71850j172j77n60j841k966l823m441m412l941m048m925n386m628l216j946
57827C24368r59l79m88q38n23L96R09O91M02L23R3j12L58J269J548R25J05o09
57809C27479j546k536l083l536m526n400m917l361k152j539o76K44J63n07r2J458
$$ y = [448885, 444150, 439201, 433645, 427416, 420719, 414487, 409874, 406828, 404219, 401700, 400147, 399827, 399607, 398603, 397190, 395709, 393569, 390450, 387036, 383773, 380145, 375910, 371804, 368311, 364977, 361600, 358789, 356727, 354809, 353139, 352872, 354249, 355838, 356635, 357445, 359199, 361357, 363128, 364841, 366919, 368673, 369284, 368914, 367860, 365749, 362592, 359477, 357127, 354909, 352265, 349982, 348891, 348436, 347693, 346820, 346388, 346219, 346017, 346255, 347416, 349179, 351208, 353828, 357075, 360138, 362678, 365484, 368876, 371701, 373067, 373770, 374709, 375103, 373888, 371850, 370678, 370501, 369941, 368100, 365134, 361311, 356870, 352458, 348517, 344469, 339544, 334158, 329530, 326314, 324368, 323409, 323030, 322542, 321704, 321181, 321577, 322486, 323177, 323579, 323902, 323995, 323883, 324241, 325510, 327058, 327983, 328088, 327479, 325933, 323397, 320314, 316778, 312252, 306852, 301935, 298574, 296422, 294883, 294207, 294451, 294614, 294107, 294015, 295473]
57793B95473K281J678J118J586K228K464L093M276M666L768L112L730M412L935
57779C37820L204L451L962L402K240J955K665L204L076K785K542J871N16j113
57765C71580k414l081l319l720m552n219m999m167l591l407l074k576k348k071
57751C23042r41P74J898K159K439L041L272L015L091L567L384K225J202J065J162
57736C54395Q62N32M09l2q12r83l10oq87k049k306j754j060l58K79L76o3k81j31
57717C45821n91k134l743m428m539m752m784m209l472l178l176l206l533m139
57703B95937m287l697l168l254l242k429j416j149j419j297m38Q30K062K689K237
57688B77959J096L80M96P14O87J264L069N351P058Q234R515J1197J3590J7428
$$ y = [295473, 297754, 299432, 300550, 302136, 304364, 306828, 309921, 314197, 318863, 322631, 325743, 329473, 333885, 337820, 341024, 344475, 348437, 351839, 354079, 356034, 358699, 361903, 364979, 367764, 370306, 372177, 372693, 371580, 369166, 366085, 362766, 359046, 354494, 349275, 344276, 340109, 336518, 333111, 330037, 327461, 325113, 323042, 322101, 322875, 324773, 326932, 329371, 332412, 335684, 338699, 341790, 345357, 348741, 350966, 352168, 353233, 354395, 355257, 355789, 356198, 356166, 355354, 354371, 354061, 354055, 353168, 351119, 348813, 347059, 345999, 345641, 345920, 346296, 346233, 345952, 345821, 345230, 343096, 339353, 334925, 330386, 325634, 320850, 316641, 313169, 309991, 306815, 303609, 300076, 295937, 291650, 287953, 284785, 281531, 278289, 275860, 274444, 273295, 271876, 270579, 270141, 270971, 273033, 275722, 277959, 279055, 279435, 279931, 280645, 281332, 282596, 285665, 291016, 298074, 306308, 315823, 327020, 340610, 358038]
57674C58038K3002K9596L6594M4482N4091O5560P8632R2928J06702J15691J14220
57663A119536R7983O6563K4668j8896n5150p9363r1923r5449r2367q4991p5804
57652G14807o6323n6747m7415l9452l3355k8294k3594j9633j6576j3628j0512
57641C59278q241p322o582n002l401k934l097k718j954j728j907j621q81m96o96
57626C10698j046j349j705j957j939j891j983j928j692j855k638l285l101k398
57612B81931j740j119n32m54r84j414j313j148j227j132q36j086j911k139j305
57597B63591o26j009j591j514j604k744l946l863l060k937l310k960j928j356
57583B31143j538j779j800j789j475o19k1o01j895k774l110l430l530k997k449
$$ y = [358038, 381040, 410636, 447230, 491712, 545803, 611363, 689995, 782923, 889625, 1005316, 1119536, 1217519, 1284082, 1308750, 1289854, 1234704, 1155341, 1063418, 967969, 875602, 790611, 714807, 648484, 591737, 544322, 504870, 471515, 443221, 419627, 399994, 383418, 369790, 359278, 351037, 343715, 337133, 332131, 328730, 325796, 322699, 319981, 318027, 316299, 314392, 312771, 311890, 311394, 310698, 309652, 308303, 306598, 304641, 302702, 300811, 298828, 296900, 295208, 293353, 290715, 287430, 284329, 281931, 280191, 279072, 278540, 278086, 277102, 275688, 274375, 273227, 272000, 270868, 270032, 268946, 267035, 264896, 263591, 262965, 261956, 260365, 258851, 257247, 254503, 250557, 246694, 243634, 240697, 237387, 234427, 232499, 231143, 229605, 227826, 226026, 224237, 222762, 222143, 222122, 221521, 219626, 216852, 213742, 210312, 206782, 203785, 201336]
57568B01336k705l121k458j061n13j272k178k241j532m12Q32J590J363N59j12
57553A88075o45j198j101K36J997K907L086L550M175L827K319P36k06p59j042
57538B05957o69L57J452K187K362J637M5j407j753j305r81q24l32L12N80O95J062
57521B09375J191M79m02l61M12R95J384K035K462K045J674K535L748L341J399
57506B32312K8J54N81L94J39J46k39j184j937k392l334m628n024m340l969m427
57490B02280m328k716p15K49L62M42M21L0k04J54M79P2o48q41m66j6K87L42m5
57471A95139p40j247j515j969k457k204j164l34j39K10J196J938J515L58n57j053
57455A86977j378j334p00J4J59j28k45J8M56Q35Q83M12k00j71O62J542J790J496
$$ y = [201336, 198631, 195510, 193052, 191991, 191478, 190206, 188028, 185787, 184255, 183843, 184675, 186265, 187628, 188187, 188075, 187430, 186232, 185131, 185367, 187364, 190271, 193357, 196907, 201082, 204909, 207228, 207964, 207758, 206999, 205957, 205288, 205645, 207097, 209284, 211646, 213283, 213328, 211921, 210168, 208863, 207882, 207058, 206726, 207038, 207618, 208313, 209375, 210566, 211045, 210643, 210282, 210694, 211689, 213073, 215108, 217570, 219615, 221289, 223824, 227572, 230913, 232312, 232340, 232494, 233075, 233469, 233608, 233754, 233515, 232331, 230394, 228002, 224668, 220040, 215016, 210676, 206707, 202280, 197952, 195236, 194521, 194770, 195132, 195574, 195995, 196025, 195821, 195975, 196454, 196526, 195878, 195037, 194571, 194555, 194842, 195184, 195139, 194399, 193152, 191637, 189668, 187211, 185007, 183843, 183509, 183370, 183580, 184776, 186714, 188229, 188587, 188030, 186977, 185599, 184265, 183565, 183579, 183738, 183610, 183365, 183383, 183839, 184674, 185557, 185969, 185769, 185598, 186260, 187802, 189592, 191088]
57437A91088J044O33N31R79J534J328L88j57L89J331J622J154M51j12l42p5M73
57420B02259P14L67k80r66j593j699p56P31J434R34L36O76J640K368K603K391
57404B11159J496p3j562k177j921j240l88M40R33J089J342J858K258K299K250
57389B17763K268K068J557J158J206J589K187K954L463L155K266J651J513J263
57375B46061P94P52J171J067j8j189j542j315r81l81M82Q39L66R0J024K544L231
57358B52995K699J672P86L01N35J575K777L382L396L284L108K664K103J763J612
57343B84652J427J215R96N61J6M4J018K183K420J562M19l11n46m32j9N87J041
57326B96833Q98L9r66j165k60R10J438J472J586J515P05j43L69K131L441L471
$$ y = [191088, 192132, 192765, 193296, 194275, 195809, 197137, 197525, 197368, 197757, 199088, 200710, 201864, 202315, 202203, 201861, 201786, 202259, 202973, 203340, 203060, 202094, 200501, 198802, 198046, 198777, 200211, 201145, 201481, 202157, 203797, 206165, 208768, 211159, 212655, 212582, 211020, 208843, 206922, 205682, 205294, 205734, 206667, 207756, 209098, 210956, 213214, 215513, 217763, 220031, 222099, 223656, 224814, 226020, 227609, 229796, 232750, 236213, 239368, 241634, 243285, 244798, 246061, 246855, 247607, 248778, 249845, 249827, 248638, 247096, 245781, 244800, 244419, 244901, 245740, 246106, 246196, 247220, 249764, 252995, 255694, 257366, 258152, 258453, 258988, 260563, 263340, 266722, 270118, 273402, 276510, 279174, 281277, 283040, 284652, 286079, 287294, 288290, 288851, 288867, 288911, 289929, 292112, 294532, 296094, 296513, 296202, 295656, 295224, 295205, 295792, 296833, 297731, 297770, 296804, 295639, 295379, 296289, 297727, 299199, 300785, 302300, 303005, 302862, 303231, 305362, 308803, 312274]
57310C12274L255L648L872L115K103J871K153K241K419L234M118M178L743L788
57296C56012M283M416M080L906M009L902L538L366L439L366L147L161L421L562
57282D07608L595L911M575N222N595N741N768N832O146O559O545O053N937O877
57268D85964Q218Q651P793O473N641N626O257P049P375O969O282N983O228O684
57254E81193O983O917O504O178O471P266P819P760P499P323O919O211N870O330
57240F77243P016P338P755Q911J0252J0601R852R096R113R554R775R760J0075
57227G96341J1105J2497J3345J3165J2660J3001J4314J5518J5822J5512J5038
57216I48318J4304J3403J3077J3722J4848J6348J9376K4836L1559L7169M0431
$$ y = [312274, 315529, 319177, 323049, 326164, 328267, 330138, 332291, 334532, 336951, 340185, 344303, 348481, 352224, 356012, 360295, 364711, 368791, 372697, 376706, 380608, 384146, 387512, 390951, 394317, 397464, 400625, 404046, 407608, 411203, 415114, 419689, 424911, 430506, 436247, 442015, 447847, 453993, 460552, 467097, 473150, 479087, 485964, 494182, 502833, 510626, 517099, 522740, 528366, 534623, 541672, 549047, 556016, 562298, 568281, 574509, 581193, 588176, 595093, 601597, 607775, 614246, 621512, 629331, 637091, 644590, 651913, 658832, 665043, 670913, 677243, 684259, 691597, 699352, 708263, 718515, 729116, 738968, 748064, 757177, 766731, 776506, 786266, 796341, 807446, 819943, 833288, 846453, 859113, 872114, 886428, 901946, 917768, 933280, 948318, 962622, 976025, 989102, 1002824, 1017672, 1034020, 1053396, 1078232, 1109791, 1146960, 1187391]
57205A187391M1928M2652M3055M3357M3981M5380M7739N0682N3276N4745N5407
57194A709593N6257N7423N7964N7540N7162N7568N7963N7452N6701N6956N7969
57183B340548N8270N7089N4985N2749N0724M8996M7426M5723M4052M3120M3045
57172B886727M2845M1861M0952M1266M2383M2911M2462M1876M1704M1635M1277
57161C347899M0570L9524L8350L7670L7861L8447L8771L8859L8861L8230L6427
57150C771469L3983L1835L0022K7958K5645K3510K1439J9086J6890J5652J5342
57139D032831J5235J5150J5494J6302J7215J8336K0224K3104K6903L1799L7842
57128D270435M4079M9063N2122N3553N3657N2441N0035M6873M3577M1245M1431
$$ y = [1187391, 1229319, 1271971, 1315026, 1358383, 1402364, 1447744, 1495483, 1546165, 1599441, 1654186, 1709593, 1765850, 1823273, 1881237, 1938777, 1995939, 2053507, 2111470, 2168922, 2225623, 2282579, 2340548, 2398818, 2455907, 2510892, 2563641, 2614365, 2663361, 2710787, 2756510, 2800562, 2843682, 2886727, 2929572, 2971433, 3012385, 3053651, 3096034, 3138945, 3181407, 3223283, 3264987, 3306622, 3347899, 3388469, 3427993, 3466343, 3504013, 3541874, 3580321, 3619092, 3657951, 3696812, 3735042, 3771469, 3805452, 3837287, 3867309, 3895267, 3920912, 3944422, 3965861, 3984947, 4001837, 4017489, 4032831, 4048066, 4063216, 4078710, 4095012, 4112227, 4130563, 4150787, 4173891, 4200794, 4232593, 4270435, 4314514, 4363577, 4415699, 4469252, 4522909, 4575350, 4625385, 4672258, 4715835, 4757080, 4798511]
57117D798511M5210N2479O2507P4487Q7010R7991J06271J12841J19796J28600
57107E685703J40067J55091J74397J98211K27237K63371L08791L65186M34777
57098G952831N21131O28045P58615R16158J104536J326102J580042J863296K171182
57089A8821938K496091K827460L154486L466967L752389L994128M170169M243129
57081D6926757M145888L790980L120902K166306J053123n6550j039485j843578
57073E8264343k470108k940955l279019l502698l625713l658723l611819l495520
57065C1679788l320531l098325k842286k567122k286932k014129j758957j528369
57057A2263137j325163j149089r98609q71298p63534o71292n91428n21833m60879
$$ y = [4798511, 4843721, 4896200, 4958707, 5033194, 5120204, 5218195, 5324466, 5437307, 5557103, 5685703, 5825770, 5980861, 6155258, 6353469, 6580706, 6844077, 7152868, 7518054, 7952831, 8473962, 9102007, 9860622, 10776780, 11881316, 13207418, 14787460, 16650756, 18821938, 21318029, 24145489, 27299975, 30766942, 34519331, 38513459, 42683628, 46926757, 51072645, 54863625, 57984527, 60150833, 61203956, 61147406, 60107921, 58264343, 55794235, 52853280, 49574261, 46071563, 42445850, 38787127, 35175308, 31679788, 28359257, 25260932, 22418646, 19851524, 17564592, 15550463, 13791506, 12263137, 10937974, 9788885, 8790276, 7918978, 7155444, 6484152, 5892724, 5370891, 4910012]
57048D910012m07402l60836l20839k86946k58638k35155k15033j96661j79428
57039B449074j63576j48866j34517j20556j07902r6700q5900p4924o4346n4366
57029A397421m4009l2503k0117p082O404J7819K1763J3952m424k7295m8051o2763
57017A211115p0625p3070p2273o9411o4455n7808n1076m5397m0207l4738k9752
57006F02303k6510k4743k3070k0886j8681j6825j5206j3861j2954j2293j1561
56995D05713j0831j0239r508q369o983n450l456r62J433L448N752Q901J2172J4133
56981C95754J3815J0911N633q64o703j0739j3256j4754j4965j3777j2086j0682
56969C28287r182p031m754l084j675K06K360M275O362R285J2610J5445J7836K0003
$$ y = [4910012, 4502610, 4141774, 3820935, 3533989, 3275351, 3040196, 2825163, 2628502, 2449074, 2285498, 2136632, 2002115, 1881559, 1773657, 1676957, 1591057, 1516133, 1451787, 1397421, 1353412, 1320909, 1300792, 1293710, 1300114, 1317933, 1339696, 1353648, 1349224, 1321929, 1273878, 1211115, 1140490, 1067420, 995147, 925736, 861281, 803473, 752397, 707000, 666793, 632055, 602303, 575793, 551050, 527980, 507094, 488413, 471588, 456382, 442521, 429567, 417274, 405713, 394882, 384643, 375135, 366766, 359783, 354333, 350877, 349915, 351348, 354796, 360548, 369449, 381621, 395754, 409569, 420480, 426113, 425249, 418546, 407807, 394551, 379797, 364832, 351055, 338969, 328287, 319105, 312074, 307320, 304236, 302561, 302767, 305127, 309402, 315764, 325049, 337659, 353104, 370940, 390943]
56955C90943K0507J6985R089o28r127j5268j9500k2258k3427k2857k0809j7893
56943B85757j4713j1527q324n216k416K56L425P430J1916J6390K0783K5138K9154
56930C58053L2132L2882K9708K1464R165m132j5475k3618k8492l0324k9871k8465
56918C23027k6892k4801k1776j8330j5254j2723j0599q860p230n247l223k155
56906A65937k091j760n00O61Q01O75J307K167K232J924K432L806N201O531Q396
56891A97719J0710J2827J4773J7136J9902K2451K4310K4889K2950J7706J0241
56880C95614K699l738r008j2847j4642j4509j3239j1190q284m930j835J109M632
56867C09832Q791J2947J7003K1716K7618L4485M1937M9534N5978N8802N5384M4405
$$ y = [390943, 411450, 428435, 437524, 436896, 427769, 412501, 393001, 370743, 347316, 324459, 303650, 285757, 271044, 259517, 251193, 245977, 243561, 243817, 247242, 254672, 266588, 282978, 303761, 328899, 358053, 390185, 423067, 452775, 474239, 483404, 479272, 463797, 440179, 411687, 381363, 351492, 323027, 296135, 271334, 249558, 231228, 215974, 203251, 192652, 183792, 176562, 171315, 168092, 165937, 163846, 162086, 161586, 162247, 163048, 163723, 165030, 167197, 169429, 171353, 173785, 177591, 182792, 189323, 197719, 208429, 221256, 236029, 253165, 273067, 295518, 319828, 344717, 367667, 385373, 395614, 398313, 394575, 385567, 372720, 358078, 343569, 330330, 319140, 310856, 305926, 304091, 305200, 309832, 318623, 331570, 348573, 370289, 397907, 432392, 474329, 523863, 579841, 638643, 694027, 738432]
56855G38432K6970O716j1771k5514l4215l8703l9301l6346l1320k6060k1174j6081
56843D91633j0204l351M486J2845K0923K8956L8662N1113O4929P7594Q7561R3279
56831I58426R1137P7045N0787J7413j5928m3639o2818p3036p5960p4065o9014
56820G80348o1633n3017m4409l6052k7375j8395r694j056Q491J9019K9449L9289
56808F24965M9206N9081O6368O7145N8538M0389J5630j0600l3241m9523n9196
56797H28762o3064o2198n8152n2568m6206l9138l1877k5342j9700j4260q646l070
56785D04541K661R211J6470K3222K8483L2030L3146K9917K0897P144p973k0942
56773E78807k9948l5142l7641l8328l7455l5203l2104k8679k5144k1818j9216
$$ y = [738432, 765402, 772118, 760347, 734833, 700618, 661915, 622614, 586268, 554948, 528888, 507714, 491633, 481429, 478078, 482564, 495409, 516332, 545288, 583950, 635063, 699992, 777586, 865147, 958426, 1049563, 1126608, 1177395, 1194808, 1178880, 1135241, 1072423, 999387, 923427, 849362, 780348, 718715, 665698, 621289, 585237, 557862, 539467, 529773, 528717, 537208, 556227, 585676, 624965, 674171, 733252, 799620, 866765, 925303, 965692, 981322, 970722, 937481, 887958, 828762, 765698, 703500, 645348, 592780, 546574, 507436, 475559, 450217, 430517, 416257, 407611, 404541, 407202, 416413, 432883, 456105, 484588, 516618, 549764, 579681, 600578, 607722, 599749, 578807, 548859, 513717, 476076, 437748, 400293, 365090, 332986, 304307, 279163, 257345, 238129]
56762B38129j7237j4917j1813q969p562p173o505n363m579m335l919l051k218
56749A40488j583p98K4K29k98r54j383j756k017j805j175n69q9L31K44p42j886
56732A26261j949r00J14M44M67M89L98M90J261K205K097P92l81m13L19J066J692
56715A34452K171K123J454P17M01M40O41R71J265J317J313J563J820J604J034
56700A53286N83J90m57j018r03l67j50k35j21j7m95j167j149o62o89j133r53j15
56682A44428K99R3L15J190J529P37j47j56L16N65O25N95K87J34J038K630L186
56665A57664K064Q37J012J984K356K059J865J738J101J27l51NQ09J576J967J772
56649A78585J187P78Q13J038J186J214R39K26m27l58J67K31k92o17n03o35j272
$$ y = [238129, 220892, 205975, 194162, 185193, 177631, 170458, 163953, 158590, 154011, 149676, 145757, 142706, 140488, 138905, 138107, 138131, 138360, 138062, 137108, 135725, 133969, 131952, 130147, 128972, 128403, 128314, 128645, 128889, 128147, 126261, 124312, 123412, 123526, 123970, 124437, 124926, 125324, 125814, 127075, 129280, 131377, 132169, 131788, 131375, 131694, 132760, 134452, 136623, 138746, 140200, 140917, 141318, 141758, 142399, 143370, 144635, 145952, 147265, 148828, 150648, 152252, 153286, 153869, 154059, 153602, 152584, 151681, 151314, 151164, 150929, 150808, 150791, 150296, 149129, 147980, 147318, 146629, 145496, 144543, 144428, 144727, 144820, 145135, 146325, 147854, 148591, 148444, 148288, 148604, 149169, 149794, 150389, 150676, 150810, 151848, 154478, 157664, 159728, 160565, 161577, 163561, 165917, 167976, 169841, 171579, 172680, 172807, 172456, 172461, 173270, 174846, 176813, 178585, 179772, 180550, 181363, 182401, 183587, 184801, 185740, 185966, 185539, 185181, 185348, 185579, 185287, 184670, 184167, 183532, 182260]
56632A82260j731j627j486j692j847j645j453j555j776k052k496k719k133j092
56618A56956n85p05o68l62m64r04q00k14j99p79p20J50L82n56j131l22O34L60
56600A50073m06k86M34O13K97L01N76N01K28M07J021J501J556J164L60l13M1J338
56582A59406K221J837R60O27O84N36L34M14M59J46j48j27k37o99p95J08J589K992
56564A70307M307N560O357O753P588R165J0514J0705R868Q259N610K210n65j852
56550B54786k318k786k989k622k355k735l188l129k976l038k693j668r23j088
56536B20278j286p28k62r50k217k758k344j521m91M61N40l35q67k19O39N23j78
56519B08285o31j179k283l002k302r29l36n67o82n78p68j101j128j076j212r99
$$ y = [182260, 180529, 178902, 177416, 175724, 173877, 172232, 170779, 169224, 167448, 165396, 162900, 160181, 158048, 156956, 156371, 155666, 154998, 154636, 154172, 153268, 152468, 152254, 152055, 151276, 150556, 150706, 151088, 150532, 149401, 149079, 149713, 150073, 149667, 149381, 149815, 150428, 150725, 151026, 151602, 152103, 152331, 152738, 153759, 155260, 156816, 157980, 158340, 158027, 158068, 159406, 161627, 163464, 164424, 165051, 165735, 166271, 166605, 167019, 167478, 167624, 167476, 167349, 167112, 166413, 165618, 165726, 167315, 170307, 174614, 180174, 186531, 193284, 200872, 210037, 220551, 231256, 241124, 249383, 254993, 257203, 256638, 254786, 252468, 249682, 246693, 244071, 241716, 238981, 235793, 232664, 229688, 226650, 223957, 222289, 221366, 220278, 218992, 218264, 218002, 217052, 214835, 212077, 209733, 208212, 207721, 208182, 208722, 208387, 207520, 207301, 207940, 208463, 208285, 207654, 206475, 204192, 201190, 198888, 197959, 197623, 197056, 196374, 195796, 195028, 193927, 192799, 191723, 190511, 189512]
56503A89512j84J89p57k139k562k081j551r64M9R72J147R76J049R48K66k05K45
56486A84910Q61P44M63Q02J092M68l69m07j92n55p21L02J559J589R59J080J498
56469A94083Q51k64r6J125J438L53o37o74l99j72M02J117J295J203J597J996J335
56452B04553M0m64q9Q5J1N77J529J660J037Q69J207R40R1o4O39J000O99O92J008
56433B16020M24j182k161j522k31M83N44K31m63j098r29k16j8m51n20P9N29M46
56415B09965M23O91P27M18K81L05j6m29j15O88P27m07j723k284j988r68N21J717
56397B08533K053K078K505K798K127J108Q95J154P79J02L01R84P08l37m58P21
56381B26051J795K034K053J949J088o0j50O12N60n45r88nJ075J207J057J250J248
$$ y = [189512, 189328, 189517, 188760, 186621, 184059, 181978, 180427, 179463, 179512, 180484, 181631, 182607, 183656, 184604, 184870, 184665, 184910, 185771, 186515, 186978, 187780, 188872, 189340, 188971, 188564, 188372, 187817, 187096, 187398, 188957, 190546, 191505, 192585, 194083, 194934, 194670, 194574, 195699, 197137, 197490, 196853, 196179, 195780, 195608, 196010, 197127, 198422, 199625, 201222, 203218, 204553, 204593, 204129, 204040, 204125, 204136, 204713, 206242, 207902, 208939, 209808, 211015, 211955, 212046, 211982, 212621, 213621, 214320, 215012, 216020, 216444, 215262, 213101, 211579, 211348, 211831, 212375, 212606, 212143, 211045, 210116, 209900, 209882, 209431, 208911, 208990, 209519, 209965, 210388, 211079, 211806, 212224, 212505, 212810, 212794, 212365, 212250, 212938, 213665, 213258, 211535, 209251, 207263, 206295, 206816, 208533, 210586, 212664, 215169, 217967, 220094, 221202, 222097, 223251, 224030, 224132, 224433, 225417, 226125, 225788, 225330, 226051, 227846, 229880, 231933, 233882, 234970, 234910, 234760, 235372, 235932, 235387, 234399, 234394, 235469, 236676, 237733, 238983, 240231]
56364B40231Q18P67J411J948K010K218K660K504J657J139J298J311Q22N04O32
56349B61930P79J075J965K658J776j61j022j35J051J602K147K853K755J875J706
56334B82854K755L688L638L319L186K641J817J955L103L638K941K354K590K424
56320C22903J152J23M82J336J503J327J449J477J063Q39J152J404J421J973L144
56305C42748L890L891M078M696M768M234M497N880O690N847M481L806L430K903
56291D05839K965L942M738M607M307M554N005N586O949Q732R483R156R508J1058
56277D96429J2037J1524J1176J2423J4244J5279J5974J7077J8054J8632J9881
56266F62730K2172K4064K4719K5518K7699L0514L3270L7016M2383M7871N2300
$$ y = [240231, 241049, 241816, 243227, 245175, 247185, 249403, 252063, 254567, 256224, 257363, 258661, 259972, 260794, 261298, 261930, 262709, 263784, 265749, 268407, 270183, 270022, 269000, 268865, 269916, 271518, 273665, 276518, 279273, 281148, 282854, 285609, 289297, 292935, 296254, 299440, 302081, 303898, 305853, 308956, 312594, 315535, 317889, 320479, 322903, 324055, 324178, 324660, 325996, 327499, 328826, 330275, 331752, 332815, 333654, 334806, 336210, 337631, 339604, 342748, 346638, 350529, 354607, 359303, 364071, 368305, 372802, 378682, 385372, 391219, 395700, 399506, 402936, 405839, 408804, 412746, 417484, 422091, 426398, 430952, 435957, 441543, 448492, 457224, 466707, 475863, 485371, 496429, 508466, 519990, 531166, 543589, 557833, 573112, 589086, 606163, 624217, 642849, 662730, 684902, 708966, 733685, 759203, 786902, 817416, 850686, 887702, 930085, 977956, 1030256]
56255A030256N7067O3984P2648Q1918R2190J04140J16763J28818J40832J53795
56245B042411J67035J79179J89888J99044K05488K08167K07181K02381J92448
56236C793222J76745J56450J32423J03808P0429L4756k65l3828o6019r5609j20940
56225D151172j41629j57856j69311j76318j80343j82020j80344j75154j68440
56216B619757j61715j54129j44836j35052j25975j16775j06739r7353r0065q3793
56206A403325p6913p0002o4415n9761n4879m9916m5432m0974l6328l2617l0315
56195H41773k7908k4284k0760j8810j7712j6232j4769j3870j2667j0678r171q811
56183F46101q086o146m771n310o056n180l866l804l894k442n49j87p05l10O36
$$ y = [1030256, 1087323, 1151307, 1223955, 1305873, 1398063, 1502203, 1618966, 1747784, 1888616, 2042411, 2209446, 2388625, 2578513, 2777557, 2983045, 3191212, 3398393, 3600774, 3793222, 3969967, 4126417, 4258840, 4362648, 4433077, 4467833, 4467568, 4433740, 4367721, 4272112, 4151172, 4009543, 3851687, 3682376, 3506058, 3325715, 3143695, 2963351, 2788197, 2619757, 2458042, 2303913, 2159077, 2024025, 1898050, 1781275, 1674536, 1577183, 1487118, 1403325, 1326412, 1256410, 1191995, 1132234, 1077355, 1027439, 982007, 941033, 904705, 872088, 841773, 813865, 789581, 768821, 750011, 732299, 716067, 701298, 687428, 674761, 664083, 654912, 646101, 638015, 631869, 627098, 621788, 615732, 610552, 606686, 602882, 598988, 596546, 595997, 595810, 595105, 594795, 595431]
56168E95431P68O27J411K351K134J569K131L296L925M701O539Q209Q309P931Q657
56153F57989R583R227Q688R931J2447J4520J6362J9170K2561K5713K9490L4770
56141H70451M0371M5293N1142N9508O8978P7492Q5404R2924R7007R4557Q6905
56130A670032P7598O7724N7116M7982M2960M0846L8195L3893K8645K1559J1480
56119B138030N45p567j2123j4955j7077j9210k3970l3537m6210n8622o9838p9921
56107A755545q6602q7594q4474q0166p4352o5496n5487m7579m1358l4370k7257
56096A070810k2377j8886j4257r500p716q283p572m808k400r74J017L290L984
56083I82328L635M440O038O298N598O049P256P259O723P774R629R986R690J1473
$$ y = [595431, 596199, 596826, 598237, 600588, 602722, 604291, 606422, 609718, 613643, 618344, 624883, 633092, 641401, 649332, 657989, 667572, 676799, 685487, 695418, 707865, 722385, 738747, 757917, 780478, 806191, 835681, 870451, 910822, 956115, 1007257, 1066765, 1135743, 1213235, 1298639, 1391563, 1488570, 1583127, 1670032, 1747630, 1815354, 1872470, 1920452, 1963412, 2004258, 2042453, 2076346, 2104991, 2126550, 2138030, 2138575, 2131008, 2118885, 2103930, 2086853, 2067643, 2043673, 2010136, 1963926, 1905304, 1835466, 1755545, 1668943, 1581349, 1496875, 1416709, 1342357, 1276861, 1221374, 1173795, 1132437, 1098067, 1070810, 1048433, 1029547, 1015290, 1005790, 998074, 989791, 982219, 977411, 975011, 974037, 975054, 978344, 982328, 985963, 990403, 996441, 1002739, 1008337, 1014386, 1021642, 1028901, 1035624, 1043398, 1053027, 1063013, 1072703, 1084176]
56069A084176J5090J8360K1705K6845L2240L4821L5066L5448L5391L2934K9803
56058A401879K9165K9773K7975K4161K1389J9222J5024J0024P723P519O293N019
56046A605166P109J1394J3676J4247J6829K1094K3385K4066K6689L0540L1582
56035A825777L0291L0999L3927L5466L5821L8444M2400M3462M2500M4357M8629
56024B252073N0143M8683M9362N3030N5189N4996N6454O0003O1679O1478O3737
56013B866827O8572P1684P3078P6999Q2938Q6126Q7180R1514R9002J04359J07853
56002C816132J14925J24930J31476J34557J40780J50862J58801J64295J73628
55993E110386J87086J98170K06546K18813K35328K49684K62415K81000L05117
$$ y = [1084176, 1099266, 1117626, 1139331, 1166176, 1198416, 1233237, 1268303, 1303751, 1339142, 1372076, 1401879, 1431044, 1460817, 1488792, 1512953, 1534342, 1553564, 1568588, 1578612, 1586335, 1593854, 1600147, 1605166, 1612275, 1623669, 1637345, 1651592, 1668421, 1689515, 1712900, 1736966, 1763655, 1794195, 1825777, 1856068, 1887067, 1920994, 1956460, 1992281, 2030725, 2073125, 2116587, 2159087, 2203444, 2252073, 2302216, 2350899, 2400261, 2453291, 2508480, 2563476, 2619930, 2679933, 2741612, 2803090, 2866827, 2935399, 3007083, 3080161, 3157160, 3240098, 3326224, 3413404, 3504918, 3603920, 3708279, 3816132, 3931057, 4055987, 4187463, 4322020, 4462800, 4613662, 4772463, 4936758, 5110386, 5297472, 5495642, 5702188, 5921001, 6156329, 6406013, 6668428, 6949428, 7254545]
55984G254545L26743L46176L72310M05550M37076M66763N04302N50590N96470
55975A1260525O42150O98544P66891Q37851R13422J007623J122471J247236J384903
55966A9881616J553714J758779J990620K256773K584666K988542L468177M047638
55958D0530525M779052N701648O839223Q245815J0005010J2174165J4785528J7911844
55950A20972810K1653977K6023348L0857032L5741704L9748942M1164306L7895044
55943C54057163K8793337J4899881p45203j4755668k5054855l1256777l3970663
55936B91967215l4060449l2366178k9643064k6468041k3196936k0043814j7154955
55929A09033778j4599849j2371112j0444474q814255p462520o340564n403596
$$ y = [7254545, 7581288, 7927464, 8299774, 8705324, 9142400, 9609163, 10113465, 10664055, 11260525, 11902675, 12601219, 13368110, 14205961, 15119383, 16127006, 17249477, 18496713, 19881616, 21435330, 23194109, 25184729, 27441502, 30026168, 33014710, 36482887, 40530525, 45309577, 51011225, 57850448, 66096263, 76101273, 88275438, 103060966, 120972810, 142626787, 168650135, 199507167, 235248871, 274997813, 316162119, 354057163, 382850500, 397750381, 397005178, 382249510, 357194655, 325937878, 291967215, 257906766, 225540588, 195897524, 169429483, 146232547, 126188733, 109033778, 94433929, 82062817, 71618343, 62804088, 55341568, 49001004, 43597408]
55922D3597408m632047m004522l481996l034321k655423k339181k065164j819647
55914A9565107j607243j429954j275294j134891j014829r17735q32931p53232
55906A0598998o84295o28922n78464n27887m83784m49588m17441l82278l50171
55897F096168l25401l02303k76943k54387k37655k21310k02393j86391j76159
55888C913226j65862j51898j39252j31175j22809j10945j00374r4881r1179q7068
55878B717783q6268q9753r1294q7228q2239q0324p8272p3284o8815o7477o5771
55867A847058o1165n7083n5886n4050m9188m4923m3861m2625l8689l5524l5915
55856A328149l6500l3957l0647k9363k8225k5458k3678k4677k5301k3075k0814
$$ y = [43597408, 38965361, 34960839, 31478843, 28444522, 25789099, 23449918, 21384754, 19565107, 17957864, 16527910, 15252616, 14117725, 13102896, 12185161, 11352230, 10598998, 9914703, 9285781, 8707317, 8179430, 7695646, 7246058, 6828617, 6446339, 6096168, 5770767, 5468464, 5191521, 4937134, 4699479, 4478169, 4275776, 4089385, 3913226, 3747364, 3595466, 3456214, 3325039, 3202230, 3091285, 2990911, 2896030, 2804851, 2717783, 2631515, 2541762, 2450468, 2363240, 2281001, 2200677, 2122405, 2049121, 1980306, 1912829, 1847058, 1785893, 1728810, 1672924, 1618874, 1569686, 1524763, 1480902, 1438277, 1399588, 1364064, 1328149, 1291649, 1257692, 1227045, 1197682, 1169457, 1143999, 1120321, 1095644, 1070343, 1047268, 1026454]
55845A026454k1345k2638k2420k2579k4699k6162k4996k3962k5537k7173k5791
55834G59152k2772k0478j7917j3815j0024q209o788m628l748m977n080j805K098
55821F41009L384K988K750J523j733m724n449n658p267q647p937o598o336n787
55807E91518l618j577j112k79K605N514O328O621Q326R742Q505N703L448J108
55793F42832k584o182p789q357r535j0533j0175r624j0040r904p810n610n711
55780E38978p416q838j0133j1971j2923j1495q810o508l924J15M686Q395J1355
55767D81511J3209J1705O055o69n200p939j0607j2611j2802j2424j3048j3604
55755D23576j2459j0670j0100j0193r535q842r427j0376j0120r257r035q725p198
$$ y = [1026454, 1005109, 982471, 960051, 937472, 912773, 886611, 861615, 837653, 812116, 784943, 759152, 736380, 715902, 697985, 684170, 674146, 665937, 659149, 654521, 650773, 645796, 640716, 638911, 641009, 644393, 647381, 650131, 651654, 649921, 645197, 639748, 634090, 626823, 618176, 610239, 603641, 597305, 591518, 587900, 586323, 585211, 584932, 587537, 593051, 599379, 606000, 614326, 624068, 632573, 638276, 641724, 642832, 640248, 634066, 626277, 617920, 608385, 597852, 587677, 578053, 568013, 558109, 550299, 544689, 538978, 531562, 522724, 512591, 500620, 487697, 476202, 467392, 460884, 456960, 457075, 461761, 470156, 481511, 494720, 506425, 512480, 511811, 506611, 498672, 488065, 475454, 462652, 450228, 437180, 423576, 411117, 400447, 390347, 380154, 370619, 361777, 352350, 341974, 331854, 322597, 313562, 304837, 297639]
55742B97639n498n030m835l470j913j811k373j899r98j341k521k913k530k419
55728B58088k403j907j850l198m824n148m621m312l660k089j149k238l629k732
55714B14328k3K107L250M708O375O886O291N778N281L921K232J495J366M45j336
55699B63104k999m483o161p231o771n609n083m786l671k385k175k383j480K23
55685B08110J202J428K056L100L651L926M830O004O355N970N565M750K901R28
55671B60776J33m9r79k305k658k168k067k369k123j348o57L76K334M173M493L910
55655B59472L916M167L345J965J701K308J925J91j429k342l385m701n447n768
55641B55918o774q361r136q734q252q167p775o936o522o731o655n770m542l389
$$ y = [297639, 292141, 287111, 282276, 278806, 276893, 275082, 272709, 270810, 269812, 268471, 265950, 263037, 260507, 258088, 255685, 253778, 251928, 248730, 243906, 238758, 234137, 229825, 226165, 224076, 222927, 220689, 217060, 214328, 214305, 216412, 219662, 224370, 230745, 237631, 243922, 249700, 254981, 258902, 261134, 262629, 263995, 264440, 263104, 260105, 255622, 249461, 242230, 235459, 229850, 224767, 219981, 216310, 213925, 211750, 209367, 207887, 208110, 209312, 210740, 212796, 215896, 219547, 223473, 228303, 234307, 240662, 246632, 252197, 256947, 259848, 260776, 260909, 260860, 259881, 257576, 254918, 252750, 250683, 248314, 246191, 244843, 244186, 244562, 246896, 251069, 255562, 259472, 263388, 267555, 270900, 272865, 274566, 276874, 278799, 278990, 277561, 275219, 271834, 267133, 261686, 255918, 249144, 240783, 231647, 222913, 214661, 206494, 198719, 191783, 185261, 178530, 171875, 166105, 161563, 158174]
55627A58174k361j775j850j940j363o23n15o58l90l48j355k440k069p79m69j413
55611A37826k140k081k124k513k360j456p20n45m16k20l89p44p72r02j818k738
55595A15888k215n72L71m7p07p92n74j68P14J539J307K81k62j23k85r08j043n21
55577A11883l19p07p56k1Q22J357J893K294J915R57M45N86N79K96N52J470K036
55560A25282J695R82K99n64j472j794j530j380j538j531j265j005m19R70K488
55545A19218K961K555K447K724K339J255P84J437K129K016J659J779K147K241
55531A47691J988J451P03Q5k57r06k227l263k954k086k374l865m934m752m022
55516A20278l305k474j887k269l129l050j898j027j110j364j237j127j122p24
$$ y = [158174, 155813, 154038, 152188, 150248, 148885, 148262, 147747, 147089, 146699, 146351, 144996, 142556, 140487, 139708, 139239, 137826, 135686, 133605, 131481, 128968, 126608, 125152, 124432, 123887, 123471, 123251, 122862, 122118, 121346, 120444, 118626, 115888, 113673, 113101, 113472, 113425, 112718, 111926, 111352, 111184, 111898, 113437, 114744, 115025, 114763, 114640, 114355, 113447, 112404, 111883, 111564, 110857, 110101, 110080, 110902, 112259, 114152, 116446, 118361, 119318, 119763, 120349, 120928, 121224, 121776, 123246, 125282, 126977, 127959, 128258, 127694, 126222, 124428, 122898, 121518, 119980, 118449, 117184, 116179, 115760, 116730, 119218, 122179, 124734, 127181, 129905, 132244, 133499, 134283, 135720, 137849, 139865, 141524, 143303, 145450, 147691, 149679, 151130, 151833, 151918, 151661, 150755, 148528, 145265, 142311, 140225, 137851, 133986, 129052, 124300, 120278, 116973, 114499, 112612, 110343, 107214, 104164, 102266, 101239, 100129, 98765, 97528, 96401, 95279, 94555]
55502I4555j69l68j141j237m67r3o65j171q52k32J93O59J072P61j41o56o17q00
55484H8631j089m35R86J544P85K02O87J164P71L96R04J560J517J228J108L86j313
55467I9032k674k458j359p86p97n99j45M8j04n08j355k365k488j292R7M02k21
55450H2428p98r05n97J31J029J399J032N82M98L61j26m79l80k73m22l03L58R51
55432H4486J006Q37O59J50n22m66M30R86N61J17N17R65K78j239k294k262j426
55415H2783l09M84N06J91N29J491J835J034J34n9k57j186k032j704o25lm5j01
55397H2666J15L75N02K98m31j181r60J77Q40K63o23q07o33o47l68N24J030K83
55379H1423q52j034m75k23k61K08J145J740J713J321N80m74j231j245j030j171
$$ y = [94555, 94386, 94018, 92877, 91640, 91173, 91080, 90415, 89244, 88392, 88160, 88353, 89012, 90084, 90845, 90704, 90048, 89431, 88631, 87542, 87107, 88093, 89637, 90422, 90624, 91311, 92475, 93246, 93642, 94546, 96106, 97623, 98851, 99959, 100345, 99032, 96358, 93900, 92541, 91755, 90958, 90359, 90214, 90262, 90158, 89650, 88295, 85930, 83442, 82150, 82247, 82649, 82428, 81630, 80725, 80128, 80259, 81288, 82687, 83719, 84301, 84799, 85160, 85034, 84555, 84175, 83902, 83480, 83177, 83535, 84486, 85492, 86329, 86988, 87138, 86616, 86150, 86580, 87566, 88127, 88244, 88761, 89726, 90004, 88765, 86471, 84209, 82783, 82474, 82958, 83464, 83655, 84184, 85675, 87510, 88544, 88678, 88619, 88362, 87176, 85144, 83440, 82815, 82812, 82767, 82666, 82781, 83156, 83658, 83956, 83525, 82344, 81384, 81561, 82401, 82664, 82041, 81234, 80601, 79954, 79586, 80110, 81140, 81423, 80571, 79537, 79062, 78839, 78578, 78786, 79931, 81671, 83384, 84705, 85285, 84811, 83580, 82335, 81305, 80134]
55363H0134j323j013n91l67K21J400K004J115j84l07L48K21p05r43r6N89M08J74
55345H1085O16J232J310R43N12N1m39p06o76o33q41j277j701j699r58J64P57N15
55327G8255J65K71L77P4J4Q04J666J474N84K89P90J053N20l16r70j416j502r99
55309H1133l13j25l13j27N21Q85N68Pl28l86j53M28J071J343J275J182J003M97
55291H8168o8j51K09N01N73O48O32J57o83j313j356q68j3Q31J026L61m21n18k20
55272H7495l97j080j445j100n38l01m04o37p64n10Q1M22J29k93q3O35J061Q66
55254H3137M08l8m72p33n31M9N87Q15O59J52l17j13O69J011M13j50K91R98N94
55235H7429o16r62M4R93P36j37m55q6K69J78j88m78n21m26m58o38o71m83m35n71
$$ y = [80134, 78811, 77798, 77207, 76840, 77061, 78461, 80465, 81580, 81396, 81089, 81437, 81658, 80953, 80010, 79914, 80503, 80911, 81085, 81701, 82933, 84243, 85186, 85698, 85749, 85310, 84604, 83928, 83295, 82454, 81177, 79476, 77777, 76819, 76983, 77740, 78255, 78420, 78691, 79068, 79142, 79156, 79960, 81626, 83100, 83684, 83973, 84763, 85816, 86336, 86020, 85050, 83634, 82132, 81133, 80820, 80695, 80382, 80255, 80776, 81661, 82229, 82236, 81908, 81522, 81369, 81797, 82868, 84211, 85486, 86668, 87671, 88168, 88100, 87949, 88158, 88659, 89232, 89880, 90512, 90669, 89986, 88673, 87317, 86449, 86436, 87267, 88293, 88654, 88233, 87715, 87495, 87098, 86018, 84573, 83473, 82935, 82634, 82230, 81593, 80829, 80319, 80400, 80822, 80951, 80658, 80575, 81210, 82271, 83137, 83545, 83507, 83035, 82302, 81771, 81820, 82407, 83222, 83881, 84033, 83716, 83603, 84272, 85283, 85696, 85546, 85837, 86835, 87429, 86813, 85851, 85895, 86888, 87624, 87487, 87032, 86946, 87215, 87393, 87205, 86727, 86206, 85780, 85322, 84684, 84013, 83530, 83095, 82524]
55215H2524k38R49K142K193J169R5m69o84n88o1M81L85k59p48p96o14j79O29J278
55196H7209J082L31p7q4m30j180j462q87q8L42M83L95j24p37n35O56J782J849
55178H8525J065L13P4K43M62M03N5j53mK2n02r67m56O62J071M74m7J30K67k28
55158I1409o50j63P83J137P28K28L5l6j95l92m95l99j38rl28q96j101o58J17Q20
55138H9797J248J170M08o20j092p21m5M00O68R21R83O68J11m84j004j233r12k25
55120I0038K60L19K97M62O16N15K75J75L28O50R00P77K78k00l91m76m88L2J157
55101I5524J905J474N95N27J026Q40l2k13P12J474J250Q35R53R45K35l41P2P09
55083A08490L73n66q28k62J70J41K28O09P60N75N87Q95Q72K91j57J46Q54J216
$$ y = [82524, 82286, 83235, 85377, 87570, 88739, 88834, 88365, 87681, 87093, 87032, 87513, 87898, 87639, 86891, 86095, 85481, 85302, 85931, 87209, 88291, 88622, 88545, 88461, 88031, 86851, 85389, 84502, 84414, 84756, 85239, 85634, 85510, 84773, 84238, 84894, 86676, 88525, 89590, 89903, 89977, 90220, 90682, 91085, 91140, 90987, 90983, 91005, 90503, 89536, 89080, 89742, 90813, 91287, 91240, 91370, 91637, 91409, 90759, 90596, 91379, 92516, 93244, 93472, 93507, 93471, 93276, 92884, 92389, 91990, 91852, 91843, 91515, 90619, 89518, 88860, 88977, 89797, 91045, 92215, 92623, 92003, 90911, 90190, 90145, 90545, 91213, 92134, 93117, 93785, 93896, 93412, 92408, 91175, 90263, 90038, 90298, 90617, 90914, 91376, 91992, 92507, 92782, 92957, 93285, 93935, 94835, 95612, 95890, 95690, 95299, 94823, 94335, 94367, 95524, 97429, 98903, 99498, 100025, 101051, 101891, 101859, 101646, 102358, 103832, 105082, 105917, 106870, 107815, 108050, 107709, 107781, 108490, 108863, 108297, 107469, 107207, 107377, 107518, 107746, 108355, 109115, 109690, 110277, 111172, 112044, 112335, 112178, 112324, 113178, 114394]
55065A14394J032O26K45j48o13j061j281j057m25J84K08m58j212j272m57N69R08
55048A10182L00o70j255j313j204j122r13n23k22j38N2O42J309J368O29l45r51
55031A05826j276j809k499k584j593j46P00O34J44l92r13j030k19J105J671J036
55015I8655K80L77Q16O80K62M69J120J156K54q50j492j532r19K10J082R86L16
54998A01870J6K53O05J185K257L013K293N77l17K41R46P22J13j04j97m96m43L47
54980A12881J017N55p10j584j505q55k89k47o73q43o5J203J720J167M92K92O7
54963A12623m20l64O39J608J691J550K050K556J944N67k63l13m96j128j484j123
54947A19637m97q2P4j19q22j618j653p12M12Q75O60M43Q39J878K892L048K203
$$ y = [114394, 115426, 116052, 116297, 116149, 115536, 114475, 113194, 112137, 111712, 111896, 112104, 111646, 110434, 109162, 108705, 109274, 110182, 110482, 109812, 108557, 107244, 106040, 104918, 104005, 103482, 103260, 103122, 103174, 103816, 105125, 106493, 107122, 106777, 105826, 104550, 102741, 100242, 97658, 96065, 95919, 96619, 97253, 97397, 97005, 96092, 95062, 94843, 95948, 97619, 98655, 98935, 99312, 100128, 100808, 101070, 101539, 102659, 103815, 104069, 103219, 101727, 100195, 99276, 99486, 100568, 101554, 101870, 101886, 102139, 102744, 103929, 106186, 109199, 111492, 112069, 111752, 111993, 112939, 113661, 113774, 113670, 113473, 112977, 112534, 112881, 113898, 114453, 113743, 112159, 110654, 109799, 109510, 109263, 108590, 107747, 107682, 108885, 110605, 111772, 112264, 112556, 112623, 112203, 111839, 112478, 114086, 115777, 117327, 119377, 121933, 123877, 124444, 124181, 123868, 123372, 122244, 120760, 119637, 119140, 119058, 119132, 119013, 118191, 116573, 114920, 114208, 114620, 115495, 116155, 116598, 117437, 119315, 122207, 125255, 127458]
54930A27458J120O05P43J216J928K920M029N143O465Q107R700J0874J1738J2403
54916B04449J2406J1218Q949O048K617j265m927p536r028r923j0356j0026r004
54903A83622p900p087o411n735n221m823m040k554q37K23K65k02m01q2L61N54
54887A39732O42R88J634K336K959L466L723L765M068N011O259P271Q254R711J1121
54872B10940J1063Q906N539K172p23l109m922o376p853r115r427q836q299q141
54858A71819p441n668l853l288l819m386m460m132l397k408j765j767j813j384
54844A22238r84j268j801j727j155r11j262j706j796j399m68P00J378J281J021
54829A12141J111J085M04m46o44k52J79N66R51Q37l4p96n42K31L86j13m64n47
$$ y = [127458, 128578, 129183, 129926, 131142, 133070, 135990, 140019, 145162, 151627, 159734, 169434, 180308, 192046, 204449, 216855, 228073, 237022, 243070, 245687, 244422, 239495, 231959, 222931, 213008, 202652, 192626, 183622, 175722, 168635, 162224, 156489, 151268, 146445, 142405, 139851, 139014, 139237, 139502, 139300, 138899, 138817, 139178, 139732, 140374, 141362, 142996, 145332, 148291, 151757, 155480, 159245, 163313, 168324, 174583, 181854, 190108, 199819, 210940, 222003, 230909, 236448, 238620, 237897, 234788, 229866, 223490, 215637, 206522, 197095, 188259, 179960, 171819, 164378, 158710, 154857, 151569, 147750, 143364, 138904, 134772, 131375, 128967, 127202, 125435, 123622, 122238, 121254, 119986, 118185, 116458, 115303, 114392, 113130, 111424, 109628, 108229, 107761, 108461, 109839, 111120, 112141, 113252, 114337, 114741, 114295, 113651, 113399, 113578, 114144, 115095, 115932, 115898, 115102, 114560, 114791, 115177, 115064, 114600, 114053]
54811A14053q51j130o11N88J449J464J015N12J19J66P02R77M49q2M39J482J697
54794A22438J067P52R05N47l73o69l3L43j58o12l24L5j09p1P44J623J740J565
54776A29410J921K563K814K911L546M561N104M945M713N111O326Q095R801J0753
54762B02574J0700R940Q777P238N353L195N67k721o097q502r576r866r741q918
54748A92923p408n956n089m505l887l535l641l639k958j885j099q48r78j311j543
54733A44641j278n54J94R14K011L380M259M476M951O259P566P806P269P065P513
54718B06472P888P490O166M007J297j409l649n435o903p902q301q315q091p397
54704A75918o174m994m406m145l589k680j913j598j580j529j201o55l94q47j586
$$ y = [114053, 113202, 112072, 111461, 112049, 113498, 114962, 115977, 116489, 116608, 116774, 117476, 118453, 118902, 118820, 119259, 120741, 122438, 123505, 124257, 125162, 125709, 125336, 124667, 124634, 124977, 124819, 124207, 123883, 123918, 123809, 123738, 124482, 126105, 127845, 129410, 131331, 133894, 136708, 139619, 143165, 147726, 152830, 157775, 162488, 167599, 173925, 182020, 191821, 202574, 213274, 223214, 231991, 239229, 244582, 247777, 248344, 245623, 239526, 231024, 221448, 211582, 201841, 192923, 185515, 179559, 174470, 169965, 166078, 162543, 158902, 155263, 152305, 150420, 149321, 148473, 147495, 146184, 144641, 143363, 142809, 143003, 143917, 145928, 149308, 153567, 158043, 162994, 169253, 176819, 184625, 191894, 198959, 206472, 214360, 221850, 228016, 232023, 233320, 231911, 228262, 222827, 215924, 208022, 199721, 191406, 183315, 175918, 169744, 164750, 160344, 156199, 152610, 149930, 148017, 146419, 144839, 143310, 142109, 141454, 141060, 140213, 138627]
54689A38627j638q74l65q58j715k005j862j937k128j905j445j367j552j271m53
54674A17252J33P3j78r0L17Q12J287J543J273M73m69j195j547j396p12J80P89
54657A18545R58Q24M24j87n79l30J99J44o27j139o09M29Q07K92j61K62J198J635
54639A22085J205M63K2j70m46p44p27m17k20k77k69M4M56O34N56M34M37N97P61
54620A24424O42J38m00n56m13l30k41K11Q49R56L19l86n51l38j61n6L6m3k44j72
54600A23684J86J69n82j350j251m15L58P21Q15O49J50l04k63P5P6m03r23j138
54582A20254r97m03N99J399J252K78n42m77L01J138J576J477R88M20l4n08j053
54565A25668j287q25O8P66J098J371J633J580J209R27Q24M30n64j692k214j985
$$ y = [138627, 136989, 136115, 135750, 134892, 133177, 131172, 129310, 127373, 125245, 123340, 121895, 120528, 118976, 117705, 117252, 117385, 117458, 117280, 117190, 117507, 118319, 119606, 121149, 122422, 122895, 122426, 121231, 119684, 118288, 117576, 117756, 118545, 119503, 120327, 120751, 120564, 119985, 119655, 119854, 119998, 119371, 118232, 117623, 118052, 118859, 119151, 118990, 119252, 120450, 122085, 123290, 123753, 123775, 123605, 123159, 122415, 121688, 121271, 121051, 120774, 120505, 120549, 121005, 121639, 122195, 122629, 123066, 123663, 124424, 125066, 125204, 124804, 124248, 123835, 123505, 123264, 123475, 124324, 125280, 125599, 125213, 124662, 124324, 124163, 124107, 124143, 124100, 123856, 123684, 123870, 124039, 123457, 122107, 120856, 120441, 120799, 121520, 122335, 122984, 123134, 122830, 122567, 122642, 122718, 122315, 121392, 120254, 119257, 118854, 119453, 120852, 122104, 122382, 121840, 121363, 121664, 122802, 124378, 125855, 126843, 127263, 127229, 126721, 125668, 124381, 123556, 123624, 124390, 125488, 126859, 128492, 130072, 131281, 132208, 133032, 133462, 132898, 131206, 128992, 127007]
54549A27007j490j205j037n26N31J655K108J754J208R86R43Q03P94J143J393R10
54533A36977j8m94k94j21m08o85m58K1K40J63L1j36l12j90L45P27L17o74j368
54514A33663j332r44o10j83N23J091Q89k4q10p98j94L48N37N56N45M02J15n8R3
54495A33809M24O16N08J47l46q25j176j381j425j181n45K58Q41J128J402J769
54479A34023J943J699J259R53P53M98K96M11Q13J137J057N41j48o26o66l72KM01
54461A43974Q44J072P54J02l03m18q07j549j785r12L45Q62N86L42M18L52ok22
54443A43649j47l18j098k019k317j695m06R98J790J435K23q33r85m46J22N04R47
54426A39404J439J530R15k1n03j46O99J372J573J464J222P91J25n49r42j024r51
$$ y = [127007, 125517, 124312, 123275, 122749, 123280, 124935, 127043, 128797, 130005, 130991, 131934, 132737, 133531, 134674, 136067, 136977, 136959, 136465, 136171, 136050, 135642, 134957, 134499, 134520, 134760, 134923, 134954, 134818, 134506, 134316, 134661, 135388, 135705, 135031, 133663, 132331, 131387, 130777, 130594, 131117, 132208, 133097, 133073, 132263, 131465, 131271, 131619, 132156, 132712, 133257, 133659, 133774, 133716, 133809, 134233, 134849, 135357, 135504, 135158, 134333, 133157, 131776, 130351, 129170, 128625, 128883, 129724, 130852, 132254, 134023, 135966, 137665, 138924, 139877, 140630, 141128, 141424, 141835, 142648, 143785, 144842, 145383, 145235, 144609, 143943, 143571, 143573, 143974, 144818, 145890, 146644, 146746, 146443, 146025, 145218, 143669, 141884, 140972, 141317, 142179, 142765, 143107, 143525, 143877, 143871, 143649, 143502, 143184, 142086, 140067, 137750, 136055, 135649, 136647, 138437, 139872, 140095, 139262, 138277, 137831, 137953, 138457, 139404, 140843, 142373, 143288, 143267, 142764, 142618, 143317, 144689, 146262, 147726, 148948, 149739, 149864, 149315, 148373, 147349, 146398]
54409A46398p70l70K66Q83J153J023Q31R88J416J560J143N96M09L15k69j122j353
54392A53097o89J18M92Q27J603K381K363J461K73o64j044o80J37M86k84j647k442
54375A55788k158j251m10Kqn6M09J439K344K517K135J703J286P91N30Q05J289
54358A67155J499J599K039K707L111L162L056K808K562K875L762L991K531L42
54344B03199o70l19l20j719l575m539m409l643k571j697j673k268k337j510r19
54329A71030j498k513k685j999j361j099q39n25n03p53q50o36k85J40O01P21J44
54312A57090q11j426j419j082o58j32M12P15O74M73L03J82j8m84j215j752j405
54295A49447r9J275J712J119K49k34k52o5Q3Q8J2OJ19K63M19O89J047J271J215
$$ y = [146398, 145628, 145258, 145524, 146407, 147560, 148583, 149414, 150402, 151818, 153378, 154521, 155117, 155526, 155841, 155572, 154450, 153097, 152408, 152526, 153018, 153845, 155448, 157829, 160192, 161653, 161926, 161262, 160218, 159538, 159675, 160161, 159877, 158230, 155788, 153630, 152379, 151969, 151971, 151963, 151907, 152316, 153755, 156099, 158616, 160751, 162454, 163740, 164531, 165061, 165866, 167155, 168654, 170253, 172292, 174999, 178110, 181272, 184328, 187136, 189698, 192573, 196335, 200326, 202857, 203199, 202529, 202210, 201890, 200171, 196596, 192057, 187648, 184005, 181434, 179737, 178064, 175796, 173459, 171949, 171030, 169532, 167019, 164334, 162335, 160974, 159875, 159036, 158511, 158008, 157255, 156405, 155769, 155484, 155624, 156225, 156946, 157090, 156279, 154853, 153434, 152352, 151694, 151562, 151974, 152689, 153363, 153836, 154139, 154321, 154303, 153819, 152604, 150852, 149447, 149348, 150623, 152335, 153454, 153703, 153469, 153217, 153152, 153235, 153323, 153335, 153341, 153460, 153723, 154142, 154831, 155878, 157149, 158364]
54276A58364R29M14l32r27p18L96J609K013J496N61m20j360k068k197j558l11
54260A55891J058J860J602N72k30p8P44J405J507J253Q50K36n73j161r34K54J687
54243A65943K179J184n30j686j962k106k580k816k175j017k06KpJ0m6j60j18J91
54225A54100O82J231J581J381O40q4l46l88n92p13k39O13J007N67k36q32j059
54208A57313q70j76P25J123O87o1m25l54k76l16k10J64N60Q00J032J318J258L92
54190A62684j001j918j674o91K4R8M7M05J019J407J391J099O08o6p22j051r24
54173A60735m40J76N74L54n67j634k051j533n71J26L28L38M75O50N20l1p03j113
54155A55633j137q33k87L36P19O72L62Q4l8K9L37O97O13l5n52k08P22J351J391
$$ y = [158364, 159293, 159707, 159375, 158448, 157730, 158126, 159735, 161748, 163244, 163805, 163385, 162025, 159957, 157760, 156202, 155891, 156949, 158809, 160411, 160983, 160753, 160675, 161419, 162824, 164331, 165584, 166434, 166670, 166097, 164936, 164002, 164256, 165943, 168122, 169306, 168776, 167090, 165128, 163022, 160442, 157626, 155451, 154434, 154228, 154230, 154223, 154233, 154187, 154027, 153909, 154100, 154782, 156013, 157594, 158975, 159615, 159531, 159185, 158797, 158205, 157492, 157253, 157866, 158873, 159440, 159204, 158372, 157313, 156443, 156267, 156992, 158115, 158802, 158741, 158316, 157962, 157686, 157370, 157160, 157324, 157884, 158684, 159716, 161034, 162292, 162684, 161683, 159765, 158091, 157400, 157424, 157522, 157569, 157974, 158993, 160400, 161791, 162890, 163498, 163432, 162710, 161659, 160735, 160295, 160471, 161045, 161399, 160832, 159198, 157147, 155614, 155043, 155169, 155497, 155835, 156310, 156960, 157480, 157449, 156746, 155633, 154496, 153663, 153376, 153712, 154431, 155103, 155465, 155549, 155511, 155540, 155877, 156574, 157187, 157152, 156600, 156392, 157114, 158465, 159856]
54136A59856J263J132P07Q0k06q6j58o35r84r12q43r99q75j74N90R85J330J736
54118A61807J543N22k13L45J452J634R13N75J024J320Q99L92M09O05N09L26L98
54101A74460M91J91l89p16m28L35R90R03N7p47p32m7O17J029J351J386Q05Q8K12
54082A79856J194J934J820J584K072K982L532L664L847M108M154M160M671N621
54068B25199O087N178K896R0k239l546l963l993m006l990l772l289k643k011j526
54053B04472j108m60N12J390J668J474J492K063K783L132L118L086L231L555M122
54038B34530M961N841O441O748P135P883Q670Q714P666O241N553N744N778M900
54024C26805L703L179L251L058K403J878J655J133J7j236k240l212m217m733m492
$$ y = [159856, 161119, 162251, 162958, 163038, 162832, 162746, 162588, 161953, 160969, 160057, 159214, 158215, 157340, 157166, 157756, 158741, 160071, 161807, 163350, 163872, 163659, 164004, 165456, 167090, 168003, 168578, 169602, 170922, 171821, 172213, 172622, 173227, 173736, 174062, 174460, 174951, 175142, 174753, 174037, 173609, 173944, 174934, 175837, 175894, 175147, 174415, 174368, 174985, 176014, 177365, 178751, 179556, 179644, 179856, 181050, 182984, 184804, 186388, 188460, 191442, 194974, 198638, 202485, 206593, 210747, 214907, 219578, 225199, 231286, 236464, 239360, 239450, 237211, 233665, 229702, 225709, 221703, 217713, 213941, 210652, 208009, 205998, 204472, 203364, 202904, 203416, 204806, 206474, 207948, 209440, 211503, 214286, 217418, 220536, 223622, 226853, 230408, 234530, 239491, 245332, 251773, 258521, 265656, 273539, 282209, 290923, 298589, 304830, 310383, 316127, 321905, 326805, 330508, 333687, 336938, 339996, 342399, 344277, 345932, 347065, 347082, 345846, 343606, 340394, 336177, 331444, 326952]
54009C26952m060m018m179m130l974l896l532k518j324q20j269k319l697n248
53995B81968o451o688n956m817l716k830k419k652l162l389l379l574l822l303
53981B25810j777k12K90k29q31r15p30p43j003j202j137q63n23k04J0l2l93q50
53963B14466r99o74o9N87J231J795K051J910J628J504J525J616J943K624L275
53948B34413L350K937K727L148L905M495M788M980N325O076P320Q693R595R903
53934C11655J0111J0547J0827J0442R570Q799Q379Q257Q629R866J1798J3738J5210
53921D47828J6112J6020J4129J0330N818K038n22k026k308j169O07J536J070J70
53907E09633j24Kl10j311k574l761m801n451n432n045n067n851o973p865q429
$$ y = [326952, 322892, 318874, 314695, 310565, 306591, 302695, 299163, 296645, 295321, 294501, 293232, 290913, 287216, 281968, 275517, 268829, 262873, 258056, 254340, 251510, 249091, 246439, 243277, 239888, 236509, 232935, 229113, 225810, 224033, 223821, 224111, 223882, 223051, 222136, 221406, 220663, 219660, 218458, 217321, 216458, 215935, 215731, 215741, 215709, 215316, 214466, 213467, 212793, 212724, 213311, 214542, 216337, 218388, 220298, 221926, 223430, 224955, 226571, 228514, 231138, 234413, 237763, 240700, 243427, 246575, 250480, 254975, 259763, 264743, 270068, 276144, 283464, 292157, 301752, 311655, 321766, 332313, 343140, 353582, 363152, 371951, 380330, 388587, 397216, 407082, 418880, 432618, 447828, 463940, 479960, 494089, 504419, 510237, 512275, 511753, 509727, 507419, 506250, 506857, 508393, 509463, 509633, 509509, 509511, 509201, 507890, 505316, 501555, 496754, 491303, 485871, 480826, 475759, 469908, 462935, 455070, 446641]
53892D46641q763q731q181p500p440q248r217r417q844q454q835r236q445o508
53878C28822m869m601n200n543n385n212n107m650l915l635m192m997n186m523
53864B61807l456k662k603l153l598l339k683k426k727k953k765k531k434j907
53850B22570o56M30K29r99j791j297k00L37Q1l17l17l5J59K00L03N50P32O55M17
53831B21051K53J89J39J49K80L15m8o45q84m99J42O30J084J744K358K400J827
53814B30485J252J288J862K311K159J774K104L557N333O255O203O145O705P363
53800B84796P403P014O852O955O773O063N133M288L549K908K402J930J408J056
53786C48530J050R95L24p39j295j095j150k513m789o478o697o044n716o108o612
$$ y = [446641, 437878, 429147, 420966, 413466, 406026, 397778, 388561, 379144, 370300, 361846, 353011, 343775, 335330, 328822, 323953, 319352, 314152, 308609, 303224, 298012, 292905, 288255, 284340, 280705, 276513, 271516, 266330, 261807, 258351, 255689, 253086, 249933, 246335, 242996, 240313, 237887, 235160, 232207, 229442, 226911, 224477, 222570, 221914, 222344, 222573, 221574, 219783, 218486, 218286, 218623, 218704, 218387, 218070, 218035, 218194, 218394, 218697, 219247, 219979, 220634, 221051, 221304, 221493, 221632, 221781, 222061, 222376, 222328, 221683, 220799, 220300, 220442, 221072, 222156, 223900, 226258, 228658, 230485, 231737, 233025, 234887, 237198, 239357, 241131, 243235, 246792, 252125, 258380, 264583, 270728, 277433, 284796, 292199, 299213, 306065, 313020, 319793, 325856, 330989, 335277, 338826, 341734, 344136, 346066, 347474, 348530, 349580, 350575, 350899, 350160, 348865, 347770, 346620, 344107, 339318, 332840, 326143, 320099, 314383, 308275, 301663]
53771C01663o519n826n083m698m599m561m527m538m470m104l446k831k575k659
53757B41227k753k591k179j649j080o40p32j599k689k897j905q55j057k174k522
53742B13905j274M68J185P79K57J80K49K33L99Q94J323J235O80J21l8K81P98J074
53724B22749Q91M81K31K92O18J199J951K549K697K511K249J796Q40m28j268j142
53708B38216k02J011K017K516K447K108J916J959J997J972K140K671L390M080
53694B68238M649M886M442L319K014R87K98k4K36R59J335O68o07j311q81J31R22
53677B90261J219J077M29o59j631j842j312o99n17o64q27r69j172j208p01J97
53661B80982P22L92k45j31R57K035K105J415J071J547K106J859R39J79r2l19q47
$$ y = [301663, 295144, 289318, 284235, 279537, 274938, 270377, 265850, 261312, 256842, 252738, 249292, 246461, 243886, 241227, 238474, 235883, 233704, 232055, 230975, 230335, 229603, 228004, 225315, 222418, 220513, 219658, 218601, 216427, 213905, 212631, 213099, 214284, 215063, 215320, 215500, 215749, 215982, 216381, 217275, 218598, 219833, 220513, 220634, 220596, 220877, 221675, 222749, 223640, 224121, 224352, 224644, 225262, 226461, 228412, 230961, 233658, 236169, 238418, 240214, 241054, 240626, 239358, 238216, 238014, 239025, 241042, 243558, 246005, 248113, 250029, 251988, 253985, 255957, 258097, 260768, 264158, 268238, 272887, 277773, 282215, 285534, 287548, 288535, 288833, 288809, 289045, 290004, 291339, 292007, 291400, 290089, 289208, 289339, 290261, 291480, 292557, 292986, 292327, 290696, 288854, 287542, 286843, 286326, 285662, 284835, 283866, 282694, 281486, 280785, 280982, 281704, 282096, 281851, 281720, 282677, 284712, 286817, 288232, 289303, 290850, 292956, 294815, 295754, 295933, 295841, 295522, 294675]
53644B94675j261r43J04J263K034K321K198J693R71M10L49Q13J481J887J721J087
53628C10803M67K63M49P99J292J997K700L008K837K545K439K511K622K653K481
53613C39866K138K039K636L703M448M493M293M369M626M740M748M783M667M300
53599C95849M074M299M556M169L172K167J448Q29K66o1k47o23j203j683k002k326
53583D12684k531k314j867j694j764j585j270j557k415k629j502j44j19j328k262
53568C87703k009j108m20r9J08L17N36P51P84M23r9k69K1L37M23N54R87J486J773
53549C92199J974K254K367K011J360P19M7o97r21J00K070L723M275M213M319M577
53533D24590M538M286M241M331M200M150N018O819Q354Q680Q381Q741R983J1071
$$ y = [294675, 293414, 292471, 292575, 293838, 295872, 298193, 300391, 302084, 303055, 303465, 303814, 304627, 306108, 307995, 309716, 310803, 311270, 311533, 311982, 312781, 314073, 316070, 318770, 321778, 324615, 327160, 329599, 332110, 334732, 337385, 339866, 342004, 344043, 346679, 350382, 354830, 359323, 363616, 367985, 372611, 377351, 382099, 386882, 391549, 395849, 399923, 404222, 408778, 412947, 416119, 418286, 419734, 420563, 420829, 420768, 420521, 419898, 418695, 417012, 415010, 412684, 410153, 407839, 405972, 404278, 402514, 400929, 399659, 398102, 395687, 393058, 391556, 391412, 391293, 389965, 387703, 385694, 384586, 384166, 384067, 384175, 384492, 385028, 385779, 386563, 386986, 386887, 386618, 386639, 386976, 387399, 387953, 388940, 390426, 392199, 394173, 396427, 398794, 400805, 402165, 402884, 402931, 402234, 401313, 401413, 403483, 407206, 411481, 415694, 420013, 424590, 429128, 433414, 437655, 441986, 446186, 450336, 455354, 462173, 470527, 479207, 487588, 496329, 506312, 517383]
53519E17383J1204J0755J0551J0860J1467J2331J3661J5388J7040J8181J8801
53508F67622J9152J9460J9853K0436K1165K1741K1870K1653K1451K1257K0486
53497H96146J8782J6718J5339J4963J4963J4779J4616J4879J5396J5676J5679
53486A067936J5768J6010J6066J5804J5569J5643J5794J5621J5137J4763J4757
53475A238868J4822J4303J2793J0545Q265O474N091L689J998N7k008m152o339
53462A304406q416j0044j0829j0616r779r024q834r203r914j0865j1928j2815
53450A182139j3398j3893j4468j4895j4957j4927j5175j5385j4739j2962j0733
53439A026607q904p660o543n074l188j319j60q4o76j062p18K12J337K413L236
$$ y = [517383, 528587, 539342, 549893, 560753, 572220, 584551, 598212, 613600, 630640, 648821, 667622, 686774, 706234, 726087, 746523, 767688, 789429, 811299, 832952, 854403, 875660, 896146, 914928, 931646, 946985, 961948, 976911, 991690, 1006306, 1021185, 1036581, 1052257, 1067936, 1083704, 1099714, 1115780, 1131584, 1147153, 1162796, 1178590, 1194211, 1209348, 1224111, 1238868, 1253690, 1267993, 1280786, 1291331, 1299596, 1306070, 1311161, 1314850, 1316848, 1316905, 1314897, 1310745, 1304406, 1295990, 1285946, 1275117, 1264501, 1254722, 1245698, 1236864, 1227661, 1217747, 1206882, 1194954, 1182139, 1168741, 1154848, 1140380, 1125485, 1110528, 1095601, 1080426, 1065041, 1050302, 1037340, 1026607, 1017703, 1010043, 1003500, 998426, 995238, 993919, 993759, 993675, 992999, 991937, 991219, 991431, 992768, 995181, 998417]
53424I98417L581L500L495M144N628P641R654J1226J2250J2935J3540J4169J4923
53411A115103J6034J7570J9173K0403K1298K2263K3555K5162K7025K8891L0198
53400A366675L0663L0998L2296L4690L7248L9299M1078M2836M4139M4574M4522
53389A789018M4645M5020M5299M5346M5161M4521M3248M1604L9961L8324L6572
53378B258719L4830L3140L0996K7926K4235K0626J7173J3303Q804M253K27l500
53366B470732p717j2950j8826k4238k8236l0862l2972l5039l6660l7447l7855
53355B167930l8481l9050l8812l7705l6192l4178l1192k7790k5662k5786k7175
53344A805907k8128k8043k7503k7003k6447k5699k4907k4215k3478k2452k0968
$$ y = [998417, 1001998, 1005498, 1008993, 1013137, 1018765, 1026406, 1036060, 1047286, 1059536, 1072471, 1086011, 1100180, 1115103, 1131137, 1148707, 1167880, 1188283, 1209581, 1231844, 1255399, 1280561, 1307586, 1336477, 1366675, 1397338, 1428336, 1460632, 1495322, 1532570, 1571869, 1612947, 1655783, 1699922, 1744496, 1789018, 1833663, 1878683, 1923982, 1969328, 2014489, 2059010, 2102258, 2143862, 2183823, 2222147, 2258719, 2293549, 2326689, 2357685, 2385611, 2409846, 2430472, 2447645, 2460948, 2469752, 2474005, 2474232, 2470732, 2463015, 2450065, 2431239, 2407001, 2378765, 2347903, 2314931, 2279892, 2243232, 2205785, 2167930, 2129449, 2090399, 2051587, 2013882, 1977690, 1943512, 1912320, 1884530, 1858868, 1833082, 1805907, 1777779, 1749736, 1722233, 1695230, 1668783, 1643084, 1618177, 1593962, 1570484, 1548032, 1527064]
53333A527064j8975j6608j4195j2030j0173q604p523p323q288j0324j2923j5361
53321A384737j7089j8058j8521j8549j7973j6837j5587j4601j3813j3009j2199
53310A208501j1411j0388q921p369o376o009n626m675l269j791k36J679L888N785
53296A153782O886P485Q527J0727J3876J7012J9269K0436K0787K0594K0044J9378
53284A338803J8814J8248J7339J5964J4399J2916J1437R760P943O073L882R90
53272A476568k395n464p663r284j0978j2960j4997j6885j8523j9651k0004j9779
53260A317985j9548j9657j9963k0243k0452k0490k0146j9487j8954j8773j8617
53249A101655j8135j7544j7372j7763j8386j8876j9056j8895j8524j8203j7932
$$ y = [1527064, 1508089, 1491481, 1477286, 1465256, 1455083, 1446479, 1438956, 1431633, 1423345, 1413021, 1400098, 1384737, 1367648, 1349590, 1331069, 1312520, 1294547, 1277710, 1262123, 1247522, 1233709, 1220700, 1208501, 1197090, 1186702, 1177781, 1170412, 1164036, 1158027, 1152401, 1147726, 1144457, 1142666, 1142430, 1144109, 1147997, 1153782, 1160668, 1168153, 1176680, 1187407, 1201283, 1218295, 1237564, 1258000, 1278787, 1299381, 1319425, 1338803, 1357617, 1375865, 1393204, 1409168, 1423567, 1436483, 1447920, 1457680, 1465623, 1471696, 1475578, 1476568, 1474173, 1468709, 1461046, 1451762, 1440784, 1427824, 1412827, 1395942, 1377419, 1357768, 1337764, 1317985, 1298437, 1278780, 1258817, 1238574, 1218122, 1197632, 1177486, 1157999, 1139045, 1120272, 1101655, 1083520, 1065976, 1048604, 1030841, 1012455, 993579, 974523, 955628, 937104, 918901, 900969]
53238I00969j7312j6144j4900j4116j3496j2275j0458q950q284p909p132o169
53226G63824n766o136o875p711q682r732j0651j1530j2711j4172j5382j6019j6444
53213F22013j7079j7584j7169j5655j3738j2139j0928r947r390r465r754r589
53201D69576r073r015r692j0295j0098r572r683j0413j0806j0325r399q517p583
53188C45105o476n602n378n578n644n302m558l446k234j605j998k861l069k183
53174B89171q89j91m30j188j821j950j642j239j007r54r97j090j085p81l46l91
53158B73170j235k262k529j913j144p00l18K99Q75J021Q35O47M45l7p77j403j579
53141B63395j268p06k44o3M3L96Q83J028P51N34O15N14r9o04j93Q78J582J525
$$ y = [900969, 883657, 867513, 852613, 838497, 825001, 812726, 802268, 793318, 785034, 777125, 769993, 763824, 758058, 751922, 745047, 737336, 728654, 718922, 708271, 696741, 684030, 669858, 654476, 638457, 622013, 604934, 587350, 570181, 554526, 540788, 528649, 517721, 507774, 498384, 488919, 479165, 469576, 460503, 451488, 441796, 431501, 421403, 411831, 402148, 391735, 380929, 370604, 361205, 352688, 345105, 338629, 333027, 327649, 322071, 316427, 311125, 306567, 303121, 300887, 299282, 297284, 294423, 291354, 289171, 288282, 288091, 287661, 286473, 284652, 282702, 281060, 279821, 278814, 277860, 276863, 275773, 274688, 273907, 273561, 273170, 271935, 269673, 267144, 265231, 264087, 263387, 263069, 263368, 264243, 265264, 266099, 266746, 267191, 267154, 266377, 264974, 263395, 262127, 261421, 261177, 261114, 261157, 261553, 262436, 263464, 264215, 264749, 265364, 265878, 265779, 265175, 264982, 265860, 267442, 268967]
53123B68967J214J003O42J17LN74J226J281Q73O12Q15J403K149K567K074P87l37
53106B85970o85q34j588k641l035k651k281k335k452k425k564k858k598j393P5
53091B55705Q13O95M40O39J090J012j70k000l131k608j008K95Q36J298K054K452
53075B58412J995J243Q61N63k31j227j687j543j297j071o69l17m07o38l69K02
53059B53820J96m44o39K11J178J028j39j042p71M06J515J771J116K23j20K16O50
53042B59175O38K00l67q74j158r76l58K46M63M23M29M79M53M86P71J118J141P61
53024B63050J96m26j023j234o53M91J317J190M18j37lN55J012J129J075J136J397
53007B69490J651J495O34p30j774j595j24J545K122J407L96K0K14L26N8l50n49
$$ y = [268967, 270181, 271184, 271826, 271943, 271946, 272520, 273746, 275027, 275900, 276512, 277327, 278730, 280879, 283446, 285520, 286307, 285970, 285285, 284451, 282863, 280222, 277187, 274536, 272255, 269920, 267468, 265043, 262479, 259621, 257023, 255630, 255705, 256518, 257213, 257653, 258292, 259382, 260394, 260224, 258224, 255093, 252485, 251477, 251772, 252608, 253906, 255960, 258412, 260407, 261650, 262511, 263074, 262843, 261616, 259929, 258386, 257089, 256018, 255349, 255032, 254625, 253987, 253618, 253820, 254016, 253572, 252933, 253144, 254322, 255350, 255211, 254169, 253398, 253804, 255319, 257090, 258206, 258429, 258309, 258525, 259175, 259813, 260013, 259646, 258772, 257614, 256638, 256280, 256526, 256989, 257412, 257841, 258320, 258773, 259259, 260030, 261148, 262289, 263050, 263246, 262820, 261797, 260563, 259910, 260401, 261718, 262908, 263326, 263189, 263186, 263741, 264753, 265882, 266957, 268093, 269490, 271141, 272636, 273270, 272540, 270766, 269171, 269047, 270592, 272714, 274121, 274517, 274537, 274751, 275077, 275135, 274785, 274236]
52990B74236l52K90J159J728J629J171R86J220J405J243J041J236J794K290K424
52975B93500K206J871J752K053K559K686K045Q43l80j218j505j201m57L82J047
52960C06183J524J739J349K76q18j118p13n71j269k321k880k733k283j960j916
52945B92489k043j997j502q25o31j088j569j514j140p89k20P69J479J051r9o77
52929B81694l23j7m78j164j333j085p68k57M96Q64L63m45p28n98o45p24k19O50
52911B75283R25L27l88o41p21j005j265j152p41k46K37M86K25l00l80Q5K83l06
52893B70706r69p33K05P75N30R3P7L38M59M13M06L55jo20j040q73k75K17K65N1
52873B70379m4P5K37L52N15Q09J201J679K262K874L364L609L457K739J562M87
$$ y = [274236, 273884, 274174, 275333, 277061, 278690, 279861, 280847, 282067, 283472, 284715, 285756, 286992, 288786, 291076, 293500, 295706, 297577, 299329, 301382, 303941, 306627, 308672, 309515, 309135, 307917, 306412, 305211, 304754, 305136, 306183, 307707, 309446, 310795, 311071, 310253, 309135, 308422, 307851, 306582, 304261, 301381, 298648, 296365, 294405, 292489, 290446, 288449, 286947, 286122, 285491, 284403, 282834, 281320, 280180, 279391, 279171, 279940, 281419, 282470, 282371, 281694, 281371, 281354, 280876, 279712, 278379, 277294, 276526, 276269, 276765, 277629, 277992, 277547, 276819, 276221, 275576, 274852, 274633, 275283, 276208, 276535, 276147, 275506, 274785, 273780, 272515, 271363, 270622, 270376, 270613, 271099, 271324, 271024, 270644, 270729, 271012, 270706, 269737, 269004, 269209, 269984, 270514, 270607, 270684, 271022, 271481, 271894, 272300, 272655, 272654, 272034, 270994, 270121, 269846, 270063, 270328, 270379, 270335, 270410, 270647, 270999, 271514, 272323, 273524, 275203, 277465, 280339, 283703, 287312, 290769, 293508, 295070, 295557]
52857B95557j4j37m21r84j575k208l074l801l716l021k802l488m106l692k686
52842B59832k100k024j837j467j304j161m69M98O52l25j430j706j400j260j368
52827B43131j239o19L17J288J957J962J309N24J06Qn6j25o7Q5K85O49J095J135
52809B51745M71l33l64N60J684K136J577K38j158j604p04O26R76J01q95j244j471
52792B52341k217k885k430r23N43J304J545J387O31m50r45l91O91J603K191K479
52776B54474K302J750J304J053M41n94j077m09L61j45j536k078j062M61J354J531
52760B58130J223L72p31j226q04k45k33m36l32j64k67k27L83J058J098Q63J168
52743B59630J822J858J143O55J018J853K647L336L690L160J893J005J239J918
$$ y = [295557, 295543, 295406, 294985, 294001, 292426, 290218, 287144, 283343, 279627, 276606, 273804, 270316, 266210, 262518, 259832, 257732, 255708, 253871, 252404, 251100, 249939, 249470, 249968, 250620, 250295, 248865, 247159, 245759, 244499, 243131, 241892, 241273, 241590, 242878, 244835, 246797, 248106, 248630, 248736, 248744, 248688, 248563, 248496, 248581, 248866, 249515, 250610, 251745, 252216, 251883, 251519, 252079, 253763, 255899, 257476, 257714, 256556, 254952, 254248, 254874, 255850, 255951, 255056, 253812, 252341, 250124, 247239, 244809, 243886, 244429, 245733, 247278, 248665, 249296, 248846, 247901, 247510, 248201, 249804, 251995, 254474, 256776, 258526, 259830, 260883, 261324, 260730, 259653, 259244, 259605, 259460, 257924, 255846, 254784, 255245, 256599, 258130, 259353, 259725, 258994, 257768, 256964, 256719, 256486, 256050, 255718, 255554, 255287, 255060, 255443, 256501, 257599, 258462, 259630, 261452, 263310, 264453, 265108, 266126, 267979, 270626, 273962, 277652, 280812, 282705, 283710, 284949, 286867]
52729B86867J928J237P14P70R97R67P08L13k99j081j773k296k807l199k973j963
52713B78110q66n45r40j093m18N47Q87M81l2k17k26j85J46Q06J208Q57J82Q4P24
52694B79510J343J291P03K4n85j029r58j72Q13J173O90p7n84q87j300j777j929
52677B76249j541q62l57k90n66q35p75l68O1J57m3j32J53N26M66j54q88j191r30
52658B68680m24l7J44L14O96J274J824K194K374K280J633L60j014j740j558q53
52642B76147r2M85P47N88K40J98O28J159J448J681K164K730K914K671K562L219
52626B99489M689O168O378M542J260j860l643m286m681n153n330m924m169l455
52612B85025k937k547k130j522p01K14J074J730J822J035k76j047n96N29J235
$$ y = [286867, 288795, 290032, 290746, 291516, 292513, 293480, 294188, 294501, 294202, 293121, 291348, 289052, 286245, 283046, 280073, 278110, 277244, 276699, 275759, 274666, 274248, 274795, 275682, 276163, 276131, 275914, 275688, 275503, 275649, 276455, 277663, 278520, 278702, 278786, 279510, 280853, 282144, 282847, 282871, 282286, 281257, 280299, 280127, 280940, 282113, 282803, 282726, 282142, 281255, 279955, 278178, 276249, 274708, 273846, 273489, 273199, 272633, 271798, 271023, 270655, 270716, 270873, 270830, 270698, 270851, 271377, 271843, 271689, 270801, 269610, 268680, 268256, 268219, 268363, 268677, 269373, 270647, 272471, 274665, 277039, 279319, 280952, 281312, 280298, 278558, 277000, 276147, 276055, 276540, 277287, 277875, 278115, 278313, 278941, 280100, 281548, 283229, 285393, 288123, 291037, 293708, 296270, 299489, 304178, 310346, 316724, 321266, 322526, 320666, 317023, 312737, 308056, 302903, 297573, 292649, 288480, 285025, 282088, 279541, 277411, 275889, 275188, 275402, 276476, 278206, 280028, 281063, 280787, 279740, 279144, 279673, 280908]
52597B80908J115O17K31J07K63N69N98J00m79m80rK49J76L54R88J487J445J247
52579B89486J280J196N67k64n84l37j42m54j166j887k206j887j162p15r35j335
52563B79455j165m73n3l11p05n31J35N78L36l68j011j281j187q19k66K85M89J44
52545B73252n00q36m40M70J179J064J44q84j220o71K22P83Q62P85Q00Q51Q63R37
52527B77661J159J419J560J551J394J014M42l8j12J44L47L14L47Q71J899L014
52511B92986L857M348M487M185L474K592J612L43j116k094k199k183l071m492
52497C02729m898l638j936j213j396j577j537j659j877j777j430j154o72M33J622
52482B80020J831J006K01pr7l70l12L80J087J209J055J135J298J231J238J767
$$ y = [280908, 282023, 282640, 282871, 282978, 283241, 283810, 284408, 284508, 284029, 283549, 283540, 283789, 283965, 284319, 285307, 286794, 288239, 289486, 290766, 291962, 292529, 292265, 291681, 291344, 291202, 290748, 289582, 287695, 285489, 283602, 282440, 281725, 280790, 279455, 278290, 277817, 277764, 277453, 276748, 276217, 276352, 276930, 277266, 276898, 275887, 274606, 273419, 272600, 272334, 272619, 273108, 273252, 272752, 271916, 271476, 271946, 273125, 274189, 274333, 273449, 272229, 271558, 271780, 272563, 273425, 274210, 275010, 275861, 276724, 277661, 278820, 280239, 281799, 283350, 284744, 285758, 286200, 286162, 286050, 286194, 286541, 286855, 287202, 288073, 289972, 292986, 296843, 301191, 305678, 309863, 313337, 315929, 317541, 317884, 316768, 314674, 312475, 310292, 307221, 302729, 297831, 294193, 292257, 291044, 289648, 288071, 286534, 284875, 282998, 281221, 279791, 278637, 277965, 278398, 280020, 281851, 282857, 283058, 283051, 282954, 282584, 282272, 282652, 283739, 284948, 286003, 287138, 288436, 289667, 290905, 292672]
52466B92672K582L108L306L592M091M537M698M393L321J396q39k545l339l415
52452C17558l180k967l004l202l174k716k169j979k052j859j139k72P1m53j464
52437B87999k104j794p95J71P67J173J452J315O88n0n37p36o42j76M09O02L58
52420B88100K44N70R77J130J188J257J060P00R70K240L632M165M235N089P098
52405C22655R472J1465J2937J3622J2790R984N668R96k908n469o821p472p655
52392C69264p229o333n638n517n424m641l323k205j545j058n80j64L14J013J681
52377C28615K014K273K957L891M386M245M088M548N594O611O772N622L627J968
52363C87211J292J030L92m24o94l24K65R38J647J836J185O04J200K483K870K011
$$ y = [292672, 295254, 298362, 301668, 305260, 309351, 313888, 318586, 322979, 326300, 327696, 326857, 324312, 320973, 317558, 314378, 311411, 308407, 305205, 302031, 299315, 297146, 295167, 293115, 291256, 290117, 289845, 289916, 289463, 287999, 285895, 284101, 283306, 283477, 284244, 285417, 286869, 288184, 288872, 288822, 288285, 287549, 286907, 286731, 287140, 287742, 288100, 288344, 288914, 289891, 291021, 292209, 293466, 294526, 295226, 296196, 298436, 302068, 306233, 310468, 315557, 322655, 332127, 343592, 356529, 370151, 382941, 392925, 398593, 399589, 396681, 391212, 384391, 376919, 369264, 362035, 355702, 350064, 344547, 339123, 334482, 331159, 328954, 327409, 326351, 325771, 325607, 325921, 326934, 328615, 330629, 332902, 335859, 339750, 344136, 348381, 352469, 357017, 362611, 369222, 375994, 381616, 385243, 387211, 388503, 389533, 389925, 389501, 388807, 388483, 388748, 389686, 391333, 393169, 394354, 394958, 396158, 398641, 401511, 403522]
52347D03522J129J076J463K031L210M753N412M893M743O120P921Q390P701P479
52333D69843Q429R892J1351J3028J4979J6832J8440J9910K0979K1320K1424K2251
52321F68678K3844K5186K5638K5670K5883K6147K6180K6301K6955K7841K8139
52310I56462K7538K6596K6108K6368K6979K7195K6429K4701K2692K1229K0495
52299A232792J9841J8389J5973J3242J0772Q319N204J387k397n521q037j0182
52287A299782j1806j2725j3265j3884j4379j3999j2508j0642r267q320o906m389
52275A167692j174J700L557M618N657P338R778J2486J4657J5833J6388J7152J8394
52262A294076J9519J9950J9942K0164K0751K1249K1276K0748J9621J7968J6170
$$ y = [403522, 404651, 405727, 407190, 409221, 412431, 417184, 422596, 427489, 432232, 438352, 446273, 454663, 462364, 469843, 478272, 488164, 499515, 512543, 527522, 544354, 562794, 582704, 603683, 625003, 646427, 668678, 692522, 717708, 743346, 769016, 794899, 821046, 847226, 873527, 900482, 928323, 956462, 984000, 1010596, 1036704, 1063072, 1090051, 1117246, 1143675, 1168376, 1191068, 1212297, 1232792, 1252633, 1271022, 1286995, 1300237, 1311009, 1319328, 1324532, 1325919, 1323522, 1318001, 1309964, 1299782, 1287976, 1275251, 1261986, 1248102, 1233723, 1219724, 1207216, 1196574, 1187307, 1178987, 1172081, 1167692, 1166518, 1168218, 1171775, 1176393, 1182050, 1189388, 1199166, 1211652, 1226309, 1242142, 1258530, 1275682, 1294076, 1313595, 1333545, 1353487, 1373651, 1394402, 1415651, 1436927, 1457675, 1477296, 1495264, 1511434]
52251A511434J4554J2882J0668P887M801J313k766o910j0159j2323j4147j6120
52239A501114j7956j9396k0675k1796k2236k1876k1479k1645k1896k1446k0275
52228A270438j8882j7459j5998j4763j3969j3267j2147j0614r072p752o624n583
52216A124308m352k669q63K86O91J273K608L970M414M160M020M034L740L320L328
52201A152268L560L343K856L032M149N523O626P540Q193Q210P707P273O909N954
52187A233143M420L252K796K004k0k619m604o019p786r967j1495j1663j0994j0308
52173A170140r713q818p574o364n462m732l894k811j508o2J333K423L175L923
52159A130056M913N764N761M772L459K440J685R94N33M60M37J34r1L80J544K799
$$ y = [1511434, 1525988, 1538870, 1549538, 1557425, 1562226, 1563539, 1560773, 1553863, 1543704, 1531381, 1517234, 1501114, 1483158, 1463762, 1443087, 1421291, 1399055, 1377179, 1355700, 1334055, 1312159, 1290713, 1270438, 1251556, 1234097, 1218099, 1203336, 1189367, 1176100, 1163953, 1153339, 1144267, 1136515, 1129891, 1124308, 1119956, 1117287, 1116424, 1116710, 1117401, 1118674, 1121282, 1125252, 1129666, 1133826, 1137846, 1141880, 1145620, 1148940, 1152268, 1155828, 1159171, 1162027, 1165059, 1169208, 1174731, 1181357, 1188897, 1197090, 1205300, 1213007, 1220280, 1227189, 1233143, 1237563, 1240815, 1243611, 1245615, 1245595, 1242976, 1238372, 1232353, 1224567, 1214600, 1203105, 1191442, 1180448, 1170140, 1160427, 1151609, 1144035, 1137671, 1132209, 1127477, 1123583, 1120772, 1119264, 1119202, 1120535, 1122958, 1126133, 1130056, 1134969, 1140733, 1146494, 1151266, 1154725, 1157165, 1158850, 1159844, 1160377, 1160837, 1161274, 1161408, 1161317, 1161697, 1163241, 1166040]
52143A166040L736M349M667M751M794M718M026K748K137L371N829P785Q826J0312
52129A238089J3176J6651J9771K2933K6959L1461L5161L7387L8460L8936L9265
52118A558249L9847M0671M1032M0236L8442L6296L4014L1405K8484K5499K2485
52107A936660J9379J6462J4121J2257J0389Q341O307M430K657R69p29k805n528
$$ y = [1166040, 1169776, 1174125, 1178792, 1183543, 1188337, 1193055, 1197081, 1199829, 1201966, 1205337, 1211166, 1218951, 1227777, 1238089, 1251265, 1267916, 1287687, 1310620, 1337579, 1369040, 1404201, 1441588, 1480048, 1518984, 1558249, 1598096, 1638767, 1679799, 1720035, 1758477, 1794773, 1828787, 1860192, 1888676, 1914175, 1936660, 1956039, 1972501, 1986622, 1998879, 2009268, 2017609, 2023916, 2028346, 2031003, 2031972, 2031243, 2028438, 2022910]
$$ [...]
##END NTUPLES=NMR SPECTRUM
##END=
