##TITLE=AC1636_CENAH_8493977_dbLFOWS9NT
##JCAMPDX= 6.0         $$ Bruker NMR JCAMP-DX V2.0
##DATA TYPE= NMR SPECTRUM
##DATA CLASS= NTUPLES
##ORIGIN= BRUKER
##OWNER= Administrator
$$ 1.72 TOPSPIN		Version 2.1
$$ 2014-02-18 19:40:31.758 -0800  Administrator@X
$$ Compression mode = diff/dup
##.OBSERVE FREQUENCY= 400.02188249412
##.OBSERVE NUCLEUS= ^1H
##.ACQUISITION MODE= SIMULTANEOUS (DQD)
##.ACQUISITION SCHEME= undefined
##.AVERAGES= 8
##.DIGITISER RES= 22
##SPECTROMETER/DATA SYSTEM= spect
##.PULSE SEQUENCE= zg30
##.SOLVENT NAME= COFFEE_meoh
##.SHIFT REFERENCE= INTERNAL, COFFEE_meoh, 1, 14.98509
##AUDIT TRAIL= $$ (NUMBER, WHEN, WHO, WHERE, PROCESS, VERSION, WHAT)
$$ ##TITLE= Audit trail, TOPSPIN		Version 2.1
$$ ##JCAMPDX= 5.01
$$ ##ORIGIN= Bruker BioSpin GmbH
$$ ##OWNER= Administrator
$$ $$ E:\/data/COFFEE/nmr/AC1636_CENAH_8493977_dbLFOWS9NT/10/pdata/1/auditp.txt
$$ ##AUDIT TRAIL=  $$ (NUMBER, WHEN, WHO, WHERE, PROCESS, VERSION, WHAT)
(   1,<2014-02-18 19:40:25.258 -0800>,<Administrator>,<X>,<go>,<TOPSPIN 2.1>,
      <created by zg
	started at 2014-02-18 19:39:19.008 -0800,
	POWCHK enabled, PULCHK disabled,
       configuration hash MD5:
       C8 4E 4E 5D D3 5C D8 9E 9F 52 82 E0 59 8A DE 15
       data hash MD5: 64K
       87 7B 9F F2 F2 A5 42 73 5C E5 E4 6E C9 53 55 CA>)
(   2,<2014-02-18 19:40:28.149 -0800>,<Administrator>,<X>,<proc1d>,<TOPSPIN 2.1>,
      <Start of raw data processing
       efp LB = 0 FT_mod = 6 PKNL = 1 PHC0 = 0 PHC1 = 0 SI = 32K 
       data hash MD5: 32K
       7B B6 FE E3 45 5C 27 5B 7F 30 7D ED 52 F9 51 D4>)
(   3,<2014-02-18 19:40:28.430 -0800>,<Administrator>,<X>,<proc1d>,<TOPSPIN 2.1>,
      <pk PHC0 = 97.03125 PHC1 = 0 
       data hash MD5: 32K
       82 98 44 EE 8B 84 70 FC A3 8D 1C 5B D3 EA 26 51>)
(   4,<2014-02-18 19:40:28.524 -0800>,<Administrator>,<X>,<proc1d>,<TOPSPIN 2.1>,
      <abs ABSG = 1 
       data hash MD5: 32K
       E3 18 13 72 12 37 71 F9 6B 07 54 D9 50 4D 99 0E>)
(   5,<2014-02-18 19:40:28.586 -0800>,<Administrator>,<X>,<proc1d>,<TOPSPIN 2.1>,
      <abs ABSG = 2 
       data hash MD5: 32K
       A6 24 E8 DA 5D E0 A0 48 43 55 A3 9B FC 84 4D 35>)
(   6,<2014-02-18 19:40:28.633 -0800>,<Administrator>,<X>,<proc1d>,<TOPSPIN 2.1>,
      <abs ABSG = 3 
       data hash MD5: 32K
       0D 8E DA FB D2 D1 46 C8 CE 2C 42 FE A9 BA 03 FB>)
(   7,<2014-02-18 19:40:28.711 -0800>,<Administrator>,<X>,<proc1d>,<TOPSPIN 2.1>,
      <abs ABSG = 4 
       data hash MD5: 32K
       54 85 CC 86 92 02 08 14 93 C2 25 DA 18 85 DD 88>)
(   8,<2014-02-18 19:40:28.758 -0800>,<Administrator>,<X>,<proc1d>,<TOPSPIN 2.1>,
      <abs ABSG = 5 
       data hash MD5: 32K
       EB 06 2A 56 F2 31 CD E3 87 42 43 67 9A A7 0C 8E>)
$$ ##END=
$$ 
$$ $$ hash MD5
$$ $$ 95 D3 8A B7 32 E1 23 F2 9F B7 71 FD 53 A2 02 14
##$RELAX= 
##$RELAX= 
##$RELAX= 
##$RELAX= 
##$RELAX= 
##$RELAX= 
##$RELAX= 
$$ Bruker specific parameters
$$ --------------------------
##$DU= <E:\>
##$EXPNO= 10
##$NAME= <AC1636_CENAH_8493977_dbLFOWS9NT>
##$PROCNO= 1
$$ [...]
150 150 150 150 150 150 150 150
##$TP07= 0
##$TPNAME0= <>
##$TPNAME1= <>
##$TPNAME2= <>
##$TPNAME3= <>
##$TPNAME4= <>
##$TPNAME5= <>
##$TPNAME6= <>
##$TPNAME7= <>
##$TPOAL= (0..7)
0.5 0.5 0.5 0.5 0.5 0.5 0.5 0.5
##$TPOFFS= (0..7)
0 0 0 0 0 0 0 0
##$TUNHIN= 0
##$TUNHOUT= 0
##$TUNXOUT= 0
##$USERA1= <user>
##$USERA2= <user>
##$USERA3= <user>
##$USERA4= <user>
##$USERA5= <user>
##$V9= 5
##$VALIST= <valist>
##$VCLIST= <CCCCCCCCCCCCCCC>
##$VD= 0
##$VDLIST= <DDDDDDDDDDDDDDD>
##$VPLIST= <PPPPPPPPPPPPPPP>
##$VTLIST= <TTTTTTTTTTTTTTT>
##$WBST= 2048
##$WBSW= 25
##$XGAIN= (0..3)
0 0 0 0
##$XL= 0
##$YL= 0
##$YMAX_a= 660601
##$YMIN_a= -562408
##$ZGOPTNS= <>
##$ZL1= 120
##$ZL2= 120
##$ZL3= 120
##$ZL4= 120
##$ABSF1= 14.98509
##$ABSF2= -5.573092
##$ABSG= 5
##$ABSL= 3
##$ALPHA= 0
##$AQORDER= 0
##$ASSFAC= 0
##$ASSFACI= 0
##$ASSFACX= 0
##$ASSWID= 0
##$AUNMP= <proc_prof1d_extract_pilot.lims>
##$AXLEFT= 0
##$AXNAME= <>
##$AXNUC= <1H>
##$AXRIGHT= 0
##$AXTYPE= 0
##$AXUNIT= <>
##$AZFE= 0.1
##$AZFW= 0.1
##$BCFW= 0
##$BC_mod= 0
##$BYTORDP= 0
##$COROFFS= 0
##$CY= 15
##$DATMOD= 1
##$DC= 0
##$DFILT= <>
##$DTYPP= 0
##$F1P= 0
##$F2P= 0
##$FCOR= 0.5
##$FTSIZE= 32768
##$FT_mod= 6
##$GAMMA= 0
##$GB= 0
##$INTBC= 1
##$INTSCL= 1
##$ISEN= 128
##$LB= 0
##$LEV0= 0
##$LPBIN= 0
##$MAXI= 10000
##$MC2= 0
##$MEAN= 0
##$ME_mod= 0
##$MI= 0
##$NCOEF= 0
##$NC_proc= -8
##$NLEV= 6
##$NOISF1= 0
##$NOISF2= 0
##$NSP= 0
##$NTH_PI= 0
##$NZP= 0
##$OFFSET= 14.98509
##$PC= 1
##$PHC0= 97.03125
##$PHC1= 0
##$PH_mod= 1
##$PKNL= yes
##$PPARMOD= 0
##$PPDIAG= 0
##$PPIPTYP= 0
##$PPMPNUM= 2147483647
##$PPRESOL= 1
##$PSCAL= 4
##$PSIGN= 0
##$PYNMP= <proc.py>
##$REVERSE= no
##$SF= 400.02
##$SI= 32768
##$SIGF1= 0
##$SIGF2= 0
##$SINO= 400
##$SIOLD= 32768
##$SPECTYP= <>
##$SREGLST= <1H.CDCl3>
##$SSB= 0
##$STSI= 32768
##$STSR= 0
##$SW_p= 8223.68421052631
##$SYMM= 0
##$S_DEV= 0
##$TDeff= 65536
##$TDoff= 0
##$TI= <>
##$TILT= no
##$TM1= 0
##$TM2= 0
##$TOPLEV= 0
##$USERP1= <user>
##$USERP2= <user>
##$USERP3= <user>
##$USERP4= <user>
##$USERP5= <user>
##$WDW= 1
##$XDIM= 32768
##$YMAX_p= 472971371
##$YMIN_p= -814790
##$CURPLOT= <Network HP LaserJet P1505>
##$CURPRIN= <$Network HP LaserJet P1505>
##$DFORMAT= <normdp>
##$LAYOUT= <+/1D_H.xwp>
##$LFORMAT= <normlp>
##$PFORMAT= <normpl>
##$SURQMSG= 1
$$ End of Bruker specific parameters
$$ ---------------------------------
##NTUPLES= NMR SPECTRUM
##VAR_NAME=  FREQUENCY,     SPECTRUM/REAL,   SPECTRUM/IMAG
##SYMBOL=    X,             R,               I
##VAR_TYPE=  INDEPENDENT,   DEPENDENT,       DEPENDENT
##VAR_FORM=  AFFN,          ASDF,            ASDF
##VAR_DIM=   32768,         32768,           32768
##UNITS=     HZ,            ARBITRARY UNITS, ARBITRARY UNITS
##FACTOR=    0.250966925370066, 1,           1
##FIRST=     8223.43324360094, -137302,      138658
##LAST=      0,             -76040,          -327773
##MIN=       0,             -814790,         0
##MAX=       8223.43324360094, 472971371,    0
$$ Real data points
##PAGE= N=1
##DATA TABLE= (X++(R..R)), XYDATA
$$ [...]
19541A96919F687b2666p5247A98231c4575H5743a43633A32210f8052A92330C0857
19529c77548B00934A2982K0835K1778b07679A00111l1253h4499B47102a27501
19518a49233F7387a58422E6726L2252j9698b67034R5147C89461A7495c9701A20795
19506a66833b9808A6823g5028q6915A3649b24542O616M5815N7392i3A73827d00081
19493a8935C11268j35269b27692A752b45221A22114a83560O9685A06883I784K12103
19482B21887g2663b3824e951C67574h0403n9012q1013A65209b05789A46724a92
19470a63508h0414q8373A1576Q3443k4601a93770A0107f5209j36479H8633a75992
19458g3102B36386a94505C3023K90201A1447b06080B42867a44869G3418b76069
$$ plain form
19541 196919 6687 -22666 -97913 198231 -34575 85743 -143633 132210 -68052 192330 30857
19529 -377548 200934 12982 33817 55595 -207679 100111 68858 -84499 247102 -127501
19518 -149233 67387 -158422 56726 88978 69280 -267034 -171887 389461 17495 -39701 120795
19506 -166833 -29808 16823 -75028 -161943 13649 -224542 -217926 -172111 -114719 -93 173827 -400081
19493 -18935 311268 175999 -227692 1752 -245221 122114 -183560 -113875 106883 9784 221887
19482 221887 -72663 -23824 -5951 367574 -80403 -139415 -220428 165209 -205789 146724 -192
19470 -163508 -80414 -168787 11576 95019 70418 -193770 10107 -65209 -201688 88633 -175992
19458 -73102 236386 -194505 33023 323224 11447 -206080 242867 -144869 73418 -276069
19447a16923M9989k5330j85283A69671d15028C8843b988j00683A95694b00583
19436f3297E8329K64267H2950i0659o3539f1896F8601c62968l0708e5569b2270
19424b61762N4557f0462A17126E0277L32305a11870M5519m8409A57735E9498K43427
19413C02925A01580b9309A18850C6225a94407C5263L1355b60670O9892l7166A9770
19401c50217e105B91935a15756B2535e446j07524K4513r4299N241A93614e7389
19389a93570Q1450l26500B54375A20243J29674a3753D094b34989A06188b65998
19378d1876J2970A9613b3639C69495A30798g207l0396C30246G8482C1420b78051
19366A27352e6752j84133r3341A17692b15401A41627c8016j61249L4330g5851
$$ plain form
19447 -116923 -66934 -92264 -277547 169671 -415028 38843 -2988 -103671 195694 -200583
19436 -63297 58329 322596 82950 -90659 -154198 -61896 68601 -362968 -393676 -55569 -22270
19424 -261762 -207205 -60462 117126 50277 382582 -111870 -66351 -114760 157735 59498 302925
19413 302925 101580 -29309 118850 36225 -194407 35263 66618 -260670 -190778 -227944 19770
19401 -350217 -5105 291935 -115756 22535 -5446 -112970 -88457 -182756 -177515 193614 -57389
19389 -193570 -112120 -438620 254375 120243 249917 -13753 4094 -234989 106188 -265998
19378 -41876 -28906 19613 -23639 369495 130798 -7207 -37603 330246 78482 31420 -278051
19366 127352 -56752 -240885 -334226 117692 -215401 141627 -38016 -199265 -164935 -75851
19355b5586j90515b574B9277N9697O8469B7750b85l9734k2207F0145d5246A32812
19342A12108O8656i3847j61389C0371c0923h453D0659c83709O4066a06981J9208
19331h7773c1549B19224c1679A85930b37093A72225C4648A3114J60574b13426
19320a91384A13561k8919K41160i3212A38750M2693o4027a42124A18923j8321
19310A00602a30338D97727k20677c05246A88826a54292K7537j15422q2415G4073
19299A88378b24194H1891c03849J04888C7040f7540j31837F3618O7745g0756D746
19287G7686a38556A12093a66216f2672l219o3972k70880j36332B59744a05057
19276A09118J73556a07691B98108a7063C5077k266c10557C8299a17940L2657k35551
$$ plain form
19355 -25586 -216101 -2574 29277 88974 157443 27750 -285 -40019 -62226 60145 -45246 132812
19342 112108 180764 -93847 -255236 30371 -30923 -8453 40659 -383709 -319643 -106981 -87773
19331 -87773 -31549 219224 -31679 185930 -237093 172225 34648 13114 173688 -213426
19320 -191384 113561 84642 325802 -93212 138750 181443 117416 -142124 118923 100602
19310 100602 -130338 497727 277050 -305246 188826 -154292 -126755 -242177 -324592 74073
19299 188378 -224194 81891 -303849 -198961 37040 -67540 -199377 63618 131363 -70756 4746
19287 77686 -138556 112093 -166216 -62672 -65891 -129863 -400743 -537075 259744 -105057
19276 109118 282674 -107691 298108 -17063 35077 32811 -310557 38299 -117940 -85283 -320834
19265c20834E21049b20611k0953m7405a21414K7262k85082e6125j66690F5483
19254e2709m9996d159n9787h287l48938G9177c33755F1579K22450A02725m1019
19243F1706b13174C16458A28708a27662A63381E8474R882L7269K35626E5421e4668
19231a8070j55057b3764E1142b27666A31378c69608B51837e0743G6302b7271b537
19219a97872n8716A3980a27230F5555e0284j08045B56771b83890o0183J00939
19209b43134A70330a3977j4447j16193H876c06574l3119B7281i2824B17935b10782
19197a7425B9177b4518j33493G3906b11873N9128g0501b244B19768c1761E5037
19185D8182c32419a15707N2499n2735N7037k31410A87111C6648E4L6412r648L4647
$$ plain form
19265 -320834 521049 -220611 -241564 -288969 -121414 -94152 -379234 -56125 -222815 65483
19254 -52709 -102705 -4159 -63946 -8287 -357225 79177 -333755 61579 284029 102725 61706
19243 61706 -213174 316458 128708 -127662 163381 58474 68356 105625 341251 55421 -54668
19231 -18070 -173127 -23764 51142 -227666 131378 -369608 251837 -50743 76302 -27271 -2537
19219 -197872 -256588 13980 -127230 65555 -50284 -158329 256771 -283890 -344073 -243134
19209 -243134 170330 -13977 -28424 -144617 8876 -306574 -339693 27281 -92824 217935 -210782
19197 -17425 29177 -24518 -158011 73906 -211873 -152745 -70501 -2244 219768 -31761 55037
19185 48182 -332419 -115707 -63208 -115943 -58906 -290316 187111 36648 54 36466 26818 61465
19173F1465J198a52672C972h1692j26470A3223a0366A76147a91857M8248j46935
19162b90544a5145H7708i7025b0775j89362B295b17812j56350f895j14056k14838
19151c35789f480H5448b38104b9442j10516f3585k03535J29812m5110l5604e997
19139a99277j69082H0320J53839a86999g7872j79351B01155a09380A5029P8466
19129I3495m320a16132L5464B2485b0315l4886A24220f3213G8564K30449c66954
19117B31166J84803I9700d0563m8526j68813J7617i5329j21677C7330O5793a08953
19105B88345e3538k62009D7376Q305a60620a093H3943k0236L04137a87245Q114
19094a79131H9123f7036j35506C07906G7342b18592d5027k4735k4084G2336J41396
$$ plain form
19173 61465 62663 -152672 3972 -81692 -208162 13223 -10366 176147 -191857 -143609 -290544
19162 -290544 -15145 87708 -97025 -20775 -210137 2295 -217812 -374162 -6895 -120951 -335789
19151 -335789 -6480 85448 -238104 -29442 -139958 -63585 -267120 -137308 -182418 -218022 -5997
19139 -199277 -368359 80320 234159 -186999 -77872 -257223 201155 -109380 15029 93495
19129 93495 89175 -116132 -80668 22485 -20315 -55201 124220 -63213 78564 309013 -366954
19117 231166 415969 99700 -40563 -89089 -257902 -240285 -95329 -217006 37330 103123 -108953
19105 288345 -53538 -315547 47376 55681 -160620 -1093 83943 63707 367844 -187245 -179131
19094 -179131 89123 -67036 -202542 307906 77342 -218592 -45027 -69762 -93846 72336 213732
19083B13732I0520c40811a20784A83404O3311d0886r9156B32851a26383k96972
19073d23355a16460l42485d8864o6472j6937b3003j90813A16077C9251a55203
19062i9535a5667B58690I5184l3021b1501j76960B1553J90262a98653k6584j65717
19051c90954A61999F0579N4677K74071A61040n4382b73819a25016B16679a95040
19040d9059A35673e104k36017i0825M2804C30540b62j31443B95707b300C04810
19028H5060c0588D58706B05650M7259g7846C12668A8769O9440N857b48374a13605
19016f3997A74093c8245C5875a33625c9935H3461b05118o5527L4036j17807B60053
19004a06099m21126J94260f338k15451c3262j17317F5116b42911f9948P451A00637
$$ plain form
19083 213732 90520 -340811 -120784 183404 246715 -40886 -140042 232851 -126383 -423355
19073 -423355 -116460 -458945 -48864 -115336 -132273 -23003 -213816 116077 39251 -155203
19062 -99535 -15667 258690 95184 62163 -21501 -198461 21553 211815 -198653 -225237 -390954
19051 -390954 161999 60579 115256 389327 161040 106658 -273819 -125016 216679 -195040
19040 -49059 135673 -5104 -241121 -90825 -48021 330540 -262 -131705 295707 -2300 304810
19028 85060 -30588 458706 205650 252909 -77846 312668 18769 88209 94066 -248374 -113605
19016 -63997 174093 -38245 35875 -133625 -39935 83461 -205118 -270645 -236609 -354416 260053
19004 -106099 -527225 -332965 -6338 -221789 -33262 -150579 65116 -242911 -69948 -62497 100637
18992a0008B32174I536M2758a99269l15712H033a48677k6280I4813a83929g6343
18980b6406F6963h3933j37617B7750b19194f1029J0500l12436a0279n2917j86253
18969b49449A42013a10028A45577E5454a90480A04855J72016E8180g3431k65667
18959c39098A80776G4343f0175B12042b85386a40604O601C58257A26308d41186
18948b52043d9854O5r2368c2524I2343A3548b89058C9738l65b91886a17658N5353
18936f2305j56701B24671J51085I2453Q1461b6813B0250L84999I7495a86851N056
18925a81795A9527g4129b3172j77715M9346I1916c3940B86899j19054l2666i3541
18913c71327F265b0318C8578J8117j7872a30113c1480m4052n134E8204a60432
$$ plain form
18992 -10008 232174 9536 52294 -199269 -514981 8033 -148677 -174957 94813 -183929 -76343
18980 -26406 66963 -83933 -221550 27750 -219194 -61029 -50529 -362965 -10279 -63196 -249449
18969 -249449 142013 -110028 145577 55454 -190480 104855 276871 58180 -73431 -339098
18959 -339098 180776 74343 -60175 212042 -285386 -140604 -134003 358257 126308 -441186
18948 -252043 -49854 -49789 -142157 -32524 92343 13548 -289058 39738 39373 -291886 -117658 -62305
18936 -62305 -219006 224671 375756 92453 173914 -26813 20250 405249 97495 -186851 -181795
18925 -181795 19527 -74129 -23172 -200887 -151541 91916 -33940 286899 167845 135179 -93541
18913 -371327 6265 -20318 38578 56695 38823 -130113 -31480 -75532 -80666 58204 -160432
18901E9809b6998j41991c7023A88373a81496D6592b94773A98501M7969A5785b2066
18889B5678K05415P9726b3806F2710O9981e6428l06986F9048A907R2308c55405
18877A0824d0726A27604b32991A47216c60408d062k29798A42612j6290g2128j87793
18866b59921E5557a48544B06715d5145F6139k7310R3819c56639A04522d94050
18855A85001q4783a32564j77428G4509a6272H8746B3611M3932N99757A1388R1503
18844A02891k1158C9861b68018A03977L281b4292A04066d6331n2570l4557A25801
18832b21794R876R9074d3046j83347a840E1607c4836j64352d9074j76297a0162
18820d481C54115q8626e5963B57933O9392b10608i0924A0173L2391Q2941J54833
$$ plain form
18901 59809 -26998 -168989 -37023 188373 -181496 46592 -294773 198501 246470 15785 -22066
18889 25678 231093 310819 -23806 62710 132691 -56428 -363414 69048 1907 94215 -355405
18877 10824 -40726 127604 -232991 147216 -360408 -4062 -233860 142612 126322 -72128 -259921
18866 -259921 55557 -148544 206715 -45145 66139 38829 132648 -356639 104522 -494050
18855 185001 100218 -132564 -309992 74509 -16272 88746 23611 67543 667300 11388 102891
18844 102891 81733 39861 -268018 103977 107258 -24292 104066 -46331 -98901 -133458 125801
18832 -221794 -211918 -112844 -43046 -226393 -1840 51607 -34836 -199188 -49074 -225371 -10162
18820 -4481 354115 265489 -55963 257933 327325 -210608 -90924 10173 42564 125505 280338
18809B80338M1716o6259m0137I0390b26987g4289j71735A68644f2502l37084A38046
18797e3673k26055C3648b0735m4760B86661A09099d19640A82447b8092A46162
18786B8393J87087b75436a4888l27304G374J76728a12898l2537K9592L2542H8325
18774A71518d0437n2371M32b4184G5961E160g0035G1952b25699A46511B5999J50375
18762A76374h6832B95964j43883C462a46556A02791c02628G1035O4835A9958b12384
18750A37476d61434K11032C7312P6440N5440K13260j63686b65188A77555b26230
18739b87520g1928J0779k10060P5807c8180j17687C6471K1929c046l12159C6399
18727b9867A66773a3212o9698k1455b1833C2807a78783j44283F36a11576j833
$$ plain form
18809 280338 322054 255795 215658 90390 -226987 -74289 -246024 168644 -62502 -399586 138046
18797 -53673 -279728 33648 -20735 -65495 286661 109099 -419640 182447 -28092 146162
18786 28393 215480 -275436 -14888 -342192 7374 184102 -112898 -145435 -115843 -83301 88325
18774 171518 -40437 -92808 -92376 -24184 75961 5160 -70035 71952 -225699 146511 25999 176374
18762 176374 -86832 295964 152081 3462 -146556 102791 -302628 71035 135870 19958 -212384
18750 137476 -461434 -250402 37312 113752 169192 382452 218766 -265188 177555 -226230
18739 -287520 -71928 -61149 -271209 -195402 -38180 -155867 36471 58400 -3046 -315205 36399
18727 -29867 166773 -13212 -82910 -104365 -21833 32807 -178783 -323066 636 -111576 -113409
18716a13409k13671G1277B8000f5762H9N5699L04913a41117D4928i7971j79061
18705b77032A65155b0730l12581a58554O6075q3558O7886j05964A50265e8839
18694b21924j87507J91030a6081C8050M5157d51988b10302D53760A21059N0591
18684A71650a37667C4073L6933Q8885M2657c53271B60241d83762H4526e9409j81520
18673b40929j03226N9390J0407a28783j37288p163n0839A70209f5451b2057j19298
18662a41355d1681j21829k3257A08691a15799r7172i7505J9298p9359G2620J54528
18651B27148e2875B2787B272R9796a94858d272B60657I0847F44K3768b00009a7647
18638B88397D429a50694A18488g7098D9481K03171j25112N6000a74094C12380
$$ plain form
18716 -113409 -327080 71277 28000 -65762 89 55788 360701 -141117 44928 -97971 -277032
18705 -277032 165155 -20730 -333311 -158554 -92479 -176037 -108151 -214115 150265 -58839
18694 -221924 -409431 -218401 -16081 38050 83207 -451988 -210302 453760 121059 171650
18684 171650 -137667 34073 71006 159891 202548 -353271 260241 -483762 84526 -59409 -240929
18673 -240929 -344155 -284765 -274358 -128783 -266071 -273234 -324073 170209 -65451 -22057 -141355
18662 -141355 -41681 -163510 -186767 108691 -115799 -212971 -97505 -78207 -157566 72620 227148
18651 227148 -52875 22787 2272 102068 -194858 -4272 260657 90847 644 24412 -200009 -17647
18638 288397 4429 -150694 118488 -77098 49481 252652 127540 183540 -174094 312380
18627A42343a22301r6886p004B26297b0442k17283i306A9757d343o2468A43945
18615C9232g4238r5251C03324a65722E6227J16626J94896E2483K12603i2942k17735
18604c10677D5492K01124a6138j35943B31873B1711c18969C32009c61016Q7629
18594b73387b49A00543a17526B03859e2984j24654A12698c08057J23691Q5771
18584i8595k37163A4749c23714A06268a4821G6648i3045q9177L2941A55381j7393
18573A37988A6951a65886j28754J35309f5139A9997b93786j41708a52294c8298
18562a97386C5695g9716M243j58219j50440C13067E2601i6506a6595j57130F7162
18550g7446H0600b283p9727j52342G2605d4675E3790e2375k65158J52311A28873
$$ plain form
18627 142343 -122301 -219187 -226191 226297 -20442 -237725 -9306 19757 -4343 -66811 143945
18615 39232 -74238 -169489 303324 -165722 56227 172853 367749 52483 265086 -92942 -310677
18604 -310677 45492 246616 -16138 -152081 231873 21711 -318969 332009 -361016 -273387
18594 -273387 -249 100543 -117526 203859 -52984 -177638 112698 -308057 -184366 -98595
18584 -98595 -335758 14749 -323714 106268 -14821 76648 -93045 -182222 -149281 155381 137988
18573 137988 16951 -165886 -294640 -159331 -65139 19997 -293786 -435494 -152294 -38298
18562 -197386 35695 -79716 -75473 -233692 -384132 313067 52601 -96506 -16595 -173725 67162
18550 -77446 80600 -2283 -82010 -234352 72605 -44675 53790 -52375 -317533 -165222 128873
18538g2840k82063K7929J39548H7842f5893p693A47556J3555a10074j55857A52713
18526a90695Q3044e598r8428d1044k41055I7221N8081K36330m3989c36060G7721
18514a7454J585C4656b64127J00297M4879o6955A0581c5401j16971J8342E1892
18502A44013Q3381b6540k85782b4247r1849A75148i0996o7782m085I9730j1976
18491H7754B8932c41047J30762L6510k44066G9472J03671k3472l6405A4066K51637
18480B65703D9001a64938B65215o5685b4715j0096j041q5025j20767j4204F1510
18468D4940b9775l51675a16498E0118b73015B13737q9919a47937f4074L153A31531
18456b8338q5169a1982m060j26689O870I2023b08569k8685E1959J3375g6632G2011
$$ plain form
18538 -72840 -354903 -326974 -187426 87842 -65893 -73586 147556 161111 -110074 -265931 152713
18526 -190695 -107651 -5598 -104026 -41044 -282099 97221 155302 391632 347643 -336060 77721
18514 -17454 -15869 34656 -264127 -163830 -118951 -185906 10581 -35401 -152372 -134030 51892
18502 144013 227394 -26540 -312322 -24247 -116096 175148 -90996 -158778 -162863 99730 87754
18491 87754 28932 -341047 -210285 -173775 -417841 79472 183143 159671 123266 14066 265703
18480 265703 49001 -164938 265215 199530 -24715 -34811 -35852 -120877 -241644 -255848 61510
18468 44940 -29775 -381450 -116498 50118 -273015 213737 123818 -147937 -64074 -60921 131531
18456 -28338 -113507 -11982 -16042 -142731 -135861 92023 -208569 -237254 51959 65334 -76632 72011
18443b73354A1245a07066j55797b2532B43727E2465L2237B9470h5231b61C27652
18431e1319a1437j33952c4731j11420k84759c459H3481J43552i2923F3880c10919
18419a03319C38792j42041G7140b32394A63263a26510k91585A79644l9053N7049
18409A97640b08976D7867D99b52950q0920A96148K23331h1518m0B23457b21956
18397A46904a72099P1119k6583A26301b84648I4856a37920A8740K44101f7724
18386f590A33362a30677q1539H3352b88692G374a82738B21021f4002r0326M8173
18375a06155d8886A97201l8791C3292J77933a74888E2820K557N1374b38619h6357
18363B07301o6849J06798J5019K50918A5407Q131h3380m3278A24457H202N3459
$$ plain form
18443 -273354 11245 -107066 -262863 -22532 243727 52465 84702 29470 -85231 -261 327652
18431 -51319 -11437 -145389 -34731 -146151 -430910 -3459 83481 227033 -92923 63880 -310919
18419 -103319 338792 196751 77140 -232394 163263 -126510 -418095 179644 140591 197640
18409 197640 -208976 47867 499 -252950 -333870 196148 419479 -81518 -81558 223457 -221956
18397 146904 -172099 -100980 -127563 126301 -284648 94856 -137920 18740 262841 -67724
18386 -6590 133362 -130677 -212216 83352 -288692 7374 -182738 221021 -64002 -154328 -106155
18375 -106155 -48886 197201 158410 33292 211225 -174888 52820 55377 106751 -238619 -86357
18363 207301 140452 247250 262269 513187 15407 23538 -83380 -126658 124457 8202 61661
18352F1661e12A41217b78233i1945Q398j38964A81719H166b92712J01162e2259
18340a89086J9930P7361C6539P6887k5090j9131b28907N7942R7C9088a00704a3
18327a18472B94824b22848B56621a13247B24438a50865j83849D756b6861k45257
18317b72118E3075c97920h4446Q964j95520b6825L851k02360C780c32839d8619
18305d58308a77287Q1518q3719A06743f1455k38251g8660C9549b31722i129j69208
18294a78337A7623g557j03943B8392K61757o058a95603Q1908M8364a5655C9683
18282a18055q8827J9771P6123G2372c4188k49721J38810A49736E8931d7507q1587
18271a29094a4286E1073O6403J89463c9946J4981C76519e7102k12608M0233A05167
$$ plain form
18352 61661 -512 141217 -278233 -91945 -83547 -222511 181719 8166 -292712 -191550 -52259
18340 -189086 -169156 -91795 36539 113426 88336 69205 -228907 -170965 -170868 39088 -100704 -13
18327 -118472 294824 -222848 256621 -113247 224438 -150865 -334714 4756 -26861 -272118
18317 -272118 53075 -397920 -84446 -75482 -271002 -26825 -22974 -225334 3780 -332839 -48619
18305 -458308 -177287 -95769 -179488 106743 -61455 -299706 -78660 39549 -231722 -9129 -178337
18294 -178337 17623 -7557 -111500 28392 290149 284091 -195603 -113695 -65331 -15655 39683
18282 -118055 -206882 -187111 -110988 72372 -34188 -283909 -145099 149736 58931 -47507 -129094
18271 -129094 -14286 51073 117476 306939 -39946 -24965 376519 -57102 -269710 -229477 105167
18259D4006a51732A40089h9723A29423f4695j23797H3613R8936j7966M5215a21747
18247a83845D18401E8975b37033A41674c4999j80827B17159c3128o8006m6916
18237a48050A00334M2221a6743B7767O7553a47943D2704d52068e5767a8165E5177
18225h5437q0949H1727a30728j7942M7175k88226a08381D8586c4526n1911C12625
18213f5289K7721B26777J76523d62992A41088k3164c49535B1171J01248j3677
18203A08742D8186B0519J18793F6416j0456J53684p9661A7411c87744G9850a01678
18191F3134f9501J5793b0417B77081g0054k02154D8789a78742Q2830j5322I4692
18179A52778m3948g4316r345r9249j96271A43870K78818i4581D4971a31662j89100
$$ plain form
18259 44006 -151732 140089 -89723 129423 -64695 -188492 83613 182549 164583 209798 -121747
18247 -183845 418401 58975 -237033 141674 -34999 -215826 217159 -33128 -101134 -148050
18237 -148050 100334 142555 -16743 27767 95320 -147943 42704 -452068 -55767 -18165 55177
18225 -85437 -166386 81727 -130728 -148670 -101495 -389721 -108381 48586 -34526 -86437 312625
18213 -65289 -37568 226777 403300 -462992 141088 117924 -349535 21171 122419 108742
18203 108742 48186 20519 139312 66416 55960 209644 129983 17411 -387744 79850 -101678
18191 63134 -69501 -53708 -20417 277081 -70054 -272208 48789 -178742 -95912 -111234 94692
18179 152778 108830 -74316 -83661 -182910 -379181 143870 422688 -94581 44971 -131662 -320762
18168c20762a57540p8098c3756B0042d25663J44837C276e39865F2323a77865L5299
18157a42566n5263B37742j09028b95823A53487a79315A64237A3264O9126b04424
18146i2031b4483G7249a96916Q9752j79549i0860n6432e8624O613j52334A56805
18134b50499A27637c4195A7981J13803b9780B20724d9749j9493j73437B8942L05400
18123C34342b56124H5316k6373N4865h6820j5131G8904h7279d2711A24470c8155
18111b02388l938o6512b264D6451J39690a32431k4792B31842a3929l8683I8287
18099b29949B69423H0134J31551c6769j50055A47098J013f1802k0650E6021a87466
18087a04541J4884k22764A30774b53879A95021d9317a9319A03724J91898I9621
$$ plain form
18168 -320762 -157540 -235638 -33756 20042 -425663 -280826 3276 -539865 62323 -177865 -142566
18157 -142566 -197829 237742 128714 -295823 153487 -179315 164237 13264 82390 -204424
18146 -92031 -24483 77249 -196916 -107164 -286713 -90860 -147292 -58624 -52011 -204345 156805
18134 -250499 127637 -34195 17981 131784 -29780 220724 -49749 -69242 -242679 28942 334342
18123 334342 -256124 85316 58943 113808 -86820 -101951 78904 -87279 -42711 124470 -38155
18111 -202388 -206326 -272838 -2264 46451 186141 -132431 -157223 231842 -13929 -52612 98287
18099 -229949 269423 80134 211685 -36769 -186824 147098 148111 -61802 -82452 56021 -187466
18087 -104541 -89657 -312421 130774 -253879 195021 -49317 -19319 103724 295622 99621
18076B61732a00228k35867A58141a50254K2094j39019A52874i4150E4383K68207
18066C22590H116b29150K9201a3073C0774a75012P171a129A17568e5073j70847
18055b25920B12375H4427a60308C33001b3610B55351a53106B47834a70176k46053
18045d16229a17482j8462D736e21087a76397g0821q557B88259A05211h8938B35604
18033b15640B74870G9084O6731P7565G9694e8128p1720A63651K3981f6494D66978
18021B69051e2071k31916B49715b58508B78574F5999J04717l6904a64313l6320
18011b00633j45865h523I1682R4177I0790a07713A33830a56647g7964F551i788
17999B71104h3860A70680e0788k78086A07794f2200j58206A7a345l01303l494
$$ plain form
18076 261732 -100228 -336095 158141 -150254 -128160 -267179 152874 -94150 54383 322590
18066 322590 8116 -229150 -199949 -13073 30774 -175012 -167841 -1129 117568 -55073 -225920
18055 -225920 212375 84427 -160308 333001 -23610 255351 -153106 247834 -170176 -416229
18045 -416229 -117482 -135944 4736 -521087 -176397 -70821 -79378 288259 105211 -88938 235604
18033 -215640 274870 79084 145815 223380 79694 -58128 -129848 163651 187632 -66494 466978
18021 269051 -52071 -283987 249715 -258508 278574 65999 170716 133812 -164313 -200633
18011 -200633 -346498 -8523 91682 185859 90790 -107713 133830 -156647 -77964 6551 -9788
17999 271104 -83860 170680 -50788 -328874 107794 -62200 -220406 17 -1345 -302648 -306142
17988c06142o2522A29739D2794c0269I3361m1566A6049a92748B76049a17094j6667
17977a33761F410c07663a19011C25586H1727d6952B81975a35707e5819E616a00441
17965b17424I4267a21005I9643g6543A18186l9447i1153p8861L8351A044a51101
17953a73706k74118b06452o1783A39942j7183a83065c0202B10590i969j72289
17943a82258E46370b13003O1430j6104B82152l2642a03112H4130P1833a32734
17932A72268b75461b6158Q240I2007c4311B61384E7564a97902C4483b35230L4480
17921b00750R0519I3355J37355I8908k2867A5534f7664n5795A99678i873k96609
17910c06482c3628r1805H2907b32244a07266A93013m2835a3474B471J1465a64510
$$ plain form
17988 -306142 -368664 129739 42794 -30269 93361 51795 16049 -192748 276049 -117094 -133761
17977 -133761 6410 -307663 -119011 325586 81727 -46952 281975 -135707 -55819 5616 -100441
17965 -217424 94267 -121005 99643 -76543 118186 78739 -91153 -170014 -131663 1044 -151101
17953 -173706 -447824 -206452 -268235 139942 122759 -183065 -30202 210590 -9969 -182258
17943 -182258 546370 -213003 -151573 -167677 282152 249510 -103112 84130 155963 -132734
17932 172268 -275461 -26158 -17918 92007 -34311 261384 57564 -197902 34483 -235230 -200750
17921 -200750 -110231 93355 230710 98908 76041 15534 -67664 -123459 199678 -9873 -306482
17910 -306482 -33628 -125433 82907 -232244 -107266 193013 150178 -13474 2471 13936 -164510
17898a10926a919A87641G655b27418c1449l2193O923a6156A08186a67210L6893
17887a30317O1452j92383b5159C4308E633J28706c11267a3213k93070h4456b5277
17875A00055O0590F9345H205d1059d628B3735L9182K9834B8459I806M77827a31340
17862B48151g8476C0570M72731g6705l8357H1169k3320M7404b38031p3644D47877
17850H26L908c0231B63277j1457o8430P563A8285a46429c0824q6A18076a49499
17837h4807A10693a80437A24442N1272a3887I1960e4950m8881k66600b2322C02520
17825A65439D1565J23440a09184K635d7741A50524a23625L4257B82249f703l40688
17814c47391A368a9976B04546L2976p7801b6951A6041a87857c8377P14C77407
$$ plain form
17898 -110926 -1919 187641 7655 -227418 -31449 -63642 -56719 -16156 108186 -167210 -130317
17887 -130317 -68865 -261248 -25159 34308 5633 134339 -311267 -13213 -306283 -84456 -25277
17875 100055 160645 69345 8205 -41059 -4628 23735 62917 92751 28459 9806 487633 -131340
17862 248151 -78476 30570 503301 -76705 -115062 81169 57849 105253 -238031 -311675 447877
17850 826 4734 -30231 263277 251820 183390 190953 18285 -146429 -30824 -30910 118076 -149499
17837 -84807 110693 -180437 124442 175714 -13887 91960 -54950 -103831 -370431 -22322 302520
17825 165439 41565 165005 -109184 -106549 -47741 150524 -123625 -89368 282249 -6703 -347391
17814 -347391 1368 -19976 204546 237522 159721 -26951 16041 -187857 -38377 -37663 377407
17802b61497R2630A35945c20139a2731E6444b32252A30088b09564B81381a17079
17791B6103a30253F6882O0272c1274q152c826G0954d2312j45126A65637J37443
17780C03080C6134J11805b05351C1265N2065i2518j23297A95255A6471a33780
17769h5480n2826H6146g7774L0777A57664a26341m6210F4393a99916B82385A27406
17757a14510j9745C17973m6955b45197g4869b3352B3602c97369A22979J80411
17747C03390h7657B46982b35776H679J92629A0973P9220C30L29368O2460A76032
17735C25733B6982a71257A75074n333o0161b66356a16110F3539b01885D33462
17724A26263j0719M8003h5602a1251A63201O8816b08285c8518B17191a26546j29227
$$ plain form
17802 -261497 -168867 135945 -320139 -12731 56444 -232252 130088 -209564 281381 -117079
17791 26103 -130253 66882 127154 -31274 -39426 -3826 70954 -42312 -187438 165637 303080
17780 303080 36134 147939 -205351 31265 83330 -92518 -215815 195255 16471 -133780
17769 -85480 -138306 86146 -77774 -46997 157664 -126341 -172551 64393 -199916 282385 127406
17757 -114510 -134255 317973 271018 -245197 -74869 -23352 23602 -397369 122979 303390
17747 303390 -87657 246982 -235776 8679 201308 10973 90193 330 329698 392158 176032
17735 325733 26982 -171257 175074 169741 109580 -266356 -116110 63539 -201885 433462
17724 126263 115544 163547 -85602 -11251 163201 232017 -208285 -38518 217191 -126546 -255773
17713b55773L8509M0732f8396B20691A4792a31208A44184H06M001d074j6148A73108
17700A74213o9053J45052F3671R4473k7769M8765g317A45746K19136B0590R9365
17689A19955c95852A79359c97969C70789A42654C4406f0381A01372a04715q5246
17679a89961E8356J15997f3615N011I7043a07818J5780j4495f931j28935B40898
17667E2813K66725G3782d2601A04915J4420G692M08602C7429J7140P4109J23525
17656B52203b3011A05450J91329a81636Q4968C65485A00000D3081Q1619A6057
17645H3610C880J14190g2046A05103j0173A1148a4556C4364R1885K5925m4238
17634A07936M4606k1018a02377A41610b65090Q8210j74153A88968A0116J72427
$$ plain form
17713 -255773 -217264 -176532 -68396 220691 14792 -131208 144184 806 4807 -4074 -20222 173108
17700 174213 105160 250212 63671 158144 130375 179140 -7317 145746 364882 20590 119955
17689 119955 -395852 179359 -397969 370789 142654 34406 -60381 101372 -104715 -189961
17679 -189961 58356 174353 -63615 -58604 97043 -107818 -92038 -106533 -6931 -135866 240898
17667 52813 319538 73782 -42601 104915 119335 7692 416294 37429 54569 128678 252203
17656 252203 -23011 105450 296779 -181636 -96668 365485 100000 43081 124700 16057
17645 83610 3880 118070 -72046 105103 94930 11148 -14556 34364 126249 152174 107936
17634 107936 152542 131524 -102377 141610 -265090 -176880 -351033 188968 10116 182543
17624A82543A4837J07J11719b2887G2948R550M3728m0109K09542j1858E773a68339
17611C3793e7180A18496a79873c650A71843a03157A07348J30784K86660a75122
17600i64B42844B1504e3417A36615J08671n8870c7231B18485p8506B5047L9876
17589F4923K5241C2867M7470a968L70j06970m2514j5379F260K3336f5052I7224
17576B07485q2428E8570N8521j8333f491A42584A0650L28003r8204A5660J60491
17565A76151K18824j91396B0626L38089A35318K24443b86308L4196B93179a5074
17554C08370a5098k97891k2860A06951i4127D1297K67410J08928E2787J54041
17544B06828O8969C5141g9404k41564B28885A13830K320N0695D8431a22938M9007
$$ plain form
17624 182543 14837 14944 126663 -22887 72948 82498 126226 86117 295659 283801 5773 -168339
17611 33793 -57180 118496 -179873 -3650 171843 -103157 107348 238132 524792 -175122
17600 -964 242844 21504 -53417 136615 245286 186416 -37231 218485 139979 25047 64923
17589 64923 90164 32867 80337 -1968 -1598 -108568 -151082 -166461 6260 29596 -65052 97224
17576 207485 125057 58570 117091 98758 -6491 142584 10650 338653 240449 15660 176151
17565 176151 394975 203579 20626 358715 135318 359761 -286308 -252112 293179 -15074
17554 308370 -15098 -312989 -335849 106951 -94127 41297 308707 417635 52787 206828
17544 206828 275797 35141 -79404 -320968 228885 113830 116150 166845 48431 -122938 -73931
17533g3931o0715H6468g1799D113b94500a29685f757F4888K24676A37604E9302
17521B0424b04539C14523A15684b71921C29800e0218A11303a0723B2523J3913
17511C6436a54612B16456J21130A22421J82413a36569C24119a00224A61822E5000
17500b6614B98365B8296P6317P5474J9707P1091I6082L4103K26032A01940a13758
17488d96051A05931n0062k412J43186d8396A06542J06440o5088J08296P8453b4921
17476D21890j34742A28859O6657l2341j6150D6051N976a32724C33290P623e8274
17464A76966H5067i5546c4170A86828J64934D0064J48356i2340C72836d0002C01806
17452A7630P4958e7335G5687c5738A33367K59075j8111j31177G6844J40186G8667
$$ plain form
17533 -73931 -134646 86468 -71799 4113 -294500 -129685 -6757 64888 289564 137604 59302
17521 20424 -204539 314523 115684 -271921 329800 -50218 111303 -10723 22523 36436
17511 36436 -154612 216456 337586 122421 304834 -136569 324119 -100224 161822 55000
17500 -26614 298365 28296 104613 180087 199794 270885 96082 130185 356217 101940 -113758
17488 -496051 105931 55869 53457 196643 -48396 106542 212982 147894 256190 334643 -24921
17476 421890 287148 128859 195516 163175 147025 46051 52027 -132724 333290 340913 -58274
17464 176966 85067 -95546 -34170 186828 351762 40064 188420 -92340 372836 -40002 301806
17452 17630 92588 -57335 75687 -35738 133367 392442 374331 243154 76844 217030 78667
17440A74879M1849r6747K25186P5749k02077F1786K20872A22471L23022j63914
17430B81579J00366j23159J14966D5305K40040p2191R773O0196Q5823L62517j79807
17419E51656A96520O8138A11406M73848j05801A79301J58517K7701K0650h1656
17408D80782k22619A4656J99402L95993A81069Q7605A33424m5082g133C12689
17397B2012Q4016Q9654p5938J18398J11189j31430K22454k03460j0144G3560J10195
17386A83755Q7867j33419O4782p1397d800j10438B38397m0742e5032A60450R3381
17375B53831A26047Q8740L8210M1135A42347J54477F7998k4357L94110B17697
17364C19031G7212j0078a93265B30910J5567b3341C97696j6639A71940R5608a0033
$$ plain form
17440 174879 216728 119981 345167 420916 218839 61786 282658 122471 445493 281579
17430 281579 381945 258786 373752 45305 285345 213154 222927 283123 368946 731463 551656
17419 551656 196520 264658 111406 585254 479453 179301 337818 365519 386169 -81656
17408 480782 258163 14656 214058 610051 181069 268674 133424 88342 -7133 312689
17397 22012 106028 195682 119744 238142 349331 217901 440355 236895 226751 73560 183755
17386 183755 271622 138203 202985 131588 -4800 -115238 238397 197655 -55032 160450 253831
17375 253831 126047 214787 252997 294132 142347 296824 67998 43641 437751 217697
17364 319031 77212 67134 -193265 230910 246477 -23341 397696 381057 171940 267548 -10033
17352A92180d1893A82678b9104A19137a61675I6341d2884C05682A18828J03445
17342B22273R657h8097A8471J74349j1810L7105G2362N17718A55890b1214A75545
17330b08501C37269E3361L83422a30970A65560j6577K13184a5087B79658d7860
17319E96127i21B33373A03932J00688K65821n0356H5433P5205o9709K8206J09875
17308B29010r4617A9004M07901h3270j77533h9578G8316J29410F8892K41860J43621
17297D54373A34719M75418a90255C34023j470n1371k8208q3004C7723a9512C32449
17285I325K75293J1516m0116L57242G1485N42357A9883K44123j21201O6480L80480
17274E89765r1350A51085M0918a38434A64861J77706c26729B07948L62515A06521
$$ plain form
17352 192180 -41893 182678 -29104 119137 -161675 96341 -42884 305682 118828 222273
17342 222273 231930 -88097 18471 192820 181010 218115 72362 590080 155890 -21214 175545
17330 -208501 337269 53361 436783 -130970 165560 148983 362167 -15087 279658 -47860
17319 596127 -921 233373 103932 204620 470441 420085 85433 160638 90929 119135 229010
17308 229010 134393 19004 426905 -83270 -260803 -89578 78316 207726 68892 310752 454373
17297 454373 134719 610137 -190255 334023 332553 281182 252974 169970 37723 -19512 332449
17285 9325 284618 296134 256018 613260 71485 613842 19883 264006 142805 209285 589765
17274 589765 498415 151085 192003 -138434 164861 342567 -326729 207948 570463 106521
17263A67293Q2074K75189G9022M33312E2206K74698g2931C068J3751J34380o0935
17252I0264B5825l159Q2440K50995a6431D38558A56307Q8351P5987M00023B81316
17240C39764l7973Q9964j56758K30851j26101A03567f2873C24548j62125J31539
17230B93962H8899J54047n0288l3050F081K4363K23442A13773K93606A68292g2535
17218B07415J07482k2159j35720J12385P7222a5088A66423a06443D53724j57541
17208B96183p9689c2158D56171J9994k03624I468L55410A37961E04J46001K97905
17197D44410B18569K80008q7897q2774A46751J80062J11925p2400n2111J07565
17187D21792j35348j39096J6213K98098A83852J32730O7514N5098a0476C56191
$$ plain form
17263 167293 249367 524556 79022 512334 52206 326904 -72931 3068 16819 151199 90264
17252 90264 25825 22666 105106 356101 -16431 438558 156307 244658 320645 720668 281316
17240 339764 301791 391755 234997 465848 339747 103567 -62873 324548 162423 293962
17230 293962 88899 242946 192658 159608 6081 30444 253886 113773 407379 168292 -72535
17218 207415 314897 292738 157018 269403 346625 -15088 166423 -106443 453724 296183
17208 296183 216494 -32158 456171 476165 272541 9468 364878 137961 504 146505 444410
17197 444410 218569 498577 410680 327906 146751 326813 438738 366338 314227 421792
17187 421792 286444 147348 163561 461659 183852 316582 384096 439194 -10476 356191
17176A98267K4225O3479j24113n6155K14762L80551q0850A97611C1067L27127
17166C58194j25659J33266P329H2896L48925G3580N09955B42413K52659F5079
17155B36094J27280r1683A21809L87167k47938K86413A60427J92971j52060N73630
17145G74968l13273B6806M26525j05792A46027m597J81886L04607c28240E05225
17134B62911j24305L77183j4641A34781J19012K27932k08767K01427l1326K10285
17124F53344k14919j14973J43981B13121L44416B64862K24495G4133P348L88412
17114D69893A81284J25832L52159l01201j902j45538p7559B648K72157K56050
17104E30855j76611D7091N31428J42059A84435L13706n7625r2573K7553O0055
$$ plain form
17176 198267 222492 285971 161858 105703 320465 701016 620166 197611 31067 358194
17166 358194 232535 365801 373130 82896 431821 73580 583535 242413 495072 65079
17155 236094 363374 271691 121809 508976 261038 547451 160427 353398 201338 774968
17145 774968 461695 26806 453331 347539 146027 141430 323316 627923 -328240 505225
17134 262911 138606 515789 501148 134781 253793 481725 272958 474385 443059 653344
17124 653344 438425 323452 467433 213121 557537 264862 489357 74133 81481 469893
17114 469893 181284 307116 659275 358074 356172 210634 133075 2648 274805 530855
17104 530855 354244 47091 578519 720578 184435 498141 440516 347943 375496 435551
17094D35551J02726m7757P7129B35504J01796k0389K26003J29271l948k0728B06986
17082B79904J52644K5093J28149j7385K91867l88803A95441M37269c1018H58828
17071G83014l48538A41029J10025O4498K18977o8063J05756j69641O4630j67886
17061B99325K75257k65053M32018R6448j98830n6918l9675k14637J89215J01939
17051F19089J40023j9915m3920j27437q6873K4257L17403k47496L60877l74892
17041E61116n4170q7030Q4737J50797j1666j41342R5988J6833O0789k6491k2583
17030F26978Q6207l32908N07972l70114M96M13265k83505k84187N04465j73903
17020F94766j67084J12666j96389K99026K11045k30213J99377j70265J90534l97197
$$ plain form
17094 435551 538277 490520 567649 235504 337300 316911 542914 672185 668237 647509 206986
17082 279904 432548 457641 585790 568405 860272 471469 195441 632710 -31018 858828
17071 783014 434476 141029 251054 315552 534529 466466 572222 402581 467211 299325
17061 299325 574582 309529 741547 837995 639165 582247 542572 327935 517150 619089
17051 619089 759112 739197 695277 567840 480967 505224 822627 575131 936008 561116
17041 561116 506946 419916 504653 655450 643784 502442 598430 615263 676052 649561 626978
17030 626978 713185 380277 888249 518135 518631 931896 648391 364204 868669 694766
17020 694766 527682 640348 443959 742985 954030 723817 923194 752929 943463 546266
17010E46266K79218k21156L8184L35060k48891K0189j58361j02884L58444L21602
17000A167671k88441J82463m40370J42327L9748J87289J65066j83342j37063J87854
16990A023202l2056l74536L24063L0227J7111r5496k09900K80904m02419L29835
16980H90935k38958M79772j49948J3505J29608k92234J81783j02756p9884J48998
16970I80821M6244o9083K3739O8720o4545j85885K04659O2410q6261J20837k4765
16959A076891j47274J27420j97485K22253N4530O3192k41916M1513L68609m17762
16949I49971J7641J56245L76085l99579K88169J09101l72781K15678k04039K5152
16939A161643j11062M51759l65984k24660L91332L55251m36805J48209L58157
$$ plain form
17010 546266 825484 604328 642512 977572 728681 748870 590509 487625 846069 1167671
17000 1167671 879230 1061693 621323 763650 803398 990687 1155753 972411 835348 1023202
16990 1023202 991146 616610 940673 970900 988011 892515 682615 963519 561100 890935
16980 890935 651977 1131749 981801 995306 1124914 832680 1014463 911707 831823 980821
16970 980821 1027065 957982 981721 1050441 985896 800011 1004670 1067080 980819 1101656 1076891
16959 1076891 929617 1057037 859552 1081805 1136335 1199527 957611 999124 1367733 949971
16949 949971 967612 1123857 1499942 1100363 1388532 1497633 1124852 1340530 1136491 1161643
16939 1161643 1050581 1502340 1136356 911696 1303028 1658279 1221474 1369683 1727840
16930A727840k11366j78527n6303R6421P3853J26647p2316M478k25201J81708
16920A467234j54235J13596J8345O2254q4044M82023l56868K98622l43876J45878
16910A648929k28997J1992r337K89628k2820j51758J88930k91532K75441r9536
16900A610940J62019M0157M04490m64588L26407l55319r279L26671K00370l6189
16890B205679j96752M9817j3985K23580j45897L26314l7141m74438N37654j93985
16880B280846K53294m46091M81460j91165L44753n10259L10132j15096j52747
16871B255127K90426R1386k13175J82028L1127J48916k40309K36295j9916L1160
16861B793065K45767M9907k54309M64322n41835M12259o100M87572o77057M93939
$$ plain form
16930 1727840 1516474 1337947 1281644 1378065 1451918 1578565 1506249 1510727 1285526 1467234
16920 1467234 1312999 1426595 1444940 1507194 1423150 1905173 1548305 1846927 1503051 1648929
16910 1648929 1419932 1431924 1422587 1712215 1689395 1537637 1726567 1435035 1710476 1610940
16900 1610940 1772959 1813116 2217606 1753018 2079425 1724106 1714827 2041498 2241868 2205679
16890 2205679 2008927 2058744 2044759 2268339 2122442 2448756 2411615 1937177 2474831 2280846
16880 2280846 2534140 2088049 2569509 2378344 2723097 2212838 2522970 2407874 2255127
16871 2255127 2545553 2636939 2423764 2605792 2636919 2785835 2545526 2781821 2761905 2793065
16861 2793065 3038832 3088739 2834430 3298752 2756917 3169176 3163076 3650648 2973591 3467530
16851C467530j26004M9991j77275K32950K94233k65950J01373L01397M3433j66482
16841C755196p4572L92183j10075M53782m4975l38065L38767j60094L80934L07938
16831D901019m53653N15402j47797K4645K66752m1298k42420K98531J41697l30982
16821D931896P54457O5932k73635K06492J58461J85526K94340K33185l0179j84716
16811F341759L33162K5344K15389J17581Q0691Q3303K51648L71164j6318M39054
16801H242777k68113P46105j0422L32890p0393K7025N24409Q8093m3299L55244
16791I924316K93496M96310J50527J77188N10303M45024M8754L37136L12775O35844
16781A3331673J52355N63255M16200K00920O57673M42816N17483J55331P09922
$$ plain form
16851 3467530 3341526 3391517 3214242 3447192 3741425 3475475 3576848 3878245 3921678 3755196
16841 3755196 3680624 4072807 3962732 4416514 4371539 4033474 4372241 4212147 4593081 4901019
16831 4901019 4447366 4962768 4814971 4839616 5106368 5065070 4822650 5121181 5262878 4931896
16821 4931896 5686353 5752285 5478650 5685142 5843603 6029129 6323469 6556654 6526475 6341759
16811 6341759 6674921 6700265 6915654 7033235 7113926 7197229 7448877 7820041 7803723 8242777
16801 8242777 7974664 8720769 8710347 9043237 8972844 8999869 9524278 9612371 9569072 9924316
16791 9924316 10217812 10714122 10864649 11041837 11552140 11997164 12045918 12383054 12695829 13331673
16781 13331673 13484028 14047283 14463483 14664403 15322076 15764892 16282375 16437706 17147628
16772A7147628P91527L00892N12722O94653Q44289O14245J005816R76172L61070
16763B3249014R02279J061976R09586J409702J001234J081999J475055J358328
16755C2449173J556592R89492J934785J934411J516048K389271J812400K316723
16747D6898895K630562K374741K385722L152992L311091L055137L956730M196183
16739G1962053M127814M152430N168473N337412N252013O111381N851917O788579
16731A14752072O804343P132286P717663O925269P941959P503901P977757O763771
16723A73519021O866428N887589N195956L756204K660045K075188m7724j011587
16715A98901120k299758l621062m502984n893076o345934p019845p614870p990878
$$ plain form
16772 17147628 17939155 18240047 18752769 19447422 20291711 20905956 21911772 22887944 23249014
16763 23249014 24151293 25213269 26122855 27532557 28533791 29615790 31090845 32449173
16755 32449173 34005765 34995257 36930042 38864453 40380501 42769772 44582172 46898895
16747 46898895 49529457 51904198 54289920 57442912 60754003 63809140 67765870 71962053
16739 71962053 76089867 80242297 85410770 90748182 96000195 102111576 107963493 114752072
16731 114752072 121556415 128688701 136406364 143331633 151273592 158777493 166755250 173519021
16723 173519021 180385449 186273038 191468994 195225198 197885243 199960431 199912707 198901120
16715 198901120 196601362 192980300 188477316 182584240 176238306 169218461 161603591 153612713
16707A53612713p391051p748894q160848p379284o888168o911204o556114o185406
16699I6391744n686544n503840n040164m811960m136125l873917m219065l209700
16691E9910429l468266l059222k762451k598132k411500k313748k212203k306686
16683C8778221j808588j724790j553292j678901j558074j132521j399226j070933
16675B6851896j098819r94559o06622j471289j260453l84587r69249q95862j36766
16666A9033690q79450p23669o48558n80050p51267l63142m77250o06494l60654
16657A3643156j70790n13101o45075m48433m91204n0393l19994k92396m63356
16648A0248414K09840o01314m93040k60960l97177j1825j56354l83178L178k61330
$$ plain form
16707 153612713 146221662 138472768 130311920 122932636 116044468 109133264 102577150 96391744
16699 96391744 90705200 85201360 80161196 75349236 71213111 67339194 63120129 59910429
16691 59910429 56442163 53382941 50620490 48022358 45610858 43297110 41084907 38778221
16683 38778221 36969633 35244843 33691551 32012650 30454576 29322055 27922829 26851896
16675 26851896 25753077 24758518 24151896 22680607 21420154 21035567 20066318 19170456 19033690
16666 19033690 18154240 17430571 16782013 16201963 15450696 15087554 14610304 14003810 13643156
16657 13643156 13472366 12959265 12314190 11865757 11374553 11324160 11004166 10711770 10248414
16648 10248414 10458254 9856940 9363900 9102940 8705763 8693938 8537584 8154406 8157584 7896254
16638G896254p46283N15774k62178n61702K21920j27378k32370k68836o08050
16629E827151K98792k43920l62452O4558k8987j81333n6390l34794L3408K0102
16619E036135l12419j33245j27993K36297n0073j63976P5517l24535k70869k66926
16609C697913L53743l88692n3746M01221l55986j56404K76812k37792K8327j89606
16599C375790J69432n68893J68607j17671l05857L34917j77897j18900j77412
16590B582116K73027k11832M7413p8243n5791M5342j98040j27054k82763N71500
16580B565675k03650j46513K34545j51227j26777k3722l0222J74069j64947q1515
16570B045716J44566k33544p3536m7420K45513r8935j29108M45630o55531M8040
$$ plain form
16638 7896254 7149971 7665745 7403567 6841865 7063785 6936407 6704037 6435201 5827151
16629 5827151 6125943 5882023 5519571 5584129 5555142 5373809 5317419 4982625 5016033 5036135
16619 5036135 4723716 4590471 4462478 4698775 4648702 4484726 4560243 4235708 3964839 3697913
16609 3697913 4051656 3662964 3609218 4010439 3654453 3498049 3774861 3537069 3565396 3375790
16599 3375790 3545222 2976329 3144936 3027265 2721408 3056325 2878428 2759528 2582116
16590 2582116 2855143 2643311 2690724 2612481 2556690 2602032 2403992 2276938 1994175 2565675
16580 2565675 2362025 2215512 2450057 2298830 2172053 2148331 2118109 2292178 2127231 2045716
16570 2045716 2190282 1956738 1883202 1835782 2081295 1982360 1853252 2298882 1643351 1691391
16560A691391j02969J0338J20197Q6201k65945K19673k25754L02422l89932M03924
16550A849546l67134J87690k06245l268l91137P99000o35267J41803l01991L43791
16540A416788j13226M1357k26464Q1175K26136o763m38944M73396o15669L02820
16530A140606l5856L05247k75531J73O1678J3053J48266J50279o5138n58639R458
16519H93596J44336r1044L0827Q291K1810K80719m16632J88879m6622l0337j3722
16508I70101K27380j08841k05384P8542j31150k2654J26298J62947l18554J38343
16498I17028l28000J77892K03131M5997l36075J08348k74229L68834k8496l01448
16488E52982L40553m13261L16889k03672L15230O6579l53105L18635C89717o3882
$$ plain form
16560 1691391 1588422 1598760 1718957 1805158 1539213 1758886 1533132 1835554 1445622 1849546
16550 1849546 1482412 1670102 1463857 1460589 1069452 1868452 1233185 1374988 1072997 1416788
16540 1416788 1303562 1344919 1118455 1199630 1425766 1419003 980059 1453455 837786 1140606
16530 1140606 1104750 1409997 1134466 1134639 1196317 1209370 1357636 1507915 1442777 884138 893596
16519 893596 1037932 946888 977715 986006 1007816 1288535 871903 1060782 1014160 983823 970101
16508 970101 1197481 1088640 883256 961798 830648 807994 934292 1097239 778685 917028
16498 917028 589028 766920 970051 1016048 679973 788321 514092 882926 854430 552982
16488 552982 893535 480274 797163 593491 908721 975300 622195 940830 389717 325835
16478C25835L11554K31080j77241j23299j90735N04056l16514m2692K34833j70750
16468E86127m989L4544Q2666j70737J97384k05324j49822Q9774j29063L18790
16458F49350J4496k91210K90517O0154k22523M0208J23562j42241K82482C63445
16447E99883A92682L04342A48270L69902k45828l8568K20492J18598j72342q8423
16437C12101P0287K34061B92498N23392A93903K49543M57181C91620o7521K14180
16427E38279k32010m5280J05533J399J80079O2738J3136A2962J81622K31411R5302
16416E21297k10726j22232R1377K32638j89580o5179J99305A99338K29336A50674
16405C55452J07894n3218A53332K24784j47039J15771i7703B15699H4482A9013
$$ plain form
16478 325835 637389 868469 691228 567929 377194 881250 564736 522044 756877 586127
16468 586127 581138 615682 698348 527611 724995 519671 369849 459623 330560 649350
16458 649350 663846 372636 663153 723307 500784 540992 664554 522313 804795 363445
16447 599883 192682 497024 148270 518172 272344 233776 454268 572866 400524 312101
16437 312101 382388 616449 292498 815890 193903 443446 900627 391620 324099 538279
16427 538279 306269 260989 366522 367921 548000 610738 623874 12962 194584 425995 521297
16416 521297 310571 188339 279716 512354 322774 257595 456900 199338 428674 150674
16405 355452 463346 410128 153332 378116 231077 346848 -97703 215699 84482 19013
16394B82497J88854A69466C2499Q0831J84739A33479J04632J20842K36941B70487
16383d78410a37613B76950A20923K40107j280A05302O9215j5869K33108J28394
16373E20150B48812L23442B55589K0508o9246k9405O8078J38567C5305M176M60006
16362D99487G2700J2696L78407a57570C25696j05409Q7234C6686L62001A94195
16351D16810N1079D3739O6779L9117K4947K00081j41531J63688A53883K64105
16341D17988A65925k9729E5165a62396A87168D447J29103d9320B37502j06470
16331A31032J02753K8150B5821a79432C5102K47438J17681j94139i0655c3390
16320E7365K76764j31063e7641B46533a421G5017K90499b60991B45892b5152B13
$$ plain form
16394 282497 471351 169466 32499 113330 298069 133479 238111 358953 595894 270487
16383 -478410 -137613 276950 120923 361030 359750 105302 174517 158648 391756 520150
16373 520150 248812 572254 255589 276097 206851 177446 245524 384091 35305 39481 499487
16362 499487 72700 85396 463803 -157570 325696 220287 307521 36686 398687 194195
16351 416810 467889 43739 110518 149635 174582 374663 233132 396820 153883 417988
16341 417988 165925 136196 55165 -162396 187168 4447 133550 -49320 237502 131032
16331 131032 233785 261935 25821 -179432 35102 282540 400221 206082 -90655 -33390
16320 57365 334129 203066 -57641 246533 -1421 75017 365516 -260991 245892 -25152 213
16308A07790Q8468N6516n0406j4621f1440B15802O155P3518A41180B9321J64105
16297A93426o3897J09514k9237P3374A08874P7386K44590B07896p7727P5850b6008
16285B23918G1045c3575C54059G6603J49131Q6778G8767n769A7143O8979J59393
16274B45515H0507r080B5443K81867j53251a07705A08440g8234C36296j44971
16264A91325a14199A73345h0873K792o6773F3859a37935e960A21857C4104a45740
16252e2416n0937l7148B41905I6139Q8695l05f2734A78337O7762R7511D897a9726
16239C0168h0538L006A53664b17655P4519B03857a02983M0406C2607i2122j848
16228i3970K8073j03150c3790H2347J2844J68195b11889L9682j29188a3243k16441
$$ plain form
16308 107790 196258 252774 202368 187747 -61440 215802 221957 295475 141180 29321 193426
16297 193426 129529 239043 209806 283180 108874 186260 430850 207896 130169 206019 -26008
16285 223918 71045 -33575 354059 76603 225734 312512 78767 72998 17143 86122 245515
16274 245515 80507 71427 25443 307310 154059 -107705 108440 -78234 336296 191325
16264 191325 -114199 173345 -80873 -78081 -144854 63859 -137935 -5960 121857 34104 -145740
16252 -52416 -103353 -140501 241905 96139 184834 184529 -62734 178337 246099 343610 4897 -19726
16239 30168 -80538 -77532 153664 -217655 -143136 203857 -102983 -62577 32607 -92122 -93970
16228 -93970 -65897 -169047 -33790 82347 95191 263386 -211889 -172207 -301395 -13243 -229684
16217b29684M7253n4731e1310a3465B32082i4768c198B52522D3395J75894b56145
16205b12398E6855c2415A27707Q445b38946A27156R4435a7410j27556c5527B46404
16193A33107d94476B37558q7432h0269A27243a71644G8695d2812l87418i7431
16182A81416l4573g2985B1241K26135F956J49576d4863D33002j15675f7803l3362
16171a01165a9603A06771h8545F9649L09581a28499A12345a70890k23817N4779
16161c39928J20434K2361n9157a19490D26434A53813b29284J10846D0259b30895
16150B52774A02258J26483c04793B2589e7338G2523a67118j67851A39590A3521
16139I9284R605a16961n180N4384A2326J88985F1395Q6126D2276f6586B74301
$$ plain form
16217 -229684 -182431 -237162 -51310 -13465 232082 -94768 -3198 252522 43395 219289 -256145
16205 -212398 56855 -32415 127707 136152 -238946 127156 221591 -17410 -144966 -35527 246404
16193 133107 -494476 237558 150126 -80269 127243 -171644 78695 -42812 -430230 -97431
16182 181416 146843 -72985 21241 247376 6956 156532 -44863 433002 317327 -67803 -101165
16171 -101165 -19603 106771 -88545 69649 379230 -128499 112345 -170890 -394707 -339928
16161 -339928 -219494 -197133 -256290 -119490 426434 153813 -229284 -118438 40259 -230895
16150 252774 102258 228741 -304793 22589 -57338 72523 -167118 -334969 139590 13521
16139 99284 108889 -116961 -122141 -67757 12326 201311 61395 147521 42276 -66586 274301
16127b06548H6322O377J1577M2681a64578B37026B9271f7376j46290C0493k592
16116B7901b45964D85935f3651q643A7673J79597q7094d4150D9474a9847B198
16104d4238i74l7141j84837C05616A25514e0947A1346a63601l195A8590J04471
16093A23061d3946I908b94310B84107b62145A57010b2065l909o4337a9391A68213
16081B5970b27183n766o3219A8127J9916e3423j00583c6930o5652C20059F6706
16069e04762b7552H6272g4105A64787b1378D6110a04966C24227e3278c779l55695
16058c59474a35448F1628c1973B20036j01279e32833h7480q5880N4487d9800l7178
16047h6978B03296F7427B0962c17171H4967d5641k46924q7579E5349R1449p0109
$$ plain form
16127 -206548 86322 92699 104276 146957 -164578 237026 29271 -67376 -213666 30493 27901
16116 27901 -245964 485935 -63651 -72294 17673 197270 110176 -44150 49474 -19847 2198
16104 -44238 -974 -38115 -222952 305616 125514 -50947 11346 -163601 -166796 18590 123061
16093 123061 -43946 9908 -294310 284107 -262145 157010 -22065 -25974 -90311 -19391 168213
16081 25970 -227183 -232949 -296168 18127 38043 -53423 -154006 -36930 -102582 320059 66706
16069 -504762 -27552 86272 -74105 164787 -21378 46110 -104966 324227 -53278 -3779 -359474
16058 -359474 -135448 61628 -31973 220036 118757 -532833 -87480 -173360 -118873 -49800 -86978
16047 -86978 203296 67427 20962 -317171 84967 -45641 -292565 -380144 55349 146798 76689
16036G6689a45958A03397K23253c66991A84679d03875i8253A19686a11988A16480
16025b45203C1281c4582j78026h134H7073a06240e2365k36906B95953b9500q5173
16014a14673C1668J24992j6323C1429J71930b61575B77066B3275h6786j21367
16004b08153b8802A66705a74360D0287j944J80360p5407D5693c9668F9722l2821
15993C6901A6667a1333p2164N990B53264q8025A7714K17766N2941O6836A32228
15981H5556K22564A52555Q8478I213a86996C2997K3695j5558K718a35599A17392
15969H1980J03859O9941b5445k29714k9321J13970E6885J03506k0944m5244h569
15957A96598p7541c3037j37778C19456I3392b24204A32965L0245b05587E7792
$$ plain form
16036 76689 -145958 103397 326650 -366991 184679 -403875 -98253 119686 -111988 116480
16025 -245203 31281 -34582 -212608 -8134 87073 -106240 -52365 -289271 295953 -29500 -114673
16014 -114673 31668 156660 140337 31429 203359 -261575 277066 23275 -86786 -208153
16004 -208153 -28802 166705 -174360 40287 38343 218703 143296 45693 -39668 69722 36901
15993 36901 16667 -11333 -83497 -77507 253264 165239 17714 235480 288421 355257 132228
15981 85556 308120 152555 241033 9213 -186996 32997 56692 41134 43852 -135599 117392
15969 81980 185839 255780 -25445 -255159 -284480 -170510 56885 160391 139447 94203 -8569
15957 196598 119057 -33037 -170815 319456 93392 -224204 132965 163210 -205587 57792
15946b80925g0338F9480a74866d4521l233H4870B7376a45694A19947J40205a9953
15934A6888a53141P1739D4216L2202J8570L3356b77392m6780A22784c43467b0255
15922d40531f2722F4842b07941a5321A51503a05119j35186A28069a09576n3441
15912a63017D4270a90594A75827a9160k3549J8211j25984B05532E6312b88043
15901D6989J83585a51178A26491J31310I2432a78493G6590K24293r8932c49254
15890e2195B52242I9820M1337a62260O6132M959q9504c7433r999C11067a6079
15878h8196A15186a37306Q378a9894l72902a76342B17899M2443c21162B1991b53243
15866b67567J03058f6669j92737j7043f5071A72384m4638D4185Q1704O281j3577
$$ plain form
15946 -280925 -70338 69480 -174866 -44521 -47754 84870 27376 -145694 119947 260152 -19953
15934 16888 -153141 -81402 44216 76418 94988 128344 -277392 -324172 122784 -343467 -20255
15922 -440531 -62722 64842 -207941 -15321 151503 -105119 -240305 128069 -109576 -163017
15912 -163017 44270 -190594 175827 -19160 -42709 -24498 -150482 205532 56312 -288043
15901 46989 230574 -151178 126491 257801 92432 -178493 76590 300883 201951 -349254
15890 -52195 252242 99820 141157 -162260 -96128 -91169 -180673 -37433 -47432 311067 -16079
15878 -88196 115186 -137306 -128928 -19894 -392796 -176342 217899 260342 -321162 21991 -253243
15866 -267567 -164509 -66669 -259406 -276449 -65071 172384 127746 44185 125889 132170 118593
15855A18593N8566B338b43911a16156j35628e957B94241J9771c78978a27195c0710
15843b03427K7114A37628b22508Q8821o0078k10109A71488E3900d51751a56540
15832a45441c4017L33A78632l2761c24738D4313b47275I2641b40654c1778E7202
15820D3349c01431I0020a30475a8688o0204A12799c1374A60597e2114j63258Q7057
15809a28315A0992a24884J250j27540a07887k008B14690A9431f1507A14991J97439
15798C12430a21968R075h93j81975F0720i659k24838A72471b96858H8258d4569
15786g736B58004a59231A37653a23354B57781Q6670a23603A00511g5041A51388
15775B83429g1077j05178F4754J15516p5677h8668A04757c59423a31816e4827
$$ plain form
15855 118593 177159 2338 -243911 -116156 -251784 -5957 294241 314012 -378978 -127195 -30710
15843 -203427 -176313 137628 -222508 -133687 -193765 -403874 171488 53900 -451751 -156540
15832 -145441 -34017 -33684 178632 145871 -324738 44313 -247275 92641 -240654 -31778 57202
15820 43349 -301431 90020 -130475 -18688 -78892 112799 -31374 160597 -52114 -215372 -128315
15809 -128315 10992 -124884 -123634 -251174 -107887 -109895 214690 19431 -61507 114991 312430
15798 312430 -121968 -112893 -893 -182868 60720 -9659 -234497 172471 -296858 88258 -44569
15786 -7736 258004 -159231 137653 -123354 257781 344451 -123603 100511 -75041 151388
15775 283429 -71077 -176255 64754 180270 104593 -88668 104757 -359423 -131816 -54827
15764D16459a21135E0871b88846D4013K88649c85024b6618A32890P842m9459K78758
15753C70031a9041B11616K35772e5533l809B69684j30794J83294B6138a83181
15742a40292A8148e803B35547I7200Q3535c81986a22332i08D600a12487C67550
15730b30678R4400B9937b00579i0655A39022a1624j44205j24358A77934Q7864
15720B65798C662a64083A19071a85941F4153o24K45042F2811J6991d7525p7326
15709a24851A73962a81122N4811j82797A06710E2472b01396d1898j06709C33603
15698d4874A85980m1180b87588a26841k05104f7403A94208G9238J56540H924J0176
15687A9100L76047H5519e3607C6354J9128a71134A1489K05534b23600F595b12973
$$ plain form
15764 416459 -121135 50871 -288846 44013 332662 -385024 -26618 132890 140732 91273 370031
15753 370031 -19041 211616 447388 -55533 -59342 269684 138890 322184 26138 -183181
15742 -140292 18148 -5803 235547 97200 180735 -381986 -122332 -908 4600 -112487 367550
15730 -230678 -136278 29937 -200579 -90655 139022 -11624 -155829 -280187 177934 265798
15720 265798 3662 -164083 119071 -185941 64153 63529 308571 62811 79802 -47525 -124851
15709 -124851 173962 -181122 -126311 -309108 106710 52472 -201396 -41898 -148607 333603
15698 -44874 185980 144800 -287588 -126841 -331945 -67403 194208 79238 235778 8924 19100
15687 19100 395147 85519 -53607 36354 55482 -171134 11489 217023 -223600 6595 -212973
15675a78267A95082A0168R9026d36898F1604J47283p3120a42700a1897E1869R2938
15664A44807c2451o7648d6540j01409l1105o6088I3767J02556c18608B01904A1532
15652I731J47425m8848C0064c11455B21799E7523d32661A37822a89400D3462c4289
15640A61132o4067c51554a33901B51131b32836A1551J34828a46438o3545B1761
15629c94212C57932a02679E9131J27478h8074G3485B0329N1375K94164B1330J80283
15618B01613O0276P8666a03014A6865K30817b93123c5987H7992j9233Q5027c32527
15606b14337g2771j72785q6759C4383b10620c7468q497o0429B76844b97138C25944
15594i8602I0731C6969r19J14134e3810j87647B1860J38768c37066B21239o0265
$$ plain form
15675 -178267 195082 10168 109194 -436898 61604 208887 135767 -142700 -11897 51869 144807
15664 144807 -32451 -100099 -46540 -147949 -179054 -245142 93767 196323 -318608 201904 11532
15652 9731 157156 108308 30064 -311455 221799 57523 -432661 137822 -189400 43462 -34289
15640 161132 97065 -351554 -133901 251131 -232836 11551 146379 -146438 -209983 21761
15629 -394212 357932 -102679 59131 186609 -88074 73485 20329 71704 365868 21330 201613
15618 201613 261889 340555 -103014 16865 247682 -293123 -35987 87992 68759 153786 -332527
15606 -214337 -72771 -245556 -332315 34383 -210620 -37468 -45965 -106394 276844 -297138 325944
15594 -98602 90731 36969 36050 150184 -53810 -241457 21860 160628 -337066 221239 160974
15583A60974A4149N8690M6109i1230K5484m2248n7765Q0394A82832a52585L8461
15572a14124D21682E3235J5503K32972j38790b4147j66065m7665b0050j04379
15562a24429A37626j7425k7948k9625R0684n7737e6210A07248a01356A22480J43538
15551B66018E1230K29057r7567h3505O89A40846b0251j29028G2779M2560a24986
15539C66169N5808d41074A44964a28005B4811d7160A36769c4324j20813f7059
15528G2361b507n346A53101f9948F9053I539J35731M5560E2525Q652i1556j50791
15516b42347K3816G7059K73216a02196A97013C039J2247J58575L4187G794a65302
15504D4556g6342E35451c498A96048Q0110i0997k57212Q1684B6213h2749C75290
$$ plain form
15583 160974 14149 72839 118948 -91230 -65746 -107994 -165759 -85365 182832 -152585 -114124
15572 -114124 421682 53235 68738 301710 162920 -24147 -190212 -237877 -20050 -124429
15562 -124429 137626 120201 92253 62628 153312 95575 -56210 107248 -101356 122480 266018
15551 266018 51230 280287 182720 -83505 -82816 140846 -20251 -149279 72779 115339 -124986
15539 366169 421977 -441074 144964 -128005 24811 -47160 136769 -34324 -155137 -67059
15528 72361 -2507 -7853 153101 -69948 69053 9539 145270 190830 52525 61177 -91556 -242347
15516 -242347 -218531 77059 350275 -102196 197013 3039 15286 173861 208048 7794 -165302
15504 44556 -76342 535451 -3498 196048 276158 -90997 -348209 -266525 26213 -82749 375290
15492a48047k259j39799A42654i8851l06447B302J55853d5149j29700G2176h1098
15480e2682E3314a31456j9849e7809B57165H9189C932g1126F0585J41654r7081
15469A05158i7480I8785d5023j76392A39049n3823L01k8000J60320E9825J8808
15458G8633b51832D3543b45316A66706e7521A18944b9498l7136j14356O0436A36876
15446b05748B20474q5493c0336r9955B51022C8227K00558I7564B6830K26268B0328
15434a56926F2147B4922Q2569h7246a6001C84331a25133M011B03917g7111l09793
15423c86904g5617F4972d8112F7589a05475j1764j0925j7166q5539N8895B56822
15411A06629g5835j74057O9646H640g7185B8075M1720a49135I1039f4527G3837
$$ plain form
15492 -148047 -150306 -290105 142654 -98851 -405298 2302 158155 -45149 -174849 72176 -81098
15480 -52682 53314 -131456 -151305 -57809 257165 89189 3932 -71126 60585 202239 105158
15469 105158 -97480 98785 -45023 -221415 139049 85226 85527 57527 217847 59825 78633
15458 78633 -251832 43543 -245316 166706 -57521 118944 -29498 -66634 -180990 -120554 136876
15446 -205748 220474 134981 -30336 -130291 251022 38227 238785 97564 26830 253098 20328
15434 -156926 62147 24922 107491 -87246 -16001 384331 -125133 -121122 203917 -77111 -386904
15423 -386904 -75617 64972 -48112 67589 -105475 -117239 -128164 -145330 -230869 -171974 256822
15411 106629 -75835 -249892 -180246 8640 -77185 28075 69795 -149135 91039 -64527 73837
15399h5324B15489d3429C99152K1732h8557k26751i384B15092Q9747F1294a08471
15387b9083B12726e60154b42798f9073j4146A26166D2767R9085O6853C2736J6330
15376D9066K20568J21336a17278k93755B63751c25371A16406P6286c22544B88861
15365g0514A068a07525H4779J37027c0679j6644B27474d9076N006A97461E4992
15353C76845G3604J4426k1262c0516l23592D0142J55860d32940A92955a35036
15342A23258J11432a4030A95193a02018n7266C11180d4815k23803I6460A2176
15331A75459E4060P0221b64085C2754b34284H3326O3449J19745b78285E7036K9453
15320H6489J13023b03213A92075k4802b83340A07967n2355E165J74781P3440a26960
$$ plain form
15399 -85324 215489 -43429 399152 420884 -88557 -315308 -9384 215092 304839 61294 -108471
15387 -29083 212726 -560154 -242798 -69073 -83219 126166 42767 141852 208705 32736 49066
15376 49066 269634 390970 -117278 -411033 263751 -325371 116406 192692 -322544 288861
15365 -70514 1068 -107525 84779 221806 -30679 -47323 227474 -49076 -44070 197461 54992
15353 376845 73604 88030 66768 -30516 -354108 40142 196002 -432940 192955 -135036
15342 123258 234690 -14030 195193 -102018 -159284 311180 -44815 -268618 96460 12176
15331 175459 54060 124281 -264085 32754 -234284 83326 146775 266520 -278285 57036 86489
15320 86489 199512 -203213 192075 167273 -283340 107967 55612 5165 179946 253386 -126960
15308F6332A317J75590J19320j15146A8261a42731g476A69122g5200A97294i531
15296B34470b56333F9808e088A86981J96067e8976A35899n7548J87623a58807
15285A0186K97338g2986j32449b9266q6294j9694G5388i9857b5879m7947G36184
15273H3661M0104K91046j33382b5121A78939p5879m6157b26735a0564B60768K36033
15262D96801A69109J17354a21484j06322C6435J64770b48199A31026J16848B6977
15251b59970A08536K66613J34824K75844M74984p4382l28857L39247n91358B41817
15240a45362c2717C9737J61397h922m8156B15958a53822L8815F0247d5475A32023
15228E5253L76890j86928j0832g1123C21422A17051b65977A83132J7929c16903
$$ plain form
15308 66332 1317 176907 296227 181081 18261 -142731 -7476 169122 -75200 197294 -9531
15296 234470 -256333 69808 -5088 186981 383048 -58976 135899 78351 265974 -158807
15285 10186 307524 -72986 -205435 -29266 -115560 -135254 75388 -99857 -25879 -73826 736184
15273 83661 123765 414811 281429 -25121 178939 103060 56903 -226735 -10564 260768 496801
15262 496801 169109 286463 -121484 -227806 36435 201205 -248199 131026 247874 26977
15251 -259970 108536 375149 509973 785817 1260801 1186419 857562 1196809 605451 241817
15240 -145362 -32717 39737 201134 -8922 -57078 215958 -153822 -115007 60247 -45475 132023
15228 55253 432143 245215 234383 -71123 321422 117051 -265977 183132 201061 -316903
15217E5437G251K78314j07261h6204B02557E396L06972a4589A26166J2456C0881
15205c7335A53644p732n0620g5475B32740g9596C1410N3830B0565J78362j1184
15194A87743P5083a17430C37818I9705e4392B06312I7527a44617n9247B02075
15183H3536L30751b440B72388a0680k67613i6953B53675N5985o1167J97395G2517
15171d1919B11775q3042a20144F9517a84652B15191E7842J26092c80q214F5978
15159A29830e8796A92328q3611b77450i9677C64688j55999l6763M223L3844b2617
15147B01632B7012M9477i3613D44551a08951j474E7912L81211G3028c6553A81685
15135F4804L37603A03775m2685b37958G9913c21507C18052f2797B68624D1512
$$ plain form
15217 55437 7251 285565 178304 -86204 202557 5396 312368 -14589 126166 138622 30881
15205 -37335 153644 145912 95292 -75475 232740 -79596 31410 85240 20565 198927 187743
15194 187743 262826 -117430 337818 99705 -54392 206312 97527 -144617 -203864 202075
15183 83536 414287 -2440 272388 -10680 -278293 -96953 253675 309660 248493 445888 72517
15171 -41919 211775 128733 -120144 69517 -184652 215191 57842 183934 -380 -8594 65978
15159 129830 -58796 192328 108717 -277450 -99677 364688 208689 171926 176149 209993 -22617
15147 201632 27012 76489 -93613 444551 -108951 -110425 57912 439123 73028 -36553 181685
15135 64804 402407 103775 61090 -237958 79913 -321507 318052 -62797 268624 41512
15124E6052D70e301C4805J69900A9224K05450N1584H984P4193j5159C433K81943
15112B85376b44071H6956K64034I8786L10569D6664K54695A07719L79690k22305
15102B65104I3921R166K77735A25603J80201a38245o768B78387E8538L95318A49270
15090G3021J36430K55375q8463j09504p4942D0167Q4512m6404L0604O0778J08704
15079B78361o8253K32860A82740K12689j35238c44735f6201j30581B24331F7541
15068B61081m4780J9227N023a59714B16052J53071a28738M7691c9679j2281E2004
15056f2694A66718O4753j0300o7599N07073A17056a29046a9437D8989J24986M58797
15045F32772G0682J67756K26906k27992c559B19762J72913e5363B88228j22960
$$ plain form
15124 56052 470 -5301 34805 204705 19224 224674 276258 8984 83177 68018 3433 285376
15112 285376 -244071 86956 350990 98786 409355 46664 301359 107719 487409 265104
15102 265104 93921 103087 380822 125603 305804 -138245 -145013 278387 58538 453856 149270
15090 73021 209451 464826 376363 266859 191917 40167 124679 78275 108879 169657 278361
15079 278361 210108 442968 182740 395429 260191 -344735 -66201 -196782 224331 67541
15068 261081 216301 235528 240551 -159714 216052 369123 -128738 -81047 -39679 -51960 52004
15056 -62694 166718 231471 221171 153572 660645 117056 -129046 -19437 48989 173975 632772
15045 632772 70682 238438 465344 237352 -3559 219762 392675 -55363 288228 165268
15035A65268o8813A4358a35326A51063m5656g2897B79890c0454b198C05300b6347
15023B96644c4071B48992H5736L9525M3390K27318F9544C2994L90987d4908e858
15011B88833J98793j55976A8439J55623J90421l8156O0623j59236K39330B10243
15000C13622f0175A38841K4572f310B42926L22744k32994E2676Q1048K29795m3033
14989C20486c2347C54966A54863J13049j16273a50221A79838n3631J62208M0857
14979C29272F7635J33887H7143o985J87790K6381L8966j9816j10203L04670A08273
14967C28735p0149c3493B04352n1451K23258A43464K61530A45950J98452D6748
14956A22952j7180J59567r0381K22537o0975A30265L4688K60721A84605O7257
$$ plain form
15035 165268 96455 14358 -135326 151063 105407 -72897 279890 -30454 -2198 305300 -26347
15023 296644 -34071 248992 85736 125261 168651 395969 69544 32994 423981 -44908 -5858
15011 288833 487626 331650 18439 174062 364483 326327 386950 227714 467044 210243
15000 313622 -60175 138841 163413 -6310 242926 565670 332676 52676 133724 363519 320486
14989 320486 -32347 354966 154863 267912 151639 -150221 179838 126207 288415 329272
14979 329272 67635 201522 87143 80158 267948 294329 333295 313479 203276 507946 108273
14967 328735 258586 -33493 204352 152901 376159 143464 404994 145950 344402 46748
14956 122952 105772 265339 174958 397495 336520 130265 164953 425674 184605 251862
14946B51862M6806J97869G0910K50416n2017J89819m127n4883R7654k38963J73102
14935D31911r0401J03332J5315M8414k23583K31860r0338n0784m4263J337J25440
14924D58240k25364L4620K01568J97859k28091R4957N6068O6414C14360G9301
14913C31401J36254q5051I6940K89647J65214B70286K3926r7426j6639R9095l2583
14902B46659J10651R8085A45959n7493L42134q6252l050L56681C13909J38092
14892D52001A58142M29589j96023j26188n2258K51007j08316P0172M954j59099
14882B71980e1517C22662M2588j48887L19805R2659B23578O8414K46418L1546
14872E69956B68875K39711A97276J76049Q6954B0190K53402Q334J09051k5122
$$ plain form
14946 251862 298668 496537 70910 321326 269309 459128 455001 400118 497772 258809 431911
14935 431911 341510 444842 460157 508571 284988 516848 426510 375726 331463 332800 458240
14924 458240 232876 267496 469064 666923 438832 533789 589857 656271 314360 79301
14913 331401 467655 382604 96940 386587 551801 270286 294212 196786 180147 279242 246659
14902 246659 357310 455395 145959 88466 430600 344348 341298 697979 313909 452001
14892 452001 158142 587731 391708 265520 213262 464269 355953 426125 431079 271980
14882 271980 -51517 322662 365250 216363 536168 628827 223578 291992 538410 569956
14872 569956 268875 508586 197276 373325 460279 20190 273592 281926 390977 365855
14862C65855J69669p4358K5361j56332K52128J21511j88668j87521n290j8362
14852C03993J86654n1418J14668j62755K66766l22038j14065M21387k43072j06659
14842B93461j20469J25695L3008J04803m9662J4235p9481J46883K75994A90258
14831G11087l43652N701m8695Q5004l4867J74177j79152p7240O51953m70657A27808
14819E42308N2256k62564J61812L94497m21363M25241C90824N2634n5532k7121
14809C60805J26958K52406l16590R5025N2633K36322B93240P8123K83935j92898
14799D62400k7026J7594L86557D09631J66620q1398J44321K71591j04859l24268
14789D81638L07334l44942J54638k25844M47154k77471K64327B69071N10143j56114
$$ plain form
14862 365855 535524 461166 486527 330195 582323 703834 515166 327645 322355 303993
14852 303993 490647 439229 553897 391142 657908 335870 221805 643192 400120 293461
14842 293461 172992 298687 331695 436498 386836 401071 321590 468473 744467 190258
14831 711087 367435 373136 324441 409445 374578 548755 369603 292363 944316 473659 127808
14819 542308 594564 332000 493812 888309 466946 892187 390824 443458 387926 360805
14809 360805 487763 740169 423579 518604 571237 807559 293240 371363 655298 462400
14799 462400 435374 452968 839525 409631 576251 494853 639174 910765 805906 481638
14789 481638 788972 444030 598668 372824 819978 542507 806834 269071 779214 623100
14779F23100n3817J35536J36125j3626L7922p2748k62951J49919p675m6523m5169
14768E80093J1937J78195j82832n2457J88711K22672k76026j74177K6988J34143
14758F57247k7730J45475j13624R8069N2045Q5498j84211r519j34966K94935l61001
14747E02218M75202j24106R0471p8379j16577j11883K64040j16589P189r6163
14737F95423J26506k86187K02345k1268K66103j40929j27107L3265L4927q3104
14727F99974N6283Q8354j50918K48492l26154K28491k24663N00023D90625K46618
14717G37243K50002k17385k6080M04260n69698P4236J59185R5372l2935j13611
14707G60589l893J63534j29562J5141k23315J86994K6897J20983l76351M71094
$$ plain form
14779 623100 569283 704819 840944 827318 865240 792492 529541 679460 671785 625262 580093
14768 580093 592030 770225 587393 534936 723647 946319 670293 496116 523104 657247
14758 657247 629517 774992 661368 759437 811482 896980 712769 703250 568284 863219 502218
14747 502218 977420 853314 943785 865406 748829 636946 900986 784397 791586 695423
14737 695423 821929 535742 738087 716819 982922 841993 714886 748151 783078 699974
14727 699974 756257 844611 693693 942185 616031 844522 619859 1119882 490625 737243
14717 737243 987245 769860 743780 1148040 578342 652578 811763 907135 874200 760589
14707 760589 756696 920230 790668 805809 582494 769488 796385 917368 541017 1012111
14697A012111k42313J76614l46009K19150J97319k51069J16836K48812k17415
14688I14036M55127m67200k87725M38984l42507K36886p1588l1503R7668n1432
14678H90746J24374j79670L0445N8221K61202l53017M2534J43151K09775J37597
14668A365358k41931K04026l86113L05381j26632j72917K89505k35178M37642
14659A439141l49516m7602J99040l95652K44823K10589o2676n1102j11854J80433
14649A255624j27477K55866j8952k99076N05738m94547R6566r9278M24099J08424
14639A606987m16519M85566l28745O314l7114L22212j40066j63695R0555K5027
14629A450522J13613j67130K52656r5050k88306K22231j82057M79267k2148r6666
$$ plain form
14697 1012111 769798 946412 600403 819553 1016872 765803 882639 1131451 914036
14688 914036 1369163 901963 614238 1053222 710715 947601 876013 844510 942178 890746
14678 890746 1015120 835450 865895 924116 1185318 832301 874835 1017986 1227761 1365358
14668 1365358 1123427 1327453 941340 1246721 1120089 947172 1236677 1001499 1439141
14659 1439141 1089625 1042023 1241063 845411 1090234 1300823 1238147 1187045 1075191 1255624
14649 1255624 1128147 1384013 1365061 1065985 1571723 1077176 1173742 1074464 1498563 1606987
14639 1606987 1190468 1676034 1347289 1353603 1316489 1638701 1498635 1334940 1425495 1450522
14629 1450522 1564135 1397005 1649661 1554611 1266305 1488536 1306479 1785746 1763598 1666932
14619A666932J2342m31679J66766J70084j99104l1725L24763k0562j21560K27685
14609A763942k28998L92052j46461j80703K49480l34902K08784m06501K45628
14600A562321N0335L35048m70046J19990K30187o3499K77424j67628M0066j55521
14590A758677N850k41573N65152o9938j11743K4337L16778k37074r5556K4614
14580A939524L41953k95813j25004P3991R3473J21808J70059l30263J12188j23101
14570A978815O66775l98415K10212k82157J87057Q6299j5142L05227p5425L7123
14560B700369J86418K34674J15462K2379j61547k7803M13559L54824K30441P68028
14550D836804R03842K393751N574027J1317362J3496331P081104B0855173A0152915
$$ plain form
14619 1666932 1679274 1247595 1414361 1584445 1385341 1353616 1678379 1657817 1536257 1763942
14609 1763942 1534944 1926996 1780535 1599832 1849312 1514410 1723194 1316693 1562321
14600 1562321 1612656 1947704 1477658 1597648 1827835 1764336 2041760 1874132 1914198 1758677
14590 1758677 1764527 1522954 2088106 2018168 1906425 1930762 2247540 2010466 1914910 1939524
14580 1939524 2281477 1985664 1860660 1934651 2028124 2149932 2319991 1989728 2101916 1978815
14570 1978815 2645590 2247175 2457387 2175230 2362287 2448586 2433444 2738671 2663246 2700369
14560 2700369 2886787 3121461 3236923 3259302 3097755 3069952 3483511 3838335 4068776 4836804
14550 4836804 5740646 8134397 13708424 25025786 38522117 45603221 20855173 10152915
14541E081489k006909n17811m28973J35402K1919m95936O9337M60609j75964J14228
14531B257391n2556l4559k16622L90314j6272L28458m06788J37186J99774j87452
14521B398874J33136J76134R4097j13873l30124P64192l25156p5864J62680K35998
14511C120094m29480j2729L01606J0336J10539M9217l0160j58201k84059L84270
14501C061433L19717j5894o6177k30377K38374K2142P0527K943j32406K69431
14491C539713n300K2434M9763k26497M10598N3127K47360m40251N85896n59888
14481C676955K36124j55558K42155K08781o6429J54430k84773K86563L97q7316
14471D211329L09029k86433P5934M83954j84579k50241L85153O7511j47824K04384
$$ plain form
14541 5081489 3074580 2556769 2127796 2263198 2285117 1789181 1858518 2319127 2143163 2257391
14531 2257391 2204835 2170276 1953654 2343968 2327696 2656154 2249366 2386552 2586326 2398874
14521 2398874 2532010 2708144 2802241 2688368 2358244 3122436 2797280 2721416 2884096 3120094
14511 3120094 2690614 2677885 2979491 2989827 3100366 3149583 3119423 2961222 2677163 3061433
14501 3061433 3381150 3365256 3299079 3068702 3307076 3329218 3399745 3402688 3270282 3539713
14491 3539713 3534413 3556847 3606610 3380113 3790711 3843838 4091198 3650947 4236843 3676955
14481 3676955 3913079 3757521 3999676 4208457 4142028 4296458 4011685 4298248 4298645 4211329
14471 4211329 4520358 4233925 4309859 4793813 4609234 4358993 4744146 4811657 4663833 4868217
14461D868217j43043K44102j04113P2287L03454j45275J48857k26929N2797J77815
14451E248169N56397j65561r0972j73203J15311K60181J29965j87689M99021j54097
14441F037522l4484J79998R221L24564J2576j58138L04790j63172L07583j69983
14431F650477J88888J79610K02964l7023K47813k93011L36434J23362J13665J78759
14421G891938j70198M07430K79161Q1213j3771q6866M67094j37740J74543J66113
14411I058917N3876K25361j8468L6981L11553J47995K42852K07231l6919R0466
14401A0319845J01224L41270l8526P24983l28212p6794P59532j94920N50099K03842
14391A2362343K22201l86529Q13695K5069J90240N47534M48538j39391M41093
$$ plain form
14461 4868217 4725174 4969276 4865163 4937450 5240904 5095629 5244486 5017557 5070354 5248169
14451 5248169 5804566 5639005 5548033 5374830 5490141 5750322 5880287 5692598 6191619 6037522
14441 6037522 6003038 6183036 6192257 6516821 6529397 6371259 6676049 6512877 6820460 6650477
14431 6650477 6839365 7018975 7221939 7184916 7432729 7139718 7476152 7599514 7713179 7891938
14421 7891938 7721740 8129170 8408331 8489544 8475773 8388907 8856001 8718261 8892804 9058917
14411 9058917 9112793 9338154 9319686 9356667 9668220 9816215 10059067 10266298 10229379 10319845
14401 10319845 10421069 10762339 10723813 11448796 11120584 11043790 11803322 11608402 12158501 12362343
14391 12362343 12584544 12198015 13011710 13036779 13227019 13774553 14223091 14083700 14524793
14382A4524793l8422O16141J25606J38309K10984K08936M62906J14124P62082
14373A7125459J26930J61490L08038K60565N17877J39365M39875O09541K88326
14364A9977466L11523M27033M84454N86227J79850P55528K34336P31995O39908
14355B4328320J72413N91584O12067L37868J023254M56826P61352P70682Q99620
14346B9953986O19769P04565J094292L70857P79696J014336J129140P76351P53325
14337C7196317J383858J169528Q97507J284532J148302J561166J099444J542973
14329D7283627J399381J473960K036504J380049J688530K089545J823638J831993
14321F1007227K199735K188073K669974K333445K548517K763467K871257L110740
$$ plain form
14382 14524793 14486371 15102512 15228118 15366427 15577411 15786347 16249253 16363377 17125459
14373 17125459 17252389 17413879 17721917 17982482 18500359 18639724 19079599 19689140 19977466
14364 19977466 20288989 20716022 21200476 21786703 21966553 22722081 22956417 23688412 24328320
14355 24328320 24500733 25092317 25704384 26042252 27065506 27522332 28283684 29054366 29953986
14346 29953986 30573755 31278320 32372612 32743469 33523165 34537501 35666641 36442992 37196317
14337 37196317 38580175 39749703 40647210 41931742 43080044 44641210 45740654 47283627
14329 47283627 48683008 50156968 52193472 53573521 55262051 57351596 59175234 61007227
14321 61007227 63206962 65395035 68065009 70398454 72946971 75710438 78581695 81692435
14313H1692435L328135L159042L489400L814875M095705M059679M417383M970870
14305A13027524M860154M923419N996094O157411O337347O773738P132011P551455
14297A62759153Q114864Q550846R293721R598814R920103J1181798J1084628J2456612
14289B42960539J2703739J3388093J3949374J4530865J4957364J5164544J5844665
14282C43499183J5891492J5740205J5661658J5080950J4649983J3778181J2479119
14275D46780771J0920333Q921663N430427R18177m229568P99458K504439k265550
14267D69780150l726425o567060q754914j0086125j1872666j3158286j4565936
14260D01048738j5175426j6077942j6695991j6155708j6125069j5363792j4485795
$$ plain form
14313 81692435 85020570 88179612 91669012 95483887 99579592 103639271 108056654 113027524
14305 113027524 117887678 122811097 128807191 134964602 141301949 148075687 155207698 162759153
14297 162759153 170874017 179424863 188718584 198317398 208237501 219419299 230503927 242960539
14289 242960539 255664278 269052371 283001745 297532610 312489974 327654518 343499183
14282 343499183 359390675 375130880 390792538 405873488 420523471 434301652 446780771
14275 446780771 457701104 466622767 472053194 472971371 468741803 469541261 472045700 469780150
14267 469780150 466053725 459486665 450731751 440645626 428772960 415614674 401048738
14260 401048738 385873312 369795370 353099379 336943671 320818602 305454810 290969015
14253B90969015j4257367j4022304j3118440j2363436j2176010j1254537j0927312
14246B02849609r852522r356573q463067q549391p851082p740544o986587o175944
14238A37873899o205980n620511n340876n653041m868561m424154m148999l993947
14230I7617830m030223l961650l178047l324353l328415l065793k783845k627936
14222G1317568k641770k490733k197004k277637j866665k084274j927328j348973
14214E4483184k015158j039093j715081j934646j313490j639716j244770n35512
14206D3045718j362847j351053j352011j034649o99103n87247j280089p56056
14198C4622663j236200q39180j036151q98600m07100r81861m95125r35352p06957
$$ plain form
14253 290969015 276711648 262689344 249570904 237207468 225031458 213776921 202849609
14246 202849609 192997087 183640514 175177447 166628056 158776974 151036430 144049843 137873899
14238 137873899 131667919 126047408 120706532 115053491 110184930 105760776 101611777 97617830
14230 97617830 93587607 89625957 86447910 83123557 79795142 76729349 73945504 71317568
14222 71317568 68675798 66185065 63988061 61710424 59843759 57759485 55832157 54483184
14214 54483184 52468026 51428933 49713852 47779206 46465716 44826000 43581230 43045718
14206 43045718 41682871 40331818 38979807 37945158 37246055 36658808 35378719 34622663
14198 34622663 33386463 32547283 31511132 30612532 30205432 29223571 28728446 27793094 27086137
14189B7086137n73933q24978k50866n80622p21583l72535n00741p57409p32856
14180B1770614j86377n83277j60026m18989n49905m10856m24136l20979m96251
14171A8219818n70312R8690n66760p49767k92198J00051l66165j37742n08917
14162A5226698k5345o13368J21216k68109o84945L3352m78350j08914l47394J15904
14152A2970745l77181j48554k21378k63800J9033j66425k93783k01473l46747
14143A0970437L99212n24471k69922k09487m9774k45994j26673j60907k96793
14134I485628K88892k95436j39513K8367n17409J966j75391J12670l74697Q9977
14124H505054k07378J07875l67426R4763j7565m60801J82973O5137l57179k86416
$$ plain form
14189 27086137 26512204 25687226 25436360 24855738 24134155 23761620 23260879 22503470 21770614
14180 21770614 21584237 21000960 20840934 20421945 19872040 19461184 19037048 18716069 18219818
14171 18219818 17649506 17748196 17181436 16431669 16139471 16239522 15873357 15735615 15226698
14162 15226698 15201353 14587985 14709201 14441092 13756147 13789499 13311149 13202235 12854841 12970745
14152 12970745 12593564 12445010 12223632 11959832 11978865 11812440 11518657 11317184 10970437
14143 10970437 11369649 10845178 10575256 10365769 10315995 10070001 9943328 9782421 9485628
14134 9485628 9774520 9479084 9339571 9367938 8850529 8852495 8677104 8789774 8415077 8505054
14124 8505054 8297676 8405551 8038125 8132888 8115323 7654522 7837495 7902632 7545453 7259037
14114G259037P4361q9743j53189J42344m17664L00730k92012M0199m08664J85053
14104F640452k35044j94588N1072j23434J28444l26345k19503J02054k1462j19954
14094E681692L14273l16569k60424J00067J44519k26775k02440J03511j69750
14085E168104J92337j47850j08073J29275j2155k62716k9207o6119p4094j25201
14075D664301l19997K16971J3247k79781K37820l59999L37955k70194j54108J83198
14065D269413K80943m42602J20843k55405J81993j85115M53850n20684J54305
14056D057541r2562q497j15696k45388Q050p3810j028j83780J04082N8728n7438
14045C450202J63736q3260J10817k27216L9826P1038k78560M3859Q9856M0448
$$ plain form
14114 7259037 7333398 7243655 7090466 7232810 6815146 7115876 6823864 6864063 6455399 6640452
14104 6640452 6405408 6210820 6261892 6138458 6266902 5940557 5721054 5823108 5801646 5681692
14094 5681692 5995965 5679396 5418972 5519039 5663558 5436783 5234343 5337854 5168104
14085 5168104 5360441 5212591 5104518 5233793 5221638 4958922 4929715 4863596 4789502 4664301
14075 4664301 4344304 4561275 4574522 4294741 4532561 4172562 4510517 4240323 4086215 4269413
14065 4269413 4550356 4107754 4228597 3973192 4155185 3970070 4423920 3903236 4057541
14056 4057541 3964979 3956482 3840786 3595398 3603448 3529638 3528610 3344830 3448912 3507640 3450202
14045 3450202 3613938 3530678 3641495 3414279 3454105 3525143 3246583 3290442 3380298 3420746
14035C420746j44965j88808J42824K2627J7780k23456J79970n15855L92594J14928
14025C218385l63226j14492k6220J7523J14227j28233k52374r2982N52083k54475
14015B670216q1435k16400j06300J27496Q3610J17121l59415J53296j64997L3669
14005B256861L23030l17892l58423K54244j63797k04525N62547k10271r73j55339
13995A985462M90160n66404L87368j72239K31944J80818J092523M069342J0098243
13986A7797217J4450527J5016270k0916280j2925101n460694k017915j068462
13979D875562p17643m64603l66109J9019j68472o38090J68758m15046J18095K38536
13969B650007k50734q2696K8899j49139J63359k29183J34424J88744j45745j03169
$$ plain form
14035 3420746 3275781 3086973 3229797 3252424 3270204 3046748 3226718 2710863 3103457 3218385
14025 3218385 2855159 2740667 2714447 2731970 2846197 2717964 2465590 2372608 2924691 2670216
14015 2670216 2588781 2372381 2266081 2393577 2477187 2594308 2234893 2388189 2223192 2256861
14005 2256861 2579891 2261999 1903576 2157820 1994023 1789498 2352045 2141774 2140801 1985462
13995 1985462 2475622 1909218 2296586 2124347 2356291 2537109 3629632 7698974 17797217
13986 17797217 32247744 47264014 26347734 13422633 7961939 5944024 4875562
13979 4875562 4157919 3693316 3327207 3346226 3177754 2539664 2708422 2293376 2411471 2650007
13969 2650007 2399273 2316577 2345476 2196337 2359696 2130513 2264937 2453681 2307936 2204767
13959B204767k86142K44334m2658J29786o8662j04487J88705l48274J25606r2018
13949A950957o5203r2467P6367M6114O3879k97182L34720l81220R7188K82203
13939B015356j83509p5372R8523o557j69380o998k36130N45463l76518K2388m8246
13928A579020j01762J6006J23658k06470p407L03134m06361K48711j21015K11609
13918A639123k38384Q38N7373J85364K8608p6982o0816j3986j99955k1429K23977
13907A523731k91841J98378O4624L17724j31382m79181j99178M33028k9269n3344
13897A353290j81432L86377k99069k72378N22227j29146J35406j7683l63783J61092
13887A294901l06475K94555j95413M89192l26990r5476J10808J6515J3069j26717
$$ plain form
13959 2204767 1918625 2162959 2120301 2250087 2181425 2076938 2265643 1917369 2042975 1950957
13949 1950957 1885754 1793287 1869654 1915768 1979647 1682465 2017185 1635965 1733153 2015356
13939 2015356 1831847 1756475 1854998 1848441 1679061 1672063 1435933 1981396 1604878 1627266 1579020
13928 1579020 1477258 1493264 1616922 1410452 1403045 1706179 1299818 1548529 1427514 1639123
13918 1639123 1400739 1401577 1458950 1644314 1672922 1595940 1535124 1521138 1321183 1299754 1523731
13907 1523731 1231890 1430268 1494892 1812616 1681234 1202053 1002875 1435903 1406634 1353290
13897 1353290 1171858 1558235 1259166 986788 1509015 1379869 1515275 1497592 1133809 1294901
13887 1294901 988426 1282981 1087568 1576760 1249770 1154294 1265102 1281617 1294686 1167969
13877A167969J5829j16151P4452p8491j92863O01015j82791l81011L06279k33901
13867I80336K11370K25238l21448J1475K31116M1007o06424K56420K60349R0973
13857A380412l47605q5129J58997J15339J99378j96542n1415k55046Q2837k4495
13847I76731m3637K23387k35827K86279l51160J68596K60424n54899K78601j29642
13837H78853K04718k14753J94293j31887J54438K9301l64242J00904J65680p4771
13827I42534R4803l36795K58784j30065J23585j59302J18309R6032m74206P9943
13817F13622J28047j62977M56006j22077m3272j73660j32747L37603J0621j0708
13807I00458m05321L34959q1030K14845l41641j01979K06124J95826j25417J45504
$$ plain form
13877 1167969 1183798 1067647 1142099 1063608 870745 1471760 1288969 907958 1214237 980336
13867 980336 1191706 1416944 1095496 1106971 1338087 1379094 772670 1029090 1289439 1380412
13857 1380412 1032807 947678 1106675 1222014 1421392 1224850 1173435 918389 1001226 976731
13847 976731 933094 1156481 920654 1206933 855773 1024369 1284793 729894 1008495 878853
13837 878853 1083571 868818 1063111 931224 1085662 1114963 750721 851625 1017305 942534
13827 942534 1037337 700542 959326 829261 952846 793544 911853 1007885 533679 613622
13817 613622 741669 578692 1034698 912621 869349 695689 562942 900545 911166 900458
13807 900458 495137 830096 749066 963911 622270 520291 726415 922241 796824 942328
13797I42328k80385M48973D58114L07477k33822L21510j32104j1634o6666o3978
13787E78897K58636N9440k77868K54495k21209p1224R321J83731l46775K83196
13777G10640l3965K58740k08731j027r853j87707M965O1130L8785N3648j49842
13766E36783K46920n0330j75981K39870l8807L90787n39317B78779K13029K24034
13756G15842C54818J17435L70521k73485p8286N9463L17847j50982L2707l41841
13746D08197P3502J74K56916l41324K55096j28355J65749j59862J75752k7208
13736F78637l25004J41403k11878M44790j11742B56072K88854j68261J25202J53312
13726F55179Q6554k33766j22405M3102L19847k42716r544K41430k97190M89981
$$ plain form
13797 942328 661943 1110916 458114 765591 531769 853279 721175 709541 642875 578897
13787 578897 837533 896973 619105 873600 652391 581167 590488 774219 427444 710640
13777 710640 676675 935415 726684 725657 715804 528097 533062 594192 632977 686625 536783
13766 536783 783703 733373 557392 797262 758455 1149242 609925 278779 491808 715842
13756 715842 354818 472253 842774 569289 491003 550466 868313 717331 750038 408197
13746 408197 481699 481873 738789 397465 652561 524206 689955 530093 705845 678637
13736 678637 353633 495036 283158 727948 616206 256072 544926 376665 501867 655179
13726 655179 741733 507967 385562 428664 748511 505795 496251 737681 440491 930472
13716I30472k12607K10434D32593R2126O1067j0414N6052C04343A26074L22916
13706D48990m8356n4328L74353q1928k68280J47820j53792K6043L15920l27261
13696C79181K10138R141B11250N32984k03010J19330p4058B47849M0037L52684
13686F40570l03944J83964J10219B97346N5009q9170A07438M66830m9083J81694
13676G06879k87406P9877k31144K64353j52050j04796M19576k19665J07538B03460
13665D51499L8506k5433A16881J40805L07231B50472L06416B18681K96359j04567
13655D10473J88478j39105k1018n4270j48213M02960k0174k1234J47670k86271
13645D59296G444M53081j4055M1179n1820A22958L63651A96189M38070k28984
$$ plain form
13716 930472 717865 928299 432593 524719 585786 575372 631424 304343 126074 448990
13706 448990 400634 346306 720659 638731 370451 518271 364479 390522 706442 379181
13696 379181 589319 598460 211250 744234 541224 660554 586496 247849 287886 640570
13686 640570 336626 520590 630809 297346 352355 263185 107438 574268 525185 706879
13676 706879 419473 499350 268206 532559 380509 275713 695289 475624 583162 203460
13665 451499 490005 464572 116881 257686 564917 250472 556888 218681 515040 410473
13655 410473 598951 459846 438828 384558 236345 639305 619131 597897 745567 459296
13645 459296 7444 460525 446470 487649 435829 122958 486609 196189 634259 405275
13635D05275p4987J69758J3227j32010K05484r0957j42200A20336L08357K04904
13625F33597k38387A45129J92530O4168J48759o432o9242j26781k0532Q5627j23632
13614B89594K03068j543j11132K466A89216J32243A01156J2720L60317r1419k4529
13603C58245K0636R8921I9353j3679L60668k16324n86A8699K34976j792J35000
13592C86883l4234N7219B04082J807L35707M276j20371A04707L24791A03157M34712
13581E37869A61999J87018L791o5083L49646l07359G6007J11492m8201K79384
13571D18682E2258L39992k7363P9760j86211J46443o4455F8708K53532n097J59456
13560D76599a76579e892C70789k450j30380g954D63657j59335j06132K22258E0563
$$ plain form
13635 405275 330288 500046 513273 381263 586747 495790 353590 120336 428693 633597
13625 633597 395210 145129 337659 401827 550586 544154 474912 348131 327599 413226 289594
13614 289594 492662 491119 379987 382453 189216 321459 101156 113876 474193 382774 358245
13603 358245 378881 477802 99353 85674 446342 230018 229432 18699 253675 251883 386883
13592 386883 352649 409868 204082 205889 541596 545872 425501 104707 429498 103157 537869
13581 537869 161999 349017 352808 287725 637371 330012 76007 187499 139298 418682
13571 418682 52258 392250 364887 444647 258436 404879 340424 68708 322240 317143 476599
13560 476599 -176579 -5892 370789 368339 237959 -7954 463657 304322 198190 420448 50563
13548E05842k23598k542R0792K01652p3662J4520A30894O6200J28449p0992J8320
13537B72871J8475K50935K97322B77464J71157B20769J32506j57379J81586A83906
13526B36692I2208K58482j61824K4660I2943N3845J23899k6141J93582J15861
13516E53989a88696B83121o0658J59479K5921I2158K67802A76017n3392K02503
13506C25128j59567J49013j34839j4522K26168M6570k12698N2815A02910J58266
13496B61176e4662A35848L6141N5479c0517F82326B90317L5440d1979n5247I7000
13484g4091F64864B61871N1832O6265F4744K61180C2079M81989A72189L73299
13474E45488j67175j69384p7922J67592R2565A63199J77564M7029j09810h2633
$$ plain form
13548 505842 282244 279702 370494 572146 498484 513004 130894 197094 325543 254551 272871
13537 272871 291346 542281 839603 277464 448621 220769 353275 195896 377482 183906
13526 236692 92208 350690 188866 213526 92943 146788 270687 244546 438128 553989
13516 553989 -188696 283121 222463 381942 407863 92158 359960 176017 122625 325128
13506 325128 165561 314574 179735 165213 391381 437951 225253 278068 102910 261176
13496 261176 -54662 135848 171989 227468 -30517 682326 290317 325757 -41979 -97226 97000
13484 -74091 664864 261871 313703 379968 64744 325924 32079 514068 172189 545488
13474 545488 378313 208929 131007 298599 391164 163199 340763 387792 277982 -82633
13463b7929D04785j0713j13197a53741B68219h7348A51330A6503i4371D90093
13452B14219L17277k38253p7784J73442g9475A93574J07415A3456K64200G9298
13441C02285A23599L27957L3261j80548o0031N3299R8261e5416B85787m764O9992
13430C51015j33564O1995J52660a21401D94539A77756C3273J99161N3328O1791
13420C47553j59640K7888l3974d20448B6985a3579C17626l2294F4674K82902c0467
13408C19079A4692P1811Q048J30945q7704R8794l7679K14965L1731B8300M45246
13397D73546b91658D8661J81219J53660h791j6887C59197b62011F2857e1595Q735
13386d2860J9948B01469J18808b3166B06913J05784j17513a6657B88247K02657
$$ plain form
13463 -27929 404785 394072 280875 -153741 268219 -87348 151330 16503 -94371 490093
13452 214219 531496 293243 215459 388901 -79475 193574 300989 13456 277656 79298
13441 302285 123599 451556 484817 304269 244238 297537 395798 -55416 285787 281023 351015
13430 351015 217451 279446 432106 -121401 494539 177756 33273 232434 285762 347553
13420 347553 187913 215801 181827 -420448 26985 -13579 317626 285332 64674 347576 -30467
13408 319079 14692 86503 94551 225496 137792 236586 198907 413872 445603 28300 473546
13397 473546 -291658 48661 229880 383540 -8791 -25678 359197 -262011 62857 -51595 -42860
13386 -42860 -22912 201469 320277 -23166 206913 312697 195184 -16657 288247 490904
13376D90904A72425J19516j07096G642Q2580a11156A23233R4822N9024r9546M03316
13365E80849A27270j3366M88902k99807a28554B57351n9070K00541A58492L0244
13355A88736L380J03831B0122i5387B28592B5635K71613M8723K3886A28119B4946
13343A08370J03260F1809k8051J89617L79647m1952L8031A78403L6406H0053Q6518
13332A66571K23741E2593d6723A76106J37999L06888F2313K11692A1957P4764
13322H6721K10715g7375B90487J7091G571G52L47470j12014n6556R2609j04795
13311A67466n0325m9460J14737b50004C40255R6938B13540L98683B21481l4612
13301A86869J63366r6961h7262c9636B86607E028J7191J12826E6470J7572K10347
$$ plain form
13376 490904 172425 291941 184845 7642 90222 -111156 123233 218055 277079 177533 580849
13365 580849 127270 113904 602806 302999 -128554 257351 198281 398822 158492 188736
13355 188736 192116 295947 20122 -95387 228592 25635 297248 345971 369857 128119 24946
13343 108370 211630 61809 33758 223375 603022 561070 599101 178403 214809 80053 166571
13332 166571 390312 52593 -46723 176106 314105 620993 62313 274005 11957 86721
13322 86721 297436 -77375 290487 307578 7571 752 348222 236208 179652 272261 167466
13311 167466 117141 67681 182418 -250004 340255 437193 213540 612223 221481 186869
13301 186869 350235 253274 -87262 -39636 286607 5028 22219 135045 56470 74042 284389
13290B84389b11272A7508J41141R822B3147P0877c867A06121a83370A34278K51435
13279C85713b0857p7197A55590O5086C8166M28781a31075e1862i007q5241A74801
13267D29897O8106a4845n4484B42483a2576A27759K10318j33833a18951D3970
13256a43660B5566a33863C6385J97693r2144L25231B03677a21480B82337A29926
13245B4910O0358J02741L44311j11458c6565E4275J39680a10214J9389E0125J80592
13234B30717j3443q0883h178C56470D5668e9685m663A04965K3144n2110i1667
13222a77193c2957A21429I537J69270k3811a41683B09317M0218q8404a14258A34573
13210a73925A46668A2891a88270B133J29360J13392o2691p7551P584g7551A26583
$$ plain form
13290 284389 -211272 17508 158649 168471 23147 94024 -3867 106121 -183370 134278 385713
13279 385713 -20857 -98054 155590 220676 38166 466947 -131075 -51862 -9007 -94248 174801
13267 429897 498003 -14845 -69329 242483 -12576 127759 338077 204244 -118951 43970
13256 -143660 25566 -133863 36385 234078 141934 467165 203677 -121480 282337 129926
13245 24910 85268 188009 532320 420862 -36565 54275 193955 -110214 -90825 50125 230717
13234 230717 217274 136391 -8178 356470 45668 -59685 -64348 104965 128109 75999 -91667
13222 -177193 -32957 121429 9537 178807 154996 -141683 209317 249535 161131 -114258 134573
13210 -173925 146668 12891 -188270 2133 131493 244885 182194 104643 112227 -77551 126583
13198A62510R332C3245g4491H5894i0160c516I5843J4289J66951r3300a22801
13186b1291A85578b07374A65026c3686F1484K65457i7029M6344k0139B12337C2067
13174A68569A1071L29719d5953C691L2844K387A4957a91845M5902A87329K55248
13163D42577b04082G5916L2429K44665a48043A25714K7005J1309K1365H29J8848
13152A9677O3903e7721j64196e6804I4855a09849M2587A91847r3410K9622l0336
13141I7723k6823N729d4434H2710A8572f119D92366b28404J02071H7000a762m7180
13129d8942m741D7183a23225B49950f5769I8484L4927d6481A24916D3430b28847
13117B04045a20308C0416K20831l013c07891A23304J22465a6831A9950J19104
$$ plain form
13198 162510 171842 33245 -74491 85894 -90160 -3516 95843 110132 277083 183783 -122801
13186 -21291 185578 -207374 165026 -33686 61484 326941 -97029 -50685 -70824 212337 32067
13174 168569 11071 340790 -45953 3691 36535 38922 14957 -191845 -145943 187329 442577
13163 442577 -204082 75916 108345 353010 -148043 125714 152719 164028 185393 829 19677
13152 19677 83580 -57721 -221917 -56804 94855 -109849 -67262 191847 98437 128059 97723
13141 97723 70900 76629 -44434 82710 18572 -6119 492366 -228404 -126333 87000 -1762 -48942
13129 -48942 -53683 47183 -123225 249950 -65769 98484 133411 -46481 124916 43430 -228847
13117 204045 -120308 30416 251247 248234 -307891 123304 245769 -16831 19950 139054
13107A39054B8189K51775i086I7673Q2760L1099Q8070a02712I4282b03707B13995
13095i1092k37424B45819q7968k0879K16710C6755J34881O2481J06435j29719
13085B10833a78739k1971E1313B4763J2422J05662d7801A5843b38173A72330c5847
13073A71377E2658a45250A71694R3672H3796J77345A12451D9055J56669O3530
13063B69254N9755g141C29320o9657i2081E0554K92917c5743k6090j54802A79599
13051A11186J65798b22100A79118K43486E2164a09277k358B6372K37205a56103
13040a16728M5719A37309K09257j19956C6538M17047j79694e9774A14295j7925
13030I6370r022J85516E9183L81647F2545a14084A51003D2156q911b43536R9396
$$ plain form
13107 139054 28189 279964 -9086 97673 180433 211532 299602 -102712 94282 -203707 213995
13095 -91092 -328516 245819 157851 136972 353682 36755 171636 234117 340552 210833
13085 210833 -178739 -200710 51313 24763 37185 142847 -47801 15843 -238173 172330 -35847
13073 171377 52658 -145250 171694 265366 83796 261141 112451 49055 205724 269254
13063 269254 329009 -7141 329320 259663 -92081 50554 343471 -35743 -61833 -216635 179599
13051 111186 276984 -222100 179118 422604 52164 -109277 -111635 26372 263577 -156103
13040 -116728 -71009 137309 346566 226610 36538 453585 273891 -59774 114295 96370
13030 96370 87348 272864 59183 440830 62545 -114084 151003 42156 33245 -243536 -144140
13019a44140A1783J13642O8364o3200f6984B4911K54098O9121c36094h4456j0684
13008i5140b3104A6668a96480N7573C29385A17077C8843g4855B40652F1475a22352
12996C30059H6771D1323J64858M0638a61938h006q9119j68325E328K88337d9033
12984H5691c9180k1802k6935F6432b11433m2538j0782A72307J3634a97530C77205
12972a77942L0284E1624a94884A59826K14451d2973A18582O5446J38729I2062
12961i8902j9451C72398a51783E16298B16534A02581l5682J47220d84571A3319
12950i2138B58108a2695G0936j407d2594p8757A82589F8149J51550b23142A17071
12938H4949a63825a2571A88874H3903J50869g7251k69677b5690d881C54436B744
$$ plain form
13019 -144140 11783 125425 193789 130589 -66984 24911 279009 348130 -336094 -84456 -95140
13008 -95140 -23104 16668 -196480 -138907 329385 117077 38843 -74855 240652 61475 -122352
12996 330059 86771 41323 206181 246819 -161938 -8006 -97125 -265450 5328 293665 -49033
12984 85691 -39180 -60982 -87917 66432 -211433 -253971 -264753 172307 185941 -197530 377205
12972 -177942 -147658 51624 -194884 159826 374277 -42973 118582 184028 322757 92062
12961 -98902 -118353 372398 -151783 516298 216534 102581 66899 214119 -484571 13319
12950 -92138 258108 -12695 70936 69529 -42594 -121351 182589 68149 219699 -223142 117071
12938 84949 -163825 -12571 188874 83903 234772 -77251 -346928 -25690 -4881 354436 2744
12926b84458A92549h3649H631f0726I1742O5537J16596b2553n6297n33193d9463
12914I8959b13133R6471B22504j06442E2388L57223j08537G4569R2453k1069L2726
12903A78679o2676J46239D3234j726c27544F0877P7563M3568H5468a18949D8943
12891A63716k3735M2064I0816L0443E0592J60415B0856a30394K7132m9853H8389
12879A03326a89146L1565M7155L8123A40488N754c23338a50575k9888g6102E9938
12867g9311B01440F7148b60122A88385a72330j9304A67190f2225A65984p5502
12857I0482G731J2188C421L48248A7113J40323c7934G6362a04596A390e1582B08520
12844c1799D2349M2974A0857c4374B7341k03c27954D6959R5027B9362E244L40617
$$ plain form
12926 -284458 192549 -83649 8631 -60726 91742 157279 273875 -22553 -78850 -612043 -49463
12914 98959 -213133 -116662 222504 116062 52388 409611 301074 74569 167022 145953 178679
12903 178679 116003 262242 43234 41508 -327544 60877 138440 182008 85468 -118949 48943
12891 163716 139981 182045 90816 121259 50592 211007 20856 -130394 -103262 -153115 88389
12879 103326 -189146 -157581 -110426 -72303 140488 146242 -323338 -150575 -180463 -76102 59938
12867 -79311 201440 67148 -260122 188385 -172330 -191634 167190 -62225 165984 90482
12857 90482 7731 19919 3421 351669 17113 157436 -37934 76362 -104596 1390 -51582 208520
12844 -31799 42349 85323 10857 -34374 27341 27138 -327954 46959 141986 29362 5244 345861
12832C45861d718A09459j0993b94698A57740k2835r279K43357d6926I1335d0302
12820A64805K1828b18938j01746D0367N9700D9586f4915C672J75298c1051j9949
12809e1000J1373E286K05964b2011m2652C46492a29678I8671g4916B24833P7a54407
12796b34969n7698a32249k0673G1408n181a33698A28461n8369M1438Q6406g2536
12784A96638g7615B62031j12885b86764b1063D7823K08781a33277N6578p634p6484
12773a60817P284A24022j0648a68748e4461j22817A97576B715J54917B7209P9763
12762A06972d7140B6763M328M0559a6000C32232b45579A33835b01983B4083a12271
12750A51615h045B75640G4472c0199F479J96489j1190r1450B2611a41910a6928
$$ plain form
12832 345861 -4718 109459 98466 -294698 157740 134905 125626 368983 -46926 91335 -40302
12820 164805 186633 -218938 -320684 40367 100067 49586 -64915 3672 178970 -31051 -51000
12809 -51000 -39627 5286 211250 -22011 -64663 346492 -129678 98671 -74916 224833 224910 -154407
12796 -234969 -292667 -132249 -152922 71408 66227 -133698 128461 70092 111530 197936 -72536
12784 196638 -77615 262031 149146 -286764 -21063 47823 256604 -133277 -76699 -84333 -160817
12773 -160817 -153533 124022 113374 -168748 -54461 -177278 197576 2715 157632 27209 106972
12762 106972 -47140 26763 31091 71650 -16000 332232 -245579 133835 -201983 24083 -112271
12750 151615 -8045 275640 74472 -30199 6479 202968 191778 100328 22611 -141910 -16928
12738A11617c21024h0740b648D8952a29084D36617k12522i4563M5599B3766c4023
12726G0388b26154A10144a35315B04008a931C50255C6667a45911f297G4256K65294
12715C39550B4529b6558B05266a13660A88066J49161j61531L75917B16136J35387
12705C51523K9582A79291j0633G6177O9780h079q2815A40576i0698B0936d9993
12693b39150j24052J66430r3366C8443j6063J44088b11288l7857e7728A3229a2388
12681G5118J41549n5473K00392A2342N6475E980L4765J98684B7946J55446A5841
12669i5539C87920q6293G3099L193a0579j88794F2951D141J55056a49752A83227
12657A94331G5493P9293J0890C5672J99535C899a87236L3061A2642J70782k1911
$$ plain form
12738 111617 -321024 -80740 -2648 48952 -129084 436617 224095 -94563 -48964 23766 -34023
12726 70388 -226154 110144 -135315 204008 -1931 350255 36667 -145911 -6297 74256 339550
12715 339550 24529 -26558 205266 -113660 188066 337227 175696 551613 216136 351523
12705 351523 381105 179291 168658 76177 145957 -8079 -90894 140576 -90698 20936 -49993
12693 -239150 -363202 -196772 -290138 38443 22380 166468 -211288 -249145 -57728 13229 -12388
12681 75118 216667 161194 361586 12342 68817 5980 40745 239429 27946 183392 15841
12669 -95539 387920 301627 73099 76292 -10579 -199373 62951 4141 159197 -149752 183227
12657 194331 75493 154786 165676 35672 235207 3899 -187236 -154175 12642 183424 161513
12646A61513b9703j54379h2012q6324B6756A0545f2840F2863a99179g7960B29462
12634A63903o0450J61897I3541h878C57254b1385G6564P8233K418a57108D1664
12622a41603B35535a26988A35773a36660B05066J03622A17700J47534a69649A34224
12611A90853i2249B5745e8162A75361a26939C2005e972n6096B17827j04424b05467
12599B19805K0574c7763A22745D1177r256g7716A62885C17M25673C6269e1714
12587a34689k50625D1405J43778K0926A6794i8398B30204H0250Q7982d3546a5895
12575a39375a3590k17194B19657B9540J49252e4876C05389E2169n264K60708c04069
12563A32620r630j3824D0657O8663c6704H083J96591l5746G8484b89229A20326
$$ plain form
12646 161513 -29703 -184082 -82012 -168336 26756 10545 -62840 62863 -199179 -77960 229462
12634 163903 103453 265350 93541 -8878 357254 -21385 76564 154797 157215 -157108 41664
12622 -141603 235535 -126988 135773 -136660 205066 308688 117700 265234 -169649 134224
12611 190853 -92249 25745 -58162 175361 -126939 32005 -5972 -62068 217827 113403 -205467
12599 219805 240379 -37763 122745 41177 31921 -77716 162885 317 425990 36269 -51714
12587 -134689 -385314 41405 185183 206109 16794 -98398 230204 80250 168232 -43546 -15895
12575 -139375 -13590 -230784 219657 29540 178792 -54876 305389 52169 46905 307613 -304069
12563 132620 122990 109166 40657 109320 -36704 8083 204674 168928 78484 -289229 120326
12551a04667o017H2077K62860i1582M1336j31547d7113m9262j50745c8998l9346
12540g8344j88429f2378j81641A43937b5865j50322D2345e1069D9331e9089b2969
12528D674P3539h0916A91155A7044i2696C676a53736d0711I6564k2092a22377
12516C02323A44731E9933R6729j7683E4150O9848a67130c1314A11554e2346A57783
12504b81647c098C57677b8350j04771A77875C378a10045A05705l5456B92K51509
12493B51801H8819e2582b2017C37088d85q7550A00000c22483A15525a52487A07536
12481b7973A43184a96772c1890A67209a05133L8212j49834C9999J55230b0161
12470i5102B10042a5795C1178a26947p3138B14252I0084b25350i5348c6884k00516
$$ plain form
12551 -104667 -110684 82077 344937 -91582 -50246 -181793 -47113 -96375 -247120 -38998 -78344
12540 -78344 -266773 -62378 -244019 143937 -25865 -176187 42345 -51069 49331 -59089 -22969
12528 4674 78213 -80916 191155 17044 -92696 3676 -153736 -40711 96564 74472 -122377
12516 302323 144731 59933 156662 138979 54150 123998 -167130 -31314 111554 -52346 157783
12504 -281647 -3098 357677 -28350 -133121 177875 3378 -110045 105705 70249 292 251801
12493 251801 88819 -52582 -22017 337088 -485 -88035 100000 -322483 115525 -152487 107536
12481 -27973 143184 -196772 -31890 167209 -105133 -66921 -216755 39999 195229 -20161
12470 -95102 210042 -15795 31178 -126947 -200085 214252 90084 -225350 -95348 -36884 -237400
12459b37400E8308O93D811a56878A22309d4956K0337l7961m3525R721B37J546
12447A783J8441a05068G1566a47156e29j62037n7130B65602H6092Q2087a24990
12435B2366i5882G1508a03498M5636n6285B47233a65956p8486k7298I7803H171
12423a25065A18663a21064A50301K9642b6733B56213C8663J9791B3196o940g8934
12411B57678h3968A7823b21968A81954H5113a5900E3839a05008F428N5549a3398
12399D3678n482b61021J06266K6836c4977j32500B7923Q5307K7575a06638C50849
12387A87964R5643a25862B55474f3416F4977j4305K6780J95143j02674L956b8011
12375b3376k31203A03419m30J83984r8388g0387p8808L1523A7228a08492n7560
$$ plain form
12459 -237400 58308 59001 4811 -156878 122309 -44956 -24619 -62580 -106105 -96384 237 1783
12447 1783 20224 -105068 71566 -147156 -529 -162566 -219696 265602 86092 168179 -124990
12435 22366 -95882 71508 -103498 -57862 -114147 247233 -165956 -244442 -271740 97803 8171
12423 -125065 118663 -121064 150301 179943 -26733 256213 38663 58454 23196 16256 -78934
12411 257678 -83968 17823 -221968 181954 85113 -15900 53839 -105008 6428 61977 -13398
12399 43678 38196 -261021 -154755 -127919 -34977 -167477 27923 113230 140805 -106638 350849
12387 187964 283607 -125862 255474 -63416 64977 50672 77452 272595 169921 173877 -28011
12375 -23376 -254579 103419 102989 286973 188585 -70387 -149195 -117672 17228 -108492 -166052
12364a66052l09618D9136d4292j01457j79748a49860j4312I1754a09405E32306
12353I6947B9246a32669B33371c34304B4261K02340a74588A34862J01499a04085
12342a98094R0416j91189m1891A13223i7563I253K31896a22733B2005L3085A5286
12330A64122j8136c22062C8739i3327k05806A66981a29424K3125r4228A48774
12319C3846L0400e4538A5011c25969B08198B1225a01508j39704e4032I2262h2844
12307a87959j33964B05425b42009H144b54551A55803a12759n51A53686b28988
12296b48864f5243A93799a84311A26913N3191j1865L825e1321B43519e1105H1971
12284C97572q3548A29585R9166g891B08004b952A26443J19006K99913N9250A06415
$$ plain form
12364 -166052 -475670 49136 -44292 -145749 -325497 -149860 -164172 91754 -109405 532306
12353 96947 29246 -132669 233371 -334304 24261 226601 -174588 134862 236361 -104085
12342 -198094 -107678 -298867 -340758 113223 -97563 9253 241149 -122733 22005 55090 15286
12330 164122 145986 -322062 38739 -93327 -299133 166981 -129424 -106299 -200527 148774
12319 33846 64246 -54538 15011 -325969 208198 21225 -101508 -241212 -54032 92262 -82844
12307 -187959 -321923 205425 -242009 8144 -254551 155803 -112759 -113310 153686 -228988
12296 -248864 -65243 193799 -184311 126913 180104 168239 172064 -51321 243519 -51105 81971
12284 397572 314024 129585 228751 -7891 208004 -2952 126443 245449 545362 604612 106415
12272A05717K48351j76186b0686E2021J23365b19688C26222n819A5450J25750
12262A41200m7099L4569F375h1543j999C51367I7885P5148J24829A21937C2960
12250a31343m5332C11371I0146a8693F2863a17058E8157c21717c620B77921M9223
12239C27144b413j3230E693a26419C22102E8786J08943E592a47284b172B80213
12227B13938J94135J65058j61621A59152K6449K86653A96831K6687L40405k41231
12217C22692a11083B51571J91605A68656K587Q4394A08749j5440b02996B25648
12206e6610E6721L2058J63506q9990g852o13j61151D17988F1111K11939J19433
12195C92483j79750n5667p2895l255L52004a07646A40625H061J2121P3190h5159
$$ plain form
12272 105717 354068 177882 -20686 52021 175386 -219688 326222 320403 15450 141200
12262 141200 94101 128670 6375 -81543 -83542 351367 97885 173033 297862 121937 32960
12250 -131343 -176675 311371 90146 -18693 62863 -117058 58157 -321717 -3620 277921 327144
12239 327144 -2413 -15643 5693 -126419 322102 58786 167729 5592 -147284 -2172 280213
12227 213938 408073 573131 411510 159152 185601 472254 196831 223518 563923 322692
12217 322692 -111083 251571 443176 168656 171243 255637 108749 93309 -202996 225648
12206 -56610 56721 88779 252285 162295 -7852 -8465 -169616 417988 61111 273050 392483
12195 392483 212733 157066 84171 80916 432920 -107646 140625 8061 20182 93372 -85159
12183A58163c6803A35683K15761N6379C5425J61703d9858a7195H6679O8595L2321
12172A87595i916B49607D000L78348a09571D67241A93378J24308A34804j72a63735
12160b35956M009b3141j01855B9904d3297k5919A5232b59449c178I5008N4024
12149A49032M9057D9697M2084h2058A06899i1299A23881a60732D8732c1091B91009
12137A01156m5280J67493A08816m053L33491I0973O0575k844l7566E2901b13159
12125B04553b4065I8163R8924A3710K5843J62803d911k13865A59485P1590a29221
12113a33837J6953A85856N5905o978D6719b1544C4024a7733k07960C9414c206
12101c71546d8534E42511H1651d5987C37210h0915A13786j7094l5401b18551B37892
$$ plain form
12183 158163 -36803 135683 351444 407823 35425 197128 -49858 -17195 86679 155274 187595
12172 187595 -9916 249607 4000 382348 -109571 467241 193378 317686 134804 134632 -163735
12160 -235956 -231947 -23141 -124996 29904 -43297 -69216 15232 -259449 -3178 95008 149032
12149 149032 198089 49697 91781 -82058 106899 -91299 123881 -160732 48732 -31091 291009
12137 101156 55876 223369 108816 104763 438254 90973 151548 148704 111138 52901 -213159
12125 204553 -24065 98163 197087 13710 39553 202356 -4911 -218776 159485 231075 -129221
12113 -133837 -116884 185856 241761 234783 46719 -21544 34024 -17733 -225693 39414 -3206
12101 -371546 -48534 542511 81651 -45987 337210 -80915 113786 96692 61291 -218551 237892
12089D1204J04028a67727g2197H3321K11167A34221a97616k27429i5681D8449
12078E66519J64775J060106m68634C77612j87414P9474p1055h2076C4047J67608
12068B01655G8413g722A2304J98564C890b48441d3350J6057B816J48917b04355
12056a29256A35894a53116J2775G7628b44892B26802L4365f2201l1528G0248a4491
12044h4295n8824g1154B18650L9004B7349K8116A5343a10170A56958n8266G407
12032a97952B11993A04658B2445c7672Q778k44153A68790a05623l5876H539J84231
12021A92770N6979c22661E5499L1855J05540J8953B2250J18534D2954K51422a47170
12009B06864d01242A71297C4074g8649B15081a56162C8858h4153g818o186B31892
$$ plain form
12089 41204 145232 -167727 -72197 83321 294488 134221 -197616 -425045 -95681 48449
12078 566519 731294 1791400 1322766 377612 190198 269672 198617 -82076 34047 201655
12068 201655 78413 -7722 12304 210868 3890 -248441 -43350 -27293 2816 151733 -204355
12056 -129256 135894 -153116 -140341 77628 -244892 226802 261167 -62201 -93729 70248 -14491
12044 -84295 -143119 -71154 218650 257654 27349 55465 15343 -110170 156958 98692 7407
12032 -197952 211993 104658 22445 -37672 -28894 -273047 168790 -105623 -141499 8539 192770
12021 192770 249749 -322661 55499 87354 192894 211847 22250 140784 42954 294376 -147170
12009 206864 -401242 171297 34074 -78649 215081 -156162 38858 -84153 -7818 -14004 231892
11997A9749R8144O7095G5699a8301A74658i5994C30018I0529c12068M5201A23030
11985c99928a90390j5140c208m3430l4310I6616a37178K0439c1795A14154M702
11974A18856J0084b95807P5008B3908K7464O8566J5303o5278c98688E4396c14024
11962g2865J2543E0752B21c3952j3386n2555I7484K7768a58150A59623k7692O6358
11950A98289c90655E3747O8935J57056f7980A42198b30026q499m2925a12479g122
11938b23638B2142N9741c28331C3720J9215L99272A79750a85452B26654c7879
11927b2093r7480F1309b81982k3949J46109N2628j23290N5321N6317l10544a91328
11915B33658j06384m4428a36974A03576J221c9281j53901c6431F518K32569c6758
$$ plain form
11997 19749 117893 184988 75699 -18301 174658 -95994 330018 90529 -312068 -266867 123030
11985 -399928 -190390 -205530 -3208 -46638 -80948 96616 -137178 -116739 -31795 114154 118856
11974 118856 128940 -295807 -220799 23908 51372 119938 135241 69963 -398688 54396 -314024
11962 -72865 -60322 50752 221 -33952 -47338 -99893 97484 125252 -158150 159623 131931 198289
11950 198289 -390655 53747 122682 279738 -67980 142198 -230026 -238525 -281450 -112479 -7122
11938 -223638 22142 81883 -328331 33720 52935 452207 179750 -185452 226654 -37879
11927 -22093 -119573 61309 -281982 -305931 -159822 -107194 -230484 -175163 -118846 -429390 -191328
11915 233658 127274 82846 -136974 103576 104797 -39281 -193182 -36431 6518 239087 -36758
11903c13299G891N7811J87863j15135m8733e5605j20673b6351q8343A11074a5399
11891a96040b1912C5873a19832K7457B77881f3824A59445d4617J8308j40429j1598
11880a78336H0675c86522c5941H8636N4526a32768B68943c3076j79204P0752k97269
11869d38797r9108a49535l3310A67358J59945b09400J1589E7826O5959b07942
11858C5441b85019F1068K00014F2033a5730j21613a6863n1639r7351c1616j95755
11847b27371D6856a48121D5854J26397a40088j86793F4816L0091a40840A67775
11836D8453i276p5452I0267k4004A746R4709g3352q7376j91766h6236J0720I735
11823B164c11624A3858N1751A9940c50458B05065a97467f0431Q312m1281j7059
$$ plain form
11903 -313299 7891 65702 253565 138430 89697 -55605 -176278 -26351 -114694 111074 -15399
11891 -196040 -21912 35873 -119832 -92375 277881 -63824 159445 -44617 -26309 -166738 -178336
11880 -178336 80675 -386522 -35941 88636 143162 -132768 268943 -33076 -212280 -141528 -438797
11869 -438797 -537905 -149535 -182845 167358 327303 -209400 -197811 57826 123785 -207942
11858 35441 -285019 61068 261082 62033 -15730 -137343 -16863 -68502 -165853 -31616 -227371
11847 -227371 46856 -148121 45854 172251 -140088 -326881 64816 94907 -140840 167775
11836 48453 -9276 -84728 90267 66263 1746 96455 -73352 -160728 -352494 -86236 -75516 9735
11823 2164 -311624 13858 65609 19940 -350458 205065 -197467 -60431 -52119 -93400 -110459
11812a10459d7938j16084A41486F0527k6199n031c9280g598k52807J24495K3333
11801a12577a9249B17008G6741d46018i1675j05797a5830A8365J55559m5875B730
11789F8076C1686J24215A3526a72451A70446N5465g6758A69945e7384A32988G926
11777A72867b59301G9170J12590a94653L9167F2776B6794b2823A24335B5317O97
11766B6014M1043P0366B3867K2709K85427A06030a52031A57113c2131B5978a20209
11754a99201C0051f2068B41241A3450b09010B1665K42356o1491a10387M6726A0883
11742b4112k70606C09002G5399b44488B57479a43320d9482A10844M5814a17163
11731b4505E9275e6514j45184g9993j09540A06292K1262l880b2316k24371A32208
$$ plain form
11812 -110459 -47938 -164022 141486 60527 34328 29297 -39280 -7598 -260405 -135910 -112577
11801 -112577 -19249 217008 76741 -446018 -91675 -197472 -15830 18365 173924 128049 2730
11789 68076 31686 155901 13526 -172451 170446 225911 -76758 169945 -57384 132988 7926
11777 172867 -259301 79170 191760 -194653 -155486 62776 26794 -22823 124335 25317 26014
11766 26014 67057 137423 23867 46576 332003 106030 -152031 157113 -32131 25978 -120209
11754 -199201 30051 -62068 241241 13450 -209010 21665 264021 202530 -110387 -63661 10883
11742 -24112 -294718 309002 75399 -244488 257479 -143320 -49482 110844 156658 -117163
11731 -24505 59275 -56514 -201698 -79993 -189533 106292 127554 123674 -22316 -246687 132208
11719I5013A9949K30314A9495a53412a1802B06281d50011a57812g0599A72162
11708B71728a5612f494k46446A72209c4105D9154Q9634i8537B40425Q0396e5322
11696B59585c9904D2190J43998c42939G6319K98295a09421B87747c378A83763
11685d0222j83258f0684j31292N3431D25321A52580E8270k11o431g937H6718i4869
11672D7042K73455b03164C49936H8147a06372A30532a59040L7664K2324p814e0807
11660a91872H0540P8420a67777l8745N5071A05619d1535D9798J68216K2163b33845
11648B1362P3494c7935C3222a17239A42044a33801A8832N8773a35386m3283A25650
11636C69395Q2200j05027c37934i0039A93035e1972o2986d2977A52837g1007r496
$$ plain form
11719 95013 19949 250263 19495 -153412 -11802 206281 -450011 -157812 -70599 172162
11708 271728 -15612 -6494 -252940 172209 -34105 49154 138788 -98537 240425 320821 -55322
11696 259585 -39904 42190 186188 -342939 76319 374614 -109421 287747 -3378 183763
11685 -40222 -223480 -60684 -191976 -138545 425321 152580 58270 58059 51628 -7937 86718 -94869
11672 47042 320497 -203164 349936 88147 -106372 130532 -159040 -121376 -99052 -106866 -50807
11660 -191872 80540 158960 -167777 -206522 -151451 105619 -41535 49798 218014 240177 -233845
11648 21362 94856 -37935 33222 -117239 142044 -133801 18832 77605 -135386 -178669 125650
11636 369395 451595 346568 -337934 -90039 193035 -51972 -114958 -42977 152837 -71007 -80503
11625h0503B37746b4128A61849l6806q927b95173b1737n5785n6213C6279Q6035
11614A22314F913L20138j54622o3359e6704C10456j26963A4308a6917r5525k9659
11603a42101D33239A924e253B04804K52638a37491B16022a40848A86881O677c7935
11591A86023K6805q7762J56576m0160o592c54858B75296a32668j24872B9403J03909
11580A33312K3321L621a0811j03464F9442c3394B41988P5175b2897j60356A81242
11568g5181A74809f0261A37460c4236B61191r0851a91311L1397a9963k70423F4412
11556A26020c07747B09135a71343A08002O8799j9406K00892E8274R8119m1155
11546A15238J74615a43297N4277A25639L46313h4424C71975j76614b27347g8522
$$ plain form
11625 -80503 237746 -24128 161849 125043 116116 -295173 -21737 -77522 -133735 36279 122314
11614 122314 6913 327051 172429 109070 -56704 310456 183493 14308 -16917 -112442 -142101
11603 -142101 433239 1924 -5253 204804 457442 -137491 216022 -140848 186881 193558 -37935
11591 186023 212828 125066 281642 241482 234890 -354858 275296 -132668 -257540 29403 133312
11580 133312 156633 160254 -10811 -114275 69442 -33394 241988 317163 -22897 -183253 181242
11568 -75181 174809 -60261 137460 -34236 261191 170340 -191311 -159914 -19963 -290386 64412
11556 126020 -307747 209135 -171343 108002 176801 157395 358287 58274 156393 115238
11546 115238 289853 -143297 -89020 125639 471952 -84424 371975 195361 -227347 -78522
11535A58926K12230A02229J95716h5065A47731J5302J71760b12949A57385N754
11525A63139c0743G5974K61301A40352a3469j35643C9524J97748r1183J8967l2048
11514A33008B4636J71191q901e3760D1386J46433p5399K77857a21845A16901R6169
11503B13070j04706k9296R0046B1772J36601m7906j1984j0264P4887N8340b7868
11491B10490c18365D21708a58888d9244r6547A95483K64694A72606a96576E1937
11480A84970o5127j8503o148K73589g9967j07134B13506A3303L11074G8982J40262
11469B19244k7572M631J7581K5372j06212K77833H6708k1210a73426g1731B82678
11457B76860j03612C9711J04314L8450B5530a69578b2558B22480b27229D34601
$$ plain form
11535 158926 371156 102229 297945 -85065 147731 163033 334793 -212949 157385 163139
11525 163139 -30743 75974 337275 140352 -13469 -149112 39524 237272 146089 165056 133008
11514 133008 24636 195827 186926 -53760 41386 187819 112420 390277 -121845 116901 213070
11503 213070 108364 79068 169114 21772 158373 110467 98483 88219 163106 221446 -27868
11491 210490 -318365 421708 -158888 -49244 -145791 195483 460177 172606 -196576 51937
11480 184970 119843 101340 95192 368781 -79967 -187101 213506 13303 324377 78982 219244
11469 219244 191672 196303 213884 239256 133044 410877 86708 65498 -173426 -71731 282678
11457 276860 173248 39711 144025 182475 25530 -169578 -22558 222480 -227229 434601
11446B2492J12273J8443c8681G6381L71034i4737B21572I5802K45393j03100a09957
11434d1645D1720J02714E7398J0740a16020j99576E3120e0013K1284m037m9029
11423h1795I1141b40061I2716K9312D1288L9611R4353b628A78878A4796c59634
11411B62463c84249F4977J72092a28547B27050L05907b74417B59221h75o6234
11401f7109j0454F0992A962b78075D22481j76918J75501B4532J0480L29970A818
11389i6907k70200a72640B37564b62435n5470B00533D1537G128a08215M9366k6536
11378h5385C02600b8920E8992c54088C6202b84811B87107a64581F894J73935a59619
11366a94612H1241O9615b3332B22299a47885j1600r870H5960c67812A12557m0221
$$ plain form
11446 22492 134765 153208 -38681 76381 447415 -94737 221572 95802 341195 238095 -109957
11434 -41645 41720 144434 57398 68138 -116020 -315596 53120 -50013 -28729 -32766 -81795
11423 -81795 91141 -240061 92716 122028 41288 80899 175252 -2628 178878 14796 -359634
11411 262463 -384249 64977 237069 -128547 227050 532957 -274417 259221 -875 -67109
11401 -67109 -77563 60992 1962 -278075 422481 245563 421064 24532 35012 364982 1818
11389 -96907 -367107 -172640 237564 -262435 -317905 200533 41537 7128 -108215 -58849 -85385
11378 -85385 302600 -28920 58992 -354088 36202 -284811 287107 -164581 6894 180829 -159619
11366 -194612 81241 150856 -23332 222299 -147885 -159485 -169355 85960 -367812 112557 72336
11355G2336L2115a69010B8126i0718k9394M5102l3581J447r3331l3045P8009P0468
11343h5043B9928L3209j448Q9987g0650A67598b1860M359l02081A07654J36236
11332B43890i8863B28223d73353A07556m2488f1867n07635a09704D24383b06288
11321a6763B4696c49811B27538b23921E8914A3340J39887a71285N0945L7679l72036
11310d54697E136a50251r3557Q2643F7918k0030K6218a21128F0203O5103m9900
11299G5406d43443i5452l5429e5169B25404a1729j94195A52246c1195B30728i975
11287a12495b6939k02662f3102k76449C5177a53105k30651A7807g8566D3207b75738
11275a36223o7811c0387k47534R6462Q0619A0007Q4903d28917c4877B2403e6040
$$ plain form
11355 72336 104451 -169010 28126 -90718 -120112 -75010 -108591 -107144 -200475 -233520 -155511 -85043
11343 -85043 29928 63137 61689 151676 -70650 167598 -21860 -17501 -319582 107654 243890
11332 243890 -98863 228223 -473353 107556 65068 -61867 -569502 -109704 424383 -206288
11321 -16763 24696 -349811 227538 -223921 58914 13340 153227 -171285 -120340 -82661 -454697
11310 -454697 5136 -150251 -243808 -161165 67918 47888 74106 -121128 60203 125306 75406
11299 75406 -443443 -95452 -130881 -55169 225404 -11729 -205924 152246 -31195 230728 -9975
11287 -112495 -26939 -229601 -63102 -339551 35177 -153105 -383756 17807 -78566 43207 -275738
11275 -136223 -204034 -30387 -277921 -181459 -100840 10007 94910 -428917 -34877 22403 -56040
11263D65607g2353K9254p2162F3282A981e75886b30442M9832Q777b7178B8350
11251b75715J01363C15987a06272J2418G9199k6575b72228e5358k85708a33603
11240D0843K12702D6026i2013K1411C48878f8387q4059g4857K4882K0974A0321
11228h2563j96685C2348L1953a30155j4184B49047d1894F3759f169n1812A59875
11216A35144A0648P7906b45381N0173h7871j79946I7999M6447F1499a54689q4381
11205b39070B77028O1390a81263C05631d5063m5738k93466f9781H5189a25689
11194B88691a60522Q075j46392J26526n1864n5041h3496A907e4000j5113C8986
11182A73663c83602c616B73182a87281e9112n7603K3816j02764f8297Q284G472
$$ plain form
11263 465607 -72353 -43099 -115261 63282 1981 -575886 -230442 -180610 -171833 -27178 28350
11251 -275715 -174352 315987 -106272 -93854 79199 52624 -272228 -55358 -341066 -133603
11240 40843 253545 46026 -92013 -70602 348878 -68387 -152446 -74857 -49975 -29001 10321
11228 -82563 -279248 32348 64301 -130155 -144339 249047 -41894 63759 -6169 -57981 159875
11216 135144 10648 88554 -245381 -195208 -87871 -267817 97999 144446 61499 -154689 -239070
11205 -239070 277028 338418 -181263 305631 -45063 -90801 -384267 -69781 85189 -125689
11194 288691 -160522 -152447 -298839 -172313 -224177 -279218 -83496 1907 -54000 -69113 38986
11182 173663 -383602 -3616 273182 -187281 -59112 -116715 -92899 -195663 -68297 -60013 7472
11170e2910J2610C07093g6920l6294d8289J5923j9210j00738d6753D65281H7298
11158a53804j0310A28418d3987C31771A59229A229J3835h9268A18977b53737A08597
11146a1351B02721b56033A40017g6799A48141l4960i3416C19199a38900A55025
11135a07270l6278C34489d4049I1335h9691a2738A61147d5305k1507j13245f5778
11123B7457h8637A91189c295k13948G5105B674c356o3911Q051A54186I296i69
11110g3830I6689a56089e7087A44505B0631a31601b8431F4737A6210J82260k2755
11099A75715q1647C2641K60320K34529a13406n3619A06287D2987L26039j63120
11089B05906k33A4238K1694K84155D8713J91780C2905J84836g1603R061D5484
$$ plain form
11170 -52910 -40300 307093 -76920 -113214 -48289 -32366 -51576 -152314 -46753 465281 87298
11158 -153804 -164114 128418 -43987 331771 159229 1229 15064 -89268 118977 -253737 108597
11146 -11351 202721 -256033 140017 -76799 148141 113181 -93416 319199 -138900 155025
11135 -107270 -143548 334489 -44049 91335 -89691 -12738 161147 -45305 -66812 -180057 -65778
11123 27457 -88637 191189 -3295 -217243 75105 2674 -3356 -67267 -59216 154186 9296 -969
11110 -73830 96689 -156089 -57087 144505 20631 -131601 -28431 64737 16210 198470 175715
11099 175715 94068 32641 292961 527490 -113406 -167025 106287 42987 369026 205906
11089 205906 205673 14238 35932 320087 48713 240493 32905 217741 -71603 -62542 45484
11077C14600J13658H7790a709C43454J60404k15442J0758A1846K64902k5521B3893
11065C66291G0947K94428j82674K10641O6632J024K21960k14123Q1346p35m4922
11054E04524O6135L14629D29237j60154O09823l70056K03285P8124K32252l00110
11044G22401J19440j60958K9422k28492P8573R4553k9523K3167K6368j16140j80928
11033C77883N65844D16003R8094j78921K10525J66753l6817k6551J83654k76424
11023E56316q3628J28155j352j97987M4349J65861K36471k87371K36955k41816
11013E55953p3998P2976J21896l7072j2626o5798Q6977l2717R934j15244J77246
11002F87527L37742l54533j99881J06285J90347C26505L85062M0425C66883M84924
$$ plain form
11077 314600 428258 87790 -1709 343454 503858 288416 299174 11846 276748 251227 23893
11065 366291 70947 365375 182701 393342 459974 460998 682958 468835 550181 549446 504524
11054 504524 570659 885288 429237 269083 878906 508850 712135 790259 1022511 722401
11044 722401 841841 680883 710305 481813 560386 654939 625416 648583 674951 558811 377883
11033 377883 943727 416003 514097 335176 545701 712454 675637 649086 832740 556316
11023 556316 472688 600843 599491 401504 445853 611714 848185 560814 797769 555953
11013 555953 481955 554931 676827 639755 627129 561331 648308 615591 625525 510281 687527
11002 687527 1025269 670736 470855 577140 767487 326505 711567 751992 366883 851807
10992H51807q2474j50317K83966j39775r5885p348L34152j46899k4462L15638
10982A138403k87039N6590J14101L71210j1094M05283q8629J06278K33038L34315
10972B372456m562J56131L47199k09475l22808J96361l17255N5097m54909J57098
10962A975333J31686k17491J37284L38600l93330L27106J90232K5476m11784k24034
10952A879078k32932m35352k216j38460k80980C65883J9975j6974j07894K65285
10942E26275J98481l48861p0122I6301a14736B96535h4168H5540a8295A03119
10931B69580F6770J90065F7441N8694a26937C21254i9213j3435A95303a36831
10920C74995j83867P6277D114J78940J50648F4914b6238j59440B94701E1609A3330
$$ plain form
10992 851807 769333 619016 902982 763207 667322 659974 994126 847227 822765 1138403
10982 1138403 851364 907954 1022055 1393265 1382171 1787454 1698825 1805103 2038141 2372456
10972 2372456 2367894 2524025 2871224 2661749 2338941 2535302 2218047 2273144 1818235 1975333
10962 1975333 2107019 1889528 2026812 2365412 1972082 2299188 2489420 2514896 2103112 1879078
10952 1879078 1646146 1210794 1208578 1070118 789138 365883 385858 368884 260990 526275
10942 526275 724756 375895 305773 96301 -114736 296535 -84168 85540 -18295 103119
10931 269580 66770 256835 67441 126135 -126937 321254 -99213 -112648 195303 -136831
10920 374995 191128 267405 4114 183054 333702 64914 -26238 -185678 294701 51609 13330
10908I0484b54011D64348e7851A98319l4474a8769l72640h8782g69o0554k30392
10897b91715D31865e3953A8200p234K24631j3336a49125O0042k13525d5144j1223
10886e6367k8511j49369D0805R737J1733a11217j84114B15392c909j62778N839
10875a60848j24077a26137C35393d8454k89257E5571A0709b46597A5943d3665
10864D02945e146B3610J35959J1151g677k08105J1607A50207R9834G2352a09961
10852b95481O9925B38277a20515K263G4772a95419B34970a04119A69424a36027
10841A19753D0286O8671K23062a28713M7384j46219a05333A15873J95185D5523
10830A33162a23591A77854b17932q8651J00465A05136a02980j13258I7499m146
$$ plain form
10908 90484 -254011 464348 -57851 198319 163845 -18769 -391409 -88782 -769 -61323 -291715
10897 -291715 431865 -53953 18200 10966 235597 222261 -149125 -89083 -302608 -45144 -56367
10886 -56367 -84878 -234247 40805 50542 62275 -111217 -295331 215392 -3909 -166687 -160848
10875 -160848 -284925 -126137 335393 -48454 -337711 55571 10709 -246597 15943 -43665
10864 402945 -5146 23610 159569 170720 -7677 -215782 -204175 150207 250041 72352 -109961
10852 -295481 -225556 238277 -120515 -118252 74772 -195419 234970 -104119 169424 -136027
10841 119753 40286 108957 332019 -128713 -81329 -227548 -105333 115873 311058 45523
10830 133162 -123591 177854 -217932 -306583 -206118 105136 -102980 -216238 97499 93353
10820I3353a80725j42022A680N9899b98079O4656I8619b26275D9787c36591c3217
10808A50782a60418K5804H9717K05226j41879a40958O6869H594a28294p9057O4695
10797a42656A84652f4301j49755k9421a070B09962e6533j65044d9574B1031J97737
10786B18768g9995L732l7279L7469C42633d4653F8610b76266E18561c71197d7965
10774E5793b74696F878J94368a437k62683A7240a57491j13921E1068a5292H6011
10762b13330b2278E3127b32061J03144B15532b51113J16161a6629A26670E7207
10751a53533b6073A70470b31863N4228N58j7384j51582E3468J02081C1553b51510
10739i9729D281N6576c59011J55100A00190k5057c7677D0352j0885a03380a4666
$$ plain form
10820 93353 -180725 -322747 1680 61579 -298079 -233423 98619 -226275 49787 -336591 -33217
10808 150782 -160418 -134614 89717 294943 153064 -140958 -74089 8594 -128294 -207351 -142656
10797 -142656 184652 -64301 -214056 -243477 -1070 209962 -56533 -221577 -49574 21031 218768
10786 218768 -79995 -76263 -113542 -76073 342633 -44653 68610 -276266 518561 -371197 -47965
10774 55793 -274696 6878 201246 -1437 -264120 17240 -157491 -271412 51068 -15292 86011
10762 -213330 -22278 53127 -232061 -128917 215532 -251113 -134952 -16629 126670 57207
10751 -153533 -26073 170470 -231863 -177635 -177077 -194461 -346043 53468 155549 31553 -251510
10739 -99729 4281 60857 -359011 -203911 100190 75133 -37677 40352 29467 -103380 -14666
10727b67281k0093k60643K70254a19164I3303N1487m8595b19593C27450i1285
10716C00095F8697a77831A74376a10733B4903g2489j01316K1246m4852B00438
10705g7237j29980j27221J55593k36324d0719F5233q561c97580a10394J4581L6397
10694e9416b1050m1968k08911J09171C35694d7676A64091h9954k22301B6914b44978
10682I7033J80771b32907P8338j54508g6509b7791l5436q0102f9504j77898a19986
10670A9112R9566J65990A23139a07906B6131a45405k2940G930f2347A31265l5071
10659I6194R9287a06173j24922P2806j79109a45688j8028A13992g2277j57441
10649b29718H1870b93050q8044J32344J20075c4440F9426J60540G4717a04022
$$ plain form
10727 -267281 -287374 -548017 -277763 -119164 93303 144790 96195 -219593 327450 -91285
10716 300095 68697 -177831 174376 -110733 24903 -72489 -173805 -152559 -197411 200438
10705 -77237 -207217 -334438 -178845 -415169 -40719 65233 56672 -397580 -110394 -95813 -59416
10694 -59416 -21050 -63018 -271929 -162758 335694 -47676 164091 -89954 -312255 26914 -244978
10682 97033 277804 -232907 -154569 -309077 -76509 -27791 -63227 -143329 -69504 -247402 -119986
10670 19112 118678 284668 123139 -107906 26131 -145405 -168345 7930 -62347 131265 96194
10659 96194 195481 -106173 -231095 -158289 -337398 -145688 -163716 113992 -72277 -229718
10649 -229718 81870 -293050 -381094 -248750 -128675 -34440 69426 229966 74717 -104022
10638b73585C04999A39301F3803b05301M0591A48750D8153a46410j91883D54726
10627A79191F9320i4419A12452a94330b9097j8028k11117Q4780g5612A10664d9613
10615b32501C2242i6880L5007a1583k82587B93959E382c53812I968N0240a19007
10603i4065n3499d5018m66253A57175g5805l5797j54034g3884n9451A41236k7813
10592A13423A1619a34750B21758c8851k7143C5122k108J87232b7737G728b53665
10580a78176P8404A3053e4335k29296h3129b9045A43968P1260a1314A02976J00339
10569B03315b31994G2053j0993b76470O3305R7193j04686O3888K3596F7989h3449
10557C13617K12181b04771F345N4192l291i2143k22410A15830L15662a79087D2601
$$ plain form
10638 -273585 304999 139301 63803 -205301 -164710 148750 48153 -146410 -338293 454726
10627 179191 69320 -94419 112452 -194330 -29097 -47125 -258242 -173462 -75612 110664 -49613
10615 -232501 32242 -96880 -61873 -11583 -294170 293959 5382 -353812 9968 60208 -119007
10603 -94065 -147564 -45018 -511271 157175 -75805 -111602 -265636 -73884 -133335 141236 113423
10592 113423 11619 -134750 221758 -38851 -65994 35122 33014 220246 -27737 7728 -253665
10580 -178176 -99772 13053 -54335 -283631 -83129 -29045 143968 215228 -11314 102976 203315
10569 203315 -231994 72053 61060 -276470 -213165 -115972 -220658 -156770 -133174 67989 -83449
10557 313617 525798 -204771 6345 60537 57246 -92143 -314553 115830 431492 -179087 42601
10545B65J55724B3655i7435r8697e9207j46327B19136b11618J04910n2963j01836
10534b61507f6074I8290D1618J68077a52786C8549h2855l0476D11329c30139d8517
10522a26232A20488f0044j55881H9105c5642A98104a13380A15864e8361o2250
10512a20611I6159L4027h0628p0418C0902e3169B27490H6889d4450r016a3329
10500B11257c25896a36996j63170a42345F114a77080C05926a63200B24919b49019
10489c20679J52025E8646F832K13082a510n2985B26278L9153j31218L64760J96022
10478F94995A73284K84777I3030a21317A18836e07612B30313J37218a07585A14155
10467b1452H2531p209f1696j33923F1373N2665d89683A83646a9213A30031a19748
$$ plain form
10545 265 155989 23655 -97435 -196132 -59207 -205534 219136 -211618 -106708 -159671 -261507
10534 -261507 -66074 98290 41618 209695 -152786 38549 -82855 -113331 411329 -330139 -48517
10522 -126232 120488 -60044 -215925 89105 -35642 198104 -113380 115864 -58361 -120611
10512 -120611 96159 130186 -80628 -151046 30902 -53169 227490 86889 -44450 -53466 -13329
10500 211257 -325896 -136996 -300166 -142345 6114 -177080 305926 -163200 224919 -249019
10489 -320679 -168654 58646 6832 219914 -1510 -54495 226278 265431 134213 498973 694995
10478 694995 173284 458061 93030 -121317 118836 -507612 230313 367531 -107585 114155
10467 -21452 82531 75322 -61696 -195619 61373 114038 -489683 183646 -19213 130031 -119748
10455b43456h4329A84123a16246f665m9413j48096P0170f6839j60501j13293J38631
10444b02002C78388b0663k34700d08k49846d6664n1444c4736C41235b79078a18583
10432B30791j02677e0987B49462g8772m4697I3399a38225o661D0895a59681A44120
10420d53711a3299E2713d23541J78492H4589P2067o3524e0204a1323A77882M3986
10409B21868d25047D25235d6136r3807K5656k5597F8287i6616c3029C28961a42814
10397E9789a74948d2399j2836A8161M5539J82418E5417f857k52073B04834f5569
10385a38642k0437A41665F455a8376A41181J76108b3065E44779A71939n5472A8703
10373B35495J55470A6724K66328J85595P9060A66682L64141J5178A40167J91527
$$ plain form
10455 -243456 -84329 184123 -116246 -6665 -56078 -204174 -134004 -66839 -227340 -340633 -202002
10444 -202002 378388 -20663 -255363 -408 -250254 -46664 -98108 -34736 341235 -279078 -118583
10432 230791 128114 -50987 249462 -78772 -123469 93399 -138225 -144886 40895 -159681 144120
10420 -453711 -13299 52713 -423541 -245049 84589 156656 93132 -50204 -11323 177882 221868
10409 221868 -425047 425235 -46136 -139943 -114287 -139884 68287 -96616 -33029 328961 -142814
10397 59789 -174948 -42399 -55235 18161 63700 246118 55417 -6857 -258930 204834 -65569
10385 -138642 -159079 141665 6455 -18376 141181 317289 -23065 544779 171939 116467 18703
10373 235495 390965 16724 283052 468647 547707 166682 530823 546001 140167 331694
10363C31694l9139J10097A31025O3422F8242P5971g9886b4219A88137K10106K56112
10352F54355j63302j79976r0979I0356J52396N352J17225P9371j77805K48718
10342E15613j81165k6276F7400M629K55742A39823f5841c1857F2555Q3942e5941
10330A71359E2430K391J20555a79005C25567A15892b42998D21137A73484d3962
10319A86881k4038B9912O9177l6302N0667K6663L7270d0489C12413j41956q0507
10308H9950Q2393c33563J61085h5960j95355B37090b1492j4794A273c00984Q2579
10297b18405C25930c15131a36800N651K9114C8439j4599J4523b0647A33155n0662
10286H2493C2182g7553j01285d8811A83057H0633j998a98668j50184J8516J10337
$$ plain form
10363 331694 292555 402652 131025 194447 68242 144213 -79886 -24219 188137 398243 654355
10352 654355 491053 311077 220098 90356 242752 248104 365329 444700 266895 515613
10342 515613 334448 308172 67400 72029 327771 139823 -65841 -31857 62555 146497 -55941
10330 171359 52430 54821 175376 -179005 325567 115892 -242998 421137 173484 -43962
10319 186881 162843 29912 99089 62787 113454 140117 177387 -40489 312413 170457 89950
10308 89950 172343 -333563 -172478 -85960 -281315 237090 -21492 -36286 1273 -300984 -218405
10297 -218405 325930 -315131 -136800 -131149 -102035 38439 23840 38363 -20647 133155 82493
10286 82493 32182 -77553 -178838 -48811 183057 80633 78635 -198668 -348852 -330336 -219999
10275b19999A56112B6093L42750a91806L658g8469A33762D1334g0095A72701q6125
10264H6576R5222J56400r7069B7343K49925Q4609J31329j79593n6405K88250k70689
10253B74769d9462b0288E51362a4678k85715a00299k68409A11589k8250Q5458
10243A68797C9094A253J83948a24958k40667a59641A7523J16200d40851E9045
10232G0861O1890F194a54650o369O9003r4615A29339e4222l90047j37409H3343
10220b37456E3348b12538p363h5960j10307f1959k46392A08845j7627h8166K7675
10209f0491l57661a08820R631j0421j35724B12958e5692C3862b46663R3340n7912
10198b11235a8571j13242A46458b38850f7955k92791A74804b93451M3088J13991
$$ plain form
10275 -219999 156112 26093 368843 -191806 -188148 -78469 133762 41334 -70095 172701 86576
10264 86576 181798 338198 241129 27343 277268 361877 493206 313613 257208 545458 274769
10253 274769 -49462 -20288 551362 -14678 -300393 -100299 -368708 111589 83339 168797
10243 168797 39094 1253 185201 -124958 -365625 -159641 17523 133723 -440851 59045
10232 70861 132751 6194 -154650 -161019 -92016 -186631 129339 -54222 -444269 -581678 83343
10220 -237456 53348 -212538 -219901 -85960 -196267 -61959 -308351 108845 91218 -88166 -60491
10209 -60491 -418152 -108820 -99189 -109610 -245334 212958 -55692 33862 -246663 -153323 -211235
10198 -211235 -18571 -131813 146458 -238850 -67955 -360746 174804 -293451 -250363 -136372
10188a36372j69440p5170D524a2307k31070C58449g0130b8147k7184k14148B20438
10176A88602p6225f3155j58732b9175q0334A68114J3551A6893M4640J879a59383
10164d9881B47567c19006M4625R5156a6840l42914j05658b20838b9018o4285G3329
10152G4103j7193K6130a36456K7652d0663k8963I9967d49829B01089b22520J08397
10141a14123A22752l0983D1892g6206a8806A44527m2019a88119B29300P023a25647
10129b90545P7852D9694P009F355a78905A15084q471i9068l3105A23021l881g7884
10116A75882J18664F1322c02996e9302n7390r3044a02949R928G6607g0945G791
10104a35077C3421d33602a92421j37228J09259E1495a79452D5465a84581A0542
$$ plain form
10188 -136372 -305812 -380982 4524 -12307 -243377 358449 -70130 -28147 -55331 -269479 220438
10176 188602 112377 -63155 -221887 -29175 -109509 168114 181665 16893 61533 63412 -159383
10164 -49881 247567 -319006 -274381 -179225 -16840 -359754 -465412 -220838 -29018 -93303 73329
10152 74103 56910 83040 -136456 -108804 -40663 -69626 99967 -449829 201089 -222520 -114123
10141 -114123 122752 91769 41892 -76206 -18806 144527 102508 -188119 229300 236323 -125647
10129 -290545 -212693 49694 56703 6355 -178905 115084 106613 -99068 -132173 123021 119140 -77884
10116 175882 294546 61322 -302996 -59302 -116692 -209736 -102949 -93021 76607 -70945 7791
10104 -135077 33421 -433602 -192421 -329649 -220390 51495 -179452 45465 -184581 10542
10093a29199A12652J4973e4329k2430A75495i4970j05548C2918a02327A36724
10082A82985b81099K3257f4448j27887K8017l35154D102c17266A53162a14028
10071b57760E9532a0997k99332H6584b19363A72582d22056a81036A31652A2007
10060b04091i6491A3858c09224G3552c8576A31380c83642J01712R9739A32059
10049a8092k03570c1216A97749a85106h2782C529i0326l5487e5929q7260j05203
10038b48392N138P9893k06966J75978A99579a89162A71832b67121j01090A27723
10027a76259p0422B46059f3282A2060i6790j37582F9078O994a80516A02750A3669
10015B7386b17097O1488E2231N424R947R1528i1000a8459C0953g3354B22385L8920
$$ plain form
10093 -129199 112652 127625 -54329 -76759 175495 -94970 -200518 32918 -102327 136724
10082 182985 -281099 -257842 -64448 -192335 -164318 -499472 4102 -317266 153162 -114028
10071 -257760 59532 -10997 -310329 86584 -219363 172582 -422056 -181036 131652 12007
10060 -204091 -96491 13858 -309224 73552 -38576 131380 -383642 -281930 -182191 132059
10049 -18092 -221662 -31216 197749 -185106 -82782 3529 -90326 -125813 -55929 -143189 -248392
10038 -248392 -243254 -163361 -370327 -194349 199579 -189162 171832 -267121 -368211 127723
10027 -176259 -246681 246059 -63282 12060 -96790 -234372 69078 76072 -180516 102750 13669
10015 27386 -217097 -155609 52231 57655 67602 159130 -91000 -18459 30953 -73354 222385 261305
10003B61305a75170A59424b58001B09514b78844G1125E631a22096L8769l8092
9993a21419j12530I9663a62025A2104L26596d4095L124A9803q901a85314o578
9982a91892A36926J6319a93210r0755f7127q6178c1421I9340A8502a33841l3707
9971a67548N1405A6562J83999b90118A30591B9891Q5922n1569h134n9714j05322
9960a73170j13813B53290a69347O4900j02864j768i8653c7805j76269B0814L8414
9949E9228c0587j80297C2912D375b10277d8530a7543G4067L04474F7755b45445
9937F9667J75564j20316b70515J1121J10031o861b264E946c40073a38698b7155
9925i1936d5276o038A5470J3862e8921A95156d6317o0992b9922j80021g1988b804
$$ plain form
10003 261305 -175170 159424 -258001 209514 -278844 71125 5631 -122096 -83327 -121419
9993 -121419 -233949 99663 -162025 12104 338700 -44095 -40971 19803 10902 -185314 -191892
9982 -191892 136926 153245 -193210 -283965 -67127 -153305 -31421 99340 18502 -133841 -167548
9971 -167548 -116143 16562 200561 -290118 130591 29891 115813 64244 -8134 -67848 -173170
9960 -173170 -286983 253290 -169347 -104447 -207311 -209079 -98653 -37805 -214074 20814 59228
9949 59228 -30587 -210884 32912 4375 -210277 -48530 -17543 74067 378541 67755 -245445
9937 69667 245231 124915 -270515 -259394 -149363 -156224 -2264 5946 -340073 -138698 -27155
9925 -91936 -45276 -51314 15470 29332 -58921 195156 -46317 -107309 -29922 -209943 -71988 -2804
9912C4367J10913B4068c22210f3792g612B01422b26325l5411a2913j3181B03776
9900D2347i0308j12910J605Q2755c6999p8588l53869J56650b9995k07188k58506
9889d95689C06543b10073g171k91527b6599n0328A01495m3918A1819e8476o7628
9878a26104k01093A17042j3470K157a1876l4907n7133k53345N1910j39183e6661
9866h4345R735B98612e3095k14808R157J23992q1560C41728b06164e5991j86286
9855b42277f8803g023B68665c24481a26485k01748J05079R9233B4743a63831M8611
9844a15220j07730a06450L4363k35620C03798E04g9267A38963B2322J55822k689
9833A75455J39473g7364B05734E0951J50090a61203k28013b1036A07598J33302
$$ plain form
9912 34367 145280 24068 -322210 -63792 -7612 201422 -226325 -261736 -12913 -26094 203776
9900 42347 -90308 -203218 -201613 -118858 -36999 -115587 -469456 -312806 -29995 -237183 -495689
9889 -495689 306543 -210073 -7171 -298698 -26599 -76927 101495 57577 11819 -58476 -126104
9878 -126104 -327197 117042 103572 105729 -11876 -46783 -103916 -357261 -305351 -444534 -56661
9866 -84345 -74610 298612 -53095 -267903 -258746 -134754 -216314 341728 -206164 -55991 -242277
9855 -242277 -68803 -7023 268665 -324481 -126485 -328233 -223154 -123921 24743 -163831 -115220
9844 -115220 -222950 -106450 -72087 -307707 303798 504 -79267 138963 22322 178144 175455
9833 175455 314928 -77364 205734 50951 201041 -161203 -389216 -21036 107598 240900
9823B40900a48103A8233J16609j5544b31692B500N3727R5755l9442d14257e01
9811b81142j4356f8080j64106j76097Q8448D1129I459c99413a50393j06378A92942
9799b7750m3457j90321B04955h6624q1034l3185n641A15821e6998j35886J2271
9788a80613j69491a49702n9111F973d45962e568B18494m8375a51002N9880j95112
9777b86234A59479a65517l57836h0284o2137e1988e409j46407A32374G435b19646
9765H2126c4731A74411c88269a9249C9040d40163e2103A46432O3320i0482a221
9753a26950J2052B12359a92916q4798D7840b14532I5523a69312g9485A18423c93011
9741c0058j63071A00846Q5679b02367J3101Q2121L7422l4833A6526a97372f08
$$ plain form
9823 240900 -148103 18233 134842 119298 -231692 2500 56227 151982 112540 -414257 -501
9811 -281142 -295498 -68080 -232186 -408283 -319835 41129 9459 -399413 -150393 -256771 192942
9799 -27750 -71207 -261528 204955 -86624 -167658 -200843 -206484 115821 -56998 -192884 -180613
9788 -180613 -350104 -149702 -208813 6973 -445962 -5568 218494 170119 -151002 -91122 -286234
9777 -286234 159479 -165517 -523353 -80284 -142421 -51988 -5409 -151816 132374 7435 -219646
9765 82126 -34731 174411 -388269 -19249 39040 -440163 -52103 146432 209752 -90482 -1221
9753 -126950 -114898 212359 -192916 -277714 47840 -214532 95523 -169312 -79485 118423 -393011
9741 -30058 -193129 100846 186525 -202367 -189266 -107145 -69723 -104556 16526 -197372 -608
9729C17292e8697j3499B3779f263F1622a81301j3559l7355k26602i153k29852
9718b39005f3582H1510a12458A9989P669L2345h2370A12350e861B27612G8977
9706a59030e6211q2819M9714r9245j17812j6530B08251c48205a24850n0681e0154
9694c20465k4892R0956Q391K4484d559l87149a63154B22749N2872a04020D5829
9682B6971K45515h2141E7668c1500k00882A31949b18946C6549j7469c85122O3978
9671c21144J36802O3115a2374p8631o4254l8081F9693b7912A35054f9613j62835
9660b32448I3661i8692A07761a95572a090m06979A35752b34565c3550A55297l135
9649A52162a87565B87107d43227p3659c5137I5227h1490r6456j87112A02137d1461
$$ plain form
9729 317292 -58697 -72196 23779 -6263 61622 -181301 -194860 -232215 -458817 -9153 -239005
9718 -239005 -63582 81510 -112458 19989 27658 60003 -82370 112350 -5861 227612 78977
9706 -159030 -56211 -139030 -89316 -188561 -306373 -322903 208251 -348205 -124850 -175531 -50154
9694 -320465 -345357 -254401 -246010 -221526 -4559 -391708 -163154 222749 275621 -104020 45829
9682 26971 272486 -82141 57668 -31500 -232382 131949 -218946 36549 19080 -385122 -321144
9671 -321144 -184342 -121227 -12374 -91005 -155259 -193340 69693 -27912 135054 -69613 -232448
9660 -232448 93661 -98692 107761 -195572 -1090 -408069 135752 -234565 -33550 155297 152162
9649 152162 -187565 287107 -443227 -516886 -35137 95227 -81490 -177946 -365058 102137 -41461
9637B8401c2658r7621d9794j08515n4260r3300B57587j07846g9734B43155c28210
9625e9406K2397C60484A27703a72761j29127P4232A26492f0039G8694B9731c27974
9613b87686A1347c57438B3019a41292O3334k06373C28692e6027k1256A38753c96298
9601b2126B36529B5191b27781L7095K5529C63713c31275A1218a21834c1830F8988
9589a4783B10665B666K2836a41439O2216F7576c2089G8576O6604a72365Q1830
9578i0535G4958J0316J5986K028c7446B71502c24325B48923a03943j9289B92419
9566a43354k19559J50974C70370c11499G5260a98504j18732A13444d06754a53283
9555E9358M4610a77526A43519F9057b31654K5786n967a3356q5998J6634j55382
$$ plain form
9637 28401 -32658 -130279 -49794 -158309 -212569 -305869 257587 149741 -79734 243155 -328210
9625 -59406 -37009 360484 127703 -172761 -301888 -227656 126492 -60039 78694 29731 -327974
9613 -287686 11347 -357438 23019 -141292 -77958 -284331 328692 -56027 -77283 138753 -396298
9601 -22126 236529 25191 -227781 -190686 -165157 363713 -331275 11218 -121834 -31830 68988
9589 -14783 210665 2666 25502 -141439 -79223 67576 -32089 78576 145180 -172365 -90535
9578 -90535 74958 85274 101260 103288 -37446 271502 -324325 248923 -103943 -123232 292419
9566 -143354 -362913 -211939 370370 -311499 75260 -198504 -317236 113444 -406754 -153283
9555 59358 103968 -177526 143519 69057 -231654 -205868 -211835 -13356 -99354 -82720 -238102
9544b38102A49162j305G024a03509j86219g5092j7613B41998a28540H9613b109
9532i6151K707H2435a55188C57768r5077b16284C424M8298a68781d5942j06740
9521a52682a9007l2102A61775a2127A41785c44552J48181b8561n9753C22940b55452
9509c30764a0604j53306A9177c78275d1834A00161j0173J69754G8269b84022B244
9497A11453a55254g1391b6279l46787e0418r6613K6868C481J40627d19725a59210
9485e3478r0795j072K327m3994o8649a19668k97272A33484O5033h7844o1681D9093
9472B49704B4335J3301c8275q6043j2963O431e1683E262b17370j15541K2643a09143
9459I2953I842C504K67832a15683G522Q4254a91188n4137L3392M6109m2094f2672
$$ plain form
9544 -238102 149162 147857 7024 -103509 -289728 -75092 -92705 241998 -128540 89613 -2109
9532 -96151 -93444 82435 -155188 357768 262691 -216284 3424 51722 -168781 -45942 -152682
9521 -152682 -19007 -51109 161775 -12127 141785 -344552 -196371 -28561 -88314 322940 -255452
9509 -330764 -10604 -163910 19177 -378275 -41834 100161 89988 259742 78269 -284022 2244
9497 111453 -155254 -71391 -26279 -373066 -50418 -147031 -120163 3481 144108 -419725 -159210
9485 -53478 -144273 -145345 -143018 -187012 -255661 -119668 -416940 133484 198517 -87844 -149525 49093
9472 249704 24335 37636 -38275 -124318 -137281 -130850 -51683 5262 -217370 -332911 -310268 -109143
9459 92953 9842 3504 271336 -115683 7522 91776 -191188 -245325 -211933 -165824 -207918 -62672
9446a81498m3246b6854H6687g1641B60496a34947G0330K16084a49061K2730k04710
9435c31041d7116a6661A35507L3923c96421I7779K4609a64350O7181K2805A61163
9423a63701r8644N2441A22370J46479D5152c07817e0282j01934d5117m5560A29056
9411c65206a54285A76913b68542R2761C9164a8643B40410c05319K7392i5051E5376
9399G5756b55459o3569a59281P7986m8680B91253c79487B0199b68240F2151L0321
9388I2472b76847a07937j56506G6236d23832B3102c0397A63048d07214D7282c03560
9376a36415c5082G2903C507a56128A01805e2958k80100A30880b0910A95181a92067
9364F6155b4329o381j63236A00753b38865j4436l7851G8316A9641a96363D44031
$$ plain form
9446 -181498 -224744 -26854 86687 -71641 260496 -134947 70330 286414 -149061 -126331 -331041
9435 -331041 -47116 -16661 135507 169430 -396421 97779 122388 -164350 -97169 -74364 161163
9423 -163701 -262345 -209904 122370 268849 45152 -307817 -50282 -152216 -45117 -90677 129056
9411 -365206 -154285 176913 -268542 -175781 39164 -18643 240410 -305319 -277927 -95051 55376
9399 75756 -255459 -319028 -159281 -81295 -129975 291253 -379487 20199 -268240 62151 92472
9388 92472 -276847 -107937 -264443 76236 -423832 23102 -30397 163048 -407214 47282 -303560
9376 -136415 -35082 72903 3507 -156128 101805 -52958 -333058 130880 -20910 195181 -192067
9364 66155 -24329 -30710 -193946 100753 -238865 -253301 -291152 78316 19641 -196363 444031
9352A16369a1907j28724n9538j5720f3116k00413L2755O6899j25215i2685B48166
9340a08891p1725Q117C13235A22845d6646B079a09180D1370d2872A12536l2218
9329H0318f5265n2272n4251D3045c39185J56796D2427a95236E4151a79838B7757
9317b93463I4080b00991L8715r8292B3349K6j1266b5944k45147a6689j91834L6339
9305a72184B9659b29860A57698i0967k00527H361b85116c5636A48482k500c72307
9293A35019f6022B884g9507A11200j5044d5557A55751J66524o3326b60158e1871
9281g8584A66384d17067a93822c1191j33083G0491J53536b83267a06497A26241
9270b44933A93242a91702F789O7576b81028J13030d9415j6234j21268D48712a10166
$$ plain form
9352 116369 -11907 -140631 -200169 -215889 -63116 -263529 -230774 -163875 -289090 -92685 248166
9340 -108891 -180616 -172499 313235 122845 -46646 2079 -109180 41370 -42872 112536 80318
9329 80318 -65265 -117537 -171788 43045 -339185 -182389 42427 -195236 54151 -179838 27757
9317 -293463 94080 -200991 -162276 -260568 23349 23375 12109 -25944 -271091 -16689 -208523 -172184
9305 -172184 29659 -229860 157698 -90967 -291494 8361 -285116 -35636 148482 145982 -372307
9293 135019 -66022 2884 -79507 111200 96156 -45557 155751 322275 258949 -260158 -51871
9281 -78584 166384 -417067 -193822 -31191 -164274 70491 224027 -283267 -106497 126241
9270 -244933 193242 -191702 6789 74365 -281028 -167998 -49415 -65649 -186917 448712 -110166
9258c01657o8208H4640a80954A9663M602a24678k6911A83251f0866l08971J52791
9247b17046G002f1382b6442O53I2468e4790j75667a8477H9219a75095O5459r4247
9235b03883e4291E8398c41383A50344h6979C16069b66725A12178h7468E1841c8521
9223a68835A28233J63819G6619b43839h2822k36156C079a25340K7933l37421b15224
9211E9580L47J85748p7508M2867p7746e7344A32069D2761i0277M4309l0946j29734
9199b06648e8213k3202k44123a00364m6169b8751j47142O0450G1496b12528j28005
9188c40533a20872q5188B00956b18375F8312h9798l7930A75563n7605b37399d823
9176A4699a1458C9437d91478d9788j38537C80193G7648i8126L0512A32366a21346
$$ plain form
9258 -301657 -369865 84640 -180954 19663 24265 -124678 -151589 183251 -60866 -369837 -217046
9247 -217046 7002 -61382 -26442 -25789 92468 -54790 -230457 -18477 89219 -175095 -109636 -203883
9235 -203883 -54291 58398 -341383 150344 -86979 316069 -266725 112178 -87468 51841 -38521
9223 -168835 128233 292052 76619 -243839 -82822 -318978 3079 -125340 -97407 -434828 -215224
9211 59580 59927 245675 168167 211034 133288 -57344 132069 42761 -90277 -45968 -76914 -206648
9199 -206648 -58213 -81415 -325538 -100364 -146533 -28751 -175893 -115443 71496 -212528 -340533
9188 -340533 -120872 -206060 200956 -218375 68312 -89798 -127728 175563 117958 -237399 -4823
9176 14699 -11458 39437 -491478 -49788 -188325 380193 77648 -98126 -67614 132366 -121346
9164A6319d9005C1239K59046A28542j2514b04686e5950k49438G999c2693B19115
9152a15161I8144J37718b89151F4213b76073E1786J37733m1266a95906A17663
9141A70704b31266o011C572b23911P3579a0720l45212K4265A49273b57229R3604
9130a63625j47524B72617a49795p3440J06680b6826I287d5913a1115B3981b3362
9118B7338a50246a7611j88936C97556F130c12607O5310N8515l264D9347a28307
9106B43139a79720M810B12824B5343b0329g598k94591H671i187r4601j60014B43410
9093c71975A27724b42664A22192a968D5263J5409d1571j4390C3075h5407I9775
9081G9414b73983A52571c73451A1390a10784A36226K3308c2961F6882M5793b9848
$$ plain form
9164 16319 -49005 31239 290285 128542 116028 -204686 -55950 -305388 7999 -32693 219115
9152 -115161 98144 235862 -289151 64213 -276073 51786 189519 148253 -195906 117663
9141 170704 -231266 -237277 3572 -223911 -150332 -10720 -355932 -331667 149273 -257229 -163625
9130 -163625 -311149 272617 -149795 -223235 -116555 -26826 9287 -45913 -11115 23981 -23362
9118 27338 -150246 -17611 -206547 397556 6130 -312607 -247297 -188782 -192046 49347 -128307
9106 243139 -179720 -174910 212824 25343 -20329 -7598 -302189 8671 -9187 -103788 -263802 243410
9093 -371975 127724 -242664 122192 -1968 45263 60672 -41571 -55961 33075 -85407 99775
9081 79414 -273983 152571 -373451 11390 -110784 136226 159534 -32961 66882 112675 -29848
9069B962b1056B7694K83692d22547b6475l11420a47171D9042a11067A20113j3303
9058A06810c59539d8930l8056l38065c8620G4786c55570B85349a24487B015b07634
9046b00182B30329c02929D1905e4894n0156d3249h956m06928a39733k27018i1523
9034b31583G7249a85245b9180k36310C5991G290a2003j86008e8564j94879d259
9022H9507c3745j49962A07698a73549l9626G997K19481n1244b13432L1827D1335
9010g4371q2452O6416B7488L8572a05042J9701j26759B42119a21956A09151c10091
8998a85022B67330a7701I3510e266j87066k8152A54530i3615j72302J17274r2925
8987b41568c9710l10854i2766A5891J49915J2887f3542B3374K03120N7428H5312
$$ plain form
9069 2962 -21056 27694 311386 -422547 -26475 -337895 -147171 49042 -111067 120113 106810
9058 106810 -359539 -48930 -86986 -425051 -38620 74786 -355570 285349 -124487 2015 -207634
9046 -200182 230329 -302929 41905 -54894 -105050 -43249 -8956 -415884 -139733 -366751 -91523
9034 -231583 77249 -185245 -29180 -265490 35991 7290 -12003 -198011 -58564 -253443 -4259
9022 89507 -33745 -183707 107698 -173549 -213175 7997 227478 176234 -213432 -181605 41335
9010 -74371 -156823 -90407 27488 66060 -105042 -85341 -212100 242119 -121956 109151 -310091
8998 -185022 267330 -17701 93510 -5266 -192332 -220484 154530 -93615 -265917 -148643 -241568
8987 -241568 -39710 -350564 -92766 15891 165806 178693 -63542 23374 226494 283922 85312
8975A61179d5079l6525c9566j2832B49450e1149A333b2984A37602b3681o8288
8964i1969B2594a67100I1953f34108F5288j6804c19707H9788C4807Q7703C0474
8952a33465C3367a42290l9745b7372j13666A35920J4402l2509i9620A40298d6851
8940c17660e0387j49659b5353q706q2844d3402A54939b94404J12162D6724d677
8928A48015e5878G6519M8006K88586M16565J729533K437303M842241C254015G15645
8917C29588O7063F2983A8182e1429J746j23744j43065g7045L1937B53745F6435
8905a61035c2903B32555k0067p3933a69609A66579D4529a50046A9842K54558p3793
8894B00607a94392j13835a50718J5780m2837Q6810a7377k31489j8805G7682h5398
$$ plain form
8975 161179 -45079 -81604 -39566 -52398 249450 -51149 1333 -22984 137602 -23681 -91969
8964 -91969 22594 -167100 91953 -634108 65288 48484 -319707 89788 34807 122510 30474
8952 -133465 33367 -142290 -182035 -27372 -141038 135920 150322 117813 -99620 140298 -46851
8940 -317660 -50387 -200046 -25353 -34059 -116903 -43402 154939 -294404 -182242 46724 -4677
8928 148015 -55878 76519 124525 413111 829676 2559209 4996512 9838753 3254015 715645
8917 329588 396651 62983 18182 -51429 -49683 -173427 -316492 -77045 -45108 253745 66435
8905 -161035 -32903 232555 212488 138555 -169609 166579 44529 -150046 19842 274400 200607
8894 200607 -194392 -308227 -150718 -134938 -177775 -90965 -17377 -248866 -267671 77682 -85398
8882a46888J5157m8396n1582j0276A15920a55461b47k45149J22689e1294j06716
8871a58010n2783M2421A00813a21352C3847c15228d5316J9036j43176A71860a09430
8859a66625m7440e0304l02823e8091A87881C7544c3233A07380P4324a9755q0838
8848a00593L1864I2808a11543A76160b20528h0355L1302A95991P5448a01062J6092
8837h4970A64703C6164b56928j03672C2984i3278J5444C7002d3887n15822b11747
$$ plain form
8882 -146888 -131731 -180127 -231709 -241985 115920 -155461 -247 -245396 -122707 -51294 -158010
8871 -158010 -210793 -168372 100813 -121352 33847 -315228 -45316 -26280 -169456 171860 -109430
8859 -166625 -214065 -50304 -353127 -58091 187881 37544 -33233 107380 181704 -19755 -100593
8848 -100593 -68729 92808 -111543 176160 -220528 -80355 -49053 195991 271439 -101062 -84970
8837 -84970 164703 36164 -256928 -360600 32984 -93278 -77834 37002 -43887 -559709 -211747
$$ [...]
##END NTUPLES=NMR SPECTRUM
##END=
