##TITLE=AC1638_CTIAH13371_8569428_wyTXtcWmSr
##JCAMPDX= 6.0         $$ Bruker NMR JCAMP-DX V2.0
##DATA TYPE= NMR SPECTRUM
##DATA CLASS= NTUPLES
##ORIGIN= BRUKER
##OWNER= Administrator
$$ 1.72 TOPSPIN		Version 2.1
$$ 2014-04-11 13:30:32.892 -0700  Administrator@X
$$ Compression mode = diff/dup
##.OBSERVE FREQUENCY= 400.02188249412
##.OBSERVE NUCLEUS= ^1H
##.ACQUISITION MODE= SIMULTANEOUS (DQD)
##.ACQUISITION SCHEME= undefined
##.AVERAGES= 64
##.DIGITISER RES= 22
##SPECTROMETER/DATA SYSTEM= spect
##.PULSE SEQUENCE= noesygpps1d.comp
##.SOLVENT NAME= COFFEE_meoh
##.SHIFT REFERENCE= INTERNAL, COFFEE_meoh, 1, 14.9611
##AUDIT TRAIL= $$ (NUMBER, WHEN, WHO, WHERE, PROCESS, VERSION, WHAT)
$$ ##TITLE= Audit trail, TOPSPIN		Version 2.1
$$ ##JCAMPDX= 5.01
$$ ##ORIGIN= Bruker BioSpin GmbH
$$ ##OWNER= Administrator
$$ $$ E:\/data/COFFEE/nmr/AC1638_CTIAH13371_8569428_wyTXtcWmSr/12/pdata/1/auditp.txt
$$ ##AUDIT TRAIL=  $$ (NUMBER, WHEN, WHO, WHERE, PROCESS, VERSION, WHAT)
(   1,<2014-04-10 23:57:53.487 -0700>,<Administrator>,<X>,<go>,<TOPSPIN 2.1>,
      <created by zg
	started at 2014-04-10 23:46:23.528 -0700,
	POWCHK enabled, PULCHK disabled,
       configuration hash MD5:
       C8 4E 4E 5D D3 5C D8 9E 9F 52 82 E0 59 8A DE 15
       data hash MD5: 64K
       7B 75 BB 60 D3 16 60 26 A0 24 40 7F 9D EE 40 D3>)
(   2,<2014-04-10 23:58:02.440 -0700>,<Administrator>,<X>,<audit>,<TOPSPIN 2.1>,
      <user comment:
       ICON-NMR User ID: COFFEE
       data hash MD5: 64K
       7B 75 BB 60 D3 16 60 26 A0 24 40 7F 9D EE 40 D3>)
(   3,<2014-04-11 13:30:30.533 -0700>,<Administrator>,<X>,<proc1d>,<TOPSPIN 2.1>,
      <Start of raw data processing
       efp LB = 0.3 FT_mod = 6 PKNL = 1 PHC0 = 0 PHC1 = 0 SI = 128K 
       data hash MD5: 128K
       3A B2 2A 10 07 79 EB E7 25 FB 8C 87 20 0A 87 2E>)
(   4,<2014-04-11 13:30:31.498 -0700>,<Administrator>,<X>,<proc1d>,<TOPSPIN 2.1>,
      <pk PHC0 = -83.05664 PHC1 = 0 
       data hash MD5: 128K
       41 E9 90 F6 AE 87 9C DC D8 53 7C 43 B9 5F AB 05>)
(   5,<2014-04-11 13:30:32.065 -0700>,<Administrator>,<X>,<proc1d>,<TOPSPIN 2.1>,
      <abs ABSG = 1 
       data hash MD5: 128K
       31 87 C3 26 A0 4E 7A 4F 60 21 76 6A E3 3A 2B C4>)
(   6,<2014-04-11 13:30:32.279 -0700>,<Administrator>,<X>,<proc1d>,<TOPSPIN 2.1>,
      <abs ABSG = 2 
       data hash MD5: 128K
       A1 E1 94 DE 0C 80 89 C7 4D 98 E4 3C 3C 88 5F 06>)
(   7,<2014-04-11 13:30:32.432 -0700>,<Administrator>,<X>,<proc1d>,<TOPSPIN 2.1>,
      <abs ABSG = 3 
       data hash MD5: 128K
       B3 72 F0 2F 8E B0 43 B4 37 25 BD A3 DD B2 9D 87>)
(   8,<2014-04-11 13:30:32.540 -0700>,<Administrator>,<X>,<proc1d>,<TOPSPIN 2.1>,
      <abs ABSG = 4 
       data hash MD5: 128K
       20 84 F4 F6 25 74 A7 5B 26 7D 75 F9 0A B1 CB EE>)
(   9,<2014-04-11 13:30:32.647 -0700>,<Administrator>,<X>,<proc1d>,<TOPSPIN 2.1>,
      <abs ABSG = 5 
       data hash MD5: 128K
       BA B9 8F 39 5A 44 E7 BC 95 40 6C 1E F8 3F CB EE>)
$$ ##END=
$$ 
$$ $$ hash MD5
$$ [...]
150 150 150 150 150 150 150 150
##$TP07= 0
##$TPNAME0= <>
##$TPNAME1= <>
##$TPNAME2= <>
##$TPNAME3= <>
##$TPNAME4= <>
##$TPNAME5= <>
##$TPNAME6= <>
##$TPNAME7= <>
##$TPOAL= (0..7)
0.5 0.5 0.5 0.5 0.5 0.5 0.5 0.5
##$TPOFFS= (0..7)
0 0 0 0 0 0 0 0
##$TUNHIN= 0
##$TUNHOUT= 0
##$TUNXOUT= 0
##$USERA1= <user>
##$USERA2= <user>
##$USERA3= <user>
##$USERA4= <user>
##$USERA5= <user>
##$V9= 5
##$VALIST= <valist>
##$VCLIST= <CCCCCCCCCCCCCCC>
##$VD= 0
##$VDLIST= <DDDDDDDDDDDDDDD>
##$VPLIST= <PPPPPPPPPPPPPPP>
##$VTLIST= <TTTTTTTTTTTTTTT>
##$WBST= 1024
##$WBSW= 4
##$XGAIN= (0..3)
0 0 0 0
##$XL= 0
##$YL= 0
##$YMAX_a= 5460252
##$YMIN_a= -12389569
##$ZGOPTNS= <>
##$ZL1= 120
##$ZL2= 120
##$ZL3= 120
##$ZL4= 120
##$ABSF1= 14.9611
##$ABSF2= -5.597082
##$ABSG= 5
##$ABSL= 3
##$ALPHA= 0
##$AQORDER= 0
##$ASSFAC= 0
##$ASSFACI= 0
##$ASSFACX= 0
##$ASSWID= 0
##$AUNMP= <proc_prof1d_extract.lims>
##$AXLEFT= 0
##$AXNAME= <>
##$AXNUC= <1H>
##$AXRIGHT= 0
##$AXTYPE= 0
##$AXUNIT= <>
##$AZFE= 0.1
##$AZFW= 0.1
##$BCFW= 0
##$BC_mod= 0
##$BYTORDP= 0
##$COROFFS= 0
##$CY= 15
##$DATMOD= 1
##$DC= 0
##$DFILT= <>
##$DTYPP= 0
##$F1P= 0
##$F2P= 0
##$FCOR= 0.5
##$FTSIZE= 131072
##$FT_mod= 6
##$GAMMA= 0
##$GB= 0
##$INTBC= 1
##$INTSCL= 1
##$ISEN= 128
##$LB= 0.3
##$LEV0= 0
##$LPBIN= 0
##$MAXI= 10000
##$MC2= 0
##$MEAN= 0
##$ME_mod= 0
##$MI= 0
##$NCOEF= 0
##$NC_proc= -2
##$NLEV= 6
##$NOISF1= 0
##$NOISF2= 0
##$NSP= 0
##$NTH_PI= 0
##$NZP= 0
##$OFFSET= 14.9611
##$PC= 1
##$PHC0= -83.05664
##$PHC1= 0
##$PH_mod= 1
##$PKNL= yes
##$PPARMOD= 0
##$PPDIAG= 0
##$PPIPTYP= 0
##$PPMPNUM= 2147483647
##$PPRESOL= 1
##$PSCAL= 4
##$PSIGN= 0
##$PYNMP= <proc.py>
##$REVERSE= no
##$SF= 400.02000959556
##$SI= 131072
##$SIGF1= 0
##$SIGF2= 0
##$SINO= 400
##$SIOLD= 131072
##$SPECTYP= <>
##$SREGLST= <1H.CDCl3>
##$SSB= 0
##$STSI= 131072
##$STSR= 0
##$SW_p= 8223.68421052631
##$SYMM= 0
##$S_DEV= 0
##$TDeff= 65536
##$TDoff= 0
##$TI= <>
##$TILT= no
##$TM1= 0
##$TM2= 0
##$TOPLEV= 0
##$USERP1= <user>
##$USERP2= <user>
##$USERP3= <user>
##$USERP4= <user>
##$USERP5= <user>
##$WDW= 1
##$XDIM= 131072
##$YMAX_p= 447685795
##$YMIN_p= -11821
##$CURPLOT= <Network HP LaserJet P1505>
##$CURPRIN= <$Network HP LaserJet P1505>
##$DFORMAT= <normdp>
##$LAYOUT= <+/1D_H.xwp>
##$LFORMAT= <normlp>
##$PFORMAT= <normpl>
##$SURQMSG= 1
$$ End of Bruker specific parameters
$$ ---------------------------------
##NTUPLES= NMR SPECTRUM
##VAR_NAME=  FREQUENCY,     SPECTRUM/REAL,   SPECTRUM/IMAG
##SYMBOL=    X,             R,               I
##VAR_TYPE=  INDEPENDENT,   DEPENDENT,       DEPENDENT
##VAR_FORM=  AFFN,          ASDF,            ASDF
##VAR_DIM=   131072,        131072,          131072
##UNITS=     HZ,            ARBITRARY UNITS, ARBITRARY UNITS
##FACTOR=    0.0627417313425164, 1,          1
##FIRST=     8223.62146879497, -347,         -58721
##LAST=      0,             2079,            -59177
##MIN=       0,             -11821,          0
##MAX=       8223.62146879497, 447685795,    0
$$ Real data points
##PAGE= N=1
##DATA TABLE= (X++(R..R)), XYDATA
$$ [...]
61543D15001m51j046p85R4Q07J197J525J951K616L623M646N195N227M945M178
$$ 415001 414550 413504 412719 412813 413620 414817 416342 418293 420909 424532 429178 434373 439600 444545 448723
61528D48723K734J083r1q06j416j692j242n62o09j486k453l027l194k867k153
$$ 448723 451457 452540 452449 451643 450227 448535 447293 446731 446122 444636 442183 439156 435962 433095 430942
61513D30942j714j927k047j312k59J98M17J216K049J687N07K40J405K676L092
$$ 430942 429228 427301 425254 423942 423683 423881 424298 425514 427563 429250 429757 429997 431402 434078 437170
61498D37170L226L733M256M350M306M438M559M568M704M846M438L406K409J938
$$ 437170 440396 444129 448385 452735 457041 461479 466038 470606 475310 480156 484594 488000 490409 492347
61484D92347J938K322L101L929M306M227L931L139J430p37k319k849k561j633
$$ 492347 494285 496607 499708 503637 507943 512170 516101 519240 520670 519933 517614 514765 512204 510571
61470E10571k99O29N16k9Q3P13P23k82j584k608l323l559l116k459k098j501J40
$$ 510571 510272 510901 511417 511388 511471 512184 512907 512625 511041 508433 505110 501551 498435 495976 493878 492377 492517
61453D92517K185L009K196R15J54j36q0M45J080J246J326K281L933M949M674L794
$$ 492517 494702 497711 499907 500822 500976 500840 500760 501205 502285 503531 504857 507138 511071 516020 520694 524488
61437E24488K988K266J723J634J577Q00l16n49K38P50K54m99o21j60N98J604K435
$$ 524488 527476 529742 531465 533099 534676 535476 535160 534611 534849 535599 535853 535354 534733 534573 535171 536775 539210
61420E39210K388J615J050R39N64l06r78j195j635k600l409l560l406l259k878
$$ 539210 541598 543213 544263 545202 545766 545460 544482 543287 541652 539052 535643 532083 528677 525418 522540
61405E22540k293j969j852j359o94r20k210l276l140k398k046k048j757j013j56
$$ 522540 520247 518278 516426 515067 514373 513453 511243 507967 504827 502429 500383 498335 496578 495565 495409
61390D95409M64O32M16L21O96J080R40Q16J605K913L417K925K703L511M676N381
$$ 495409 495873 496505 496921 497242 497938 499018 499958 500774 502379 505292 508709 511634 514337 517848 522524 527905
61374E27905N629N605N226M662M234L651K443J154P69J002O29l79p80k91p2m91
$$ 527905 533534 539139 544365 549027 553261 556912 559355 560509 561278 562280 562909 562530 561750 561459 561387 560896
61358E60896l15J063K456K894L220M485O097O858O766O568O336N579M244K725
$$ 560896 560581 561644 564100 566994 570214 574699 580796 587654 594420 600988 607324 612903 617147 619872
61344F19872J362M34R4j7m25r15q41m16o01j464j965j716j609k185k722k547k091
$$ 619872 621234 621668 621762 621745 621320 620405 619564 619148 618547 617083 615118 613402 611793 609608 606886 604339 602248
61327F02248j931j879j649j411j056j8J620K831L072L032L451M234N086O056O936
$$ 602248 600317 598438 596789 595378 594322 594304 595924 598755 601827 604859 608310 612544 617630 623686 630622
61312F30622P254P253P810R063J0237J1118J2300J3710J4332J3853J3047J1973
$$ 630622 637876 645129 652939 662002 672239 683357 695657 709367 723699 737552 750599 762572
61300G62572R482N221O72k694m984o806q055q584q824q909q418p631p644q496
$$ 762572 772054 777275 777947 775253 770269 763463 755408 746824 738000 729091 720673 713042 705398 696902
61286F96902q655p261n432m376l708k676j666j227q59J5R71J547K263L601M934
$$ 696902 688247 680986 675554 671178 667470 664794 663128 661901 661042 661057 662028 663575 665838 669439 674373
61271F74373N487N410N116M497L676L385L908M690N610P322R710J1442J1857J1719
$$ 674373 679860 685270 690386 694883 698559 701944 705852 710542 716152 723474 733184 744626 756483 768202
61257G68202J1369R826O831M012K661J944O72o67j087q85o90j40R61J563J068
$$ 768202 779571 789397 796228 800240 802901 804845 805517 804850 803763 802878 802188 802048 803009 804572 805640
61242H05640P32J702K959K989K284K223K516J888N60L5Q90K458M276O193P554
$$ 805640 806372 808074 811033 814022 816306 818529 821045 822933 823493 823528 824418 826876 831152 837345 844899
61227H44899P905Q000Q710R445R181Q410Q474R388R939R649R183R016R061R360
$$ 844899 852804 860804 869514 878959 888140 896550 905024 914412 924351 934000 943183 952199 961260 970620
61213I70620R930J0140R406Q214P442P116O864O981P839Q804R084R208J0323J2342
$$ 970620 980550 990690 1000096 1008310 1015752 1022868 1029732 1036713 1044552 1053356 1062440 1071648 1081971 1094313
61199A094313J4101J5175J6364J8383K0952K3190K4227K3609K1684J9259J6596
$$ 1094313 1108414 1123589 1139953 1158336 1179288 1202478 1226705 1250314 1271998 1291257 1307853
61188A307853J3374R865P087N287L480J230m08p25q05j961l898n712p561r842
$$ 1307853 1321227 1331092 1338179 1343466 1346946 1348176 1347768 1347043 1346238 1344277 1340379 1334667 1327106 1317264
61174A317264j1734j2209j1796j1837j2526j3037j3109j3228j3604j4079j4676
$$ 1317264 1305530 1293321 1281525 1269688 1257162 1244125 1231016 1217788 1204184 1190105 1175429
61163A175429j5332j5652j5569j5513j5336j4104j1732r556q428p576o289n146
$$ 1175429 1160097 1144445 1128876 1113363 1098027 1083923 1072191 1062635 1054207 1046631 1040342 1035196
61151A035196m399k904k51J620P91j980m796p380j0291j2672j3205j2431j1911
$$ 1035196 1030797 1027893 1027642 1029262 1030053 1028073 1023277 1015897 1005606 992934 979729 967298 955387
61138I55387j1641j0456q419o746n709m531l038j685l01J560L458M785O125Q271
$$ 955387 943746 933290 924871 918125 912416 907885 904847 903162 902861 904421 907879 912664 918789 927060
61124I27060J0570J1898J2668J4065J5909J7062J7468J7955J8441J8200J7531
$$ 927060 937630 949528 962196 976261 992170 1009232 1026700 1044655 1063096 1081296 1098827
61113A098827J7457J7926J7887J6817J4922J2354R600P870P590P238N212K011
$$ 1098827 1116284 1134210 1152097 1168914 1183836 1196190 1205790 1213660 1221250 1228488 1233700 1235711
61101A235711j027m077q066j2485j6096j9070k2286k5103k5998k5080k3951k3424
$$ 1235711 1234684 1230607 1222541 1210056 1193960 1174890 1152604 1127501 1101503 1076423 1052472 1029048
61089A029048k3159k3038k3083k2472k0494j7981j6210j5031j3692j2532j1988
$$ 1029048 1005889 982851 959768 937296 916802 898821 882611 867580 853888 841356 829368
61078H29368j1033q749o384n577n549m498k764j972j959j337m05n48j283r10L71
$$ 829368 818335 809586 803202 797625 792076 787578 784814 782842 780883 779546 779141 778593 777310 776400 776771
61063G76771Q84P56J726L855N371N864O705Q203R118R220R682J0841J1980J3317
$$ 776771 777655 778411 780137 783992 789363 795227 801932 810135 819253 828473 838155 848996 860976 874293
61049H74293J5565J7739J8139J7445J7965J9911K1366K1828K2700K4193K4885
$$ 874293 889858 907597 925736 943181 961146 981057 1002423 1024251 1046951 1071144 1096029
61038A096029K4596K4654K5122K4795K4009K4320K5327K5216K4450K5379K7964
$$ 1096029 1120625 1145279 1170401 1195196 1219205 1243525 1268852 1294068 1318518 1343897 1371861
61027A371861K9772L0520L2664L6815M0613M2930M5153M7399M7874M7289M9587
$$ 1371861 1401633 1432153 1464817 1501632 1542245 1585175 1630328 1677727 1725601 1772890 1822477
61016A822477N6570O5933P6140Q8832J04563J20558J35104J50120J67454J87088
$$ 1822477 1879047 1944980 2021120 2109952 2214515 2335073 2470177 2620297 2787751 2974839
61006B974839K11071K44139K87852L39199L97670M67640N51081O45850P55999
$$ 2974839 3185910 3430049 3717901 4057100 4454770 4922410 5473491 6119341 6875340
60997F875340Q95096J073802J296784J580260J945449K350608K626841K538394
$$ 6875340 7770436 8844238 10141022 11721282 13666731 16017339 18644180 21182574
60989B1182574J970193J068216J65810m46869o79353n93821k74252J96876O53600
$$ 21182574 23152767 24220983 24386793 23939924 23260571 22666750 22392498 22589374 23242974
60980B3242974Q33913N35588k02273j101188j839797k249609k347707k238808
$$ 23242974 24076887 24612475 24410202 23309014 21469217 19219608 16871901 14633093
60972A4633093k021490j762600j505489j272986j069451q92112p40306o13456
$$ 14633093 12611603 10849003 9343514 8070528 7001077 6108965 5368659 4755203
60964D755203n07511m18323l44992k87085k41787k06041j78539j57665j40299
$$ 4755203 4247692 3829369 3484377 3197292 2955505 2749464 2570925 2413260 2272961
60955B272961j24535j11165j00838r1919q2655p3355o4923n7108m9756m4182m1667
$$ 2272961 2148426 2037261 1936423 1844504 1761849 1688494 1623571 1566463 1516707 1472525 1430858
60944A430858m1674m2606m3483m4035m4041m3425m2296m0447l7551l4080l1115
$$ 1430858 1389184 1346578 1303095 1259060 1215019 1171594 1129298 1088851 1051300 1017220 986105
60933I86105k9019k7152k5039k2913k1027j9254j7568j6106j4781j3449j2353
$$ 986105 957086 929934 904895 881982 860955 841701 824133 808027 793246 779797 767444
60922G67444j1668j0981r920q891q369p950p048o017n460n027m037k824k185j938
$$ 767444 755776 744795 734875 725984 717615 709665 702617 696600 691140 686113 682076 679252 677067 675129
60908F75129j263j05Q92J473J610P69j270l402m347m470n038o052o428n991n717
$$ 675129 673866 673761 674653 676126 677736 678505 677235 673833 669486 665016 659978 653926 647498 641507 635790
60893F35790n984o207o218o495o862o402m982l567k726j966r29j71l35j306k590
$$ 635790 629806 623599 617381 610886 604024 597622 592640 589073 586347 584381 583452 583281 582946 581640 579050
60878E79050l836m782n184m995m356l465k732k632k981k929k169j525j664j987
$$ 579050 575214 570432 565248 560253 555897 552432 549700 547068 544087 541158 538989 537464 535800 533813
60864E33813j596p05j70j51j76R1Q70K339L859L993K283J85q57j283k137k983
$$ 533813 532217 531512 531342 531191 531015 531106 531976 534315 538174 542167 544450 544635 543778 542495 540358 537375
60848E37375k669j382k62M27J115J446O28j027k558l906n545o969p290o952p072
$$ 537375 534706 533324 533062 533489 534604 536050 536678 535651 533093 529187 523642 516673 509383 502431 495359
60833D95359p334o454m609l449l461l301k130r04o26q91q59n41l39l01l80o59
$$ 495359 488025 481571 476962 473513 470052 466751 464621 463717 463091 462200 461341 460800 460461 460160 459780 459121
60817D59121r88j108j260j855k464k188j060j17L7k06m42p44j049j073j014j380
$$ 459121 458133 457025 455765 453910 451446 449258 448198 448081 448118 447912 447470 446726 445677 444604 443590 442210
60801D42210j990k101j674j506j855j911j035L18J280J511J140M05m33j194j900
$$ 442210 440220 438119 436445 434939 433084 431173 430138 430456 431736 433247 434387 434792 434359 433165 431265
60786D31265k464k469j824j217j236j415j036m51o05j405j752j207n20l58n24
$$ 431265 428801 426332 424508 423291 422055 420640 419604 419153 418548 417143 415391 414184 413664 413306 412782
60771D12782o06n51l02K94R96J223Q92O62J126K199L333L971L823L076K291J831
$$ 412782 412176 411625 411323 411617 412613 413836 414728 415390 416516 418715 422048 426019 429842 432918 435209 437040
60755D37040J570J353J305J327R69K48j1O75J655K156K462L208M061M082K947
$$ 437040 438610 439963 441268 442595 443564 443812 443801 444476 446131 448287 450749 453957 458018 462100 465047
60740D65047J045j165l098m021l975m115n147o078n607m124l066k752k263j262
$$ 465047 466092 464927 461829 457808 453833 449718 444571 438493 432886 428762 425696 422944 420681 419419
60726D19419n71q20j589k046j752q73n7N7l72n96n37j016k199k966k603j927j723
$$ 419419 418848 418028 416439 414393 412641 411768 411711 411768 411396 410800 410263 409247 407048 404082 401479 399552 397829
60709C97829j367k79N47J24o40m15J52m05j621j756o94%k32l77N3L61K95N03J102
$$ 397829 396462 396183 396730 396854 396214 395799 395951 395546 393925 392169 391475 391475 391243 390866 390919 391280 391575 392078 393180
60690C93180J475J664K338L192L043J839R36J111J716K167K773L666M224M057
$$ 393180 394655 396319 398657 401849 404892 406731 407667 408778 410494 412661 415434 419100 423324 427381
60676D27381L561L181L086L551M594N291M614K938J469M14r68k618l524l357k865
$$ 427381 430942 434123 437209 440760 445354 450645 455259 458197 459666 460080 459112 456494 452970 449613 446748
60661D46748k509k052j558j413j379r12l78n58j051p22L43R84J064J653K955L789
$$ 446748 444239 442187 440629 439216 437837 436925 436547 435989 434938 434216 434559 435543 436607 438260 441215 445004
60645D45004L455K456J082r76l218m280l904l404l576l595k639j176MQ13J259
$$ 445004 448459 450915 451997 451021 447803 443523 439619 436215 432639 429044 426405 425229 425233 426046 427305
60630D27305J052M13J07K43J35k93k13O27J338J277Q30M78J47j14k8J43r8k92
$$ 427305 428357 428770 428877 429120 429255 428962 428749 429376 430714 431991 432821 433299 433446 433332 433304 433447 433349 433057
60612D33057N43K086K794K118J173P76M25k65o55l40J7j23l48k60k02l86l89l6
$$ 433057 433600 435686 438480 440598 441771 442547 442972 442707 442052 441712 441729 441606 441258 440998 440796 440410 440021 439985
60594D39985K43L41P58J577K207K417K574K689K437K205K726L563L491K522J964
$$ 439985 440228 440569 441327 442904 445111 447528 450102 452791 455228 457433 460159 463722 467213 469735 471699
60579D71699K201K175J444J003J394J817J864K403L850N155N520N656O373P311
$$ 471699 473900 476075 477519 478522 479916 481733 483597 486000 489850 495005 500525 506181 512554 519865
60565E19865P979Q783R988J0866J0772J0008Q892P122M791K725J130q16l284n125
$$ 519865 527844 536627 546615 557481 568253 578261 587153 594275 599066 601791 602921 602105 598821 593696
60551E93696n599n354m833l256l21K493L625L393L177L635M726O368Q073Q910
$$ 593696 588097 582743 577910 574654 574333 576826 580451 583844 587021 590656 595382 601750 609823 618733
60537F18733Q887R441J1636J4751J7491J9570K1246K2393K2974K3364K3274K1317
$$ 618733 627620 637061 648697 663448 680939 700509 721755 744148 767122 790486 813760 835077
60525H35077J6665J0305L847j985o978j0729j3231j5147j6642j6949j5872j4504
$$ 835077 851742 862047 865894 863909 856931 846202 832971 817824 801182 784233 768361 753857
60513G53857j3578j2285r814o895m734l365k071m67J713M890Q661J1692J3582
$$ 753857 740279 727994 718180 711285 706551 703186 701115 700648 702361 707251 715912 727604 741186
60500G41186J5693J9131K3165K6816L0647L5440M0244M3455M5017M5851M5739
$$ 741186 756879 776010 799175 825991 856638 892078 932322 975777 1020794 1066645 1112384
60489A112384M3511L9070L3684K8402K3473J9240J6303J4584J3046J0464O001
$$ 1112384 1155895 1194965 1228649 1257051 1280524 1299764 1316067 1330651 1343697 1354161 1360162
60478A360162p95r905k0742l2337m3440n2459n8072o0184n9694n7253n3079m7940
$$ 1360162 1359367 1349462 1328720 1296383 1252943 1200484 1142412 1082228 1022534 965281 912202 864262
60466H64262m3045l8634l3980k9141k5314k2880k0666j7982j5815j4957j4413
$$ 864262 821217 782583 748603 719462 694148 671268 650602 632620 616805 601848 587435
60455E87435j2900j0787r178q141p116o216n779n457m795m079l582k844j663q70
$$ 587435 574535 563748 554570 546429 539313 533097 527318 521861 517066 512987 509405 506561 504898 504028
60441E04028j041j366r86m85q01j439j207j32O66O36J76l43r40j667k567l602
$$ 504028 502987 501621 500635 500150 499349 497910 496703 496571 497237 497873 498049 497706 496766 495099 492532 488930
60425D88930m163l290r47J657L525M689N163M361K382O25J77N50R47J531K456
$$ 488930 484767 481477 480530 482187 485712 490401 495564 499925 502307 502932 503109 503659 504606 506137 508593
60410E08593K930K461J960K208K380J395j44q38n13O3O88J564K265K287K073K278
$$ 508593 511523 513984 515944 518152 520532 521927 521783 520945 520432 520495 521183 522747 525012 527299 529372 531650
60394E31650K556K312K010K421L169L221K514J865J648J599J545J479J275J093
$$ 531650 534206 536518 538528 540949 544118 547339 549853 551718 553366 554965 556510 557989 559264 560357
60380E60357J481K395K893K480J902J860J944J715J678K152K311J559P45P78J062
$$ 560357 561838 564233 567126 569606 571508 573368 575312 577027 578705 580857 583168 584727 585472 586250 587312
60365E87312P31L50R56K233L193L835M638N167M798M188M454N377N913O002O401
$$ 587312 588043 588393 589349 591582 594775 598610 603248 608415 613213 617401 621855 627232 633145 639147 645548
60350F45548P068P139O326N166M043K919J727K47j881m293n773n773n252n149
$$ 645548 652616 659755 666081 671247 675290 678209 679936 680183 678302 674009 668236 662463 657211 652062
60336F52062n079m465l816l666l371k330j390j590k432k843k921l244l339k511
$$ 652062 646983 642518 638702 635036 631665 629335 627945 626355 623923 621080 618159 614915 611576 609065
60322F09065j377r95j072n76N28J578K608M022N461O355O983P774Q284Q122P915
$$ 609065 607688 606693 605621 605045 605573 607151 609759 613781 619242 625597 632580 640354 648638 656760 664675
60307F64675Q122P895O543N083M850N641O708Q251J0262J1109R365N950K558r27
$$ 664675 672797 680692 687235 692318 697168 702809 709517 717768 728030 739139 748504 754454 757012 756085
60293G56085n289r446j1551j1776j1622j1234r795p925p102p059o297m866m245
$$ 756085 750796 741350 729799 718023 706401 695167 685372 677447 670345 663286 656989 652123 647878
60280F47878m671n024n163n933o958o868n818n386n870n954n278m899m964m263
$$ 647878 643207 638183 633020 627087 620129 613261 607443 602057 596187 590233 584955 580056 575092 570829
60266E70829k634j591j914k505k303j537n95O44J827K049J336P16N99M87M77J333
$$ 570829 568195 566604 564690 562185 559882 558345 557750 558394 560221 562270 563606 564322 564921 565408 565885 567218
60250E67218K866L784L541K840K153J236K88j6J58j30r97j663j947k345k625j947
$$ 567218 570084 573868 577409 580249 582402 583638 583926 583910 584068 583938 582941 581278 579331 576986 574361 572414
60234E72414m35Q88J761K737L713M117M373N482P087P821P504P207P252P054O931
$$ 572414 571979 572867 574628 577365 581078 585195 589568 595050 602137 609958 617462 624669 631921 638975 645906
60219F45906P940R768J0877J0980J1301J2177J2534J2163J2256J3088J3244J2010
$$ 645906 653846 663614 674491 685471 696772 708949 721483 733646 745902 758990 772234 784244
60207G84244J0556R940R638Q892P926P043N941M650L757L276K566J609R24O9k038
$$ 784244 794800 804740 814378 823270 831196 838239 844180 848830 852587 855863 858429 860038 860962 861031 858993
60192H58993n021p161p937q639r954j0892j0757j0314j0211r923r049q211p807
$$ 858993 853972 846811 838874 830235 820281 809389 798632 788318 778107 768184 759135 750924 743117
60179G43117p347o569n932n445m479l137k346k228j915j311j288j802j685q01
$$ 743117 735770 729201 723269 717824 713345 710208 707862 705634 703719 702408 701120 699318 697633 696832
60165F96832n75j632k742k863k495k217j601n08J39j32m45m3O66J225J969L026
$$ 696832 696257 694625 691883 689020 686525 684308 682707 682199 682338 682206 681761 681718 682384 683609 685578 688604
60149F88604L778L892L725L333K448J668K098L491M427M655N447P242Q841R587
$$ 688604 692382 696274 699999 703332 705780 707448 709546 713037 717464 722119 727566 734808 743649 753236
60135G53236J0268J1239J1537J0779R978R594Q618O590M773M166M035L464K798
$$ 753236 763504 774743 786280 797059 807037 816631 825249 831839 836612 840778 844813 848277 851075
60122H51075K583K555K653L499M981N821N446M729M157K971J005m71q25j236k629
$$ 851075 853658 856213 858866 862365 867346 873167 878613 883342 887499 890470 891475 891004 890179 888943 886314
60107H86314m145m814n182n948o539o384o193o624o880n954m186k497j166k40
$$ 886314 882169 877355 872173 866225 859686 853302 847109 840485 833605 827651 823465 820968 819802 819562
60093H19562j14o74j109j184j607k419k548j658j005j576k759l682m318m620m133
$$ 819562 819448 818774 817665 816481 814874 812455 809907 808249 807244 805668 802909 799227 794909 790289 786156
60078G86156l251l254m328n202n468o314q137r462r355q841q774q269o720n315
$$ 786156 782905 779651 775323 770121 764653 758339 750202 740740 731385 722544 713770 705501 698781 693466
60064F93466n052m966l972k823k626k921k868k812l149k990j544M77K087L388
$$ 693466 688414 683448 679476 676653 674027 671106 668238 665426 662277 659287 657743 658220 660307 663695
60050F63695M532M903M628N209P261R185R563R171R182R130Q323P501P291O615
$$ 663695 668227 673130 677758 682967 690228 699413 708976 718147 727329 736459 744782 752283 759574 766189
60036G66189M492J929J89j276l355n347o491p797j0255j2571j2942j1906j1261
$$ 766189 770681 772610 772799 771523 768168 762821 756330 748533 738278 725707 712765 700859 689598
60023F89598j1282j1114j0854j0970j0704r174p275o415o184n322m073l549l459
$$ 689598 678316 667202 656348 645378 634674 625500 618225 611810 605626 600304 596231 592682 589223
60010E89223k740j675j374j626j363p51q71j636j836j034J38J177J850J746J089
$$ 589223 586483 584808 583434 581808 580445 579694 578823 577187 575351 574317 574455 575632 577482 579228 580317
59995E80317J162K544L848L784L375M257N813O140N111M300M333M365L929L285
$$ 580317 581479 584023 587871 591655 595030 599287 605100 611240 616351 620651 624984 629349 633278 636563
59981F36563K238L29j899l397m088m539m626m018l385l577m087l861l012k276
$$ 636563 638801 639130 637231 633834 629746 625207 620581 616563 613178 609601 605514 601653 598641 596365
59967E96365j447m2J242J470J267J936L268M000L938L864L830L320K692K683K831
$$ 596365 594918 594876 596118 597588 598855 600791 604059 608059 611997 615861 619691 623011 625703 628386 631217
59952F31217K069O56j35O6N97J146J731J794Q45m08j030j357j983k094o24J560
$$ 631217 633286 633942 633807 633873 634470 635616 637347 639141 639986 639578 638548 637191 635208 633114 632490 634050
59936F34050K676K713L154M299M875M267L213K283J361N72J51n34k226m102m453
$$ 634050 636726 639439 642593 646892 651767 656034 659247 661530 662891 663463 663614 663080 660854 656752 652299
59921F52299l013j186%P76J560K336L103L853M271M379M953O300P326P036O093
$$ 652299 649286 648100 648100 648876 650436 652772 655875 659728 663999 668378 673331 679631 686957 693993 700086
59906G00086N574N075L663J774L74r30k956m852m964l473k132j705j456r17l19
$$ 700086 705660 710735 714398 716172 716546 715616 712660 707808 702844 699371 697239 695534 694078 693161 692842
59891F92842M78J789L045L463L383L456L280K492K283L738N506N449M069L771
$$ 692842 693320 695109 698154 701617 705000 708456 711736 714228 716511 720249 725755 731204 735273 739044
59877G39044N099O199N930N013L998K526Q96R0j28r97k437k986k380k057k663
$$ 739044 744143 750342 756272 761285 765283 767809 768705 768795 768667 767670 765233 762247 759867 757810 755147
59862G55147l211l167l315l870l802k800k129k606l352l325k705j950q77N95J909
$$ 755147 751936 748769 745454 741584 737782 734982 732853 730247 726895 723570 720865 718915 718038 718633 720542
59847G20542K809L866N590P863J0349J2494J3089J1146P411L909J838R90J120
$$ 720542 723351 727217 732807 740670 751019 763513 776602 787748 795159 799068 800906 801896 803016
59834H03016K544N151P973R964J0373Q572M633o2l912o578q500r484r111q004
$$ 803016 805560 810711 818684 828648 839021 847593 852226 852164 848252 841674 833174 823690 814579 806575
59820H06575p137o207m261j583N80J913L034L838L445J747m39k538m257m928m259
$$ 806575 799438 793231 788970 787387 787967 789880 792914 796752 800197 801944 801505 798967 794710 789782 785523
59805G85523l320l188l254k479j587k054l506m398m727n714p104p245n946m781
$$ 785523 782203 779015 775761 773282 771695 769641 766135 761737 757010 751296 744192 736947 731001 726220
59791G26220m385l728k510j943k606l496l769l713l491k686j492p94o83l87K31
$$ 726220 721835 718107 715597 713654 711048 707552 703783 700070 696579 693893 692401 691607 690924 690537 690768
59776F90768O25R92K020L299L746L600M147N414O099N799N380N174M715M368N111
$$ 690768 691393 692385 694405 697704 701450 705050 709197 714611 720710 726509 731889 737063 741778 746146 751257
59761G51257O561P300P294P868R147R676Q979Q247Q107P748O786N947N436M486
$$ 751257 757818 765118 772412 780280 789427 799103 808082 816329 824436 832184 838970 844917 850353 854839
59747H54839L049K101J898J688J382J576J798P55j358k911l378l854m786n303
$$ 854839 857888 859989 861887 863575 864957 866533 868331 869086 867728 864817 861439 857585 852799 847496
59733H47496n052m567l652j628O16J229L20n2Q33J580J485J440J598Q93l97m36
$$ 847496 842444 837877 834225 832597 833213 834442 834762 834710 835543 837123 838608 840048 841646 842539 842142 841706
59717H41706J011J894J360J180K527L964M097L793M270N159N839O714P843Q305
$$ 841706 842717 844611 845971 847151 849678 853642 857739 861532 865802 870961 876800 883514 891357 899662
59703H99662Q073Q525R970J0790J0182R589J0186J1180J1801J2666J3693J2978
$$ 899662 907735 916260 926230 937020 947202 956791 966977 978157 989958 1002624 1016317 1029295
59691A029295R503N049J793k36j824k681k565k498l147l534k891k247k732l838
$$ 1029295 1038798 1043847 1045640 1045404 1043580 1040899 1038334 1035836 1032689 1029155 1026264 1024017 1021285 1017447
59677A017447m720n660o857p379o768o171o414o517n475l984k944j797J44K134
$$ 1017447 1012727 1007067 1000210 992831 986063 979892 973478 966961 961486 957502 954558 952761 952905 955039
59663I55039L237L900M893N900O461P068Q151R141R559R778R892R176P557O008
$$ 955039 958276 962176 967069 972969 979430 986498 994649 1003790 1013349 1023127 1033019 1042195 1049752 1055760
59649A055760M677K341j405n235q326j1621j5689j9248k1119k1807k1938k0852
$$ 1055760 1060437 1062778 1061373 1056138 1047812 1036191 1020502 1001254 980135 958328 936390 915538
59637I15538j8209j5200j2840j0653q320o848o825p206p194p573q950j0375j1030
$$ 915538 897329 882129 869289 858636 850316 843468 836643 829437 822243 814670 805720 795345 784315
59624G84315j1507j2190j2252j1404j0741j0549r532p447o186o630o809n084k823
$$ 784315 772808 760618 748366 736962 726221 715672 706140 698693 692507 685877 679068 673984 671161
59611F71161j816j288K06J884K241J781J835K141J852J627K355L129K594J272
$$ 671161 669345 668057 668263 670147 672388 674169 676004 678145 679997 681624 683979 687108 689702 690974
59597F90974N47M67M01O05J294J430K96r73j180r96j413j805j406j159k132l478
$$ 690974 691521 691988 692389 692994 694288 695718 696014 695041 693861 692865 691452 689647 688241 687082 684950 681472
59581F81472l955l999m318m103k763j806k625l875l526k192j864k476k387j359
$$ 681472 677517 673518 669200 665097 662334 660528 657903 654028 650502 648310 646446 643970 641583 640224
59567F40224n69k82J64O26M97J41K25L79J29J54Q58J106K05k93R76K523K233R55
$$ 640224 639655 639373 639537 640163 640660 640801 641026 641405 641534 641688 642546 643652 643857 643564 644540 647063 649296 650251
59549F50251J090K706L878M084M445N127N369N726P549J0358J2459J4238J8079
$$ 650251 651341 654047 657925 662009 666454 671581 676950 682676 690225 700583 713042 727280 745359
59536G45359K4192K8680K6918J7970N434n258j0520j0734q885o979m693j679P53
$$ 745359 769551 798231 825149 843119 848553 843295 832775 822041 813156 806177 801484 799805 800558
59523H00558J506J435J580J277k00j723k146k532m399p030q805r909j1314j2290
$$ 800558 802064 803499 805079 806356 806156 804433 802287 799755 795356 788326 779521 769612 758298 746008
59509G46008j1470r540q300p792o775n295m369l745k392p35RJ47R88K444L403
$$ 746008 734538 724998 716698 708906 702131 696836 692467 688722 686330 685595 685604 685751 686739 689183 692586
59494F92586L908M710N245M426L021K892M104N065N148N044M778L716K366K055
$$ 692586 696494 701204 706449 710875 713896 716788 720892 725957 731105 736149 740927 744643 747009 749064
59480G49064K829L608M170N068N935N900N384N428N524M189J640k24n21j97r4
$$ 749064 751893 755501 759671 764739 770674 776574 781958 787386 792910 797099 798739 798515 797994 797797 797703
59465G97703J9L45O03Q52J483K442L353M231N146N890O702Q303J0291J0927R707
$$ 797703 797722 798067 798670 799522 801005 803447 806800 811031 816177 822067 828769 837072 847363 858290 867997
59450H67997Q499Q650Q765P193M766K863P18k696n808o517n752n838o433n410
$$ 867997 876496 885146 893911 901104 905870 908733 909451 906755 900947 894430 888678 882840 876407 870997
59436H70997k886j035l43O00J815J769N40J20J200K366K895L808N760Q107J0437
$$ 870997 868111 867076 866733 867333 869148 870917 871457 871577 872777 875143 878038 881846 887606 895713 906150
59421I06150J2917J4985J5748J5826J6771J8573J9766K0290K2284K7196L3047
$$ 906150 919067 934052 949800 965626 982397 1000970 1020736 1041026 1063310 1090506 1123553
59410A123553L4894K7949J1560q715k4311l0466k9157k4793j9264j2384m344M674
$$ 1123553 1158447 1186396 1197956 1189241 1164930 1134464 1105307 1080514 1061250 1048866 1044522 1049196
59398A049196J4487K1719J9709N837j3057k6758l1788l1661k9374k4963j9407
$$ 1049196 1063683 1085402 1105111 1110948 1097891 1071133 1039345 1007684 978310 953347 933940
59387I33940j5193j2366q730m476k392k856k901j090O55J066J497K783L655L480
$$ 933940 918747 906381 897651 893175 890783 887927 885026 883936 884591 885657 887154 889937 893592 897072
59373H97072L329L322K098o0q47L30J312Q91M89J074J489J085J085K109L024L334
$$ 897072 900401 903723 905821 905761 904914 905244 906556 907447 907936 909010 910499 911584 912669 914778 917802 921136
59357I21136M158N693O465O144O516Q553J0921J2473J3772J5183J5895J5794J6012
$$ 921136 925294 930987 937452 943596 950112 958665 969586 982059 995831 1011014 1026909 1042703 1058715
59344A058715J6698J6528J5136J3594J1934Q770M119pk676n186q391j1397j3708
$$ 1058715 1075413 1091941 1107077 1120671 1132605 1141375 1145494 1145487 1142811 1137625 1129234 1117837 1104129
59331A104129j6024j8197j8912j8285j8093j8689j8280j6216j4252j3561j3041
$$ 1104129 1088105 1069908 1050996 1032711 1014618 995929 977649 961433 947181 933620 920579
59320I20579j1654j0031q756p353n914n385n628n466n104n956p633p977o674n792
$$ 920579 908925 898894 890138 882785 876871 871486 865858 860392 855288 849332 841699 833722 827048 821256
59306H21256o014n486l299j049K05J508L409M762N292O596R441J2753J6101J9973
$$ 821256 815242 809756 806457 805408 805613 807121 810530 815292 820584 827180 836621 849374 865475 885448
59292H85448K2599K0168J1922K036n287r658j2152j2504j0754q581o803m002L84
$$ 885448 908047 928215 940137 942173 936886 927228 915076 902572 891818 883237 876434 872432 872816
59279H72816M283O153P408R645J1927J2863J3082J3640J4076J3854J3636J3546
$$ 872816 877099 883252 890660 900305 912232 925095 938177 951817 965893 979747 993383 1006929
59267A006929J2350R874P913P230O047L165J4k115m215p101r380r950j0143j1332
$$ 1006929 1019279 1029153 1037066 1044296 1050343 1053508 1053522 1051407 1047192 1040091 1030711 1020761 1010618 999286
59253I99286j2641j2984j3145j3773j3564j1613r428q533q082o825n411m625l454
$$ 999286 986645 973661 960516 946743 933179 921566 912138 903605 895523 888698 883287 878662 875208
59240H75208j110Q63Q00m15q98n60m66q45j394k236l162l405l263m234o508q348
$$ 875208 874098 874961 875761 875346 874448 873888 873422 872577 871183 868947 865785 862380 859117 854883 848375 840027
59224H40027q884r314j0200j0213q887p955q347q455p064n477m949m621l827l819
$$ 840027 831143 821829 811629 801416 792529 784574 776227 767772 760708 755231 750282 745661 741834 738015
59210G38015n147n907m724l106k760l003k852l150m309m471k402M5P87N76R22
$$ 738015 732868 726961 722237 719131 716371 713368 710516 707366 703057 698586 696184 696229 697016 697592 698514
59195F98514J225N75K06J417K961L122K600K883L536L465L243L760M168L402K160
$$ 698514 699739 700314 700520 701937 704898 708020 710620 713503 717039 720504 723747 727507 731675 735077 737237
59180G37237J418O79m13p03K81Q10l00j599j614j330j824j862k76J559K148K533
$$ 737237 738655 739334 738921 738218 738499 739309 739009 737410 735796 734466 732642 730780 730504 732063 734211 736744
59164G36744L892M758L438J193J24k55j461k980l619m156n750p248o983n823n635
$$ 736744 740636 745394 748832 750025 750149 749894 748433 745453 741834 737678 731928 724680 717697 711874 706239
59149G06239o091n701m675m225m262m185m611o007p017o377n076m483m088l142
$$ 706239 700148 694447 689772 685547 681285 677100 672489 666482 659465 653088 648012 643529 639441 636299
59135F36299k632l289l595k163k43N43R53K201L442L699M203O080P861Q070Q096
$$ 636299 633667 630378 626783 624620 624377 624920 625873 628074 631516 635215 639418 645498 653359 661429 669525
59120F69525R573J1105J0755R732J0213J1482J1604J1167J1860J2859J2180J0294
$$ 669525 679098 690203 700958 710690 720903 732385 743989 755156 767016 779875 792055 802349
59108H02349R046Q250O654M959M632M825L670J527K8r73k639m563n731o686p941
$$ 802349 811395 819645 826299 831258 835890 840715 844385 845912 845940 844967 842328 837765 832034 825348 817407
59093H17407p965n613k896k116k072m66J688J705j83j644k396l889n880o866p043
$$ 817407 809442 803829 800933 798817 796745 796279 797967 799672 799489 797845 795449 791560 785680 778814 771771
59078G71771p488p495n956m292m566n789n507l990l358l669l353k513k364k329
$$ 771771 764283 756788 750832 746540 741974 736185 730678 726688 723330 719661 716308 713795 711431 709102
59064G09102j182p4r13k743l224k686l148m315m288l335l188l426k291m05Q7n37
$$ 709102 707920 707846 706933 704190 700966 698280 695132 690817 686529 683194 680006 676580 674289 673884 673971 673434
59048F73434k36Q64Q65r0j46N73K86q17q34K90Q91Q65J424K072J329K8M16K317
$$ 673434 673198 674062 674927 674837 674691 675264 675550 674733 673899 674189 675080 675945 677369 679441 680770 680798 681214 683531
59030F83531L594L938M844O367P336Q337J0899J4170J5755J5428J4719J3540J0736
$$ 683531 687125 691063 695907 702274 709610 717947 728846 743016 758771 774199 788918 802458 813194
59017H13194P201M805K872n68m639o613o495o729p763p732o241m683l063l14K649
$$ 813194 820395 825200 828072 827504 822865 816252 809757 803028 795265 787533 781292 776609 773546 773232 775881
59002G75881L918M230N807Q043Q291O538N240M816L509J448P13J344J311M05K47
$$ 775881 779799 784029 789836 797879 806170 812708 817948 822764 826273 827721 828434 829778 831089 831494 831741
58987H31741N98k72j715j374M77J373J306K572N061O259O055P072R809J1856J2395
$$ 831741 832339 832067 830352 828978 829455 830828 832134 834706 839767 846026 852081 859153 868962 880818 893213
58972H93213J3109J4223J3920J2280J1487J1554J0199P427N932O236N780L623
$$ 893213 906322 920545 934465 946745 958232 969786 979985 987412 993344 999580 1005360 1008983
58960A008983J741Q22r16l811n938p096r423j3078j5493j5966j6750j8529j9014
$$ 1008983 1010724 1011546 1010630 1006819 1000881 993785 984362 971284 955791 939825 923075 904546 885532
58947H85532j7333j5634j5011j3760j1089q750p535n829l045j005o68p61o17r77
$$ 885532 868199 852565 837554 823794 812705 803955 796420 790591 787546 786541 785873 785112 784495 783518
58933G83518j332n7K126K562J115L96J030Q21p76j604j089j231k375k375r62n71
$$ 783518 782186 782129 784255 786817 787932 788328 789358 790179 789403 787799 786710 785479 783104 780729 779767 779196
58917G79196j648j543N97K223K120K379M123N572N884O775Q659R419Q648Q938
$$ 779196 777548 776005 776602 778825 780945 783324 787447 793019 798903 805678 814337 823756 832404 841342
58903H41342J1253J3160J3373J3893J5787J6942J5990J4608J4032J3129J1630
$$ 841342 852595 865755 879128 893021 908808 925750 941740 956348 970380 983509 995139
58892I95139J1449J3079J4474J5085J6976K0330K2033K0540J8137J6584J4649
$$ 995139 1006588 1019667 1034141 1049226 1066202 1086532 1108565 1129105 1147242 1163826 1178475
58881A178475J1707R532Q557O552K952L53k42j428m640p681r045j0335j2136j2029
$$ 1178475 1190182 1199714 1208271 1214823 1217775 1218128 1217886 1216458 1211818 1204137 1195092 1184757 1172621 1160592
58867A160592r296p273q265j0108j0457j0502j1737j2973j3262j4048j5814j6334
$$ 1160592 1151296 1144023 1135758 1125650 1115193 1104691 1092954 1079981 1066719 1052671 1036857 1020523
58855A020523j4753j3625j4359j4628j2811j1074j1266j1700j0877j0559j2168
$$ 1020523 1005770 992145 977786 963158 950347 939273 928007 916307 905430 894871 882703
58844H82703j3782j3616j3010j3217j2819j1025r890j0501j0573q560o486o067
$$ 882703 868921 855305 842295 829078 816259 805234 795344 784843 774270 765710 759224 753157
58832G53157n681m000k771l187l229j511l1k38j47J701L243K869K523L787M644
$$ 753157 747476 743476 740705 737518 734289 732778 732747 732509 732362 734063 737306 740175 742698 746485 751129
58817G51129L404K045K392K674J210j81K43P39l72j357o30j19j641l404l445l146
$$ 751129 754533 756578 758970 761644 762854 762673 762916 763655 763283 761926 761296 761177 759536 756132 752687 749541
58801G49541l996m416l176k394l653m682l412j815k124k780j738l92n28o52R72
$$ 749541 745545 741129 737953 735559 731906 727224 723812 721997 719873 717093 715355 714963 714435 713783 714755
58786G14755K990M079N986R776J2624J2093J0269R981J0322R592R170J0432J1159
$$ 714755 717745 721824 727810 737586 750210 762303 772572 782553 792875 802467 811637 822069 833228
58773H33228Q993N347K200j570o982j1559j3121j3587j5072j5752j3662j0995
$$ 833228 842221 847568 849768 848198 841216 829657 816536 802949 787877 772125 758463 747468
58761G47468j0367j0176q034n443m688m410k657j141j981l321k649j405j844k478
$$ 747468 737101 726925 718891 713448 708760 704350 701693 700552 698571 695250 692601 691196 689352 686874
58747F86874j092P48Q08P36K969N894O720O283O693P042N895N043O344P783P015
$$ 686874 685782 686530 687338 688074 691043 696937 703657 709940 716633 723675 729570 734613 740957 748740 755755
58732G55755N782O461P485O666N667O441O784M411K038L050N373N143L504M099
$$ 755755 761537 767998 775483 782149 787816 794257 801041 805452 807490 810540 815913 821056 824560 828659
58718H28659O514P757P850Q584R039P487N390M635L430j66l668m233m224p203
$$ 828659 835173 842930 850780 859364 868403 875890 881280 885915 889345 889179 885511 881278 877054 869851
58704H69851j1489j3477j4386j7539k1540k2483k0792j9845j9684j8076j5871
$$ 869851 858362 844885 830499 812960 791420 768937 748145 728300 708616 690540 674669
58693F74669j5436j5498j3242r795q159p642n836l982m672o305n622l750l893
$$ 674669 659233 643735 630493 620698 612539 604897 599061 595079 590407 584102 578480 574730 570837
58680E70837m984l673q00J37p04m99N48L31o1J891M939O210O708R115J2187J3177
$$ 570837 565853 562180 561380 561517 560813 560314 560862 561193 561132 563023 567962 574172 580880 589995 602182 615359
58664F15359J3656J6749K0522K0349J6026J0537L962m865j2780j5392j4282j4459
$$ 615359 629015 645764 666286 686635 702661 713198 717160 712295 699515 684123 669841 655382
58652F55382j6140j5724j3267j1940j1383q736n192m518n825m869j788o36j740
$$ 655382 639242 623518 610251 598311 586928 578192 573000 568482 562657 557788 556000 555364 553624
58639E53624j465P31J701R25R73J857J098q16j080k25j140l181l195j629j525
$$ 553624 552159 552890 554591 555516 556489 558346 559444 558628 557548 557323 556183 553002 549807 548178 546653
58624E46653k445j570K92J22j008L42L160L577K204K941N546O445N934P253R343
$$ 546653 544208 542638 542930 543052 542044 542386 545546 549123 551327 554268 559814 566259 572193 579446 588789
58609E88789Q082M298K997M814N563M162L613M180K933K65l43Q62K60j986k184
$$ 588789 596871 601169 604166 608980 614543 618705 622318 626498 629431 629696 629353 630215 630475 628489 626305
58594F26305l55p9j269l32K614M035M275O955J1307J2811J1598J2259J5138J5769
$$ 626305 625950 625871 624602 624270 626884 630919 635194 642149 653456 666267 677865 690124 705262 721031
58580G21031J3423J2167J2742J1442P953O393P540P758O675Q103J2323J5186J6017
$$ 721031 734454 746621 759363 770805 778758 785151 792691 800449 807124 815227 827550 842736 858753
58567H58753J8770K4116K8181L0201L3700L8802M1191L9988L8745L7341L0994
$$ 858753 877523 901639 929820 960021 993721 1032523 1073714 1113702 1152447 1189788 1220782
58556A220782J9156P566m33p096j3209j5593j3693j1303r760o494j809J01j681
$$ 1220782 1239938 1247504 1247071 1239975 1226766 1211173 1197480 1186177 1176417 1169923 1168114 1168215 1166534
58543A166534l821n977j1495j9881k6309k9763l3710l7832l7538l3026l0069l0059
$$ 1166534 1162713 1156736 1145241 1125360 1099051 1069288 1035578 997746 960208 927182 897113 867054
58531H67054k7979k2172j7474j6291j5084j2122j0452j0714r228n576m013n218
$$ 867054 839075 816903 799429 783138 768054 755932 745480 734766 725538 719962 715949 710731
58519G10731m852k244j936m528m935k038r73l267l864q89Q67o57j029J699L146
$$ 710731 705879 703635 701699 697171 692236 690198 689225 685958 682094 681205 682072 681415 680386 682085 685231
58504F85231J282J38J403J088j917k809j4J397p59j639J392M133M074M889Q322
$$ 685231 686513 686651 688054 689142 687225 684416 684402 685799 685040 683401 684793 688926 693000 697889 706211
58489G06211J0194Q647Q064J0731J2850J2717J4388J9355K3093K3681K5337K9486
$$ 706211 716405 725052 733116 743847 756697 769414 783802 803157 826250 849931 875268 904754
58477I04754L1146K7964K3980K0631J3368J354q821j3575j7224k2194k3907k0130
$$ 904754 935900 963864 987844 1008475 1021843 1023197 1014376 1000801 983577 961383 937476 917346
58465I17346j5965j4549j1989o309k110j399P77O677J1319J2385J4851K0674K3907
$$ 917346 901381 886832 874843 868534 866424 865025 865802 872479 883798 896183 911034 931708 955615
58452I55615K1386J8211J7049J2390J546q918j4117j8167k4179k7205k4100k0492
$$ 955615 977001 995212 1012261 1024651 1026197 1017279 1003162 984995 960816 933611 909511 889019
58440H89019k0638j9893j4435r075q133p731m284j512k054j296L486P109O357
$$ 889019 868381 848488 834053 824978 816845 809114 804830 803318 801264 799968 803454 810563 816920
58427H16920O456J0843J4226J2761J1134J2445J1240M226k379l978n779j1865
$$ 816920 823376 834219 848445 861206 872340 884785 896025 900251 897872 893894 888115 876250
58415H76250j6483j4763j1942j3245j4453j1322q452r935j0921p335m179n495
$$ 876250 859767 845004 833062 819817 805364 794042 785590 775655 764734 757399 753220 747725
58403G47725o070j976R42j737l766L11M757L542J380L901O915N622M455P551R454
$$ 747725 741655 739679 740621 738884 735118 735429 740186 743728 745108 749009 755924 761546 766001 773552 783006
58388G83006N678K482N668R708Q603P311J1502J6042J4807J1864J2040J0608L605
$$ 783006 788684 791166 796834 806542 815145 822456 833958 850000 864807 876671 888711 899319 902924
58375I02924k045j59L347K041J039N820J0141P661M726Q696J4236J4161J3170
$$ 902924 900879 900720 904067 906108 907147 912967 923108 930769 935495 944191 958427 972588 985758
58362I85758J7419K1189J7715J2822J3825J5224R526J983L04P5n173r794o735
$$ 985758 1003177 1024366 1042081 1054903 1068728 1083952 1093478 1095461 1095765 1095840 1090667 1080873 1074138
58349A074138k022l653o311k152L577L051J370N958J1064Q992O111J1192J8245
$$ 1074138 1072116 1068463 1062152 1060000 1063577 1066628 1067998 1073956 1085020 1094012 1100123 1111315 1129560
58336A129560J7900J5258J9171K4165K0986J5020J6007J9096J4522O642M981N698
$$ 1129560 1147460 1162718 1181889 1206054 1227040 1242060 1258067 1277163 1291685 1298327 1303308 1309006
58324A309006M12n886m277J23j861n255j282M198J798k194K572R978Q801M353
$$ 1309006 1309418 1303532 1299255 1299378 1297517 1292262 1290980 1295178 1296976 1294782 1297354 1307332 1316133 1320486
58310A320486P904J4698J3786R831J3417J9416J7040J1751J4868K1077J8881J3605
$$ 1320486 1328390 1343088 1356874 1366705 1380122 1399538 1416578 1428329 1443197 1464274 1483155 1496760
58298A496760J6958K3516K1206J5307J8072K4385K2141J6882K1092K8941K7288
$$ 1496760 1513718 1537234 1558440 1573747 1591819 1616204 1638345 1655227 1676319 1705260 1732548
58287A732548K1700K5478L2913L0333K3550K6824L4624L2594K6437L0906M0034
$$ 1732548 1754248 1779726 1812639 1842972 1866522 1893346 1927970 1960564 1987001 2017907 2057941
58276B057941L8260L1347L5660M6147M6161L9819M2977N1277M9472M3275M8999
$$ 2057941 2096201 2127548 2163208 2209355 2255516 2295335 2338312 2389589 2439061 2482336 2531335
58265B531335O0740O1309N6180O2269P2898O9570N8667N9727O7234O1919N0158
$$ 2531335 2592075 2653384 2709564 2771833 2844731 2914301 2972968 3032695 3099929 3161848 3212006
58254C212006N2817O4595O4705N8402O6375Q2369Q4250P7916Q6172J03324J06155
$$ 3212006 3264823 3329418 3394123 3452525 3518900 3601269 3685519 3763435 3849607 3952931 4059086
58243D059086J00577J10363J29104J32096J26448J38713J62079J68429J63633
$$ 4059086 4159663 4270026 4399130 4531226 4657674 4796387 4958466 5126895 5290528
58234E290528J76269K00558K07444K03437K19354K49150K61315K62391K85240
$$ 5290528 5466797 5667355 5874799 6078236 6297590 6546740 6808055 7070446 7355686
58225G355686L22956L41377L48452L80996M31315M60654M76851N20998N86012
$$ 7355686 7678642 8020019 8368471 8749467 9180782 9641436 10118287 10639285 11225297
58216A1225297O30508O64411P33714Q29208R03290R68340J079519J229279J365315
$$ 11225297 11855805 12520216 13253930 14083138 14986428 15954768 17034287 18263566 19628881
58207A9628881J503953J711200J981267K258478K569571K997772L535465M111350
$$ 19628881 21132834 22844034 24825301 27083779 29653350 32651122 36186587 40297937
58199D0297937M751667N549990O495382P521928Q710570J0224648J2075712J4220182
$$ 40297937 45049604 50599594 57094976 64616904 73327474 83552122 95627834 109848016
58191A09848016J6856185K0310710K4719211L0260983L7447608M5980588N2729841
$$ 109848016 126704201 147014911 171734122 201995105 239442713 285423301 338153142
58184C38153142N2030892L9778720J7723041o970245k6735383l8038954m1595960
$$ 338153142 390184034 429962754 447685795 440715550 413980167 375941213 334345253
58177C34345253l9947161l5695161l1047246k7421639k4978812k2975162k0775322
$$ 334345253 294398092 258702931 227655685 200234046 175255234 152280072 131504750
58170A31504750j8344263j5902146j3561947j1399556r543063q031329o762134
$$ 131504750 113160487 97258341 83696394 72296838 62753775 54722446 47960312
58163D7960312n663400m767660m074970l496186k979740k560997k245792j967184
$$ 47960312 42296912 37529252 33454282 29958096 26978356 24417359 22171567 20204383
58155B0204383j694026j470533j314351j177126j035538r25729q59247p93575
$$ 20204383 18510357 17039824 15725473 14548347 13512809 12587080 11727833 10934258
58147A0934258p12038o49928o17551n75939n11435m59599m33726m00771l48700
$$ 10934258 10222220 9572292 8954741 8378802 7867367 7407768 6974042 6573271 6224571
58138F224571l09342k94069k72111k32931k07790k09198k07945j89838j78689
$$ 6224571 5915229 5621160 5349049 5116118 4908328 4699130 4491185 4301347 4122658
58129D122658j84017j80361j57858j41732j42944j38607j19072j06700j10523
$$ 4122658 3938641 3758280 3600422 3458690 3315746 3177139 3058067 2951367 2840844
58120B840844j08326r0909p9774q4151q3466o8840o0258o6304o7363n4911m8189
$$ 2840844 2732518 2641609 2561835 2477684 2394218 2325378 2265120 2198816 2131453 2076542 2028353
58109B028353n5837n9116m9145m3748n1469n4775m4888l8608m4777m7585l8764
$$ 2028353 1972516 1913400 1864255 1820507 1769038 1714263 1669375 1630767 1585990 1538405 1499641
58098A499641l3711m0188m2682l3111k6449l0876l2294k3212j7779k3419k5992
$$ 1499641 1465930 1425742 1383060 1349949 1323500 1292624 1260330 1237118 1219339 1195920 1169928
58087A169928j7625j1666j5733j7114r085n051j2274j7494j2819j0523j8030k3032
$$ 1169928 1152303 1140637 1124904 1107790 1098705 1093654 1081380 1063886 1051067 1040544 1022514 999482
58075I99482j7684j3512j8188k0945j4922j1066j6031j8679j2199p672j2204j5070
$$ 999482 981798 968286 950098 929153 914231 903165 887134 868455 856256 848584 836380 821310
58063H21310r097m655q923j1858o312j983o095r809o796o016j2952j7307j2283
$$ 821310 812213 807558 798635 786777 780465 778482 772387 762578 755782 749766 736814 719507 707224
58050G07224p585j0488j2451p161l508p717j0650n775k172o696j0571o679l188
$$ 707224 699639 689151 676700 669539 666031 658314 647664 641889 639717 633021 622450 615771 612583
58037F12583o934r968n742k277o092r059m554r35n594j0831q912o361r851j2539
$$ 612583 605649 595681 589939 587662 581570 572511 567957 567022 561428 550597 541685 535324 525473 512934
58023E12934p910l244n803q987n520j386l525o390l640q48l878o740l489l08l370
$$ 512934 505024 501780 495977 486990 481470 480084 476559 470169 466529 465681 461803 455063 451574 451266 447896
58008D47896o534l352L57j896m699j927R05k260n767l201J76j968m710k180L31
$$ 447896 441362 438010 438367 436471 431772 429845 430750 428490 422723 419522 419698 417730 413020 410840 411171
57993D11171l329p946o927m423n733n731J036Q448R083P053Q834J0693P185K926
$$ 411171 407842 399896 392969 388546 382813 377082 378118 386566 395649 402702 411536 422229 429414 432340
57979D32340L852N463J804k400n14L456K820O93K780N648L798Q83K368M383J273
$$ 432340 436192 441655 443459 441059 440545 444001 446821 447514 450294 455942 459740 460623 462991 467374 468647
57964D68647l080k627o66k835n782l937p01j839m425l219j367l869p052n369k214
$$ 468647 465567 462940 462274 459439 453657 449720 449019 447180 442755 439536 438169 434300 427248 421879 419665
57949D19665l273n538l633n36j357k753N27M885M474K489M921Q977Q731O650Q404
$$ 419665 416392 410854 407221 406685 405328 402575 403102 407987 412461 414950 419871 428848 437579 444229 452633
57934D52633J1624J0773Q107Q921J0712P864K472N9r02m909r532r909q605j0814
$$ 452633 464257 475030 483137 492058 502770 510634 513106 513165 512263 507354 497822 487913 479308 468494
57920D68494j4089j2972r549r337j0898r445o556o497p069l966k3l37k377p21
$$ 468494 454405 441433 431884 422547 411649 402204 395648 389151 382082 378116 378093 377756 375379 374658
57906C74658K520J933q33q00K98k189n893n484k940l756o459n798k940k552l231
$$ 374658 377178 379111 378278 377478 377776 375587 369694 364210 361270 357514 351055 345257 342317 339765 336534
57891C36534o88K904K712R25K702N873M802J207Q12K346M55l351l296m45o75l604
$$ 336534 335846 338750 341462 342387 345089 350962 355764 356971 357783 360129 360584 357233 353937 353492 352817 349213
57875C49213m023k307l100n319l853K57J447P9J251M494M690K329K784O052O906
$$ 349213 345190 342883 339783 334464 330611 330868 332315 332394 333645 338139 342829 345158 347942 353994 360900
57860C60900M870M611O758P481O718P897R908Q413M629L913O023N713K598J471
$$ 360900 365770 370381 377139 384620 391338 399235 409143 417556 422185 426098 432121 437834 440432 441903
57846D41903K932K684K31l62J246R91j620k853k224k851m426l600j244j520l862
$$ 441903 444835 447519 447750 447388 448634 449625 448005 445152 442928 440077 435651 432051 430807 429287 425425
57831D25425l693q81L26n04J97K249J846o45j031N68j00l017l691j590r21k605
$$ 425425 421732 420851 421177 420673 420870 423119 424965 424320 423289 423857 423757 420740 417049 415459 414538 411933
57815D11933l133j814j576k222n21K697K973R5j841k207m096o831o262k868j592
$$ 411933 408800 406986 405410 403188 402667 405364 408337 408432 406591 404384 400288 393457 387195 384327 382735
57800C82735l037k741J12J250m55j183K79Q02j27P27L319L575J033o3J448J970
$$ 382735 379698 376957 377069 378319 377864 376681 376960 377762 377635 378362 381681 385256 386289 386226 387674 389644
57784C89644M17k8J267J081p76m20K717M461L338K474K768J155k654m704l851
$$ 389644 390061 390033 391300 392381 391605 391185 393902 398363 401701 404175 406943 408098 405444 400740 396889
57769C96889l536m963n212l705l775o047o978n668n489p173p134m477k956l954
$$ 396889 393353 388390 383178 379473 375698 369651 362673 357005 351516 344343 337209 332732 329776 325822
57755C25822m106k025q17j786k030m96r8j682k019J8J386R01J249L126L548J939
$$ 325822 321716 319691 318874 317088 315058 314562 314464 312782 310763 310781 312167 313068 314317 317443 320991 322930
57739C22930J614L251L301R18%K072L649K945K779M295M354J910O09K141L136
$$ 322930 324544 327795 331096 332014 332014 334086 337735 340680 343459 347754 352108 354018 354627 356768 359904
57724C59904J664P58K328L533K365J247J882K030M57k35J257K224J175N26J363
$$ 359904 361568 362326 364654 368187 370552 371799 373681 375711 376168 375933 377190 379414 380589 381115 382478
57709C82478R35j765l394k113q55j745k551j577q49j564j484K50Q83n61j033O37
$$ 382478 383413 381648 378254 376141 375286 373541 370990 369413 368564 367000 365516 365766 366649 366088 365055 365692
57693C65692J007j712m137l699k785l550l840j867O1Q3K60K173L712L612M361
$$ 365692 366699 364987 360850 357151 354366 350816 346976 345109 345170 345253 345513 347686 351398 355010 359371
57678C59371P363R990J0714J2273J6397K0466K2921K6884L4577M3167N0402N9391
$$ 359371 366734 376724 387438 399711 416108 436574 459495 486379 520956 564123 614525 673916
57666F73916P2815Q5908Q9608P8075N0823J2090k8408n8783p3690p7319p5573
$$ 673916 746731 832639 922247 1000322 1051145 1063235 1034827 976044 902354 825035 749462
57655G49462o9681n9858m9584m1779l5067k7865k2148j9436j7270j3605j0609
$$ 749462 679781 619923 570339 528560 493493 465628 443480 424044 406774 393169 382560
57644C82560j0217j0095p967n909o168o776n440l936m413n078l846k607l584m896
$$ 382560 372343 362248 354281 348372 342204 335428 329988 326052 321639 316561 312715 310108 306524 301628
57630C01628m027k401k378k930k340j947l148l908k332n25r53k133j869j470k704
$$ 301628 297601 295200 292822 289892 287552 285605 282457 278549 276217 275692 274739 272606 270737 269267 266563
57615B66563l748k384k59J04l75J16M39q20j913j127l68j639k996k083o05j073
$$ 266563 262815 260431 260172 260276 259901 260017 260456 259636 257723 256596 256228 254589 251593 249510 248905 247832
57599B47832k071j120N80N79l41l06k95j729k814j554J22m26j750j101M78L11
$$ 247832 245761 244641 245221 245800 245459 245153 244858 243129 240315 238761 238883 238457 236707 235606 236084 236395
57583B36395r03p32L44K13o83n82r7p87j779j523j078k145l665l849l533m139
$$ 236395 235492 234760 235104 235317 234634 234052 233955 233168 231389 229866 228788 226643 222978 219129 215596 211457
57567B11457m519l263j857k066k537j455j03k46o14L81J136j14j472n72J082R87
$$ 211457 206938 203675 201818 199752 197215 195760 195657 195411 194797 195178 196314 196200 194728 194156 195238 196225
57551A96225K21J003K319K251K106L810N624M964L104K666K776J365j30Q05K751
$$ 196225 196446 197449 199768 202019 204125 207935 213559 218523 221627 224293 227069 228434 228304 229109 231860
57536B31860K581P84j17n10k181l845l115j273j176k014j033J025J184l57r66
$$ 231860 234441 235225 235108 234598 232417 228572 225457 224184 223008 220994 219961 220986 222170 221813 220847
57521B20847m93o88q84Q73L397L786K386J807K074J287OL19J437R07o39n49R14
$$ 220847 220354 219666 218782 219655 223052 226838 229224 231031 233105 234392 234398 234717 236154 237061 236422 235873 236787
57504B36787J298P62J498L058K951J342O74J134Q63M4L89J228N50p94m01Q71J04
$$ 236787 238085 238847 240345 243403 246354 247696 248370 249504 250367 250411 250800 252028 252578 251784 251383 252254 252358
57487B52358k223k834j333n35j220j313l33p2o69l07R48J185M76O23J175l7k480
$$ 252358 250135 247301 245968 245433 244213 242900 242567 242495 241826 241519 242467 243652 244128 244751 245926 245889 243409
57470B43409l288k141j508j954j531k2N30q6J88J573J931Q21K18P09P33L1J44
$$ 243409 240121 237980 236472 234518 232987 232965 233495 233409 233597 235170 237101 237922 238140 238849 239582 239613 239757
57453B39757J124J316P31J060K106J880M27K5J227K238K385K754L310K847J879
$$ 239757 240881 242197 242928 243988 246094 247974 248401 248426 249653 251891 254276 257030 260340 263187 265066
57438B65066K150L369L759L527M209N072M066K006J640K879L038J722J049J209
$$ 265066 267216 270585 274344 277871 282080 287152 291218 293224 294864 297743 300781 302503 303552 304761
57424C04761K30j575j557M56J640J035O48J186R56k18k17J378K493K564L430N465
$$ 304761 304991 303416 301859 302315 303955 304990 305638 306824 307780 307562 307345 308723 311216 313780 317210 322675
57408C22675O670O358N906N332L063k47j783j123p16j218n76J471K401J478J057
$$ 322675 329345 335703 341609 346941 350004 349757 347974 346851 346135 344917 344341 345812 348213 349691 350748
57393C50748K100K581J658J342K502L224K682K851M718O435O764O974P764P741
$$ 350748 352848 355429 357087 358429 360931 364155 366837 369688 374406 380841 387605 394579 402343 410084
57379D10084O402N347N246M778L697L569M416M098K215J054J575J921J129P40
$$ 410084 416486 421833 427079 431857 435554 439123 443539 447637 449852 450906 452481 454402 455531 456271
57365D56271J447J651P17L20J278K355L194M938P027P098N127L955M605M928M039
$$ 456271 457718 459369 460086 460406 461684 464039 467233 472171 479198 486296 491423 495378 499983 504911 508950
57350E08950L946N402O262N658N707P258P940O457N043N470O288O114O056O832
$$ 508950 512896 518298 524560 530218 535925 543183 551123 557580 562623 568093 574381 580495 586551 593383
57336E93383O918N727N264O564P742P544P517Q660R326Q492P863Q659R524R570
$$ 593383 600301 606028 611292 617856 625598 633142 640659 649319 658645 667137 675000 683659 693183 702753
57322G02753J0168J1836J2711J2049J1867J3153J4012J3555J3851J5796J6852
$$ 702753 712921 724757 737468 749517 761384 774537 788549 802104 815955 831751 848603
57311H48603J5478J4177J5336J7412J8154J8331J9386K0409K0349K0492K1997
$$ 848603 864081 878258 893594 911006 929160 947491 966877 987286 1007635 1028127 1050124
57300A050124K3668K4590K6158K8950L0643K9734K8477K9286L1132L2162L3149
$$ 1050124 1073792 1098382 1124540 1153490 1184133 1213867 1242344 1271630 1302762 1334924 1368073
57289A368073L5343L7542L8262L8512L9708M1095M1780M2947M5505M7915M8804
$$ 1368073 1403416 1440958 1479220 1517732 1557440 1598535 1640315 1683262 1728767 1776682 1825486
57278A825486M9309N0543N1295N0611M9990N0575N0918M9995M9572N0864N1654
$$ 1825486 1874795 1925338 1976633 2027244 2077234 2127809 2178727 2228722 2278294 2329158 2380812
57267B380812M9624M5960M2870M0118L6854L4284L3495L3103L1859L1185L2350
$$ 2380812 2430436 2476396 2519266 2559384 2596238 2630522 2664017 2697120 2728979 2760164 2792514
57256B792514L3768L3934L4412L6896L9865M1279M2007M3381M3938M2014L9322
$$ 2792514 2826282 2860216 2894628 2931524 2971389 3012668 3054675 3098056 3141994 3184008 3223330
57245C223330L8409L8629L7955L6796L6630L6838L6185L5703L6844L8495L8975
$$ 3223330 3261739 3300368 3338323 3375119 3411749 3448587 3484772 3520475 3557319 3595814 3634789
57234C634789L9267M1176M4076M6399M8624N1875N5349N7952O0601O4040O6645
$$ 3634789 3674056 3715232 3759308 3805707 3854331 3906206 3961555 4019507 4080108 4144148 4210793
57223D210793O7251O7904P0466P2881P2262O9689O8213O8041O7298O5890O4990
$$ 4210793 4278044 4345948 4416414 4489295 4561557 4631246 4699459 4767500 4834798 4900688 4965678
57212D965678O4203O2769O2040O3383O5188O5350O5066O6665O9376P0918P1697
$$ 4965678 5029881 5092650 5154690 5218073 5283261 5348611 5413677 5480342 5549718 5620636 5692333
57201E692333P3556P5774P6217P5316P5149P5543P4794P3381P3301P4460P5200
$$ 5692333 5765889 5841663 5917880 5993196 6068345 6143888 6218682 6292063 6365364 6439824 6515024
57190F515024P5598P6954P8731P9303P8961P9113P9357P8487P7387P7722P8714
$$ 6515024 6590622 6667576 6746307 6825610 6904571 6983684 7063041 7141528 7218915 7296637 7375351
57179G375351P8353P6868P5779P4620P1798O7780O4209O0888N6815N2928N0502
$$ 7375351 7453704 7530572 7606351 7680971 7752769 7820549 7884758 7945646 8002461 8055389 8105891
57168H105891M8040M3291L7194L2170K7701K1485J4078Q270M495P37l438o853
$$ 8105891 8153931 8197222 8234416 8266586 8294287 8315772 8329850 8338120 8342615 8343352 8339914 8333061
57156H333061j0321j6298k4693l2787l9518m6488n4583o2966p1607q1519r2107
$$ 8333061 8322740 8306442 8281749 8248962 8209444 8162956 8108373 8045407 7973800 7892281 7800174
57145G800174j01212j08066j13464j17064j17258j13752j07597r8821q6753p2528
$$ 7800174 7698962 7590896 7477432 7360368 7243110 7129358 7021761 6922940 6836187 6763659
57135F763659n8580m5837l3944k3879j7600j5368j6019j9520k6632l6465m6964
$$ 6763659 6705079 6659242 6625298 6601419 6583819 6568451 6552432 6532912 6506280 6469815 6422851
57124F422851n7308o7393p5727q0633q2771q3734q3033p9338p3627o7940o2002
$$ 6422851 6365543 6298150 6222423 6141790 6059019 5975285 5892252 5812914 5739287 5671347 5609345
57113E609345n4500m6795m1610l8507l4321k7755j9859j0153L963K3677M8123
$$ 5609345 5554845 5508050 5466440 5427933 5393612 5365857 5345998 5335845 5339808 5363485 5411608
57102E411608P7701J15017J62249K20544K92374L81640M91156O22384P77536R59005
$$ 5411608 5489309 5604326 5766575 5987119 6279493 6661133 7152289 7774673 8552209 9511214
57092I511214J166377J396088J643742J904476K171499K436213K686941K900220
$$ 9511214 10677591 12073679 13717421 15621897 17793396 20229609 22916550 25816770
57084B5816770L029670L009336K782839K347550J781134J217047P70305M66407
$$ 25816770 28846440 31855776 34638615 36986165 38767299 39984346 40754651 41221058
57076D1221058K37715q158l15801o69936j034047j382866j702588j980521k204888
$$ 41221058 41458773 41450615 41134814 40464878 39430831 38047965 36345377 34364856 32159968
57067C2159968k367759k462625k483976k433283k321720k164587j976493j772535
$$ 32159968 29792209 27329584 24845608 22412325 20090605 17926018 15949525 14176990
57059A4176990j568084j373922j194538j032566q91125p70683o68103n80742n07972
$$ 14176990 12608906 11234984 10040446 9007880 8116755 7346072 6677969 6097227 5589255
57050E589255m47739l95903l50481l12526k81498k54028k28759k08040j92846
$$ 5589255 5141516 4745613 4395132 4082606 3801108 3547080 3318321 3110281 2917435
57041B917435j80075j66864j53804j41937j30199j17956j06745r7439q8619p9355
$$ 2917435 2737360 2570496 2416692 2274755 2144556 2026600 1919855 1822416 1733797 1654442
57031A654442p0683o2967n4797m5613l6510k7577j7492n808P944K6595N0803P1143
$$ 1654442 1583759 1520792 1465995 1420382 1383872 1356295 1338803 1332995 1340939 1367534 1418337 1489480
57019A489480P1486M4353o58m5993p9763r8702j03938r9132q9906q0369p0884
$$ 1489480 1560966 1605319 1604661 1558668 1478905 1380203 1276265 1177133 1087227 1006858 935974
57008I35974o0958n1947m4979l9012l3204k8681k5977k3352j9608j6080j3996
$$ 935974 875016 823069 778090 739078 705874 677193 651216 627864 608256 592176 578180
56997E78180j2493j0810r734r197p457m282k030j770j356R33L935O562J0028J5126
$$ 578180 565687 554877 545143 535946 528489 524207 522177 520407 519051 519984 523919 530481 540509 555635
56983E55635K0128K3169K3778K0749J2107p52j2440j9301k2600k4263k3437j9755
$$ 555635 575763 598932 622710 643459 655566 654814 642374 623073 600473 576210 552773 533018
56971E33018j6130j4995j4702j2733r672p187m757j342K096M435O607R647J3067
$$ 533018 516888 501893 487191 474458 464786 457599 452842 451500 453596 458031 464638 474285 487352
56958D87352J7105K3606L1920L6698L2783K0461L972j2552k5665l2466l3010l0791
$$ 487352 504457 528063 559983 596681 629464 649925 653897 641345 615680 583214 550204 519413
56946E19413k8438k5116j9906j4673j1078p791l414N62K545L970O865J0645J4078
$$ 519413 490975 465859 445953 431280 420202 412411 408997 409559 412104 416074 422939 433584 447662
56933D47662J8106K4169L1714L9272M5283M5985L6264J5885p774k6232l6902m1574
$$ 447662 465768 489937 521651 560923 606206 652191 688455 704340 696566 670334 633432 591858
56921E91858m1621l8165l3920l0845k7733k3107j8370j5284j2878r787p291o867
$$ 591858 550237 512072 478152 447307 419574 396467 378097 362813 349935 340148 332857 325990
56909C25990p135o282n181n095m763k852q58m34k53J263K653K205J512K793M986
$$ 325990 318855 312573 307392 302297 297534 294682 293824 293390 293137 294400 297053 299258 300770 303563 308549
56894C08549N985O504Q127R879J0357J1208J4809K0510K6415L2521L8242L9326
$$ 308549 314534 321038 329165 339044 349401 360609 375418 395928 422343 454864 493106 532432
56882E32432L1742J7304J729j1341k1002k6102k6035k3151k0375j7408j2604p004
$$ 532432 564174 581478 583207 571866 550864 524762 498727 475576 455201 437793 425189 418185
56870D18185k796O71N506J1250J5973K0113K5544L2072L8627M6782N9127P4337
$$ 418185 415389 416060 421566 432816 448789 468902 494446 526518 565145 611927 671054 745391
56858G45391Q6647Q9452P7819N0291J2181k4799n0332o2501o5160o1345n2776
$$ 745391 832038 921490 999309 1049600 1061781 1036982 986650 924149 858989 797644 744868
56847G44868m2790l4439k6850j7657p707O42Q115J7124K7348L7083M7439O0832
$$ 744868 702078 667639 640789 623132 615425 616067 624182 641306 668654 705737 753176 814008
56835H14008P6929R4630J15390J37985J50867J37521R2171K6627l9132q9663j18542
$$ 814008 890937 985567 1100957 1238942 1389809 1527330 1619501 1646128 1606996 1517333 1398791
56824A398791j27010j21497j09507r5323q0123o5119n1780l9666k7372j5470n646
$$ 1398791 1271781 1150284 1040777 945454 865331 800212 748432 708766 681394 665924 660278
56813F60278K692J1942K2901L4741M7923O4148Q3322J02082J13878J09218Q0103
$$ 660278 662970 674912 697813 732554 780477 844625 927947 1030029 1143907 1253125 1333228
56802A333228K9205k7292p1013r5198j04393j03933r5729q2546o9116n7561m6610
$$ 1333228 1362433 1335141 1264128 1168930 1064537 960604 864875 782329 713213 655652 609042
56791F09042l6033k7462k0603j3118m808K199P772J4200K2214L0646L9932N1070
$$ 609042 573009 545547 524944 511826 507018 509217 516989 531189 553403 584049 623981 675051
56779F75051O0403O0132M5795K0385r117l5928n4517o2358o2059n8710n4446m8385
$$ 675051 735454 795586 841381 861766 852649 816721 762204 699846 637787 579077 524631 476246
56767D76246m1119l5197l1039k6585k1366j7182j4478j1839r312q365q364p031
$$ 476246 435127 399930 368891 342306 320940 303758 289280 277441 268129 259764 251400 244369
56755B44369m657l880n020n592m756m236m497m059k938k794l280k342m62l71k148
$$ 244369 239712 235832 230812 225220 220464 216228 211731 207672 204734 201940 198660 196318 195856 195485 193337
56740A93337k850j537m61o56o03J22R2m78L00J904J667l19j005K19N71q39j451
$$ 193337 190487 188950 188489 187833 187230 187352 187444 186966 187266 189170 190837 190518 189513 189732 190303 189464 188013
56723A88013j46R39P49R73K023J878L54P4J668K366R84nR31J969J847J991K955
$$ 188013 187867 188806 189555 190528 192551 194429 194783 194857 196525 198891 199875 199870 200801 202770 204617 206608 209563
56706B09563K886J389Q62K097K596J136l1N28R54j7o43J89P04j78o33N09J517
$$ 209563 212449 213838 214700 216797 219393 220529 220498 221026 221980 221963 221320 221509 222213 222035 221402 221911 223428
56689B23428J125P25J200J087j97p02M12J104J93n22J68O71q7n59J14J49j520
$$ 223428 224553 225278 226478 227565 227368 226666 227078 228182 228375 227853 228021 228692 228605 228046 228160 228309 226789
56672B26789l100l155k810k991k646j433r04j417j187J03K89j198j935p46M16
$$ 226789 223689 220534 217724 214733 212087 210654 209750 208333 207146 207249 207538 206340 204405 203659 204075
56657B04075M45R25K305K373N16n62N49J658J310J277K482K707Q60n20K79J151
$$ 204075 204520 205445 207750 210123 210639 210077 210626 212284 213594 214871 217353 220060 220920 220400 220679 221830
56641B21830K98n83M8N99j87n86M57P81r66k452j746o61j102j674r43n08j698
$$ 221830 222128 221545 221593 222192 222005 221419 221876 222657 221691 219239 217493 216832 215730 214056 213113 212605 210907
56624B10907k617j574k29l50p09MM56l09n75N76J030l59j219J8J031n4j199n50
$$ 210907 208290 206716 206487 206137 205428 205432 205888 205579 205004 205580 206610 206251 205032 205050 206081 206027 204828 204278
56606B04278r6j594k734j197R55R84J95R56K128J589M34P17J569J347R99J751
$$ 204278 204182 202588 199854 198657 199612 200596 200791 201747 203875 205464 205898 206615 208184 209531 210530 212281
56590B12281K106P10n16L71J670J139m2J38P36K39j16J012J885P92l92O15K417
$$ 212281 214387 215097 214581 214952 216622 217761 217719 217857 218593 218832 218716 219728 221613 222405 222013 222628 225045
56573B25045K595J805J755J743P57L04J742L399L703M205O243P846P562P946J1270
$$ 225045 227640 229445 231200 232943 233700 234004 235746 239145 242848 247053 253296 261142 268704 276650 287920
56558B87920J4928J5254J2843R959N942k73o032q150p787p789p673n682l308l097
$$ 287920 302848 318102 330945 340904 346846 346573 340541 332391 324604 316815 309142 303460 300152 297055
56544B97055m071l750k699k911l756l584l215l936m330k946j643k344l150j737
$$ 297055 292984 289234 286535 283624 279868 276284 273069 269133 264803 261857 260214 257870 254720 252983
56530B52983J76j7j003l23Q44K83o49K68J497O25p92r1J234K37j958k336j439
$$ 252983 253159 253142 252139 251816 252660 252943 252294 252562 254059 254684 253892 253801 255035 255272 253314 250978 249539
56513B49539j624k195j308m34j750l339k245p1k03j682j359m3o89k341j772L15
$$ 249539 247915 245720 244412 243978 242228 238889 236644 236573 236370 234688 233329 233286 232597 230256 228484 228799
56497B28799N69p57n85J061J463O41R46K042J527k11p65l88j062j959q86R26N36
$$ 228799 229368 228611 228026 229087 230550 231191 232137 234179 235706 235495 234730 234342 233280 231321 230435 231361 231897
56480B31897j231j110P72J351J09p91r09j386j491J18J852J505O13J846L793L348
$$ 231897 230666 229556 230328 231679 231788 230997 230088 228702 227211 227329 229181 230686 231299 233145 236938 240286
56464B40286J449J186J951J009p55l74J299J003q51j166r6k93j323o22J118J201
$$ 240286 241735 242921 244872 245881 245126 244752 246051 247054 246203 245037 244941 244648 243325 242703 243821 245022
56448B45022M58J761M066L915J783J025J464J90k183k278l64J53r42q52L22o6
$$ 245022 245480 247241 251307 255222 257005 258030 259494 259684 257501 255223 254859 255012 254070 253218 253540 253474
56432B53474j540j230K98L7j340n60J674J545q53j719m34J03l90N04K160J637
$$ 253474 251934 250704 251002 251039 249699 249139 250813 252358 251505 249786 249352 249455 249065 249569 251729 253366
56416B53366j61M52K943L194R60k6P57J80j765j640O63J583O16P38J922J070j295
$$ 253366 253205 253657 256600 259794 260754 260728 261485 261665 259900 258260 258923 260506 261122 261860 263782 264852 263557
56399B63557j271J112J767K02J93K309K907J337R75K226J696p53j296N05Q28q74
$$ 263557 262286 263398 265165 265367 265560 267869 270776 272113 273088 275314 277010 276257 274961 275466 276294 275420
56383B75420q22J411J737n11r76J563K858J011m99K85P90k5M84K644K927O15n65
$$ 275420 274598 276009 277746 277235 276259 277822 280680 281691 281192 281477 282267 282242 282726 285370 288297 288912 288347
56366B88347O89J252J72M81K612K897O40k39J476K185O58L00K180K859J338J061
$$ 288347 289036 290288 290460 290941 293553 296450 297090 296851 298327 300512 301170 301470 303650 306509 307847 308908
56350C08908K807K797J61r52Q59J728K03l6K175K724J93r71J486L626K835K169
$$ 308908 311715 314512 314673 313721 314580 316308 316511 316475 318650 321374 321567 320596 322082 325708 328543 330712
56334C30712L697M496K956K312M188N171L332J814K626L280K615L360N842N988
$$ 330712 334409 338905 341861 344173 348361 353532 356864 358678 361304 364584 367199 370559 376401 382389
56320C82389K657J86N95L94j935k685m10Q79m49l37K777M250J779k4J945L939
$$ 382389 385046 385232 385827 386221 384286 381601 381191 382070 381621 381284 384061 388311 390090 390066 392011 395950
56304C95950L031K723N869R129R446R356J0957J1225Q165N167M703M126K002J788
$$ 395950 398981 401704 407573 416702 426148 435504 446461 457686 465851 471018 475721 479847 481849 483637
56290D83637M862O900N633N131P826R646P916O670Q914J0946R734Q805J1180J3452
$$ 483637 488499 495399 501032 506163 513989 523635 531551 538221 547135 558081 567815 576620 587800 601252
56276F01252J2529J1516J3299J4982J4212J4352J7805K0924K0953K1300K4570
$$ 601252 613781 625297 638596 653578 667790 682142 699947 720871 741824 763124 787694
56265G87694K7287K7068K7991L3167L8930M2113M5990N3297O0604O5408P1594
$$ 787694 814981 842049 870040 903207 942137 984250 1030240 1083537 1144141 1209549 1281143
56254A281143Q1813R1845R8601J06182J17687J28697J35467J41802J50847J57837
$$ 1281143 1362956 1454801 1553402 1659584 1777271 1905968 2041435 2183237 2334084 2491921
56244B491921J58258J55762J54348J50189J38874J23569J08096Q9092O3099L4592
$$ 2491921 2650179 2805941 2960289 3110478 3249352 3372921 3481017 3570109 3633208 3667800
56234C667800Q914j6068m3279o8420q6834j01690j17036j29358j34414j35885
$$ 3667800 3676714 3660646 3617367 3548947 3462113 3360423 3243387 3114029 2979615 2843730
56224B843730j38643j39881j35502j28954j25045j21172j13413j05066j00369
$$ 2843730 2705087 2565206 2429704 2300750 2175705 2054533 1941120 1836054 1735685
56215A735685r5976q7515p8518p3920p0817o4648n8356n6219n4709m8905m2043
$$ 1735685 1639709 1552194 1473676 1399756 1328939 1264291 1205935 1149716 1095007 1046102 1004059
56204A004059l9301l7885l2865k7087k5558k5523k1805j6747j5273j5319j2600
$$ 1004059 964758 926873 894008 866921 841363 815840 794035 777288 762015 746696 734096
56193G34096r536j0079j1075q174m766n610p283m615r46k032n300n051k965l518
$$ 734096 724560 714481 703406 695232 690466 684856 677573 672958 672012 669980 664680 659629 656664 653146
56179F53146m470j871J056j62k001N66M201L671J989L961O147L759J004L563P310
$$ 653146 648676 646805 647861 647699 645698 646264 650465 654136 656125 660086 666233 669992 670996 674559 681869
56164F81869N848K790M824Q921Q526O358Q702J2821J2509J0561J3279J8064J8935
$$ 681869 687717 690507 695331 704252 712778 719136 727838 740659 753168 763729 777008 795072 814007
56151H14007J8797K3657L0212L2054L2646L9138M8840N5020O0589P2429Q7423
$$ 814007 832804 856461 886673 918727 951373 990511 1039351 1094371 1154960 1227389 1314812
56140A314812R7804J05168J15341J24500J24430J16674J07704R5497P5377N3909
$$ 1314812 1412616 1517784 1633125 1757625 1882055 1998729 2106433 2201930 2277307 2331216
56130B331216M2053L8981L6706L5215L8027L8535K7230Q347o262j5392k5263l3520
$$ 2331216 2373269 2412250 2448956 2484171 2522198 2560733 2587963 2596310 2590048 2574656 2549393 2515873
56118B515873l3433k9947l4763m8537o3481p9186r9356j17384j22674j17935j13583
$$ 2515873 2482440 2452493 2417730 2369193 2305712 2226526 2127170 2009786 1887112 1769177 1655594
56107A655594j08958r6303p9029o7750o1455n0802l7073k9700k7815k2484j4588
$$ 1655594 1546636 1450333 1371304 1303554 1242099 1191297 1154224 1124524 1096709 1074225 1059637
56096A059637j2337j3810j0192l510k804n687k489M429M684N8J125O736O850K916
$$ 1059637 1047300 1033490 1023298 1019788 1016984 1011297 1008808 1013237 1017921 1017979 1019104 1025840 1032690 1035606
56082A035606N040J1476J1630O973Q102J3529J2692P525R215J5815J5479R859
$$ 1035606 1040646 1052122 1063752 1070725 1078827 1092356 1105048 1112573 1121788 1137603 1153082 1162941
56070A162941J1389J9151K0704J6326J7672K3678K2130J4350J3678J9788J9350
$$ 1162941 1174330 1193481 1214185 1230511 1248183 1271861 1293991 1308341 1322019 1341807 1361157
56059A361157J2032J0781J6173J5925J0122J1224J8551J8850J2794J4430K3532
$$ 1361157 1373189 1383970 1400143 1416068 1426190 1437414 1455965 1474815 1487609 1502039 1525571
56048A525571K5514J9685K0152K7500K7698K0562K0852K9216L0902K5159K6592
$$ 1525571 1551085 1570770 1590922 1618422 1646120 1666682 1687534 1716750 1747652 1772811 1799403
56037A799403L5364L6167K8910K9746L9187M0670L3336L4091M4221M6951M1170
$$ 1799403 1834767 1870934 1899844 1929590 1968777 2009447 2042783 2076874 2121095 2168046 2209216
56026B209216M3637N4383N4918M4722M3590N3425N4672M5601M6847O1118O7320
$$ 2209216 2252853 2307236 2362154 2406876 2450466 2503891 2558563 2604164 2651011 2712129 2779449
56015B779449O1432O3497P6879Q1225P3814P6341R1974R8025R0310R1569J06312
$$ 2779449 2840881 2904378 2981257 3062482 3136296 3212637 3304611 3402636 3492946 3584515 3690827
56004C690827J11884J04467J08068J27005J36450J31541J37442J58826J69450
$$ 3690827 3802711 3907178 4015246 4142251 4278701 4410242 4547684 4706510 4875960
55995D875960J64434J71009J94155K05483K00140K08626K37189K54788K55103
$$ 4875960 5040394 5211403 5405558 5611041 5811181 6019807 6256996 6511784 6766887
55986F766887K70528L07595L32323L38013L60876M08653M43780M58522M93042
$$ 6766887 7037415 7345010 7677333 8015346 8376222 8784875 9228655 9687177 10180219
55977A0180219N56170O06291O35572O90455P81670Q61816R21747J015483J157382
$$ 10180219 10736389 11342680 11978252 12668707 13450377 14312193 15233940 16249423 17406805
55968A7406805J295261J421269J601442J856169K128640K415338K799585L306503
$$ 17406805 18702066 20123335 21724777 23580946 25709586 28124924 30924509 34231012
55960C4231012L864769M466401N209153O122387P131090Q262006R679821J1443831
$$ 34231012 38095781 42562182 47771335 53893722 61024812 69286818 78966639 90410470
55952I0410470J3482702J5910174J9065760K3153262K8281585L4932032M3351171
$$ 90410470 103893172 119803346 138869106 162022368 190303953 225235985 268587156
55945B68587156N1451056N3935568M5384908K5288758m09628k3358073l8299750
$$ 268587156 320038212 373973780 419358688 444647446 444237818 420879745 382579995
55938C82579995m4874640m5443394m2487020l7791751l2622796k7721293k3295910
$$ 382579995 337705355 292261961 249774941 211983190 179360394 151639101 128343191
55931A28343191j9359556j5997040j3247414j0983207r073750p517274o309681
$$ 128343191 108983635 92986595 79739181 68755974 59682224 52164950 45855269
55924D5855269n337475m501542l815659l295270k867883k472440k138493j892955
$$ 45855269 40517794 36016252 32200593 28905323 26037440 23565000 21426507 19533552
55916A9533552j685760j474500j291841j166237j058795r36661q31092p67826
$$ 19533552 17847792 16373292 15081451 13915214 12856419 11919758 11088666 10320840
55908A0320840p12296o35573n66723n30706m98423m44931l96615l75855l56268
$$ 10320840 9608544 8972971 8406248 7875542 7377119 6932188 6535573 6159718 5803450
55899E803450l15764k79501k68761k59031k28886k01048j96075j92309j69624
$$ 5803450 5487686 5208185 4939424 4680393 4451507 4250459 4054384 3862075 3692451
55890C692451j48219j47131j46778j28437j10482j10873j12200r7329q2695q3825
$$ 3692451 3544232 3397101 3250323 3121886 3011404 2900531 2788331 2691002 2608307 2524482
55880B524482q3500o5845m8084m7838n1589m4919m1841n5080o8211o5867o1892
$$ 2524482 2440982 2375137 2327053 2279215 2227626 2182707 2140866 2085786 2017575 1951708 1889816
55869A889816p0004p5902o5779n4011n5340n7059m5484l3504l5386l9820l3945
$$ 1889816 1819812 1743910 1678131 1624120 1568780 1511721 1466237 1432733 1397347 1357527 1323582
55858A323582k9187l7447m5725l9979l1323l3517l6796k8734j9553k2149k7420
$$ 1323582 1294395 1256948 1211223 1171244 1139921 1106404 1069608 1040874 1021321 999172 971752
55847I71752k3296j8431k3562k8803k2601j4634j7156k1628j6254r092j1707j6714
$$ 971752 948456 930025 906463 877660 855059 840425 823269 801641 785387 776295 764588 747874
55835G47874j3200q148j1408j5446j0594m794p867j1734o302L34k534p605m447
$$ 747874 734674 726526 715118 699672 689078 684284 676417 664683 658381 658715 656181 648576 644129
55822F44129j32n024j2131j0565o088q724j2889r207l481n010q195m191J124r50
$$ 644129 643997 638973 626842 616277 610189 601465 588576 579369 575888 570878 562683 558492 559616 558666
55808E58666m160N56P033N818K541O351J1529Q640L015M136P156K836m316n413
$$ 558666 554506 555062 562095 567913 570454 576805 588334 596974 599989 604125 611281 614117 609801 604388
55794F04388m732j0381j7104j5918j1618j3432j7134j3584o483m645m950J00N834
$$ 604388 599656 589275 572171 556253 544635 531203 514069 500485 494002 489357 484407 484507 490341
55781D90341L367l253m181j070j420k698K164J0133J4306J8189K8494L9967M1898
$$ 490341 493708 490455 486274 485204 483784 481086 483250 493383 507689 525878 554372 594339 636237
55768F36237L3827K1368L934j9179l8180m3475m0577m0134m0352l3889k4639k1659
$$ 636237 670064 691432 695366 676187 638007 594532 553955 513821 473469 439580 414941 393282
55756C93282k2548j8790j2258j1089j3985j3595j0846j1364j2224o694J932N238
$$ 393282 370734 351944 339686 328597 314612 301017 290171 278807 266583 259889 261821 267059
55744B67059M255N770Q591P029L757N420R339P940K574Q8l37l951q188o744k102
$$ 267059 271314 277084 285675 292704 296461 301881 311220 319160 321734 321822 321485 317534 309346 302602 300500
55729C00500j351l197j763Q36j478o048n728k238k525n388m393p17l96k080N4
$$ 300500 299149 295952 294189 295025 293547 287499 281771 279533 277008 271620 267227 266510 266114 264034 264088
55714B64088M409N400N231R639J5292J4229P890M020K642j919p939q513m816m227
$$ 264088 268497 273897 279128 288767 304059 318288 326178 330198 332840 330921 322982 314469 309653 305426
55700C05426o929o910m566n772r793j0322p387o456p139m529k28k86l447l095
$$ 305426 298497 291587 287021 281249 271456 261134 253747 247291 240152 235623 235395 235109 231662 228567
55686B28567M17R54j314p05K398K444J40J326N349O019L315K803M242K208k595
$$ 228567 228984 229938 228624 227919 230317 232761 232901 234227 239576 245595 248910 251713 255955 258163 255568
55671B55568m109k355k800m998l356J181J905j274j700J636K925J072J162L754
$$ 255568 251459 249104 246304 241306 237950 239131 241036 239762 238062 239698 242623 243695 244857 248611
55657B48611L743P55JJ965J723p82l22K982L196l82k064p16j455n160o591m448
$$ 248611 252354 253109 253110 255075 256798 256016 255694 258676 261872 261490 259426 258710 257255 252095 245504 241056
55641B41056l452m909m808k764l262o535p526n308m382n440m179m73O75j380j757
$$ 241056 237604 232695 227887 225123 221861 215326 207800 202492 198110 192670 188491 188018 188693 187313 185556
55626A85556L43K96k418k749J78J191j247k576j146p80k512k606n87n65k814k713
$$ 185556 185899 186195 183777 181028 181206 182397 181150 178574 177428 176648 174136 171530 170943 170378 167564 164851
55610A64851K22R76j595k720p85K32q77m98J696J356j854k892o51M8k186k772
$$ 164851 165073 166049 164454 161734 160949 161181 160304 159806 161502 162858 161004 158112 157461 157509 155323 152551
55594A52551k40R24j002j910j80L90j489j991j26l6k692l472p39J163K66J92K337
$$ 152551 152311 153235 152233 150323 150143 150533 149044 147053 146927 146891 144199 140727 139988 141151 141417 141609 143946
55577A43946K948R07M10K932M328K975K916N824P634O354N552O858O664L541J419
$$ 143946 146894 147801 148211 151143 155471 158446 161362 167186 174820 181174 186726 193584 200248 203789 205208
55562B05208K055J762j157l170k807l665o836q023n611l977n236n404k511p39
$$ 205208 207263 209025 207868 204698 201891 198226 191390 183367 177756 173779 168543 163139 160628 159889
55548A59889k348l152n15J517k00k205j120N29Rn04Q36J303p59j911K01K274J301
$$ 159889 157541 154389 153874 155391 155191 152986 151866 152395 152404 151900 152736 154039 153280 151369 151570 153844 155145
55531A55145n15q37j536l835m762k715j067k126l006j410l6j103k015o53M17q60
$$ 155145 154630 153793 152257 148422 143660 140945 139878 137752 134746 133336 133300 132197 130182 129529 129946 129086
55515A29086j916p24J48j324k579j507m44j222j444M43J590K14o67J050K359Q04
$$ 129086 127170 126446 126594 125270 122691 121184 120740 119518 118074 118517 120107 120321 119654 120704 123063 123867
55499A23867q74J8J277M67m91L83J037j89q21R33K299J009m26M34J501O42p3J138
$$ 123867 122993 123011 124288 124755 124264 124647 125684 125495 124674 125607 127906 128915 128489 128923 130424 131066 130993 132131
55481A32131J762k70k275j524Ok92j070n10p9r51r88Q81J678l83k208j236K3j053
$$ 132131 133893 133623 131348 129824 129830 129538 128468 127958 127879 126928 125940 126821 128499 128116 125908 124672 124695 123642
55463A23642k427j738p48j256j119J196K675Q30j510j014P46J047R04J830J924
$$ 123642 121215 119477 118729 117473 116354 117550 120225 121055 119545 118531 119277 120324 121228 123058 124982
55448A24982k83k200j647r01j948k247K73K488J253j022q97J66n43j474k71J112
$$ 124982 124699 122499 120852 119951 118003 115756 116029 118517 119770 118748 117851 118017 117474 116000 115729 116841
55432A16841O7j455o34P75j01j646q32J164J579J277K348L372K123K41L34J153
$$ 116841 116908 115453 114819 115594 115493 113847 113015 114179 115758 117035 119383 122755 124878 125119 125453 126606
55416A26606L47q14r8J108N50l65N51J723P67q52p64l53j725k992j521Q11O74
$$ 126606 126953 126139 126041 127149 127699 127334 127885 129608 130375 129523 128759 128406 126681 123689 122168 122979 123653
55399A23653r52j035k1k01q70o7J076M86m69N70K218J677l05j168j186j931k417
$$ 123653 122701 121666 121645 121444 120574 120507 121583 122069 121600 122170 124388 126065 125760 124592 123406 121475 119058
55382A19058j154J21p50k068j178O37O04n44m80R2o62j471k14J618J299l51q59
$$ 119058 117904 118025 117275 115207 114029 114666 115270 114726 114246 114338 113676 112205 111991 113609 114908 114557 113698
55365A13698o02j155j473j99P66m88j622J69K702K218j97q99o0l45j215k19J695
$$ 113698 113096 111941 110468 110269 111035 110547 108925 109094 111796 114014 113817 112918 112858 112513 111298 111079 112774
55348A12774J658L12M70J611J026p56r23K41L1j418j529k04L43jM69J335P67o25
$$ 112774 114432 114744 115214 116825 117851 117095 116172 116413 116444 115026 113497 113293 113636 113635 114104 115439 116206 115581
55330A15581p96j87n26j064p3J246O97n80j01J172O99n95k2J522J030r16j141
$$ 115581 114785 114598 114072 113008 112935 114181 114878 114298 114197 115369 116068 115473 115451 116973 118003 117087 115946
55313A15946L49O63n43q87j0K63%Q00J852R78j006j418n49q51k005j487M43J166
$$ 115946 116295 116958 116415 115528 115518 115781 115781 116581 118433 119411 118405 116987 116438 115587 113582 112095 112538 113704
55295A13704N59P98J677R51r28j179L01R17K95O56K182K522J177J58Q4l89j181
$$ 113704 114263 115061 116738 117689 116761 115582 115883 116800 117095 117751 119933 122455 123632 123790 123874 123485 122304
55278A22304q19K18l2j259j422o53p77j496r95J50j29j179o37R48R33m15l50J195
$$ 122304 121485 121703 121671 120412 118990 118337 117560 116064 115069 115219 115090 113911 113274 114222 115155 114740 114390 115585
55260A15585J576M91L45J460J550K45k81M04L91n15m07P12P32m44o96J00r9j215
$$ 115585 117161 117652 117997 119457 121007 121252 120971 121375 121766 121251 120844 121556 122288 121844 121148 121248 121149 119934
55242A19934q89R09J406j60j344q72k93n48o00j96m53j126p04M38M20n87n98M06
$$ 119934 119045 119954 121360 121200 119856 118984 118691 118143 117543 117347 116894 115768 115064 115502 115922 115335 114737 115143
55224A15143O43K43R13K107J687K24L65J881J845q6j086k76P7q76j253m57k35
$$ 115143 115786 116029 116942 119049 120736 120960 121325 123206 125051 124965 123879 123603 123680 122804 121551 121094 120859
55207A20859q56m10J214J702N20j66M09N57j38J5J147J289K29m7O01M5j771k286
$$ 120859 120003 119593 120807 122509 123029 122863 123272 123829 123691 123706 124853 126142 126371 126324 126925 126970 125199 122913
55189A22913r10l9n95p14J61J26j183j561l74L27o7M22K127K598J026j55M20J100
$$ 122913 122003 121964 121369 120655 120816 120942 119759 118198 117824 118151 118084 118506 120633 123231 124257 124102 124522 125622
55171A25622Q78J097K046J813R1o99L79J098J86o55l13j88j003j270m73k61j062
$$ 125622 126500 127597 129643 131456 131547 130848 131227 132325 132511 131856 131543 131355 130352 129082 128609 128348 127286
55154A27286j089J6K23q45q26R67J993R46r7K93N82j78l66O80R30m84j355l67
$$ 127286 126197 126213 126436 125591 124765 125732 127725 128671 128574 128867 129449 129271 128905 129585 130515 130031 128676 128309
55136A28309N58j3n33K13P58J34q6Q92J135l98j609r86k61r69j512k64J388J642
$$ 128309 128867 128854 128321 128534 129292 129426 129340 130232 131367 130969 129360 128374 128113 127144 125632 125368 126756 128398
55118A28398J180J091N63r47j913j290m92p14p57M77J820K053J870J878J216j79
$$ 128398 129578 130669 131232 130285 128372 127082 126590 125876 125119 125596 127416 129469 131339 133217 134433 134254
55102A34254o30L04O59m86j256l94N78M11K91J050J309L80L6J255K188J449N32
$$ 134254 133624 133928 134587 134101 132845 132451 133029 133440 133731 134781 136090 136470 136506 137761 139949 141398 141930
55085A41930P59Q28l44j258p11j92r81j588n21R32J119P87J063J152K86l54J08
$$ 141930 142689 143517 143173 141915 141204 141012 140031 138443 137922 138854 139973 140760 141823 142975 143261 142907 143015
55068A43015M27l41q68o9Q53P13K98K36l94j586j499J78R49m28j720j145k59n88
$$ 143015 143442 143101 142233 142164 143017 143730 144028 144264 143870 142284 140785 140963 141912 141484 139764 138619 138360 137772
55050A37772q07J71N63q54j932p99O90L20n40K15J434J050j0K31J034O03m22m81
$$ 137772 136965 137136 137699 136845 134913 134114 134804 135124 134584 134799 136233 137283 137273 137504 138538 139141 138719 138238
55032A38238k61j131k092j477j32J43j73M05J325J097R0m17n94j069j073O2J098
$$ 138238 137977 136846 134754 133277 133145 133288 133115 133520 134845 135942 136032 135615 135021 133952 132879 132941 134039
55015A34039Q71L87O84O64o75j860j384m91q10j282j75J627K254J984K033J972
$$ 134039 134910 135297 135981 136645 135970 134110 132726 132235 131425 130143 129968 131595 133849 135833 137866 139838
54999A39838J037L08Q00J212K23p74m0J255J079O1p1J98m77j254n78O84P09K2
$$ 139838 140875 141183 141983 143195 143418 142644 142604 143859 144938 144999 144928 145126 144649 143395 142817 143501 144210 144232
54981A44232K94J059O86n23j061j038j427j693q55J88J10k41N90J737J468L79
$$ 144232 144526 145585 146271 145748 144687 143649 142222 140529 139674 139862 139972 139731 140321 142058 143526 143905
54965A43905L39J214J413Q19N84Q40R54J155J680J505N9j187r65m27q41j076M4
$$ 143905 144244 145458 146871 147690 148274 149114 150068 151223 152903 154408 154467 153280 152315 151888 151047 149971 150015
54948A50015R71O3j031j1J755J275j032k099j053K79J028J937K778K463J505J450
$$ 150015 150986 151049 150018 150007 151762 153037 152005 149906 148853 149132 150160 152097 154875 157338 158843 160293
54932A60293K118K104J609K121L680M991N789O743P607P707P487P352O150L160
$$ 160293 162411 164515 166124 168245 171925 176916 182705 189448 197055 204762 212249 219601 225751 228911
54918B28911K75m96m17j945m558n787n454n540o489o898o404n849m996l025q99
$$ 228911 229186 228690 228273 226328 221770 215983 210529 204989 198500 191602 185198 179349 174353 171328 170429
54903A70429l69j051j208r02j524k708k638j165J52Q01J484K003J634J136J782
$$ 170429 170060 169009 167801 166899 165375 162667 160029 158864 159016 159817 161301 163304 164938 166074 167856
54888A67856K834K649J724J939L283M168M466N399O770P201O792O749O629M785
$$ 167856 170690 173339 175063 177002 180285 184453 188919 194318 201088 208289 215081 221830 228459 233244
54874B33244J451j367k962m362n807o428o329o513o810o192m917m208m082l638
$$ 233244 234695 233328 230366 226004 220197 213769 207440 200927 194117 187925 183008 178800 174718 171080
54860A71080l001k811k492j235K8mo37n33l66j404k615k178q81q51j809j832j109
$$ 171080 168079 165268 162776 161541 161569 161565 160928 160395 160029 158625 156010 153832 152951 152100 150291 148459 147350
54843A47350j453k581k424q79J22J36M84J133O61o32q24K32P10J29r7M44O54M20
$$ 147350 145897 143316 140892 140013 140135 140271 140755 141888 142549 141917 141093 141325 142035 142164 142067 142511 143165 143585
54825A43585P39J323R05j54l38J27k29j070p57L54L82n86p49j65n06j368n75J695
$$ 143585 144324 145647 146552 146398 146060 146187 145958 144888 144131 144485 144867 144281 143532 143367 142861 141493 140918 142613
54807A42613K797K073J703K517K702J503O53R99J108L22L0P82J124M37K5M10L21
$$ 142613 145410 147483 149186 151703 154405 155908 156561 157560 158668 158990 159020 159802 160926 161363 161388 161798 162119
54790A62119n74q12L1M51j34l59L55P89N50R09K080K515J829J652K550K988K359
$$ 162119 161545 160733 160764 161215 161081 160722 161077 161866 162416 163325 165405 167920 169749 171401 173951 176939 179298
54773A79298K304L709N216N883O635P846Q105O851N662N504N007K919P5k326m352
$$ 179298 181602 185311 190527 196410 203045 210891 218996 225847 231509 237013 242020 244939 245014 242688 238336
54758B38336o050o640o119n734n932n757m966m633m950m694l577k758k445j466
$$ 238336 232286 225646 219527 213793 207861 202104 197138 192505 187555 182861 179284 176526 174081 172615
54744A72615N7K85j148k183j564m86j1N07J325J307L02N9J419K881L204L181L701
$$ 172615 172672 172957 171809 169626 168062 167576 167565 168072 169397 170704 171006 171065 172484 175365 178569 181750 185451
54727A85451M262M615N535O879P104N785M335L295J444j418l497m060m755o455
$$ 185451 189713 194328 199863 206742 213846 219631 223966 227261 228705 227287 223790 219730 214975 208520
54713B08520p479o546n033m554m558m024l405l169k513j100k02n59j005o22k73
$$ 208520 201041 194495 189462 184908 180350 176326 172921 169752 167239 166139 165937 165378 164373 163751 163478
54698A63478o95j082q69r38j655j770o58L73K81j15k7p5n75o23j05m10j812k495
$$ 163478 162783 161701 160832 159894 158239 156469 155811 156184 156465 156350 156323 156248 155673 155050 154945 154535 152723 150228
54680A50228j534n58q90j401q62j20j54j40O78J179L13r67j400j292j183n30P20
$$ 150228 148694 148136 147246 145845 144983 144863 144709 144569 145247 146426 146739 145772 144372 143080 141897 141367 142087
54663A42087J207M11j30O00J306P18k57l99j48j57J43Q53O03r95j930p47J089
$$ 142087 143294 143705 143575 144175 145481 146199 145942 145543 145395 145238 145381 146234 146837 145842 143912 143165 144254
54646A44254J580J058P54M79k16m41M54J316J068N29N79L78p36j466o73M72M91
$$ 144254 145834 146892 147646 148125 147909 147468 147922 149238 150306 150835 151414 151792 151056 149590 148917 149389 149880
54629A49880L4L29Q40N83J55L86N17k61r97o76j73n43q98n8J118J200N20J17k23
$$ 149880 149914 150243 151083 151666 151821 152207 152724 152463 151466 150790 150617 150074 149176 149118 150236 151436 151956 152073 151850
54610A51850r29j125k15N24o3q85n02L28J72m93m39p9l97p40rJ103J224P06P44
$$ 151850 150921 149796 149581 150105 150042 149157 148655 148983 149155 148662 148223 148144 147747 147007 146998 148101 149325 150031 150775
54591A50775J133R14L04L5k40r93j355m87O74R04P48J219J705J198M27O58J424
$$ 150775 151908 152822 153126 153161 152921 151928 150573 150086 150760 151664 152412 153631 155336 156534 156961 157619 159043
54574A59043J442Q24L99n2r29j339m80N49L62l84l03K11k0n60k32M77K82m00r2
$$ 159043 160485 161309 161708 161656 160727 159388 158908 159457 159819 159435 159132 159343 159323 158763 158531 159008 159290 158890 158798
54555A58798J131J830J587J216J013O09J91K37M05J83N3N87J136Q22R3j10Q4M2
$$ 158798 159929 161759 163346 164562 165575 166184 166375 166612 167017 167200 167253 167840 168976 169798 169891 169781 169865 169907
54537A69907j40k56p38j568j657o27J56k87q87m76J90L7l32n3K22j48j62Q75J444
$$ 169907 169767 169511 168773 167205 165548 164921 165077 164790 163903 163427 163617 163654 163322 163269 163491 163343 163181 164056 165500
54518A65500J39j648j746n48P4j17j11M3k86n21J07P59L83k48LM00j45p43j53
$$ 165500 165639 163991 162245 161697 161771 161654 161543 161586 161300 160779 160886 161645 162028 161780 161783 162183 162038 161295 161142
54499A61142O26K1j170j163l53k61m86L96J782J877Q74M58P83P00L62P97J490
$$ 161142 161768 161789 160619 159456 159103 158842 158356 158752 160534 162411 163285 163743 164526 165226 165588 166385 167875
54482A67875J094R3N9P91Q77N27J078K143K056R06M32J096J776K106K617K890
$$ 167875 168969 169062 169121 169912 170789 171316 172394 174537 176593 177499 177931 179027 180803 182909 185526 188416
54466A88416K059P85M41P08L39l24j00M75K2r76j048o11j133k108j941j161j577
$$ 188416 190475 191260 191701 192409 192748 192424 192324 192799 192821 191845 190797 190186 189053 186945 185004 183843 182266
54449A82266k725k555j251r07j558j137M20P92n60j414o86nm76r52n76j71j02
$$ 182266 179541 176986 175735 174828 173270 172133 172553 173345 172785 171371 170685 170680 170204 169252 168676 168505 168403
54432A68403N51J715J872Q08K67R79J511R77M51O80Q15L92L33R48J169O24M21
$$ 168403 168954 170669 172541 173349 173616 174595 176106 177083 177534 178214 179029 179421 179754 180702 181871 182495 182916
54415A82916R19Q55l45j459j500j009n54J24Q89R84O51R71J702J343j45r51l05
$$ 182916 183835 184690 184345 182886 181386 180377 179823 179947 180836 181820 182471 183442 185144 186487 186342 185391 185086
54398A85086M65M33L35N92L78m01m75M73R26O8p85m24M73Q54Q58Q52N30o4o4P97
$$ 185086 185551 185984 186319 186911 187289 186888 186413 186886 187812 187880 187095 186671 187144 187998 188856 189708 190238 190174 190110 190907
54378A90907J671K036K236K343K022J761K344K991K063j17j393j074o99j055r55
$$ 190907 192578 194614 196850 199193 201215 202976 205320 208311 210374 210257 208864 207790 207091 206036 205081
54363B05081J79J050Q87P77J455J897J315N62L26o9r52j338q42o70j520k352k388
$$ 205081 205260 206310 207197 207974 209429 211326 212641 213203 213529 213460 212508 211170 210328 209658 208138 205786 203398
54346B03398k459l155l490k713j695j290r30j16L52o4m42J3O12O28O10J075J329
$$ 203398 200939 197784 194294 191581 189886 188596 187666 187550 187902 187838 187396 187409 188021 188649 189259 190334 191663
54329A91663P42j18o39j085j497j191k66k9q68j362n33N83Q05N57N25K16p81j532
$$ 191663 192405 192287 191648 190563 189066 187875 187609 187580 186712 185350 184817 185400 186205 186762 187287 187503 186722 185190
54311A85190j217o03o67r25m79L77Q38R50J053Q30Op97q82m63l4L17N03K63n3
$$ 185190 183973 183370 182703 181778 181299 181676 182514 183464 184517 185347 185353 184556 183674 183211 183177 183494 183997 184260 184207
54292A84207L61J393J939J657J405J531J217J12q59j033r22r23o24K1K74K4R9
$$ 184207 184568 185961 187900 189557 190962 192493 193710 193822 192963 191930 191008 190085 189461 189482 189756 189780 189879
54275A89879O03M91m95j172q60l54k41L2O51Q09L94N43J635K466K291J881J708
$$ 189879 190482 190973 190478 189306 188446 188092 187851 187883 188534 189343 189737 190280 191915 194381 196672 198553 200261
54258B00261J020k25n55O32J740J341J50o35j177j844j929j047k69m16o36m3P01
$$ 200261 201281 201056 200501 201133 202873 204214 204364 203729 202552 200708 198779 197732 197463 197047 196411 196368 197069
54241A97069O91K97J02k46r21j097l93L19N48R82J626J092r09k372j819n11j96
$$ 197069 197760 198057 198159 197913 196992 195895 195502 195821 196369 197351 198977 200069 199160 196788 194969 194458 194262
54224A94262m83k79k2m64p82j4Q90M79p80j439j391j428j431q01J09O46J067J704
$$ 194262 193779 193500 193478 193014 192232 192218 193108 193587 192807 191368 189977 188549 187118 186317 186426 187072 188139 189843
54206A89843J881J060Q4j96l52j029j391n40O87R92O34N40N23O8j86M49J135P82
$$ 189843 191724 192784 192868 192672 192320 191291 189900 189360 190047 191039 191673 192213 192736 192804 192618 193067 194202 194984
54188A94984nJ4N70N91K38M73J221J622J610J688J755J491J254J338J125K21n45
$$ 194984 194979 194993 195563 196154 196392 196865 198086 199708 201318 203006 204761 206252 207506 208844 209969 210190 209645
54171B09645n41o73j799k890k490j030k9J94L29M11N8l16j18J72j38n51k57L98
$$ 209645 209104 208431 206632 203742 201252 200222 200193 200387 200716 201127 201185 200869 200751 200923 200785 200234 199977 200375
54153B00375P56J256K434L419L029J725Q05M23p3n48n04l84q50j439j435j340
$$ 200375 201131 202387 204821 208240 211269 212994 213799 214222 214149 213601 213097 212713 211863 210424 208989 207649
54137B07649j873k329j634l31K43R5K21O67P23N21P94J424J747J861K171K227
$$ 207649 205776 203447 201813 201482 201725 201820 202041 202708 203431 203952 204746 206170 207917 209778 211949 214176
54121B14176J446L71k58q38j857k345j247M88J065M84J21K30j57j125j689j549
$$ 214176 215622 215993 215735 214897 213040 210695 209448 209936 211001 211485 211606 211836 211679 210554 208865 207316
54105B07316j248q00K06J254J319N07j85m84p40o32L63J472J320N5q65q72p33
$$ 207316 206068 205268 205474 206728 208047 208554 208369 207885 207145 206513 206876 208348 209668 209723 208858 207986 207253
54088B07253q77q62n64m31l62L04J523K402K441K009J584J380J543J938K080J893
$$ 207253 206376 205514 204950 204519 204157 204461 205984 208386 210827 212836 214420 215800 217343 219281 221361 223254
54072B23254K021K678K953K175J072O06N34J86l36q44j825l169l389j686M12J059
$$ 223254 225275 227953 230906 233081 234153 234759 235293 235479 235143 234299 232474 229305 225916 224230 224642 225701
54056B25701O93P76J120O04l46l37N24R61R21J472K563L029K722K663L118L304
$$ 225701 226394 227170 228290 228894 228548 228211 228735 229696 230617 232089 234652 237681 240403 243066 246184 249488
54040B49488L041L027L446L795M066M663N337N456N091M667M076L282L093L897
$$ 249488 252529 255556 259002 262797 266863 271526 276863 282319 287410 292077 296153 299435 302528 306425
54026C06425M544L979L004K703K323P16j118j326k05M31K25J46Q2q76k099k086
$$ 306425 310969 314948 317952 320655 322978 323694 322576 321250 321045 321476 321701 321847 321929 321053 318954 316868
54010C16868j289j658l374m597m521m190m137l743l119l226l785l413k113j336
$$ 316868 315579 313921 310547 305950 301429 297239 293102 289359 286240 283014 279229 275816 273703 272367
53996B72367j268n35J058J989J811J989L239M355M521M447M325K891k60l476n273
$$ 272367 271099 270564 271622 273611 275422 277411 280650 285005 289526 293973 298298 301189 300929 297453 292180
53981B92180o066o621o549n535m441m013l741l001k173j696j231n09J4K0j48k56
$$ 292180 286114 279493 272944 267409 262968 258955 255214 252213 250040 248344 247113 246604 246618 246638 246490 246234
53965B46234m70o33m02k05p78j620j376O5J342J707J794K029J979J564J412J635
$$ 246234 245764 245131 244729 244524 243746 242126 240750 240815 242157 243864 245658 247687 249666 251230 252642 254277
53949B54277J724J829K587L569L643L029L103L980M252L486K876K926K675J841
$$ 254277 256001 257830 260417 263986 267629 270658 273761 277741 281993 285479 288355 291281 293956 295797
53935B95797J574K215K448J661J119J589J863R87J70Q67K467L466L689L912M309
$$ 295797 297371 299586 302034 303695 304814 306403 308266 309253 309423 310290 312757 316223 319912 323824 328133
53920C28133M608M960N474N644N205M802N019N559O055O812P964Q781Q562P492
$$ 328133 332741 337701 343175 348819 354024 358826 363845 369404 375459 382271 390235 399016 407578 415070
53906D15070O078M419K570Q01p73k143k863k507j660j407j791k057k286l309m923
$$ 415070 421148 425567 428137 428938 428165 426022 423159 420652 418992 417585 415794 413737 411451 408142 403219
53891D03219n892n927o031o571o738o306o160o580o709o279o123o344n836m318
$$ 403219 397327 391400 385369 378798 372060 365754 359594 353014 346305 340026 333903 327559 321723 317405
53877C17405l151l142l318k728j971j869k127k297k673l323l481k821k117j957
$$ 317405 314254 311112 307794 305066 303095 301226 299099 296802 294129 290806 287325 284504 282387 280430
53863B80430k047k233k755l019j893J17Q82l21j643j579j090j539k332k162j173
$$ 280430 278383 276150 273395 270376 268483 268600 269482 269161 267518 265939 264849 263310 260978 258816 257643
53848B57643l19K18N91M04m28r49n50k8k47p24o72l09j57m2K49L18%j43Q0Q5j76
$$ 257643 257324 257542 258133 258537 258109 257160 256610 256582 256335 255611 254939 254630 254473 254431 254680 254998 254998 254855 254935 255020 254844
53827B54844Q9Q68J021L49K47J253J828Q84k02K16J487J977J580J221R98N49K85
$$ 254844 254933 255801 256822 257171 257418 258671 260499 261383 261181 261397 262884 264861 266441 267662 268660 269209 269494
53810B69494O65J062Q47O97J446K552L119L515M484N576N889N661N683N881N829
$$ 269494 270159 271221 272068 272765 274211 276763 279882 283397 287881 293457 299346 305007 310690 316571 322400
53795C22400N892O452O712N701L904K615K142J835J346Q02J77m90q50r58j500
$$ 322400 328292 334744 341456 347157 351061 353676 355818 357653 358999 359801 359978 359488 358638 357680 356180
53780C56180k552l131k780k536l299m426n011n385o075o426n690m471l680l012
$$ 356180 353628 350497 347717 345181 341882 337456 332445 327060 320985 314559 308869 304398 300718 297706
53766B97706j878r50j210k198k728k604k312j757p92k88j069k286k417j474p96
$$ 297706 295828 294878 293668 291470 288742 286138 283826 282069 281277 280989 279920 277634 275217 273743 272947
53751B72947r53j190q59k11J92L2o24j107n80P23J420P49l68p75n83m19k02K52
$$ 272947 271994 270804 269945 269734 269926 269958 269334 268227 267647 268370 269790 270539 270171 269396 268813 268394 268192 268444
53733B68444M68J80RK78K29m55n37R86K963L494K433J140M93M91J076J962K305
$$ 268444 268912 269092 269101 269379 269608 269153 268616 269602 272565 276059 278492 279632 280125 280616 281692 283654 285959
53716B85959J756J196J357J607J249R81J699K733K792J841P75l8m49K23K266M634
$$ 285959 287715 288911 290268 291875 293124 294105 295804 298537 301329 303170 303945 303907 303458 303681 305947 310581
53700C10581O282P525Q722Q802O806L910K081J472R01J30k39l91r58j538j393
$$ 310581 316863 324388 333110 341912 348718 352628 354709 356181 357082 357212 356973 356582 355624 354086 352693
53685C52693j014j259j523o96N67O33m59j102p18k76k85k01J15M5m84q57r75j206
$$ 352693 351679 350420 348897 348201 348768 349401 348942 347840 347122 346846 346561 346360 346475 346520 346036 345179 344204 342998
53667C42998j279o45J64P1p85j215q02k04K18O12O77p8j217j790j710j440p88
$$ 342998 341719 341074 341238 341309 340524 339309 338507 338303 338521 339133 339810 339732 338515 336725 335015 333575 332787
53650C32787N68J814J869J210J211J986K495K500K669K950K604J825J598J945
$$ 332787 333355 335169 337038 338248 339459 341445 343940 346440 349109 352059 354663 356488 358086 360031
53636C60031J944J482J308J443J157N57N06R38R47N47O18J094J031N44Q00J848
$$ 360031 361975 363457 364765 366208 367365 367922 368428 369366 370313 370860 371478 372572 373603 374147 374947 376795
53620C76795K347J803J299J538J956K259L000M079M379L678L278L911M564M248
$$ 376795 379142 380945 382244 383782 385738 387997 390997 395076 399455 403133 406411 410322 414886 419134
53606D19134L496L148K936K344J799J949K560L044L334L460K938J444l38j255
$$ 419134 422630 425778 428714 431058 432857 434806 437366 440410 443744 447204 450142 451586 451248 449993
53592D49993q78J66Q33N33l69r60r46j084j942k796k668j856j411j507j593j762
$$ 449993 449115 449281 450114 450647 450278 449318 448372 447288 445346 442550 439882 438026 436615 435108 433515 431753
53576D31753k489l226k810j370l85n82j217j586j900k265k172j526j004r45q81
$$ 431753 429264 426038 423228 421858 421473 420891 419674 418088 416188 413923 411751 410225 409221 408276 407395
53561D07395o15o41j025r55j7R63J020L19j93O1Q75J608J702J180O22M51N28P60
$$ 407395 406780 406139 405114 404159 404142 405105 406125 406444 406251 406312 407187 408795 410497 411677 412299 412750 413278 414038
53543D14038J470K591L185K721K146K596L670M207M198M488N110N404N527O163
$$ 414038 415508 418099 421284 424005 426151 428747 432417 436624 440822 445310 450420 455824 461351 467514
53529D67514O997P079O702P250R038J0855J1812J2193J2338J2131J1840J2158
$$ 467514 474511 481590 488292 495542 504580 515435 527247 539440 551778 563909 575749 587907
53517E87907J3059J3875J4571J5713J7179J8219J8883J9869K1055K1599K1653
$$ 587907 600966 614841 629412 645125 662304 680523 699406 719275 740330 761929 783582
53506G83582K2249K3310K3547K2613K1638K1108J9976J7673J5435J4715J5462
$$ 783582 805831 829141 852688 875301 896939 918047 938023 955696 971131 985846 1001308
53495A001308J6683J7645J7876J7149J6134J6007J6907J7702J7667J7304J7159
$$ 1001308 1017991 1035636 1053512 1070661 1086795 1102802 1119709 1137411 1155078 1172382 1189541
53484A189541J6989J6576J6212J5907J5238J4347J4021J4303J4193J3146J1772
$$ 1189541 1206530 1223106 1239318 1255225 1270463 1284810 1298831 1313134 1327327 1340473 1352245
53473A352245J0580R149P104M868K942J273k66j614l104n359q329j1206j3404
$$ 1352245 1362825 1371974 1379078 1383946 1386888 1388161 1387895 1386281 1383177 1377818 1369489 1358283 1344879
53460A344879j4811j5220j4625j3932j4114j4742j4707j4212j4521j5783j6877
$$ 1344879 1330068 1314848 1300223 1286291 1272177 1257435 1242728 1228516 1213995 1198212 1181335
53449A181335j7479j8407j9575j9618j8191j6872j6869j7341j6885j5369j3515
$$ 1181335 1163856 1145449 1125874 1106256 1088065 1071193 1054324 1036983 1020098 1004729 991214
53438I91214j1750j0172q647o574l650r93q8n20l58R86K132K349K792M365O286
$$ 991214 979464 969292 960645 954071 950421 949428 949340 948820 948462 949448 951580 953929 956721 961086 967372
53423I67372P709Q983J0399J1334J1706J2624J4545J6324J7170J7931J9406K0892
$$ 967372 975081 984064 994463 1005797 1017503 1030127 1044672 1060996 1078166 1096097 1115503 1136395
53411A136395K1676K2432K3831K5162K5626K5769K6364K7126K7749K8987L1288
$$ 1136395 1158071 1180503 1204334 1229496 1255122 1280891 1307255 1334381 1362130 1391117 1422405
53400A422405L3627L5015L6124L8081M0654M2973M5019M7078M8655M9247M9368
$$ 1422405 1456032 1491047 1527171 1565252 1605906 1648879 1693898 1740976 1789631 1838878 1888246
53389A888246M9621M9599M8887M8208M8287M8480M7711M5989M3809M1017L7529
$$ 1888246 1937867 1987466 2036353 2084561 2132848 2181328 2229039 2275028 2318837 2359854 2397383
53378B397383L4243L1897K9720K6582K2758J9229J5920J2057P806M062Q68k833
$$ 2397383 2431626 2463523 2493243 2519825 2542583 2561812 2577732 2589789 2597595 2601657 2602525 2599692
53366B599692p897j4302k1475k8544l4621l9422m3279m6191m7686m7939m8062
$$ 2599692 2591795 2577493 2556018 2527474 2492853 2453431 2410152 2363961 2316275 2268336 2220274
53355B220274m8644m9099m9140m9508n0291m9904m7142m3239m0428l9280l8786
$$ 2220274 2171630 2122531 2073391 2023883 1973592 1923688 1876546 1833307 1792879 1753599 1714813
53344A714813l8317l7917l7293l5996l4420l3344l2623l1401k9418k7213k5224
$$ 1714813 1676496 1638579 1601286 1565290 1530870 1497526 1464903 1433502 1404084 1376871 1351647
53333A351647k3513k2115k0950j9583j7693j5463j3213j1072r360q545q523q716
$$ 1351647 1328134 1306019 1285069 1265486 1247793 1232330 1219117 1208045 1198685 1190140 1181617 1172901
53321A172901r129j0270j1713j2027j0773r286q673q417p712o838o106m793k410
$$ 1172901 1163772 1153502 1141789 1129762 1118989 1109703 1101030 1092613 1084901 1078063 1071957 1067164 1064754
53308A064754J20J740K731L734M449M509M590N344O293P034Q434J1148J4057J5695
$$ 1064754 1064874 1066614 1069345 1073079 1077528 1082037 1086627 1091971 1098264 1105298 1113732 1124880 1138937 1154632
53294A154632J6387J7429J8995K0375K1474K2538K3121K2854K2559K3080K3621
$$ 1154632 1171019 1188448 1207443 1227818 1249292 1271830 1294951 1317805 1340364 1363444 1387065
53283A387065K2742K0483J8076J6116J4392J2850J1364R107N654K069m73k445
$$ 1387065 1409807 1430290 1448366 1464482 1478874 1491724 1503088 1512195 1517849 1519918 1519445 1517000
53271A517000m945p731r878j1604j3701j5853j7301j8563k0567k2658k3428k3207
$$ 1517000 1512055 1504324 1494446 1482842 1469141 1453288 1435987 1417424 1396857 1374199 1350771 1327564
53259A327564k3627k4939k5808k5827k6104k7109k7840k7597k6945k6402k5691
$$ 1327564 1303937 1278998 1253190 1227363 1201259 1174150 1146310 1118713 1091768 1065366 1039675
53248A039675k4782k4287k4292k3952k2771k1305k0261j9792j9833k0199k0224
$$ 1039675 1014893 990606 966314 942362 919591 898286 878025 858233 838400 818201 797977
53237G97977j9273j7698j6383j5389j4041j2340j1153j0823j0620r738q124o266
$$ 797977 778704 761006 744623 729234 715193 702853 691700 680877 670257 660519 652395 646129
53225F46129m892m724n664o495o257n678o184p831r372j0135j0582j1048j1238
$$ 646129 641237 636513 630849 624354 618097 612419 606235 598404 589032 578897 568315 557267 546029
53212E46029j1130j1172j1387j1189j0356r335q441p492o396n374m632m293m570
$$ 546029 534899 523727 512340 501151 490795 481460 473019 465527 459131 453757 449125 444832 440262
53199D40262n436o375p004p527q061q086p375o732o850p089o480n316m604m456
$$ 440262 434826 428451 421447 413920 405859 397773 390398 383666 376816 369727 363247 357931 353327 348871
53185C48871m355m433n039n524m955l781l322l716l879l363k772k336j525l48
$$ 348871 344516 340083 335044 329520 324565 320784 317462 313746 309867 306504 303732 301396 299871 299523
53171B99523L94L61J06j5l09r11j382j383r72l02L25K76o20j434j186k61J87j68
$$ 299523 299917 300278 300384 300369 300060 299149 297767 296384 295412 295110 295435 295711 295091 293657 292471 292210 292397 292229
53153B92229p76j341j839j804r29QK2n55o55k35q4k86l02k88p75j284q31K97Q37
$$ 292229 291453 290112 288273 286469 285540 285548 285570 285015 284360 284125 284041 283755 283453 283165 282390 281106 280275 280572 281409
53134B81409O01O47J396K105K323K349K162J318J64l09J05P05J263K044K666K506
$$ 281409 282010 282657 284053 286158 288481 290830 292992 294310 294474 294165 294270 294975 296238 298282 300948 303454
53118C03454K188K916M239M346K906J704J919K513K137J000l7q75j740k375k575
$$ 303454 305642 308558 312797 317143 320049 321753 323672 326185 328322 329322 329285 328410 326670 324295 321720
53103C21720k704l080l585m115m627m641l711k463j992k176j916j166j121k063
$$ 321720 319016 315936 312351 308236 303609 298968 295257 292794 290802 288626 286710 285544 284423 282360
53089B82360k613j789l88M07N30M07O2m03m27Q9M01M1m43m15MM24O85N22l40j451
$$ 282360 279747 277958 277570 277977 278507 278914 278976 278573 278146 278235 278636 278677 278234 277819 277823 278247 278932 279454 279114 277663
53069B77663j853j340p09n45p50j269k136k652j876k26O87K53m02k77J99L13K29
$$ 277663 275810 274470 273761 273216 272466 271197 269061 266409 264533 264307 264994 265247 264845 264568 264767 265080 265309
53052B65309L77O68R48J278J416R89M44O73J431J454M88k86l05n25j490k062j216
$$ 265309 265686 266354 267302 268580 269996 270985 271429 272102 273533 274987 275475 275189 274884 274359 272869 270807 269591
53035B69591K08P23K55k13k52j44j0K87O38Q06P27L70k68p67n53J82N80K97j74
$$ 269591 269799 270522 270777 270564 270312 270168 270158 270445 271083 271889 272616 272986 272718 271951 271398 271580 272160 272457 272283
53016B72283m99q94j311j258o76k9O28J612K570K672K081J925K479K689J960J054
$$ 272283 271784 270890 269579 268321 267645 267616 268244 269856 272426 275098 277179 279104 281583 284272 286232 287286
53000B87286O38L50o8k1P83J611J841J753J656J273O45M28O58M87l23r00q64j036
$$ 287286 287924 288274 288206 288185 288968 290579 292420 294173 295829 297102 297747 298175 298833 299320 298997 298097 297233 296197
52982B96197j727j867p58O06J069R25R58J018P35N71R59J364J299J339K022K632
$$ 296197 294470 292603 291845 292451 293520 294445 295403 296421 297156 297727 298686 300050 301349 302688 304710 307342
52966C07342K291J411R91J125J353J623J896J517J60j249j680j445j447j630j330
$$ 307342 309633 311044 312035 313160 314513 316136 318032 319549 319709 318460 316780 315335 313888 312258 310928
52951C10928o88n16r99j570j858j926j727j131l87J3j06n49j001j095o39K6L46
$$ 310928 310240 309724 308725 307155 305297 303371 301644 300513 300126 300139 300033 299484 298483 297388 296749 296775 297121
52934B97121L38M78P53O35J05k15j71k54n20l63K93P71Q49J065J381R20m75j668
$$ 297121 297459 297937 298690 299325 299430 299215 299044 298790 298270 297907 298200 298971 299820 300885 302266 303186 302711 301043
52916C01043j842j388p73J77J157J147Q8o19k14K43k77j156j457j462j696j662
$$ 301043 299201 297813 297040 297217 298374 299521 299609 298990 298776 299019 298742 297586 296129 294667 292971 291309
52900B91309q68J7K37J78M33O76N56N89J007J002K01l38J49P02L39j89J59Q09
$$ 291309 290441 290458 290695 290873 291306 291982 292538 293127 294134 295136 295337 294999 295148 295850 296189 296000 296159 296968
52882B96968Q10P74J712K920K972K137J847K317K519K126J791J784J907K319L036
$$ 296968 297778 298552 300264 303184 306156 308293 310140 312457 314976 317102 318893 320677 322584 324903 327939
52867C27939L093J710j53r78r42j437k716l665l681l210k564j732j189j505k214
$$ 327939 331032 332742 332589 331611 330669 329232 326516 322851 319170 315960 313396 311664 310475 308970 306756
52852C06756k352j966j837k010j941j813k255k945k921k208j684j470q05L47J021
$$ 306756 304404 302438 300601 298591 296650 294837 292582 289637 286716 284508 282824 281354 280549 280896 281917
52837B81917P51J47j58j74j8K14Q9o73j328q23O22J580J194mj050j494j394j077
$$ 281917 282668 282815 282657 282483 282465 282679 282768 282095 280767 279944 280566 282146 283340 283336 282286 280792 279398 278321
52819B78321r17q29k11J006J812J410N07L71J088J737J812J371L16j315k632k752
$$ 278321 277404 276575 276364 277370 279182 280592 281099 281470 282558 284295 286107 287478 287794 286479 283847 281095
52803B81095k122j927k325k445j916j314j108j159j245j278j060n90l29n08n70
$$ 281095 278973 277046 274721 272276 270360 269046 267938 266779 265534 264256 263196 262606 262277 261769 261199
52788B61199K0R10J536J987K312J828K35j238j123L31J676K171K022J325J24r25
$$ 261199 261219 262129 263665 265652 267964 269792 270027 268789 267666 267997 269673 271844 273866 275191 275315 274390
52772B74390j198j035r69o51K84J036O93j84m06L6M56R03J574J606L13j052q17
$$ 274390 273192 272157 271188 270537 270821 271857 272550 272366 271960 271996 272452 273355 274929 276535 276848 275796 274979
52755B74979M01O23k99o58J65J036J361J767K262J941R65P52J665K414K304K144
$$ 274979 275380 276003 275704 275046 275211 276247 277608 279375 281637 283578 284543 285295 286960 289374 291678 293822
52739B93822K293J766K07j041q13K61R32R33O22K38J55P61J523J308P2r65j215
$$ 293822 296115 297881 298088 297047 296234 296495 297427 298360 298982 299220 299375 300136 301659 302967 303039 302074 300859
52722C00859j438k067k294j566o28k53r8L85Q92R43P26N48K17l57p47o76m18j59
$$ 300859 299421 297354 295060 293494 292866 292613 292515 292900 293792 294735 295461 296009 296226 295869 295122 294446 294028 293869
52704B93869K51N96K94n35r68n83q6k39r45j653j895j291N0J160J149N15M12P93
$$ 293869 294120 294716 295010 294475 293507 292924 292838 292599 291654 290001 288106 286815 286865 288025 289174 289689 290101 290894
52686B90894O37o2j35O93J266R05K97J1l37p90n93K62N86l5l12O27J695J622R67
$$ 290894 291531 291469 291334 292027 293293 294198 294495 294506 294169 293379 292786 293048 293634 293599 293287 293914 295609 297231 298198
52667B98198R76J426J158R9o97o58j81L26R27J700K470K979L036K708K410K475
$$ 298198 299174 300600 301758 301857 301160 300502 300321 300647 301574 303274 305744 308723 311759 314467 316877 319352
52651C19352K511J817M26r39j940k737l090k433j092k29l06o36p96j225j946k015
$$ 319352 321863 323680 324106 323167 321227 318490 315400 312967 311875 311646 311340 310704 309908 308683 306737 304722
52635C04722r68L33R79J163J281J114O61P35J701K496J995O20l78o38p39j012
$$ 304722 303754 304087 305066 306229 307510 308624 309285 310020 311721 314217 316212 316832 316454 315816 315077 314065
52619C14065j228j163p80p9O84R64N93J34J54M84N67J85l97p45m74L76J208J481
$$ 314065 312837 311674 310894 310815 311499 312463 313056 313190 313344 313828 314395 314580 314183 313438 312964 313340 314548 316029
52601C16029J412J527J755J667J335J024L98q61j907j564k47M63J72K0N40Q45
$$ 316029 317441 318968 320723 322390 323725 324749 325147 324286 322379 320815 320568 321031 321203 321223 321763 322608
52585C22608M13K2K56O67J000J676K395J894N7j346j128m24p65j783k150j631
$$ 322608 323021 323043 323299 323966 324966 326642 329037 330931 330988 329642 328514 328090 327325 325542 323392 321761
52569C21761q92j94M15N23R6m1M78O43l97j824k330j947j518j179o04j04k01o14
$$ 321761 320869 320675 321090 321613 321709 321668 322146 322789 322392 320568 318238 316291 314773 313594 312990 312886 312685 312071
52551C12071p66p93j052j214q53l43k47l16k4M86P60P91O78K64k32j18N36O69
$$ 312071 311305 310512 309460 308246 307393 307050 306803 306487 306463 306949 307709 308500 309178 309442 309210 309092 309628 310297
52533C10297N9Q4J516K840K372Q18O1L17M38L34R12J931J970P38l14k9J220K580
$$ 310297 310356 310440 311956 314796 317168 317986 318047 318364 318802 319136 320048 321979 323949 324687 324373 324344 325564 328144
52515C28144L695M306M140L558L412L873M217L976L496L086K418J087q34k900
$$ 328144 331839 336145 340285 343843 347255 351128 355345 359321 362817 365903 368321 369408 368574 365674
52501C65674m599n547n773n740n682n168l778j939n50l6k03o81j074j059q49j000
$$ 365674 361075 355528 349755 344015 338333 333165 329387 327448 326898 326862 326659 325978 324904 323845 322996 321996
52485C21996j409j224k41M55J11l49K88J599K222J964J783K039K140J883J867
$$ 321996 320587 319363 319122 319577 319688 319339 319627 321226 323448 325412 327195 329234 331374 333257 335124
52470C35124K366K870K985K940L076L449M042M694M941M444L412K075J83k287
$$ 335124 337490 340360 343345 346285 349361 352810 356852 361546 366487 370931 374343 376418 376601 374314
52456C74314m400n220n109n097n256m865l990l600l982m250l713k731j900j213
$$ 374314 369914 364694 359585 354488 349232 344367 340377 336777 332795 328545 324832 322101 320201 318988
52442C18988n33j33k74p06r69q98o37l78k48j70R1N61Q50O33J28k04k41j05J98
$$ 318988 318455 318322 318048 317342 316373 315475 314838 314460 314212 314042 314133 314694 315544 316177 316305 316101 315860 315755 315953
52423C15953O05P58M15o5j61J37M53O46Q71J197J588K117K773L325L628L906M553
$$ 315953 316558 317316 317731 317666 317505 317642 318095 318741 319612 320809 322397 324514 327287 330612 334240 338146 342699
52406C42699N860P924J0277J1629J0794Q102N047K305p80m368p149q094p953p899
$$ 342699 348559 356483 366760 378389 389183 397285 402332 404637 403857 399489 392340 384246 376293 368394
52392C68394p679o468m658l331k518j479l85j32o55p63J46J403K208K510K529
$$ 368394 360715 354247 349589 346258 343740 342261 341876 341744 341089 340326 340472 341875 344083 346593 349122
52377C49122K397K382K804L579M376N114N811O145N859N268M712L827K113q7j946
$$ 349122 351519 353901 356705 360284 364660 369774 375585 381730 387589 392857 397569 401396 403509 403422 401476
52362D01476l131l709l471k364j175p92r17n27N28J299J060M4j050j583j141R4
$$ 401476 398345 394636 391165 388801 387626 386834 385917 385390 385918 387217 388277 388321 387271 385688 384547 384641
52346C84641J248J673J674J805J931J768J719K214K751K656K378K868M044M970
$$ 384641 385889 387562 389236 391041 392972 394740 396459 398673 401424 404080 406458 409326 413370 418340
52332D18340N297N430N601N927O969R023J1059J1765J1419J1432J2078J2144J0931
$$ 418340 423637 429067 434668 440595 447564 456587 467646 479411 490830 502262 514340 526484 537415
52319E37415R202P958P443P623Q475R599J0496J1375J2699J4050J4591J4648J5389
$$ 537415 546617 554575 562018 569641 578116 587715 598211 609586 622285 636335 650926 665574 680963
52306F80963J6877J7838J7662J7259J7468J7981J8447J9236K0321K0477J8661
$$ 680963 697840 715678 733340 750599 768067 786048 804495 823731 844052 864529 883190
52295H83190J5467J2367R989P819N270K450J29r78j050j279k511m031m447l661
$$ 883190 898657 911024 921013 928832 934102 936552 936681 935703 934653 933374 930863 926832 922385 918724
52281I18724k981l273m048m573m727m516l754k750k246k258j864o89L82N56L90
$$ 918724 915743 912470 908422 903849 899122 894606 890852 888102 885856 883598 881734 881045 881427 881983 882373
52266H82373Q91K051L062L537L892M767O515Q986J1479J3224J4199J5090J6304
$$ 882373 883264 885315 888377 891914 895806 900573 907088 916074 927553 940777 954976 970066 986370
52253I86370J7463J8085J8151J7687J6320J3761J0480P437N205L550J811l01k336
$$ 986370 1003833 1021918 1040069 1057756 1074076 1087837 1098317 1105754 1110959 1114509 1116320 1116019 1113683
52240A113683l626m248n015o308p532q219q957j0346j1670j1784j0964j0603j1069
$$ 1113683 1110057 1105809 1100794 1094486 1086954 1078735 1069778 1059432 1047762 1035978 1025014 1014411 1003342
52227A003342j1261j0529r724r802j0433j0702j0421j0083r925r665q943p643
$$ 1003342 992081 981552 971828 962026 951593 940891 930470 920387 910462 900797 891854 884211
52215H84211n978m385l190k360j770j428j183n52O10J669K058K100K330K471K115
$$ 884211 878233 873848 870658 868298 866528 865100 863917 863365 863975 865644 867702 869802 872132 874603 876718
52200H76718J947L075N337P397Q473Q872Q842Q160P014O085N489M530K793N86
$$ 876718 878665 881740 887077 894474 902947 911819 920661 928821 935835 941920 947409 951939 954732 955318
52186I55318j757m091o014p134p811q644r202q516o817n520n246n240m973m934
$$ 955318 953561 949470 943456 936322 928511 919867 910665 902149 895332 889812 884566 879326 874353 869419
52172H69419n298n180l985k392j248m17N90J638K382K936L532M087M531M980N197
$$ 869419 864121 858941 854956 852564 851316 850899 851489 853127 855509 858445 861977 866064 870595 875575 880772
52157H80772M644L310J802M11j078k424k773j895o40K81J063K015K850L306L570
$$ 880772 885416 888726 890528 890939 889861 887437 884664 882769 882129 882410 883473 885488 888338 891644 895214
52142H95214L625K953J442j90j211j454r12L69J768K493K836L964O115Q157R422
$$ 895214 898839 901792 903234 903044 901833 900379 899467 899836 901604 904097 906933 910897 917012 925169 934591
52127I34591J0694J2707J4818J6099J6750J7508J8434J9109J9426J9459J9131
$$ 934591 945285 957992 972810 988909 1005659 1023167 1041601 1060710 1080136 1099595 1118726
52116A118726J8635J8545J8970J9228J8752J7625J5970J3809J1895J1480J2606
$$ 1118726 1137361 1155906 1174876 1194104 1212856 1230481 1246451 1260260 1272155 1283635 1296241
52105A296241J3725J3746J3360J3529J3785J3057J1292R101O590L569L64k628
$$ 1296241 1309966 1323712 1337072 1350601 1364386 1377443 1388735 1397836 1404426 1407995 1408359 1405731
52093A405731n598q664j1164j2476j3023j3576j4123j4238j4034j3872j3583j2868
$$ 1405731 1400133 1391469 1380305 1367829 1354806 1341230 1327107 1312869 1298835 1284963 1271380 1258512
52081A258512j2030j1548j1384j1283j1300j1310j0716r345p977p202o418m875
$$ 1258512 1246482 1234934 1223550 1212267 1200967 1189657 1178941 1169596 1161619 1154417 1147999 1143124
52069A143124k971j546m53J082L142N227P254R427J1486J3107J4723J6836J8729
$$ 1143124 1140153 1138607 1138154 1139236 1142378 1147605 1154859 1164286 1175772 1188879 1203602 1220438 1239167
52056A239167J9040J7625J5763J4368J2942J0625P440M109J192j162k905l989
$$ 1239167 1258207 1275832 1291595 1305963 1318905 1329530 1336970 1341079 1342271 1341109 1338204 1334215
52044A334215m567n079n927o959p491p129o408o157o396o573o623o982p535p664
$$ 1334215 1329648 1324569 1318642 1311683 1304192 1297063 1290655 1284498 1278102 1271529 1264906 1257924 1250389 1242725
52030A242725p590q468j0702j3164j4696j5390j5669j5177j3615j1853j1102j1374
$$ 1242725 1235135 1226667 1215965 1202801 1188105 1172715 1157046 1141869 1128254 1116401 1105299 1093925
52018A093925j1679j1331j0317q855p315o277n939n837n668n876o881q292r536
$$ 1093925 1082246 1070915 1060598 1051743 1044428 1038151 1032212 1026375 1020707 1014831 1007950 999658 990122
52005I90122j0678j1903j2726j2572j1673j0623r409p728n943m967n227o365p822
$$ 990122 979444 967541 954815 942243 930570 919947 910538 902810 896867 891900 886673 880308 872486
51992H72486r294j0765j2443j4467j6512j7935j8435j8114j7032j5403j4189j4444
$$ 872486 863192 852427 839984 825517 809005 791070 772635 754521 737489 722086 707897 693453
51980F93453j5801j6606j5895j4271j2469j0320p655n018k683n8L153O166Q376
$$ 693453 677652 661046 645151 630880 618411 608091 600436 595418 592735 592677 595830 601996 610372
51967F10372J0251J2171J3459J3582J3186J2852J1881R593O905N369N288O051
$$ 610372 620623 632794 646253 659835 673021 685873 697754 707347 714252 719621 724909 730960
51955G30960P547R926J2459J3808J3071R878M246k687q675j2218j3712j3937j2593
$$ 730960 738507 748433 760892 774700 787771 797649 801895 799208 790533 778315 764603 750666 738073
51942G38073r499n985l411j258J597M581O103N977N259M217K259m25k905n078
$$ 738073 728574 722589 719178 717920 719517 724098 730201 736178 741437 745654 747913 747488 744583 739505
51928G39505p564j0209j2252j3804j5628j7522j8460j8253j7597j6650j5042j3122
$$ 739505 731941 721732 709480 695676 680048 662526 644066 625813 608216 591566 576524 563402
51916E63402j1655j0351q260n552l298j556O35L255N066N661O029O734P053O371
$$ 563402 551747 541396 533136 527584 524286 522730 523365 526620 531686 537347 543376 550110 557163 563534
51902E63534M952K899j98m015p288r390j0950j2402j3201j2965j2137j0967r039
$$ 563534 568486 571385 571187 567172 559884 550494 539544 527142 513941 500976 488839 477872 468833
51889D68833o437m241l032k001j96K168M353O141P619Q674R336R973J0636J0864
$$ 468833 462396 458155 455123 453122 452926 455094 459447 465588 473207 481881 491217 501190 511826 522690
51875E22690J0520J0083R589Q117M955Q40k614m344m423l548k314q67Q79K546
$$ 522690 533210 543293 552882 560999 565954 566794 564180 559836 555413 551865 549551 548684 549563 552109
51861E52109L272K789K013J887K052J632Q30M59J36j560m951q609j1091j2200
$$ 552109 555381 558170 560183 562070 564122 565754 566584 567043 567179 565619 560668 552059 540968 528768
51847E28768j2311j1697j0931j0769j1052j0646q988o754m677k689p54N44Q69
$$ 528768 516457 504760 493829 483060 472008 461362 452374 445620 440943 438254 437500 438044 438913
51834D38913P97R95J446J945K565L122K928J689O6j133j741j957j877j718j772
$$ 438913 439710 440705 442151 444096 446661 449783 452711 454400 454466 453333 451592 449635 447758 446040 444268
51819D44268j790j130R7Q12M42j93r2M27L09o72j633j744j063j84M17O83Q30J116
$$ 444268 442478 441348 441445 442257 442699 442506 442414 442841 443150 442478 440845 439101 438038 437854 438271 438954 439784 440900
51801D40900J775L035M823O346O469M892K528M02j320k730l403l038k301j972
$$ 440900 442675 445710 450533 456879 463348 468240 470768 471170 469850 467120 463717 460679 458378 456406
51787D56406j819j316r23j385k222k363j975k054k421j807k0J773L138N004P627
$$ 456406 454587 453271 452348 450963 448741 446378 444403 442349 439928 438121 438101 439874 443012 448016 455643
51772D55643R743J0520J0805J1408J1546J0150P610N060K797M44j965m140o108
$$ 455643 465386 475906 486711 498119 509665 519815 527425 532485 535282 535726 533761 529621 523513
51759E23513p807q612q195p333p030p242p207o717o275o149n988n357m220k926
$$ 523513 515706 507094 498899 491566 484536 477294 470087 463370 457095 450946 444958 439601 435381 432455
51745D32455j864j093l23N92J329J611J802K392L148L544L849M828O395P455P174
$$ 432455 430591 429498 429175 429767 431096 432707 434509 436901 440049 443593 447442 452270 458665 466120 473294
51730D73294N615L184M48j483j513K90K912N663Q160R267P641L602q28m129o207
$$ 473294 478909 482093 482541 481058 479545 479835 482747 488410 496570 505837 513478 517080 516252 512123 505916
51715E05916p022o000l517j337o36q22j048j569k507k700j115J402L041L092K089
$$ 505916 498894 492894 489377 488040 487404 486582 485534 483965 481458 478758 477643 479045 482086 485178 487267
51700D87267N68j320l290m862n536m742k259R40L096L386K461J040q30k703l434
$$ 487267 487835 486515 483225 478363 472827 468085 465826 466766 469862 473248 475709 476749 475919 473216 469782
51685D69782k855k468l342m449m257k963j815j204p51n43p96q55P3J549K493K796
$$ 469782 466927 464459 461117 456668 452411 449448 447633 446429 445678 445135 444339 443484 443557 445106 447599 450395
51669D50395L244M226N710Q144J1963J6238J8953J8887J6444J2714Q424L905n94
$$ 450395 453639 457865 463575 471719 483682 499920 518873 537760 554204 566918 575342 579247 578653
51656E78653m640p450q251p166n238l197r20J391K323N80l341p730j1469j4268
$$ 578653 574013 566563 558312 551146 545908 542711 541791 543182 545505 546085 542744 535014 523545 509277
51642E09277j5705j5250j3315j1233r988r485q987p810n790l577k191j850j556
$$ 509277 493572 478322 465007 453774 443786 434301 425314 417504 411714 408137 405946 404096 402540
51629D02540m08J181K157K266K066J873J488P63j95j230k078k329j935j421j289
$$ 402540 402132 403313 405470 407736 409802 411675 413163 413926 413731 412501 410423 408094 406159 404738 403449
51614D03449j509j963k668l193k643r20O73R71M87N74J574K635L096L170L476
$$ 403449 401940 399977 397309 394116 391473 390553 391226 392197 392684 393258 394832 397467 400563 403733 407209
51599D07209M552O566R093J1467J3683J6193J8334J7961J3560O233j207o547q978
$$ 407209 411761 418327 427420 438887 452570 468763 487097 505058 518618 524851 523644 517097 508119
51586E08119q690o866n316m833m319k514M4K039L630O108R530J2313J3348J3249
$$ 508119 499429 492563 487247 482414 478095 475581 475625 477664 481294 487402 496932 509245 522593 535842
51572E35842J3253J3938J5228J6677J7450J6762J4697J2223J0500J0571J3166
$$ 535842 549095 563033 578261 594938 612388 629150 643847 656070 666570 677141 690307
51561F90307J8036K3792K9154L4019L8483M1323M0708L6184K8938K0252J0818
$$ 690307 708343 732135 761289 795308 833791 875114 915822 952006 980944 1001196 1012014
51550A012014J447o899j4065k0636k6727l1657l4960l6843l7511l6916l5426l3767
$$ 1012014 1013461 1006562 992497 971861 945134 913477 878517 841674 804163 767247 731821 698054
51538F98054l2085k9774k6542k2938j9618j6753j4282j2151j0132p996o129n254
$$ 698054 665969 636195 609653 586715 567097 550344 536062 523911 513779 505783 499654 494400
51526D94400n428n809n629m924m165l634l296k911k172j090j84N0k28n03o18p08
$$ 494400 488972 483163 477534 472610 468445 464811 461515 458604 456432 455342 455158 455208 454980 454477 453859 453151
51510D53151o52k39K27J74l88q13o59j28L08L51Rm19o01o28r53j617k046j897
$$ 453151 452499 452260 452487 452661 452273 451460 450801 450673 450981 451332 451341 450922 450321 449693 448740 447123 445077 443180
51492D43180j552j288p39J71N31l47j686k278k230k467k940k702j642p69o74r23
$$ 443180 441628 440340 439601 439772 440303 439956 438270 435992 433762 431295 428355 425653 424011 423242 422568 421645
51476D21645j161j646k362k625k051j151n66m03n46r47j263r08K06J401J962J811
$$ 421645 420484 418838 416476 413851 411800 410649 410083 409680 409134 408187 406924 406016 406222 407623 409585 411396
51460D11396J398J317J978L168M000L792K964K530K817L232L170K635K002J744
$$ 411396 412794 414111 416089 419257 423257 427049 430013 432543 435360 438592 441762 444397 446399 448143
51446D48143K293L729N660P711R715J0982J0150O720K344n07r01K53J820L139
$$ 448143 450436 454165 459825 467536 477251 488233 498383 505103 507447 506940 506039 506292 508112 511251
51432E11251L360J465k537p209j0755j2026j0924q601o923o767o960n873l704
$$ 511251 514611 516076 513539 506330 495575 483549 472625 464024 457101 450334 443374 437501 433797
51419D33797j999j309p79J4N18O42J158K138K544J986J488J766K094J783J494
$$ 433797 431798 430489 429710 429724 430242 430884 432042 434180 436724 438710 440198 441964 444058 445841 447335
51404D47335K016K747K735K425L009M402N222M745L722L129L063L206L661M810
$$ 447335 449351 452098 454833 457258 460267 464669 469891 474636 478358 481487 484550 487756 491417 496227
51390D96227O615Q471R767J0431J0935J1938J3926J7054K1094K5454K9532L3148
$$ 496227 502842 511313 521080 531511 542446 554384 568310 585364 606458 631912 661444 694592
51378F94592L6570M0215M4467M9359N3600N4161M8176L5965K1360Q281k247j1227
$$ 694592 731162 771377 815844 865203 918803 972964 1021140 1057105 1078465 1086746 1084499 1073272
51366A073272j9173k5828l1411l6414m0377m2364m2620m2351m1898m0426l7595
$$ 1073272 1054099 1028271 996860 960446 920069 877705 835085 792734 750836 710410 672815
51355F72815l4271l1236k8330k5210k2038j8976j5941j3102j0919r482q452p719
$$ 672815 638544 607308 578978 553768 531730 512754 496813 483711 472792 463310 454858 447139
51343D47139p360o991o108n017m520m557m191l040j758r09l30J71M27M19L82K58
$$ 447139 439779 432788 426680 421663 417143 412586 408395 405355 403597 402688 402358 402529 402956 403375 403757 404015
51327D04015j53m77j45N29O42J25j61K09Q78J681K754L582L328K399K323L602
$$ 404015 403862 403385 403240 403769 404411 404536 404375 404584 405462 407143 409897 413479 416807 419206 421529 425131
51311D25131M993N272M514L195J415l88j314j296j370j961k161j491j087k063
$$ 425131 430124 435396 439910 443105 444520 444132 442818 441522 440152 438191 436030 434539 433452 431389
51297D31389l705m450l930k997k330j965j766j577j154n07P8N86J271K023K458
$$ 431389 427684 423234 419304 416307 413977 412012 410246 408669 407515 407008 407086 407672 408943 410966 413424
51282D13424K813L772N201O127O195N906N182L225L98j424j296n98q09j364r50
$$ 413424 416237 420009 425210 431337 437532 443438 448620 451845 452243 450819 449523 448925 448116 446752 445802
51267D45802L43J640K990M755O092N759L995K112N93j010k568l219k772k082j948
$$ 445802 446145 447785 450775 455530 461622 467381 471376 473488 474081 473071 470503 467284 464512 462430 460482
51252D60482k496l579m933n961o138n587m730l730k813k535l002l303k623j410
$$ 460482 457986 454407 449474 443513 437375 431788 427058 423328 420515 417980 414978 411675 409052 407642
51238D07642o14k34L06Q64P92K25n6J22L12N34J243K161K304J452N77M70Q09J003
$$ 407642 407028 406794 407100 407964 408756 408981 408925 409047 409359 409893 411136 413297 415601 417053 417630 418100 418909 419912
51220D19912J176J708K299K235J415O30O88J423J879J502Q55Q49J511K161K610
$$ 419912 421088 422796 425095 427330 428745 429375 430063 431486 433365 434867 435722 436571 438082 440243 442853
51205D42853L376M490N090M627L688K989K341J284Q0p84j552k719m031m747m686
$$ 442853 446229 450719 455809 460436 464124 467113 469454 470738 470818 470034 468482 465763 461732 456985 452299
51190D52299m236l612k803k050j642j427j089p79q50j205j468j538j402p55N98
$$ 452299 448063 444451 441648 439598 437956 436529 435440 434661 433811 432606 431138 429600 428198 427443 428041
51175D28041K109K965K947K377J450K84o34p98l39K53R49K066L485M584M964M705
$$ 428041 430150 433115 436062 438439 439889 440173 439539 438741 438402 438655 439604 441670 445155 449739 454703 459408
51159D59408M002K957J794P83no82j304j867k365k649k540k180j948j856j522
$$ 459408 463410 466367 468161 468944 468939 468257 466953 465086 462721 460072 457532 455352 453404 451548 450026
51144D50026r98r51j701k625k968k663j886n34J126K008J301k54j067n45M71J055
$$ 450026 449028 448077 446376 443751 440783 438120 436234 435700 436826 438834 440135 439881 438814 438269 438740 439795
51128D39795J333K163L961N946O565N075K587R60O89P27M42M89J313K050J876
$$ 439795 441128 443291 447252 453198 459763 464838 467425 468385 469074 469801 470243 470732 472045 474095 475971
51113D75971J353J403J787J748J390J257J185P80M98J018J922K295K236K538L084
$$ 475971 477324 478727 480514 482262 483652 484909 486094 486874 487372 488390 490312 492607 494843 497381 500465
51098E00465K891J750N47r0m91j122j885k384k197j030P07J759J312K09o4O61
$$ 500465 503356 505106 505653 505563 505072 503950 502065 499681 497484 496454 497161 498920 500232 500441 500377 501038
51082E01038J241J072P23P41R12J034J404K210L152L948M711N628O704P897R131
$$ 501038 502279 503351 504074 504815 505727 506761 508165 510375 513527 517475 522186 527814 534518 542415 551546
51067E51546J0224J1176J2233J3310J3734J3171J2320J2059J2388J2871J3294
$$ 551546 561770 572946 585179 598489 612223 625394 637714 649773 662161 675032 688326
51056F88326J2980J0319M514k609p940r993r185n900l61N476Q331O953L688J699
$$ 688326 701306 711625 716139 713530 705590 695597 686412 680512 680151 685627 693958 700911 704599 706298
51042G06298J625J791O11k143n627q394q983o886k882J611N097N991L313j903
$$ 706298 707923 709714 710325 708182 702555 694161 685178 678292 675410 677021 682118 688109 691422 689519
51028F89519o702q572p418m903k456n14R21J874K441K693K586K245K053K159K124
$$ 689519 682817 674245 666827 661924 659468 658954 659875 661749 664190 666883 669469 671714 673767 675926 678050
51013F78050J316m22k607m397n163n018m772m934m944l953k240r91o35k98O58
$$ 678050 679366 678944 676337 671940 666777 661759 656987 652053 647109 643156 640916 639925 639290 638992 639650
50998F39650J531J394O50N73J559K726L290L624M638O496Q441R830J0927J2413
$$ 639650 641181 642575 643225 643798 645357 648083 651373 654997 659635 666131 674572 684402 695329 707742
50984G07742J4371J6191J7482J8519J9546K0149J9755J8371J6416J4227J2287
$$ 707742 722113 738304 755786 774305 793851 814000 833755 852126 868542 882769 895056
50973H95056J1631J3280J7240K2541K8184L3590L8297M1947M4745M7409N0515
$$ 895056 906687 919967 937207 959748 987932 1021522 1059819 1101766 1146511 1193920 1244435
50962A244435N4007N7328N9784O0872O0533N8962N6142N1907M6582M0956L5200
$$ 1244435 1298442 1355770 1415554 1476426 1536959 1595921 1652063 1703970 1750552 1791508 1826708
50951A826708K8574K0849J3363P716L793P9m155p915r754r310p635o573p690j1092
$$ 1826708 1855282 1876131 1889494 1897210 1901003 1901082 1896927 1889012 1879258 1869948 1862313 1855740 1848050 1836958
50937A836958j5249j8421k0107k0871k1228k1435k1829k2573k3345k4060k5449
$$ 1836958 1821709 1803288 1783181 1762310 1741082 1719647 1697818 1675245 1651900 1627840 1602391
50926A602391k8084l1278l3918l6028l8324m0572m1663m1259m0140l8834l7064
$$ 1602391 1574307 1543029 1509111 1473083 1434759 1394187 1352524 1311265 1271125 1232291 1195227
50915A195227l4681l2138k9805k7673k5813k4287k2620k0304j7772j5933j4792
$$ 1195227 1160546 1128408 1098603 1070930 1045117 1020830 998210 977906 960134 944201 929409
50904I29409j3585j2230j1364j0908r949q249o666n684m732l394k160j480j065
$$ 929409 915824 903594 892230 881322 871373 863124 856458 850774 846042 842648 840488 839008 837943
50891H37943o69n77q75j068q53m30K67J642L447M784N539O738Q843J0765J1365
$$ 837943 837274 836697 835822 834754 833901 833471 833738 835380 838827 843611 849150 855888 864731 875496 886861
50876H86861J1001J0845J1277J1849J2190J2313J2423J2906J4052J5468J6388
$$ 886861 897862 908707 919984 931833 944023 956336 968759 981665 995717 1011185 1027573
50865A027573J6876J7953K0190K2933K5468K8049L1306L5349M0170M6176N3505
$$ 1027573 1044449 1062402 1082592 1105525 1130993 1159042 1190348 1225697 1265867 1312043 1365548
50854A365548O1343O8659P5296Q1840Q8792R6274J04105J11735J18449J24002
$$ 1365548 1426891 1495550 1570846 1652686 1741478 1837752 1941857 2053592 2172041 2296043
50844B296043J28647J32380J34703J35229J33731J29336J20548J06778Q9215O9733
$$ 2296043 2424690 2557070 2691773 2827002 2960733 3090069 3210617 3317395 3406610 3476343
50834C476343M9461K8906Q787r963k6623m0692n1713n9459o3842o4641o1782n5997
$$ 3476343 3525804 3554710 3563497 3553534 3526911 3486219 3434506 3375047 3311205 3246564 3184782 3128785
50822C128785m8519m0107l1189k3055j7709j6116j7609k1446k7862l6903m7295
$$ 3128785 3080266 3040159 3008970 2985915 2968206 2952090 2934481 2913035 2885173 2848270 2800975
50811B800975n7461o6876p5617q3346q9647r4799r9075j01656j01230r7528r1639
$$ 2800975 2743514 2676638 2601021 2517675 2428028 2333229 2234154 2132498 2031268 1933740 1842101
50800A842101q4835p7693p0229o2434n4602m7302m0815l4742k8629k2916j8497
$$ 1842101 1757266 1679573 1609344 1546910 1492308 1445006 1404191 1369449 1340820 1317904 1299407
50789A299407j5261j1995q083m414k156j366j309j402j373j122r70j441k422l241
$$ 1299407 1284146 1272151 1264068 1259654 1257498 1256132 1254823 1253421 1252048 1250926 1249956 1248515 1246093 1242852
50775A242852l766m598n812o629o801p297q799j0562j1563j1923j2301j2694j2783
$$ 1242852 1239086 1234488 1228676 1222047 1215246 1207949 1199150 1188588 1177025 1165102 1152801 1140107 1127324
50762A127324j2774j2895j2627j1340r275p109n014k851p70J113L129N476P725
$$ 1127324 1114550 1101655 1089028 1077688 1068413 1061304 1056290 1053439 1052669 1053782 1056911 1062387 1070112
50749A070112R515J1137J2927J4733J6588J9033K2157K5197K7825L0874L4905
$$ 1070112 1079627 1090764 1103691 1118424 1135012 1154045 1176202 1201399 1229224 1260098 1295003
50738A295003L9150M2947M7141N2660N8577O3169O6231O8743P0717P1178P0113
$$ 1295003 1334153 1377100 1424241 1476901 1535478 1598647 1664878 1733621 1804338 1875516 1945629
50727A945629O8760O7738O6272O3573N9717N4875M8701M0885L1455K0326P368
$$ 1945629 2014389 2082127 2148399 2211972 2271689 2326564 2375265 2416150 2447605 2467931 2475299
50716B475299o867k1134l4331m5641n3948n8100n8001n4760m9595m3194l6201
$$ 2475299 2468432 2447298 2412967 2367326 2313378 2255278 2197277 2142517 2092922 2049728 2013527
50705B013527k9424k3183j7146j1215o131k886j903l140o691j2772k1120l0579
$$ 2013527 1984103 1960920 1943774 1932559 1926428 1923542 1921639 1918499 1911808 1899036 1877916 1847337
50693A847337l9521m6793n2182n5874n7726n7481n5452n2319m8327m3326l7675
$$ 1847337 1807816 1761023 1708841 1652967 1595241 1537760 1482308 1429989 1381662 1338336 1300661
50682A300661l2175k6958k1346j5195r405m646m77L718P870J1849J5988K0211
$$ 1300661 1268486 1241528 1220182 1204987 1195582 1190936 1190459 1194177 1202047 1213896 1229884 1250095
50670A250095K3552K5361K6128K6344K5571K3563K1365K0067J9295J8152J6874
$$ 1250095 1273647 1299008 1325136 1351480 1377051 1400614 1421979 1442046 1461341 1479493 1496367
50659A496367J6320J6442J6609J6913J7702J8353J7969J7032J6934J7986J9239
$$ 1496367 1512687 1529129 1545738 1562651 1580353 1598706 1616675 1633707 1650641 1668627 1687866
50648A687866K0214K1481K3568K6389K9859L3930L8069M1609M4654M7728N0654
$$ 1687866 1708080 1729561 1753129 1779518 1809377 1843307 1881376 1922985 1967639 2015367 2066021
50637B066021N2662N3335N2599N0188M6217M1904L8452L5550L2325K9505K8979
$$ 2066021 2118683 2172018 2224617 2274805 2321022 2362926 2401378 2436928 2469253 2498758 2527737
50626B527737L0879L2273K9171J9242L132j5451l1098l9786m1338l8258l2572
$$ 2527737 2558616 2590889 2620060 2639302 2642434 2626983 2595885 2556099 2514761 2476503 2443931
50615B443931k4957j6427q758k858J731N284P239P497O793N131J240n621j4541
$$ 2443931 2418974 2402547 2393789 2390931 2392662 2397946 2405185 2412682 2419475 2424606 2425846 2420225 2405684
50602B405684k4378l5099m6800n8369o8151p5256p9488q0793p9618p7128p4199
$$ 2405684 2381306 2346207 2299407 2241038 2172887 2097631 2018143 1937350 1857732 1780604 1706405
50591A706405p0631o6054o1038n6531n2539m8146m2741l6738l1219k7100k4430
$$ 1706405 1635774 1569720 1508682 1452151 1399612 1351466 1308725 1271987 1240768 1213668 1189238
50580A189238k2298j9598j6007j2079q448n360k781l92K436O005R644J2373J4142
$$ 1189238 1166940 1147342 1131335 1119256 1110808 1105448 1102667 1102275 1104711 1110716 1120360 1132733 1146875
50567A146875J5633J6987J7673J7662J7716J8157J8359J7969J7740J8654K0789
$$ 1146875 1162508 1179495 1197168 1214830 1232546 1250703 1269062 1287031 1304771 1323425 1344214
50556A344214K3521K6285K8681L0349L1190L1353L0839K9529K7699K6015K4817
$$ 1344214 1367735 1394020 1422701 1453050 1484240 1515593 1546432 1575961 1603660 1629675 1654492
50545A654492K3906K3203K3116K4164K6676L0743L5993M1552M6971N2963O0309
$$ 1654492 1678398 1701601 1724717 1748881 1775557 1806300 1842293 1883845 1930816 1983779 2044088
50534B044088O8125P4376P8182Q0703Q3510Q7215R1884R7610J03960J09747J14013
$$ 2044088 2112213 2186589 2264771 2345474 2428984 2516199 2608083 2705693 2809653 2919400 3033413
50523C033413J16659J17728J16762J13324J07495R9351Q8530P4765N8461M0454
$$ 3033413 3150072 3267800 3384562 3497886 3605381 3704732 3793262 3868027 3926488 3966942
50513C966942K1617K729j5802l4107n2069o8559q2201r2714j00474j04883j04576
$$ 3966942 3988559 3991288 3975486 3941379 3889310 3820751 3738550 3645836 3545362 3440479 3335903
50502C335903r9384r0673p9415o5413m9099l2508j7390l453J0381K3862L5573
$$ 3335903 3236519 3145846 3066431 3001018 2951919 2919411 2902021 2898568 2908949 2932811 2968384
50491B968384M4402M9698N0453M5469L4214J6991n312l1008n7585q2475j03703
$$ 2968384 3012786 3062484 3112937 3158406 3192620 3209611 3204299 3173291 3115706 3033231 2929528
50480B929528j19737j29587j33590j33284j29945j23889j15612j06475r7542q8561
$$ 2929528 2809791 2680204 2546614 2413330 2283385 2159496 2043884 1937409 1839867 1751306
50470A751306p9070o9744o1630n4713m8239m1967l6166l0800k5617k0732j6294
$$ 1751306 1672236 1602492 1540862 1486149 1437910 1395943 1359777 1328977 1303360 1282628 1266334
50459A266334j1975p517l405j04K840O130R542J2245J3989J5127J5822J6218J7104
$$ 1266334 1254359 1246842 1243437 1243333 1246173 1252303 1261845 1274090 1288079 1303206 1319028 1335246 1352350
50446A352350J9447K3362K8186L3204L7366L8682L5232K7079J6426N812l151r535
$$ 1352350 1371797 1395159 1423345 1456549 1493915 1532597 1567829 1594908 1611334 1617146 1613995 1604460
50434A604460j2808j3323j2235j0480q253n714l545k274j466p3K413N471Q207
$$ 1604460 1591652 1578329 1566094 1555614 1547361 1541647 1538102 1535828 1534362 1534289 1536702 1542173 1550380
50421A550380J0379J2618J5669J9603K3977K8619L3711L9095M4114M8440N2465
$$ 1550380 1560759 1573377 1589046 1608649 1632626 1661245 1694956 1734051 1778165 1826605 1879070
50410A879070N6475N9841O1609O1592O0348N8377N5751N2375M8177M3086L7088
$$ 1879070 1935545 1995386 2056995 2118587 2178935 2237312 2293063 2345438 2393615 2436701 2473789
50399B473789L0135K1923J2086Q46j1075k3391l6484n0156o2741p2166p7684p9957
$$ 2473789 2503924 2525847 2537933 2538779 2527704 2504313 2467829 2417673 2354932 2282766 2205082 2125125
50387B125125p9738p7158p2158o5003n6359m7156l8197k9498k0319j0284j45R044
$$ 2125125 2045387 1968229 1896071 1831068 1774709 1727553 1689356 1659858 1639539 1629255 1629110 1638154
50375A638154J7046K4029K9395L1908L0969K7045K0722J2227K144q089j7076k4712
$$ 1638154 1655200 1679229 1708624 1740532 1771501 1798546 1819268 1831495 1833639 1825550 1808474 1783762
50363A783762l2150m0457m9318n7068o1916o3236o1734n8656n5018n1467m8273
$$ 1783762 1751612 1711155 1661837 1604769 1542853 1479617 1417883 1359227 1304209 1252742 1204469
50352A204469m5177m1609l7357l2841k8616k4816k1254j7720j4031j0179o708
$$ 1204469 1159292 1117683 1080326 1047485 1018869 994053 972799 955079 941048 930869 924161
50341I24161m466l702l649l388k779k228j891j505q20J78J341K474L509M648O004
$$ 924161 919695 915993 912344 908956 906177 903949 902058 900553 899733 899911 901252 903726 907235 911883 917887
50326I17887P165P577P464P719Q673R698J0346J1134J2597J4262J5266J5477J5304
$$ 917887 925052 932629 940093 947812 956485 966183 976529 987663 1000260 1014522 1029788 1045265 1060569
50313A060569J4874J4227J3989J4932J7011J9531K2263K5664L0032L5135M0758
$$ 1060569 1075443 1089670 1103659 1118591 1135602 1155133 1177396 1203060 1233092 1268227 1308985
50302A308985M6791N2293N4731N0837L8692J9485k579k2399l6587m4553m7606
$$ 1308985 1355776 1408069 1462800 1513637 1552329 1571814 1569235 1546836 1510249 1465696 1418090
50291A418090m7539m5854m3469m0582l7118l3423l0119k7188k3907j9971j6006
$$ 1418090 1370551 1324697 1281228 1240646 1203528 1170105 1139986 1112798 1088891 1068920 1052914
50280A052914j2564r322n835k364O69L487O461R360J1808J3962J5990J7329J7345
$$ 1052914 1040350 1031028 1025193 1022829 1023498 1026985 1033446 1042806 1054614 1068576 1084566 1101895 1119240
50267A119240J6348J5099J3627J1614R620Q796R274R910R825R267Q635P503N190
$$ 1119240 1135588 1150687 1164314 1175928 1185548 1194344 1203618 1213528 1223353 1232620 1241255 1248758 1253948
50254A253948J716k233o005r222j1593j2873j2934j1802r715p144m711l166l460
$$ 1253948 1255664 1253431 1247426 1238204 1226611 1213738 1200804 1189002 1179287 1172143 1167432 1164266 1160806
50241A160806o377j1653j7617k2234k4513k4717k3426k0978j7829j4771j2433
$$ 1160806 1154429 1142776 1125159 1102925 1078412 1053695 1030269 1009291 991462 976691 964258
50230I64258j0784r353p924o799o343o380o323n977n855o363p006p046o641o552
$$ 964258 953474 944121 936197 929398 923055 916675 910352 904375 898520 892157 885151 878105 871464 864912
50216H64912o698o115m628l518l826m863n207m532l585k848k212j743j821k487
$$ 864912 858214 852099 847471 843953 840127 835264 830057 825525 821940 819092 816880 815137 813316 810829
50202H10829l322m002m532m991n447n938o248n928m974m126l999m267m122l335
$$ 810829 807507 803505 798973 793982 788535 782597 776349 770421 765447 761321 757322 753055 748933 745598
50188G45598k333j549j161j206j478j576j386j243j221r22l14j62r09j699j410
$$ 745598 743265 741716 740555 739349 737871 736295 734909 733666 732445 731523 731209 731047 730138 728439 727029
50173G27029k27P11R83J259K149L480M761N672O141O405O984Q112R382J0371J1315
$$ 727029 726802 727513 728496 729755 731904 735384 740145 745817 751958 758363 765347 773459 782841 793212 804527
50158H04527J2740J4827J7597K1182K5241K8602L0331L0812L0861L0218K7920
$$ 804527 817267 832094 849691 870873 896114 924716 955047 985859 1016720 1046938 1074858
50147A074858K4082K0215J7716J6702J6357J5686J3963J1035P307L015k165q288
$$ 1074858 1098940 1119155 1136871 1153573 1169930 1185616 1199579 1210614 1217921 1220936 1218771 1210483
50135A210483j4323j8913k1757k3546k4854k5844k6679k7341k7221k5661k2847
$$ 1210483 1196160 1177247 1155490 1131944 1107090 1081246 1054567 1027226 1000005 974344 951497
50124I51497j9572j6458j3993j2769j2767j2944j2431j1643j1197j0455q509n996
$$ 951497 931925 915467 901474 888705 875938 862994 850563 838920 827723 817268 808759 802763
50112H02763m316l376j816N77K495L295L770M312M045K539Q57k6o48j938l663
$$ 802763 798447 795071 793255 793832 796327 799622 803392 807704 811749 814288 815145 815119 814471 812533 808870
50097H08870m925n371n194m550l669k883k128j071n1M7p64j280q49k93m15o10
$$ 808870 803945 798574 793380 788830 785161 782278 780150 779079 779028 779075 778311 777031 776182 775889 775474 774864
50081G74864L0J086J471J108R31J517K661L996N241N971N980N691N706N991O108
$$ 774864 774894 775980 777451 778559 779490 781007 783668 787664 792905 798876 804856 810547 816253 822244 828352
50066H28352N982N892N839N475M669L765L214L129L121K506R66q71j862j580p41
$$ 828352 834334 840226 846065 851540 856209 859974 863188 866317 869438 871944 872910 872039 870177 868597 867856
50051H67856k57k50k16K48J145K223L130L756M531O092Q494J1110J3402J5378
$$ 867856 867599 867349 867133 867381 868526 870749 873879 877635 882166 888258 896752 907862 921264 936642
50037I36642J7189J8894K0712K2956K5400K7229K7856K7333K5818K3332K0269
$$ 936642 953831 972725 993437 1016393 1041793 1069022 1096878 1124211 1150029 1173361 1193630
50026A193630J7453J5296J3468J1717J0287R079P241M167K26m278j0066j7710
$$ 1193630 1211083 1226379 1239847 1251564 1261851 1270930 1278171 1282338 1282564 1278286 1268220 1250510
50014A250510k5881l1970l4535l4333l2890l1012k8877k6652k4428k1973j9107
$$ 1250510 1224629 1192659 1158124 1123791 1090901 1059889 1031012 1004360 979932 957959 938852
50003I38852j6038j2968r706o186l123j519j374j530j007l6O15P83O63j19k259
$$ 938852 922814 909846 900140 893954 890831 889312 887938 886408 885401 885365 885980 886763 887426 887307 885048
49988H85048n549q882j1578j3827j5507j5802j4611j3301j3008j3012j1913r772
$$ 885048 879499 870617 859039 845212 829705 813903 799292 785991 772983 759971 748058 738286
49976G38286p835o590n455m209l361l034k659k015j568j548j585j458j356j260
$$ 738286 730451 723861 718406 714197 710836 707802 705143 703128 701560 700012 698427 696969 695613 694353
49962F94353q39l4R73K305M084N779O861P897R760J1767J2074J0149P482N464
$$ 694353 693514 693480 694453 696758 700842 706621 713482 721379 731139 742906 754980 765129 772611 778075
49948G78075L980K616J793J739J552L18j609l270m315m843m788m233l775l941
$$ 778075 782055 784671 786464 788203 789755 790073 788464 785194 780879 776036 771248 767015 763240 759299
49934G59299m816o507r083j1588j2231j0430p761o030n266m440l270k172j158
$$ 759299 754483 747976 738893 727305 715074 704644 696883 690853 685587 681147 677877 675705 674547
49921F74547QR63J242J304K026L355M390M725M822N083N326N341N414O147P905
$$ 674547 674555 675518 676760 678064 680090 683445 687835 692560 697382 702465 707791 713132 718546 724693 732598
49906G32598J0330J2321J2834J1893J0451R182Q018O948O346O120N381L621J423
$$ 732598 742928 755249 768083 779976 790427 799609 807627 814575 820921 827041 832422 836043 837466
49893H37466o02k844n868r156j1546j2450j2019j0551q509o634n373m486l805
$$ 837466 836864 834020 828152 818996 807450 795000 782981 772430 763921 757287 751914 747428 743623
49880G43623l741m514n428n736n600n455n030l916k589j869j694j310m12P32K026
$$ 743623 739882 735368 729940 724204 718604 713149 708119 704203 701614 699745 698051 696741 696329 697061 699087
49865F99087L534M942N880O663Q000J0015J2096J3546J3969J3281J1827J0157
$$ 699087 702621 707563 713443 720106 728106 738121 750217 763763 777732 791013 802840 812997
49853H12997Q329O001L548K216K462K987K330O44j163l173n936q787j0284j0221
$$ 812997 821326 827327 830875 833091 835553 838540 840870 841514 840351 837178 831242 822455 812171 801950
$$ [...]
##END NTUPLES=NMR SPECTRUM
##END=
