##TITLE=AC1639_CTIAH13372_8569384_D5LupPDOS9
##JCAMPDX= 6.0         $$ Bruker NMR JCAMP-DX V2.0
##DATA TYPE= NMR SPECTRUM
##DATA CLASS= NTUPLES
##ORIGIN= BRUKER
##OWNER= Administrator
$$ 1.72 TOPSPIN		Version 2.1
$$ 2014-04-10 21:02:35.142 -0700  Administrator@X
$$ Compression mode = diff/dup
##.OBSERVE FREQUENCY= 400.02188249412
##.OBSERVE NUCLEUS= ^1H
##.ACQUISITION MODE= SIMULTANEOUS (DQD)
##.ACQUISITION SCHEME= undefined
##.AVERAGES= 8
##.DIGITISER RES= 22
##SPECTROMETER/DATA SYSTEM= spect
##.PULSE SEQUENCE= zg30
##.SOLVENT NAME= COFFEE_meoh
##.SHIFT REFERENCE= INTERNAL, COFFEE_meoh, 1, 14.98509
##AUDIT TRAIL= $$ (NUMBER, WHEN, WHO, WHERE, PROCESS, VERSION, WHAT)
$$ ##TITLE= Audit trail, TOPSPIN		Version 2.1
$$ ##JCAMPDX= 5.01
$$ ##ORIGIN= Bruker BioSpin GmbH
$$ ##OWNER= Administrator
$$ $$ E:\/data/COFFEE/nmr/AC1639_CTIAH13372_8569384_D5LupPDOS9/10/pdata/1/auditp.txt
$$ ##AUDIT TRAIL=  $$ (NUMBER, WHEN, WHO, WHERE, PROCESS, VERSION, WHAT)
(   1,<2014-04-10 21:02:27.299 -0700>,<Administrator>,<X>,<go>,<TOPSPIN 2.1>,
      <created by zg
	started at 2014-04-10 21:01:21.611 -0700,
	POWCHK enabled, PULCHK disabled,
       configuration hash MD5:
       C8 4E 4E 5D D3 5C D8 9E 9F 52 82 E0 59 8A DE 15
       data hash MD5: 64K
       3E CC 8A 88 09 E4 91 E0 7C E3 AB E7 B9 5E DE D7>)
(   2,<2014-04-10 21:02:30.830 -0700>,<Administrator>,<X>,<proc1d>,<TOPSPIN 2.1>,
      <Start of raw data processing
       efp LB = 0 FT_mod = 6 PKNL = 1 PHC0 = 0 PHC1 = 0 SI = 32K 
       data hash MD5: 32K
       AD FE E3 76 45 2D 11 17 F0 27 8D B2 39 35 29 EF>)
(   3,<2014-04-10 21:02:31.220 -0700>,<Administrator>,<X>,<proc1d>,<TOPSPIN 2.1>,
      <pk PHC0 = 96.1908 PHC1 = 0 
       data hash MD5: 32K
       D0 4A A9 C6 CB 85 F2 11 9D 33 31 43 55 17 03 D4>)
(   4,<2014-04-10 21:02:31.486 -0700>,<Administrator>,<X>,<proc1d>,<TOPSPIN 2.1>,
      <abs ABSG = 1 
       data hash MD5: 32K
       C0 05 A4 9A 5C DA 02 05 D3 1A BC 69 79 CB 75 99>)
(   5,<2014-04-10 21:02:31.674 -0700>,<Administrator>,<X>,<proc1d>,<TOPSPIN 2.1>,
      <abs ABSG = 2 
       data hash MD5: 32K
       46 B0 24 8E D2 1E E1 5A F5 E7 57 2A FF 7F 20 C5>)
(   6,<2014-04-10 21:02:31.861 -0700>,<Administrator>,<X>,<proc1d>,<TOPSPIN 2.1>,
      <abs ABSG = 3 
       data hash MD5: 32K
       A8 B1 99 77 CC 66 79 C1 C1 1C 00 5E 7B AA 35 94>)
(   7,<2014-04-10 21:02:31.924 -0700>,<Administrator>,<X>,<proc1d>,<TOPSPIN 2.1>,
      <abs ABSG = 4 
       data hash MD5: 32K
       62 62 A1 3F 59 BC B0 08 F6 74 89 57 A9 A5 A3 94>)
(   8,<2014-04-10 21:02:32.049 -0700>,<Administrator>,<X>,<proc1d>,<TOPSPIN 2.1>,
      <abs ABSG = 5 
       data hash MD5: 32K
       B3 94 D0 8A B5 53 73 ED A2 C0 CB 6D F1 54 27 A9>)
$$ ##END=
$$ 
$$ $$ hash MD5
$$ $$ DC 0E 03 8B A3 27 D8 85 5D ED 2C 09 AD 47 08 44
##$RELAX= 
##$RELAX= 
##$RELAX= 
##$RELAX= 
##$RELAX= 
##$RELAX= 
##$RELAX= 
$$ Bruker specific parameters
$$ --------------------------
##$DU= <E:\>
##$EXPNO= 10
##$NAME= <AC1639_CTIAH13372_8569384_D5LupPDOS9>
$$ [...]
##$TP= (0..7)
150 150 150 150 150 150 150 150
##$TP07= 0
##$TPNAME0= <>
##$TPNAME1= <>
##$TPNAME2= <>
##$TPNAME3= <>
##$TPNAME4= <>
##$TPNAME5= <>
##$TPNAME6= <>
##$TPNAME7= <>
##$TPOAL= (0..7)
0.5 0.5 0.5 0.5 0.5 0.5 0.5 0.5
##$TPOFFS= (0..7)
0 0 0 0 0 0 0 0
##$TUNHIN= 0
##$TUNHOUT= 0
##$TUNXOUT= 0
##$USERA1= <user>
##$USERA2= <user>
##$USERA3= <user>
##$USERA4= <user>
##$USERA5= <user>
##$V9= 5
##$VALIST= <valist>
##$VCLIST= <CCCCCCCCCCCCCCC>
##$VD= 0
##$VDLIST= <DDDDDDDDDDDDDDD>
##$VPLIST= <PPPPPPPPPPPPPPP>
##$VTLIST= <TTTTTTTTTTTTTTT>
##$WBST= 1024
##$WBSW= 4
##$XGAIN= (0..3)
0 0 0 0
##$XL= 0
##$YL= 0
##$YMAX_a= 620674
##$YMIN_a= -527181
##$ZGOPTNS= <>
##$ZL1= 120
##$ZL2= 120
##$ZL3= 120
##$ZL4= 120
##$ABSF1= 14.98509
##$ABSF2= -5.573092
##$ABSG= 5
##$ABSL= 3
##$ALPHA= 0
##$AQORDER= 0
##$ASSFAC= 0
##$ASSFACI= 0
##$ASSFACX= 0
##$ASSWID= 0
##$AUNMP= <proc_prof1d_extract_pilot.lims>
##$AXLEFT= 0
##$AXNAME= <>
##$AXNUC= <1H>
##$AXRIGHT= 0
##$AXTYPE= 0
##$AXUNIT= <>
##$AZFE= 0.1
##$AZFW= 0.1
##$BCFW= 0
##$BC_mod= 0
##$BYTORDP= 0
##$COROFFS= 0
##$CY= 15
##$DATMOD= 1
##$DC= 0
##$DFILT= <>
##$DTYPP= 0
##$F1P= 0
##$F2P= 0
##$FCOR= 0.5
##$FTSIZE= 32768
##$FT_mod= 6
##$GAMMA= 0
##$GB= 0
##$INTBC= 1
##$INTSCL= 1
##$ISEN= 128
##$LB= 0
##$LEV0= 0
##$LPBIN= 0
##$MAXI= 10000
##$MC2= 0
##$MEAN= 0
##$ME_mod= 0
##$MI= 0
##$NCOEF= 0
##$NC_proc= -8
##$NLEV= 6
##$NOISF1= 0
##$NOISF2= 0
##$NSP= 0
##$NTH_PI= 0
##$NZP= 0
##$OFFSET= 14.98509
##$PC= 1
##$PHC0= 96.1908
##$PHC1= 0
##$PH_mod= 1
##$PKNL= yes
##$PPARMOD= 0
##$PPDIAG= 0
##$PPIPTYP= 0
##$PPMPNUM= 2147483647
##$PPRESOL= 1
##$PSCAL= 4
##$PSIGN= 0
##$PYNMP= <proc.py>
##$REVERSE= no
##$SF= 400.02
##$SI= 32768
##$SIGF1= 0
##$SIGF2= 0
##$SINO= 400
##$SIOLD= 32768
##$SPECTYP= <>
##$SREGLST= <1H.CDCl3>
##$SSB= 0
##$STSI= 32768
##$STSR= 0
##$SW_p= 8223.68421052631
##$SYMM= 0
##$S_DEV= 0
##$TDeff= 65536
##$TDoff= 0
##$TI= <>
##$TILT= no
##$TM1= 0
##$TM2= 0
##$TOPLEV= 0
##$USERP1= <user>
##$USERP2= <user>
##$USERP3= <user>
##$USERP4= <user>
##$USERP5= <user>
##$WDW= 1
##$XDIM= 32768
##$YMAX_p= 448262394
##$YMIN_p= -884344
##$CURPLOT= <Network HP LaserJet P1505>
##$CURPRIN= <$Network HP LaserJet P1505>
##$DFORMAT= <normdp>
##$LAYOUT= <+/1D_H.xwp>
##$LFORMAT= <normlp>
##$PFORMAT= <normpl>
##$SURQMSG= 1
$$ End of Bruker specific parameters
$$ ---------------------------------
##NTUPLES= NMR SPECTRUM
##VAR_NAME=  FREQUENCY,     SPECTRUM/REAL,   SPECTRUM/IMAG
##SYMBOL=    X,             R,               I
##VAR_TYPE=  INDEPENDENT,   DEPENDENT,       DEPENDENT
##VAR_FORM=  AFFN,          ASDF,            ASDF
##VAR_DIM=   32768,         32768,           32768
##UNITS=     HZ,            ARBITRARY UNITS, ARBITRARY UNITS
##FACTOR=    0.250966925370066, 1,           1
##FIRST=     8223.43324360094, 161737,       -99031
##LAST=      0,             -163691,         -179985
##MIN=       0,             -884344,         0
##MAX=       8223.43324360094, 448262394,    0
$$ Real data points
##PAGE= N=1
##DATA TABLE= (X++(R..R)), XYDATA
$$ [...]
19551A59440e0225j8904Q15D3090a18507L4884C7935N8741d0951j75230m2153
$$ 159440 -50225 -69129 -68314 43090 -118507 -83623 37935 96676 -40951 -216181 -258334
19540b58334O1765A54359J7427p5238a26655l63821K05702h2952p2994B18577
$$ -258334 -196569 154359 171786 96548 -126655 -490476 -284774 -82952 -155946 218577
19529d0555A61155D1441e5733q9080A52661C0930d9960B00288D3165b68969A16857
$$ -40555 161155 41441 -55733 -144813 152661 30930 -49960 200288 43165 -268969 116857
19517B04189b53131N1124a00585k23995a9379B62232i89B92596a02579J5816l9122
$$ 204189 -253131 -202007 -100585 -324580 -19379 262232 -989 292596 -102579 -86763 -125885
19506a25885j48417C236R3929D642a81972E8758d9318l0585A47416i2822E7603
$$ -125885 -274302 3236 97165 4642 -181972 58758 -49318 -79903 147416 -92822 57603
19494d203A71630l0954a83426D23009C8945a74092B48517H4591f477j4792j78368
$$ -4203 171630 140676 -183426 423009 38945 -174092 248517 84591 -6477 -21269 -199637
19483a99637j33904P9354J03863A30110n442a51925a4982j33489j44195A96947
$$ -199637 -333541 -254187 -150324 130110 124668 -151925 -14982 -148471 -292666 196947
19472b72983J35657A89957a68158f0367A15146M7770h2551r1231N3806K2937j92248
$$ -272983 -137326 189957 -168158 -60367 115146 162916 -82551 -173782 -119976 -97039 -289287
19461b89287a09667A52419a22898k01549H7067A7664O2701P8078f9199E2638b20500
$$ -289287 -109667 152419 -122898 -324447 87067 17664 80365 158443 -69199 52638 -220500
19449D4464A5606b53469J09946m610l78165A47272a57108A69250a44452A27174
$$ 44464 15606 -253469 -143523 -148133 -526298 147272 -157108 169250 -144452 127174
19438c78477e8778A55297B2924K69735G9356J25939A01038b71265O2599H5615
$$ -378477 -58778 155297 22924 292659 79356 205295 101038 -271265 -208666 85615
19427b13731k1943A09113c8901l2718q0901o5128k42209a64130B12298a03921
$$ -213731 -235674 109113 -38901 -71619 -152520 -217648 -459857 -164130 212298 -103921
19416a77799A30561d2922C2474N064g5864A12247J4130a65852Q1615l024C7153
$$ -177799 130561 -42922 32474 37538 -75864 112247 126377 -165852 -84237 -87261 37153
19404A56758c6103H9795O9790a53272j09683Q7888j32940J7750B2730R176a40353
$$ 156758 -36103 89795 159585 -153272 -262955 -175067 -308007 -290257 22730 31906 -140353
19392G9758b71342E378c73165a36709A64022e874m29F8443J6610a68122B63968
$$ 79758 -271342 5378 -373165 -136709 164022 -5874 -6303 68443 85053 -168122 263968
19380C42172q9837c22359J13111j72616E2688h2854j43732M0097P7944j13275
$$ 342172 252335 -322359 -209248 -381864 52688 -82854 -226586 -186489 -108545 -221820
19370b21820a0982n2300j86207J22910K7454j09889g2390l74619Q3589A09908
$$ -221820 -10982 -63282 -249489 -126579 -99125 -209014 -72390 -447009 -363420 109908
19359a37901c3193m9050j922A52021I613L0067a49616d7927k16851M033f9742
$$ -137901 -33193 -82243 -84165 152021 9613 39680 -149616 -47927 -264778 -260745 -69742
19347G8475K6010c87397C7645a25431k9371J984n0365P9431d3232e41j7436l4539
$$ 78475 104485 -387397 37645 -125431 -154802 -152818 -203183 -123752 -43232 -541 -17977 -52516
19335e2516A33450L0491a9100j29451q9977F8223c02993C1263a24064F139a01495
$$ -52516 133450 163941 -19100 -148551 -238528 68223 -302993 31263 -124064 6139 -101495
19323C8728g2839a4431D6187a10366j80963J26719a6007j29792j3188C7994K8997
$$ 38728 -72839 -14431 46187 -110366 -291329 -164610 -16007 -145799 -158987 37994 66991
19312F6991a29325j94261A7423a59983Q326E2558a51006l7881n1471e717A87384
$$ 66991 -129325 -323586 17423 -159983 -151657 52558 -151006 -188887 -240358 -5717 187384
19300a24979H2535a02898k60131A05017a81089B5853a47321o0024g465n4664a920
$$ -124979 82535 -102898 -363029 105017 -181089 25853 -147321 -207345 -7465 -62129 -1920
19288A09548b55035d7713j6629b9364F6931b23945J04385I0747b09555b1094h889
$$ 109548 -255035 -47713 -64342 -29364 66931 -223945 -119560 90747 -209555 -21094 -8889
19276g3019j60887B15746a06459f34j90809K8246H1647A8911a76234A41810j7518
$$ -73019 -233906 215746 -106459 -634 -191443 -163197 81647 18911 -176234 141810 124292
19265A24292c7208A10695l6158a10625A48064a83548d5013o0815A12541F630i3882
$$ 124292 -37208 110695 74537 -110625 148064 -183548 -45013 -105828 112541 6630 -93882
19253b8137l8185p2592j04267R6021G1773b92491A76367A0131L3628j1429a43994
$$ -28137 -66322 -138914 -243181 -147160 71773 -292491 176367 10131 43759 32330 -143994
19241a46634p9449E6535b55484c4441j31162A24236h9548C79314A38440m9905
$$ -146634 -226083 56535 -255484 -34441 -165603 124236 -89548 379314 138440 88535
19231H8535a03031A8965a29410B34739q3370l6708a72506b9916m1820n1378L4704
$$ 88535 -103031 18965 -129410 234739 151369 114661 -172506 -29916 -71736 -123114 -88410
19220h8410B3670a39438A83958E4708j2661b07581J5103G2515a83236j07067a20469
$$ -88410 23670 -139438 183958 54708 42047 -207581 -192478 72515 -183236 -290303 -120469
19208a53698g2441A01406K01999a95013K278L7436k2388j43107a19830C8367a28577
$$ -153698 -72441 101406 303405 -195013 -192735 -155299 -177687 -320794 -119830 38367 -128577
19196b90172A51340D3077a11022a6820j86314a0083j02836B5157a04569A77568
$$ -290172 151340 43077 -111022 -16820 -203134 -10083 -112919 25157 -104569 177568
19185B3368N0290b79739A68314A0761L08947N4606G2115a74809H2281J67925a56758
$$ 23368 73658 -279739 168314 10761 319708 374314 72115 -174809 82281 250206 -156758
19173b35691c9953k02680F665i0697b0524k13661F1702e83267A28404f4294k51591
$$ -235691 -39953 -242633 6665 -90697 -20524 -234185 61702 -583267 128404 -64294 -315885
19162c15885G1115a88908C1244a37688a2242A27284B4820J26276B7327K9175a29933
$$ -315885 71115 -188908 31244 -137688 -12242 127284 24820 151096 27327 56502 -129933
19150b48081a06619j6847A583a62528D4957a15580C02980a2290o13667b32519
$$ -248081 -106619 -123466 1583 -162528 44957 -115580 302980 -12290 -625957 -232519
19139b53572F4689c7291B33738F439l59a67859p5411c4555k9065m9142b3253o7786
$$ -253572 64689 -37291 233738 6439 6080 -167859 -243270 -34555 -63620 -112762 -23253 -91039
19127i1039j3530M721j33817A13252H446a77964B70631I4910b94122a8638j53484
$$ -91039 -104569 -99848 -233665 113252 8446 -177964 270631 94910 -294122 -18638 -172122
19116a72122O4853m7697H0071C7954J79901r7919C7635c66134A6674C717a07522
$$ -172122 -107269 -154966 80071 37954 217855 119936 37635 -366134 16674 3717 -107522
19104i1771j17814A66898b16335c1278F2075a89181k8009g2527J704Q037j12748
$$ -91771 -209585 166898 -216335 -31278 62075 -189181 -217190 -72527 -70823 -62786 -175534
19093a75534j05146B17503c89651h5722D9182d02599n0292g1494K9305j27211
$$ -175534 -280680 217503 -389651 -85722 49182 -402599 -452891 -71494 -42189 -169400
19083a69400A78374b51051Q2841A68331e8680p0946r247j71346a03333j0461b158
$$ -169400 178374 -251051 -168210 168331 -58680 -129626 -138873 -310219 -103333 -113794 -2158
19071g9260r4063c1602k32177j69219j815A61598c597m40497C310g9178i870k89352
$$ -79260 -173323 -31602 -263779 -432998 -434813 161598 -3597 -444094 3310 -79178 -9870 -299222
19059b99222A88669c50608a02296D2374h2968B42959i9126D4503F266a23868C593
$$ -299222 188669 -350608 -102296 42374 -82968 242959 -99126 44503 6266 -123868 3593
19047c87997f1154A64663a31798C9080J79489n5424b96545f1230k33277A93852
$$ -387997 -61154 164663 -131798 39080 218569 163145 -296545 -61230 -294507 193852
19036e7941B16232a79400B54348c8121A36023a9875B65396a09661A97764J60405
$$ -57941 216232 -179400 254348 -38121 136023 -19875 265396 -109661 197764 358169
19026C58169b27240j38465j6593a77121Q5803K901g957H6983a15265B73010A34491
$$ 358169 -227240 -365705 -382298 -177121 -91318 -88417 -7957 86983 -115265 273010 134491
19014A06031f513A39361c40443E8617b71482a27087A13392b92265F2313i680A46211
$$ 106031 -6513 139361 -340443 58617 -271482 -127087 113392 -292265 62313 -9680 146211
19002B64029a67757F1846b05735E1227j7230h8157j55089k2666c4491o1661A78291
$$ 264029 -167757 61846 -205735 51227 33997 -88157 -243246 -265912 -34491 -96152 178291
18990A05936c09326A70322F3724K07622n3187e4599j86843h2858B00012I6656
$$ 105936 -309326 170322 63724 271346 218159 -54599 -241442 -82858 200012 96656
18979a64146A13535b07872O4632c3519A04499a10760j90851C657b71565C44100
$$ -164146 113535 -207872 -143240 -33519 104499 -110760 -301611 3657 -271565 344100
18968A27065e683q8557r2351A61104i2719l46113d8566k96774b8210p7695C23889
$$ 127065 -5683 -94240 -186591 161104 -92719 -438832 -48566 -345340 -28210 -105905 323889
18956H2161C8837K3546a30302M8519n9212A20874b72043o8665J37043D3036b23490
$$ 82161 38837 62383 -130302 -81783 -140995 120874 -272043 -340708 -203665 43036 -223490
18944a73232I395d8961F7111c5635A2261b48704D6040K11243a19944C7511A3032
$$ -173232 9395 -48961 67111 -35635 12261 -248704 46040 257283 -119944 37511 13032
18932E8483J48096a7082o2881k65458f7896K0265p7104N7406A12704a16512m8620
$$ 58483 206579 -17082 -79963 -345421 -67896 -47631 -124735 -67329 112704 -116512 -165132
18921a65132f1847j06966j18675a20518A44246k8624m6129b16815A96137d71506
$$ -165132 -61847 -168813 -287488 -120518 144246 115622 69493 -216815 196137 -471506
18910A82557b03024A79565a45290I1009b08348B27582f7290B6988a39040n6629
$$ 182557 -203024 179565 -145290 91009 -208348 227582 -67290 26988 -139040 -195669
18900a95669f2715A4728i0063a9819r0390j87619a36432M2467A62124B8777h8685
$$ -195669 -62715 14728 -90063 -19819 -110209 -297828 -136432 -93965 162124 28777 -88685
18888f38641D2131g8302K6585A44816h3749H9236b00867J7095D479J93141d03889
$$ -638641 42131 -78302 -51717 144816 -83749 89236 -200867 -183772 4479 197620 -403889
18876A2173b80405b4415N675j39599B41557c97431f7895r2116B63853G3945b77537
$$ 12173 -280405 -24415 -18740 -158339 241557 -397431 -67895 -160011 263853 73945 -277537
18864b50856e9320C01692I3588a50710M1925I2910D890M9854a18418l04391a4633
$$ -250856 -59320 301692 93588 -150710 -108785 92910 4890 54744 -118418 -422809 -14633
18852g2189G2590R0511k794J7783R3218a23588b4297B42769Q7979H9484b25410
$$ -72189 72590 163101 160307 178090 271308 -123588 -24297 242769 330748 89484 -225410
18840F2965a79453f2543F5551b5903f027r2273j51121l0685A2820f6386l9950
$$ 62965 -179453 -62543 65551 -25903 -6027 -98300 -249421 -280106 12820 -66386 -106336
18829a06336B77583b11902F394b10537b7432A15443a10456r6915A82025a65935
$$ -106336 277583 -211902 6394 -210537 -27432 115443 -110456 -207371 182025 -165935
18818c5528j45059j72312C475e18388B32514A00831N4817Q112a64231B70781a13537
$$ -35528 -180587 -352899 3475 -518388 232514 100831 155648 163760 -164231 270781 -113537
18806f4493B35933L4420a52573H8909b1720j61393G2952f0751H506J26140i8503
$$ -64493 235933 270353 -152573 88909 -21720 -183113 72952 -60751 8506 134646 -98503
18794A05931c70252a19097N5544A35193h5760I027b76755J1995e3508o8009k09349
$$ 105931 -370252 -119097 -63553 135193 -85760 9027 -276755 -264760 -53508 -121517 -330866
18783c30866B35640b35992i1449B32322G7891K37692c18926F1595l444q678R389
$$ -330866 235640 -235992 -91449 232322 77891 315583 -318926 61595 58151 49473 58862
18772E8862e6607r86j12419o5524h6547j08030j00980A89417d27093a66639P3581
$$ 58862 -56607 -57593 -170012 -235536 -86547 -194577 -295557 189417 -427093 -166639 -93058
18761i3058c2926A23395N8155a01001B2861J8347g3683A56821c71253d9462D6726
$$ -93058 -32926 123395 181550 -101001 22861 41208 -73683 156821 -371253 -49462 46726
18749f3831D7538d22640A34263o1386O4628R7009l9786j3a74850b0494p9528A01324
$$ -63831 47538 -422640 134263 72877 137505 234514 194728 194715 -174850 -20494 -100022 101324
18736A41310F9650a03533A13153a04047A02522b55512c1734j49033f1958F8271
$$ 141310 69650 -103533 113153 -104047 102522 -255512 -31734 -180767 -61958 68271
18725B44422c73505P5106G3046b14240A07301a49085j21368a01320j92141J11289
$$ 244422 -373505 -298399 73046 -214240 107301 -149085 -270453 -101320 -293461 -182172
18715a82172j51149B66238b51858J23960A20703a29277C20424D8419a24061a3990
$$ -182172 -333321 266238 -251858 -127898 120703 -129277 320424 48419 -124061 -13990
18704A20684E3235a33767E9703b30159q3616a30007r380k07182a68485D0868a29374
$$ 120684 53235 -133767 59703 -230159 -313775 -130007 -139387 -346569 -168485 40868 -129374
18692a68558j1859G3318j0792J02587P334b33150f4602j3800A75437H5428C1395
$$ -168558 -180417 73318 62526 165113 172447 -233150 -64602 -78402 175437 85428 31395
18680c49460r700a15428e517E8818c9474G1891g4757p1797A09444c82695i8199
$$ -349460 -359160 -115428 -5517 58818 -39474 71891 -74757 -146554 109444 -382695 -98199
18668f2775j76116A1589K40681g6541B4540r424J56338b97263B31243a93637A04457
$$ -62775 -238891 11589 252270 -76541 24540 15116 171454 -297263 231243 -193637 104457
18656a65561L4829j79374f4777k99749J73846A80826c13542A41079F9380R4694
$$ -165561 -130732 -310106 -64777 -364526 -190680 180826 -313542 141079 69380 164074
18646A64074L4666a51444K4374o7934C7216c0935G5343a64092f105j44844L3864
$$ 164074 198740 -151444 -127070 -195004 37216 -30935 75343 -164092 -6105 -150949 -117085
18635a17085H9089D1660j7684b47831r153a0000H9243b91761K7502M0409L3545
$$ -117085 89089 41660 23976 -247831 -256984 -10000 89243 -291761 -264259 -223850 -190305
18624a90305j16409A06785k8730L3853j4218J29991b39914i0C5253e2859a3519
$$ -190305 -306714 106785 78055 111908 97690 227681 -239914 -90 35253 -52859 -13519
18612d2868n17725K00017b4664j36788L9945e5206j06545A86201a11159H6641
$$ -42868 -560593 -360576 -24664 -161452 -121507 -55206 -161751 186201 -111159 86641
18601a5167k18004k32117a16813D1287J53643d40005c5768j76905A26679a57293
$$ -15167 -233171 -465288 -116813 41287 194930 -440005 -35768 -212673 126679 -157293
18590C0027R7023J70981G9709b98710d2198j14870n0360Q5800D4399p000h3819
$$ 30027 127050 298031 79709 -298710 -42198 -157068 -207428 -121628 44399 37399 -83819
18578B47310k2315a57322k64615A305a35241p1792F4695c86212A68995p6148a14364
$$ 247310 224995 -157322 -421937 1305 -135241 -207033 64695 -386212 168995 92847 -114364
18566a17768K3127k50058a30871O1017r3384k53718d5915k5516A25833e4754j9454
$$ -117768 -94641 -344699 -130871 -69854 -163238 -416956 -45915 -71431 125833 -54754 -74208
18555g4208H0473f6817j1020B03454a27769a2723F9258e0711p2821r555G2353
$$ -74208 80473 -66817 -77837 203454 -127769 -12723 69258 -50711 -123532 -133087 72353
18543a98816Q6148R820A7010O7324i2315C7942c36819d0013B3755c57760B77303
$$ -198816 -112668 -102848 17010 84334 -92315 37942 -336819 -40013 23755 -357760 277303
18531e7833j36242g1074k200k48550a43542l36901a1776B55173b49696i7190o5287
$$ -57833 -194075 -71074 -73274 -321824 -143542 -480443 -11776 255173 -249696 -97190 -162477
18520a62477a0395F8042B8312b35260A88922q8068P6126f6217n1527k97621A57899
$$ -162477 -10395 68042 28312 -235260 188922 100854 176980 -66217 -117744 -415365 157899
18508b31149D2411b240j21422A13259l5341K7950a86568A1759K202a47116j93452
$$ -231149 42411 -2240 -123662 113259 77918 105868 -186568 11759 13961 -147116 -340568
18497c40568B1060L04724A2301a58373I8131O7492c13857f4873j06688M0078D19599
$$ -340568 21060 325784 12301 -158373 98131 165623 -313857 -64873 -171561 -131483 419599
18485a31244A11033d4828r6055c4689E8501f0831m6571j28752A03459a20169q5305
$$ -131244 111033 -44828 -140883 -34689 58501 -60831 -107402 -236154 103459 -120169 -205474
18474b05474C8780a50889I9939R3883b09075B06004a68378g2320k06092g9283
$$ -205474 38780 -150889 99939 193822 -209075 206004 -168378 -72320 -278412 -79283
18463b63283a21724j15249p1123h1589c8513H1112d0422D14051F2815i9957A9469
$$ -263283 -121724 -236973 -308096 -81589 -38513 81112 -40422 414051 62815 -99957 19469
18451a30215I7221L13768b48666f8343k91948A18477a43904a2523p09867E9028
$$ -130215 97221 410989 -248666 -68343 -360291 118477 -143904 -12523 -722390 59028
18440b99181b7159D0791a60413P086B42556b37748B26181B4177c20053J21990
$$ -299181 -27159 40791 -160413 -153327 242556 -237748 226181 24177 -320053 -198063
18430a98063e9638Q650G961i3065C33689A51142b6459l5783j14999G4365a28200
$$ -198063 -59638 -50988 7961 -93065 333689 151142 -26459 -62242 -177241 74365 -128200
18418C1767f1723A99109F0797b02461C4013d9925B21367E5844h4738A11822E3417
$$ 31767 -61723 199109 60797 -202461 34013 -49925 221367 55844 -84738 111822 53417
18406h8625A51957M29c5742o02D07477j57281H418P7703e99162A25232a85238
$$ -88625 151957 152386 -35742 -36344 407477 250196 8418 86121 -599162 125232 -185238
18394b10535P2003I6029m4566K30251a69278A54794b65029C21847a98640C32946
$$ -210535 -138532 96029 51463 281714 -169278 154794 -265029 321847 -198640 332946
18383d36189K04284e8768G5420L1937f5012q6348C1324L7880A0501J52965N3564
$$ -436189 -231905 -58768 75420 107357 -65012 -151360 31324 69204 10501 163466 217030
18372B17030a33633a6453B1069j0089K60638F0453L36345d71553a08809I1037
$$ 217030 -133633 -16453 21069 10980 271618 60453 396798 -471553 -108809 91037
18361e9088m9033C43381A43003K5928d9701H4668a3639k28226A50303a53874j00192
$$ -59088 -108121 343381 143003 168931 -49701 84668 -13639 -241865 150303 -153874 -254066
18350b54066j90437A71515n9511a6858m8368A77360b23468C7054K06330b32417
$$ -254066 -444503 171515 112004 -16858 -65226 177360 -223468 37054 243384 -232417
18339c63107d3492F4033b74676A16806b8065k62834J31068A5110K41471E2294
$$ -363107 -43492 64033 -274676 116806 -28065 -290899 -159831 15110 256581 52294
18328a14829m733l6054A64446i0210E4373a07617b7701j20026P0942q043o3374
$$ -114829 -119562 -155616 164446 -90210 54373 -107617 -27701 -147727 -76785 -84828 -148202
18317a48202A22162M6778D8679a84220k7762K5116n4670e5295A24406a62721r4099
$$ -148202 122162 168940 48679 -184220 -211982 -186866 -241536 -55295 124406 -162721 -256820
18306b56820A21843d33867E1431Q0637a93507H0030a03127G3741b02472J5549
$$ -256820 121843 -433867 51431 132068 -193507 80030 -103127 73741 -202472 -186923
18296a86923h8614A63490b61100f6941A56773B9342a06663H6334c8441o4649r1310
$$ -186923 -88614 163490 -261100 -66941 156773 29342 -106663 86334 -38441 -103090 -194400
18285a94400b646H3959k2633a12083K3771A79350c4473j22035o2951h3351B02111
$$ -194400 -2646 83959 61326 -112083 -88312 179350 -34473 -156508 -219459 -83351 202111
18273C9675O4499a02753k29010h4846A3455b02256m6647c1129A60549b97268a28094
$$ 39675 104174 -102753 -331763 -84846 13455 -202256 -248903 -31129 160549 -297268 -128094
18261a9598n0569C5506J20077a40156A0797a32277j3628n1319f3205C15659a03110
$$ -19598 -70167 35506 155583 -140156 10797 -132277 -145905 -197224 -63205 315659 -103110
18249a92013B85653D6444e5981F2693N661g2414C14775d8547A17668b25201G570
$$ -192013 285653 46444 -55981 62693 68354 -72414 314775 -48547 117668 -225201 7570
18237A0084f038A43122c748A10808a93916E7210b0592A98839c50519n7964a96732
$$ 10084 -6038 143122 -3748 110808 -193916 57210 -20592 198839 -350519 -408483 -196732
18225e7723k39328j13258h4877A88838h1906E6597g1601m27222a83319o566g2552
$$ -57723 -297051 -410309 -84877 188838 -81906 56597 -71601 -498823 -183319 -189885 -72552
18213c4103m54m74368J45474k3536J66575A67252b73023R7529A2517M1447B4857
$$ -34103 -34557 -508925 -363451 -386987 -220412 167252 -273023 -175494 12517 53964 24857
18201b03301A3864c36721H7212c11839A22008A0452b2368B41755n152c8135o9494
$$ -203301 13864 -336721 87212 -311839 122008 10452 -22368 241755 236603 -38135 -107629
18190a07629D0107a37869A0280c08673R6400A46944b68815C10913a47542f534
$$ -107629 40107 -137869 10280 -308673 -212273 146944 -268815 310913 -147542 -6534
18179d7932j7770l9093d1184l09726J70707f7691A50814a13235I7465c04385f4426
$$ -47932 -65702 -104795 -41184 -350910 -180203 -67691 150814 -113235 97465 -304385 -64426
18167b3470B47050h7025J0805L0087I0700D3522J28333c6826k52202n2565B27642
$$ -23470 247050 -87025 -76220 -46133 90700 43522 171855 -36826 -289028 -341593 227642
18155E1517J45543a02862A0326b77989C9896c86028F0973a17315J8125k00192
$$ 51517 197060 -102862 10326 -277989 39896 -386028 60973 -117315 -99190 -299382
18145b99382a40638a9032m56468g7507L5544m5970B34839H4193a27851f0024C33994
$$ -299382 -140638 -19032 -475500 -77507 -41963 -87933 234839 84193 -127851 -60024 333994
18133a49882G8114M8709b13246R309M6932C9326b13306d7937l0857B8534b31633
$$ -149882 78114 126823 -213246 -203937 -157005 39326 -213306 -47937 -78794 28534 -231633
18121F9479B0412a34665j99137p1256i3606j18835P4253p3776B41654A04483J97743
$$ 69479 20412 -134665 -333802 -405058 -93606 -212441 -138188 -211964 241654 104483 302226
18110C02226j19295b40646j63272A19529L3574c7311l47185G9079C716i2987K9968
$$ 302226 182931 -240646 -403918 119529 153103 -37311 -384496 79079 3716 -92987 -63019
18099f3019C9505c2696j41172A33670l3303b09887B79516A2615g6209j14733p2628
$$ -63019 39505 -32696 -173868 133670 100367 -209887 279516 12615 -76209 -190942 -263570
18088b63570B10421G206K53569b0025l7147l75571h426B23095j02777K4849b72054
$$ -263570 210421 7206 260775 -20025 -57172 -432743 -8426 223095 120318 145167 -272054
18076b3977A61125c52121a10363A7071b18966D5848a4193k26746Q6311q1007a8818
$$ -23977 161125 -352121 -110363 17071 -218966 45848 -14193 -240939 -154628 -235635 -18818
18064h5879C535f6696k85181a01015k56615A12098a04047p7226f5433G9732a16003
$$ -85879 3535 -66696 -351877 -101015 -357630 112098 -104047 -181273 -65433 79732 -116003
18052c14277N1836A801L9743b82328b8251j7343A95776o0563J05704j11340g48910
$$ -314277 -262441 1801 41544 -282328 -28251 -45594 195776 135213 240917 129577 -748910
18040e8503b6955a1702n1930Q501j02241I7641b01297E0152b67965B57253G956
$$ -58503 -26955 -11702 -63632 -55131 -157372 97641 -201297 50152 -267965 257253 7956
18028B46131b7062C32070j35076f1761A26779a14818d423B55508b51683G3728
$$ 246131 -27062 332070 196994 -61761 126779 -114818 -4423 255508 -251683 73728
18017D2250M0150c62468B05359a70822n5592b827B18047g7784B48844C8901h1614
$$ 42250 82400 -362468 205359 -170822 -226414 -2827 218047 -77784 248844 38901 -81614
18005a60925B33354b84324J08099H8646b7135B78519J06421C1594g610k54909
$$ -160925 233354 -284324 -176225 88646 -27135 278519 384940 31594 -7610 -262519
17995b62519A04406C3608a60575M0936C30239a48016A23803m6523b27774F30a29641
$$ -262519 104406 33608 -160575 -119639 330239 -148016 123803 77280 -227774 630 -129641
17983A15128k6109c3461k21710b0044B45902A08577O851a65273o4550A87649e6554
$$ 115128 89019 -33461 -255171 -20044 245902 108577 115428 -165273 -229823 187649 -56554
17971B35729a99227A95862o8821K1320B5120b57997i0039j47911B07586J9555
$$ 235729 -199227 195862 127041 148361 25120 -257997 -90039 -237950 207586 227141
17961B27141c24491N5213b0690k6951B9447a20457K1196o6585A34591i9077C0329
$$ 227141 -324491 -269278 -20690 -47641 29447 -120457 -99261 -165846 134591 -99077 30329
17949b51554d6646m9260k38491m0923j7611B44694a03814A74996C3321J72632
$$ -251554 -46646 -95906 -334397 -375320 -392931 244694 -103814 174996 33321 205953
17939B05953d3548l1246D1856j4830N4560K7948a00801n8253l4257b7261m9680
$$ 205953 -43548 -74794 41856 27026 81586 109534 -100801 -159054 -193311 -27261 -76941
17928g6941A64862b7206j62492q3023R1864D3238J25950i3442j93925n9285C2593
$$ -76941 164862 -27206 -189698 -272721 -180857 43238 169188 -93442 -287367 -346652 32593
17916a60333C86241A63659c35674D7117a1958D6361e8076C5914c4503C90069c75582
$$ -160333 386241 163659 -335674 47117 -11958 46361 -58076 35914 -34503 390069 -375582
17904e28452A18534b61p7891l22899F5752L305a17806J8730j5174A16496B2353
$$ -528452 118534 -261 -78152 -401051 65752 69057 -117806 -99076 -114250 116496 22353
17892a15817o1351K6182I075J08773a97837B29188a00906j19418A62353J04342
$$ -115817 -177168 -150986 9075 117848 -197837 229188 -100906 -220324 162353 266695
17882B66695j31493b26096e5218B72263N174Q2045E3550K16139I9703g1245k2886
$$ 266695 135202 -226096 -55218 272263 277437 359482 53550 269689 99703 -71245 -94131
17871i4131K6522E5504J66747bj33246M9488C4713c15637a17115e3936A8036J34663
$$ -94131 -67609 55504 222251 -2 -133248 -83760 34713 -315637 -117115 -53936 18036 152699
17859A52699b26990a1433B3292N224J02531h6684L5277B74397C5560J16147A8552
$$ 152699 -226990 -11433 23292 28516 131047 -86684 -51407 274397 35560 151707 18552
17847B97152I4091a98075N6689B15282e6808C7152O444a61742F0304b95164I7328
$$ 297152 94091 -198075 -141386 215282 -56808 37152 43596 -161742 60304 -295164 97328
17835A55646a30220A8275b7972B3072N372L13401m7661I9428a18724B51889b537
$$ 155646 -130220 18275 -27972 23072 28444 341845 294184 99428 -118724 251889 -2537
17823A74336a23779K5581B44490h3748C17286b54432I0549e28293h5650A2046
$$ 174336 -123779 -98198 244490 -83748 317286 -254432 90549 -528293 -85650 12046
17812b8226q432B87292E688J78168e4447j23174E4213f517B05990c79161f9701
$$ -28226 -36658 287292 5688 183856 -54447 -177621 54213 -6517 205990 -379161 -69701
17800b44247d8485j33224c0201n0503F7554A4744b1688B03029N2362b55656a2216
$$ -244247 -48485 -181709 -30201 -80704 67554 14744 -21688 203029 255391 -255656 -12216
17788B21381d33962E4144f5346F8663L42979a1045a792C78469j20988J65250A35646
$$ 221381 -433962 54144 -65346 68663 411642 -11045 -1792 378469 257481 422731 135646
17776b23332A13611n3857a91097K2083A92706A8032a40381O5463A83461g1162
$$ -223332 113611 59754 -191097 -169014 192706 18032 -140381 -74918 183461 -71162
17765A1042f872j11121J6927F8136c7754q4898j46834E6627b9697j76242A75513
$$ 11042 -6872 -117993 -101066 68136 -37754 -122652 -269486 56627 -29697 -205939 175513
17753b05569B3769a30476A65565A7895i6942A14674b66764F1841d4163a0606D01108
$$ -205569 23769 -130476 165565 17895 -96942 114674 -266764 61841 -44163 -10606 401108
17741e2933A30955a39749b7496m5282C12269b64383A34694a89344m3535R4123
$$ -52933 130955 -139749 -27496 -72778 312269 -264383 134694 -189344 -232879 -138756
17731a38756r2905a9475k84916E405N9337c9303j87855A53789O5391F8052J15439
$$ -138756 -231661 -19475 -304391 5405 64742 -39303 -227158 153789 219180 68052 183491
17720A83491H4314d49951I3429J39006b6118A7485e0683k29591J32985A95516
$$ 183491 84314 -449951 93429 232435 -26118 17485 -50683 -280274 -147289 195516
17709a03221L3981m6644a1628A2846N9544d1091A80821b6134j20750A17172f8099
$$ -103221 -69240 -115884 -11628 12846 72390 -41091 180821 -26134 -146884 117172 -68099
17697A05014e2933r520H7948a74115A23629d9353C26956b17648f2746b2513l3270
$$ 105014 -52933 -62453 87948 -174115 123629 -49353 326956 -217648 -62746 -22513 -55783
17686e5783H4378e7344A51896a59583F1470a26064M0801D07564B9570b15983k24356
$$ -55783 84378 -57344 151896 -159583 61470 -126064 -85263 407564 29570 -215983 -440339
17675d40339a41754e5460A6778L50450H7601b73980A14124e7899d115B12371B8428
$$ -440339 -141754 -55460 16778 367228 87601 -273980 114124 -57899 -4115 212371 28428
17663B46782p3425b59935B6612c3476j01403d3583j74165h772m6137A69711a9135
$$ 246782 173357 -259935 26612 -33476 -134879 -43583 -217748 -8772 -54909 169711 -19135
17651a20350C7235a27515c8404A92760c2027l6479j84018J24499D24538a42591
$$ -120350 37235 -127515 -38404 192760 -32027 -68506 -252524 -128025 424538 -142591
17640G2939g0955A56504E86a16923A07039h7640K8331C03501j48572i9254O322
$$ 72939 -70955 156504 586 -116923 107039 -87640 -59309 303501 154929 -99254 -92932
17629i2932m1724k23387A47640a7953j0078I395J38929c620E706a00758B62595
$$ -92932 -134656 -358043 147640 -17953 -28031 9395 148324 -3620 5706 -100758 262595
17617c4997j32972A9019J82607J0088e6234k41257C86424A6746a5361k229A28388
$$ -34997 -167969 19019 201626 211714 -56234 -297491 386424 16746 -15361 -17590 128388
17605f768D34365B2983K58739A2163J40315M3935a66629B66103a7454n4560i048
$$ -6768 434365 22983 281722 12163 152478 196413 -166629 266103 -17454 -72014 -9048
17593A28590E6678N0812l3661a35880j8763J1221B7141c4319j98797l5392G1282
$$ 128590 56678 107490 73829 -135880 -154643 -143422 27141 -34319 -233116 -268508 71282
17581E360g9034B322a06396l9065L1935d8927J8988k34111C22918a65279m3687
$$ 5360 -79034 2322 -106396 -145461 -113526 -48927 -29939 -264050 322918 -165279 -208966
17570b08966c5347J5678A38354K04402k2604e5329B08629b2280j42912g2107C08347
$$ -208966 -35347 -19669 138354 342756 320152 -55329 208629 -22280 -165192 -72107 308347
17558C19200a10811D2679c3743n5381j34267E3801c4102B30664c14145O2856e4602
$$ 319200 -110811 42679 -33743 -89124 -223391 53801 -34102 230664 -314145 -251289 -54602
17546a82229f8073c0662e249B18994b08439A31429Q667A6426c33125q86C49887
$$ -182229 -68073 -30662 -5249 218994 -208439 131429 140096 16426 -333125 -334011 349887
17534A63695E2013A4860K57481j30773c80371C51031I102K5866i9020A0759c8256
$$ 163695 52013 14860 272341 141568 -380371 351031 9102 34968 -99020 10759 -38256
17522C55217H9330J2108P4604B9627J97441a28227A38603i0732C1339N54Q1645
$$ 355217 89330 101438 176042 29627 227068 -128227 138603 -90732 31339 31893 113538
17511A13538N7690B9055i2641A29897K70879a68738A15153J3168n8503J10341
$$ 113538 171228 29055 -92641 129897 400776 -168738 115153 128321 69818 180159
17501A80159K9324B4186M81560A69053j2314a73052A81871q5369a27157A43355
$$ 180159 209483 24186 505746 169053 156739 -173052 181871 96502 -127157 143355
17490I4195b81812C39268a32398C6700N4624K11150k1463a328C48474A45446i4881
$$ 94195 -281812 339268 -132398 36700 91324 302474 281011 -1328 348474 145446 -94881
17478g5841B82593I614J42099n0180J62264D0128K29454K5223C7340h995C9704
$$ -75841 282593 9614 151713 101533 263797 40128 269582 294805 37340 -8995 39704
17466a1230G4282J60322D536K04437o1876e2202A83737K5432a60655K1276D07508
$$ -11230 74282 234604 4536 208973 147097 -52202 183737 209169 -160655 -139379 407508
17454A35909J99181b29427C39591o0776m2049q1686K68400J67469I8432A0955
$$ 135909 335090 -229427 339591 278815 236766 155080 423480 590949 98432 10955
17443I7554L31267r1162C0176K04510j07690K50492j16711l2723p6735J44101
$$ 97554 428821 337659 30176 234686 126996 377488 260777 228054 151319 295420
17433B95420A01064K52456A65653M02305A21731J22599J100J8722M82619C26250
$$ 295420 101064 353520 165653 567958 121731 244330 245430 264152 746771 326250
17422A71692a07652C76184j80507F7839k9680K22972r2098O4175g2382G3637c3258
$$ 171692 -107652 376184 195677 67839 38159 261131 169033 233208 -72382 73637 -33258
17410A47570P2243R5858e2006G823K21566q4240E8046Q7946a3983A47713o8849
$$ 147570 219813 315671 -52006 7823 229389 145149 58046 145992 -13983 147713 78864
17399G8864A3883J64613B9449a40016F4004J73830N5858A22262L55459A36939
$$ 78864 13883 178496 29449 -140016 64004 237834 293692 122262 477721 136939
17388i4410B83063o8895O9607b0403C12402A51839M16985A75496G9836Q6105e7370
$$ -94410 283063 214168 283775 -20403 312402 151839 568824 175496 79836 165941 -57370
17376A86334E6216M9697m0868k1267A1724J53423p9892j0743J51138a202A67651
$$ 186334 56216 105913 65045 43778 11724 165147 85255 74512 225650 -1202 167651
17364E0640J19130J10739A13985d080o3824I2540c7642D8983J523K52917H748
$$ 50640 169770 280509 113985 -4080 -67904 92540 -37642 48983 50506 303423 8748
17352G1956J16688a64846D9411L15143j30441N8824b9595P570l1432B51795E0558
$$ 71956 188644 -164846 49411 364554 234113 292937 -29595 -22025 -53457 251795 50558
17340a3686A12147L22740j98840C0190K34677l3343I5909l6434B4439Q7203g3523
$$ -13686 112147 434887 236047 30190 264867 231524 95909 59475 24439 111642 -73523
17328B40786a36459A07796B4220h2685h304A37463P0312a1197F3531K55648A55737
$$ 240786 -136459 107796 24220 -82685 -8304 137463 207775 -11197 63531 319179 155737
17316C19889A25909Q48K8716K54513C3477c0815A24872J92644a60273h942A24754
$$ 319889 125909 126757 155473 409986 33477 -30815 124872 317516 -160273 -8942 124754
17304A34352K4044K08303a44190F7994q001K04737p2985J58707A8641J05747h0809
$$ 134352 158396 366699 -144190 67994 59993 264730 191745 350452 18641 124388 -80809
17292d7246B70539j32162J54785q231j4694k6260J08435E8361i04r4328C4019
$$ -47246 270539 138377 293162 284931 270237 243977 352412 58361 -904 -95232 34019
17280A81345J8609J78387b4159C1976K36180j31745J15799h1773A01325c08479
$$ 181345 199954 378341 -24159 31976 268156 136411 252210 -81773 101325 -308479
17269G6061J235b51105a058C08635A43781L94267c6911A23326J34696p3378q0048
$$ 76061 77296 -251105 -1058 308635 143781 538048 -36911 123326 258022 184644 104596
17258A04596N3353m2112D0414L16914J16316H7315J3937J63692m7593n1939k7396
$$ 104596 157949 115837 40414 357328 473644 87315 101252 264944 217351 165412 138016
17247A38016K62787j74867J37749j40405J46701i5168A23680B3011a26320B06238
$$ 138016 400803 225936 363685 223280 369981 -95168 123680 23011 -126320 206238
17236a665D60282a9430D2924c9214k1126C30492R5255r0034N362d6170B79371
$$ -1665 460282 -19430 42924 -39214 -60340 330492 425747 335713 341075 -46170 279371
17224C85561R1000k13971j1927a05519C87879h5498A89953E8976K81616a17483
$$ 385561 476561 262590 250663 -105519 387879 -85498 189953 58976 340592 -117483
17213C30089K474J29687A86595M07800j45963a7394H0267j0312K20064b12564
$$ 330089 332563 462250 186595 594395 448432 -17394 80267 69955 290019 -212564
17202C82158j34393o5903J33880J4257D4388J55731J88595B898J53699J64910
$$ 382158 247765 181862 315742 329999 44388 200119 388714 2898 156597 321507
17192C21507j28436L2955O0011l7519H1378J57519L91219o0751B32989J35219
$$ 321507 193071 226026 286037 248518 81378 238897 630116 569365 232989 368208
17182C68208L4559j24900h5793B79159k7459j5861F3827N7964d5134B52868K03046
$$ 368208 402767 277867 -85793 279159 251700 235839 63827 121791 -45134 252868 455914
17171D55914n5123m0358A22945K0228J83724j59552K92952A62934p9059f3307
$$ 455914 400791 360433 122945 143173 326897 167345 460297 162934 83875 -63307
17160D87792p1337A44509K57039J00111E9184R4113R4522m3223J91161G0502K26495
$$ 487792 416455 144509 401548 501659 59184 153297 247819 204596 395757 70502 296997
17149B96997j41610O8387j057P1503R4033A35535M54565B56258a0161D04806e7198
$$ 296997 155387 223774 222717 294220 388253 135535 590100 256258 -10161 404806 -57198
17137C17955P4612r3408K5918A26903R7292O5731k3410A6360M54268k08979P7961
$$ 317955 392567 299159 325077 126903 224195 289926 266516 16360 470628 261649 339610
17126C39610j30470J17711J15901J47325A41818K60362r4940j34225M4814o2983
$$ 339610 209140 326851 442752 590077 141818 402180 307240 173015 217829 154846
17116A54846L18803N4742O3375k09853J12050B30282K3199K54546A56304J25154
$$ 154846 473649 528391 591766 381913 493963 230282 253481 508027 156304 281458
17106B81458M7106j22506J65207L18843C38802J78093K0558k10284J97904N8718
$$ 281458 328564 206058 371265 690108 338802 516895 537453 327169 525073 583791
17096E83791j61013j33768K76297j12694A91785N38823k56622r4743L3592K1589
$$ 583791 422778 289010 565307 452613 191785 730608 473986 379243 412835 434424
17086D34424N8200A95304k106O390K74049k11704L73583q5589q4531J12503j16416
$$ 434424 492624 195304 193198 199588 473637 261933 635516 549927 465396 577899 461483
17075D61483J03752K5888K06465B48129K56720o8385L4306B20304L25745k63799
$$ 461483 565235 591123 797588 248129 504849 436464 470770 220304 546049 282250
17065B82250K58731J23484k98763j21612J14376j69788K91433p6289l8102L22189
$$ 282250 540981 664465 365702 244090 358466 188678 480111 403822 365720 687909
17055F87909l03831N21037m10118L1055N7066R0506L6362r6941k64429J07884
$$ 687909 384078 905115 494997 526052 583118 673624 709986 613045 348616 456500
17045D56500J86799K23218r9953k22226Q1324m9180k58898J87704J59346j62583
$$ 456500 643299 866517 766564 544338 625662 576482 317584 505288 664634 502051
17035E02051o5262Q8464N4832j74768L97402j84386L53276l91775L31248k55236
$$ 502051 436789 525253 580085 405317 802719 618333 971609 579834 911082 655846
17025F55846r0663j37893L54693j99481J64657j5318j63620J95750j93429L6381
$$ 655846 565183 427290 781983 582502 747159 731841 568221 763971 570542 606923
17015F06923J2898K25227m17539K11094m5089K03402J92075k83506o9820J301
$$ 606923 619821 845048 427509 638603 593514 796916 988991 705485 635665 636966
17005F36966m2845M33070m76235R3790Q2813l4690j36655n6992L86092k11805
$$ 636966 594121 1027191 550956 644746 727559 692869 556214 499222 885314 673509
16995F73509K57196j98285C03057M05572M581N6364K57540m64668O2352P1376
$$ 673509 930705 732420 303057 708629 713210 769574 1027114 562446 624798 696174
16985F96174J44126k10984m7322K61042k28180Q7381L3598J1913j81962J02758
$$ 696174 840300 629316 581994 843036 614856 702237 735835 747748 565786 668544
16975F68544L49796j81584J73130K51528m46980l9086j87441N99805j44712L2379
$$ 668544 1018340 836756 1009886 1261414 814434 775348 587907 1187712 1043000 1075379
16965A075379k13979n6374M78308j50486l27830K71637E35221N85995l44450K15526
$$ 1075379 861400 805026 1283334 1132848 805018 1076655 535221 1121216 776766 992292
16955I92292K45880n8641n5549m4784l76736m7939K31150J14063L22398l59888
$$ 992292 1238172 1179531 1123982 1079198 702462 654523 885673 999736 1322134 962246
16945I62246r6462r4158K78545M71453m78302P8810k08677M43604k56358M324
$$ 962246 865784 771626 1050171 1521624 1043322 1122132 913455 1357059 1100701 1105025
16935A105025J65675p2875N2644M9417k17708L7717J12305K18361O287O3060M9795
$$ 1105025 1270700 1197825 1250469 1299886 1082178 1119895 1232200 1450561 1456848 1519908 1569703
16924A569703j44079o1917q8872J65504j61723K2108j40782K93127k54388K42377
$$ 1569703 1425624 1363707 1274835 1440339 1278616 1300724 1159942 1453069 1198681 1441058
16914A441058l4541J18829k14099M39582j55671J16327O2822k36140K6003P7280
$$ 1441058 1406517 1525346 1311247 1750829 1595158 1711485 1774307 1538167 1564170 1641450
16904A641450N89230k17599l46982J54414o0990J20649r4841P5920o1266J86618
$$ 1641450 2230680 2013081 1666099 1820513 1759523 1880172 1785331 1861251 1799985 1986603
16894A986603l59421K74674K04344n33850K48691L8320K18278K24528l19748k40938
$$ 1986603 1627182 1901856 2106200 1572350 1821041 1859361 2077639 2302167 1982419 1741481
16884A741481L56760Q5551J9291Q6442k70353L15408j5155K39930j52282j69914
$$ 1741481 2098241 2183792 2203083 2289525 2019172 2334580 2319425 2559355 2407073 2237159
16874B237159Q5313J74527L1538k8664k431P5511n3631O1384J18001k30797L30666
$$ 2237159 2322472 2496999 2528537 2499873 2497442 2572953 2519322 2580706 2698707 2467910 2798576
16863B798576J59229m33400K27003J02798Q6445k7654k44884K68806M28354p5720
$$ 2798576 2957805 2524405 2751408 2854206 2940651 2912997 2668113 2936919 3365273 3289553
16853C289553l24456M79342n0240j0299j76670J81564l09248L77112P1188L07694
$$ 3289553 2965097 3444439 3394199 3383900 3207230 3388794 3079546 3456658 3527846 3835540
16843C835540k14003K94935l29927K41210L03308k33569L37595j17578k86334
$$ 3835540 3621537 3916472 3586545 3827755 4131063 3897494 4235089 4117511 3831177
16834C831177M14358M5383J18071j20728J99818J79252L148l3066K53786M4361
$$ 3831177 4245535 4290918 4408989 4288261 4488079 4667331 4670479 4637413 4891199 4935560
16824D935560n9989J21842k1730N21915j89683M969J93718M7089J30324K9488
$$ 4935560 4875571 4997413 4975683 5497598 5307915 5312884 5506602 5553691 5684015 5713503
16814E713503M20840K42859k60162J53260o2727N85021P3530N8074M83826k82935
$$ 5713503 6134343 6377202 6117040 6270300 6207573 6792594 6866124 6924198 7408024 7125089
16804G125089M15006k55421N51126P1384O6581K12872N77796l63718O16372j380
$$ 7125089 7540095 7284674 7835800 7907184 7973765 8186637 8764433 8400715 9017087 9015707
16794I015707J38117J70610M47504J94690M29897k45012K71563L39984K52897
$$ 9015707 9153824 9324434 9771938 9966628 10396525 10151513 10423076 10763060 11015957
16785A1015957K75785O12671J45593P9451P91819J37073M97314L75859P41117
$$ 11015957 11291742 11904413 12050006 12129457 12921276 13058349 13555663 13931522 14672639
16776A4672639L26562J51001N71101M43712K63602Q92531P44382N16659M10407
$$ 14672639 14999201 15150202 15721303 16165015 16428617 17321148 18065530 18582189 18992596
16767A8992596M52942J055493L73967J018125Q39483Q65459O60396J016028P10951
$$ 18992596 19445538 20501031 20874998 21893123 22732606 23598065 24258461 25274489 25985440
16758B5985440J410713P46368J289979J180900J625986J324839J668228J355417
$$ 25985440 27396153 28142521 29432500 30613400 32239386 33564225 35232453 36587870
16750C6587870J787217J563213J407006K354023K114608K299804K148374K868708
$$ 36587870 38375087 39938300 41345306 43699329 45813937 48113741 50262115 53130823
16742E3130823K477997K924510L115496L683101L496966L805864L702405M224246
$$ 53130823 55608820 58533330 61648826 65331927 68828893 72634757 76337162 80561408
16734H0561408M395789M377376N610852N140956N747476N745413N762254O029017
$$ 80561408 84957197 89334573 94945425 100086381 105833857 111579270 117341524 123370541
16726A23370541O145771O343660O349327N951377N758819N648247M992232L760577
$$ 123370541 129516312 135859972 142209299 148160676 153919495 159567742 164559974 168320551
16718A68320551L706459K180556J820026L76625k89123j556136k550673l543275
$$ 168320551 172027010 174207566 176027592 176404217 176115094 174558958 172008285 168465010
16710A68465010l884203n099283n432236n992566o232621o354640o768449o326908
$$ 168465010 164580807 159481524 154049288 148056722 141824101 135469461 128701012 122374104
16702A22374104o800106n610505o419331n557214n394873n104114n046798m642877
$$ 122374104 115573998 109963493 103544162 97986948 92592075 87487961 82441163 77798286
16694G7798286m494316l952416l627744l522671l702876k702512k933463l044267
$$ 77798286 73303970 69351554 65723810 62201139 58498263 55795751 52862288 49818021
16686D9818021k413253k154036k410979k068173j977665j746412j673522j761903
$$ 49818021 47404768 45250732 42839753 40771580 38793915 37047503 35373981 33612078
16678C3612078j552737j215621j506825j310381j008738j073484j456015q12275
$$ 33612078 32059341 30843720 29336895 28026514 27017776 25944292 24488277 23676002
16670B3676002p52683p84427j134158p37565q14552o49269k43429j290537q1537
$$ 23676002 22923319 22138892 21004734 20267169 19452617 18803348 18559919 17269382 17187845
16661A7187845r31690m18212m86399o44411n15764M1944o53200o69006J6671q10410
$$ 17187845 16256155 15837943 15351544 14707133 14191369 14233313 13580113 12911107 12927778 12117368
16651A2117368o7493l14884l91465n44213l45205m22185n03830N45804o42553
$$ 12117368 12049875 11734991 11343526 10799313 10454108 10031923 9528093 10073897 9431344
16642I431344n53686j89184J29958k52703l20235p3828m14796k84463j42819p0886
$$ 9431344 8877658 8688474 8818432 8565729 8245494 8171666 7756870 7472407 7329588 7258702
16632G258702j00831k29574l54708J88423l83314M4784l69474k96997J42199m46562
$$ 7258702 7157871 6928297 6573589 6762012 6378698 6423482 6054008 5757011 5899210 5452648
16622E452648M7528J15795k63332n34313L97736j83701l85827R2346o9991m10385
$$ 5452648 5500176 5615971 5352639 4818326 5216062 5032361 4646534 4738880 4668889 4258504
16612D258504J04285m1654N07p2403m01251M40254m41103J69346l64011m569J04440
$$ 4258504 4362789 4321135 4321642 4249239 3847988 4288242 3847139 4016485 3652474 3647905 3752345
16601C752345j75750K46136m53869L44752k9037k50511l66710L92708k27767J00140
$$ 3752345 3576595 3822731 3368862 3713614 3684577 3434066 3067356 3460064 3232297 3332437
16591C332437l1522l15882J54754k30364n9079p2402n5669J88043j60132m51465
$$ 3332437 3300915 2985033 3139787 2909423 2850344 2777942 2722273 2910316 2750184 2298719
16581B298719J88458J93275l7297l09353L7184J36172m887q2066K5207k33602
$$ 2298719 2487177 2680452 2643155 2333802 2370986 2507158 2502271 2420205 2445412 2211810
16571B211810k83992N14332o2390o89882L43802J6822J9513p1769l12324K05141
$$ 2211810 1927818 2442150 2379760 1689878 2033680 2050502 2070015 1998246 1685922 1891063
16561A891063Q1480K16579j7163k89401J00768k13185k7056N7893Q3928m59230
$$ 1891063 1972543 2189122 2171959 1882558 1983326 1770141 1743085 1800978 1884906 1425676
16551A425676L01748l7018k9380k88781K45285j06619l2789m5473M80238n17251
$$ 1425676 1727424 1690406 1661026 1372245 1617530 1510911 1478122 1432649 1912887 1395636
16541A395636q389K46486m5809l72038K15436P7764j18767P8327j92336J42173
$$ 1395636 1387247 1633733 1587924 1215886 1431322 1509086 1390319 1468646 1276310 1418483
16531A418483J84251k63718O1507k30349M4646k84666j24277L95535l11265L44835
$$ 1418483 1602734 1339016 1400523 1170174 1214820 930154 805877 1201412 890147 1234982
16521A234982m16664L41061j31973J69694j02949m3903K00708k43893q3748O6145
$$ 1234982 818318 1159379 1027406 1197100 1094151 1050248 1250956 1007063 923315 989460
16511I89460K43997n9134K9141N3486p622k16443J9123K25301m78738k4654J28764
$$ 989460 1233457 1174323 1203464 1256950 1249328 1032885 1052008 1277309 798571 773917 902681
16500I02681J08260K63366o28357N00658l35544j00497L02468m18014Q9766o5371
$$ 902681 1010941 1274307 645950 1146608 811064 710567 1013035 595021 684787 619416
16490F19416J94890o1502J76984j30371k17080N37843m24053j81389j5868J37281
$$ 619416 814306 752804 929788 799417 582337 1120180 696127 514738 498870 636151
16480F36151L17144k04924k63867K11634J96084k28015J13318o689l1301J24342
$$ 636151 953295 748371 484504 696138 892222 664207 777525 770836 739535 863877
16470H63877k90883J91273j82828n2136l1492K38303j81872L63450D18666K069
$$ 863877 572994 764267 581439 529303 497811 736114 554242 917692 418666 420735
16460D20735J76480j27730j0301l45J36535K71704m05194j36556M21290j66759
$$ 420735 597215 469485 459184 458839 595374 867078 461884 325328 746618 579859
16450E79859K68566B28569L97026K27293C34375K81903j01954k22326K50350q6533
$$ 579859 848425 228569 625595 852888 334375 616278 514324 291998 542348 455815
16440D55815L54890k98120Q1311J1322p0375J70273l23022L8551k08625N32483
$$ 455815 810705 512585 593896 605218 534843 705116 382094 420645 212020 744503
16430G44503r0184k46093q3807J51843P495J08481k50871A40835K03047J85132
$$ 744503 654319 408226 324419 476262 483757 592238 341367 140835 343882 529014
16420E29014j72000Q8665j33709J38775R6454B34000J70670j26969N2966J61783
$$ 529014 357014 445679 311970 450745 547199 234000 404670 277701 330667 492450
16410D92450A63366K24113O0656O9016J3660Q0161j31066B24181L53176k59637
$$ 492450 163366 387479 448135 517151 530811 610972 479906 224181 577357 317720
16400C17720p2788G3877M10123A88062J9567r8475J09413J51628j3191J14752
$$ 317720 244932 73877 484000 188062 207629 109154 218567 370195 357004 471756
16390D71756J21746j12811j85390j05757M2571o4643j7733B7985K46707N3138
$$ 471756 593502 480691 295301 189544 232115 167472 149739 27985 274692 327830
16380C27830k0148o4209J00280J5783j25092n0377G7746L348J43480J93876i3276
$$ 327830 307682 243473 343753 359536 234444 184067 77746 81094 224574 418450 -93276
16368C66549j31356p3170J65795A36666k1577J48770G5351K63363l8265a57085
$$ 366549 235193 162023 327818 136666 115089 263859 75351 338714 300449 -157085
16357C11593A09535K97431A59447J13399J92484j79930J51609j92904m4290r505
$$ 311593 109535 406966 159447 272846 465330 285400 437009 244105 199815 190310
16347A90310K51282C3563N7419J95819A16376J47518L3026H7218j4576C0784K84906
$$ 190310 441592 33563 90982 286801 116376 263894 296920 87218 72642 30784 315690
16336C15690J14127A64754M32720h0178C10217j09528J06260p5058C2450K63094
$$ 315690 429817 164754 597474 -80178 310217 200689 306949 231891 32450 295544
16326B95544A14352M5496J28795J49435I5882c1095C30459K03440k40841A33769
$$ 295544 114352 159848 288643 438078 95882 -31095 330459 533899 293058 133769
16315a32978A47385J30186P7183g0267B79001j26217J07766J9976M3852Q920K07978
$$ -132978 147385 277571 354754 -70267 279001 152784 260550 280526 324378 333298 541276
16304E41276A62362L14148e4117A90590o2543J01406Q8028j02411N6377J35979
$$ 541276 162362 476510 -54117 190590 128047 229453 317481 215070 271447 407426
16294D07426j14630J78863A92249J57093j58960e9677D56081a79922C21595h7398
$$ 407426 292796 471659 192249 349342 190382 -59677 456081 -179922 321595 -87398
16283C45440A2829K68921p927Q4681L459o5125G1076L4566M00088a83223C50886
$$ 345440 12829 281750 273823 358504 361963 296838 71076 105642 505730 -183223 350886
16271A9172L41593l5222e548G4165a86056j60987D63946a39299B20444H3862K72323
$$ 19172 360765 325543 -5548 74165 -186056 -347043 463946 -139299 220444 83862 356185
16260C56185b7417B10411p7253e9663B53303A19229M8934b1661A43918M3315f0904
$$ 356185 -27417 210411 133158 -59663 253303 119229 168163 -21661 143918 187233 -60904
16248A94955a53612C32595j13311b70114A04108g1567j16265B74550a34067C01376
$$ 194955 -153612 332595 219284 -270114 104108 -71567 -187832 274550 -134067 301376
16237a05097A28157b92632B79K75718e701A55958n5643g3795A52094D4743A7278
$$ -105097 128157 -292632 279 275997 -5701 155958 100315 -73795 152094 44743 17278
16225c0139C66353A76358h8462A70198a90468N8618p7678H4558Q2022J56918f4271
$$ -30139 366353 176358 -88462 170198 -190468 -131850 -209528 84558 166580 323498 -64271
16213B32898a37262B31873n8806a7320H8952M5979d96460I7496C3059N5138J56733
$$ 232898 -137262 231873 173067 -17320 88952 134931 -496460 97496 33059 88197 244930
16202B44930A17802M6183c1427B00018j2415E5973O2394f9856K7209j48344Q6776
$$ 244930 117802 163985 -31427 200018 187603 55973 118367 -69856 -42647 -190991 -104215
16191a04215A58955p7670R133c0511A02352J9941a1711k51947K1966F8844c0700
$$ -104215 158955 81285 90418 -30511 102352 122293 -11711 -263658 -241692 68844 -30700
16179E5924J6610N5761K81941i2875k37721F8967l0041b0752B59036d8513c772
$$ 55924 72534 128295 410236 -92875 -330596 68967 38926 -20752 259036 -48513 -3772
16167A9098L8645Q0137a10050D73991k28779l3746c8963j17912B53100E4538d3297
$$ 19098 57743 137880 -110050 473991 245212 211466 -38963 -156875 253100 54538 -43297
16155F0877J5578J83482b52008G0171b01707K6231j63305B98579B7950a99719
$$ 60877 76455 259937 -252008 70171 -201707 -175476 -338781 298579 27950 -199719
16144b39778B35559I1036j9034b04115e0089B99311F5444c24955i346A1742b62024
$$ -239778 235559 91036 72002 -204115 -50089 299311 65444 -324955 -9346 11742 -262024
16132D3557h5214G16a425n1361l261k5658B9620b21184A88885b77292B42651b68269
$$ 43557 -85214 716 -1425 -52786 -56047 -81705 29620 -221184 188885 -277292 242651 -268269
16119A98539p2236e5377p2964A71225c60190B78628F108K74458F6178Q4768I459
$$ 198539 126303 -55377 -128341 171225 -360190 278628 6108 280566 66178 150946 9459
16107A24757g6708I6179d1680K229D3889K10231Q0265f6895A07981K01246a30541
$$ 124757 -76708 96179 -41680 -39451 43889 254120 334385 -66895 107981 309227 -130541
16095f4453k39579a00675q4847F2581A5103K219c684p5715A17351g514A16151
$$ -64453 -304032 -100675 -185522 62581 15103 17322 -3684 -79399 117351 -7514 116151
16083a22177j7712b8851J1120H6902R9463J34508B2095b7637A55975B0882K0199
$$ -122177 -139889 -28851 -17731 86902 186365 320873 22095 -27637 155975 20882 41081
16072D1081J3593a9570m06088A13630j2767a20723A41733b68355Q2180P2389L9448
$$ 41081 54674 -19570 -425658 113630 100863 -120723 141733 -268355 -186175 -113786 -74338
16061g4338G3187b28434C7537d5168d308C5969f0782H2485j1927Q7395a67640
$$ -74338 73187 -228434 37537 -45168 -4308 35969 -60782 82485 70558 157953 -167640
16049B0678K42947h1673C47851a15107a4233j75990A21636R967a21965o0836j86467
$$ 20678 263625 -81673 347851 -115107 -14233 -190223 121636 131603 -121965 -182801 -369268
16038c69268J24858B57025a88892m8344Q0917m4603Q5816j98476J53985D6736
$$ -369268 -244410 257025 -188892 -237236 -156319 -200922 -115106 -313582 -159597 46736
16027e2509I6852c10992i5287C9522N8981a22488B55920a88026J7825D0275j6451
$$ -52509 96852 -310992 -95287 39522 98503 -122488 255920 -188026 -170201 40275 23824
16016B3824f2111l0672c1614D025a37006A78884b42955A11732J78279C3766M87359
$$ 23824 -62111 -92783 -31614 4025 -137006 178884 -242955 111732 290011 33766 521125
16005E21125d9569p3844M3348K9016g786A10249b51595B34169G223a4897k17622
$$ 521125 -49569 -123413 -80065 -51049 -7786 110249 -251595 234169 7223 -14897 -232519
15994b32519A5444K6957a20628E9760J18232h1338j19064B41157N2407j6863O1970
$$ -232519 15444 42401 -120628 59760 177992 -81338 -200402 241157 293564 276701 338671
15983C38671J0991J16163G5007d2840B742a63049b8424j76966a8548j1546C8045
$$ 338671 349662 465825 75007 -42840 2742 -163049 -28424 -205390 -18548 -30094 38045
15971b80460h3316B8754K23605a18254b4926l391p3315K3563B23916I5085a66509
$$ -280460 -83316 28754 252359 -118254 -24926 -28317 -101632 -78069 223916 95085 -166509
15959A70075g8581j72130h9641C175f2044l13114R9351h8579k3932r3142C9871
$$ 170075 -78581 -250711 -89641 3175 -62044 -375158 -275807 -88579 -112511 -205653 39871
15947F1231j8072b16141f0551j5705j56370a11545I3862Q5852R8544b48192N7658
$$ 61231 43159 -216141 -60551 -76256 -232626 -111545 93862 179714 278258 -248192 -190534
15936a90534D9147O4950d6795A99476J85468c4098m790C4282Q1321a03748c7589
$$ -190534 49147 114097 -46795 199476 384944 -34098 -38888 34282 115603 -103748 -37589
15924I4619L7670b84579h2287m7934O2736b8604k82518E7223b37815M2751Q741
$$ 94619 132289 -284579 -82287 -130221 -67485 -28604 -311122 57223 -237815 -195064 -186323
15913a86323C32121A41324b65302h722k6927j23286F15062A94293l8978F0247
$$ -186323 332121 141324 -265302 -8722 -35649 -158935 615062 194293 155315 60247
15902B13569a94037A42463J9784g1243B67856D1845b99741a764j15025b4290F3665
$$ 213569 -194037 142463 162247 -71243 267856 41845 -299741 -1764 -116789 -24290 63665
15890E0227A7755J28412b52340a4415G1375a52555A74989a93819A49540J8054
$$ 50227 17755 146167 -252340 -14415 71375 -152555 174989 -193819 149540 167594
15880A67594d8334j60636P0911B34575j08226J10546b89252g261q1276j28586
$$ 167594 -48334 -208970 -138059 234575 126349 236895 -289252 -7261 -88537 -217123
15870b17123e3665C2594a40669j61220K1191a20726H4781B0298g9550G9788L3734
$$ -217123 -53665 32594 -140669 -301889 -280698 -120726 84781 20298 -79550 79788 113522
15859A13522i1569A00395K73973h365A6738a09298B1197K23507i4610a4530l21615
$$ 113522 -91569 100395 374368 -8365 16738 -109298 21197 244704 -94610 -14530 -336145
15848c36145J51963A20911b28614R6348n0641A11761b2221A84300a81023c8909
$$ -336145 -184182 120911 -228614 -132266 -182907 111761 -22221 184300 -181023 -38909
15837A90833G9787J4293h2555q3212N4169M1838D02215b07611n3077h8716G3416
$$ 190833 79787 94080 -82555 -165767 -111598 -69760 402215 -207611 -260688 -88716 73416
15825b8934p4390p2303j43447a42658j76087C85077b18293o5131f9993A03210
$$ -28934 -103324 -175627 -319074 -142658 -318745 385077 -218293 -283424 -69993 103210
15814h4831A8811o98M282a76799b2843o8186j19869A4756J46221n4297a04293
$$ -84831 18811 18113 22395 -176799 -22843 -91029 -210898 14756 160977 106680 -104293
15802B12433a11548H3450P4775b437j17455r2868O2305l6921G8737b95232a16739
$$ 212433 -111548 83450 158225 -2437 -119892 -212760 -150455 -187376 78737 -295232 -116739
15790c7906j69051P8917j07168A44241a22227A9770J6520M8892q631h1942J4075
$$ -37906 -206957 -128040 -235208 144241 -122227 19770 36290 85182 76551 -81942 -67867
15779f7867H9266C5838b73341d5029A79250a10988A4551b96552A00834d5574j17811
$$ -67867 89266 35838 -273341 -45029 179250 -110988 14551 -296552 100834 -45574 -163385
15768a63385j44287G8040a7275B72824i1054j19983A17072J11145d58956a42532
$$ -163385 -307672 78040 -17275 272824 -91054 -211037 117072 228217 -458956 -142532
15757B54677n4042a23063A64310b3591l50698H3713R4348N227o3298E5154B5670
$$ 254677 200635 -123063 164310 -23591 -374289 83713 178061 183288 119990 55154 25670
15745b78762E1349J4591K1509J65914j24933a82599A75980n6015b8423j63980
$$ -278762 51349 65940 87449 253363 128430 -182599 175980 119965 -28423 -192403
15735a92403L0068I7174e4922B7478j483c0114C8624f4977j39371f62k57518f1746
$$ -192403 -162335 97174 -54922 27478 25995 -30114 38624 -64977 -204348 -662 -258180 -61746
15722b9825o0156e052B5183g5603k0685B366a84959A90797o9060b3402k97252
$$ -29825 -89981 -5052 25183 -75603 -96288 2366 -184959 190797 121737 -23402 -320654
15711c20654J14655g6413n16164a79653B09254q210b15382f677H8223a56906B23799
$$ -320654 -205999 -76413 -592577 -179653 209254 201044 -215382 -6677 88223 -156906 223799
15699I3048b56127g9685F6882a66101g6873q3266I432b8532l09387B23473a02075
$$ 93048 -256127 -79685 66882 -166101 -76873 -160139 9432 -28532 -337919 223473 -102075
15687b14423L3609M3162k4714A5173b72348a0773o6800H2076R3421a4791j77868
$$ -214423 -180814 -137652 -162366 15173 -272348 -10773 -77573 82076 175497 -14791 -192659
15676a92659A05508J2497h2851c1991r1393H1430a88922C50343a9649j80795h02
$$ -192659 105508 118005 -82851 -31991 -123384 81430 -188922 350343 -19649 -200444 -802
15664C11444l9370d8926j50032c9331a1312j14777A44164B1123L2382a53771N1113
$$ 311444 272074 -48926 -198958 -39331 -11312 -126089 144164 21123 53505 -153771 -102658
15653a02658q033E2413b97049K0419A45434d7323a7651E91008B24093E8702L865
$$ -102658 -110691 52413 -297049 -276630 145434 -47323 -17651 591008 224093 58702 62567
15642F2567J73622J6533b4037F5466a06748E3724a60282l4095k90951E2941R1514
$$ 62567 236189 252722 -24037 65466 -106748 53724 -160282 -194377 -485328 52941 144455
15631A44455h7539C8506h6715A80253R4429b45771F978i2311C22962l3624a72573
$$ 144455 -87539 38506 -86715 180253 274682 -245771 6978 -92311 322962 289338 -172573
15619C7097r621K75071b36337C9395n859a20465j29663a13503j82609h803j32272
$$ 37097 27476 302547 -236337 39395 33536 -120465 -250128 -113503 -296112 -8803 -141075
15608a41075G882b66995C79581c09540a1803j80915B34526c7877j74584B97337
$$ -141075 7882 -266995 379581 -309540 -11803 -192718 234526 -37877 -212461 297337
15597b00281a6909A35689A0935f5113C0914D909b38562g8868d746B6602a87764
$$ -200281 -16909 135689 10935 -65113 30914 4909 -238562 -78868 -4746 26602 -187764
15585c0280A7565a9025B10620p79R6713e2231A01931a881j9243j2610j84237E7246
$$ -30280 17565 -19025 210620 209841 306554 -52231 101931 -1881 -21124 -33734 -217971 57246
15572D6139e58468c7538B32249b06047C5246g8840B34250a53790B24169h4320
$$ 46139 -558468 -37538 232249 -206047 35246 -78840 234250 -153790 224169 -84320
15561B9939a5425j168j4821J871A07051i6456B37753b4383B00255j4273J7767
$$ 29939 -15425 -16593 -31414 -29543 107051 -96456 237753 -24383 200255 185982 203749
15550B03749N4712d5460A71251b7417j01882F9958f2529j65330A29376D0992J35901
$$ 203749 258461 -45460 171251 -27417 -129299 69958 -62529 -227859 129376 40992 176893
15539A76893h9081A86225r1397J5200l9270J64641a06567j10188B2989a5655k6211
$$ 176893 -89081 186225 94828 110028 70758 235399 -106567 -216755 22989 -15655 -41866
15528d1866l4859I6076b2906j50024d8157B01035a9687k02274b1360n6322B7085
$$ -41866 -76725 96076 -22906 -172930 -48157 201035 -19687 -221961 -21360 -77682 27085
15516d3297E1566j2511M9411l9063a28855A63094b8958B30632k9343a1987j32383
$$ -43297 51566 39055 88466 49403 -128855 163094 -28958 230632 201289 -11987 -144370
15505a44370I9190c35103B67073b5896G164K8581b2929l930D8975i6907k742q0104
$$ -144370 99190 -335103 267073 -25896 7164 35745 -22929 -26859 48975 -96907 -99649 -179753
15493a79753L6848f0648j55763j36003A57112d6894A51436a94106K2316j3801
$$ -179753 -142905 -60648 -216411 -352414 157112 -46894 151436 -194106 -171790 -185591
15483a85591K5883B67125b20069I234b44818a06821d8476A20347Q5m7739a22638
$$ -185591 -159708 267125 -220069 9234 -244818 -106821 -48476 120347 120432 72693 -122638
15471I9720a6470o0191j23917M3256D27361a0991j04085j01427H2047a8787B25085
$$ 99720 -16470 -76661 -200578 -157322 427361 -10991 -115076 -216503 82047 -18787 225085
15459a63634C4223L59788c023I920i34G3558b77736j9073K055B43059I3443O5382
$$ -163634 34223 394011 -3023 9920 -934 73558 -277736 -296809 -294754 243059 93443 158825
15447A58825a80969B153N0786a83044A61100n9871a3837B1300i2865c5534A66251
$$ 158825 -180969 2153 52939 -183044 161100 101229 -13837 21300 -92865 -35534 166251
15435a59629B41816c16356B62740a44046A2330J58457f6302F0757k4509d85113
$$ -159629 241816 -316356 262740 -144046 12330 170787 -66302 60757 36248 -485113
15424a68640a3686B42516E5798a42892H5635J4209b54135a6127A24253c84048
$$ -168640 -13686 242516 55798 -142892 85635 99844 -254135 -16127 124253 -384048
15413a90828B23128f7910D07956d874j86898A09009a55934I5763a33463C95514
$$ -190828 223128 -67910 407956 -4874 -191772 109009 -155934 95763 -133463 395514
15402a29674a9812j31188k97517d6583A66638c74420J43510H5530J55586H1443
$$ -129674 -19812 -151000 -448517 -46583 166638 -374420 -230910 85530 241116 81443
15391C40760b34474A51815d9593A86791F6433J06012G4082a6888k27148a06712
$$ 340760 -234474 151815 -49593 186791 66433 172445 74082 -16888 -244036 -106712
15380D3493R9354k0347M0553n5571l4020B6634L8249A0240a92392j5594j96175
$$ 43493 142847 122500 163053 107482 73462 26634 64883 10240 -192392 -207986 -404161
15369d04161J31727d6265l5532J1500j22686r303m386f9196D7390M7638b82570
$$ -404161 -272434 -46265 -81797 -70297 -192983 -202286 -206672 -69196 47390 95028 -282570
15357H6605K7555C2568a09432A95054i737B33763a26375n902A09997L14803a17015
$$ 86605 114160 32568 -109432 195054 -9737 233763 -126375 -132277 109997 424800 -117015
15345a3109j38657A53824c7695H6892M9738a89633e8720B6627L64804F84J4886
$$ -13109 -151766 153824 -37695 86892 136630 -189633 -58720 26627 391431 684 15570
15334A5570J31875m5534b71329J08006J3352M1925e653B97712A05295R9210J56377
$$ 15570 147445 101911 -271329 -163323 -149971 -108046 -5653 297712 105295 204505 360882
15323C60882a32761E735J492J94724L35711d7232I5181J03239h1971q6947F2247
$$ 360882 -132761 5735 7227 201951 537662 -47232 95181 198420 -81971 -168918 62247
15311c06562b1946k33075d5740i690C32866a28961A21353m5693b8037A16785b01270
$$ -306562 -21946 -255021 -45740 -9690 332866 -128961 121353 75660 -28037 116785 -201270
15299B26786a35051f5038b9834B18711m471h6929m6429E5243a01653m815D96146
$$ 226786 -135051 -65038 -29834 218711 214240 -86929 -133358 55243 -101653 -106468 496146
15287f430j23482D4820b01568C1115a6889A5422N3987K0153e2126A63762a36406
$$ -6430 -129912 44820 -201568 31115 -16889 15422 69409 89562 -52126 163762 -136406
15275C38926A14617b03792A0001K4044J8090k5679Q1208h9930C14864a46607A48677
$$ 338926 114617 -203792 10001 34045 52135 26456 107664 -89930 314864 -146607 148677
15263B35744a28054B00083B6945a38164I1857L24549a04700A58904r783J5564
$$ 235744 -128054 200083 26945 -138164 91857 416406 -104700 158904 149121 164685
15253A64685j8218n0544h219D32708M48217j25263O62864n7119j46243l10112
$$ 164685 146467 95923 -8219 432708 880925 755662 1418526 1361407 1215164 905052
15243I05052B98284N0941a61562B09483A3204c2109A03124f8683E2885O7869n5953
$$ 905052 298284 349225 -161562 209483 13204 -32109 103124 -68683 52885 120754 64801
15232F4801J12075a22347B47923A22983B5854c17147J09506J7674N4669B00866
$$ 64801 176876 -122347 247923 122983 25854 -317147 -207641 -189967 -135298 200866
15221B6986J33672b21641A29692b7463P23A01871m2795O2436a22637D35117A38170
$$ 26986 160658 -221641 129692 -27463 -26740 101871 59076 121512 -122637 435117 138170
15209e5392A79120H3338b29857L7771m8611I7771e1342F5444N3839a99957A60868
$$ -55392 179120 83338 -229857 -192086 -240697 97771 -51342 65444 119283 -199957 160868
15197b17407H2340L8811J1471g1122N65m2387j9046C94031a15691B8198i6224
$$ -217407 82340 121151 132622 -71122 -70557 -112944 -131990 394031 -115691 28198 -96224
15185h1820B62534K3466b54198e3058A61097J65427j9173a01065G8436a0212A29506
$$ -81820 262534 286000 -254198 -53058 161097 326524 307351 -101065 78436 -10212 129506
15173F3166k5278a8620p373D7391J12795d5398F4150L4379E656b92420A13978
$$ 63166 37888 -18620 -25993 47391 160186 -45398 64150 98529 5656 -292420 113978
15161f9850I193K3328a25293j972C4432M34247j63242j36385l1518P3912j9752
$$ -69850 9193 32521 -125293 -127265 34432 468679 305437 169052 137534 211446 191694
15150A91694P1968b35637B1386K37555F3667A7788b05774C99854p2739K7341A19228
$$ 191694 263662 -235637 21386 258941 63667 17788 -205774 399854 327115 354456 119228
15138a14807B27024j08414D8320b1328j9942j73737N6728B87584N8863h1120c108
$$ -114807 227024 118610 48320 -21328 -41270 -215007 -158279 287584 346447 -81120 -3108
15126C43543J8600r9824b55714B14010a77950e201B49201j13255M8694C0363J58333
$$ 343543 362143 262319 -255714 214010 -177950 -5201 249201 135946 184640 30363 188696
15115A88696c5033r9006H7724k849R5157p9864L38093j98466n1853J86440j84366
$$ 188696 -35033 -134039 87724 84875 180032 100168 438261 239795 187942 374382 190016
15104A90016c8149A53839J30400b23438I0869L06996j77860b1698B54667m7241
$$ 190016 -38149 153839 284239 -223438 90869 397865 220005 -21698 254667 207426
15094B07426F3202K2783d3338A4740d8014O401B59513d3878j03437G0135J09095
$$ 207426 63202 85985 -43338 14740 -48014 -41613 259513 -43878 -147315 70135 179230
15083A79230i8552a8400k4361D01125A40989e0556A67466G1210P0035K8600C6430
$$ 179230 -98552 -18400 -42761 401125 140989 -50556 167466 71210 141245 169845 36430
15071B84446g4173H1179M9101P3215a16503A38265A45K38351H5406j9588K46474
$$ 284446 -74173 81179 130280 203495 -116503 138265 145 238496 85406 65818 312292
15060C12292j14248a12032B74121p3820J34776q9040c27360c4062H5269g854r7806
$$ 312292 198044 -112032 274121 200301 335077 246037 -327360 -34062 85269 -7854 -105660
15049a05660C93404D9228J95491b39793G8579a23806C16205j3071r7479K16434
$$ -105660 393404 49228 244719 -239793 78579 -123806 316205 303134 205655 422089
15039D22089A75293M1091L93440B63973p1387b81944B55163G2109J68521G1714
$$ 422089 175293 216384 609824 263973 192586 -281944 255163 72109 240630 71714
15028C85798F250P021N93023b4494D83413A31710K28486q1939J08593A63709J33336
$$ 385798 6250 13271 606294 -24494 483413 131710 360196 278257 386850 163709 297045
15017B97045j39619J83330E3002K84061q1085J28425a85665e9181A53958B863
$$ 297045 157426 340756 53002 337063 255978 384403 -185665 -59181 153958 2863
15006a06659F0960L28139A9683K93857O907j25662K08443j15852R1295F8037J14993
$$ -106659 60960 389099 19683 313540 320447 194785 403228 287376 378671 68037 183030
14995A83030k4057R9652h0636B69523P2013m3423j08867J57823a17884B38489
$$ 183030 158973 258625 -80636 269523 341536 298113 189246 347069 -117884 238489
14984C51506a865p7564C65882A20106M1636e3499E1421J02837F6362J74021r0089
$$ 351506 -1865 -79429 365882 120106 161742 -53499 51421 154258 66362 240383 150294
14973A50294K37488K57954j37237g0313F6005J04571L2326B944b7324k44594D48950
$$ 150294 387782 645736 508499 -70313 66005 170576 202902 2944 -27324 -271918 448950
14961E47159k08885N3854j70220o6482J05266A9882J84714C0629J56552k5054
$$ 547159 338274 392128 221908 155426 260692 19882 204596 30629 187181 162127
14951A62127J0702m5507K32724g2212A17715L77212A12317K02816n6514J67145
$$ 162127 172829 127322 360046 -72212 117715 494927 112317 315133 258619 425764
14941D25764A79759J07085H683J87699J41609H5343g4868D31732B10872j01069
$$ 425764 179759 286844 8683 196382 337991 85343 -74868 431732 210872 109803
14931A09803L48187j14886I9737J05187j3457q920K15133p6639k2788j41868J2159
$$ 109803 457990 343104 99737 204924 191467 182547 397680 321041 298253 156385 168544
14920A68544A8379L58944J61519k10172M959o9631R4231F5412M72126A60197l7873
$$ 168544 18379 377323 538842 328670 333629 263998 358229 65412 537538 160197 122324
14909A22324L30688J7009k04306J1165J70986j85828K57931A88419Q2110J47821
$$ 122324 453012 470021 265715 276880 447866 262038 519969 188419 270529 418350
14899D18350q1268j39445l9690i1646B58625K60774B59214J02137A67174J67078
$$ 418350 337082 197637 157947 -91646 258625 519399 259214 361351 167174 334252
14889C34252j64830l5111e2682D23216A76381l7563R7952J98954J35049B09679
$$ 334252 169422 134311 -52682 423216 176381 138818 236770 435724 570773 209679
14878D87959j40203j3482J34397j89812m8888J25143j15719D505M36815e6051
$$ 487959 347756 334274 468671 278859 229971 355114 239395 4505 441320 -56051
14867D30091j7309A98973E4880i5964D78964p7858m3792r2721L2003o4271p2288
$$ 430091 412782 198973 54880 -95964 478964 401106 357314 264593 296596 232325 160037
14856A60037L23739j04252j88558E5805K74658J29959j28130A58539K65091A14766
$$ 160037 483776 379524 190966 55805 330463 460422 332292 158539 423630 114766
14845D01194p8858J82769k13609j35862A5611N06810j92648p5184K02807J80165
$$ 401194 322336 505105 291496 155634 15611 522421 329773 254589 457396 637561
14835F37561A70578D7774K58899N6699N6417R1140R252n8349j60151j37025J21687
$$ 637561 170578 47774 306673 363372 419789 510929 520181 461832 301681 164656 286343
14824B86343J41347A90276K09231K5966O255J38686j29662o6912M3065J25999
$$ 286343 427690 190276 399507 425473 431728 570414 440752 373840 416905 542904
14814E42904B23515J48126K92997o8557j60897J45121j9811p5433A55214M91175
$$ 542904 223515 371641 664638 596081 435184 580305 560494 485061 155214 646389
14804F46389m2642n7153L96J42395a16173F67867C01289j09569K29478M9918A19551
$$ 646389 603747 546594 546990 689385 -116173 667867 301289 191720 421198 471116 119551
14792E01105J36568J06436m4988C25851l3249K78699r300L1721k42873K30598
$$ 501105 637673 744109 699121 325851 292602 571301 562001 593722 350849 581447
14782E81447L0025J749j26104m956j02978b5504G14779l09936K37271L6673J99920
$$ 581447 611472 613221 487117 482161 379183 -25504 714779 404843 642114 678787 878707
14771H78707j91012k12580K04762r0290R40J0793J02097j78666j13690J47513
$$ 878707 687695 475115 679877 589587 590527 601320 703417 524751 411061 558574
14761E58574J48346j51401A05438P63121k26769J8263j36211J27423j92076P9162
$$ 558574 706920 555519 105438 868559 641790 660053 523842 651265 459189 538351
14751E38351j25698j23720J84809J38206K52351j24529j11866J05561k07999L24181
$$ 538351 412653 288933 473742 611948 864299 739770 627904 733465 525466 849647
14741H49647l86710M7265J81510C34967M31952j81533R7838q2492p0554R6909
$$ 849647 462937 510202 691712 334967 766919 585386 683224 600732 530178 627087
14731F27087J11374j95473L10010J07660l63265J31794k04011K28725j14273k26268
$$ 627087 738461 542988 852998 960658 597393 729187 525176 753901 639628 413360
14721D13360L17297k19657J14420m4899J36052k80873K93928j1676r9928K31110
$$ 413360 730657 511000 625420 580521 716573 435700 729628 717952 618024 849134
14711H49134l78214M25927D22943L63840J64245j6810j70186M04662m96710P9292
$$ 849134 470920 896847 422943 786783 951028 934218 764032 1168694 671984 751276
14701G51276K27683j90429j48426K39102L1988k05143R7461L15503l49219j45555
$$ 751276 978959 788530 640104 879206 911194 706051 803512 1119015 769796 624241
14691F24241M27774j80492l91273J06538r0203M71276j56099k54301K98770B71312
$$ 624241 1052015 871523 480250 586788 496585 967861 811762 557461 856231 271312
14680F18871M3921O54705E13491M60468r844R5365l41514Q8904o0245J58788L59707
$$ 618871 662792 1317497 513491 973959 964115 1059480 717966 806870 746625 905413 1265120
14669A265120k37072m71984L07083J24491M43264k75876l04034K69790m66090
$$ 1265120 1028048 556064 863147 987638 1430902 1155026 850992 1120782 654692
14660F54692L22841p4076K16654m2236l32301N8885L16314j43158l02938J74262
$$ 654692 977533 903457 1120111 1077875 745574 804459 1120773 977615 674677 848939
14650H48939J12643K72159n22459J27979J71507J02543l39307N26637n58872M44539
$$ 848939 961582 1233741 711282 839261 1010768 1113311 774004 1300641 741769 1186308
14640A186308j9435n3740J55228k04343K27830k75371J36004n8995j0333O7483
$$ 1186308 1166873 1113133 1268361 1064018 1291848 1016477 1152481 1093486 1083153 1150636
14630A150636K86817k32162j19972k7484L12904o9284M15568n09144j00497M45980
$$ 1150636 1437453 1205291 1085319 1057835 1370739 1301455 1717023 1207879 1107382 1553362
14620A553362q2573o659k34268q8020J83762J89490j85970O4505J15596j65031
$$ 1553362 1470789 1464130 1229862 1141842 1325604 1515094 1329124 1393629 1509225 1344194
14610A344194M58967o98415M14790j70558j07501P848K61621j90871J96095K0307
$$ 1344194 1803161 1104746 1519536 1348978 1241477 1249325 1510946 1320075 1516170 1536477
14600A536477k59132j24246M91485k57060l8587M92200l6116m92718K11345M1087
$$ 1536477 1277345 1153099 1644584 1387524 1348937 1841137 1805021 1312303 1523648 1564735
14590A564735K62776k69765k17173L03731O9921j124M3966L81172j67638k79208
$$ 1564735 1827511 1557746 1340573 1644304 1714225 1713101 1757067 2138239 1970601 1691393
14580A691393L52159l31693J72611k51129L1680J34445j611K86358j4202j41753
$$ 1691393 2043552 1711859 1884470 1633341 1665021 1799466 1797855 2084213 2070011 1928258
14570A928258M00610K13398n37023J32398k82676M98530J81717L5693k10457k24291
$$ 1928258 2328868 2542266 2005243 2137641 1854965 2353495 2535212 2570905 2360448 2136157
14560B136157N82495L4700O5048r46L07554L52186P709M9097J019516L60062J519839
$$ 2136157 2718652 2753352 2818400 2817454 3125008 3477194 3484903 3534000 4553516 4913578 6433417
14549F433417L233325O144897P287404Q347326M992475j4978986I451143D580187
$$ 6433417 9666742 15811639 23099043 31446369 36438844 21459858 9451143 4580187
14540B700658o33441K44333m01217k53274M55904l44129K4555J7008J54641q7389
$$ 2700658 2067217 2311550 1910333 1657059 2112963 1768834 1793389 1810397 1965038 1877649
14530A877649j22429J05755J53037j20388L28645J20687j74866j28745P6234J91103
$$ 1877649 1755220 1860975 2014012 1893624 2222269 2342956 2168090 2039345 2115579 2306682
14520B306682l48514j60780N91770P2446q9481P0341J76607J43124k19363l39288
$$ 2306682 1958168 1797388 2389158 2461604 2372123 2442464 2619071 2762195 2542832 2203544
14510B203544M00083J3762j27568J11385J04303l39847K52474M11504l85522N23565
$$ 2203544 2603627 2617389 2489821 2601206 2705509 2365662 2618136 3029640 2644118 3167683
14500C167683m96430J43054r1759M59980l27811K25045Q8012j17303M17021k72913
$$ 3167683 2671253 2814307 2722548 3182528 2854717 3079762 3167774 3050471 3467492 3194579
14490C194579r5945K75544j92861J30434k64104K72019J07782j27204J9637K80135
$$ 3194579 3098634 3374178 3181317 3311751 3047647 3319666 3427448 3300244 3319881 3600016
14480C600016j08286J53288R9674l85999L18520N03019j87206p0338r4664L45293
$$ 3600016 3491730 3645018 3744692 3358693 3677213 4180232 3993026 3922688 3828024 4173317
14470D173317J17368m61428j74326N81544j69340M41134k18250J69819j79208
$$ 4173317 4290685 3829257 3654931 4236475 4067135 4508269 4290019 4459838 4280630
14461D280630J96809n5420L24978k33058L41220j29491R4650K68152l73856R7117
$$ 4280630 4477439 4422019 4746997 4513939 4855159 4725668 4820318 5088470 4714614 4811731
14451D811731K30506M5714o341m6986K51749K02047k72291K96070P3127k21377
$$ 4811731 5042237 5087951 5081610 5034624 5286373 5488420 5216129 5512199 5585326 5363949
14441E363949J50780L86375k35502J37138J21708k85867P54052k58988K47525
$$ 5363949 5514729 5901104 5665602 5802740 5924448 5638581 6392633 6133645 6381170
14432F381170j54338L77517k10974K97755O3826J30573m1143l4722M00030j45610
$$ 6381170 6226832 6604349 6393375 6691130 6754956 6885529 6844386 6809664 7209694 7064084
14422G064084L0796K16847l46633O27705K83166m23195L96912K27721J38616J6952
$$ 7064084 7094880 7311727 6965094 7592799 7875965 7452770 7849682 8077403 8216019 8232971
14412H232971K58192J6049K13749j08975r6159O86219k4184j04436Q4048N69288
$$ 8232971 8491163 8507212 8720961 8611986 8515827 9202046 9177862 9073426 9157474 9726762
14402I726762O3355r707K08719O0737M95575J02662o1955K12770O7780Q83578
$$ 9726762 9790117 9780410 9989129 10049866 10545441 10648103 10586148 10798918 10866698 11750276
14392A1750276l43328N01339l88216M71419K76441J93697l11875M82103P24617
$$ 11750276 11406948 11908287 11520071 11991490 12267931 12461628 12149753 12631856 13356473
14383A3356473J99683m14799O33384M53365l3220j01662P68257N12357J0158M05008
$$ 13356473 13556156 13141357 13774741 14228106 14194886 14093224 14861481 15373838 15383996 15789004
14373A5789004J01696K76541L60041J22610O31228J06674O04097M60196M15477
$$ 15789004 15890700 16167241 16527282 16649892 17281120 17387794 17991891 18452087 18867564
14364A8867564M55602J73862K53151P31067P25774J62957R9214Q82525L46618
$$ 18867564 19323166 19497028 19750179 20481246 21207020 21369977 21469191 22351716 22698334
14355B2698334O69099N59914K47434Q53772O72106N68194Q74878Q55712M10208
$$ 22698334 23367433 23927347 24174781 25028553 25700659 26268853 27143731 27999443 28409651
14346B8409651O78331P10594Q22475N97301Q58727J092841Q17654Q33039R28789
$$ 28409651 29087982 29798576 30621051 31218352 32077079 33169920 33987574 34820613 35749402
14337C5749402R85337J279110R10257R79048J494049J166629J112266J430602
$$ 35749402 36734739 38013849 38924106 39903154 41397203 42563832 43676098 45106700
14329D5106700J335224J560373J755797J447495J563387K036598J628763J974195
$$ 45106700 46441924 48002297 49758094 51205589 52768976 54805574 56434337 58408532
14321E8408532K025635K250167K047005K686499K238034K513771L069161K780522
$$ 58408532 60434167 62684334 64731339 67417838 69655872 72169643 75238804 78019326
14313G8019326L066459L568043L120166L474736M074930L925127M218664M216380
$$ 78019326 81085785 84653828 87773994 91248730 95323660 99248787 103467451 107683831
14305A07683831N111858N174449N095507O177120N729766O495977O832070O746530
$$ 107683831 112795689 117970138 123065645 129242765 134972531 141468508 148300578 155047108
14297A55047108P883184P978673Q446854Q962590R510577R843622J0305281J1139857
$$ 155047108 162930292 170908965 179355819 188318409 197828986 207672608 217977889 229117746
14289B29117746J1481479J1834687J2756020J3592712J3771453J4112550J4440584
$$ 229117746 240599225 252433912 265189932 278782644 292554097 306666647 321107231
14282C21107231J4776633J4857709J4947447J4564647J4519188J3610349J2631319
$$ 321107231 335883864 350741573 365689020 380253667 394772855 408383204 421014523
14275D21014523J1125741P216341K865136k01243l483612K225506M399562L100440
$$ 421014523 432140264 439356605 442221741 442020498 438536886 440762392 445161954 448262394
14267D48262394j562456n535030r111785j0631168j2471432j3903704j4888421
$$ 448262394 446699938 441164908 432053123 421421955 408950523 395046819 380158398
14260C80158398j5575744j5526842j6235872j5778156j5430610j5000289j3738737
$$ 380158398 364582654 349055812 332819940 317041784 301611174 286610885 272872148
14253B72872148j3617383j3064549j2870040j1979637j1547254j0335468j0049308
$$ 272872148 259254765 246190216 233320176 221340539 209793285 199457817 189408509
14246A89408509r457028q783273q178090p676647p689698p219052o398843o269835
$$ 189408509 179951481 171168208 162990118 155313471 147623773 140404721 134005878 127736043
14238A27736043n445518n065255n209639m985281m838640m512252l636998l783320
$$ 127736043 122290525 117225270 112015631 107030350 102191710 97679458 94042460 90259140
14230I0259140l582065l629943l067600l164307k961793k992862k428275k861292
$$ 90259140 86677075 83047132 79979532 76815225 73853432 70860570 68432295 65571003
14222F5571003j894362k279849j964323j874747j957585k244715j410907j784397
$$ 65571003 63676641 61396792 59432469 57557722 55600137 53355422 51944515 50160118
14214E0160118j465082j300782j260696k077686j291001j140083q94075r62736
$$ 50160118 48695036 47394254 46133558 44055872 42764871 41624788 40730713 39767977
14206C9767977q11785j572621r45727j123611j102910o21776q02395p66117j063232
$$ 39767977 38956192 37383571 36437844 35314233 34211323 33589547 32787152 32021035 30957803
14197C0957803j111169l45260r49274o81999p37634p42202m97086o59044o41891
$$ 30957803 29846634 29501374 28552100 27870101 27132467 26390265 25893179 25234135 24592244
14188B4592244r52886K9531m11896p20003q36355m13638o15801J22386o04197
$$ 24592244 23639358 23668889 23256993 22536990 21700635 21286997 20671196 20793582 20189385
14179B0189385l64864o92811k79189m16433k17201n40881m37551l22008k3542
$$ 20189385 19824521 19131710 18852521 18436088 18218887 17678006 17240455 16918447 16894905
14170A6894905k65166o04014m26778q6659R4595n68256k54190k67886n35180q3607
$$ 16894905 16629739 16025725 15598947 15512288 15606883 15038627 14784437 14516551 13981371 13897764
14160A3897764k81220m51113L57061l81935l47361m88226r5639j87871P0643m24990
$$ 13897764 13616544 13165431 13522492 13140557 12793196 12304970 12209331 12021460 12092103 11667113
14150A1667113O4874k78036k75742J01364m74202l03510J08280L7170p25872L67306
$$ 11667113 11731987 11453951 11178209 11279573 10805371 10501861 10610141 10647311 9921439 10288745
14140A0288745m68758J72201j93730n08971J71615l91055K14515j28018k01832
$$ 10288745 9819987 9992188 9798458 9289487 9461102 9070047 9284562 9156544 8954712
14131H954712m49242k75524K86914P675l66384J10353o20819K38744j77835Q6556
$$ 8954712 8505470 8229946 8516860 8524535 8158151 8268504 7647685 7886429 7708594 7795150
14121G795150k72485l48379J96260N3294m10063J00702J24173m47274J28821L41731
$$ 7795150 7522665 7174286 7370546 7423840 7013777 7114479 7238652 6791378 6920199 7261930
14111G261930r01477j88212M2926J13175J7226p8225l6712k03127j1153K653P0224
$$ 7261930 6360453 6172241 6215167 6328342 6345568 6267343 6230631 6027504 6016351 6019004 6089228
14100F089228m40142J1289J44829r5368m81401K33390k04802j67395N6674J69681
$$ 6089228 5649086 5660375 5805204 5709836 5228435 5461825 5257023 5089628 5146302 5315983
14090E315983l76622K8597J34961m10615J57395J57605k76687L86122k56860l913
$$ 5315983 4939361 4967958 5102919 4692304 4849699 5007304 4730617 5116739 4859879 4855966
14080D855966q0466q2172j97871J38966R5037j97065l99382M88281p7218k61575
$$ 4855966 4775500 4693328 4495457 4634423 4729460 4532395 4133013 4621294 4544076 4282501
14070D282501q6994l05244M55095Q200j41456P5512l74096J81823m06395K32126
$$ 4282501 4195507 3890263 4345358 4353558 4212102 4287614 3913518 4095341 3688946 3921072
14060C921072L62055k22505L995k29379M19191k60562m69417J90667l568m85690
$$ 3921072 4283127 4060622 4064617 3835238 4254429 3993867 3524450 3715117 3711549 3225859
14050C225859J00515L432M03375n09267r8638J50624J57002k33140J2368m605
$$ 3225859 3326374 3329806 3733181 3223914 3125276 3275900 3432902 3199762 3212130 3207525
14040C207525q4941k09894L4980M86997m68420K13403o0368m57025N04314o7583
$$ 3207525 3122584 2912690 2947670 3434667 2966247 3179650 3119282 2662257 3166571 3098988
14030C098988p9757j26728J33852k11354l55128L35077O35l7705k74628l6838
$$ 3098988 3019231 2892503 3026355 2815001 2459873 2794950 2795585 2757880 2483252 2446414
14020B446414Q7079n185Q3156l15197J72381j42385K86997J63006m77338L33073
$$ 2446414 2533493 2528308 2611464 2296267 2468648 2326263 2613260 2776266 2298928 2632001
14010B632001l03094K89889m77587L62544m69602J97112M8545j55283r8174K96549
$$ 2632001 2328907 2618796 2141209 2503753 2034151 2231263 2279808 2124525 2026351 2322900
14000B322900q6417r7382l1823O7791o0499J87080k53131N99742m88009N29743
$$ 2322900 2236483 2139101 2107278 2175069 2114570 2301650 2048519 2648261 2160252 2689995
13990B689995Q28911J870974N440846P391050Q558071R933181j0750970A2359121
$$ 2689995 3518906 5389880 10830726 18221776 26779847 36713028 25962058 12359121
13981G413070k408813m48987o33991m27049l29741k35323k76992P8263q3287O5857
$$ 7413070 5004257 4555270 3921279 3494230 3164489 2929166 2652174 2730437 2647150 2713007
13971B713007l47874n1009Q6098Q5014p7274L5500j96678O5308P006k57323J05667
$$ 2713007 2365133 2314124 2400222 2485236 2407962 2443462 2246784 2312092 2319098 2061775 2167442
13960B167442k61233J30409k18648L8062M04989m56353J23211p4178K1187j38699
$$ 2167442 1906209 2036618 1817970 1856032 2261021 1804668 1927879 1853701 1874888 1736189
13950A736189j09492M02835Q5239l88311j7581K46657L8453l54373M91083m57374
$$ 1736189 1626697 2029532 2114771 1726460 1708879 1955536 1993989 1639616 2130699 1673325
13940A673325R1844K0508k54975J44032J69355k96710J29550p8261L28517j92980
$$ 1673325 1765169 1785677 1530702 1674734 1844089 1547379 1676929 1598668 1927185 1734205
13930A734205n4114j71530P2362m1750K27500k67225L0692m060K23798k82806
$$ 1734205 1680091 1508561 1580923 1539173 1766673 1499448 1530140 1526080 1749878 1467072
13920A467072q99L70444j4872o19152J42297m3027Q7237J4541j51635j95125N5598
$$ 1467072 1466173 1836617 1821745 1202593 1344890 1301863 1389100 1403641 1252006 1056881 1112479
13909A112479L25730n5393j34604M47969m1254o59946J54750M17513j45906J33515
$$ 1112479 1438209 1382816 1248212 1696181 1654927 994981 1149731 1567244 1421338 1554853
13899A554853l61570J32259k08068p7148L36308n3728J57867l04098L33349j74035
$$ 1554853 1193283 1325542 1117474 1040326 1376634 1322906 1480773 1176675 1510024 1335989
13889A335989J46522j03891l28251L49794j18346K72233l79388K96961j11959
$$ 1335989 1482511 1378620 1050369 1400163 1281817 1554050 1174662 1471623 1359664
13880A359664m87216K93121K23510j50895j49459m7616J4798M5191L53624l77013
$$ 1359664 872448 1165569 1389079 1238184 1088725 1041109 1055907 1101098 1454722 1077709
13870A077709j22946l6830N9941o5008K31010Q1680K087n0435j34685J57049r1756
$$ 1077709 954763 917933 977874 912866 1143876 1225556 1227643 1177208 1042523 1199572 1107816
13859A107816K36801l79784L5486K19715l34194J34882j45498K23217K21483m78278
$$ 1107816 1344617 964833 1000319 1220034 885840 1020722 875224 1098441 1319924 841646
13849H41646r769J33001L8982L91134m99631K29963j35036J00275k38697J51777
$$ 841646 831877 964878 1003860 1394994 895363 1125326 990290 1090565 851868 1003645
13839A003645k07212L8233L12529k82081K95169J18429l52248N3531J20094l05648
$$ 1003645 796433 834666 1147195 865114 1160283 1278712 926464 979995 1100089 794441
13829G94441J88617J63356r1678j05178k58942m6835K86907k59550N23916l47919
$$ 794441 983058 1146414 1054736 949558 690616 643781 930688 671138 1195054 847135
13819H47135r2050J93238k98452J08240K10361J00856l88856N74624F11698O3808
$$ 847135 755085 948323 649871 758111 968472 1069328 680472 1255096 611698 675506
13809F75506L41883j79790P4373L17799k21923n794m50864K05321K61705j19377
$$ 675506 1017389 837599 911972 1229771 1007848 1002054 551190 756511 1018216 898839
13799H98839j67942Q7193j28856K10140j36061M486P3053j80999j34785L20957
$$ 898839 730897 818090 689234 899374 763313 767799 840852 659853 525068 846025
13789H46025l33637Q9898L50080j95203K36822C59184J94073L03558k47222J06776
$$ 846025 512388 602286 952366 757163 993985 359184 553257 856815 609593 716369
13779G16369J37152n2739l07564J74302j61143K94611l07651j04459K26598K38064
$$ 716369 853521 800782 493218 667520 506377 800988 493337 388878 615476 853540
13769H53540J307k51077J63751k3713j6254K05058k1935M4849D69211K26292J29871
$$ 853540 854847 603770 767521 743808 727554 932612 910677 955526 469211 695503 825374
13758H25374Q6480l62791O0156n9326J46052j10096K7379k27108J11011R9253
$$ 825374 911854 549063 609219 549893 695945 585849 613228 386120 497131 596384
13748E96384L15364j15430l85348K96924q9198P0627J34899k48994j75501L02739
$$ 596384 911748 796318 410970 707894 618696 689323 824222 575228 399727 702466
13738G02466j69435j24331J80286J45670B68016J70235M1029L07085k25746k32306
$$ 702466 533031 408700 588986 734656 268016 438251 479280 786365 560619 328313
13728C28313J80413j02706K94471j11902l1959J88069l23378L0859l7944K05300
$$ 328313 508726 406020 700491 588589 556630 744699 421321 452180 414236 619536
13718F19536O1203p4774J81029C86561L42357k58132L59509l9495k58550p6300
$$ 619536 680739 605965 786994 386561 728918 470786 830295 790800 532250 455950
13708D55950M4741J63308j95369q1183J90034N5505B23178J68498j38267J04584
$$ 455950 500691 663999 468630 387447 577481 632986 223178 391676 253409 357993
13698C57993J84894k3331k4412l1892M4510L10233C63774L96506P0375l675C15427
$$ 357993 542887 519556 495144 463252 507762 817995 363774 760280 830655 826980 315427
13686E55837k13803J64422A51895L4880O77383B20179K28671M05965k50783o8421
$$ 555837 342034 506456 151895 186775 864158 220179 448850 854815 604032 535611
13676E35611j92927M1235J10604m1467J15480K11634k71371r5746J62692J2143
$$ 535611 342684 383919 494523 453056 568536 780170 508799 413053 575745 587888
13666E87888J5542B24176M02728r7357P0740N5224k03050K48705k51051j67268
$$ 587888 603430 224176 626904 529547 600287 655511 452461 701166 450115 282847
13656B82847R3046l1353j09292N3788K29070n6037j85007L53544L5693B94952
$$ 282847 375893 344540 235248 289036 518106 462069 277062 630606 666299 294952
13645A44433M13766o6604k17112K8282J50660K08891B56658Q8357J26668P9617
$$ 144433 558199 491595 274483 302765 453425 662316 256658 345015 471683 551300
13635E51300n5076H8420J67215c490B58949K95804N2089B51320k2487O4794N9263
$$ 551300 496224 88420 255635 -3490 258949 554753 606842 251320 228833 293627 352890
13624C52890J61185J49243k36793K0753A59440L81637k67859J2276K98647j58549
$$ 352890 514075 663318 426525 447278 159440 541077 273218 285494 584141 425592
13614D25592A61641p4694O17011q1922B04054L37055B54346K65898j69715A52854
$$ 425592 161641 86947 703958 622036 204054 541109 254346 520244 350529 152854
13603E67083r1654R1960j68655j14094M2910M41302A85548P7249K74766k39571
$$ 567083 475429 567389 398734 284640 327550 768852 185548 262797 537563 297992
13593B97992L75550j70837A48493L41969k11652b84900C78646k069P152j35523
$$ 297992 673542 502705 148493 490462 278810 -284900 378646 376577 383729 248206
13583B48206j4654O03410C38540F8151L49284K1249j83270j3541a52914B53428
$$ 248206 233552 836962 338540 68151 417435 438684 255414 241873 -152914 253428
13572D00027q0706A02128K31348j65583L09263j83887p4831I2848J09052K7614
$$ 400027 319321 102128 333476 167893 477156 293269 218438 92848 201900 229514
13562B29514K96273B27801Q2221K025J20168j28940K39731J09039j96464j07591
$$ 229514 525787 227801 310022 312047 432215 303275 543006 652045 455581 347990
13552C47990I9416L26947l6827A03410L21966k10354L78970B80421r1951J62420
$$ 347990 99416 426363 389536 103410 425376 215022 593992 280421 188470 350890
13542C50890j64338K25398j01446Q4483m31A30710j6516L40319j63948R300C5154
$$ 350890 186552 411950 310504 394987 394556 130710 114194 454513 290565 299865 35154
13530D30468j97067M4285K26611k38679j04763K48798A93165J2033n6294J61872
$$ 430468 233401 277686 504297 265618 160855 409653 193165 205198 148904 310776
13520C10776a52239A41804a13977D77405k20776k4909m0736J14635n3191M3951
$$ 310776 -152239 141804 -113977 477405 256629 231720 190984 305619 252428 296379
13510B96379P6507A67871J69348j30656K95352R4577B3672M29862N829A90970
$$ 296379 372886 167871 337219 206563 501915 596492 23672 453534 459363 190970
13499B00992K67684j33464A56505J17505J61801j02915j44356K21582j69297A7697
$$ 200992 468676 335212 156505 274010 435811 332896 188540 410122 240825 17697
13488b7839B44778J37470R0661j95244K7730I0179J26889J77035j52674J6880
$$ -27839 244778 382248 472909 277665 305395 90179 217068 394103 241429 258309
13478B58309k6799q323F4511J56751J80176r9424c3690A67296m9941J75320K91765
$$ 258309 231510 223187 64511 221262 401438 302014 -33690 167296 117355 292675 584440
13467E84440B54767r7192l3198L68858M6479B67837j2080J73523k7332k4170p0431
$$ 584440 254767 157575 124377 493235 539714 267837 255757 429280 401948 377778 307347
13456C07347p4355k1498n2117K80580D4880J19426L45497c5657C44737a87138
$$ 307347 232992 211494 159377 439957 44880 164306 509803 -35657 344737 -187138
13445C2918L15524N2824A4833N0154J39434J085J24279o0395B6265L6076h5360
$$ 32918 348442 401266 14833 64987 204421 205506 329785 269390 26265 62341 -85360
13433a1471D6883K43794c1A03932J74317j02478R3915Q4103l7763j7484J14188
$$ -11471 46883 290677 -31 103932 278249 175771 269686 353789 316026 298542 412730
13422D12730j24359j08401M88497a34510B13316E2659K01174K7652J48105j76943
$$ 412730 288371 179970 668467 -134510 213316 52659 253833 281485 429590 252647
13412B52647b7543B73847j21348L91320I9278L31383A9430Q9288K15933k6279
$$ 252647 -27543 273847 152499 543819 99278 430661 19430 108718 324651 298372
13402B98372g0387b3877E48346B02118J14359N7274A48897M881m8523c2459B74507
$$ 298372 -70387 -23877 548346 202118 316477 373751 148897 153778 105255 -32459 274507
13390D12557B01189J06952J98916B04794b99275M0525F09866a3857B9162M42103
$$ 412557 201189 308141 507057 204794 -299275 -258750 609866 -13857 29162 471265
13380D71265B3881l772J66634k0235J26779O764m5001Q5453A51842N23328B03907
$$ 471265 23881 20109 186743 166508 293287 300051 255050 340503 151842 675170 203907
13368D10455o1872J91195B2426P208K34975J56880B6401K0179J37374n2163Q7919
$$ 410455 348583 539778 22426 29634 264609 421489 26401 46580 183954 131791 219710
13357B19710J6007N023f470B2059r000N0522M81300K47432C13345j23245K63870
$$ 219710 235717 240740 -6470 22059 13059 63581 544881 792313 313345 190100 453970
13346D53970j51873J08561p7846k087d1162C79045J96864B27294J94217j51552
$$ 453970 302097 410658 332812 330725 -41162 379045 575909 227294 421511 269959
13336B69959J72760a53785C53294A51737D3350J30605J63306D4749L09689j52611
$$ 269959 442719 -153785 353294 151737 43350 173955 337261 44749 354438 201827
13326B01827r7293c67245C94701j09044j9568J2816K55695C1307O9364M28675
$$ 201827 104534 -367245 394701 285657 266089 278905 534600 31307 100671 529346
13316E29346B51129A7660J14L97585E7788r211J80042a48878P1094E323K43275
$$ 529346 251129 17660 17774 415359 57788 48577 228619 -148878 -77784 5323 248598
13305B48598m5368n9792J90958j29759r7239K56338p0526j9316L2964j23391P9868
$$ 248598 203230 143438 334396 204637 107398 363736 293210 273894 306858 183467 263335
13294B63335c61756B20579J86001A39483i4834C11333L3599p1957g800G653J39620
$$ 263335 -361756 220579 406580 139483 -94834 311333 344932 272975 -7800 7653 147273
13283A47273l1248R5615p410J86889j81199K7087G6925P2656k4162k893K63655
$$ 147273 116025 211640 204230 391119 209920 237007 76925 149581 125419 122526 386181
13272C86181O2803E2696P7356K35750j42368c04171C35388C9247a02690j48990
$$ 386181 448984 52696 130052 365802 223434 -304171 335388 39247 -102690 -251680
13262b51680D87157A69166i9234A36668K1389K61952A42387o5384b46274l1509
$$ -251680 487157 169166 -99234 136668 158057 420009 142387 77003 -246274 -277783
13252b77783B34054A08495P597J27084N3169c5951k18115B92472J23437A04323
$$ -277783 234054 108495 116092 243176 296345 -35951 -254066 292472 415909 104323
13241A38026j8982n086J04394A06255J94193d3735H9247L68050a27767D9620J27667
$$ 138026 119044 113958 218352 106255 300448 -43735 89247 457297 -127767 49620 177287
13230A77287a35837B51513n1158L8774D1518J74760J43892j03669q429M8483b66895
$$ 177287 -135837 251513 200355 239129 41518 216278 360170 256501 248072 296555 -266895
13218B45873G980a86495a9638B62928r9339B6570J76559g7088A57655P8806L6596
$$ 245873 7980 -186495 -19638 262928 163589 26570 203129 -77088 157655 236461 273057
13207B73057a71385A9146b906B72737A7079R0645g2101C0723K3739K17730b78413
$$ 273057 -171385 19146 -2906 272737 17079 107724 -72101 30723 54462 272192 -278413
13195A53906E3013M4291i518A19861K47649b2007C553L69215j86333a4868H3711
$$ 153906 53013 97304 -9518 119861 367510 -22007 3553 372768 186435 -14868 83711
13183A40897J2940O6410J59151A6610K72794a76607B50326g6334C60421A36717
$$ 140897 153837 220247 379398 16610 289404 -176607 250326 -76334 360421 136717
13172A57508a0758H8475A1801J88638o2506g1809C94557R9688F4345d3282C4693
$$ 157508 -10758 88475 11801 200439 137933 -71809 394557 494245 64345 -43282 34693
13160b16562A47803a47334C50972E1815K44979N9320e616D7809M19266A14458
$$ -216562 147803 -147334 350972 51815 296794 356114 -5616 47809 467075 114458
13149b91889a30391c7692B13521q6094J31247e8956B8834J85223f1901I3435h6572
$$ -291889 -130391 -37692 213521 127427 258674 -58956 28834 214057 -61901 93435 -86572
13137A96606E5858e4306H6151J59618i4264C85274C5917J94154C6939J84583j07915
$$ 196606 55858 -54306 86151 245769 -94264 385274 35917 230071 36939 221522 113607
13126A13607o391b33866J14960G8746a39865I6110J40843E7637Q6752A0199N6132
$$ 113607 107216 -233866 -118906 78746 -139865 96110 236953 57637 144389 10199 66331
13115F6331a77201A19241D9216O777J5873d3940C12176J75794j63922A7163L66860
$$ 66331 -177201 119241 49216 55993 71866 -43940 312176 487970 324048 17163 384023
13104C84023E0317J87528c88058F9157N015a9994B46150d8887H8441k0386A2928
$$ 384023 50317 237845 -388058 69157 74172 -19994 246150 -48887 88441 68055 12928
13092D5078P8935J16536b57251h6554q1128E3337J83538B7974h2290j1523A28373
$$ 45078 124013 240549 -257251 -86554 -167682 53337 236875 27974 -82290 -93813 128373
13080A96605K11775n4056A17074a03146C12406a29201E2104J4465g1866C07222
$$ 196605 408380 354324 117074 -103146 312406 -129201 52104 66569 -71866 307222
13069A24358A9832a95802h7325C10857j12362n1758J52666N5089C7389b7440C94901
$$ 124358 19832 -195802 -87325 310857 198495 146737 299403 354492 37389 -27440 394901
13057C25660D8812K47255f6045A64483o6653c8506A91029L7754a3126B33689m9700
$$ 325660 48812 296067 -66045 164483 97830 -38506 191029 228783 -13126 233689 183989
13046A83989c18427B53198j19646f9930A03682L02956g5130B58295b08813A52159
$$ 183989 -318427 253198 133552 -69930 103682 406638 -75130 258295 -208813 152159
13035I8052K7501E956J38754n6714M3844J40205p6195K11520a80077B85391c515
$$ 98052 125553 5956 144710 87996 131840 272045 195850 407370 -180077 285391 -3515
13023B75872A33280N511m8297L87254j58959j30640k6952J41234p5212J31083
$$ 275872 133280 138791 90494 477748 318789 188149 161197 302431 227219 358302
13013C58302E8124J20475G9339J52786j15524J39308C5167J60045J1706h6967
$$ 358302 58124 178599 79339 232125 116601 255909 35167 195212 206918 -86967
13002a08063A20803a03872k32627B30584L0904J93832d0598l87229F3389M8108
$$ -108063 120803 -103872 -336499 230584 261488 455320 -40598 -427827 63389 111497
12992A11497D1564L00418g4457A37749L98452H1043a4372A93724o7386n6845J05484
$$ 111497 41564 341982 -74457 137749 536201 81043 -14372 193724 126338 69493 174977
12981A74977a19864A05257D4678a43924D5002b30689A42890m4085e676j69565
$$ 174977 -119864 105257 44678 -143924 45002 -230689 142890 98805 -5676 -175241
12971a75241B61012a32188C29N5134O8421L79435B5577M4489b56553a20713A31622
$$ -175241 261012 -132188 329 55463 123884 503319 25577 70066 -256553 -120713 131622
12959D8828a70898k3782A7447h43B32605B0311J8564N6678b01836E2660c4973
$$ 48828 -170898 -194680 17447 -843 232605 20311 38875 95553 -201836 52660 -34973
12947c67917B28288g0409A74554b0378B17540K7171a120B80399O8543m9364H9960
$$ -367917 228288 -70409 174554 -20378 217540 244711 -1120 280399 348942 299578 89960
12935E2861b9851D3157M48378A15779D6137a62396M5830A61633D3594J7896K22303
$$ 52861 -29851 43157 491535 115779 46137 -162396 -116566 161633 43594 61490 283793
12924B83793A02748J0262g5220G5679h9343A37898b09098B1461L12547b21339
$$ 283793 102748 113010 -75220 75679 -89343 137898 -209098 21461 334008 -221339
12913B4300b17796c2609C9524N4496a49372N3962D56653A73277p1443J47091m2989
$$ 24300 -217796 -32609 39524 94020 -149372 -95410 456653 173277 101834 248925 205936
12902B05936d9496m5214b9550o2596n4538J7604B3318A1442d3045A51635A2001
$$ 205936 -49496 -94710 -29550 -92146 -146684 -129080 23318 11442 -43045 151635 12001
12890e1287B64178C0920a32844A18727O797a18380C9873P7225a23936j8870j44706
$$ -51287 264178 30920 -132844 118727 125524 -118380 39873 117098 -123936 -142806 -287512
12879b87512C1575b7547A29184J397c6266j72929i6008l99447A04303L9706a14387
$$ -287512 31575 -27547 129184 130581 -36266 -209195 -96008 -495455 104303 144009 -114387
12867B20129N5779a23086C87335G5042J28628e006k91913i7340a1351E15301f805
$$ 220129 275908 -123086 387335 75042 203670 -5006 -296919 -97340 -11351 515301 -6805
12855d7701C03866A28460h4653A60888c3268C09104j21766a19234G7018J543b1856
$$ -47701 303866 128460 -84653 160888 -33268 309104 187338 -119234 77018 78561 -21856
12843B99827A28917J67801O4089A70651a67099M3480C2504K01247A02555a9691
$$ 299827 128917 296718 360807 170651 -167099 -123619 32504 233751 102555 -19691
12832A7167J62289r75D7589O9619N8469a05462C04639b84966j2182e0832j26894
$$ 17167 179456 178481 47589 117208 175677 -105462 304639 -284966 -297148 -50832 -177726
12821a77726C1397L46431b85345a34841A19032C6635a66994j10033G2860g3949
$$ -177726 31397 377828 -285345 -134841 119032 36635 -166994 -277027 72860 -73949
12810b53741F5331L79649c5161A15539B9446a20403k52458B24844j04166i4860
$$ -253741 65331 444980 -35161 115539 29446 -120403 -372861 224844 120678 -94860
12799b24888e5335m3304j08948N9283H4255b3751k1323I6390J58172a94972A55826
$$ -224888 -55335 -98639 -207587 -148304 84255 -23751 -45074 96390 254562 -194972 155826
12787a09567B01528o0863a37401A4970a62798A56173p7158b63063C3852a24533
$$ -109567 201528 140665 -137401 14970 -162798 156173 79015 -263063 33852 -124533
12776b06736Q1207c1883G6774a9327j62929C39737g5129A16999N7575L1849K7786
$$ -206736 -125529 -31883 76774 -19327 -182256 339737 -75129 116999 174574 206423 234209
12765B34209a16173c7588A44527h4261j20779A34180a6037H9767J01237k0659
$$ 234209 -116173 -37588 144527 -84261 -205040 134180 -16037 89767 191004 170345
12755A70345K080m8493o1151b05099b0191l31873A29237B9159b4086A55330J24992
$$ 170345 172425 123932 62781 -205099 -20191 -352064 129237 29159 -24086 155330 280322
12744B80322i8968C89141f0766C758b63632d9829D8608L2057l8756c17060J57498
$$ 280322 -98968 389141 -60766 3758 -263632 -49829 48608 80665 41909 -317060 -159562
12733a59562A10100b17310B09132C3056L34233q2874b1687l9449A61165K1991
$$ -159562 110100 -217310 209132 33056 367289 284415 -21687 -61136 161165 183156
12723A83156b97894B71278p707A4735b15216A73190a43791D43244B0764I183K74077
$$ 183156 -297894 271278 263571 14735 -215216 173190 -143791 443244 20764 9183 283260
12712B83260B4631L05310G9570J20035J21982J05320j67405K43446A8360L26919
$$ 283260 24631 329941 79570 199605 321587 426907 259502 502948 18360 345279
12702C45279C1193M22082a69323A99813p2957L51084b7003j92382D8600K55901
$$ 345279 31193 453275 -169323 199813 126856 477940 -27003 -219385 48600 304501
12692C04501k5523d5490A36371a452A57128n5674J46305a57187A73724C523O7136
$$ 304501 278978 -45490 136371 -1452 157128 101454 247759 -157187 173724 3523 70659
12681G0659c8991C8815J60447J33412F331Q2068a11350A22222C7158r577b11913
$$ 70659 -38991 38815 199262 332674 6331 88399 -111350 122222 37158 27581 -211913
12669A78726K2118j8538M1302I603Q9895H36J70113a93959I4100k9563q056N6912
$$ 178726 200844 182306 223608 9603 99498 836 170949 -193959 94100 64537 56481 113393
12657A13393L42439j40269k545A10454i3990B40820b65016a9683A57135j467b14679
$$ 113393 455832 315563 313018 110454 -93990 240820 -265016 -19683 157135 155668 -214679
12645d3848p5093D7711c2257A26014a32016A00648f0887H6820J33108H4797K71328
$$ -43848 -118941 47711 -32257 126014 -132016 100648 -60887 86820 219928 84797 356125
12634C56125A23327J06419K9002H0810J43879R6259J10230G0408L38733j97389
$$ 356125 123327 229746 258748 80810 224689 320948 431178 70408 409141 211752
12624B11752o2715L37106j3505D0407K03675f9746F3566a1427B9150c1869B13704
$$ 211752 149037 486143 472638 40407 244082 -69746 63566 -11427 29150 -31869 213704
12612C7605e7785I6336H900P4884c9823C82026G9816N3276a22845C52233j4891
$$ 37605 -57785 96336 8900 83784 -39823 382026 79816 133092 -122845 352233 337342
12601C37342J6142c9436D14323A14423E2255J61593g5830n1675D4935K4852R1578
$$ 337342 353484 -39436 414323 114423 52255 213848 -75830 -127505 44935 69787 161365
12590A61365b9582E733c6718C19387A53717h3209I2841C3649M7320i2551j07489
$$ 161365 -29582 5733 -36718 319387 153717 -83209 92841 33649 80969 -92551 -200040
12579b00040A10091b00735C2477d498l3534B35928F7097a90819H1323C5609i5419
$$ -200040 110091 -200735 32477 -4498 -38032 235928 67097 -190819 81323 35609 -95419
12567B42912H404R2185f0918k17549A60179d2938q9182H5092a01974D3715N9266
$$ 242912 8404 100589 -60918 -278467 160179 -42938 -132120 85092 -101974 43715 102981
12556A02981k7303L8880a58132a9894k6095A01607l9079k4791b86362C8148e7960
$$ 102981 75678 114558 -158132 -19894 -45989 101607 62528 37737 -286362 38148 -57960
12544A18389h638k09035B4503g1755B86799K28165j96198B6529L27225m0114b47471
$$ 118389 -8638 -217673 24503 -71755 286799 514964 318766 26529 353754 313640 -247471
12532a58962D01775A56386m5912B6421f8165H0221J09885G5987c7067k28701f8864
$$ -158962 401775 156386 110474 26421 -68165 80221 190106 75987 -37067 -265768 -68864
12520A04606B5111Q3005A9731b97793A27651J43946j15484a34496j24602a24758
$$ 104606 25111 108116 19731 -297793 127651 271597 156113 -134496 -259098 -124758
12509B0896F853J32873g0563G4866J85012P2105A06998a27674a7951B07224m8475
$$ 20896 6853 139726 -70563 74866 259878 331983 106998 -127674 -17951 207224 158749
12498A58749f5861A52031h3633H0693d6604B02J87104f3646J3603j25135C858
$$ 158749 -65861 152031 -83633 80693 -46604 202 187306 -63646 -50043 -175178 3858
12486I348i0301A57883F5800g3096A59101A7925Q8443a68631A97879e6697K542
$$ 9348 -90301 157883 65800 -73096 159101 17925 106368 -168631 197879 -56697 -54155
12475e4155l91592A14275b71284i0751F9469K64287a40060A86080g225D3276a98511
$$ -54155 -445747 114275 -271284 -90751 69469 333756 -140060 186080 -7225 43276 -198511
12463g3708A029K0737g6136j47910J11788B51412e8509B6931a1254A58219d2489
$$ -73708 1029 21766 -76136 -224046 -112258 251412 -58509 26931 -11254 158219 -42489
12451b56308A80815b2786A7884h2196H8535c97658A08993E1728P1870c53572J68231
$$ -256308 180815 -22786 17884 -82196 88535 -397658 108993 51728 123598 -353572 -185341
12440a85341A31789A5568J57185o7423a23286k4166A93051n4494l0934d8063j08009
$$ -185341 131789 15568 172753 105330 -123286 -147452 193051 138557 107623 -48063 -156072
12429a56072m7793c2614j9385D9521K40906A41275d1942o3368a6877j7351j98151
$$ -156072 -203865 -32614 -51999 49521 290427 141275 -41942 -105310 -16877 -34228 -232379
12418b32379E2195c19678B42869b03445C96188d4231C0546L417g0881C1171a61650
$$ -232379 52195 -319678 242869 -203445 396188 -44231 30546 33963 -70881 31171 -161650
12406A82231a80564p924b6585o5795j26639A66050b39336A51378K4413n6571N3249
$$ 182231 -180564 -188488 -26585 -92380 -219019 166050 -239336 151378 175791 119220 172469
12395A72469a61667C67408A15122J15234I5446b14950O4303B45965a46851m6837
$$ 172469 -161667 367408 115122 230356 95446 -214950 -150647 245965 -146851 -193688
12385a93688B07434F4488L0465a46504A48787a74833f3843l8840B54171C5675
$$ -193688 207434 64488 94953 -146504 148787 -174833 -63843 -102683 254171 35675
12374C9671K30579b92337O0580h5758C28700c4644r620k82719f0130B21238m1078
$$ 39671 270250 -292337 -231757 -85758 328700 -34644 -44264 -326983 -60130 221238 180160
12363A80160D9637f7221B85551j22547b01116O2639M9864A08039J681a79641L8321
$$ 180160 49637 -67221 285551 163004 -201116 -138477 -88613 108039 109720 -179641 -141320
12352a41320j00245N014D1430J78287A954K31586G6898O3480a9463j4222A10939
$$ -141320 -241565 -236551 41430 219717 1954 233540 76898 140378 -19463 -33685 110939
12340A77289J5489n3581k6299A186J34691g3995A14957b8855H9981Q6016l1428
$$ 177289 192778 139197 112898 1186 135877 -73995 114957 -28855 89981 175997 144569
12329A44569O4948J31351a64783d6042C77972G4552J34455b1105H1514b5277C5871
$$ 144569 209517 340868 -164783 -46042 377972 74552 209007 -21105 81514 -25277 35871
12317B0142L5426J18897G4900P5969D9016J28586a3563A73158h4599b8886D4308
$$ 20142 55568 174465 74900 150869 49016 177602 -13563 173158 -84599 -28886 44308
12305A60464a67980B48706f5422B5846K09497b37707E4346J8562j6522a54867
$$ 160464 -167980 248706 -65422 25846 235343 -237707 54346 72908 56386 -154867
12294E7232J58182Q1101q7924b74052A42557a44071A7746b81556E14496a67586
$$ 57232 215414 296515 208591 -274052 142557 -144071 17746 -281556 514496 -167586
12283B43674c02690B22194J814a06666L6449C0485a77763j1587B9075O1578K70848
$$ 243674 -302690 222194 224008 -106666 -70217 30485 -177763 -189350 29075 90653 361501
12272C61501I4113a32171B6619K11198N9815A5383J15394m2928O7489a30715e3160
$$ 361501 94113 -132171 26619 237817 297632 15383 130777 87849 155338 -130715 -53160
12260a06612C036b09712A10465b03327G8551K14869r3568a67139F1851P0475n7283
$$ -106612 3036 -209712 110465 -203327 78551 293420 199852 -167139 61851 132326 75043
12249G5043h1132E2102c1704A0019a16543k9944e3848G8539M2891J6117B3807
$$ 75043 -81132 52102 -31704 10019 -116543 -146487 -53848 78539 121430 137547 23807
12237B34253R2982j42487G6638N6194q029K14645j14686O3671J7602i9416A27827
$$ 234253 327235 184748 76638 132832 124803 339448 224762 288433 306035 -99416 127827
12225C97691A88744j2880e1068C65302f0835C0180D253J59635L8202b01389a9961
$$ 397691 188744 175864 -51068 365302 -60835 30180 4253 163888 202090 -201389 -19961
12213E2253o999K55388d9402A76315H4139L0293K02838H2281K703O1296N2407
$$ 52253 45254 300642 -49402 176315 84139 114432 317270 82281 84984 146280 198687
12202A98687a36460B36494d4872B51108N780d6517B66409e4815B62600P5165a10774
$$ 198687 -136460 236494 -44872 251108 256888 -46517 266409 -54815 262600 337765 -110774
12190A35139J48368A37479J3906h084j88115A2984L60457D1163J16902c13928
$$ 135139 283507 137479 151385 -8084 -196199 12984 373441 41163 158065 -313928
12179A62295p0412J71248M518J0301N4478a67938A28585K49971j48110n196J57960
$$ 162295 91883 263131 267649 277950 332428 -167938 128585 378556 230446 225250 383210
12168C83210E1415N3016J97855j251j6727a9037C01933f5788j27718B05953G2100
$$ 383210 51415 104431 302286 301035 284308 -19037 301933 -65788 -193506 205953 72100
12156b96733Q0600D5902J49054k1610c08618a41517J2422A22632E8571f4984D77006
$$ -296733 -216133 45902 194956 173346 -308618 -141517 -129095 122632 58571 -64984 477006
12144A25425a23582D6968J8770M8411L8858h7124k2123B36415D4688i4565j99173
$$ 125425 -123582 46968 65738 114149 153007 -87124 -109247 236415 44688 -94565 -293738
12133b93738A03982M7173i5468J3500D1311a8742L358A6491e0720j5833l827C9547
$$ -293738 103982 151155 -95468 -81968 41311 -18742 -15384 16491 -50720 -66553 -70380 39547
12120G0138K92371a25577P693n3293B15225a07300m7942A82023c61673f1501B08852
$$ 70138 362509 -125577 -117884 -171177 215225 -107300 -155242 182023 -361673 -61501 208852
12108A2969J03942D3045d49756e4611B70323K567a64592M6224C2853J48651e7333
$$ 12969 116911 43045 -449756 -54611 270323 272890 -164592 -118368 32853 181504 -57333
12096a8064m2216n9872A55239e5255k08865A87259a06434b2994k52240a20977
$$ -18064 -60280 -120152 155239 -55255 -264120 187259 -106434 -22994 -275234 -120977
12085D4716e6927C36724D4077M7530J92313L43379O28260N383l54054A20345N1029
$$ 44716 -56927 336724 44077 91607 283920 627299 1255559 1260942 906888 120345 171374
12074A71374n7876j6182B2092K95628a36951M8014A12521n0491d7509m4038H0595
$$ 171374 113498 97316 22092 317720 -136951 -88937 112521 62030 -47509 -91547 80595
12062h1597A64872P5761g5168c1559C0394K8573b9144F2769J90157G5759j7594
$$ -81597 164872 240633 -75168 -31559 30394 58967 -29144 62769 252926 75759 58165
12051E8165O3681i136A25950M6789c4115n2772A72727e4787B9374L81036c31939
$$ 58165 121846 -9136 125950 172739 -34115 -86887 172727 -54787 29374 410410 -331939
12039C0207d5045B28092n0567b73261a6573j43246E2196G206b08645A44486C4705
$$ 30207 -45045 228092 177525 -273261 -16573 -159819 52196 7206 -208645 144486 34705
12027b34045B9799b13292A2542a16510c3010a4375C79442D5828J95825a67677
$$ -234045 29799 -213292 12542 -116510 -33010 -14375 379442 45828 241653 -167677
12016b18775B23618e0190A25333g6222k94131a19780B07504a13578a7022j46787
$$ -218775 223618 -50190 125333 -76222 -370353 -119780 207504 -113578 -17022 -163809
12006a63809k10169A8192h0167J6150H1632a07587f06j0399A83107K03898E1187
$$ -163809 -373978 18192 -80167 -64017 81632 -107587 -606 -11005 183107 387005 51187
11994A79988E9943J77681a84094P8712B47696G591e4607E9474h5891a8022o9412
$$ 179988 59943 237624 -184094 -105382 247696 7591 -54607 59474 -85891 -18022 -87434
11983h7434B47671i2774A4629a01979k33928a55211B470L08494n1143k4874a96642
$$ -87434 247671 -92774 14629 -101979 -335907 -155211 2470 310964 259821 234947 -196642
11971b48475m2209J13874b4558k3588l55151B87108j23988K01242h7671j95479
$$ -248475 -290684 -176810 -24558 -48146 -403297 287108 163120 364362 -87671 -283150
11961b83150n4840B72349a184k0957j64327D3753J07804f4303a1888r0027G8872
$$ -283150 -337990 272349 -1184 -22141 -186468 43753 151557 -64303 -11888 -101915 78872
11949b15116I3511c8247C80820c6194F4684K54915q7340B1483a15138N5356J7171
$$ -215116 93511 -38247 380820 -36194 64684 319599 232259 21483 -115138 -59782 -42611
11938d2611B04843f5134G3304D126N440J02608A0795J55019M9307e2596A4236
$$ -42611 204843 -65134 73304 4126 9566 112174 10795 165814 215121 -52596 14236
11926a44475K3190p1158F0766f6447F6676k0772a69504B93140b555r1763b1375
$$ -144475 -121285 -192443 60766 -66447 66676 45904 -169504 293140 -2555 -94318 -21375
11914a72797j79570B849K90775b65946A60700c7427F9717K1263m062J13674L1645
$$ -172797 -352367 2849 293624 -265946 160700 -37427 69717 90980 86918 200592 232237
11903B32237b35859Q1881e0335E2953a69247C8809b1407E7712d9101r9134B9827
$$ 232237 -235859 -153978 -50335 52953 -169247 38809 -21407 57712 -49101 -148235 29827
11891C99467J1663j06803f3301E8674c02695k0901B21103a17371B26762H7412
$$ 399467 411130 304327 -63301 58674 -302695 -323596 221103 -117371 226762 87412
11880c86248A55687B1289J20745M4202a31494M3516A24696k6205L0540m6085O117
$$ -386248 155687 21289 142034 186236 -131494 -87978 124696 98491 129031 82946 89063
11869H9063a27176D6866A1935a37273C2986a77126h4908j76465Q6802b6950k4407
$$ 89063 -127176 46866 11935 -137273 32986 -177126 -84908 -261373 -174571 -26950 -51357
11858e1357I0256e107q9597j81851g02o7709C46624g3014B32695a99184B4357
$$ -51357 90256 -5107 -94704 -276555 -702 -68411 346624 -73014 232695 -199184 24357
11846g9046A75671b4876l10796a2732m1450j30555A5593b01370H3253M1781d5018
$$ -79046 175671 -24876 -335672 -12732 -54182 -184737 15593 -201370 83253 125034 -45018
11834b11929J0673d5659l8224A86197A66h84344c68064g5470I175a09014C4531
$$ -211929 -201256 -45659 -83883 186197 166 -884344 -368064 -75470 9175 -109014 34531
11822a82005l7563k93606a59620J4504L5635H3202b01473A01327j3518a12729
$$ -182005 -219568 -513174 -159620 -145116 -109481 83202 -201473 101327 87809 -112729
11811b04959F956Q7233D4941b16379i3852B93246g5844m7582l7797d2581D4911
$$ -204959 6956 94189 44941 -216379 -93852 293246 -75844 -123426 -161223 -42581 44911
11799d44472A61573d0936m1253C6601J00343c07893B18738h5203G4319A6489a07046
$$ -444472 161573 -40936 -82189 36601 136944 -307893 218738 -85203 74319 16489 -107046
11787a22947N3584A99551G762a85A04147N744b47604L858C09905J11311G1838
$$ -122947 -69363 199551 7762 -185 104147 109891 -247604 -243746 309905 421216 71838
11775b97792M2598A46954D4709b7894j75214J6810Q7847B72612a83652k98183
$$ -297792 -255194 146954 44709 -27894 -203108 -186298 -98451 272612 -183652 -481835
11765d81835E6024b13084a9098H8083k0353M8119e9991j50544i611C5389P2418
$$ -481835 56024 -213084 -19098 88083 67730 115849 -59991 -210535 -9611 35389 107807
11754A07807J26430o2285N2013M4432g7558a4570H4729d44794P9140A76761a40667
$$ 107807 234237 171952 223965 268397 -77558 -14570 84729 -444794 -365654 176761 -140667
11742A56908a25480K7972A54018n7637a30277M1331F4870J41614r2819b94515
$$ 156908 -125480 -97508 154018 96381 -130277 -88946 64870 206484 113665 -294515
11731A65618G7921a74735j4753H0889b67434b5974B83073a73862d5395n1390A50730
$$ 165618 77921 -174735 -189488 80889 -267434 -25974 283073 -173862 -45395 -96785 150730
11719B14813A3185M7597a45777j1829J5742I2603J83578n8282c2725D0366d3590
$$ 214813 13185 60782 -145777 -157606 -141864 92603 276181 217899 -32725 40366 -43590
11707A24338b7738k99148C93885A90113a26613A26828a17084K0919q906C38783
$$ 124338 -27738 -326886 393885 190113 -126613 126828 -117084 -96165 -105071 338783
11696H4065g2815m66870b0282B74924L00181G7600h8562m5441B0638c5741k06503
$$ 84065 -72815 -539685 -20282 274924 575105 77600 -88562 -134003 20638 -35741 -242244
11685b42244B52707C4309K1047b20252k0012C19618A38712K05368a01105D5916
$$ -242244 252707 34309 55356 -220252 -240264 319618 138712 344080 -101105 45916
11674A31818k5783a14306B27329a45671A41693J68423D065a52447F6861d4208
$$ 131818 106035 -114306 227329 -145671 141693 310116 4065 -152447 66861 -44208
11663b19064e3923B46662G4423M1435K13861A04428j174l8755R0856B4633h552
$$ -219064 -53923 246662 74423 115858 329719 104428 103254 64499 155355 24633 -8552
11651b0840I6242P6961A7445L04648c9216F8741J06048f8863o0217A52425K6406
$$ -20840 96242 173203 17445 322093 -39216 68741 174789 -68863 -129080 152425 178831
11640A78831J20500G6543J25015a50523A12409M8506g354A31937D3442K1164K17402
$$ 178831 299331 76543 201558 -150523 112409 160915 -7354 131937 43442 64606 282008
11629B82008c02906B12854b0266k47714A96641b9551B94861a4137A90094C2193
$$ 282008 -302906 212854 -20266 -267980 196641 -29551 294861 -14137 190094 32193
11618A9586b1314j85963B08853d9295l6221C9162R314a23916C9069a47355B15730
$$ 19586 -21314 -207277 208853 -49295 -85516 39162 48476 -123916 39069 -147355 215730
11606e0228K4215G4182K9125C4142b56943O448B38578j06018K1433k0680N45709
$$ -50228 -26013 74182 103307 34142 -256943 -250495 238578 132560 153993 133313 679022
11595F79022A73858L15268I0842a73807H1342a00207H7961G883f2196d507C51169
$$ 679022 173858 489126 90842 -173807 81342 -100207 87961 7883 -62196 -4507 351169
11583B63557n3294r6600b59316G8166A3083N8822j0588a35881A42121O7624P695
$$ 263557 210263 113663 -259316 78166 13083 71905 61317 -135881 142121 209745 217440
11572B17440D2837f6859E6180K15027a8560A05533i6533B74515D1996a44958B93057
$$ 217440 42837 -66859 56180 271207 -18560 105533 -96533 274515 41996 -144958 293057
11560B53573j13989l0123i677A05969a34739M0633A1283K47469P1375g5818p6058
$$ 253573 139584 109461 -9677 105969 -134739 -94106 11283 258752 330127 -75818 -151876
11549a51876A34874d3740j570F8046J00365B0230P3388M5339d5997C75077A22317
$$ -151876 134874 -43740 -45310 68046 168411 20230 93618 138957 -45997 375077 122317
11537A99318b4113E6636h503B36230j16697j0115f1986J1300A44289J71755A40313
$$ 199318 -24113 56636 -8503 236230 119533 109418 -61986 -50686 144289 316044 140313
11525e6631B22604J83421D2108P4378f2701A49028c27035H2516a16047N6019j12219
$$ -56631 222604 406025 42108 116486 -62701 149028 -327035 82516 -116047 -60028 -172247
11514a72247C44703j50795l5737B9152b783B09248j3787f9638E3005K254J01365
$$ -172247 344703 193908 158171 29152 -2783 209248 195461 -69638 53005 55259 156624
11503A56624Q1524b8190C55985A50008N4101m4866Q4828a02923E3424K07637g7896
$$ 156624 238148 -28190 355985 150008 204109 159243 244071 -102923 53424 261061 -77896
11491A53917a67157N6491A66815a73294P9408A28140o1370q901J26150J06842
$$ 153917 -167157 -110666 166815 -173294 -93886 128140 66770 57869 184019 290861
11481B90861a8802I2460a4136C5485J1780h1949C2926J98518n0842p1176Q0486
$$ 290861 -18802 92460 -14136 35485 47265 -81949 32926 231444 180602 109426 189912
11470A89912q2231K5225K54545a57766E9406J04122j3495k4811J1362e7261A95117
$$ 189912 107681 132906 387451 -157766 59406 163528 150033 125222 136584 -57261 195117
11458B0002b04892D53404b26572B50316A0418K7207c66971d7821k6776D4854b84961
$$ 20002 -204892 453404 -226572 250316 10418 37625 -366971 -47821 -74597 44854 -284961
11446G822c2264r2085E2704k5702L6676A5381g3651H9179a23802C62591n4543
$$ 7822 -32264 -124349 52704 27002 63678 15381 -73651 89179 -123802 362591 308048
11435C08048b67325A65217R3800j2905A10663e1983i083j26647o3707A81319H5821
$$ 308048 -267325 165217 259017 246112 110663 -51983 -9083 -135730 -199437 181319 85821
11423A21129J58832a0525C22077B7159a30057B0075J83281m1809a29330j31752
$$ 121129 279961 -10525 322077 27159 -130057 20075 203356 161547 -129330 -261082
11413b61082D5908a43824A27198i0966p5520A96823a11682e2348n0645j23299
$$ -261082 45908 -143824 127198 -90966 -166486 196823 -111682 -52348 -102993 -226292
11403b26292A92258N8288a45517A29030L5463b27811B8328J95189c4911A39423
$$ -226292 192258 250546 -145517 129030 164493 -227811 28328 223517 -34911 139423
11392a4161j24466A61344f1851B23031G8631e8243A0591b85312J19953G1608f7512
$$ -14161 -138627 161344 -61851 223031 78631 -58243 10591 -285312 -165359 71608 -67512
11380B33312i5176J7298a757C01959b7611B22326F6616c54299e4593F4586K25476
$$ 233312 -95176 -77878 -1757 301959 -27611 222326 66616 -354299 -54593 64586 290062
11369B90062d6319M908A2379a28119N0726k90631c5399m47315A43076c7605A54128
$$ 290062 -46319 -41411 12379 -128119 -77393 -368024 -35399 -482714 143076 -37605 154128
11357c20682C7859b18713D4950J45385i201m1016j47863A89485k3137a14800B33341
$$ -320682 37859 -218713 44950 190335 -9201 -50217 -198080 189485 166348 -114800 233341
11345e9035A57951b72486A19320O1317p7992C8092J29302K1523a0118n1357E8442
$$ -59035 157951 -272486 119320 180637 102645 38092 167394 188917 -10118 -61475 58442
11333A06219a72197A43642k6088b4220I4254q941i5475A26134P9353B7402M6332
$$ 106219 -172197 143642 117554 -24220 94254 85313 -95475 126134 205487 27402 73734
11322G3734L996c0802k0929l3160B56661I2755l2061L6387a25527A08595c22157
$$ 73734 77730 -30802 -51731 -84891 256661 92755 60694 97081 -125527 108595 -322157
11310d27473A17892a8413F1197j9306K32364c9064A3122a09139A14334b13984
$$ -427473 117892 -18413 61197 41891 274255 -39064 13122 -109139 114334 -213984
11299A36150a5337j46179b4144j17256J5746A1015g2053J6830I47O5538i9887
$$ 136150 -15337 -161516 -24144 -141400 -125654 11015 -72053 -55223 947 66485 -99887
11287a94380D1942M9616l3149a60198A07148g2991n0073k57614A55966c07666
$$ -194380 41942 91558 58409 -160198 107148 -72991 -123064 -380678 155966 -307666
11276A37099a48151G2642b18552B1848G104b6508j73266n4180D4307J04415f3796
$$ 137099 -148151 72642 -218552 21848 7104 -26508 -199774 -253954 44307 148722 -63796
11264g6735q6883P5542A41670D9373J09675b61501O1953D5051J10748b7144E952
$$ -76735 -163618 -88076 141670 49373 159048 -261501 -199548 45051 155799 -27144 5952
11252b16780D81074a93622h7842f184C64109b57065N917q6104g5587A64772G2672
$$ -216780 481074 -193622 -87842 -6184 364109 -257065 -251148 -337252 -75587 164772 72672
11240A50000n6189K416g5336n3292G2068e3626A1096f5462j81489a6537A22505
$$ 150000 93811 96227 -75336 -128628 72068 -53626 11096 -65462 -246951 -16537 122505
11228G7497A9602b04985B6224f4998k47940g2890J1477K5576A05403a59093f3537
$$ 77497 19602 -204985 26224 -64998 -312938 -72890 -61413 -35837 105403 -159093 -63537
11216D1521O3902C8273A8783K14450n2163a29948A59631b14460o1160C66781b33680
$$ 41521 105423 38273 18783 233233 181070 -129948 159631 -214460 -275620 366781 -233680
11204c8934B13240b04091a5661D8490K39068I6569a72266r5183m469P9923A07858
$$ -38934 213240 -204091 -15661 48490 287558 96569 -172266 -267449 -271918 -191995 107858
11192f0844B267e3076k20965J31800f5110A85093c1830J2217f346F6371K0654
$$ -60844 2267 -53076 -274041 -142241 -65110 185093 -31830 -19613 -6346 66371 87025
11181H7025d69406A29707i4089B12488b41581g7277A0272Q945K12886C4439K4581
$$ 87025 -469406 129707 -94089 212488 -241581 -77277 10272 19217 232103 34439 59020
11170E9020b88661J32620o7306A21039a8144A31016J26308a38245A35259c9910
$$ 59020 -288661 -156041 -223347 121039 -18144 131016 257324 -138245 135259 -39910
11159c00966B84027i8923j67805a2410I2308L10706h6854l3418j32126G4316J97893
$$ -300966 284027 -98923 -266728 -12410 92308 403014 -86854 -120272 -252398 74316 272209
11148B72209f1581b0137k3691j71818a4039l19445j01665I7561f5810Q571j73134
$$ 272209 -61581 -20137 -43828 -215646 -14039 -333484 -435149 97561 -65810 -57239 -230373
11137b30373g098A85309f3910B28496A6401a61329P0198F3658M43915I2697a7927
$$ -230373 -7098 185309 -63910 228496 16401 -161329 -91131 63658 507573 92697 -17927
11125A60234m2471L0115B0062g6658D31819C8411a409C08129E186b43727l2892
$$ 160234 117763 147878 20062 -76658 431819 38411 -1409 308129 5186 -243727 -276619
11114b76619B10830a48292N2666C35492a85967g8880A20765M88007k54799a08280
$$ -276619 210830 -148292 -95626 335492 -185967 -78880 120765 608772 353973 -108280
11103D1741J22373h1399B01073P7161E62i6330C39769j35086g6462D01884L519
$$ 41741 164114 -81399 201073 278234 562 -96330 339769 204683 -76462 401884 405403
11092D05403j24222K1107O6498C8201J67972R5757m58I9185D7887K29486N5617
$$ 405403 281181 302288 368786 38201 206173 301930 301472 99185 47887 277373 332990
11081C32990J52683g9136B61917A06337P9288K61251A91176K2017J5138p4851
$$ 332990 485673 -79136 261917 106337 185625 446876 191176 213193 228331 153480
11071A53480J32206A05406K59283L4777A19017Q9451J69226j77215m9518J71668
$$ 153480 285686 105406 364689 399466 119017 208468 377694 200479 150961 322629
11061C22629P4601O5121p1674j71682Q7390J55801l1729J62554k4658j48951q6326
$$ 322629 397230 462351 390677 218995 306385 462186 430457 593011 568353 419402 333076
11050C33076L10743L04900k41503R2355C11971L20151J33502K8690j63166K82445
$$ 333076 643819 948719 707216 799571 311971 632122 765624 794314 631148 913593
11040I13593j49512j37541k32354L72826k78677r4012L98898l00566P1053J9217
$$ 913593 764081 626540 394186 767012 488335 394323 793221 492655 563708 582925
11030E82925k39648K3208K18596J0656K09906J55232k65310J16723j92194J03350
$$ 582925 343277 366485 585081 595737 805643 960875 695565 812288 620094 723444
11020G23444m3458A76898N60676o0429L22694D50884L04163k98962R646K37789
$$ 723444 679986 176898 737574 677145 999839 450884 755047 456085 465731 703520
11010G03520j30755j06544L16625k08382n5996J2021J02238l3870J37797r2141
$$ 703520 572765 466221 782846 574464 518468 530489 632727 598857 736654 644513
11000F44513M865J202B17796M21939k13269Q8178R9630m4012j03555K14423J65525
$$ 644513 649378 650580 217796 639735 426466 514644 614274 570262 466707 681130 846655
10989H46655q9713J9549N9973k6966o6251L8508j75261O43116k80385N7942L80810
$$ 846655 756942 776491 836464 809498 743247 781755 606494 1249610 969225 1027167 1407977
10978A407977k1059j26191N77697J13273J15625j16485L73597L4574J10324O280
$$ 1407977 1386918 1260727 1838424 1951697 2067322 1950837 2324434 2359008 2469332 2475612
10968B475612l86126j81410r4117j72421k7850k1500K791L94386l15259J39234
$$ 2475612 2089486 1908076 1813959 1641538 1613688 1592188 1594979 1989365 1674106 1813340
10958A813340l23995J71716j88522N7506m49084L89122l2365l71140K7998n10662
$$ 1813340 1489345 1661061 1472539 1530045 1080961 1470083 1437718 1066578 1094576 583914
10948E83914j37548o8181L48196l25137R0422q8405C2469a3873d719A50179L30225
$$ 583914 446366 378185 726381 401244 491666 403261 32469 -13873 -4719 150179 480404
10937D80404F4016a16952k5984B10073D3019J29577a64350D60223A14288n4666
$$ 480404 64016 -116952 -142936 210073 43019 172596 -164350 460223 114288 59622
10927E9622B9174R2155M439K8101c9242F847c331j62011A43225J99105a32164
$$ 59622 29174 121329 125768 153869 -39242 6847 -3331 -165342 143225 342330 -132164
10915b37213C46763j49162n2294e8354F3619J15613d5595C4333c2390f114D1416
$$ -237213 346763 197601 145307 -58354 63619 179232 -45595 34333 -32390 -6114 41416
10903a2294B47342a61610D5527K07259c1230B63399d9091F0583d5708o2546d7120
$$ -12294 247342 -161610 45527 252786 -31230 263399 -49091 60583 -45708 -108254 -47120
10891B25562p4160g5144k09339D7667i2262m437b0507A12670D8447J12304c6878
$$ 225562 151402 -75144 -284483 47667 -92262 -96699 -20507 112670 48447 160751 -36878
10879B14023e1854j6827k8552K8892B86901C4867J83977A00066D8077J66178d7495
$$ 214023 -51854 -68681 -97233 -68341 286901 34867 218844 100066 48077 214255 -47495
10867a5468k327I8958O0086E8441d54784B2919c93441a5090j45613D2035c5670
$$ -15468 -17795 98958 159044 58441 -454784 22919 -393441 -15090 -160703 42035 -35670
10855a55146C37468e8081l044o204A5811K13538C1021g5096p8937A93499J49394
$$ -155146 337468 -58081 -61125 -67329 15811 229349 31021 -75096 -154033 193499 342893
10844C42893O8368e503A20943Q3451O3537e9995j1401A19002e7210k9785l1024
$$ 342893 411261 -5503 120943 204394 267931 -59995 -71396 119002 -57210 -86995 -118019
10833a18019A10042J93449H7733P9833p5155o119J97921r8208a18618A03786c16654
$$ -118019 110042 303491 87733 167566 92411 86292 284213 186005 -118618 103786 -316654
10821F8007d030k60650f5970l6157k8426A10983a01404G1520a61668f2405K5557
$$ 68007 -4030 -264680 -65970 -102127 -130553 110983 -101404 71520 -161668 -62405 -36848
10810c6848O421k00549J13185d9518B52658c08566a02924k22248J39213O9279
$$ -36848 -30427 -230976 -117791 -49518 252658 -308566 -102924 -325172 -185959 -116680
10800a16680E8596L21293g2436E0471A4914i9868A86078e1469C47901b95102Q4703
$$ -116680 58596 379889 -72436 50471 14914 -99868 186078 -51469 347901 -295102 -210399
10789b10399H1510J22843e2873n0579m6889r2919a387F7177J15867E9520a16897
$$ -210399 81510 204353 -52873 -103452 -150341 -243260 -1387 67177 183044 59520 -116897
10777B9753J45829M1122G762a6498A97935g8430C29535a954r2554o9272k27192
$$ 29753 175582 216704 7762 -16498 197935 -78430 329535 -1954 -94508 -163780 -390972
10766c90972a8152q3675r2993N023r7031j0912C02954F9984J05052n2001a66629
$$ -390972 -18152 -101827 -194820 -189797 -286828 -297740 302954 69984 175036 123035 -166629
10754A934N3349e6749j64558j34652J01633d5145J7904l665F7382L48706h919
$$ 1934 55283 -56749 -221307 -355959 -254326 -45145 -27241 -30906 67382 416088 -8919
10742a78439a1753l8040C4569i1180B94039D010a62688b5346k2250H7972b16389
$$ -178439 -11753 -49793 34569 -91180 294039 4010 -162688 -25346 -47596 87972 -216389
10730b6879j17610I5021m5424P9535a96235n9061M5790Q3994b7178C5760a01663
$$ -26879 -144489 95021 49597 129132 -196235 -255296 -209506 -125512 -27178 35760 -101663
10718C87182A34343d1558p6309O167A97074a83079P6136I2597a71745B999d0276
$$ 387182 134343 -41558 -117867 -111700 197074 -183079 -106943 92597 -171745 2999 -40276
10706e4561B69043b66290i6970j12150A47863f0762j69585A49023i8317A66678
$$ -54561 269043 -266290 -96970 -209120 147863 -60762 -230347 149023 -98317 166678
10695h2506H7652a43658D71590c63904g9855R046L943k107b2355k33990a3367
$$ -82506 87652 -143658 471590 -363904 -79855 -70809 -66866 -68973 -22355 -256345 -13367
10683a17364J3160B94914B6115a07878b798j06630j87227a0220B6937b5937j55748
$$ -117364 -104204 294914 26115 -107878 -2798 -109428 -296655 -10220 26937 -25937 -181685
10672a81685j15564A08398b91471b2622C6052a72525C1224c37864J11466a8581
$$ -181685 -297249 108398 -291471 -22622 36052 -172525 31224 -337864 -226398 -18581
10661a27328j56312l7585G5152K35454A05186a7542D3118k1403e7794A5370j114
$$ -127328 -283640 -321225 75152 310606 105186 -17542 43118 21715 -57794 15370 14256
10650A4256K75427b64100m6662H0078A6737e3008j83872B2033D264b85495b723
$$ 14256 289683 -264100 -310762 80078 16737 -53008 -236880 22033 4264 -285495 -2723
10638a23784B24831k3306b49379D5414c3568I02d02376A514d5412A13699b88474
$$ -123784 224831 201525 -249379 45414 -33568 902 -402376 1514 -45412 113699 -288474
10626A22091c90981j03258e2946a9994k3281B2298d04740E9936c37897c158A6375
$$ 122091 -390981 -494239 -52946 -19994 -43275 22298 -404740 59936 -337897 -3158 16375
10614a87439A30708c73819J34724g2819b4659j2472k5864H5226b44432E3166Q218
$$ -187439 130708 -373819 -239095 -72819 -24659 -37131 -62995 85226 -244432 53166 61384
10603F1384b06046j06813e3175E0378a12745k26435a62697r2515e0745j02034
$$ 61384 -206046 -312859 -53175 50378 -112745 -339180 -162697 -255212 -50745 -152779
10593a52779B03709q4260a51312B3016i1301D8060K21968G283d5704a1973j35885
$$ -152779 203709 119449 -151312 23016 -91301 48060 270028 7283 -45704 -11973 -147858
10582a47858M2026J5592d1640E0151a47270D3474K8568Q8894A2856N0825a28074
$$ -147858 -105832 -90240 -41640 50151 -147270 43474 72042 160936 12856 63681 -128074
10570B32408a84773A15034e9612b1435H850L46253A7998c70607B63975d73A2504
$$ 232408 -184773 115034 -59612 -21435 8850 355103 17998 -370607 263975 -473 12504
10558g1312A86145c08197B26522C2498J15704a89553A6091b9570l0036A56790
$$ -71312 186145 -308197 226522 32498 148202 -189553 16091 -29570 -59606 156790
10547A4985b47255H5398e0509j615m48327f2489m28326G8340a05925B23391a62096
$$ 14985 -247255 85398 -50509 -52124 -500451 -62489 -490815 78340 -105925 223391 -162096
10535F5605k2605J60351b84656a07319e0128b2119R745j18020B08864A01723m6803
$$ 65605 43000 203351 -284656 -107319 -50128 -22119 -12374 -130394 208864 101723 54920
10524E4920O0376b13104I2075h2780B09796E5128J75171a39776A25575J38851
$$ 54920 115296 -213104 92075 -82780 209796 55128 230299 -139776 125575 264426
10514B64426E6540q485b42361h731j3575j62313H9691j894a71698j85301a05726
$$ 264426 56540 48055 -242361 -8731 -22306 -184619 89691 87797 -171698 -356999 -105726
10502A37401b38291q4966J4919f0694A96036n3375B5289J34266c21987B7501b14740
$$ 137401 -238291 -323257 -308338 -60694 196036 142661 25289 159555 -321987 27501 -214740
10490B22866f6118l1354A62482a22355b9356n2618b3358n880q4586A99477P7124
$$ 222866 -66118 -97472 162482 -122355 -29356 -81974 -23358 -29238 -113824 199477 276601
10479B76601q5318L70315A69812E7764M7317b4811j64260A71943F0851c1740k4988
$$ 276601 191283 561598 169812 57764 105081 -24811 -189071 171943 60851 -31740 -56728
10468e6728B83349g7150j34348C30594D0506i4645H6879Q4402K41555d2958j0068
$$ -56728 283349 -77150 -211498 330594 40506 -94645 86879 171281 412836 -42958 -53026
10457e3026J9356G09c53576J31046f5852k5114l1597c541B199N735f9898A81296
$$ -53026 -33670 709 -353576 -222530 -65852 -90966 -122563 -3541 2199 7934 -69898 181296
10444b00123e8019K5189D7418J65482m0590a60505B4769a79545K7132c2740m80636
$$ -200123 -58019 -32830 47418 212900 172310 -160505 24769 -179545 -152413 -32740 -513376
10433e13376a91359i395A75623J73967n6720C3160J33710E8141J59808c0012k7279
$$ -513376 -191359 -9395 175623 349590 292870 33160 166870 58141 217949 -30012 -57291
10422e7291J070B68517E2512J44024J84487a96086h0366b0923D5524J2871L22254
$$ -57291 -56221 268517 52512 196536 381023 -196086 -80366 -20923 45524 58395 380649
10411C80649d6772k10639f0911o7421C6977b04272B14184K01698c34398a52349
$$ 380649 -46772 -257411 -60911 -128332 36977 -204272 214184 415882 -334398 -152349
10400d8537j3453k34441e7845i92j55183g3089A38804b29151F8388O3918J4519
$$ -48537 -61990 -296431 -57845 -992 -156175 -73089 138804 -229151 68388 132306 146825
10389A46825M0975K4674a50444G5706P8427N9472B0016R2318f7119k8492J161
$$ 146825 187800 212474 -150444 75706 154133 213605 20016 112334 -67119 -95611 -94450
10378i4450E08022k08215r1552a0185j51974d635C30596m3355j2274J74366j74912
$$ -94450 508022 299807 208255 -10185 -162159 -4635 330596 287241 274967 449333 274421
10367B74421L83123k84587J68762A6956L64707A56281g7211B53949J33096j28043
$$ 274421 657544 372957 541719 16956 381663 156281 -77211 253949 387045 259002
10357B59002k6731n3756J47975A58706P5249m5011K66169L5354j06705K860J12920
$$ 259002 232271 178515 326490 158706 233955 188944 455113 490467 383762 386622 499542
10346D99542j13797Q2484N9731O7444f5184G8456b7312C81775j88916O9804a40805
$$ 499542 385745 468229 527960 595404 -65184 78456 -27312 381775 192859 262663 -140805
10334f3551A13567L09714n3440j43039J5333a20919B4027f7224G499N6845M8897
$$ -63551 113567 423281 369841 226802 242135 -120919 24027 -67224 7499 64344 113241
10323A13241C8513b1698A48753R3887a201H5532J472b58107A23252b5596h074
$$ 113241 38513 -21698 148753 242640 -1201 85532 87004 -258107 123252 -25596 -8074
10311A1381L16108a56324E9126a17810A06653a41884A11860b71597D11237e3788
$$ 11381 327489 -156324 59126 -117810 106653 -141884 111860 -271597 411237 -53788
10300C1781a68973A07702g6790k05426G6366O0143e3068A29308B117O7177K57647
$$ 31781 -168973 107702 -76790 -282216 76366 136509 -53068 129308 2117 69294 326941
10289C26941A17069c38551b7129j63558L5045g1113Q62I3525k5959J31655f2412
$$ 326941 117069 -338551 -27129 -190687 -155642 -71113 -70251 93525 67566 199221 -62412
10277c1904G9719N8874a53190c3943A19835J96672A43732a13069b9767j40856
$$ -31904 79719 138593 -153190 -33943 119835 316507 143732 -113069 -29767 -170623
10267a70623H0477K23290G8042P9097K28639G266L71833A85699M06559j00444
$$ -170623 80477 303767 78042 157139 385778 7266 379099 185699 592258 491814
10257D91814A5105P9826K71704P3126r3721O4638G1878C3132J83669e2001A54351
$$ 491814 15105 94931 366635 439761 346040 410678 71878 33132 216801 -52001 154351
10245A56706D7885K00385j18511n8495A9053b26982k637c1653C8948a58626n7510
$$ 156706 47885 248270 129759 71264 19053 -226982 -229619 -31653 38948 -158626 -216136
10234b16136d7878E7838a08127q2082A13779b44249B90642a0922B5849M7680A6625
$$ -216136 -47878 57838 -108127 -190209 113779 -244249 290642 -10922 25849 73529 16625
10222i1843j41584J03125D0618a83533h9528c8236D4618h0393A45177b00265d7641
$$ -91843 -233427 -130302 40618 -183533 -89528 -38236 44618 -80393 145177 -200265 -47641
10210h2484J33D7145K83856G3787a56706A00479f6652B03173E5059a16908B4605
$$ -82484 -82351 47145 331001 73787 -156706 100479 -66652 203173 55059 -116908 24605
10198I2446d4184k7244C39735a80072A09185C8534c20855C6624d1460G6161B0871
$$ 92446 -44184 -71428 339735 -180072 109185 38534 -320855 36624 -41460 76161 20871
10186h6538G6683J04758D1355g4958l462A6145M4507J1949b08480D8133J95581
$$ -86538 76683 181441 41355 -74958 -78420 16145 60652 72601 -208480 48133 243714
10175B43714r4525m1449J2329b2854l4788j5135p0952j884B6607b27781A69709
$$ 243714 149189 107740 120069 -22854 -57642 -72777 -143729 -145613 26607 -227781 169709
10163H8561O5659a55805b5998B5155b85393I6167j3196a96203a6362j21886j19737
$$ 88561 154220 -155805 -25998 25155 -285393 96167 82971 -196203 -16362 -138248 -257985
10152b57985B84508F5784C1462L1478c45948p0069B20852C4688b78202A7172J59189
$$ -257985 284508 65784 31462 62940 -345948 -416017 220852 34688 -278202 17172 176361
10141A76361g2351B82306A06184a39277o2466i2148a0701l0182A38708b04704
$$ 176361 -72351 282306 106184 -139277 -201743 -92148 -10701 -40883 138708 -204704
10130b48945A44500g6096C8980a59073j29638i7542A55716h7756e942A24481a27359
$$ -248945 144500 -76096 38980 -159073 -288711 -97542 155716 -87756 -5942 124481 -127359
10118A08762a27989j73822A54249F5773M3324a29631o0422N9940D1228k278A7438
$$ 108762 -127989 -301811 154249 65773 109097 -129631 -190053 -130113 41228 38950 17438
10106A13604a080k4077k65229J339J22517B85736b92168B9017e7223K1594k01327
$$ 113604 -1080 -25157 -290386 -289047 -166530 285736 -292168 29017 -57223 -35629 -236956
10095b36956J09837A81187a99255l805p617C376b70709N7638n4980A17247C5711
$$ -236956 -127119 181187 -199255 -203060 -210677 3376 -270709 -213071 -268051 117247 35711
10083A49386Q3435b6453A06582a03716K4361D138J28827a34384A31320e057k7990
$$ 149386 232821 -26453 106582 -103716 -79355 4138 132965 -134384 131320 -5057 -33047
10072c3047C01899f8095l16490c6884n8541J3247l94855J19874A32136J0318K0322
$$ -33047 301899 -68095 -384585 -36884 -95425 -82178 -477033 -357159 132136 142454 162776
10061A62776c26574A43085g7432q4446C77480H9101b94020A17301g5567l01628
$$ 162776 -326574 143085 -77432 -161878 377480 89101 -294020 117301 -75567 -377195
10051c77195a05212H8062c60414A18499a99018E1967d69153K02618A5146J05689
$$ -377195 -105212 88062 -360414 118499 -199018 51967 -469153 -266535 15146 120835
10041A20835C7972A6608b29684o7039f9606B04375R1396a95713p2235G326a62531
$$ 120835 37972 16608 -229684 -296723 -69606 204375 295771 -195713 -267948 7326 -162531
10029a51361B08992a01165C5493L0711B4435N9471b57048h3536l4277I5311C5644
$$ -151361 208992 -101165 35493 66204 24435 83906 -257048 -83536 -117813 95311 35644
10017A69301a57639d407l28106G0606a04733A69382E3658M7860d61791A44479
$$ 169301 -157639 -4407 -332513 70606 -104733 169382 53658 101518 -461791 144479
10006a86651j60432c1762j65007f9587A58467c10361G4410J2251b91619C4483
$$ -186651 -347083 -31762 -196769 -69587 158467 -310361 74410 86661 -291619 34483
9995a54451K0139O1522A45065B6358M60819A47993n472d9226F4030L1355C90a33893
$$ -154451 -134312 -72790 145065 26358 487177 147993 142521 -49226 64030 95385 390 -133893
9982i0901j03418c9963A36157h2905l25114J7821I7204K28922c80517J22356J05186
$$ -90901 -194319 -39963 136157 -82905 -408019 -390198 97204 326126 -380517 -258161 -152975
9971a52975f8673A07945l3246g4860A53275G6606a86088F3875c7301B39193H5409
$$ -152975 -68673 107945 74699 -74860 153275 76606 -186088 63875 -37301 239193 85409
9959A57104d0309A5558c22910P916f2272D1704e3848A93901e4204c907p8014l2347
$$ 157104 -40309 15558 -322910 -314994 -62272 41704 -53848 193901 -54204 -3907 -81921 -114268
9947a14268E7566j4684h8677A29682a31963p9974K1564M7666L6030f560j9593
$$ -114268 57566 42882 -88677 129682 -131963 -211937 -190373 -142707 -106677 -6560 -26153
9936b6153J0083k0868E7725R465b73301B1816a73790B19194g8415n4531m2585
$$ -26153 -16070 -36938 57725 67190 -273301 21816 -173790 219194 -78415 -132946 -175531
9925a75531f2868A24460o1250Q9792b49972e347J938A27522c98236a71848r9609
$$ -175531 -62868 124460 63210 153002 -249972 -5347 -3409 127522 -398236 -171848 -271457
9914b71457A74701E2766O2339D4860d04088A22337N3652a9322G9884a05438L0068
$$ -271457 174701 52766 115105 44860 -404088 122337 175989 -19322 79884 -105438 -75370
9903g5370j84103r6560Q5319a1599E7501g8179o4772A78342c38736A44020N6055
$$ -75370 -259473 -356033 -270714 -11599 57501 -78179 -142951 178342 -338736 144020 200075
9892B00075a31897L6325j79648A0034J0299e2085A96286c41889J04220K5903j41535
$$ 200075 -131897 -95572 -275220 10034 20333 -52085 196286 -341889 -237669 -211766 -353301
9881c53301d9042j75936j29764g1468m3619n1165j18380N2772A0387a33218j63575
$$ -353301 -49042 -224978 -354742 -71468 -115087 -166252 -284632 -231860 10387 -133218 -296793
9870b96793E7099i1461j07799L327g382I2884l1537a50607m7262B12696c9132
$$ -296793 57099 -91461 -199260 -195933 -7382 92884 61347 -150607 -197869 212696 -39132
9858a30185r9121Q9812k11684a39437k63789J67536c0494C20449a88418L313n689
$$ -130185 -229306 -139494 -351178 -139437 -403226 -235690 -30494 320449 -188418 -185105 -190794
9847a90794A41828o3039Q544h3364k77885a02500D826M3474A9436D833d2639D7837
$$ -190794 141828 78789 87333 -83364 -361249 -102500 4826 48300 19436 4833 -42639 47837
9834A47858E568a8434I6292b20030i8727M3520a4725q9069n8262F5557a13932
$$ 147858 5568 -18434 96292 -220030 -98727 -55207 -14725 -103794 -162056 65557 -113932
9822c8634l43399I9753a91163O71R0834A77478K10251a94069Q7791c8382A2224
$$ -38634 -382033 99753 -191163 -190492 -99658 177478 387729 -194069 -106278 -38382 12224
9810d43585A21244b45695f5177k03280a01218k80162C7889a70677B5670b4299
$$ -443585 121244 -245695 -65177 -268457 -101218 -381380 37889 -170677 25670 -24299
9799C15331C0872c7875A94506o0325c35174a59754N535O9165j16086r4771A52833
$$ 315331 30872 -37875 194506 134181 -335174 -159754 -154219 -85054 -201140 -295911 152833
9787e4570n7864F4967d5641p1690F0689J12702b11247A31652B822b30858f4391
$$ -54570 -112434 64967 -45641 -117331 60689 173391 -211247 131652 2822 -230858 -64391
9775B35392b55362f9835o723E8260J63774e5896j90106B0149b31751b7126R581
$$ 235392 -255362 -69835 -76558 58260 222034 -55896 -246002 20149 -231751 -27126 -17545
9764a7545j19288a2662J50l94233c0263k45165a7705p5661n0479q9340D4127c62744
$$ -17545 -136833 -12662 -12512 -406745 -30263 -275428 -17705 -93366 -143845 -233185 44127 -362744
9751a22022R822C1173R3391b03056C9525e6277b7365c881F682L2678c4699k1471
$$ -122022 -112200 31173 124564 -203056 39525 -56277 -27365 -3881 6682 39360 -34699 -56170
9739e6170J9445h939C849J44226a89832J3357L7820L5035M9581j64839B80591
$$ -56170 -36725 -8939 3849 148075 -189832 -176475 -138655 -103620 -54039 -218878 280591
9727h9886h388c570k72481m3188i0585H9080A6046J01049g1988l90082g7294D3246
$$ -89886 -8388 -3570 -276051 -319239 -90585 89080 16046 117095 -71988 -462070 -77294 43246
9714h9679q5041j919H930c99997A53266J52137I4116f0969j28930P9531p1133
$$ -89679 -174720 -176639 8930 -399997 153266 305403 94116 -60969 -189899 -110368 -181501
9703a81501k2540b7711m2591k13255i0329p6450A28400b26599D59555a41096E8068
$$ -181501 -204041 -27711 -70302 -283557 -90329 -166779 128400 -226599 459555 -141096 58068
9691A3702b64572C25290c5682I6644a71325B46211B2119A0256L4549O3545O9655
$$ 13702 -264572 325290 -35682 96644 -171325 246211 22119 10256 44805 108350 178005
9680A78005a29829j62419f6659H7669c1345F8289m277h4046r9136A9656i3123
$$ 178005 -129829 -292248 -66659 87669 -31345 68289 64012 -84046 -183182 19656 -93123
9668e7248C5760g6777j26294H6192a2317D0352i0655k29571d9440j3430B9190
$$ -57248 35760 -76777 -203071 86192 -12317 40352 -90655 -320226 -49440 -62870 29190
9656a23422j07935B18758a20541B08384a84633d4934j41561e0922o3111d7795
$$ -123422 -231357 218758 -120541 208384 -184633 -44934 -186495 -50922 -114033 -47795
9645B00972i9554r1690j17898g0304I0395a87598A34484d1018D3393R4117b10964
$$ 200972 -99554 -191244 -309142 -70304 90395 -187598 134484 -41018 43393 137510 -210964
9633A68826n1130a95772O6017B2720J0926b44024J17948e4757B1093J2714K0236
$$ 168826 117696 -195772 -129755 22720 33646 -244024 -126076 -54757 21093 33807 54043
9622E4043J26559c35451N3540r2273B6658c9893A26968a34474p0975B02425J83532
$$ 54043 180602 -335451 -281911 -374184 26658 -39893 126968 -134474 -205449 202425 385957
9611C85957b05997Q3239c7486l8859j21462F1198n558a00869N045j93245a38521
$$ 385957 -205997 -122758 -37486 -76345 -197807 61198 55640 -100869 -95824 -289069 -138521
9599F3430J26396a17927F9759b60388A10794b61586B3327O7493c09833A4516b3877
$$ 63430 189826 -117927 69759 -260388 110794 -261586 23327 90820 -309833 14516 -23877
9587a85580O9360m3630e2603K0926A98953c05580a36888c421l21490A61932e7789
$$ -185580 -116220 -159850 -52603 -31677 198953 -305580 -136888 -3421 -324911 161932 -57789
9575b39273a10828A40367J68511a51128l0616f2084A62629F9697k847J44584a75225
$$ -239273 -110828 140367 308878 -151128 -181744 -62084 162629 69697 66850 211434 -175225
9563c86733J49183J16234N0743j12336a641k62684K8353e7255A0454L2355b20557
$$ -386733 -237550 -121316 -70573 -182909 -1641 -264325 -235972 -57255 10454 42809 -220557
9551B12774m2876b02030I2294d21100J51696a6732A3660M3655b0497j80745J354
$$ 212774 169898 -202030 92294 -421100 -269404 -16732 13660 57315 -20497 -201242 -199888
9540a99888F8737J39692q5089c20300J30757D19323A29581c80918D2995d733j57133
$$ -199888 68737 208429 123340 -320300 -189543 419323 129581 -380918 42995 -4733 -161866
9529a61866B47190D8953L31744a68685a3725A52118b26734B2596N472M5580a65740
$$ -161866 247190 48953 380697 -168685 -13725 152118 -226734 22596 28068 73648 -165740
9517a05912j94375i5682d0663D0923R5791b56816g315p1829k08976A64164b09116
$$ -105912 -300287 -95682 -40663 40923 136714 -256816 -7315 -79144 -288120 164164 -209116
9505b20601j1430A07384b43316A47106c54323a56841e607o9798r5064p4153L3882
$$ -220601 -232031 107384 -243316 147106 -354323 -156841 -5607 -75405 -170469 -244622 -210740
9494b10740O4446f7185K9346l64178D7784R180a33090A50300b7410j8105j54408
$$ -210740 -146294 -67185 -37839 -402017 47784 56964 -133090 150300 -27410 -45515 -199923
9483a99923D2625K7539i452D7049a60272c9587l2395p0124k9403C4827a42934
$$ -199923 42625 70164 -9452 47049 -160272 -39587 -71982 -142106 -171509 34827 -142934
9471E1986N832d503C00593b24009m4934a05920a5942k23666A54000E0417c7128
$$ 51986 57818 -4503 300593 -224009 -268943 -105920 -15942 -239608 154000 50417 -37128
9459A12728a25411A37771i3789n1647c3225o1249n6840p3123A09505a51211j42445
$$ 112728 -125411 137771 -93789 -145436 -33225 -94474 -151314 -224437 109505 -151211 -293656
9448b93656E0895a75391B36170m003C7215c91736k3975G2318a43600c665k8661
$$ -293656 50895 -175391 236170 232167 37215 -391736 -415711 72318 -143600 -3665 -32326
9437c2326G724b07192F6698A5957J40564o7268K4575a55234O2761A1960d6418
$$ -32326 7724 -207192 66698 15957 156521 89253 113828 -155234 -92473 11960 -46418
9425h3241l20957F5587b9985H3970b90720Q3539g158o5929b2552n4849K6657J5001
$$ -83241 -404198 65587 -29985 83970 -290720 -207181 -7158 -73087 -22552 -77401 -50744 -35743
9413c5743r9092A46431a01735A37267j6967k845d0969m3299k7942k62640A69981
$$ -35743 -134835 146431 -101735 137267 120300 117455 -40969 -84268 -112210 -374850 169981
9401g5301D3920e48973K23631J23957C74576g9625l6965r3274e5721l86664a50360
$$ -75301 43920 -548973 -325342 -201385 374576 -79625 -116590 -209864 -55721 -442385 -150360
9389a4011r831B9616e7219j57157j48863a05649A92143C8186c9735k75805a00422
$$ -14011 -23842 29616 -57219 -214376 -363239 -105649 192143 38186 -39735 -315540 -100422
9377a93507E5135K17197i3572c5046k06541a16618L9756D54738A81045a25231
$$ -193507 55135 272332 -93572 -35046 -241587 -116618 -76862 454738 181045 -125231
9366A78456R8476e5991l1746k10330a3917j89406A41167b34936n7797A40948n7133
$$ 178456 276932 -55991 -87737 -298067 -13917 -203323 141167 -234936 -292733 140948 83815
9355H3815a24619n2003N4819M9037j5816B3225b10757B22692b9119j72439B08018
$$ 83815 -124619 -176622 -121803 -72766 -88582 23225 -210757 222692 -29119 -201558 208018
9343a09002j5723L5123c6544j15682A02574b20251E5008K4140N2052i8828j06450
$$ -109002 -124725 -89602 -36544 -152226 102574 -220251 55008 79148 131200 -98828 -205278
9332b05278A05337c50367a34942B70507d38528A63339a58465B08319b17850k678
$$ -205278 105337 -350367 -134942 270507 -438528 163339 -158465 208319 -217850 -220528
9322b20528J6502B87674D834a10661G3699b01337J8268l31081d8521j15183A16882
$$ -220528 -204026 287674 4834 -110661 73699 -201337 -183069 -514150 -48521 -163704 116882
9310b15617H9672a66096L322C34972h8737G4769A5341a37228j17150D5891b81121
$$ -215617 89672 -166096 -162774 334972 -88737 74769 15341 -137228 -254378 45891 -281121
9298D19331b7923C5742f7361A91622a73945G2448c2888F5388a22982K1165B1708
$$ 419331 -27923 35742 -67361 191622 -173945 72448 -32888 65388 -122982 -101817 21708
9286A3089Q5721a94904n6265B28141A09690d3450k7098l0307A9711K10447e0523
$$ 13089 98810 -194904 -251169 228141 109690 -43450 -70548 -100855 19711 230158 -50523
9274f99318c04022J46626B02257b92231a0078j16794f698H1572d4432j61926P1860
$$ -699318 -304022 -157396 202257 -292231 -10078 -126872 -6698 81572 -44432 -206358 -134498
9263a34498j00725e2798A65883a58822D060a46366A36402d4225B95415A4134h8992
$$ -134498 -235223 -52798 165883 -158822 4060 -146366 136402 -44225 295415 14134 -88992
9251a6073q7328J4014B40938c09831f1482k02557j33984G6894J02540b02801I8875
$$ -16073 -103401 -89387 240938 -309831 -61482 -264039 -398023 76894 179434 -202801 98875
9239C2327i472A8131f5151j22659H4799d24595a80272o1636j9067k03452A10071
$$ 32327 -9472 18131 -65151 -187810 84799 -424595 -180272 -241908 -260975 -464427 110071
9227A95313K33324H7585R0037C2151a10901A15417b6596D3796h4874j41863D9592
$$ 195313 428637 87585 177622 32151 -110901 115417 -26596 43796 -84874 -226737 49592
9215c31132c630F0704i163j45629m4457k0773L4286Q2785A01921J20310D214b94051
$$ -331132 -3630 60704 -9163 -154792 -199249 -220022 -185736 -102951 101921 222231 4214 -294051
9202b07482B02505k5312i9948M8149C01945h2671B29114a44582H4451a06972q555
$$ -207482 202505 177193 -99948 -51799 301945 -82671 229114 -144582 84451 -106972 -115527
9191a15527A38553o8841b90652A2456K24694a81145B92438C9495a77876b8681
$$ -115527 138553 69712 -290652 12456 237150 -181145 292438 39495 -177876 -28681
9180h1877b8688o8344j79196G5456J29329h9739k92174B68522C2090N6853e19113
$$ -81877 -28688 -97032 -276228 75456 204785 -89739 -381913 268522 32090 88943 -519113
9168B3208J75664a94153D4396K25657l974j6593d02740B316a58721f2429n3169
$$ 23208 198872 -194153 44396 270053 266079 249486 -402740 2316 -158721 -62429 -115598
9157a15598j4433Q886N9065A65387b05716b0571I320K5214a60526e6183l86752
$$ -115598 -130031 -121145 -62080 165387 -205716 -20571 9320 34534 -160526 -56183 -442935
9146d42935E0493h8001A27845a72713Q1394r2454D0631f7456l31892f0403l09554
$$ -442935 50493 -88001 127845 -172713 -91319 -183773 40631 -67456 -399348 -60403 -369957
9135c69957C39353d888G2102A2251M3611c35103F7477c17684P1277m6672a18480
$$ -369957 339353 -4888 72102 12251 55862 -335103 67477 -317684 -246407 -293079 -118480
9123A98884b33161j48347a11119n3842C9105J5935a17065p5426m3010k9844D12316
$$ 198884 -233161 -381508 -111119 -164961 39105 55040 -117065 -192491 -235501 -265345 412316
9111b98294c3888l96359b08844k6629r1769a03171D8332b14070h7191j08277k40125
$$ -298294 -33888 -430247 -208844 -235473 -327242 -103171 48332 -214070 -87191 -195468 -435593
9100d35593A46496B8749b24026A36724c1210l28283B98843a61571G4964b37589
$$ -435593 146496 28749 -224026 136724 -31210 -359493 298843 -161571 74964 -237589
9089A55614a28406L3813A21598a55064A25105F1843c8609k46631C3571K5409a64620
$$ 155614 -128406 -94593 121598 -155064 125105 61843 -38609 -285240 33571 58980 -164620
9077B83023h0600F1727c493n2215n3031B600b24881J0206p6183a09716k3120e6233
$$ 283023 -80600 61727 -3493 -55708 -108739 2600 -224881 -214675 -290858 -109716 -132836 -56233
9064a41225j3077P1703F9651c87191A62660a89025P3828A01807b35926A09821
$$ -141225 -154302 -82599 69651 -387191 162660 -189025 -115197 101807 -235926 109821
9053H3446a98602f7038j23609A26211a39585j03622i9022l9996k8498f7717B5016
$$ 83446 -198602 -67038 -190647 126211 -139585 -243207 -99022 -139018 -167516 -67717 25016
9041A27123b92251J2415J27252A02965l7027e5245q6549E944K49198r522c58081
$$ 127123 -292251 -279836 -152584 102965 65938 -55245 -141794 5944 255142 245620 -358081
9029a19417q356M5987j44990B4564N1184k9524a26740l1042B71569h4994k9772
$$ -119417 -127773 -81786 -226776 24564 75748 46224 -126740 -157782 271569 -84994 -114766
9018a14766b6838j21716A08212k6584a16470E8392f6195l1517L3730k6311G2650
$$ -114766 -26838 -148554 108212 81628 -116470 58392 -66195 -97712 -63982 -90293 72650
9006h3709j39041M5055B73475c75506C647a84760n5360K7682A98937a27079B841
$$ -83709 -222750 -177695 273475 -375506 3647 -184760 -240120 -212438 198937 -127079 2841
8994d27056C26341A06499K49012a14076A99210c1402B42245a79402A24411D1578
$$ -427056 326341 106499 355511 -114076 199210 -31402 242245 -179402 124411 41578
8983h2940G7456a56737A63913b53750R3472k9754B42197f7259B10659b28642B8051
$$ -82940 77456 -156737 163913 -253750 -160278 -190032 242197 -67259 210659 -228642 28051
8971a0095k4453B21066b36254I090a20945C8020b18949G9946b56514D2388A0392
$$ -10095 -34548 221066 -236254 9090 -120945 38020 -218949 79946 -256514 42388 10392
8959A72806a62712f7556n57N33C42427f5721p510j41685K9445h7610c3306F1038
$$ 172806 -162712 -67556 -68113 -67580 342427 -65721 -73231 -214916 -185471 -87610 -33306 61038
8946a02855E8202O7252O5233b25448a6594A40568i4709o2702D86760b7712A60471
$$ -102855 58202 125454 190687 -225448 -16594 140568 -94709 -157411 486760 -27712 160471
8934A07646J55630C1895K2251a02852L2761j5737A16274O0709J99536K15310N49750
$$ 107646 263276 31895 54146 -102852 -70091 -85828 116274 176983 376519 591829 1141579
8923A141579J416910J066328J890861k574511G80470B86728R7179a42414G3572
$$ 1141579 2558489 3624817 5515678 2941167 780470 286728 383907 -142414 73572
8913A39035l4004a93234a418n8034b2938B84108p3998i6563A13754L8618a4568
$$ 139035 105031 -193234 -1418 -59452 -22938 284108 210110 -96563 113754 152372 -14568
8901A6372a2148j3847n788A89473H3458c3056B474J17800a67209o8716I6442b27877
$$ 16372 -12148 -25995 -31783 189473 83458 -33056 2474 120274 -167209 -235925 96442 -227877
8888C9090a6577l25495e0614I8298K9787m7624A0967K18284c57204a65460m7763
$$ 39090 -16577 -342072 -50614 98298 128085 80461 10967 229251 -357204 -165460 -213223
8877b13223P2492C12678c07163A28483m6071b01673H466J24818l0604c64206c0906
$$ -213223 -140731 312678 -307163 128483 82412 -201673 8466 133284 102680 -364206 -30906
8865E4121a81845c2480G6131b05644B6873c3519O81j51340N6553B32808A01184
$$ 54121 -181845 -32480 76131 -205644 26873 -33519 -32838 -184178 -127625 232808 101184
$$ [...]
##END NTUPLES=NMR SPECTRUM
##END=
