##TITLE=AC1642_ETIAN13375_8569649_POWvS8Shdt
##JCAMPDX= 6.0         $$ Bruker NMR JCAMP-DX V2.0
##DATA TYPE= NMR SPECTRUM
##DATA CLASS= NTUPLES
##ORIGIN= BRUKER
##OWNER= Administrator
$$ 1.72 TOPSPIN		Version 2.1
$$ 2014-04-10 15:38:23.159 -0700  Administrator@X
$$ Compression mode = diff/dup
##.OBSERVE FREQUENCY= 400.02188249412
##.OBSERVE NUCLEUS= ^1H
##.ACQUISITION MODE= SIMULTANEOUS (DQD)
##.ACQUISITION SCHEME= undefined
##.AVERAGES= 8
##.DIGITISER RES= 22
##SPECTROMETER/DATA SYSTEM= spect
##.PULSE SEQUENCE= zg30
##.SOLVENT NAME= COFFEE_meoh
##.SHIFT REFERENCE= INTERNAL, COFFEE_meoh, 1, 14.98509
##AUDIT TRAIL= $$ (NUMBER, WHEN, WHO, WHERE, PROCESS, VERSION, WHAT)
$$ ##TITLE= Audit trail, TOPSPIN		Version 2.1
$$ ##JCAMPDX= 5.01
$$ ##ORIGIN= Bruker BioSpin GmbH
$$ ##OWNER= Administrator
$$ $$ E:\/data/COFFEE/nmr/AC1642_ETIAN13375_8569649_POWvS8Shdt/10/pdata/1/auditp.txt
$$ ##AUDIT TRAIL=  $$ (NUMBER, WHEN, WHO, WHERE, PROCESS, VERSION, WHAT)
(   1,<2014-04-10 15:38:14.939 -0700>,<Administrator>,<X>,<go>,<TOPSPIN 2.1>,
      <created by zg
	started at 2014-04-10 15:37:11.638 -0700,
	POWCHK enabled, PULCHK disabled,
       configuration hash MD5:
       C8 4E 4E 5D D3 5C D8 9E 9F 52 82 E0 59 8A DE 15
       data hash MD5: 64K
       36 D8 F3 AC 13 49 E6 75 7D E8 B5 C3 86 D3 A9 E9>)
(   2,<2014-04-10 15:38:18.355 -0700>,<Administrator>,<X>,<proc1d>,<TOPSPIN 2.1>,
      <Start of raw data processing
       efp LB = 0 FT_mod = 6 PKNL = 1 PHC0 = 0 PHC1 = 0 SI = 32K 
       data hash MD5: 32K
       F1 F0 18 35 38 8C F6 A7 4C 11 F4 40 26 4D 23 B5>)
(   3,<2014-04-10 15:38:18.710 -0700>,<Administrator>,<X>,<proc1d>,<TOPSPIN 2.1>,
      <pk PHC0 = 94.31213 PHC1 = 0 
       data hash MD5: 32K
       5F CB 7C 28 8D F4 1B 69 6B 97 B7 71 B7 72 1E 2B>)
(   4,<2014-04-10 15:38:18.828 -0700>,<Administrator>,<X>,<proc1d>,<TOPSPIN 2.1>,
      <abs ABSG = 1 
       data hash MD5: 32K
       89 CA 6E 5D C6 EB 4E B3 FA 6A 4F 05 A9 81 0A A3>)
(   5,<2014-04-10 15:38:18.913 -0700>,<Administrator>,<X>,<proc1d>,<TOPSPIN 2.1>,
      <abs ABSG = 2 
       data hash MD5: 32K
       A9 19 D0 E9 77 48 BA 6F B6 E6 71 31 C7 72 4B 67>)
(   6,<2014-04-10 15:38:19.031 -0700>,<Administrator>,<X>,<proc1d>,<TOPSPIN 2.1>,
      <abs ABSG = 3 
       data hash MD5: 32K
       2B 41 DB 20 35 40 BB 68 05 E6 52 9F 4A B0 19 FC>)
(   7,<2014-04-10 15:38:19.115 -0700>,<Administrator>,<X>,<proc1d>,<TOPSPIN 2.1>,
      <abs ABSG = 4 
       data hash MD5: 32K
       F5 FB 71 72 E5 5B AE 84 E2 73 1E 65 EC D8 B6 3D>)
(   8,<2014-04-10 15:38:19.183 -0700>,<Administrator>,<X>,<proc1d>,<TOPSPIN 2.1>,
      <abs ABSG = 5 
       data hash MD5: 32K
       E4 80 1F A3 4B A8 2B 7A 86 42 84 59 48 51 03 9C>)
$$ ##END=
$$ 
$$ $$ hash MD5
$$ $$ 32 29 C5 A4 31 D7 64 F9 23 4D FB 4D 31 39 1E 37
##$RELAX= 
##$RELAX= 
##$RELAX= 
##$RELAX= 
##$RELAX= 
##$RELAX= 
##$RELAX= 
$$ Bruker specific parameters
$$ --------------------------
##$DU= <E:\>
##$EXPNO= 10
##$NAME= <AC1642_ETIAN13375_8569649_POWvS8Shdt>
$$ [...]
150 150 150 150 150 150 150 150
##$TP07= 0
##$TPNAME0= <>
##$TPNAME1= <>
##$TPNAME2= <>
##$TPNAME3= <>
##$TPNAME4= <>
##$TPNAME5= <>
##$TPNAME6= <>
##$TPNAME7= <>
##$TPOAL= (0..7)
0.5 0.5 0.5 0.5 0.5 0.5 0.5 0.5
##$TPOFFS= (0..7)
0 0 0 0 0 0 0 0
##$TUNHIN= 0
##$TUNHOUT= 0
##$TUNXOUT= 0
##$USERA1= <user>
##$USERA2= <user>
##$USERA3= <user>
##$USERA4= <user>
##$USERA5= <user>
##$V9= 5
##$VALIST= <valist>
##$VCLIST= <CCCCCCCCCCCCCCC>
##$VD= 0
##$VDLIST= <DDDDDDDDDDDDDDD>
##$VPLIST= <PPPPPPPPPPPPPPP>
##$VTLIST= <TTTTTTTTTTTTTTT>
##$WBST= 1024
##$WBSW= 4
##$XGAIN= (0..3)
0 0 0 0
##$XL= 0
##$YL= 0
##$YMAX_a= 639020
##$YMIN_a= -541986
##$ZGOPTNS= <>
##$ZL1= 120
##$ZL2= 120
##$ZL3= 120
##$ZL4= 120
##$ABSF1= 14.98509
##$ABSF2= -5.573092
##$ABSG= 5
##$ABSL= 3
##$ALPHA= 0
##$AQORDER= 0
##$ASSFAC= 0
##$ASSFACI= 0
##$ASSFACX= 0
##$ASSWID= 0
##$AUNMP= <proc_prof1d_extract_pilot.lims>
##$AXLEFT= 0
##$AXNAME= <>
##$AXNUC= <1H>
##$AXRIGHT= 0
##$AXTYPE= 0
##$AXUNIT= <>
##$AZFE= 0.1
##$AZFW= 0.1
##$BCFW= 0
##$BC_mod= 0
##$BYTORDP= 0
##$COROFFS= 0
##$CY= 15
##$DATMOD= 1
##$DC= 0
##$DFILT= <>
##$DTYPP= 0
##$F1P= 0
##$F2P= 0
##$FCOR= 0.5
##$FTSIZE= 32768
##$FT_mod= 6
##$GAMMA= 0
##$GB= 0
##$INTBC= 1
##$INTSCL= 1
##$ISEN= 128
##$LB= 0
##$LEV0= 0
##$LPBIN= 0
##$MAXI= 10000
##$MC2= 0
##$MEAN= 0
##$ME_mod= 0
##$MI= 0
##$NCOEF= 0
##$NC_proc= -8
##$NLEV= 6
##$NOISF1= 0
##$NOISF2= 0
##$NSP= 0
##$NTH_PI= 0
##$NZP= 0
##$OFFSET= 14.98509
##$PC= 1
##$PHC0= 94.31213
##$PHC1= 0
##$PH_mod= 1
##$PKNL= yes
##$PPARMOD= 0
##$PPDIAG= 0
##$PPIPTYP= 0
##$PPMPNUM= 2147483647
##$PPRESOL= 1
##$PSCAL= 4
##$PSIGN= 0
##$PYNMP= <proc.py>
##$REVERSE= no
##$SF= 400.02
##$SI= 32768
##$SIGF1= 0
##$SIGF2= 0
##$SINO= 400
##$SIOLD= 32768
##$SPECTYP= <>
##$SREGLST= <1H.CDCl3>
##$SSB= 0
##$STSI= 32768
##$STSR= 0
##$SW_p= 8223.68421052631
##$SYMM= 0
##$S_DEV= 0
##$TDeff= 65536
##$TDoff= 0
##$TI= <>
##$TILT= no
##$TM1= 0
##$TM2= 0
##$TOPLEV= 0
##$USERP1= <user>
##$USERP2= <user>
##$USERP3= <user>
##$USERP4= <user>
##$USERP5= <user>
##$WDW= 1
##$XDIM= 32768
##$YMAX_p= 461435094
##$YMIN_p= -672664
##$CURPLOT= <Network HP LaserJet P1505>
##$CURPRIN= <$Network HP LaserJet P1505>
##$DFORMAT= <normdp>
##$LAYOUT= <+/1D_H.xwp>
##$LFORMAT= <normlp>
##$PFORMAT= <normpl>
##$SURQMSG= 1
$$ End of Bruker specific parameters
$$ ---------------------------------
##NTUPLES= NMR SPECTRUM
##VAR_NAME=  FREQUENCY,     SPECTRUM/REAL,   SPECTRUM/IMAG
##SYMBOL=    X,             R,               I
##VAR_TYPE=  INDEPENDENT,   DEPENDENT,       DEPENDENT
##VAR_FORM=  AFFN,          ASDF,            ASDF
##VAR_DIM=   32768,         32768,           32768
##UNITS=     HZ,            ARBITRARY UNITS, ARBITRARY UNITS
##FACTOR=    0.250966925370066, 1,           1
##FIRST=     8223.43324360094, 25839,        -67539
##LAST=      0,             34265,           -121344
##MIN=       0,             -672664,         0
##MAX=       8223.43324360094, 461435094,    0
$$ Real data points
##PAGE= N=1
##DATA TABLE= (X++(R..R)), XYDATA
$$ [...]
19559d0148B34031n9621c96319h8655c7396B49331h5353m5789O0126C35139b47172
19547a196k4009j06437D7428a14912k53028J58010D125K72187e2707j13650K489
19536a63868c0852F5959b60314F0578b86760A32931k9959J17976o0960F1945R3048
19525A54993a28081h236p9175f789r4108D7109L9383b67263i2263C5527e5937
19513C061f8806k3826j0241A3323F012a70430A80445A6314a33218P711j731M5628
19501h1610A94149h4542G8346M816k5484L660g6463A92013n9233b20955r2093
19490c13048f6643p3180C41803a48143C49954D6689b36442d5801A38139A8005
19479I3315c1594l8082E2425b50436A99486b51445J06993j39224H6536c4233r6336
$$ plain form
19559 -40148 234031 174410 -396319 -88655 -37396 249331 -85353 -131142 -71016 335139 -247172
19547 -1196 -25205 -131642 47428 -114912 -367940 -209930 4125 276312 -52707 -166357 -163868
19536 -163868 -30852 65959 -260314 60578 -286760 132931 102972 220948 159988 61945 154993
19525 154993 -128081 -8236 -87411 -6789 -100897 47109 86492 -267263 -92263 35527 -55937
19513 3061 -68806 -92632 -102873 13323 6012 -170430 180445 16314 -133218 -125507 -127238 -81610
19501 -81610 194149 -84542 78346 83162 57678 61338 -76463 192013 132780 -220955 -313048
19490 -313048 -66643 -139823 341803 -148143 349954 46689 -236442 -45801 138139 18005
19479 93315 -31594 -69676 52425 -250436 199486 -251445 -144452 -283676 86536 -34233 -130569
19468a30569K434G090a113E7612a83653P2854k92982a32510B8434f0160C747J09914
19456A13661a14005k26734D0966J75705b52735P5325h5555k81487g2906J0685
19446f2221k89767P3864A24154P3838a97211D1996j4993d9358q3632j05717P3772
19435a64935I0548b28923B95284i4965L7842j68780D3813a36534n4440j24112
19425c15086H1726a43209A38304j5552f9419L699H1335g2792k14795A77268o8276
19414A08992K21042a37518d5529j8506d859B4086Q0243a44369n6071e0340G0471
19402A01122a67073a4814B84450d65193a56914n7579b9712d675B83987a95543
19391B2401b98736h9914m1008k17376C0978n668a445C8853g5267H8624M2045E6192
$$ plain form
19468 -130569 -128135 7090 -1113 57612 -183653 -110799 -403781 -132510 28434 -60160 3747 113661
19456 113661 -114005 -340739 40966 216671 -252735 -177410 -85555 -367042 -72906 -62221
19446 -62221 -351988 -278124 124154 197992 -197211 41996 27003 -49358 -132990 -238707 -164935
19435 -164935 90548 -228923 295284 -94965 -57123 -225903 43813 -136534 -190974 -315086
19425 -315086 81726 -143209 138304 122752 -69419 -65720 81335 -72792 -287587 177268 108992
19414 108992 330034 -137518 -45529 -64035 -4859 24086 104329 -144369 -200440 -50340 70471
19402 101122 -167073 -14814 284450 -465193 -156914 -214493 -29712 -4675 283987 -195543
19391 22401 -298736 -89914 -130922 -348298 30978 25310 -1445 38853 -75267 88624 130669 56192
19378G8616c68613a1023j17732d899k74640J24124J02A66219G9563c26664A71846
19366B21849q2463a84556K1183c1817p4081o8568K0861B4064K3040J07134N576
19355A59814h8693j60883F4842b5136m184k58704J24143P1598j88620f8540C5629
19343b54516F0334a01446N722N892C31869l8569L5428d45540H3312a74525L1611
19332a42914O6315n6771J5431l6362B9491J0189j9621a68561A05777j6305b27855
19320I4499i2379A80518B9638a70749r4351h925I2929a2241G5963b14970d1526
19308I6692J82690k6032A23960Q61k9120J67548G523c65073a49708H1998L8835
19297A20833K39667a51581B4906d1489r8607L4589E2331f2271k36743a42935N4655
$$ plain form
19378 78616 -368613 -11023 -128755 -4899 -279539 -155415 -155313 166219 79563 -326664 171846
19366 221849 139386 -184556 -163373 -31817 -105898 -174466 -153605 24064 47104 154238 159814
19355 159814 -88693 -249576 64842 -25136 -29320 -288024 -163881 -92283 -280903 -68540 35629
19343 -254516 60334 -101446 -95724 -89832 331869 293300 328728 -445540 83312 -174525 -142914
19332 -142914 -76599 -133370 -117939 -154301 29491 39680 20059 -168561 105777 89472 -227855
19320 94499 -92379 180518 29638 -170749 -265100 -8925 92929 -12241 75963 -214970 -41526
19308 96692 279382 253350 123960 124821 95701 263249 7523 -365073 -149708 81998 120833
19297 120833 360500 -151581 24906 -41489 -140096 -105507 52331 -62271 -299014 -142935 -88280
19286h8280A10036A3477J25624m4350N5925a17539A12105b23452P5113k14834
19276c63173A78688a72264E3733h6087n564b900o9464I181a3725j61933I1685
19264b79318F2213b01415m6584L7468A9200b4749k43368k8049R2291P8076j53895
19253b79694A4036M6360O2611a12008j25626B3592a80000B9523b83575g5338C0980
19241a42340B8594c5734p237C3739g2299n1022C17014a17636k30933Q4672L0835
19230b33062B272e29604A2093b13037B42217f1769I0174a32768E648a53471D6340
19218A05954e4603q4987e2402r9882l38964A36284n8478c58548D7869L54708A76786
19206a17383r6372a05290j87042A50449o8356c18515i5794B56409a37306D9471
$$ plain form
19286 -88280 110036 13477 139101 94751 150676 -117539 112105 -223452 -148339 -363173
19276 -363173 178688 -172264 53733 -86087 -91651 -2900 -72364 9181 -13725 -175658 91685
19264 -279318 62213 -201415 -247999 -210531 19200 -24749 -268117 -296166 -203875 -125799 -279694
19253 -279694 14036 60396 123007 -112008 -237634 23592 -180000 29523 -283575 -75338 30980
19241 -142340 28594 -35734 -42971 33739 -72299 -123321 317014 -117636 -348569 -263897 -233062
19230 -233062 2272 -529604 12093 -213037 242217 -61769 90174 -132768 5648 -153471 46340
19218 105954 -54603 -139590 -52402 -152284 -491248 136284 77806 -358548 47869 402577 176786
19206 -117383 -213755 -105290 -292332 150449 82093 -318515 -95794 256409 -137306 49471
19195a32495O1680j86045H8562n990c98366A82928a35041D3904M6511b21194d2213
19183d9616A9823Q0582a53213A64425A0156J16201a021j68306G2373N8432c25163
19171A04570B9019J44984d5719q7760O399I3848b87401C70496G8761g1702l2939
19160a04641k74558a76634k34155M0525c8277A03968b14551E5736f0754A85067
19149g1708A26566a66123M6104k91794B743a42378m7402j76865I6014c5052o33
19138c5685p0369J035k07916g1637a2888B0746b48385B21205D8906c337l22256
19127c25593C4508K29437c24345h022l77171g5574a1677A2765J57525c21257A16211
19115i33j01080B04216J47713A21755B6206b77170B41500q4199b06345J0384j18198
$$ plain form
19195 -132495 -70815 -256860 88562 82572 -398366 182928 -135041 43904 90415 -221194 -42213
19183 -49616 19823 100405 -153213 164425 10156 126357 -1021 -169327 72373 130805 -325163
19171 104570 29019 174003 -45719 -133479 -127080 93848 -287401 370496 78761 -71702 -104641
19160 -104641 -379199 -176634 -410789 -370264 -38277 103968 -214551 55736 -60754 185067
19149 -71708 126566 -166123 -120019 -411813 2743 -142378 -189780 -366645 96014 -35052 -35685
19138 -35685 -106054 -105019 -312935 -71637 -12888 20746 -248385 221205 48906 -3337 -325593
19127 -325593 34508 263945 -324345 -8022 -385193 -75574 -11677 12765 170290 -321257 116211
19115 -933 -102013 204216 351929 121755 26206 -277170 241500 157301 -206345 -195961 -314159
19104c14159J24648b4584B00615b55045I5517a66653d0491j9895k41174c7386
19093g1178A29810a96506i5848a9312j12566K9492a9427q6757D56082a30577A76749
19081D8680a26201H7254Q0761c59607g512A57724J12876f8170A23493b5478n2873
19070g8351A27819c0527l16991a03530q964B21270n9017f2545A03060a20634A87314
19058b82362R8817P4847j56801N2315Q5958C2350n307K2310A8619B2J0289h926
19045h6095Q440j76860C7329a25087q0491B56235H3984K66910a86699j46234a04435
19033c1776C3955J27171n0243C9387K52291a69966B83136c9612j40557A58209
19022g8721p7066B6419K51509A01617C4753e9537q3769l35A69462k7644g6646
$$ plain form
19104 -314159 -189511 -24584 200615 -255045 95517 -166653 -40491 -60386 -301560 -37386
19093 -71178 129810 -196506 -95848 -19312 -131878 -102386 -19427 -106184 456082 -130577 176749
19081 48680 -126201 87254 168015 -359607 -7512 157724 270600 -68170 123493 -25478 -78351
19070 -78351 127819 -30527 -347518 -103530 -112494 221270 162253 -62545 103060 -120634 187314
19058 -282362 -183545 -108698 -265499 -213184 -127226 32350 27043 49353 18619 22 10311 -8926
19045 -86095 -77655 -254515 37329 -125087 -205578 256235 83984 350894 -186699 -332933 -104435
19033 -31776 33955 161126 110883 39387 291678 -169966 283136 -39612 -180169 158209
19022 -78721 -155787 26419 277928 101617 34753 -59537 -143306 -143641 169462 141818 -76646
19010e6697I7290b01063l16686C3099a73611C0349b9147a2218I6469a22416A29495
18998b72412A47687o1873n950c01277B4884b15825e0780k46574G5566c27400a59557
18986a15305H6096i5321C13637j21264b78583B68199A19032a17710B53640d17650
18975b61300J30435e1279a1553m1630A21053a98289I672a5987H3404a49808j7567
18964a67375A5142a10349j82627I8735e6317j4172g789o5137I7253J46404q8710
18953A54947a43852E0090L51530a59282e1658B3142J22732c57931a59216a7408
18942a49100q3153K1687J234B13588b25998B32203a09328A96321a859B70748b94895
18930f3371j04334M7412N8598l46563a29540E09211f5459A21965a65668d4076
$$ plain form
19010 -56697 97290 -201063 -517749 33099 -173611 30349 -29147 -12218 96469 -122416 129495
18998 -272412 147687 85814 79864 -301277 24884 -215825 -50780 -297354 75566 -327400 -159557
18986 -115305 86096 -95321 313637 192373 -278583 268199 119032 -117710 253640 -417650
18975 -261300 -130865 -51279 -11553 -53183 121053 -198289 9672 -15987 83404 -149808 -167375
18964 -167375 15142 -110349 -292976 98735 -56317 -70489 -7789 -72926 97253 243657 154947
18953 154947 -143852 50090 401620 -159282 -51658 23142 145874 -357931 -159216 -17408
18942 -149100 -232253 -210566 -209332 213588 -225998 232203 -109328 196321 -1859 270748 -294895
18930 -63371 -167705 -120293 -61695 -408258 -129540 509211 -65459 121965 -165668 -44076
18919i0694A8108l674R4203a62848b8441j50804a427k24479A88572p0265i1328
18907A08303L17795A16268B559J40436P608c59157d5176k64730a25842E7604J74211
18896B31815r7480c11603A72849o4582K94755F9223G323a22436j53874r1935J78773
18885a89472P0737L7113g876F0496c36320K2046H9872a98446F9675a78748a2532
18873b12891m8392A17051l0501b82332A1071a4197H7456b57060r7321A1995b59232
18861c55420i7110p0840m4887K630g6557n1678j13021C9106a52647e1929A00536
18849a38715O2861C17810g3228j47403R228L3707N3163F4847f3625J4725A44927
18837G9356c44011B55050F7131e6290k18343A81242N166o9661J07249b559j80854
$$ plain form
18919 -90694 18108 14434 108637 -162848 -28441 -179245 -1427 -225906 188572 118307 -91328
18907 108303 426098 116268 2559 142995 150603 -359157 -45176 -309906 -125842 57604 231815
18896 231815 134335 -311603 172849 108267 403022 69223 7323 -122436 -276310 -368245 -189472
18885 -189472 -118735 -81622 -7876 60496 -336320 -314274 89872 -198446 69675 -178748 -12532
18873 -212891 -261283 117051 86550 -282332 11071 -14197 87456 -257060 -354381 11995 -259232
18861 -355420 -97110 -167950 -212837 -210207 -76557 -128235 -241256 39106 -152647 -51929 100536
18849 -138715 -75854 317810 -73228 -220631 -211403 -177696 -124533 64847 -63625 -48900 144927
18837 79356 -344011 255050 67131 -56290 -274633 181242 186408 116747 223996 -2559 -183413
18826a83413c7446B0074a93403Q5389M9119B49507a09024A17441J434J25907H5941
18814a57816j8754H4414K4908B0004K48244e529A78001K36647A94225d3637G640
18802A57198F6429b59872a24912k33027a30230I0924a92730h3615B4722b80577
18791a43833P0386k25405i2066L8336j51851g5949n6237A12474b8068F937J26153
18780A33090Q4398o9644N7474f9940B993a05733C91011j87675a30349c3199C14557
18768d5244m21540b06282c1670o6136j59893a8903A24390b97830I8135h2676f488
18756b36302i9834q7736A20901b57846B7394a94953E1387K30129g5585j92571
18746b68156g4364E0551A4197g4660k62603g5112l26392A4536g8968B07431o5626
$$ plain form
18826 -183413 -37446 20074 -193403 -108014 -58895 249507 -109024 117441 118875 244782 85941
18814 -157816 -176570 84414 109322 20004 268248 -5529 178001 414648 194225 -43637 7640
18802 157198 66429 -259872 -124912 -357939 -130230 90924 -192730 -83615 24722 -280577
18791 -143833 -73447 -298852 -92066 -53730 -205581 -75949 -132186 112474 -28068 6937 133090
18780 133090 217488 147844 205318 -69940 2993 -105733 391011 203336 -130349 -33199 314557
18768 -45244 -466784 -206282 -31670 -97806 -257699 -18903 124390 -297830 98135 -82676 -6488
18756 -236302 -99834 -187570 120901 -257846 27394 -194953 51387 281516 -75585 -268156
18746 -268156 -74364 50551 14197 -74660 -337263 -75112 -401504 14536 -78968 207431 141805
18735A41805j1038b97666a8816A45762l9703a37540A60083a82692A04058m8428
18725E5630b14119g8520c6988k35119q0910f8250A26139i5463b5872F8724b87551
18713e4204A31525a78683l8161c647B78600e21236g2907j70472e0610A38555C7819
18701C75006A25331b81089B28225a16159j02494b0128j71549C0177a18815j97788
18691c16603J27471n6674a9781B9413b2670q2439K0016A74375a9411j39263M1916
18680a16758p8003B68777D9454b28464A10516L0169g3097D9373a20988N2566C272
18668f1602m7057l3323A05378a94260a1394k5196j29096L0385e8203J4841q4979
18657a28341c7594m78739A9918b95264J24446j89294A881e3639j9885o1649l9538
$$ plain form
18735 141805 130767 -297666 -18816 145762 106059 -137540 160083 -182692 104058 55630
18725 55630 -214119 -78520 -36988 -272107 -353017 -68250 126139 -95463 -25872 68724 -287551
18713 -54204 131525 -178683 -216844 -3647 278600 -521236 -72907 -243379 -50610 138555 37819
18701 375006 125331 -281089 228225 -116159 -218653 -20128 -191677 30177 -118815 -316603
18691 -316603 -189132 -245806 -19781 29413 -22670 -105109 -85093 174375 -19411 -158674 -116758
18680 -116758 -194761 268777 49454 -228464 110516 140685 -73097 49373 -120988 -68422 3272
18668 -61602 -108659 -141982 105378 -194260 -11394 -36590 -165686 -135301 -58203 -43362 -128341
18657 -128341 -37594 -516333 19918 -295264 -170818 -360112 1881 -53639 -73524 -135173 -174711
18646a74711A56553k9473O5477b50648G8926h6363A77937a87475B05445q2306
18636A23139g9827m0752k77244J11672J31621C39569a67968A9463J83552P4365
18626B77380b09030G6686a852D1266L73577a2973l17144f1815j61578A24709a34442
18614c14924A3488J0707c13796J03572G2519L5382b67240G8283k9888A777i6110
18602A9291a46748A33912b11456m61208A61817c79661a29923A7184J47590l5876
18592A28898b19619i5698m9140B71674c65820a20967C23476c6480l960a7749k7052
18581d4801D82012C7847M3680b42609b1283j14853H358e22538B46093H7099b84540
18569c13218g7026B17607J61669B583c8091C5484h4743j54507L5386M4725A73064
$$ plain form
18646 -174711 156553 127080 192557 -250648 78926 -86363 177937 -187475 205445 123139
18636 123139 -79827 -120579 -397823 -286151 -154530 339569 -167968 19463 203015 277380
18626 277380 -209030 76686 -1852 41266 414843 -12973 -330117 -61815 -223393 124709 -134442
18614 -314924 13488 24195 -313796 -210224 72519 107901 -267240 78283 48395 1777 -96110
18602 19291 -146748 133912 -211456 -672664 161817 -379661 -129923 17184 164774 128898
18592 128898 -219619 -95698 -144838 271674 -365820 -120967 323476 -36480 -40440 -17749 -44801
18581 -44801 482012 37847 81527 -242609 -21283 -136136 8358 -522538 246093 87099 -284540
18569 -313218 -77026 217607 379276 2583 -38091 35484 -84743 -239250 -203864 -159139 173064
18557c32559E6491g87j17154f270C0641J7994b81258B51300b74349b2900F3129
18545g5213A56779D3366a60563A59664i2585A18843b4820A72970f1656n4613A59802
18533b81457l2981A10816a59845o3609h3527J3190D3739J55775J71373b41719
18522I6294a88996O5998J3060B30891F7213R4394b08795I202f6430D0679A7958
18510e8053k54065a0773q1780G7519a07095A20172M6404J2476j4184c13648C9573
18498A41322c4263B4143a0663D8883a30131j45449i3441A59983D8524a52185a2935
18486c79515J56460O9000n4142A07803O0942c84795C96537a35726I5560R0676
18476A86236f8747p8330O0317k9781B06399I5688i2556a6968A99517d2107E5937
$$ plain form
18557 -332559 56491 -787 -117941 -6270 30641 48635 -281258 251300 -274349 -22900 63129
18545 -75213 156779 43366 -160563 159664 -92585 118843 -24820 172970 -61656 -116269 159802
18533 -281457 -314438 110816 -159845 -223454 -83527 -70337 43739 199514 370887 -241719
18522 96294 -188996 -122998 -109938 230891 67213 161607 -208795 9202 -66430 40679 17958
18510 -58053 -312118 -10773 -92553 77519 -107095 120172 166576 179052 164868 -313648 39573
18498 141322 -34263 24143 -10663 48883 -130131 -275580 -93441 159983 48524 -152185 -12935
18486 -379515 -223055 -154055 -208197 107803 168745 -384795 396537 -135726 95560 186236
18476 186236 -68747 -147077 -86760 -116541 206399 95688 -92556 -16968 199517 -42107 55937
18464A26499a43368p1993A14149g6642J8156a5102A81689J39706A11637L6999
18454A48636J33365p8381b92210d1660j93573c0776A79146H5123J20799b48898
18443a69486k1562O214e6520p95j15178k2436A76557a5367k05841C9379O6361
18432A05740c57954g6004J2485A60010a12089A20643C1107J18626i6976c0978
18421c34850b9662l9086o092B60928b48006D0682b33006C7574b91835B79589b22182
18409F9814M1954a66769n4883a06058A86057b43535i1723F7793b05161N8492k2275
18398a68944j11308a01642c8830k63326B13303a71750A50937F9782b09955P8092
18388a31863j1891H1380d1856A04895h8257A30839E0994d5876q1372A66025i9569
$$ plain form
18464 126499 -143368 -215361 114149 -76642 -58486 -15102 181689 321395 111637 148636
18454 148636 282001 203620 -292210 -41660 -235233 -30776 179146 85123 205922 -248898
18443 -169486 -191048 -184834 -56520 -57315 -172493 -194929 176557 -15367 -221208 39379 105740
18432 105740 -357954 -76004 -63519 160010 -112089 120643 31107 149733 -96976 -30978
18421 -334850 -29662 -68748 -74840 260928 -248006 40682 -233006 37574 -291835 279589 -222182
18409 69814 111768 -166769 -221652 -106058 186057 -243535 -91723 67793 -205161 -146669 -168944
18398 -168944 -280252 -101642 -38830 -302156 213303 -171750 150937 69782 -209955 -131863
18388 -131863 -143754 81380 -41856 104895 -88257 130839 50994 -45876 -127248 166025 -99569
18376a51464j13676c4860D9932a09323a6039I7532J57348r5264a59512I8476J38867
18365B37343b44306H0401K41523I8581a47845e5037E1066c65685e4842A35715
18354c764j6183j30219b4937B30053a57135B4007L82507e8260A92721m2641b64618
18342B60233E2305J99815D5062c29760h0068B6238e53700i838F602a68249O5402
18331a02847J3235J2261r816J4393n5081M4008A2197a88430K0339f6518A39638
18319A00016a8098l50683B67806a16606e225F8924a51243O9625c5875k04577n4178
18308b94630A38897b08522o6481b5676m0224n7182A57486i9242M5748k36590a42907
18296b31459P1822B41032c4641k9023o358r5075B30J84534b75484O4196h1433
$$ plain form
18376 -151464 -265140 -34860 49932 -109323 -16039 97532 254880 159616 -159512 98476 237343
18365 237343 -244306 80401 321924 98581 -147845 -55037 51066 -365685 -54842 135715
18354 -3764 -19947 -150166 -24937 230053 -157135 24007 406514 -58260 192721 150080 -264618
18342 260233 52305 252120 45062 -329760 -80068 26238 -553700 -9838 6602 -168249 -102847
18331 -102847 -89612 -77351 -87167 -72774 -127855 -83847 12197 -188430 -168091 -66518 139638
18319 100016 -18098 -368781 267806 -116606 -5225 68924 -151243 -81618 -35875 -240452 -294630
18308 -294630 138897 -208522 -275003 -25676 -65900 -123082 157486 -99242 -53494 -290084 -142907
18296 -231459 -159637 241032 -34641 -63664 -70022 -165097 230 184764 -275484 -211288 -81433
18284c6270o1714B88212G2633a00894l9031O8710j31016I3129O2480i0975r9520
18273a90495J5562k3762r1747p9606d0724q7979B9431N7413Q9531n3460n2043
18262G0872j8759b88325D832J28201a02929E7457a52214n5600m7031c7382j32197
18251a69579O5298j15734p1452H0937b30756b2965j95367Q6723e1901q5058d4003
18239a06531F9295c28140G9324g0198A9447J68093H2190g3169B50971H9680i558
18227f9878l5129c5128k86572G5137J73905h011B03651j6031a47106I2665h0430
18215A24278c19410D1858a45314L6737C30383h940k50495A5352e1472I7695D2188
18203F2134b38849A84567H3418B1342H79J03050b26562M5226C56712A20497a3848
$$ plain form
18284 -36270 -97984 288212 72633 -100894 -139925 -71215 -202231 93129 155609 -90975 -190495
18273 -190495 -174933 -198695 -290442 -370048 -40724 -128703 29431 86844 176375 122915 70872
18262 70872 52113 -288325 4832 133033 -102929 57457 -152214 -207814 -254845 -37382 -169579
18251 -169579 -104281 -220015 -291467 80937 -230756 -22965 -218332 -131609 -51901 -136959 -44003
18239 -106531 69295 -328140 79324 -70198 19447 187540 82190 -73169 250971 89680 -9558
18227 -69878 -105007 -35128 -321700 75137 249042 -8011 203651 187620 -147106 92665 -80430
18215 124278 -319410 41858 -145314 -108577 330383 -8940 -259435 15352 -51472 97695 42188
18203 62134 -238849 184567 83418 21342 879 103929 -226562 -181336 356712 120497 -13848
18191a67178A28494B1646J56164G2684a47954K5679K8391a4727B2352a20513k53789
18180c74302d3325j856k97503H4433a18404k833d5259A58047h3354j889j02174
18169a87417A51169b51112a18661F7631a48869B64104b20852L7795E219a22676
18158D00017a5038B5775h0636E0230F845J28384c05689a20580E6327N0507a95436
18146b37022D9906b70641B30749r7491m8801k4557c4190G2546a9432j2825A17509
18134b11626H4720l6209a65361A46020G2385g9723n2950C39648d4141j42657J859
18123a84939M1680L2471E3164c75454H7526K18931l0468d7177N901j4515A8040
18111B34292A12583a8507B64944F5630a62346B67502a67333C6153g0751q8528
$$ plain form
18191 -167178 128494 21646 177810 72684 -147954 -122275 -93884 -14727 22352 -120513 -374302
18180 -374302 -43325 -45181 -342684 84433 -118404 -121237 -45259 158047 -83354 -85243 -187417
18169 -187417 151169 -251112 -118661 67631 -148869 264104 -220852 -183057 5219 -122676
18158 400017 -15038 25775 -80636 50230 6845 135229 -305689 -120580 56327 106834 -195436
18146 -237022 49906 -270641 230749 133258 84457 59900 -34190 72546 -19432 -32257 117509
18134 -211626 84720 48511 -165361 146020 72385 -79723 -132673 339648 -44141 -186798 -184939
18123 -184939 -143259 -110788 53164 -375454 87526 306457 275989 -47177 -41276 -55791 18040
18111 234292 112583 -18507 264944 65630 -162346 267502 -167333 36153 -70751 -159279
18101a59279d3685k02939m41C8728J1983a40986j91683e6471I921a68767M12G306
18088f0183B2368b99133a10986m9598o1371D923N0277b28290J2949A49974a12023
18076e8880B96073c34146G6905K7006C0037a82515p3084D04629i9799l48778a43149
18064B23927K0738C4977a77536m0372H5253J7421c78468E5713i3809H4050b89306
18052f666j38948k80976L2106A67370l9858J47031O2927I0611a80915C7241b9996
18040f930B29483a58677P10M4193k40919J56398H8870b89331P3630C64345A65396
18028B02096K6511L4211q8399K6623p3668a65325D7532a124l54414A6634P9545
18017I6179d15967e3552C1583a76060L524o3606A14355g563m99549b3705k62829
$$ plain form
18101 -159279 -43685 -246624 -247065 38728 50711 -140986 -332669 -56471 9921 -168767 -168355 7306
18088 -60183 22368 -299133 -110986 -160584 -221955 4923 55200 -228290 -215341 149974 -112023
18076 -58880 296073 -334146 76905 103911 30037 -182515 -255599 404629 -99799 -448577 -143149
18064 223927 244665 34977 -177536 -217908 85253 102674 -378468 55713 -93809 84050 -289306
18052 -6666 -145614 -426590 -394484 167370 127512 274543 337470 90611 -180915 37241 -29996
18040 -6930 229483 -158677 -157967 -113774 -354693 -198295 88870 -289331 -215701 364345 165396
18028 202096 228607 262818 174419 201042 127374 -165325 47532 -1124 -355538 16634 96179
18017 96179 -415967 -53552 31583 -176060 -172536 -236142 114355 -7563 -507112 -23705 -286534
18006b86534H0137c04228a2782D2433a18192A88819K30520D4075K02387c20965
17995f4772r8742J5072C02248G8459L9224B377a02737B80129a00026B29017o457
17984B22560p7892a28860j04939A84791D9446N934O1702k7311f3006A54236F2849
17972A49054g7490A14312J19216C218a95373i5595A855N9741b68320b7066A40425
17960b50441J12215B86821b68317Q7864B62924c29083E9754b2952A44118C6688
17949A55020c09423E4498b01632j03350C5883a03501C40481e777k3811q0835l6155
17938a46578A28194D9338L6216b31227F329a14682d3230M783r8131n6727j6419
17927b09724F6488L6933N1193h3612B21388a77884B11621c9223r7291B15757n7232
$$ plain form
18006 -286534 80137 -304228 -12782 42433 -118192 188819 419339 44075 246462 -320965
17995 -64772 -163514 -148442 302248 78459 117683 2377 -102737 280129 -100026 229017 222560
17984 222560 144668 -128860 -233799 184791 49446 55380 117082 89771 -63006 154236 62849
17972 149054 -77490 114312 233528 3218 -195373 -95595 1855 61596 -268320 -27066 140425
17960 -250441 -138226 286821 -268317 -180453 262924 -329083 59754 -22952 144118 36688
17949 155020 -309423 54498 -201632 -304982 35883 -103501 340481 -5777 -29588 -110423 -146578
17938 -146578 128194 49338 85554 -231227 6329 -114682 -43230 -38447 -136578 -193305 -209724
17927 -209724 66488 103421 154614 -83612 221388 -177884 211621 -39223 -136514 215757 158525
17916A58525p4241i3351k5319A3324b39078E7102J86975b46149i4683L7162A09823
17904C2367J7321j9922i1086A29395F1427e5355B28581P5983a88957i1093m3458
17893a34551A51228a74924h4546o1637O5353G6228K57575J71353i1667k35820
17883c27487G8901L349J85127A6385d7848C23185j12957l7680a22354c9578k20483
17872b60061a7126l53744K129M6179H3094a39710A775J06745b13659R1151A47062
17860f9534l4368d9452A83673G7913L2814f3974n7491F2999j9861N3051l3444
17849F2745e5664j12720a0129j14984B47657a37076B77410j16619L2215H0747
17838B05650i0269k28687G3306g7857j23889d7810j33348e6629A62201F6523Q8114
$$ plain form
17916 158525 84284 -93351 -118670 13324 -239078 57102 244077 -246149 -94683 -57521 109823
17904 32367 49688 29766 -91086 129395 61427 -55355 228581 304564 -188957 -91093 -134551
17893 -134551 151228 -174924 -84546 -146183 -80830 76228 333803 505156 -91667 -327487
17883 -327487 78901 82250 267377 16385 -47848 323185 210228 172548 -122354 -39578 -260061
17872 -260061 -17126 -370870 -368741 -322562 83094 -139710 1775 108520 -213659 -122508 147062
17860 -69534 -103902 -49452 183673 77913 110727 -63974 -121465 62999 43138 96189 62745
17849 62745 -55664 -168384 -10129 -125113 247657 -137076 277410 160791 193006 80747
17838 205650 -90269 -318956 73306 -77857 -201746 -47810 -181158 -56629 162201 66523 154637
17827A54637c72064I295J32395C2495b0607f056A41233c16138C2235f7086j62849
17816b29935B73417g5311l6344A26623c80694E3781g9129I6415O7610b28523e6470
17804G2476J01327e3614A21846c18245A03894a813D7947a57980C39443j16967
17794B22476P2844e0972j43986A76235b90387C31794b8529p0707k85088C5705
17783e8478F6286e4547j62675C4151J60669O085C6603a41011D3551a69821G0344
17771a79635A46854K53876e2378I6537m1469g0519K5971D526J1363J73705c1775
17759D0914M1165d6263G0689L86h7237A02343c1564j39311H6824K90044F071M0033
17747D6104b72843a12706A96672G8707d957I650J10393n0634d3877A47940k1468
$$ plain form
17827 154637 -372064 9295 141690 32495 -20607 -6056 141233 -316138 32235 -67086 -229935
17816 -229935 273417 -75311 -111655 126623 -380694 53781 -79129 96415 164025 -228523 -56470
17804 72476 173803 -53614 121846 -318245 103894 -1813 47947 -157980 339443 222476
17794 222476 295320 -50972 -194958 176235 -290387 331794 -28529 -99236 -384324 35705
17783 -58478 66286 -54547 -217222 34151 194820 200905 36603 -141011 43551 -169821 70344
17771 -179635 146854 400730 -52378 96537 55068 -70519 -44548 4526 15889 189594 -31775
17759 40914 82079 -46263 70689 71075 -87237 102343 -31564 -170875 86824 376868 6071 46104
17747 46104 -272843 -112706 196672 78707 -4957 9650 120043 69409 -43877 147940 126472
17736A26472E0839g638k08770D3042L12509A20205O6652n1547K1255O7434E2424
17724A13719c4370C27065f6629p2992b5187D87971a4345k04214A08948c0945k24675
17713b55620h4456k370A2083L57660a44952C81223a76831E7093A0808b93664B0815
17701B6126a48543B19120k079a75455I130L7330A8747e3258A48475a58092j08313
17690b66405E2781g8968B92499a67118N7577A39969a6402G9816I041J01395J42396
17679B52832H6144l1046a79690a2358j02275B52523l7543l7053a4070A57376a85549
17667B19643a34717r1526N2793A65133R4209C5241a42553c5548F5067O1566J93591
17656C20224I2210O9168F9948C937R7807b1647A40009a31003m0147d4664D7975
$$ plain form
17736 126472 50839 -7638 -216408 43042 355551 120205 186857 135310 156565 223999 52424
17724 113719 -34370 327065 -66629 -139621 -25187 487971 -14345 -218559 108948 -30945 -255620
17713 -255620 -84456 -86826 12083 369743 -144952 381223 -176831 57093 10808 -293664 20815
17701 26126 -148543 219120 217041 -175455 9130 46460 18747 -53258 148475 -158092 -266405
17690 -266405 52781 -78968 292499 -167118 -109541 139969 -16402 79816 9041 110436 252832
17679 252832 86144 55098 -179690 -12358 -114633 252523 214980 177927 -14070 157376 -185549
17667 219643 -134717 -226243 -173450 165133 259342 35241 -142553 -35548 65067 126633 320224
17656 320224 92210 161378 69948 3937 101744 -21647 140009 -131003 -171150 -44664 47975
17644A81690l6241k8894J7764J10824o8882E933b10463A94778b16003J8782D4941
17632h206r0403A50453c3818B65267J30960A691a99046C68921p1136H8821P0319
17621A59140m1666b7357k9372E6732a97276H9412g4286C76886b6874B28058L7194
17610B65252B5165K20361D5880J94365k0271E2515K8251b881l66997f9718H9569
17598E6281F893N5916J12638M6337r4729K17442j20842M312I25J95823H8199j1512
17586G6687a49550b0667C3610L103a27816c9103A1013a79784g7556B69971j3360
17575B56611o4515r0597L4127l2783m8990K1385K54631b11328A40628d4621j4962
17564e9583K0926j55065J4113j9331I3450K55685b8593p5723A46974a23774D13567
$$ plain form
17644 181690 145449 116555 134319 245143 176261 5933 -210463 194778 -216003 -197221 44941
17632 -8206 -98609 150453 -33818 265267 396227 1691 -199046 368921 297785 88821 159140
17621 159140 117474 -27357 -56729 56732 -197276 89412 -74286 376886 -26874 228058 265252
17610 265252 25165 245526 45880 240245 219974 52515 80766 -2881 -369878 -69718 89569
17598 56281 6893 62809 175447 221784 127055 344497 223655 227967 925 196748 88199 76687
17586 76687 -149550 -20667 33610 36713 -127816 -39103 11013 -179784 -77556 269971 256611
17575 256611 192096 101499 135626 102843 53853 75238 329869 -211328 140628 -44621 -59583
17564 -59583 -38657 -193722 -179609 -198940 93450 349135 -28593 -104316 146974 -123774 413567
17552H9226E708P3225L3769b23073A28210F136i6017A12937N7291R58J09265i8771
17539b51390B03000r8542j4916a39699A41424L1574K37423a5164C9958d3350l8387
17528h1737j09733A42960P3385Q167d8473L32J1282j9836D9584a5916E7330F453
17515B02123M3899r7872n1926M6388k0924J24708K05143k17804J72643l1927I3770
17503E1748h2369G7866O0837C3658L31579p2130l8741p6961J58306b05991A15550
17491G5245P4577O0116r2939M2081k5905f3397A72084h7157I4345J68879n2269
17480B10955A5775K34702P4629E3794J56793l0618d7168J7200B72717C2886J45371
17469A78257C9939J99957j14798A9962f1356a4081B21588J23328C4784M50403
$$ plain form
17552 89226 5708 78933 112702 -223073 128210 6136 -96017 112937 170228 171186 280451 -98771
17539 -251390 203000 104458 89542 -139699 141424 172998 410421 -15164 39958 -43350 -81737
17528 -81737 -191470 142960 216345 224512 -48473 -48141 -36859 -56695 49584 -15916 57330 6453
17515 202123 246022 148150 96224 142612 121688 246396 451539 233735 406378 374451 93770
17503 51748 -82369 77866 138703 33658 365237 293107 254366 177405 335711 -205991 115550
17491 75245 149822 209938 116999 159080 133175 -63397 172084 -87157 94345 263224 210955
17480 210955 15775 250477 325106 53794 210587 179969 -47168 -29968 272717 32886 178257
17469 178257 39939 239896 125098 19962 -61356 -14081 221588 344916 34784 485187
17459D85187H3932K29941p5354I9962j2786J1950d5321A19605D9956J19290N9178
17448B28424a16385A63639J52918j247J60616B25613f9530B64159J52457A93830
17437B95793j18818G3037J41141m2987k015n8872N4080O8045n5855h0702C39593
17425C05380j30577J43854K9329J73220k40413R090r5883l3255j3638O3945K88734
17414D99786j76597k3258j49289p0567g4948D32278a92047B37552d470B38115
17403A50138h8862d232A69909Q82n4794K51902j82673a48853B71408a20160F63281
17391B34057K81286E3443K05948J20126A70809J19660I6273d6170j6353B55314
17380B85631n7043n771R6594J05788j58491J2635N3341L33104B08390J32968j49832
$$ plain form
17459 485187 83932 313873 238519 99962 87176 99126 -45321 119605 49956 169246 228424
17448 228424 -116385 163639 316557 315310 475926 225613 -69530 264159 416616 193830
17437 295793 176975 73037 214178 171191 169176 110304 164384 232429 176574 -80702 339593
17425 305380 174803 318657 347986 521206 280793 289883 194000 160745 147107 211052 499786
17414 499786 323189 299931 150642 80075 -74948 432278 -192047 237552 -4470 238115
17403 150138 -88862 -4232 169909 170791 115997 367899 185226 -148853 271408 -120160 663281
17391 234057 515343 53443 259391 379517 170809 290469 96273 -46170 -62523 255314
17380 285631 228588 222817 319411 425199 266708 279343 332684 665788 208390 341358 191526
17369A91526l345J46815H531c8146A22662J01804a12603C46599A36556a31101
17358A12279N7029P4158L3548j02548c27038D4006K07799Q8274A67413k7601J61732
17347C01544o5478j00555o3772J58087c5354j65741B03927J17341I3290c4550
17336A03481j9046J84169F1132k4740M03551j85141J78132J25819A93776A3421
17325A33732J1432o2547a02998C43719j48187J10804a00550F21223F3229L31678
17315C94907G9177K0635K48669j24720A09964Q4682J89016A14572b1724B8971
17304A97072J50934H0590c2697A47735J47603B7472L28228j58815q6791O3119
17294A73213L54327A52684k9119a28255d5967A69754C8325J10312J35434J07239
$$ plain form
17369 191526 188181 334996 8531 -38146 122662 224466 -112603 346599 136556 -131101
17358 112279 169308 243466 277014 174466 -327038 44006 251805 340079 167413 139812 301544
17347 301544 236066 135511 71739 229826 -35354 -201095 203927 321268 93290 -34550
17336 103481 84435 268604 61132 36392 439943 254802 432934 558753 193776 13421
17325 133732 145164 82617 -102998 343719 195532 306336 -100550 621223 63229 394907
17315 394907 79177 99812 348481 223761 109964 194646 383662 114572 -21724 28971
17304 197072 348006 80590 -32697 147735 295338 27472 355700 196885 110094 173213
17294 173213 527540 152684 123565 -128255 -45967 169754 38325 148637 284071 391310
17284C91310D6409J00j5655J30589K6295M4856L7539l7792j5098L5479b95959
17272C30628b06894E7390i1955A11669J09607n1847M2513F1717J31834J9206B0876
17260A69394J45082R6360j48724K21878B35773j2786f0386A82616L5677n5484
17250A62809F8178K34839K57079A79117k185K24433j84034K22393P7409g2180
17239a94809A35399K2628K26003n3661I8158f7420o64E44308k48507N9989L0478
17228C86268j78203j9864J7823j4931l4658M9722K87577B39731L79652L7861D2205
17216C90016n502o6157A07770J96569j0724j05781D1358K28346f1813B78816n2727
17205B26089K13966B08366B9231L19608K24554f8031D83822D1426L69152J8933
$$ plain form
17284 391310 46409 46509 30854 161443 187738 232594 270133 232341 217243 252722 -295959
17272 330628 -206894 57390 -91955 111669 221276 169429 211942 61717 193551 212757 20876
17260 169394 314476 410836 262112 483990 235773 222987 -60386 182616 218293 162809
17250 162809 68178 303017 560096 179117 176932 401365 217331 439724 517133 -72180
17239 -194809 135399 158027 384030 330369 98158 -67420 -68084 544308 295801 355790 386268
17228 386268 208065 188201 206024 191093 156435 206157 493734 239731 619383 657244 42205
17216 390016 384514 318357 107770 304339 293615 187834 41358 269704 -61813 278816 226089
17205 226089 440055 208366 29231 348839 573393 -68031 483822 41426 410578 429511
17195D29511O2613A94651K67498j76359j6124P8632P2469m8719A36185J53110
17185B89295M5275F8190L5445j5926K66737N4063I8737L02784D3379K45242J09952
17174C98573j27758r7930J26653R3080j72348J67963q7640K02617j95907m499
17164C02804j00574m2857K8073k5761K51964j290j886o6554J38016k10143J19699
17153C91491N8387J35039J94170C08960J98610r3750j18496J10886j19280J53806
17143D40736j86140q8572M7079p9789L50722k30738J53747M0547O302A65119Q7435
17132B52554K6902M1567J67281A90484L55015P9464k92015n8016J70046j64539
17122B80439J78080m9261A73537R3644J83790j12772J67217A30406J7714M19648
$$ plain form
17195 429511 492124 194651 462149 285790 269666 348298 420767 372048 136185 289295
17185 289295 334570 68190 103635 87709 354446 408509 98737 401521 43379 288621 398573
17174 398573 270815 172885 299538 392618 220270 388233 300593 503210 307303 302804
17164 302804 202230 159373 187446 161685 413649 412359 410473 343919 481935 271792 391491
17153 391491 449878 584917 779087 308960 507570 413820 295324 406210 286930 440736
17143 440736 254596 166024 213103 133314 484036 253298 407045 447592 453894 165119 252554
17132 252554 279456 321023 488304 190484 545499 624963 332948 274932 444978 280439
17122 280439 458519 409258 173537 267181 450971 338199 505416 130406 148120 567768
17112E67768K28422C68240o2766j19821M67056j64420m8675B12691N11316k31940
17102D92067l8056J557N8031K758j0977j7368j27195K33984K17943l92521J58707
17091E78930k4903G9886K62185K48922m8582K143J38498l23460j28031a9456F37184
17079D24968l7936m8691P2175K47032N3633A26578M60503O013J40059j63734j8578
17068E50841O4609L1997J56991N143C74715L77567p2057L1641J3277p7446j3281
17057F34416n8477j03258L55519j93879J85237J46286D33597L04759j777k86203
17047D50376K32751j98947j6399P6999J7466N8204J26510C39902K93329K3830
17037F57061q5273J1936K02934j80333j9927j27969J07035M6534J64693l9037
$$ plain form
17112 567768 796190 368240 305474 185653 652709 488289 439614 212691 724007 492067
17102 492067 454011 455568 513599 516357 505380 488012 360817 594801 812744 420223 578930
17091 578930 554027 79886 342071 590993 542411 544554 683052 359592 231561 -19456 637184
17079 424968 387032 338341 410516 657548 711181 126578 587081 593094 733153 569419 550841
17068 550841 615450 647447 804438 809581 374715 752282 680225 711866 725143 647697 634416
17057 634416 575939 472681 828200 634321 819558 965844 433597 738356 736579 450376
17047 450376 683127 484180 467781 544780 562246 620450 746960 339902 633231 657061
17037 657061 571788 583724 786658 606325 586398 458429 565464 611998 776691 737654
17027G37654j14452k54010L42686J83938k16194P5772J54141j99111l31671L38063
17017G16816n7195J91616k33375m7913N559K73934O7534J5547j65919M62581E29685
17005I41059k32674m343J99366j50341L33430j66075M5598m48664N73292k21544
16995H69104k66681J5831K89798l63284L47848J09796K8120k9166k62270L26961
16985A066057k05937J23464k00882j68040P8476P7761L14922l1825J95918m16245
16975H33669l20558K07898L47284l44316L29015j208P1444p0376j24523L86805
16965A315134O2799l07337r6628N9409q8289K08260r9295k69964N14902Q5852
16955A384843q8255J85951k99843k16564J89219p8813O6031P3351J06250M3153
$$ plain form
17027 737654 623202 369192 711878 895816 679622 755394 909535 710424 378753 716816
17017 716816 659621 851237 617862 569949 575508 849442 916976 932523 766604 1229185 529685
17005 941059 708385 704042 903408 753067 1086497 920422 966020 517356 1090648 869104
16995 869104 602423 618254 908052 544768 892616 1002412 1030532 1001366 739096 1066057
16985 1066057 860120 983584 782702 614662 693138 770899 1085821 1053996 1249914 833669
16975 833669 513111 721009 1068293 723977 1052992 1051784 1123228 1052852 928329 1315134
16965 1315134 1377933 1070596 973968 1033377 945088 1153348 1054053 784089 1298991 1384843
16955 1384843 1296588 1482539 1182696 966132 1155351 1076538 1142569 1215920 1322170 1365323
16945A365323m18970N25249l62612J39238k14671j29035N84249O28j44515j43477
16935A201407L91256k40417J19620m9895Q1852m8751j22544J89363N9463P971
16925A589325J33463j44405m09816L14964L10646k37957L6084J49624j11710J26173
16915A756391k40796k0766L14147K10998l85647o1391j43310O53508l15863p6941
16905A690330K33416P3586l79283k6519N29531j01017J8681M2056K5768l59996
16895A746553J11070J10061J31625K4186k09323N2838K654m0420K96212J10654
16885B336110r0006K22416p2326J57518n58731N21024j8193M5336K54844l83547
16875B414445J75981N4419j62173N02666k49321Q4885R9514q0409J52956L1015
$$ plain form
16945 1365323 946353 1471602 1108990 1248228 1033557 904522 1488771 1489399 1344884 1201407
16935 1201407 1592663 1352246 1471866 1421971 1503823 1455072 1332528 1521891 1581354 1589325
16925 1589325 1722788 1578383 1168567 1483531 1794177 1556220 1592304 1741928 1630218 1756391
16915 1756391 1515595 1494829 1808976 2019974 1634327 1572936 1429626 2083134 1767271 1690330
16905 1690330 1923746 1997332 1618049 1591530 2121061 2020044 2038725 2080781 2106549 1746553
16895 1746553 1857623 1967684 2099309 2123495 1914172 1967010 1969664 1929244 2225456 2336110
16885 2336110 2246104 2468520 2396194 2553712 1994981 2516005 2497812 2543148 2797992 2414445
16875 2414445 2590426 2644845 2482672 2985338 2736017 2820902 2920416 2840007 2992963 3023978
16865C023978J39552p80176N77757j70055K97790j71905L46417l35760Q1099j9209
16855B989488K22779k28528M21442K5466l25610M63607j29802K45307N5839j54402
16845C585586M53610k02949m1301J59902Q9928p2005K04799j39123M1903R2721
16835D173071Q8786J09629m0143M45126k6500j64782j45208K33516L10150m5060
16825D938585O11790k08993J267K98720J59585M3694l12035k14313N05201M51908
16815F275409r0608K40719L19467k53265K39774M16052p6082k2656L29638K28182
16805G606630j04010K42455L59465K41414J21594J85140k70804M85221L61093
16796I228198l6687M30538l383O30957j18541N00710L2994L83458K49797L09695
$$ plain form
16865 3023978 3163530 2383354 2961111 2791056 3088846 2916941 3263358 2927598 3008697 2989488
16855 2989488 3212267 2983739 3405181 3430647 3105037 3568644 3438842 3684149 3739988 3585586
16845 3585586 4039196 3836247 3794946 3954848 4044776 3972771 4177570 4038447 4080350 4173071
16835 4173071 4261857 4371486 4331343 4776469 4749969 4585187 4439979 4673495 4983645 4938585
16825 4938585 5550375 5341382 5342649 5641369 5800954 5844648 5532613 5318300 5823501 6275409
16815 6275409 6184801 6425520 6744987 6491722 6731496 7147548 7071466 7048810 7378448 7606630
16805 7606630 7502620 7745075 8104540 8345954 8467548 8652688 8381884 8867105 9228198
16796 9228198 9191511 9622049 9618666 10249623 10131082 10631792 10664786 11048244 11298041 11607736
16786A1607736M9360M78684J49664O62770K34203O00157L63963N17181K66981
16777A4930699M95815N38167L58181M45607N84657M39169P82706R5769J029530
16768A9700300Q74753Q24873N15835J253796N40588P62769R21937J179561Q09830
16759B7384242J198334Q33665J308425J070600J428155J643550J433593J581729
16751C7882293J808213J623400K289223J823521K219597K472837K362981K530838
16743E5012903K620280L224397L061954L411777L881137L451916M135382M223058
16735H3022804M870740M731411N274320N513818N326461O009604O077416O421423
16727A27247997O331380O657461O342043O461925N863147N961512M891668M736425
$$ plain form
16786 11607736 11657096 12135780 12285444 12948214 13182417 13782574 14146537 14663718 14930699
16777 14930699 15426514 15964681 16322862 16768469 17353126 17792295 18575001 18670770 19700300
16768 19700300 20575053 21399926 21915761 23169557 23710145 24472914 25394851 26574412 27384242
16759 27384242 28582576 29416241 30724666 31795266 33223421 34866971 36300564 37882293
16751 37882293 39690506 41313906 43603129 45426650 47646247 50119084 52482065 55012903
16743 55012903 57633183 60857580 63919534 67331311 71212448 74664364 78799746 83022804
16735 83022804 87893544 92624955 97899275 103413093 108739554 114749158 120826574 127247997
16727 127247997 133579377 140236838 146578881 153040806 158903953 164865465 169757133 174493558
16719A74493558M090270K468863J867451Q31012l87517j521471k171058l808831
16711A75862277m267125n185661n898310o411252o216733p034962o850298o969802
16703A27028134o653189o222635o549698n961133n561332n049350n518037m817242
16695H0695518m658868m468101l509318m089330l223200l043808l146824k923754
16687E1632315k759823k305009k092201k182356k007133k028732j866897j615038
16679C4775126j276063k181716j063680j184178j492023n94147j487424j093840
16671B4402055p91363p86731j109494n94763r65764q25082p16566n93493o48540
16662A7370259o34906m89818m73049m74053n28788m09537o78805n08242j44029
$$ plain form
16719 174493558 178583828 181052691 182920142 183751154 183363637 181842166 179671108 175862277
16711 175862277 171595152 166409491 160511181 154099929 147883196 140848234 133997936 127028134
16703 127028134 120374945 114152310 107602612 101641479 96080147 91030797 85512760 80695518
16695 80695518 76036650 71568549 68059231 63969901 60746701 57702893 54556069 51632315
16687 51632315 48872492 46567483 44475282 42292926 40285793 38257061 36390164 34775126
16679 34775126 33499063 31317347 30253667 29069489 27577466 26983319 25495895 24402055
16671 24402055 23610692 22823961 21714467 21119704 20153940 19328858 18612292 18018799 17370259
16662 17370259 16735353 16245535 15772486 15298433 14769645 14360108 13681303 13173061 13029032
16653A3029032n77064m58657n80522K8584J14753m55477m73989l35303l42893
16644I948464l28949k99385j24117k44469n15388l2869j5369j83570n18534m0290
16634G645524m68024p6896k69542N2610k58814k68778J63242n68212R8056K79900
16624F329066m11418l65247K9954l7955K20826o17740j14531l9756P6575k83345
16614D786429m3241j19271J60470m45319J5374j37692n0429k6359l02225j91409
16604C646328M27329l77496n9356K23391j19997l40715j04178O052J82970m46809
16594C037519K80751k79141J39667j43014k71667M27490l14995J81587m70669
16585B587528K40781m54499N96323o5879l98522J47144j72489L2434m0120l25164
$$ plain form
16653 13029032 12451968 11993311 11412789 11441373 11556126 11100649 10626660 10291357 9948464
16644 9948464 9619515 9320130 9196013 8951544 8436156 8403287 8387918 8204348 7685814 7645524
16634 7645524 7177500 7100604 6831062 6883672 6624858 6356080 6519322 5951110 6049166 6329066
16624 6329066 5917648 5552401 5582355 5544400 5765226 5147486 5032955 4993199 5069774 4786429
16614 4786429 4743188 4623917 4784387 4339068 4354442 4216750 4166321 4139962 3837737 3646328
16604 3646328 4073657 3696161 3636805 3860196 3740199 3399484 3295306 3301358 3484328 3037519
16594 3037519 3318270 3039129 3178796 3035782 2764115 3191605 2876610 3058197 2587528
16585 2587528 2828309 2373810 2970133 2904254 2505732 2652876 2480387 2512821 2472701 2147537
16575B147537K15185K08714j04425q8473k80754m0113o3439R8483j37944r6326
16565A858445L692J5129J96973j95607j75266J97157k16385M3523j13475J68382
16555A782568M8345j36907J60740l35060K7831K39038m88403K94184J30289M7902
16545A770527m64562j07621J46253K20075l65697N06990l80098l83652N29016
16536A471231j04976l47234N4462K38161P513j96752K19811J0332j07175J12390
16526A357763k22624K49825k85811K33302l90477K49853k44554K82467L88520
16517A618264p86365L97727j9157l2818m69131M21581q7737N7411j94153K80443
16507A186065R0368j02773m25369L23519j41789m6290L43184k65537p6937j36296
$$ plain form
16575 2147537 2362722 2571436 2467011 2378538 2097784 2057671 1994232 2092715 1954771 1858445
16565 1858445 1862137 1877266 2074239 1878632 1703366 1900523 1684138 1727661 1614186 1782568
16555 1782568 1830913 1694006 1854746 1519686 1547517 1786555 1298152 1592336 1722625 1770527
16545 1770527 1305965 1198344 1344597 1564672 1198975 1705965 1325867 942215 1471231
16536 1471231 1366255 1019021 1073483 1311644 1319157 1122405 1342216 1352548 1245373 1357763
16526 1357763 1135139 1384964 1099153 1332455 941978 1191831 947277 1229744 1618264
16517 1618264 831899 1229626 1210469 1177651 708520 1130101 1042364 1099775 905622 1186065
16507 1186065 1276433 1173660 748291 1071810 930021 883731 1226915 961378 884441 748145
16497G48145L86993l14075J26833N0066J45911l91076j7275J19114j06045O3716
16487H12307j59298K24859j67331k21359L32070N9680j30502J60483j6890C18133
16476F91840P604k37243K76485J38966m24891K38657j25962j74968L9945L93018
16466H23451k45291M17703D35008Q244Q9105K40679C48605L67521k26136q7970
16456D02020j39922A02204L53154q5960P2247j10296r4547K90818j22793R0939
16446D95766J91346k18351J32852p1786j05689J94175j41173J22876P5267k61173
16436D14110J64760j52069J82321K2095k4735B77371K40138O5135B37233L12868
16426E50101o5294j7979q7645J60512j04872I4556J26160j07288L27121l012D2178
$$ plain form
16497 748145 1135138 821063 947896 997962 1143873 752797 735522 854636 748591 812307
16487 812307 653009 877868 710537 489178 821248 880928 750426 910909 894019 318133
16476 691840 699444 462201 738686 877652 452761 691418 565456 390488 430433 823451
16466 823451 578160 995863 435008 443252 532357 773036 348605 716126 489990 402020
16456 402020 262098 102204 455358 369398 441645 331349 236802 527620 404827 495766
16446 495766 687112 468761 601613 529827 424138 618313 477140 600016 675283 414110
16436 414110 578870 426801 609122 631217 606482 277371 517509 582644 237233 550101
16426 550101 484807 466828 379183 539695 434823 94556 220716 113428 440549 437537 42178
16414A66625M2413M6945M44724A12960O7392L12305q8818L01798C10184j05387
16404B04797o3933J56887M1604i2971C90725j2993O76K11417j46521M4713j80882
16393C07135k7202J69188p7853J5163j41760K34765j85441J91719O268I1626K58140
16382C49766j70545d3734D25031B4298L75769A93025J30832A24691L29138A95183
16371B75100J22309A53761K15214A79633g6219C27851L3324J55408A75225J98994
16361C74219j79661k4411c0827A08520J52681O339k7926b41242C51089A54308
16350a7082C14840k1517m8319H9558K01852b2266A13958L68514j20418H8873J90623
16339B79496r0565j0754K6147n6109J82675A18889L95231k30383O2475o0379a2432
$$ plain form
16414 166625 209038 255983 700707 112960 180352 492657 403839 705637 310184 204797
16404 204797 140864 297751 339355 -92971 390725 377732 378408 589825 443304 488017 307135
16393 307135 279933 449121 371268 386431 244671 479436 293995 485714 491982 91626 349766
16382 349766 179221 -43734 425031 24298 400067 193025 323857 124691 453829 195183
16371 275100 397409 153761 368975 179633 -76219 327851 361175 516583 175225 374219
16361 374219 194558 170147 -30827 108520 261201 267540 239614 -241242 351089 154308
16350 -17082 314840 293323 245004 89558 291410 -22266 113958 482472 362054 88873 279496
16339 279496 188931 178177 204324 148215 330890 118889 514120 283737 346212 285833 -12432
16327B17128e262C8718L21352H2544H316K51654d6839B49360K763h8931C53945
16315B30109k5017E561K42126d25651i4871B16989a36450C8898J1712O7360J57816
16304B75786A17610B0993M7627i7268I1607L87104h8030A08968C5079b3226A31814
16292b0506E29489A07986k4244J83519I3587K93721A72119M8788J08489a3986
16281A06960B405K33174J19751D7037L5523a11480c041m1564A12879L0980k8380
16270A15479j6068m4406J56365e0523B505K3432K18672m7327M1884A18831A2218
16258D18488c45523B30683e6701k76J5158A72092a94295B10206m7151b17381f9234
16246B21252D1162k0272L23716o8738J3685a35256A15204N7437D9707J69000i3240
$$ plain form
16327 217128 -5262 38718 360070 82544 8316 259970 -46839 249360 252123 -88931 353945
16315 230109 205092 5561 247687 -425651 -94871 216989 -136450 38898 50610 117970 275786
16304 275786 117610 20993 68620 -97268 91607 478711 -88030 108968 35079 -23226 131814
16292 -20506 529489 107986 83742 267261 93587 387308 172119 220907 329396 -13986
16281 106960 2405 235579 355330 47037 82560 -111480 -3041 -44605 112879 143859 115479
16270 115479 99411 55005 211370 -50523 2505 25937 244609 197282 239166 118831 12218
16258 418488 -345523 230683 -56701 -56977 -41819 172092 -194295 210206 163055 -217381 -69234
16246 221252 41162 20890 344606 275868 289553 -135256 115204 172641 49707 218707 -93240
16234G8008L05173e9220k92057A83918H6153c0114D34440A6668e3825B22197I8856
16222a04128C82567N9974e6595a2960C8365b5749C4456H676a82928A11670C69
16210C07181c3099H5519M2836a54468A66077a63833N2009I0295a91900B72455
16199A90800A6327J03703a36112a8657j21550k554A4783J60150a29157F594a15984
16187b66961m5998a52060B2504d6092o9220A62851k0061a64480A23314a7398j8383
16176c5781F2615J37767M0780n3568g8722B79385a65030H426J00124e8234H5189
16164b18155H9314d4623k17765P0900B10682E0895c31318g7906A38226p581J02008
16153B32653f0312D2310a03046B61720C1954j3371b49011h5395A54453E0787b15931
$$ plain form
16234 78008 383181 -59220 -351277 183918 86153 -30114 434440 16668 -53825 222197 98856
16222 -104128 382567 442541 -56595 -12960 38365 -25749 34456 8676 -182928 111670 369
16210 307181 -33099 85519 128355 -154468 166077 -163833 -111824 90295 -191900 272455
16199 190800 16327 120030 -136112 -18657 -140207 -142761 14783 174933 -129157 6594 -115984
16187 -266961 -312959 -152060 22504 -46092 -115312 162851 142790 -164480 123314 -17398 -35781
16176 -35781 62615 200382 241162 187594 -78722 279385 -165030 8426 108550 -58234 85189
16164 -218155 89314 -44623 -262388 -191488 210682 50895 -331318 -77906 138226 130645 232653
16153 232653 -60312 42310 -103046 261720 31954 18583 -249011 -85395 154453 50787 -215931
16141D06849j23783e8511A29673k4049c3879B7028O8814a35738l005L6832j20487
16130b22398b0203C92053A03106b29274B24594k7698F9802j2198a32754B15599
16119a30712A45985E9809K54677A5711c24738f5039m320L3492k11932R3336D8172
16107c26427D85006a07867j04659K1545B6785a27412a767I5044L6182p774a870
16095a99894a1389B28946P2944a35738p1982M0084E11767F9853a85970H9616e9024
16083c55728A60596N4262D3011J98214G6349c6167B04349b94441B69963I8215
16072h0969J4891C7530c8311B23503d089B9341b34184B55912c4882B48024a03014
16060c3158A33034c6105A04407i8952c455j5153D09137A34258J81905a16340o7515
$$ plain form
16141 406849 283066 -58511 129673 105624 -33879 27028 95842 -135738 -138743 -101911 -222398
16130 -222398 -20203 392053 103106 -229274 224594 196896 69802 57604 -132754 215599
16119 -130712 145985 59809 314486 15711 -324738 -65039 -69359 -35867 -247799 -154463 48172
16107 -326427 485006 -107867 -212526 -190981 26785 -127412 -1767 95044 131226 123452 -1870
16095 -199894 -11389 228946 301890 -135738 -207720 -167636 511767 69853 -185970 89616 -59024
16083 -355728 160596 214858 43011 241225 76349 -36167 204349 -294441 269963 98215
16072 -80969 -66078 37530 -38311 223503 -4089 29341 -234184 255912 -34882 248024 -103014
16060 -33158 133034 -36105 104407 -98952 -3455 -18608 409137 134258 316163 -116340 -183855
16049a83855h9438A7471Q6568a05122L5811l10729a6502B5842d3832Q300n7562
16038i3094K8310l46038a65136A07174a17921J3193j48888O9017r9100a35476
16027a10340J8813k14828m3168J32053d9704J4453j11066A70633c09821c1046
16016E9821j3489a12253k41300J04311C4661b70666d3587k14667D07078N6565
16006D63643a99024j18694D9417b05119B09491I5265c9029l406J9732b36k10470
15995b10706h3689j47212B05179a20108A5078K52646i8700B51892A22850n6626
15985F6224b9974B56858J41594R9297k1971k3106A67379D7051K42011d2824I8353
15973d4816J1568j97475D0955a911j0545C33820B7208K9743a05293A27796a82465
$$ plain form
16049 -183855 -89438 17471 104039 -105122 -69311 -380040 -16502 25842 -43832 -35532 -93094
16038 -93094 -64784 -410822 -165136 107174 -117921 -104728 -253616 -184599 -283699 -135476
16027 -110340 -91527 -306355 -349523 -217470 -49704 -35251 -146317 170633 -309821 -31046
16016 59821 46332 -112253 -353553 -249242 34661 -270666 -43587 -258254 407078 463643
16006 463643 -199024 -317718 49417 -205119 209491 95265 -39029 -42435 -22703 -236 -210706
15995 -210706 -83689 -230901 205179 -120108 15078 267724 -98700 251892 122850 66224
15985 66224 -29974 256858 398452 497749 475778 452672 167379 47051 289062 -42824 98353
15973 -44816 -33248 -230723 40955 -1911 -12456 333820 27208 56951 -105293 127796 -182465
15961A61275d5128A17608b96615A2211K03354A8744k99e3088k15241d8197a601
15949e1764B38777e56079A58552d13817c2112A44438A2021J71223F1733c32698
15938d8064A1943M5810a17660m25043J58306K2963J73076k38021J15694b7872
15927B81181a17598D8892i8951A91559a11690J1429A10396d0584J5046j20086
15917a45624c7750C5225e2310j74283A05972a13337c4323F2168i6105F0814h0864
15905F1364J9337d4291K0967l71315a03264L0753A03056c15530C42507D1590e423
15893d42461a04562G8769A4543a95187B3314N8157a11578A19008n0342M413b08108
15881a2168j03k7360F2437N0583c33246A48651E1631J88546c23430A03828a41272
$$ plain form
15961 161275 -45128 117608 -296615 12211 215565 18744 18445 -53088 -268329 -48197 -1601
15949 -51764 238777 -556079 158552 -413817 -32112 144438 12021 183244 61733 -332698
15938 -48064 11943 57753 -117660 -542703 -384397 -361434 -188358 -426379 -310685 -27872
15927 281181 -117598 48892 -98951 191559 -111690 -100261 110396 -40584 -25538 -145624
15917 -145624 -37750 35225 -52310 -226593 105972 -113337 -34323 62168 -96105 60814 -80864
15905 61364 80701 -44291 -23324 -394639 -103264 -72511 103056 -315530 342507 41590 -5423
15893 -442461 -104562 78769 14543 -195187 23314 81471 -111578 119008 68666 73079 -208108
15881 -12168 -12271 -39631 62437 113020 -333246 148651 51631 240177 -323430 103828 -141272
15869C6056P503a23309r884A5666b14793i03A21735n9489b45173B1456b22046
15857I3223a50759B38999p8666l6975m8717J21269A0870L31234a6720A65669a52804
15845b01508j5594r5582e6469O784a1888j60240K9337N7936n3970e0288b0741
15833c4576j7327H5440d8971E2142O5282k792g6460A47885f2846A97695d1809
15821h4746n430F2118b18208G6690d375E5048J86187a23105K1738j721q8419p9104
15809b70611C51026A57797N7718a00301b5746D071e2191j53120F8149Q5897b70058
15797F0096a79190N8145l663A1017f3146C9476i9720A4079J07830n9690m726b07637
15784a86047E384e2068n3203A96011i909j21227C77167I6682e3131j6642j933
$$ plain form
15869 36056 43559 -123309 -133193 15666 -214793 -903 121735 62246 -245173 21456 -222046
15857 93223 -150759 238999 160333 123358 74641 195910 10870 342104 -16720 165669 -152804
15845 -201508 -217102 -312684 -56469 -49685 -11888 -172128 -142791 -84855 -138825 -50288 -20741
15833 -34576 -51903 85440 -48971 52142 117424 114632 -76460 147885 -62846 197695 -41809
15821 -84746 -90176 62118 -218208 76690 -4375 55048 241235 -123105 -101367 -103088 -191507 -270611
15809 -270611 351026 157797 215515 -100301 -25746 4071 -52191 -205311 68149 154046 -270058
15797 60096 -179190 -121045 -124708 11017 -63146 39476 -99720 14079 121909 62219 57493 -207637
15784 -186047 5384 -52068 -105271 196011 -9909 -131136 377167 96682 -53131 -69773 -71706
15773g1706j23958B19774f7579C9635F283c6909a1721k58022f7732I0876a34267
15761B8575K78796G6891b6707o9421L1912k4787j0599A69263h4245B43525C4970
15749E69645c6129q8552A58895a7703k45809O6700e1045C08719i0972k31686E2586
15737e5299A14025f6019k63353J58219A74121n3845b5043A29288d6200D2806i7252
15725g8434j06991A1986g1986k48323a26588r241n903N3671g650D24501h4121
15713C575K19379c06977B36922G2018J04924b8360l94133A13694a55105N975B46201
15701C004a36000b6676k8276A07897a11607g592j9764B58484D9740f3589L791
15690e9798J1385m3042C8178a19134l7531H4439J2188a91366l362B18991e3960
$$ plain form
15773 -71706 -195664 219774 -67579 39635 6283 -36909 -11721 -269743 -67732 90876 -134267
15761 28575 307371 76891 -26707 -96128 -64216 -89003 -99602 169263 -84245 243525 34970
15749 569645 -36129 -124681 158895 -17703 -263512 -196812 -51045 308719 -90972 -322658 52586
15737 -55299 114025 -66019 -329372 -171153 174121 120276 -25043 129288 -46200 42806 -97252
15725 -78434 -185425 11986 -71986 -320309 -126588 -135829 -141732 -88061 -7650 424501 -84121
15713 3575 222954 -306977 236922 72018 176942 -28360 -422493 113694 -155105 -149130 246201
15701 3004 -136000 -26676 -54952 107897 -111607 -7592 -27356 258484 49740 -63589 -59798
15690 -59798 -48413 -91455 38178 -119134 -156665 84439 96627 -191366 -194728 218991 -53960
15678C1829b94739A71749G4081a97864d1449A6084a92541C34194a89025M1072
15668a47953B75747b76329A67719A7409b40446A76941R125c185j76161b5298l33496
15657c58794E3342J89955k818j04797a86810C83460a5176E2619a51352i13n4073
15646e4986E3551b42339C81802b02753r2375I1880L8362a72560B40469a08570
15635i4480C2846J58409a69849H384a30738F6963J41081b48084r4541A5138a93403
15623F4598j0470L47525G1482b8916G6181M9851A4425a68911A8876b12490r0376
15612c02866i6592r8710I7713H30J53527m2721a0829j8841C9280h1015C8185j4682
15600B3503K2934O1768A1558b5902j25100G0849C0869a5314B1064P7077c14062
$$ plain form
15678 31829 -294739 171749 74081 -197864 -41449 16084 -192541 334194 -189025 -147953
15668 -147953 275747 -276329 167719 17409 -240446 176941 186066 -3185 -179346 -25298 -358794
15657 -358794 53342 243297 240479 135682 -186810 383460 -15176 52619 -151352 -913 -54986
15646 -54986 53551 -242339 381802 -202753 -295128 91880 130242 -172560 240469 -108570
15635 -94480 32846 191255 -169849 8384 -130738 66963 208044 -248084 -342625 15138 -193403
15623 64598 54128 401653 71482 -28916 76181 126032 14425 -168911 18876 -212490 -302866
15612 -302866 -96592 -195302 97713 830 154357 111636 -10829 -29670 39280 -81015 38185 23503
15600 23503 46437 108205 11558 -25902 -151002 70849 30869 -15314 21064 98141 -314062
15588h4957A21698N5916Q5705I4320M4868Q8155q6691n6227c2169A00586f2265
15576b03316B31640j05969A5750h5075p8278A30411C5899Q777J4968K40140J63776
15565D63560d6156D0952a79948e7312I8209f475m1157F5949a4133o9779A11520
15553b37875F7005b05444P9679F1385N6007a04504J5786k45577A70125A0215J11543
15542A21758M0570A681K46723a02876C1880O1422a466A45466a62061n9551A51923
15530B31369b14781A6114a28589D6401i7635r2332C6814j0850i3011j45236A12344
15518d4359B33106I0600e2411A66159J72763r4098B0407b30380j01594B23401
15507A2053a64242J1752B67293G1746k8873N889g5405c0028j82551I124J23259
$$ plain form
15588 -84957 121698 177614 263319 94320 139188 227343 140652 84425 -32169 100586 -62265
15576 -203316 231640 125671 15750 -85075 -163353 130411 35899 44676 59644 299784 463560
15565 463560 -46156 40952 -179948 -57312 98209 -6475 -47632 65949 -14133 -83912 111520
15553 -237875 67005 -205444 -125765 61385 117392 -104504 -88718 -334295 170125 10215 121758
15542 121758 162328 1681 248404 -102876 31880 93302 -1466 145466 -162061 -221612 151923
15530 231369 -214781 16114 -128589 46401 -97635 -189967 36814 25964 -93011 -238247 112344
15518 -44359 233106 90600 -52411 166159 338922 244824 20407 -230380 -331974 223401
15507 12053 -164242 -152490 267293 71746 42873 48762 -75405 -30028 -212579 9124 132383
15496A32383b87454c3722A47746J1800R1785a74256I260N7914a26990j20589c5520
15484a34073H0977c0506o6593G8090J03616e8129o0887B82982i2811b7308a2147
15472A6432J07702J8051F1828j8323i3210o9573g3324K9149A28953e3561I9139
15460a45187G6588a01924b9249G9389k8070K65926e457A12826a48787B09259b27021
15448d8157A65597a53195K3271a6435A79213k6502a30130j93623G3287K91507
15438C64794E9251f929E05N9537J92176C6330J53253J12994H5677D083h8858j75965
15426b64823l6293B0036R8182a52178g5052A37539g1439j00886b1415k28859B9937
15414H0958K35221a7114d677A85234h7862M0709A85497b57970L8729j66391a08690
$$ plain form
15496 132383 -287454 -33722 147746 159546 251331 -174256 9260 67174 -126990 -247579 -35520
15484 -134073 80977 -30506 -97099 78090 181706 -58129 -119016 282982 -92811 -27308 -12147
15472 16432 124134 142185 61828 43505 -93210 -162783 -73324 -44175 128953 -53561 99139
15460 -145187 76588 -101924 -29249 79389 51319 317245 -5457 112826 -148787 209259 -227021
15448 -48157 165597 -153195 -129924 -16435 179213 152711 -130130 -323753 73287 364794
15438 364794 59251 -6929 505 60042 252218 36330 189583 302577 85677 4083 -88858 -264823
15426 -264823 -301116 20036 118218 -152178 -75052 137539 -71439 -172325 -21415 -250274 29937
15414 80958 316179 -17114 -4677 185234 -87862 -47153 185497 -257970 -219241 -385632 -108690
15402G6144A6263J1830J98553J40314A38009b30086A58589G7433j329J23541a4434
15390A79479a80305j03834j69841b14442D7966f913B4162b42023B74602h2306
15379a13510G2407J47569a39431F8304P8349F750d9406j5636A79406G1013d167
15367A87439F5169b2998o5433H258J98464J49403a17926J3270A99526L2718h3517
15355C9926J50710E2360J2373B8766J25796J85923c9383j11465A08617j4268a63713
15343a96900A8717P3975J88839I5321D4868c18381i250j84870Q6515A46930a8864
15331B8732L06805A5128h4740A03152K28713a20484N6521E4368R2038A1842a43842
15319d4504r1208a3370A42005b84936A04674Q5651J01568a89832I1725C6719J7792
$$ plain form
15402 76144 16263 28093 226646 366960 138009 -230086 158589 77433 76104 199645 -14434
15390 179479 -180305 -284139 -453980 -214442 47966 -6913 24162 -242023 274602 -82306
15379 -113510 72407 219976 -139431 68304 146653 6750 -49406 -65042 179406 71013 -4167
15367 187439 65169 -22998 -88431 8258 206722 356125 -117926 -104656 199526 232244 -83517
15355 39926 190636 52360 64733 28766 154562 340485 -39383 -150848 108617 94349 -163713
15343 -196900 18717 92692 281531 95321 44868 -318381 -9250 -194120 -107605 146930 -18864
15331 28732 335537 15128 -84740 103152 331865 -120484 -63963 54368 146406 11842 -143842
15319 -44504 -135712 -13370 142005 -284936 104674 190325 291893 -189832 91725 36719 54511
15308E4511j627f0823A90509l4876g3096J2629B97277I9054J05259G3493a79608
15296C97499j52139A11804N6030c97044H9355J7680k2058A8908K35718A08396
15285B58775A9675J55852a51938B64548a89175f7959A62485L18594A64868r712
15275A55156K39294a2222j4360D90614H15a73482O1732j35b5421n1487D8613J77832
15263B26445r1567b70823A79182J58996E8978i6160d2759A32548O0088E7129K6165
15252H3294h2621E47313h4234B66165K1415O22247O69420k31803K77347J25983
15242A750774D34987n1418A01634j3300L01505a8716B75503b76038C8074P7206
15232A15280b5164F4910M3136r325L4615J5334o9634h0102A22181d1526Q685H4158
$$ plain form
15308 54511 52884 -60823 190509 155633 -73096 -60467 297277 99054 204313 73493 -179608
15296 397499 245360 111804 167834 -397044 89355 107035 84977 18908 254626 108396
15285 258775 19675 175527 -151938 264548 -189175 -67959 162485 481079 164868 155156
15275 155156 394450 -12222 -26582 490614 815 -173482 -111750 -111885 -25421 -76908 48613 226445
15263 226445 134878 -270823 179182 338178 58978 -96160 -42759 132548 192636 57129 83294
15252 83294 -82621 547313 -84234 266165 287580 909827 1579247 1347444 1624791 1750774
15242 1750774 434987 383569 101634 88334 389839 -18716 275503 -276038 38074 115280
15232 115280 -25164 64910 108046 98721 133336 148670 79036 -80102 122181 -41526 -32841 84158
15219c4587j28896A90349l563F3924J5424l3116I793h2022B09481d4145A96009
15207b67574a9541q4566l0459a0307C90528B4077L56175G1549b39090A57601K177
15196A59778J01921H1179K7599K74699j42179i9081n5880F3552j5545b1443a0222
15184a89125C9707K86824I6422a62329C14009a50016d3630A82253C5676R2615
15174A28291o1050K18676a42209I8315a32898A74386B1859K2655a15899d8838
15163H0103K60756A51323j13d5036j13865I0439J64441q0870L3487r6888i8874
15151A64680K40125A15143k8989B4645N1022L50590j59259H6825L1408c7684n1016
15140h8700B18408n6896F5344I671J10536K25213A20560J16487I8423K98452H946
$$ plain form
15219 -34587 -163483 190349 186786 63924 79348 46232 9793 -82022 209481 -44145 196009
15207 -267574 -19541 -104107 -134566 -10307 390528 24077 380252 71549 -239090 157601 159778
15196 159778 261699 81179 108778 383477 241298 -99081 -154961 63552 48007 -21443 -10222
15184 -189125 39707 326531 96422 -162329 314009 -150016 -43630 182253 35676 128291
15174 128291 67241 285917 -142209 98315 -132898 174386 21859 44514 -115899 -48838
15163 80103 340859 151323 151210 -45036 -158901 90439 254880 174010 207497 110609 -98874
15151 164680 404805 115143 86154 24645 75667 426257 266998 86825 118233 -37684 -88700
15140 -88700 218408 161512 65344 9671 120207 345420 120560 237047 98423 396875 8946
15128I5193b7075A43344k4850E3826j6012J96757B1036J07761B2387Q7967J71086
15117B81440J63615B16580N0157o7333b6287B66500i0400B84383l2617f4948E6672
15105b19242C22375a69273B8757O90923A09459J28177j00286N0618k7702G1696
15094A604J49535K020L54054j23220D1942f0659A01811M050J29116A15779J74947
15083B90726A27865M2287n059N181a54917A23791K05973J44955j98081O9405o0683
15072B85360F9060K41856J09073A77477P34A3304L17915a31961C76877b7535B94432
15060A59749L84116E0672N34853e7935A73131p4456K05065L0863h5472D25170
15049B22496H2781J19910H4228d0242j6246B61629J24948e381B63939a26055I7223
$$ plain form
15128 95193 -27075 143344 118494 53826 37814 234571 21036 128797 22387 110354 281440
15117 281440 445055 216580 266737 199404 -26287 266500 -90400 284383 251766 -64948 56672
15105 -219242 322375 -169273 28757 719680 109459 237636 137350 187968 160266 71696
15094 1604 151139 153159 507213 383993 41942 -60659 101811 105861 234977 115779 290726
15083 290726 127865 170152 165093 170274 -154917 123791 329764 474719 276638 346043 285360
15072 285360 69060 310916 419989 177477 178211 13304 331219 -131961 376877 -27535 294432
15060 159749 543865 50672 585525 -57935 173131 98675 303740 334603 -85472 425170
15049 222496 82781 202691 84228 -40242 -56488 261629 386577 -5381 263939 -126055 97223
15037B15204J17924j38995R1217r6338N7382J77557i4450o4993M091a8849A94498
15025f0707A66169K51398f2519K9459j12734C10582q5431n8249J21457O7232R6784
15014D52375j63006G6157j8936L30701A62627k8773M559a01057A74882C7425g1374
15002C47994p6433A29202J79705k7868A14505Q1512J81273p4611J16953k05590
14992B14042R9563K04904R7103B42371K9109L17356A73703L53909A45271J76342
14982C21613a63869B75607R2768H9701O08358C20035E0635L63094J76651B69080
14971C35918J22578p1977l8568J61448E8620N15256A87613M34591B30180K71648
14961E01828H365M42774A7681J68504j5362P5487p8621M9002l0160L74097p4309
$$ plain form
15037 215204 333128 194133 285350 189012 246394 423951 -94450 -159443 -155352 -18849 194498
15025 -60707 166169 417567 -62519 -33060 -145794 310582 225151 166902 288359 355591 452375
15014 452375 289369 76157 57221 387922 162627 133854 138413 -101057 174882 37425 -71374
15002 347994 271561 129202 308907 281039 114505 196017 377290 302679 419632 214042
14992 214042 313605 518509 615612 242371 271480 588836 173703 527612 145271 321613
14982 321613 -163869 275607 368375 89701 698059 320035 50635 413729 590380 269080
14971 335918 458496 386519 347951 509399 58620 573876 187613 622204 230180 501828
14961 501828 8365 451139 17681 186185 170823 246310 167689 216691 186531 560628 486319
14950D86319j33144A24734N65291C28761R3069i0409B13251m2807M51717B11941
14939D55924a37702B10378M9495F9898C2707L19516K11210k03365A25128J05880
14929B31008A0217L60498R0416o3991J38064A41506J31421H8714M73845H5696
14918B75656J9651J32409q2830A50506K84932K04291B56651J45877K79783l33547
14908C48764J74533M7453Q2681o1078J6539B83609N40035l61156K06988l15071
14898C54405L13034k05051k24727C3010J93774Q4578M45392C72515K5042A85359
14887C54771j6440j1878p55J57830J43941j62205O6455J2214j94809A19705J23748
14876B43453J70054K7527l1206j3299Q4962L25433C05409J38575J19259k39477
$$ plain form
14950 486319 353175 124734 690025 328761 421830 -90409 213251 170444 622161 211941
14939 455924 -137702 210378 259873 69898 32707 352223 563433 360068 125128 231008
14929 231008 10217 370715 461131 397140 535204 141506 272927 88714 562559 85696
14918 275656 295307 427716 344886 150506 435438 639729 256651 402528 682311 348764
14908 348764 523297 570750 653431 592353 608892 283609 823644 462488 669476 354405
14898 354405 667439 462388 237661 33010 226784 311362 756754 372515 397557 185359
14887 354771 338331 326453 325698 483528 627469 465264 531719 543933 349124 119705 243453
14876 243453 413507 441034 409828 396529 481491 806924 305409 443984 563243 323766
14866C23766J83078k09330l7676K92334P9091o3731k39533J11554K3648L71395
14856H34596j98897k24045J70713A94181J87339L29455N8880k56398k21605N7058
14846C48910j59507L05838J7162k714K10604m3659k13924J67044j36696L3888
14836E26946d1866F68007j09239k13515J84174A90197L05735J75387k12319Q5167
14826E44167N4745k73818J28261K71478r2514C13050N8238J18513K8428r2652
14816D25577J57776n5961J78389n1636q8231j60252j61437m5550L15067N1470
14806E65212B63294K87627j84030J00198P6413J0343n4112p6459K1659J21619
14796E66552j61278K11231j15186J50505B33076K92283j82107J3778M30187k38261
$$ plain form
14866 323766 506844 297514 259838 552172 631263 567532 327999 439553 463201 834596
14856 834596 635699 411654 582367 194181 381520 710975 769855 513457 291852 348910
14846 348910 189403 495241 512403 509689 720293 676634 462710 629754 493058 526946
14836 526946 -41866 668007 558768 345253 529427 190197 495932 671319 459000 544167
14826 544167 598912 325094 453355 724833 632319 313050 371288 489801 518229 425577
14816 425577 583353 527392 705781 654145 565914 405662 244225 198675 513742 565212
14806 565212 263294 550921 366891 467089 543502 553845 499733 423274 444933 566552
14796 566552 405274 616505 501319 651824 233076 525359 343252 357030 787217 548956
14786E48956j73446M28736k87035q2331M81644m07415k141P635K8289j7117k1632
14775E04143K90089k62112K9256L60241m11384J46796N24488n30009k48978L98782
14765H01312j09471j09565J29562L0356C28240N78605k9398k97870M55318j16370
14755I18525l12375j63084M86363m35438K84508K36065l47272J31352j80851j06369
14745E11424L54150k63062N1631J2604L1605K40836r0517k23124K36089j26831
14735G34805O1995J95187m17121K52743j95864M71043l94142L7287j77096O5324
14725F34161j46148K93834Q515N2388o4640q485N5155J78258j77136K9486J25139
14714I80527k98386K23494k93126O78532o27886L31890j56697q9237j14595J49183
$$ plain form
14786 548956 375510 804246 517211 434880 916524 509109 506968 514603 542892 525775 504143
14775 504143 794232 532120 561376 921617 510233 657029 1181517 651508 402530 801312
14765 801312 691841 582276 711838 742194 328240 906845 877447 579577 1034895 918525
14755 918525 606150 443066 929429 493991 778499 1014564 667292 798644 617793 511424
14745 511424 865574 602512 654143 666747 698352 939188 848671 625547 861636 734805
14735 734805 796800 991987 574866 827609 631745 1102788 708646 745933 568837 634161
14725 634161 488013 781847 790362 842750 778110 769625 824780 1003038 825902 855388 980527
14714 980527 682141 905635 612509 1291041 663155 995045 838348 749111 634516 783699
14704G83699j0248Q14K7428K0945Q9762K36022j62352J29239k88857j4622Q0749
14693H92579j36179K9266J22755J81238j12668j39326L47170j49182k9942j99692
14683H06019M71061l64723K59818l11410L02860j55027P1868j31481n83J02052
14673A050454j03505J98527K0137l10749n478M11748p5512k03860q6904Q1060
14663I75918m2674J45625l35917J62230J65273J61861k85961J93700J46740N6429
14653A343224k93101N9830N60227m51008n1852j39016L64450K11507o09796K07523
14643A201988K95966j76771k12636K15093k78961L21528r833J817K93910j78567
14633A473534q49J1842j19068r8489R0388q3293K5514o2981M13331j39539J40761
$$ plain form
14704 783699 773451 774265 801693 822638 912400 1148422 986070 1115309 826452 811830 892579
14693 892579 756400 785666 908421 1089659 976991 837665 1184835 1035653 1005711 806019
14683 806019 1277080 912357 1172175 860765 1163625 1008598 1080466 948985 948402 1050454
14673 1050454 946949 1145476 1165613 854864 849386 1261134 1185622 981762 894858 975918
14663 975918 933244 1078869 742952 905182 1070455 1232316 946355 1140055 1286795 1343224
14653 1343224 1050123 1109953 1670180 1219172 1167320 1028304 1392754 1604261 994465 1201988
14643 1201988 1497954 1321183 1108547 1323640 1044679 1366207 1356374 1358191 1652101 1473534
14633 1473534 1472685 1484527 1365459 1266970 1357358 1274065 1299579 1236598 1649929 1510390 1651151
14622A651151n40462M15009j05775K5708J06202j65899K17395n0369j49072K06358
14612A610246j05542J24347J2558k32902P327K18902K0056j11734K65450k94189
14602A514519P8368j8731R1573r5749L25883J57399j90499j98239L20036k19977
14592A764583j18221j96066L76374k45470K5377M48588o00730N23909k51842P6378
14582A802880J15769K5871J02025J7599M2170L6745k70087J49532J05028J01417
14572B228949p4762N4869k27324L20617j14947K08515K30168k15017m8492L39708
14562B702284n1490K44166M1166L5537L9356J85545P4943Q9201J47359R4890O73510
14551D276467O84829O63990J793946L962144P523485J8539336J2175626B0369607
$$ plain form
14622 1651151 1110689 1525698 1419923 1445631 1551833 1385934 1603329 1552960 1403888 1610246
14612 1610246 1504704 1629051 1641609 1408707 1416034 1634936 1654992 1543258 1808708 1514519
14602 1514519 1592887 1574156 1665729 1569980 1895863 2053262 1862763 1664524 1984560 1764583
14592 1764583 1646362 1450296 1826670 1581200 1606577 2055165 1454435 1978344 1726502 1802880
14582 1802880 1918649 1944520 2046545 2064144 2106314 2143059 1872972 2022504 2127532 2228949
14572 2228949 2154187 2209056 1981732 2302349 2187402 2395917 2626085 2411068 2362576 2702284
14562 2702284 2650794 2894960 2936126 2971663 3011019 3196564 3271507 3360708 3508067 3602957 4276467
14551 4276467 4961296 5625286 7419232 11381376 18904861 37444197 49619823 20369607
14542H734512j664263l422097j507615k28663o6441P7372J5578J59166j64500
14533A933049L3378K34940j34659J00404J16390j63047M97297m85556K12646N5879
14523B400721K54492Q8252l2977j78496J50318j78601l21989L37009Q7565J97204
14513B803498j98872O89144o61120J24880k18474J83138M80567k4694k85207m0741
14503B852119K9777K07155J30118M25625p48279M01879k5173J964K76899m53401
14493C098683J55432L83222l63521r3563L61007m49731N80193l51199O51915l79798
14483C592640L09836j4045L2873L2972K05417K2432l33441M5774K26985j46597
14473C974846K33134p7480J86275N2702j70268J40866l231K2280m0012L39569
$$ plain form
14542 8734512 7070249 3648152 2140537 1911874 1845433 1922805 1938383 2097549 1933049
14533 1933049 1966427 2201367 2066708 2167112 2283502 2120455 2617752 2132196 2344842 2400721
14523 2400721 2655213 2743465 2710488 2531992 2682310 2503709 2181720 2518729 2606294 2803498
14513 2803498 2604626 3293770 2632650 2757530 2539056 2722194 3202761 3178067 2892860 2852119
14503 2852119 2881896 3089051 3219169 3644794 2896515 3298394 3273221 3275185 3552084 3098683
14493 3098683 3254115 3637337 3273816 3180253 3541260 3091529 3671722 3320523 3972438 3592640
14483 3592640 3902476 3888431 3921304 3954276 4159693 4182125 3848684 3894458 4121443 3974846
14473 3974846 4207980 4130500 4316775 4369477 4199209 4340075 4336844 4359124 4319112 4658681
14463D658681j84148K09202K40695j19235o0548K54961J14440P3403m79497M04974
14453E112928J27924k02850K07086J29642j58443M59388m95711J83762K08622
14444E572348R6023L12609M8819n6892K4467M61057L8216k71801P4717K57046
14434F556609q3977L64305j8668J81777m3410R5546j32070K52812N3910J33251
14424G360085N3317L47316M1722m1286J9352K60397J75003j33572K31587k7556
14414H286365N66752j66935N1269J47848K64020J79143N2783j44539P9645J97116
14404I513467M92458J35182q5926M69748Q4838R8386J8786m9898P35831k62775
14394A1150097O14167m7528K12639J79528K30509M31782j62251K88308M89042
$$ plain form
14463 4658681 4474533 4683735 4924430 4805195 4744647 4999608 5114048 5187451 4707954 5112928
14453 5112928 5240852 5038002 5245088 5374730 5216287 5675675 5179964 5363726 5572348
14444 5572348 5668371 5980980 6029799 5972907 5997374 6458431 6496647 6224846 6299563 6556609
14434 6556609 6472632 6836937 6818269 7000046 6956636 7052182 6920112 7172924 7226834 7360085
14424 7360085 7413402 7760718 7802440 7761154 7780506 8040903 8215906 8082334 8313921 8286365
14414 8286365 8853117 8686182 8737451 8885299 9149319 9328462 9381245 9236706 9316351 9513467
14404 9513467 10005925 10141107 10055181 10524929 10609767 10708153 10726939 10677041 11412872 11150097
14394 11150097 11764264 11716736 11929375 12108903 12339412 12771194 12608943 12897251 13386293
14385A3386293L42472l38590L87596M92417l32116O06775J95838P43389J5723
14376A5499797O63623r0071M32590K22923L33847L08587L24341N50907K24400
14367A8470944M59612K69003K88444O20227K94393L64408O39364K69616L82656
14358B2058667Q55190K69812M24385R73892N03945L44374O61521Q73357L01143
14349B7266286Q40871M79494N91921J421762N11118N02950J099622N24374J377673
14340C4616071O58890J476588O04541Q42400J505160J017512J252089J304849
14332D3278100J215533J351627J530175J202899K132577J446751J787194J619461
14324E5564317J803670J855066K247305K507018K158953K459114K548265K451514
$$ plain form
14385 13386293 13728765 13390175 13777771 14270188 13938072 14544847 14740685 15484074 15499797
14376 15499797 16163420 16073349 16505939 16728862 17062709 17371296 17695637 18246544 18470944
14367 18470944 18930556 19199559 19488003 20108230 20402623 20767031 21406395 21676011 22058667
14358 22058667 22913857 23183669 23608054 24581946 25085891 25430265 26091786 26965143 27266286
14349 27266286 28107157 28586651 29178572 30600334 31111452 31614402 32714024 33238398 34616071
14340 34616071 35274961 36751549 37356090 38198490 39703650 40721162 41973251 43278100
14332 43278100 44493633 45845260 47375435 48578334 50710911 52157662 53944856 55564317
14324 55564317 57367987 59223053 61470358 63977376 66136329 68595443 71143708 73595222
14316G3595222K864389L360380K968127L530336L379863L572581M078040L776931
14308A01125869L976083M334046M759788N181258N053488N631300O224531O071290
14300A42357653O625668P440759P056846Q130566Q411572Q419613R396574R958029
14292B07797280J0330667J0604320J1100943J1745202J1961514J3074124J2977184
14285B89591234J3742105J4085177J4180233J4674373J4445237J4427715J4549152
14278C89695226J3572536J3286467J2447519J1503876R499058O125910J776155
14271D57906747J147274J493425Q87648l858296k740688o417608q911138j1743734
14263D27763630j3037435j4725622j5048977j5831022j5770285j6366990j5523065
$$ plain form
14316 73595222 76459611 79819991 82788118 86318454 89698317 93270898 97348938 101125869
14308 101125869 105101952 109435998 114195786 119377044 124430532 130061832 136286363 142357653
14300 142357653 148983321 156424080 163480926 171611492 180023064 188442677 197839251 207797280
14292 207797280 218127947 228732267 239833210 251578412 263539926 276614050 289591234
14285 289591234 303333339 317418516 331598749 346273122 360718359 375146074 389695226
14278 389695226 403267762 416554229 429001748 440505624 450004682 456130592 457906747
14271 457906747 459054021 460547446 461435094 457576798 454836110 448418502 439507364 427763630
14263 427763630 414726195 400000573 384951596 369120574 353350289 336983299 321460234
14256C21460234j5419540j5217445j4411792j3037548j2800327j2936249j1784256
14249B25853077j1319743j1270055r774112r387282q984366q054989q422149p180544
14241A51459837o782829p032167n897138n878038n513589n215069n279308m526932
14233A05334767m376417l916825l340876m090296l530798l762120l005893k950488
14225G6361054l124472k261121k704240k291524k607279j926115k045567k162363
14217E7238373k097599j567433j643887j207700j379573j675398j674358j336011
14209D4656414j463188j266953m46084r36174j914434j021548p54354j114216
14201C5739463r97861m11089j166327q05059j234533q40416o74064n90167n69117
$$ plain form
14256 321460234 306040694 290823249 276411457 263373909 250573582 237637333 225853077
14249 225853077 214533334 203263279 193489167 184101885 175117519 167062530 158640381 151459837
14241 151459837 144677008 137644841 131747703 125869665 120356076 115141007 109861699 105334767
14233 105334767 100958350 97041525 93700649 89610353 86079555 82317435 79311542 76361054
14225 76361054 73236582 70975461 68271221 65979697 63372418 61446303 59400736 57238373
14217 57238373 55140774 53573341 51929454 50721754 49342181 47666783 45992425 44656414
14209 44656414 43193226 41926273 41480189 40544015 38629581 37608033 36853679 35739463
14201 35739463 34741602 34330513 33164186 32359127 31124594 30284178 29610114 29019947 28450830
14192B8450830r04527m49540r81634o40773m50952n86011j016748j36308o76972
14183B2607365m48064l42688l67902q43430r1128o21592M3708o10704m26025m03199
14173A8496341m86881k3932p19378m24608j33892j58386n97153j75071o28287
14164A5148753k8043k47509l18462L2609l32642l36943k38847o6306j25600m02622
14154A3084388k90528p8211n51592M0285j30433k91544j64729j77884k52998K14008
14144A1400762n49629r3822j16173l25130j4373m8093j15608l59377j57144K1480
14134I642893k90651o5432k19571j81068q2930k23848J41875O0646m25507j89132
14124H167275P5929l07070J9233N616k56723j66860M8823p1798m86871J7338L82287
$$ plain form
14192 28450830 27546303 27096763 26115129 25474356 25023404 24437393 23420645 23284337 22607365
14183 22607365 22159301 21816613 21448711 20605281 20514153 19892561 19936269 19325565 18899540 18496341
14173 18496341 18009460 17985528 17266150 16841542 16707650 16549264 15952111 15777040 15148753
14164 15148753 15120710 14873201 14554739 14587348 14254706 13917763 13678916 13612610 13487010 13084388
14154 13084388 12793860 12715649 12164057 12204342 12073909 11782365 11617636 11439752 11186754 11400762
14144 11400762 10851133 10757311 10641138 10316008 10301635 10253542 10137934 9778557 9621413 9642893
14134 9642893 9352242 9286810 9067239 8886171 8803241 8579393 8721268 8781914 8356407 8167275
14124 8167275 8243204 7936134 7955367 7960983 7704260 7537400 7586223 7514425 7027554 7044892 7427179
14113G427179l41661p518k72149L33612j32119l75598l02843J5023P2295p4420
14103F341801l98765L90853m38437k50273J39640j50574M64913r04748P10957
14094E905367k76603K47157m03812j33699J54856k40927j41967j25848J21742
14085E106266r2868p8004j05965k1343K87759m17129p8390l90974M55949J60191
14075D825492l76036J70364o38209M39933k70457J81242j8644k7452l37126P7960
14065D027067j21851K86723j92078j23908l1782K27599j01199j51151j17015Q4588
14055C786993k7635J17361m94664K34330P1097l36894K04017l93349Q5063J91353
14045C437672k89025M07336m46790J41501J20355j97012J69588J65114j91844
$$ plain form
14113 7427179 7085518 7078000 6805851 7139463 7007344 6631746 6328903 6343926 6416221 6341801
14103 6341801 5943036 6333889 5895452 5645179 5784819 5634245 6099158 5194410 5905367
14094 5905367 5628764 5875921 5472109 5338410 5493266 5252339 5110372 4984524 5106266
14085 5106266 5013398 4935394 4829429 4808086 5095845 4678716 4600326 4209352 4665301 4825492
14075 4825492 4449456 4619820 3981611 4421544 4151087 4332329 4313685 4286233 3949107 4027067
14065 4027067 3905216 4191939 3999861 3875953 3844171 4071770 3970571 3819420 3702405 3786993
14055 3786993 3759358 3876719 3382055 3616385 3687482 3350588 3554605 3161256 3246319 3437672
14045 3437672 3148647 3555983 3109193 3250694 3371049 3174037 3343625 3508739 3316895
14036C316895l89849J20925j79919K20392j38076J20032L4541l60200K95881M8174
14026C088796p10942M52918j56997M0491j28095J5417r186k78923K27358K5797
14016B566634M6352j19759m5908m5834J63904j49534m4733q789O9386K60025n94001
14005B097743J27104J10285k39264J79574L2206k13472J6206J39727K67509n71589
13995A946029K54290J11200j79904j34775L44960K13964R95823K792748N521054
13986A1865389J6726221K3384185k4451230A3106756n451183j944911j645449
13979D065213n20141j71686l79754j42676j51714n4628j13186j42996J97083j65074
13969B420441n9796J29721k25406j46230Q8031k08563J98141Q7483M586M3949
$$ plain form
14036 3316895 2927046 3047971 2868052 3088444 2950368 3070400 3104941 2744741 3040622 3088796
14026 3088796 2377854 2830772 2673775 2714266 2586171 2601588 2592402 2313479 2540837 2566634
14016 2566634 2612986 2493227 2447319 2401485 2565389 2415855 2371122 2362333 2431719 2691744 2097743
14005 2097743 2224847 2335132 2095868 2275442 2307648 2094176 2110382 2250109 2517618 1946029
13995 1946029 2200319 2311519 2131615 1996840 2341800 2555764 3551587 6344335 11865389
13986 11865389 28591610 51975795 27524565 13106756 7655573 5710662 4065213
13979 4065213 3545072 3373386 2993632 2850956 2699242 2644614 2531428 2388432 2585515 2420441
13969 2420441 2360645 2490366 2264960 2118730 2206761 1998198 2196339 2283822 2288408 2332357
13959B332357k39396k59560K02295M4071O2829J1548k89468j07141j47347J58383
13949A768571K78477J74182n47190K49919k33767K9484r0141J11913k43655L14540
13939A812333k24787K30989K40913l61509J82936k33984Q9181J97759j03471m79167
13929A351193L74093j75137j08281j35916o9647J83669l8359K91297k78014j82514
13919A212384J72906k51394K58993J07070o581k53167J68863j15680k54846L68332
13909A406880K225n6275J81495N3099n14323L19742L97142q04136J40521L56151
13899A482521l82795K23316L6491j45393Q2127K62335m26045K15742l03924L99457
13889A443832j79581k50334o3599K07834K47827j01819r4473k23007J91104j95573
$$ plain form
13959 2332357 2092961 1833401 2035696 2079767 2142596 2154144 1864676 1757535 1610188 1768571
13949 1768571 2047048 2221230 1674040 1923959 1690192 1719676 1629535 1741448 1497793 1812333
13939 1812333 1587546 1818535 2059448 1697939 1880875 1646891 1736072 1933831 1830360 1351193
13929 1351193 1725286 1550149 1441868 1305952 1236305 1419974 1381615 1672912 1394898 1212384
13919 1212384 1385290 1133896 1392889 1499959 1493378 1240211 1409074 1293394 1038548 1406880
13909 1406880 1409105 1352830 1534325 1587424 1073101 1392843 1789985 985849 1126370 1482521
13899 1482521 1099726 1323042 1359533 1214140 1296267 1558602 1132557 1348299 1044375 1443832
13889 1443832 1264251 1013917 950318 1158152 1405979 1304160 1209687 986680 1177784 982211
13879I82211J13053j9903P6823J37572j40154k79615K21369K37184j84087r5166
13869A049287L18006j15679m10304J64516j793J11093m2391n4608K09018l88134
13859H39011L29858j58754K296o5085k22218N62805l36476m90J84961m22743L71864
13848A085029k50104R5774J00477j30696n1792O9057j51511J52032l26140K91249
13838H83375J0154k44896M39132m79788N57077l8726p7286j78122R3992k69752
13828F95160L28438j42737k6985J50810n424j75110J63614l8548M2558k37539
13818G54237K05067j52329q1145K51175j54168K05252l13686J85723k74658N4403
13808F79871J86291q3839n5757k51030K30149l6081J81799p4496j31099K61805
$$ plain form
13879 982211 1095264 1075361 1152184 1289756 1149602 869987 1091356 1328540 1144453 1049287
13869 1049287 1367293 1251614 841310 1005826 1004033 1115126 1072735 1018127 1227145 839011
13859 839011 1168869 1010115 1012411 947326 725108 1287913 951437 950947 1135908 713165 1085029
13848 1085029 834925 930699 1031176 900480 848688 917745 766234 918266 592126 883375
13838 883375 893529 648633 1087765 607977 1165054 1126328 1049042 870920 964912 695160
13828 695160 1023598 880861 853876 1004686 999262 824152 987766 949218 991776 754237
13818 754237 959304 806975 725830 977005 822837 1028089 714403 900126 625468 679871
13808 679871 866162 782323 726566 475536 705685 669604 851403 776907 645808 907613
13798I07613j06245N4581k22852N95248n67660J31274j72966J70135j9235p7046
13788F92847J25588l16981Q3282J23969o5889N6982o3099k34774N7981L89108
13778H49014C70608L29902l4669J16355j52977J91457j99310j43982L24350J7598
13768H19332l95754L85203j36267L96544m03274K37439k69771L5421j80634L13021
13758H01260o3799k55897o2064L54458N0381k00658j47420M07252l28158K1096
13748E76451l1741j54597J13352j6264K50225j86227L59773j52832Q7184j56356
13738F88968Q831p3862J6781j3184M4249n5592k28643R7011A76781P51871m26800
13727E01852O7305n3293j02216j32227L25348k50169J57766j4457o6663j16327
$$ plain form
13798 907613 801368 855949 633097 1228345 660685 791959 618993 789128 769893 692847
13788 692847 818435 501454 584736 708705 642816 699798 636699 401925 459906 849014
13778 849014 370608 700510 665841 782196 629219 820676 621366 477384 801734 819332
13768 819332 423578 808781 672514 1069058 665784 903223 633452 668873 488239 801260
13758 801260 737461 481564 419500 773958 824339 623681 476261 883513 555355 576451
13748 576451 544710 390113 503465 487201 737426 551199 910972 758140 845324 688968
13738 688968 697799 623937 640718 627534 671783 616191 387548 484559 176781 928652 501852
13727 501852 569157 515864 413648 281421 606769 356600 514366 499909 433246 316919
13717C16919Q9902J14568L11431c0557E10560L3822k56334Q6889J62447k42459
13707B94925L07297k21457J19000k7453K8206O6296o1273J56247C24244M3910
13697C68154J8541K75551P7465j67296L9071J12108k25454r0737r2556K38245
13687E53092r4128J28341J8180N2301r3751j41065q3262K93039C06201J40071
13677D46272P1128k22257A33206M53393J81967B29527J87846A79597K58531j67825
13667B70303P0797R2610o8695K81549k1801o5318A31378M84302P1630J8020O4479
13656G69809k98409J95819C14806K74197M3945B41607J04463N8661A08659K16686
13646C25345J12013M9255j20022M93376m04470j78624L69060k9418B22390J31923
$$ plain form
13717 316919 406821 521389 832820 -30557 510560 544382 288048 374937 537384 294925
13707 294925 602222 380765 499765 472312 500518 566814 505541 661788 324244 368154
13697 368154 386695 662246 739711 572415 611486 723594 498140 407403 314847 553092
13687 553092 458964 587305 605485 657786 564035 422970 339708 632747 306201 446272
13677 446272 517400 295143 133206 586599 768566 229527 417373 179597 438128 270303
13667 270303 341100 433710 365015 646564 624763 559445 131378 615680 687310 705330 769809
13656 769809 471400 667219 314806 589003 632948 241607 346070 404731 108659 325345
13646 325345 437358 486613 366591 859967 455497 276873 645933 616515 222390 354313
13636C54313P966J29039r9155N0872j51899J33956j418P4943N9581j62940Q5164
13625D80422p8778N4845A27170M81077B35185K40093p9224K89174A76240p5960
13615A00280N90484k17129P1671B47936J41903C2243M71284B31330K44719j72905
13605C03144J18779o6710A48509D815L23482j5208l5960L4185L03740p1141l127
13594E40786A34555R7390c4430C17208J35191J4992j56625M4456j21956L20110
13584E53376B40761k2153L0989J68141l2411B4383J10671K27821j24881a3773
13573e3667C65328l4097n5362M2849n3446o5452L38580B30633N8486D9463L22117
13562C71580q1737N8856C0434J60902J38706K5747j18328A1795L78869r3979N0106
$$ plain form
13636 354313 362279 491318 392163 443035 291136 425092 423674 498617 558198 395258 480422
13625 480422 401644 456489 127170 608247 235185 475278 396054 685228 176240 100280
13615 100280 690764 473635 545306 247936 389839 32243 503527 231330 476049 303144
13605 303144 421923 355213 148509 4815 328297 313089 277129 311314 615054 543913 540786
13594 540786 134555 231945 -34430 317208 452399 467391 310766 355222 233266 553376
13584 553376 240761 218608 249597 417738 385327 24383 135054 362875 237994 -13773
13573 -53667 365328 331231 275869 318718 265272 199820 538400 230633 289119 49463 371580
13562 371580 289843 348699 30434 191336 330042 355789 237461 11795 390664 296685 346791
13551C46791J417K76865k15662A43128L67017j88756K165C8858M6708a5871B63766
13539A93986P8770l8086J80259P6830j46391L48349b54763H3551L4564D0929P5914
13528A16843K63333j53762J31689f5076D53878K38184C45877J87432j50208j07652
13518B75449J94971c13754b5336k1568F0937J66778J06223J4912E1588r440L54216
13507C96364m9679k8648N4867c9685C53767O8329k01108a83958B65077A25433
13496A81140p2058P0881N6054R0169J83636r7913A85317M8319K7507M6174n9959
13485B47358a93349D19615j95778Q2631r5982J67758j01944J6564n022J57019
13475D44861j10240K3522j4469g6683I0760J72512B9181K63394N4294j0011n3028
$$ plain form
13551 346791 348208 625073 409411 143128 510145 321389 323554 38858 85566 -15871 263766
13539 193986 272756 234670 414929 491759 345368 693717 -254763 83551 118115 40929 116843
13528 116843 380176 226414 358103 -65076 453878 692062 345877 533309 383101 275449
13518 275449 470420 -313754 -25336 -46904 60937 227715 333938 348850 51588 42148 396364
13507 396364 346685 318037 372904 -39685 353767 422096 220988 -183958 265077 125433
13496 181140 109082 179963 236017 326186 509822 411909 185317 233636 261143 307317 247358
13485 247358 -193349 419615 223837 306468 210486 378244 276300 292864 287842 444861
13475 444861 334621 358143 343674 -76683 90760 263272 29181 292575 346869 336858 283830
13464B83830d7052B93404K80752A33349l9075R7821J21607R0980A05625a9927
13453a04873B27175J96443j55463P2213F3910M8721J25878p9093N7497j0671b46428
13441d899D26312d5873E7314c14780A24576j1681L59894A42991J76176A53171
13430C30678j22349c44407A97125G3584b38595d7669B47999J64149A36798j6657
13420A20141E0670k5334a7580C44790G8281M4226J74316H8379K96166q4148J82602
13409D82999A44375a3047E12674I2517J72128I9693d5332j62541i3103A89881
13398C3836i4753D124K60991L54176E6383a58663D87919A78462L3741J08846A47894
13386b084j3871B97258e1915A339K27445k5204C2414M34928j54046A0732J2847
$$ plain form
13464 283830 -47052 293404 574156 133349 94274 192095 313702 404682 105625 -19927
13453 -104873 227175 423618 268155 340368 63910 112631 238509 159416 216913 206242 -246428
13441 -4899 426312 -45873 57314 -314780 124576 112895 472789 142991 319167 153171
13430 330678 208329 -344407 197125 73584 -238595 -47669 247999 412148 136798 120141
13420 120141 50670 25336 -17580 344790 78281 122507 296823 88379 384545 300397 482999
13409 482999 144375 -13047 512674 92517 264645 99693 -45332 -207873 -93103 189881
13398 33836 -94753 4124 265115 619291 56383 -158663 487919 178462 212203 321049 147894
13386 -2084 -15955 297258 -51915 1339 228784 203580 32414 467342 313296 10732 23579
13375B3579c0486C1238N0128J54494r5108B8953J98517m8035J11523A12751n3277
13364E9474j9723K84046b0716G4174K88514j11494A05707M6317Q1189R4777A7563
13352B21648A5028J30189L39185A74798L73241A32599Q6530j01028J99909j3857
13342C04153O203J66728F9885a28317E7414K86286O8864J67072k80942l9105M8551
13331C08140J69988A54872Q9900c1056C29818A46275O1663J3711J34804j70984
13321A85469l4080k7887J16806J14471A61571J43249E8120M72320Q2617h3220
13310b2925I5293K34499F4365A9895a0563C89378H8771d0918A24871J33719E6382
13298A00219K08842c1452D28044I3907m3960L7047r211R9623i111E5758A2101
$$ plain form
13375 23579 -30486 31238 81366 235860 140752 28953 227470 179435 290958 112751 59474
13364 59474 39751 323797 -20716 74174 362688 251194 105707 152024 233213 327990 17563
13352 221648 15028 145217 484402 174798 548039 132599 219129 118101 318010 304153
13342 304153 310356 477084 69885 -128317 57414 343700 412564 579636 298694 259589 308140
13331 308140 478128 154872 244772 -31056 329818 146275 207938 221649 356453 185469
13321 185469 151389 123502 240308 354779 161571 304820 58120 530440 613057 -83220
13310 -22925 95293 329792 64365 19895 -10563 389378 88771 -40918 124871 258590 56382
13298 100219 309061 -31452 428044 93907 49947 86994 77783 177406 -9111 55758 12101
13286f5639A26477j7172K4455l0052c46235Q6216E9284i7781C51693j09688r225
13275B32780J03879G4795O0077B0545b47465C06433b74759A62752n3861l0233
13265G8658n559a20984I34K5674f4932B44962J27431m7420I4153a5493B87797
13253D7084K3959e6562o5809K9767E23591b9685B25320p1863J3133R9686b5089
13241e8611C68202j29883a17480j8888K5509b2315A25381J35634A24518a84420
13230A78515a2658C32726j36889J10680H719J39563a27469C37347I9325J2917
13220A12242k9448d6246l41059C30081j54106q3575L2540d7236B22410q3324a02910
13208E3415M8043d7961p5141D5772i5273A39102a3486o0383A60545K96233b786
$$ plain form
13286 -65639 126477 109305 133760 103708 -346235 -260019 59284 -97781 351693 242005 232780
13275 232780 336659 74795 134872 20545 -247465 306433 -274759 162752 108891 78658
13265 78658 73099 -120984 934 26608 -64932 244962 372393 324973 94153 -15493 287797
13253 47084 71043 -56562 -122371 -92604 523591 -29685 225320 153457 166590 266276 -25089
13241 -58611 368202 238319 -117480 -136368 -110859 -22315 125381 261015 124518 -184420
13230 178515 -12658 332726 195837 306517 8719 148282 -127469 337347 99325 112242
13220 112242 82794 -46246 -387305 330081 175975 92400 124940 -47236 222410 139086 -102910
13208 53415 101458 -47961 -123102 45772 -95273 139102 -13486 -73869 160545 456778 -2786
13196A76735a58775O6082B81283H4111i3580B0021e8903l4388C31570f6529d523
13184a18769C14684c26447A83532D8242J23276L22856e2744A65494a32071a877
13173c5577I0113b01217j05071J02901A84591b2262l3593E7559O4646j8863J12079
13162B15421J35312A63295p734b96074N5337C0966c0158A90766d270A46398J83268
13151C29666j43918k0914d6597B36881j08306a52666b5863A26207P549K39583
13141C73339r2049a6643D8288c6949F1117O6738n5425J00112J5923k4507G4610
13129A27908k7128K06538b6717A83820o7815b46557A28965a08280F3211k0102
13119D3109a72668a3417j55004B11358a65004A73162a25173B23703i7579A06076
$$ plain form
13196 176735 -158775 -92693 281283 84111 -93580 20021 -58903 -93291 331570 -66529 -4523
13184 -118769 314684 -326447 183532 48242 171518 494374 -52744 165494 -132071 -1877
13173 -35577 90113 -201217 -306288 -203387 184591 -22262 -55855 57559 122205 103342 215421
13162 215421 350733 163295 155561 -296074 -240737 30966 -30158 190766 -4270 146398 329666
13151 329666 185748 164834 -46597 236881 128575 -152666 -25863 126207 133756 373339
13141 373339 281290 -16643 48288 -36949 61117 127855 72430 172542 188465 163958 74610
13129 127908 100780 307318 -26717 183820 116005 -246557 128965 -108280 63211 43109
13119 43109 -172668 -13417 -168421 211358 -165004 173162 -125173 223703 -97579 106076
13108A35213I808N12576D2962B0574K8479K21051c2334B77004j26689f2806B35906
13096G5363J46851j4714K0527G6483C0285a12496m4976a1464F1000J86433B9817
13084E4749J94267b72846R1481d8472r5125d9621H7011g2512G4108K07450m7382
13073B34176A15168R5933K120h3058A15617b06570B54643a13222A1877J17845
13063A29722c00208A74541B3247M6645c6j42650M2743B31687h226C6395P650K93826
13051C37871H6390K42934c8800A24589l8334J58408C9883d8080R489C05593h487
13039G8684P7906a15812E19056A40685l235F1512J52376n6026J5625f8862B62312
13027B97508d6350B72975i9356p8758H0269K22685J4634l764b8145A41386E7233
$$ plain form
13108 135213 9808 522384 42962 20574 49053 270104 -32334 277004 150315 -62806 235906
13096 75363 222214 207500 228027 76483 30285 -112496 -157472 -11464 61000 247433 29817
13084 54749 249016 -272846 -181365 -48472 -143597 -49621 87011 -72512 74108 281558 234176
13073 234176 115168 211101 213221 -83058 115617 -206570 254643 -113222 11877 129722
13063 129722 -300208 174541 23247 69892 -36 -142686 -99943 231687 -8226 36395 44045 337871
13051 337871 86390 329324 -38800 124589 86255 244663 39883 -48080 -38591 305593 -8487
13039 78684 156590 -115812 519056 140685 137450 61512 213888 157862 173487 -68862 262312
13027 297508 -46350 272975 -99356 -178114 80269 302954 317588 313824 -28145 141386 57233
13015I3479J46310i4072B64318h5672B76a35470D63827j06020A57970h0757p7154
13004a57911F3513i0309A0484i4948B19761J46800A69682L39635C7179Q9021J9882
12993A46082N7900o0685g6845l662A57947d20A26217d3044q1499C55792j00395
12982B55397o9236p8950J58228b13084J01123J2720k36441A49394n1649A348J9656
12971B1004O7802a53676k16899B87102a36001C01420j13794c10906i1784q591
12961a00375o7474B14495J30494g1690q1259a7792A22285C6586k722b0508B9082
12949A39169R1984a46106A08147c5354A41789a816o0697F3610N4625a3151B98826
12937A89188J0534H0662b38903A76804b99366c6469A49262i4943A30163R2993
$$ plain form
13015 93479 239789 -94072 264318 -85672 276 -135470 463827 357807 157970 -80757 -157911
13004 -157911 63513 -90309 10484 -94948 219761 366561 169682 509317 37179 126200 146082
12993 146082 203982 143297 -76845 -80507 157947 -420 126217 -43044 -124543 355792 255397
12982 255397 186161 107211 265439 -213084 -111961 -99241 -335682 149394 97745 1348 21004
12971 21004 88806 -153676 -370575 287102 -136001 301420 187626 -310906 -91784 -100375
12961 -100375 -167849 214495 344989 -71690 -152949 -17792 122285 36586 33864 -20508 29082
12949 139169 231153 -146106 108147 -35354 141789 -1816 -62513 63610 118235 -13151 298826
12937 189188 199722 80662 -238903 176804 -299366 -36469 149262 -94943 130163 223156
12927B23156d4777j45113m3454O600B36009n8513g5681B48182B02a04366m4049
12916a48415b1224F2382a9357G106J94301c8593A4423c57636C39730a48627j18309
12905b66936B57887a11650L690l67246a37028O6872B4225r91L32858d4558l05043
12894c49601A05124O2963D7104N2406m2361a94205A63253A6655a90267A50518
12883H6175J81890B3432L4839K35067A06812E2095L8729K24465G4074d9542C28698
12871e602q8710A14593K30949L7958G7579a4884D8075i6496B0716J52995J38673
12860C12384h4324A55468a03661A46085A3119c3513F9750i8834A51578F3044d7011
12848B8505d7816D4805e2351J7730B42592q2308j971A0696M9461K302h4865j96063
$$ plain form
12927 223156 -44777 -189890 -233344 -226744 236009 177496 -75681 248182 202 -104366 -148415
12916 -148415 -21224 62382 -19357 7106 201407 -38593 14423 -357636 339730 -148627 -266936
12905 -266936 257887 -111650 -107960 -475206 -137028 -70156 24225 23234 356092 -44558 -349601
12894 -349601 105124 168087 47104 99510 57149 -194205 163253 16655 -190267 150518
12883 86175 268065 23432 58271 293338 106812 52095 90824 315289 74074 -49542 328698
12871 -5602 -94312 114593 345542 383500 77579 -14884 48075 -96496 20716 173711 312384
12860 312384 -84324 155468 -103661 146085 13119 -33513 69750 -98834 151578 63044 -47011
12848 28505 -47816 44805 -52351 -34621 242592 160284 158313 10696 60157 62459 -84865 -280928
12836b80928G2322p813K06568c2973q2885B38024C3555L38867I3778a88592C29237
12824a10925H810J35623a19555A52416h9376A22140k9002B7418K43945e02620
12813C9750j0910d967q4875D6359a35636j55985p188b93n4410D3522K09396H3065
12800C80310B9297b42492C3543e5654k56300n4057A81844a23524l4298G4172b77915
12788F2394J86889d5713n3740B52862b28391m1141j11722G5094f8958m4852k31387
12777c45197A32372a18707A46992b93228C02594F3855f511n0248Q266C346a70002
12765b86835B70984K13727j08628b0449G7843a01787H7732J25503l4623J50682
12755C29294a23220K2934p0615A74757C3474a4476J149k05743h7377B44794e4587
$$ plain form
12836 -280928 72322 64509 271077 -32973 -115858 238024 33555 372422 93778 -188592 329237
12824 -110925 8810 144433 -119555 152416 -89376 122140 93138 27418 271363 -502620
12813 39750 28840 -4967 -89842 46359 -135636 -291621 -298809 -293 -54703 43522 252918 83065
12800 380310 29297 -242492 33543 -55654 -311954 -366011 181844 -123524 -157822 74172 -277915
12788 62394 249283 -45713 -99453 252862 -228391 -269532 -381254 75094 -68958 -113810 -345197
12777 -345197 132372 -118707 146992 -293228 302594 63855 -6511 -56759 -48493 3346 -170002
12765 -286835 270984 484711 376083 -20449 77843 -101787 87732 213235 178612 329294
12755 329294 -123220 -100286 -170901 174757 33474 -14476 -13327 -219070 -87377 244794 -54587
12743e7663H6425c3482B49966a6073j82049C0991L65212j12476C7438a25079B50220
12731C0398J31025h4168k8306C37569J10491A4492J04710d2603F0655J81596A0090
12719c20673I4816K20999c79433C14091B3605R4749J41418A18913E3154K52382
12709C05536j45910K32935q0933j02160I9535m615a43190C6953c4249F8329J09742
12698A78071C9385N3919b9404F8591K47494d7703C7878a59292j37664a7787j29882
12687a47669e5466j35210I7691d4639I3278M9088l8974K81876J48431G7543L2600
12676A10143N7312E4554J33228Q1012D8297a4236C5247b00680E3902a00615j65311
12665b65926b2621A41816K5065k2766D761J9144d2701A39245d6029A38096J650
$$ plain form
12743 -57663 86425 -33482 249966 -16073 -198122 30991 396203 283727 37438 -125079 250220
12731 30398 161423 -84168 -112474 337569 448060 14492 119202 -42603 60655 242251 10090
12719 -320673 94816 315815 -379433 314091 23605 118354 259772 118913 53154 305536
12709 305536 159626 392561 311628 209468 99535 94920 -143190 36953 -34249 68329 178071
12698 178071 39385 93304 -29404 68591 316085 -47703 37878 -159292 -296956 -17787 -147669
12687 -147669 -55466 -190676 97691 -44639 93278 142366 103392 385268 533699 77543 110143
12676 110143 167455 54554 187782 268794 48297 -14236 35247 -200680 53902 -100615 -265926
12665 -265926 -22621 141816 166881 144115 4761 23905 -42701 139245 -46029 138096 139746
12654A39746J70084A51835a2786k3286l25466G8432L63600B16014d5199A26002
12643I6532k9955d2518m7115D6964J53211b08077F0748b37601B53147j08319J26937
12632B71765F4156a30895B28409P580H2377l0036K9827M8943N2779L02132k12075
12621B73947J00298q0669n5744J21101o6373k1218J57120i3076F5518b03960g2052
12609b63153F2409M7666a58790r9595P6947A9102M46005A71247m1430D661c7580
12597D19456F6831R4254F3400b97532f2358a8384j73003a9951A26432b17171a2419
12585i1854j17923m9741A43206A9181O2818j1706b55722M2492A76967J29640a77127
12573A30711L0637k8842E713J16430b33074R8905G1010b06834A5262O9927a27471
$$ plain form
12654 139746 309830 151835 -12786 -36072 -361538 78432 442032 216014 -45199 126002
12643 96532 66577 -42518 -89633 46964 200175 -208077 60748 -237601 253147 144828 271765
12632 271765 64156 -130895 228409 235989 82377 52341 82168 131111 183890 486022 273947
12621 273947 374245 293576 237832 358933 292560 271342 428462 -93076 65518 -203960 -72052
12609 -263153 62409 110075 -158790 -258385 -181438 19102 465107 171247 129817 4661 -37580
12597 419456 66831 161085 63400 -297532 -62358 -18384 -191387 -19951 126432 -217171 -12419
12585 -91854 -209777 -259518 143206 19181 81999 70293 -255722 -213230 176967 306607 -177127
12573 130711 161348 132506 5713 122143 -233074 -134169 71010 -206834 15262 85189 -127471
12561g3670A14897K5083a4434n2273E8566J0823P3581N0054c81527h4185a2566
12549a06914A18430L7288m6464J61457r0789a81137I2841K57394h1064C90936
12538a5275F0159a81239A27953J6640a02322G2753d6694n1728b482A68827R8925
12527B67752b8705k36928R9995o958F6929O0182L9401A130h8420K1646A07532
12515C1006b95128B00905f6925B38608a71880k06184f482A23376D1652b22679
12504A19378b8472A38896A0915M3426c6012A45310b52224j5865b4831j51692I0674
12492a66074M9652L3479C20951F1232a41397c2194j08897I2166b87675A38141
12481c21I7008O4329P7371a27494D472d3893C57799h0793B7920c48008d4386A65530
$$ plain form
12561 -73670 114897 139980 -14434 -66707 58566 69389 142970 193024 -381527 -84185 -12566
12549 -106914 118430 155718 109254 270711 179922 -181137 92841 350235 -81064 390936
12538 -15275 60159 -181239 127953 144593 -102322 72753 -46694 -98422 -2482 168827 267752
12527 267752 -28705 -265633 -165638 -172596 66929 127111 166512 1130 -88420 -66774 107532
12515 31006 -295128 200905 -66925 238608 -171880 -378064 -6482 123376 41652 -222679
12504 119378 -28472 138896 10915 54341 -36012 145310 -252224 -268089 -24831 -176523 90674
12492 -166074 -116422 -82943 320951 61232 -141397 -32194 -141091 92166 -287675 138141
12481 -321 97008 161337 238708 -127494 4472 -43893 357799 -80793 27920 -348008 -44386 165530
12468i8849k5667G0655R371B8999a4011g3l72437b6172l3598m293A4011i9702
12455A82134c5022k11168a07031B07428H4664B1339P2315b9037D8355A9252d3037
12443E421L8620L50448a35866C32629a59307B38490h0953A6660c7989A55168o0313
12432I4855J56091c5749r4209A23883f2025r3160f1494B19357a75257j19740A28406
12420c1402j72564d0590k24902J09463A1375d6241L245C6524d1702B85820b6602
12408A31572J9559e4773F0428b14078e6312A53568J64986i6567B0136b17065B09920
12396A79203m5650h2819A7651J42451g6914j16404c1140M813j79649P5654B51098
12384A42249i1425A04809k004N8932b51693d8292A40327n1633C1769a31834e5853
$$ plain form
12468 -98849 -124516 70655 80026 28999 -14011 -73 -372510 -26172 -59770 -64063 14011 -99702
12455 182134 -35022 -246190 -107031 207428 84664 21339 93654 -29037 48355 19252 -43037
12443 5421 44041 394489 -135866 332629 -159307 238490 -80953 16660 -37989 155168 94855
12432 94855 250946 -35749 -129958 123883 -62025 -155185 -61494 219357 -175257 -294997 128406
12420 -31402 -203966 -40590 -265492 -156029 11375 -46241 -42996 36524 -41702 285820 -26602
12408 131572 151131 -54773 60428 -214078 -56312 153568 318554 -96567 20136 -217065 209920
12396 179203 133553 -82819 17651 160102 -76914 -193318 -31140 -26327 -205976 -130322 251098
12384 142249 -91425 104809 102805 161737 -251693 -48292 140327 88694 31769 -131834 -55853
12372D04616h9760D1138b24293B23334b43934J21454I4762R9372F4040a7215H583
12360B13025a4057n3785c3769D4795a64996P0293j16388g5593H5012D411i4613
12348a82129Q5281A22958m3076O3641J13781H8946a9421r81q2795A42973A365
12336b12927F6421a05647A19347i1182C22679b01387a4709F1391k470J17111p060
12325A68972K31273b20381A52276J65078f0357C2978c21217e4411k43101J32964
12315a64548A23622D3248L3647b72878J23332K3630D8247a46999B34858K4886
12305B59744c09347A99681l3520F1661g8348c3075j59220D6346A4797a05847C4312
12293B88834a24916j16737B63091J8776f9825j25336M1646g5187J8496l5923k11240
$$ plain form
12372 404616 -89760 41138 -224293 223334 -243934 -122480 94762 194134 64040 -17215 8583
12360 213025 -14057 -67842 -33769 44795 -164996 -94703 -211091 -75593 85012 4411 -94613
12348 -182129 -96848 122958 79882 143523 257304 88946 -19421 -20402 -103197 142973 1365
12336 -212927 66421 -105647 119347 -91182 322679 -201387 -14709 61391 58921 176032 168972
12325 168972 400245 -220381 152276 317354 -60357 32978 -321217 -54411 -297512 -164548
12315 -164548 123622 43248 76895 -272878 -149546 -125916 48247 -146999 234858 259744
12305 259744 -309347 199681 166161 61661 -78348 -33075 -192295 46346 14797 -105847 34312
12293 288834 -124916 -241653 263091 281867 -69825 -195161 -153515 -75187 -56691 -92614 -303854
12282c03854C2358j512J50622a45083A26379b57777C14023J47734j45011A39233
12271B79320B152K83260m5458a44872B72668a2857A08790N5751f3554k55266B19920
12259B30647p5169E2616B0969f379l8834B3848b33448G5783L0339J05034I9260
12247C41473A05322p415a807A6192K16254c68272C44839a90253A26131K04838
12237C30969a52072k5289j08768A07394L674L9411M3746H8830J47631a29929A30111
12225D81313A61973A2001J98502J8613B5693f6883A31417K17040f1734B87120
12214a46275E29612D6586N9924c2069D5317J0018K5274J40198G2547K88955A38354
12202A47695M8536B8133J24934J75919J26821D3788b17671A11110m8470c4320
$$ plain form
12282 -303854 32358 30846 181468 -145083 126379 -257777 314023 461757 316746 139233
12271 279320 2152 285412 239954 -144872 272668 -12857 108790 164541 -63554 -318820 219920
12259 230647 155478 52616 20969 -6379 -45213 23848 -233448 75783 106122 211156 99260
12247 341473 105322 97907 -1807 16192 232446 -368272 344839 -190253 126131 330969
12237 330969 -152072 -177361 -286129 107394 111068 150479 194225 88830 236461 -129929 130111
12225 481313 161973 12001 210503 229116 25693 -66883 131417 348457 -61734 287120
12214 -146275 529612 46586 106510 -32069 45317 55335 80609 220807 72547 361502 138354
12202 147695 196231 28133 153067 328986 455807 43788 -217671 111110 62640 -34320
12191C9425N07405k26221h7567B56305A08654D7965a13330C48208a15812B59287
12180B28891O7007L1977d7841A79043R684J15346p9522c24435h1582B72522A29036
12168B9050a68209B03877p7720O5825F9737M4051K8479k5319E5122j6298K57353
12157B96177F5661a03239A74245L2765A5735J37004Q0974c3615B12124g0599o4488
12146a35087i170j23476B10453a25115B24015f2n0445E138J95388A02a74966A4288
12133g5254n4906A535O5896a17164B93271B2314N64700G4717K0855L96155B15742
12121C13752a16066A21072D8470Q2865a20314M5447c2141l03159G6772Q1214M6715
12110B04701a08452I9197Q8274c4130g341E9805c1034B14184G3640J24419e0635
$$ plain form
12191 39425 546830 320609 -87567 256305 108654 47965 -113330 348208 -115812 259287
12180 228891 295898 327875 -47841 179043 188727 304073 224551 -324435 -81582 272522 129036
12168 29050 -168209 203877 126157 191982 69737 113788 142267 116948 55122 38824 296177
12157 296177 65661 -103239 174245 207010 15735 152739 233713 -33615 212124 -70599 -135087
12146 -135087 -9170 -132646 210453 -125115 224015 -62 -50507 5138 200526 102 -174966 14288
12133 -75254 -130160 1535 67431 -117164 293271 22314 587014 74717 95572 491727 215742
12121 313752 -116066 121072 48470 131335 -120314 -74867 -32141 -335300 76772 157986 204701
12110 204701 -108452 99197 187471 -34130 -7341 59805 -31034 214184 73640 198059 -50635
12098a43086e3643k8128A53498g8394A37935D7772K58555F8832e9407I1270e2075
12086d8241k9693C12423f3021A07138B8463L42395M07003J180161J30510E11219
12075D30528a39467B649J99745a10132j23620b0563k02678r9821B9349M1208b12096
12063H1916b2718B39321a58564G8014K2787C2050R7005A6047R1924a79842N9067
12052a20775A73055i9681q1668E3202M2165e06895a50129G3595a23072j15566
12042b38638P4920E4201a36245M0593F0799K4021D1882A0509d96567F2819i6873
12030B10116a03123k9534j7167A88545J06032a23517b6605E3672a56446G4054
12019a34283D4492p959Q9052a67997F9616M6229a65617I4640M4471c01360A10026
$$ plain form
12098 -143086 -53643 -81771 153498 -78394 137935 47772 306327 68832 -59407 91270 -52075
12086 -48241 -77934 312423 -63021 107138 28463 370858 777861 1958022 2088532 511219
12075 430528 -139467 2649 202394 -110132 -233752 -20563 -223241 -323062 29349 70557 -212096
12063 81916 -22718 239321 -158564 78014 100801 32050 129055 16047 107971 -179842 -120775
12052 -120775 173055 -99681 -181349 53202 95367 -506895 -150129 73595 -123072 -238638
12042 -238638 -163718 54201 -136245 -95652 60799 84820 41882 10509 -496567 62819 -96873
12030 210116 -103123 -132657 -149824 188545 294577 -123517 -26605 53672 -156446 74054
12019 -134283 44492 36533 125585 -167997 69616 115845 -165617 94640 139111 -301360 110026
12007H3366b40346i255B66007j23110F5138b6041F7113J16969a71286A67388d5691
11995B21133A1315N785B206b69815B00573J86484c40373K4555Q2088G4095J86163
11984B60258G3113C5399a48580K9327G1229a39978C75418a74651C1793G66K68449
11973B69215M3468G0003A9669c1324a3031I6945c57721B5735K16194f4753j79415
11962b44168D7738b27563j04759J42330F4193a38386I0973j4718N6655a09765
11951a68229B78451h3130p3376j72595B26683c64539h3431D2070b0734A57010
11940B90927a11118H4716J60061B55e9891K7450A36466a20127K3475A47519c5304
11928a02672H1363l3887b5793n476A23704E9555a31359l3813B59900b163A5605
$$ plain form
12007 83366 -240346 -9255 266007 142897 65138 -26041 67113 184082 -171286 167388 -45691
11995 221133 11315 17100 2206 -269815 200573 387057 -340373 -315818 -233730 74095 260258
11984 260258 73113 35399 -148580 -119253 71229 -139978 375418 -174651 31793 766 269215
11973 269215 312683 70003 19669 -31324 -13031 96945 -357721 25735 241929 -64753 -244168
11962 -244168 47738 -227563 -332322 -189992 64193 -138386 90973 76255 132910 -109765
11951 -168229 278451 -83130 -156506 -329101 226683 -364539 -83431 42070 -20734 157010
11940 290927 -111118 84716 244777 255 -59891 -32441 136466 -120127 -96652 147519 -35304
11928 -102672 81363 47476 -25793 -31269 123704 59555 -131359 -165172 259900 -2163 15605
11916A84650a7297C74176a68110A47706K6972F0993b12223M3411j41340a00991
11905b70331D4868d30023B8073g9372K776j16356j56481R9584L1143f8670G3179
11893a62337A9118a04985A63792J24163c6620H6946J82439b41014A0093a29494
11882A6627f533n1060K1685C10560a95432M9670a5727n4870q8291J3685l4365
11871a79568b4985j64291e1884A0715a50941n4443f9614j33919I6195a60448H7746
11859b35569A75141B4793J23312L7468a26062n1917f8650D0719e6810I945a42919
11847a53428j3623A68965D7267r483h9787A43886I215J7232J38366h2011q1575
11836a63586G8644b14531q8586b0763j94760j64726C8689a85640A8257L1737b39342
$$ plain form
11916 184650 -17297 374176 -168110 147706 174678 60993 -212223 -168812 -310152 -100991
11905 -270331 44868 -430023 28073 -79372 -76596 -192952 -349433 -249849 -218706 -68670 73179
11893 -162337 19118 -104985 163792 287955 -36620 86946 269385 -241014 10093 -129494
11882 16627 -6533 -57593 -35908 310560 -195432 -145762 -15727 -70597 -158888 -145203 -179568
11871 -179568 -24985 -189276 -51884 10715 -150941 -205384 -69614 -203533 96195 -160448 87746
11859 -235569 175141 24793 148105 185573 -126062 -177979 -68650 40719 -56810 9945 -142919
11847 -153428 -167051 168965 47267 37784 -89787 143886 9215 26447 164813 -82011 -163586
11836 -163586 78644 -214531 -303117 -20763 -215523 -380249 38689 -185640 18257 49994 -239342
11824b85549J31105B1695p622F083e4252n2352A02220e2963C2512L01485l4928
11813B99069b0714D16237a73163F626d7087B63404c08174H879J33725J9264g0690
11801A07748K0641a65218G9993l3962k1117a74704A84006p3408d7113j41818A35892
11789G6910P0485a24774k17204a02956l23530e3928B99291a11704J6665a2546
11778B17938a49242B74726A3943e29061b53931e812o3906D00016E282b16429F2383
11766b44503A4412L76054a11017j45026e4595K3818k64313I2244a34970l7345
11756a72315f3454r1418I8366m2086c0015A47264n0816e4766A52818e6478a2298
11744E513L1169b78112B63858G5440R5053J43868c2838A66235C5504b2594A61707
$$ plain form
11824 -285549 -154444 21695 14073 6083 -54252 -106604 102220 -52963 32512 333997 299069
11813 299069 -20714 416237 -173163 6626 -47087 263404 -308174 8879 142604 161868 -70690
11801 107748 128389 -165218 79993 46031 24914 -174704 184006 110598 -47113 -188931 135892
11789 76910 147395 -124774 -341978 -102956 -426486 -53928 299291 -111704 -95039 -12546
11778 217938 -149242 274726 13943 -529061 -253931 -5812 -69718 400016 5282 -216429 62383
11766 -244503 14412 390466 -111017 -256043 -54595 -30777 -295090 92244 -134970 -172315
11756 -172315 -63454 -154872 98366 56280 -30015 147264 96448 -54766 152818 -56478 -12298
11744 5513 36682 -278112 263858 75440 170493 314361 -32838 166235 35504 -22594 161707
11732d2768j62887B86432A09804m2085B5408K43789P7164a19332B60866o393a97765
11720B63464d29092G6530k1641K72435c9013k20532i435j8774l7977m0541c8527
11708G8124N4591F0627O0493C6658L3151K98237a70052L3855C58803j04200A07550
11696a00589d2763j59837A13004Q8951Q8017r8157H7254l2783e1906C4732f1949
11684b728l05943H8803h3719J5658K4069k38121G0385a20946J9999F4106b68220
11672G8002C0804g429B33647j08728E5292J52757Q9017d48j10247F3258L9685
11661A02943g1667C97231D9643a29708l638A5211c26214A82506n2398K18607d0263
11649A7272e7194j66280A28494c3748l45214a74355f3421B8139J7891J07231J53694
$$ plain form
11732 -42768 -205655 286432 109804 67719 25408 269197 346361 -119332 260866 254473 -197765
11720 263464 -429092 76530 54889 327324 -39013 -259545 -9435 -28209 -66186 -106727 -38527
11708 78124 132715 60627 121120 36658 69809 368046 -170052 -136197 358803 254603 107550
11696 -100589 -42763 -202600 113004 201955 289972 191815 87254 54471 -51906 34732 -61949
11684 -2728 -308671 88803 -83719 -68061 -43992 -282113 70385 -120946 -100947 64106 -268220
11672 78002 30804 -7429 233647 124919 55292 208049 297066 -448 -110695 63258 102943
11661 102943 -71667 397231 49643 -129708 -133346 15211 -326214 182506 130108 348715 -40263
11649 17272 -57194 -223474 128494 -33748 -378962 -174355 -63421 28139 46030 153261 306955
11638C06955A41208e9431I5086A2051a97904A10760a48216K6418A17446a43970
11627I7854B7312M90712A67296L3654a31620A48950n4680a60072N2770k73802
11617c81104A37262e21914c5686j03244A89497r726a23336N3717B36168G7739
11606C09373C6631a61305e5925A19869n8292R0153J1782O8874B4484a15463q9286
11595b04749B80309K8397B8396g5794H1389b94026F7481M4665C4906K45536q4426
11584A96016J63556m7681p9942E1181q767K48090G8479a1293G5045M3124c7427
11572D1872P3693j9251J03740J70638A09621A1645L34088d0187B3754J18278g547
11560B14955b73308A65376L041J66878j37641G8049Q7665Q3559j01873o2522e8599
$$ plain form
11638 306955 141208 -59431 95086 12051 -197904 110760 -148216 -121798 117446 -143970
11627 97854 27312 518024 167296 200950 -131620 148950 94270 -160072 -107302 -381104
11617 -381104 137262 -521914 -35686 -138930 189497 179771 -123336 -69619 236168 77739
11606 309373 36631 -161305 -55925 119869 61577 151730 163512 232386 24484 -115463 -204749
11595 -204749 280309 308706 28396 -75794 81389 -294026 67481 112146 34906 280442 196016
11584 196016 359572 311891 231949 51181 42414 290504 78479 -11293 75045 118169 -37427
11572 41872 115565 96314 200054 370692 109621 11645 345733 -40187 23754 142032 -7547
11560 214955 -273308 165376 168417 335295 197654 78049 165714 249273 147400 84878 -58599
11548B2660a15954A92540J66555a0646r500G9383J74372a55202a9214I6647p7
11537I6570m3937a25292A48137J36226b5626k9781E5661R9466d7441A86953c55108
11525b62227a13726B80996g8637A27246m7384k4762L96053B21508B8951b34162
11514h7022c8925A9968K63178b00521A05030l9876L07426j75533q8061l8740c0297
11502B30953H3983d0605r4760A97094j507a6531A51292n1725J23672m9839F7514
11490d3908A36258P7672a07655j71579A70714b092j3487m9562B64647B7018J05939
11479A32957l0815O3001c9201F9196j6823k0787J06842c6292A91652i0798a2154
11467C33111A18904J00777A06369A2963J63780k1550b29182B87703E9546K60365
$$ plain form
11548 22660 -115954 192540 359095 -10646 -20146 79383 253755 -155202 -19214 96647 96570
11537 96570 52633 -125292 148137 284363 -25626 -55407 55661 155127 -47441 186953 -355108
11525 -262227 -113726 280996 -78637 127246 79862 55100 451153 221508 28951 -234162
11514 -87022 -38925 19968 283146 -200521 105030 65154 372580 197047 108986 70246 -30297
11502 230953 83983 -40605 -135365 197094 195587 -16531 151292 99567 223239 173400 67514
11490 -43908 136258 213930 -107655 -279234 170714 -2092 -15579 -65141 264647 27018 132957
11479 132957 102142 165143 -39201 69196 52373 31586 138428 -36292 191652 -90798 -12154
11467 333111 118904 219681 106369 12963 176743 155193 -229182 287703 59546 319911
11457C19911C5095A2474J29600c25849C88008A79299l5397f0382l4956F120f8496
11445D36588j59953M5778b19597f05B20877E6141J06938C3153f4682A70946e7969
11433d7350B38405I1490B955c7683C06619b03628L7274B12483A00748a62199G6628
11421B1759N5309b1693A69379J6424B6784N6708M9986c2517H7388b69907a01863
11409c6695n4241D2131O9912a27992k5118M0074p5312I6559J75973i6625B46503
11397C10973a59685J6798F2947L5854c56871I4669d7214F0693b93260J44471d0636
11385A17197m6253K87098E5495h4382l0028A24484Q5402c13833F7553Q4383a32559
11373A75810f3736D41380c7446D36547c5378i112k0618m8422j16113m3992g9354
$$ plain form
11457 319911 35095 12474 142074 -325849 388008 179299 143902 -60382 -95338 6120 -68496
11445 436588 276635 322413 -219597 -605 220877 56141 163079 33153 -64682 170946 -57969
11433 -47350 238405 91490 2955 -37683 306619 -203628 -166354 212483 100748 -162199 76628
11421 21759 77068 -21693 169379 185803 26784 83492 133478 -32517 87388 -269907 -101863
11409 -36695 -90936 42131 112043 -127992 -153110 -113036 -188348 96559 272532 -96625 246503
11397 310973 -159685 -142887 62947 98801 -356871 94669 -47214 60693 -293260 -148789 -40636
11385 117197 70944 358042 55495 -84382 -114410 124484 209886 -313833 67553 151936 -132559
11373 175810 -63736 441380 -37446 436547 -35378 -9112 -29730 -78152 -194265 -238257 -79354
11361c3925K339c202l30348a02353A25406J02185i9258k71480d9523H7142a78030
11349c58832b5854O121j17882A34171g4242j69706i8050I9984m5309b15863I5982
11337a1300k992H0707B3604K9147J40261o6055H126f4898k8574D36893a54276
11325a99259A37516a18195d0187D036L6680g3727C34034J13646A36266a43224
11314b00346A51232k2686a02586A0570P3629C7090b94309M794K5720h6296j14487
11303b00783F3414h7606i063C9773a00587j48538b3030l65067A34233a69612C4227
11291a83333P1264F0874d7842D29125b2321B1567J01038a84591D6663a49744B9652
11279c4521C14909B3763a4112m02562A38239e9995j62857A23586I34J91495m3898
$$ plain form
11361 -33925 -31586 -3202 -333550 -102353 125406 227591 -99258 -370738 -49523 87142 -178030
11349 -358832 -25854 -19733 -137615 134171 -74242 -243948 -98050 99984 54675 -215863 95982
11337 -11300 -14292 80707 23604 52751 193012 126957 8126 -64898 -93472 436893 -154276
11325 -199259 137516 -118195 -40187 4036 40716 -73727 334034 447680 136266 -143224
11314 -200346 151232 128546 -102586 10570 84199 37090 -294309 -289515 -263795 -86296 -200783
11303 -200783 63414 -87606 -9063 39773 -100587 -249125 -23030 -388097 134233 -169612 34227
11291 -183333 -112069 60874 -47842 429125 -22321 21567 122605 -184591 46663 -149744 29652
11279 -34521 314909 23763 -14112 -416674 138239 -59995 -222852 123586 934 192429 148531
11268A48531m4634j5235a4226o3759l09584a42503C6084Q7690a32580c2903l02561
11257c35464A48450a01740C92237j34339g1794r5086M9160J5811o1522F997c8571
11245a99830F3824a10766k60825L2476a48708O5110a1242H380K88784a85368h6545
11233b89551f3261j97070j17590J44032a5550l3011A70142F2119K4143a87984
11222c22838R5760a08691k17960p8947a15746j2567K5124o6227e278j66568f577
11210b91710A96883B0085c8788j38307d6291A157a8101j524q2011M3670B5019
11198a82703A29406a99193L3382A19361K4838n2486a16362N7502a3281j12638
11188a25919k314p8811P4623A03336d95830a41052O4396j44170E4766a22247B39884
$$ plain form
11268 148531 103897 88662 -14226 -77985 -387569 -142503 36084 123774 -132580 -32903 -335464
11257 -335464 148450 -101740 392237 257898 -71794 -166880 -117720 -101909 -163431 6997 -38571
11245 -199830 63824 -110766 -371591 -339115 -148708 -83598 -11242 8380 297164 -185368 -86545
11233 -289551 -63261 -260331 -377921 -233889 -15550 -48561 170142 62119 86262 -187984
11222 -322838 -227078 -108691 -326651 -405598 -115746 -128313 -103189 -169416 -5278 -171846 -6577
11210 -291710 196883 20085 -38788 -177095 -46291 1157 -18101 -19625 -101636 -57966 25019
11198 -182703 129406 -199193 -165811 119361 144199 91713 -116362 -58860 -13281 -125919
11188 -125919 -128233 -207044 -132421 103336 -495830 -141052 -76656 -220826 54766 -122247 239884
11176A3662b85946B57138A2846d19792A3573L1722a38767j9B89197a44313a2275
11164c05560h50l82891B06035e7066k14985B07967O08c0941B29500H414a21892
11152c80547d3904A87674n6538i7805c7503A34224B8488h0499B79343h9004E9907
11140B14389k229b5311D8317N1902a45859L9302c9905F6681j456a21087A9275
11128A06893K76806A19799A0159a62182G5457a22046M1209G4644b00652C4354
11117b0942G6252L31377F6294B2182K61383H5979K3447l0607J23319C9711C894
11105G8199L49701B0524J77049c5257A61378m8678L102J17596K05577H8752b6674
11093B10761h7036C12299j7184o8681K03683a0569o858B04934G9145J37548n6550
$$ plain form
11176 13662 -285946 257138 12846 -419792 13573 45295 -138767 -138786 289197 -144313 -12275
11164 -305560 -850 -383741 206035 -57066 -272051 207967 208575 -30941 229500 8414 -121892
11152 -380547 -43904 187674 131136 -97805 -37503 134224 28488 -80499 279343 -89004 59907
11140 214389 212160 -25311 48317 100219 -145859 -106557 -39905 66681 65225 -121087 19275
11128 106893 383699 119799 10159 -162182 75457 -122046 -80837 74644 -200652 34354
11117 -20942 76252 407629 66294 22182 283565 85979 109426 78819 202138 39711 3894
11105 78199 427900 20524 197573 -35257 161378 112700 115802 233398 438975 88752 -26674
11093 210761 -87036 312299 295115 226434 430117 -10569 -17427 204934 79145 216693 160143
11082A60143j8094i885D7573K41720N0429o8345N4400j26534F0951P0656J031
11071A32638K29238j21077J6300L8719q7232L11308A32470M73108Q9505m6712
11061F48371j8702M5077B01158M21597L0557K80969m55222j74237L65763k4082
11051F46503K2546K42379O7860j26908l37199J07315L32590j11710l52682N14059
11041A004753j45349j41920n0768n9397O7380J66080J8123j85754k76397M13231
11031H09982k69417J34321J4946J35929k75992M68121m32453k05272L16709j61895
11021E34979L52062j65255j98097L12765l3710C77701K76093K5687L98691l66378
11011G11794J20920k82151J4333j64796K56952l11093Q4781M0308J44173M019
$$ plain form
11082 160143 142049 -9885 47573 289293 339722 271377 325777 199243 60951 131607 132638
11071 132638 361876 240799 257099 295818 208586 519894 132470 605578 695083 648371
11061 648371 629669 674746 201158 622755 653312 934281 479059 304822 670585 646503
11051 646503 669049 911428 979288 852380 515181 622496 955086 843376 490694 1004753
11041 1004753 859404 717484 666716 607319 674699 840779 858902 673148 396751 809982
11031 809982 540565 674886 689832 825761 549769 1017890 585437 380165 696874 534979
11021 534979 887041 721786 523689 836454 802744 377701 653794 679481 1078172 711794
11011 711794 832714 550563 564896 400100 657052 345959 430740 471048 615221 619240
11001F19240L63051j12038k43659K90983j99245j58390N0770Q880K00978l7491
10991G83079k76577K23546M04621E64796L18961O9598j14541j28197L16736J5332
10981A042685J92016j80302M93746m00895L36806J81495J68328J93956K59419
10972B287254J53985j1585L77159j50243K279k26068K46537l92489o47773R8521
10962A737577m4484p2142m00711N03590j5290o1276J4530L21320j48662j17472
10952A716980l56742l4807m7267k65525k56111k11633k31107L39903B83232l5002
10942B48230j19246J6664J64814D1323L15961H7471K86137J90368B66670o2060
10932B04610b15238I5715R2916G5581K28139a6241B11390b8778D36587F2706c68966
$$ plain form
11001 619240 982291 870253 626594 917577 718332 559942 610712 619592 820570 783079
10991 783079 506502 730048 1134669 564796 883757 953355 838814 710617 1027353 1042685
10981 1042685 1234701 1054399 1548145 1147250 1484056 1665551 1833879 2027835 2287254
10972 2287254 2441239 2429654 2806813 2656570 2658849 2432781 2679318 2286829 1639056 1737577
10962 1737577 1693093 1620951 1220240 1723830 1708540 1647264 1661794 1983114 1834452 1716980
10952 1716980 1360238 1325431 1278164 1012639 756528 544895 313788 653691 283232 248230
10942 248230 128984 145648 310462 41323 357284 87471 373608 563976 266670 204610
10932 204610 -215238 95715 188631 75581 303720 -16241 211390 -28778 436587 62706 -368966
10920A90348B7507J4438e2926p6347I9681N2547b80357C73639f2340K8122j04593
10909a38811A08263N1317l6422a46925j71325N4623j0736A43795d5435B0610a95619
10897F9340J11921g4953k9741c094B60651h8797c4538r8413L72N8455F474O6768
10885G3242J47390B061e2589A5670c9243A4498L75228b55272A32846b2344j80659
10874b03003E9321m265a97002c321k61816J28595L4943n0495A1605K1619b58136
10862I6358b09581j30758A52991J8275b86676J35098K8559B66489b3243l6125
10852e9368k57706d5700j50999A02872a15343R304B87144R3331a10355D8276p006
10841D1270f6601J4504M091N53G1415B6598N3925L7500c00704I2330B7903J90016
$$ plain form
10920 190348 27507 41945 -52926 -129273 99681 152228 -280357 373639 -62340 -34218 -138811
10909 -138811 108263 159580 123158 -146925 -318250 -263627 -274363 143795 -45435 20610 -195619
10897 69340 181261 -74953 -104694 -3094 260651 -88797 -34538 -132951 -132579 -74124 6474 73242
10885 73242 220632 2061 -52589 15670 -39243 14498 389726 -255272 132846 -22344 -203003
10874 -203003 59321 55056 -197002 -3321 -265137 -136542 -101599 -152094 11605 33224 -258136
10862 96358 -209581 -340339 152991 171266 -286676 -151578 -123019 266489 -23243 -59368
10852 -59368 -317074 -45700 -196699 102872 -115343 -106039 287144 380475 -110355 48276 41270
10841 41270 -66601 -52097 -48006 -47453 71415 26598 80523 118023 -300704 92330 27903 217919
10829B17919r3867c37145B702J71901g4o9836B87480d0952p7043A70200C5718
10817B02179b8924A01195A40J11598a0472k9029D8927a67139H3169i5827j91033
10806b86860K0187b0869j57644E3880a21621K9002F6040a31389j4741o354J4598
10795a37886j46371a6408k29660i4210H3722b21739c6945r4661l07103f6264l31866
10784c98130e4573k58029P8113A22131c25398a5044l197j72001k05143B4921a44463
10772A07933a38230A97644A0685g1832Q279B8168L4002K99830a9101l11513a44307
10760a69766C6881K01900C3057b27152A49601i6781j7227K1525k4509a3006A7226
10748a99270G1589J71160A04932J12437K2298D7827j9884a10196c1510l4199F061
$$ plain form
10829 217919 124052 -337145 2702 174603 -74 -69910 287480 -40952 -117995 170200 35718
10817 202179 -28924 101195 140 111738 -10472 -39501 48927 -167139 83169 -95827 -286860
10806 -286860 -266673 -20869 -178513 53880 -121621 -92619 66040 -131389 -146130 -152484 -137886
10795 -137886 -284257 -16408 -246068 -94210 83722 -221739 -36945 -131606 -438709 -66264 -398130
10784 -398130 -54573 -312602 -234489 122131 -325398 -15044 -18241 -190242 -395385 24921 -144463
10772 107933 -138230 197644 10685 -71832 -63553 28168 62170 362000 -19101 -330614 -144307
10760 -169766 36881 238781 33057 -227152 149601 -96781 -114008 -92483 -116992 -13006 17226
10748 -199270 71589 242749 104932 217369 239667 47827 27943 -110196 -31510 -65709 6061
10736H9465L0400J08983a35763k0138o9169A85562O3518a0832j335B72931a17018
10724A45051L4513b52670D7532b03215l8225k5742N333A51986o3821g7077A24133
10712b75968R4355h6481L5624l4720O157J6511A9294L2048b83587e0615o498B05161
10699A17945E5864c00773j42623b6793B41490m6175A0761a86082G117a65461a4484
10687A8266b5558k24222f6224l27456h4811k49275B25116c76497a21801j53537
10677b75338f2090o2268B03675d2025j16770M1227a4602A80732c35768I0673b6361
10665b52424D0916b0577D0821c73957A80342b45131m9606h9426A6513a50866C0195
10653B0060a09740A54828C6451a43155B1014M2971a66203e6982A01261J13857
$$ plain form
10736 89465 119865 228848 -135763 -155901 -225070 185562 249080 -10832 -12167 272931 -117018
10724 145051 179564 -252670 47532 -203215 -241440 -267182 -261849 151986 88165 -77077 124133
10712 -275968 -181613 -86481 -50857 -85577 -79420 -62909 19294 51342 -283587 -50615 -57113 205161
10699 117945 55864 -300773 -443396 -26793 241490 195315 10761 -186082 7117 -165461 -14484
10687 18266 -25558 -249780 -66224 -393680 -84811 -334086 225116 -376497 -121801 -275338
10677 -275338 -62090 -124358 203675 -42025 -158795 -117568 -14602 180732 -335768 90673 -26361
10665 -252424 40916 -20577 40821 -373957 180342 -245131 -294737 -89426 16513 -150866 30195
10653 20060 -109740 154828 36451 -143155 21014 63985 -166203 -56982 101261 215118
10643B15118E9678a6933C5317c10044A69353P6723a43908k10568d7157B64452
10632e7835o103C4998b50444o5790j18005d23A59542a09999C2105K0216N8305
10621A10626b44227J08059G2198a25438I1154c7750A51404a84952Q2237B25332
10610A70773a03787p8433b7662j81821a4527k2033A14933a61547D7127d05975
10599A15966L3441m4224k3101a75798d9495k8430k02990A2060a08308j88804K8968
10588b68144J12144G0614b59759r3705f8400l04001R7437A13360L2423a82548
10577F4197g6996L0704B65248A09697J36591f3360j16395m4489c6301E6277d62635
10565i3485j96471A40892a49364N6352B25695b78894R7391o1847j63744d1956
$$ plain form
10643 215118 59678 -16933 35317 -310044 169353 246076 -143908 -354476 -47157 264452
10632 -57835 -63938 34998 -250444 -316234 -434239 -423 159542 -109999 32105 52321 110626
10621 110626 -244227 -136168 72198 -125438 91154 -37750 151404 -184952 -102715 225332
10610 170773 -103787 -182220 -27662 -209483 -14527 -36560 114933 -161547 47127 -405975
10599 115966 149407 105183 82082 -175798 -49495 -77925 -280915 12060 -108308 -297112 -268144
10588 -268144 -156000 70614 -259759 -353464 -68400 -372401 -274964 113360 145783 -182548
10577 64197 -76996 -46292 265248 109697 246288 -63360 -179755 -224244 -36301 56277 -462635
10565 -93485 -289956 140892 -149364 -93012 225695 -278894 -181503 -243350 -407094 -41956
10554b33806a4657m8647J0487A28245A8959a25551d9199E0836b38406b63l01320
10543c01583a2868k02680D7221a59844A46129b85533L2487d7438A11320B2225
10532a74871n9734c4154C5830a02175B16875f5332j1690E9460k3681J11280a08586
10520H3981c47880C64487a69044k2835A45556b2193A98037C2262M13502A67778
10509B21661H9754f7650k8736j16999E1950J18687D9887a02470K5121I740d8821
10497A59693a00841M1463b5968L436B03955e3901D14805a64067b6542k12976A02825
10485B18196a56495F4368c7496A08642b5027D00784K99218k61122j6408j64527
10475B57945R6734A48931c18636E2131c2416l71956A26775c12875H8130b81727
$$ plain form
10554 -233806 -14657 -63304 -52817 128245 18959 -125551 -49199 50836 -238406 -263 -301583
10543 -301583 -12868 -215548 47221 -159844 146129 -285533 -253046 -47438 111320 22225
10532 -174871 -234605 -34154 35830 -102175 216875 -65332 -77022 59460 35779 147059 -108586
10520 83981 -347880 364487 -169044 -191879 145556 -22193 198037 32262 445764 167778
10509 221661 89754 -67650 -96386 -213385 51950 170637 49887 -102470 -77349 9740 -48821
10497 159693 -100841 -59378 -25968 -22532 203955 -53901 414805 -164067 -26542 -239518 102825
10485 218196 -156495 64368 -37496 108642 -25027 400784 700002 438880 422472 257945
10475 257945 354679 148931 -318636 52131 -32416 -404372 126775 -312875 88130 -281727
10464a04532A15518c7699F2886f3852A124i3708o1876j65415J05689C00478a03969
10452F0924a42946j71485D3490N8561J42469a20676n1608N9538H2398a19981A24751
10440A94390c6447j40893A86251E6388b70634g9323a8227A32836J64396a57182
10429e8732l6063A55584a18583j01761a07965A37418a09116j65621G9394R0956
10419A70350b38208B18980k8395j0565b5833l7086l195l20775A6513a40839k06527
10408c47366a46515a932I8137Q1309c3874a1622j23424L8159k4577j24561f3599
10396d27186A04202c8581B35771H71J21015J89693A13454L7225l7096J12131a59676
10384I4335M82912B48376a1475D11092j22351f0440A43740K04043A24517L30413
$$ plain form
10464 -104532 115518 -37699 62886 -63852 1124 -93708 -155584 -320999 -215310 300478 -103969
10452 60924 -142946 -314431 43490 102051 244520 -120676 -172284 -112746 82398 -119981 124751
10440 194390 -36447 -177340 186251 56388 -270634 -79323 -18227 132836 297232 -157182
10429 -58732 -94795 155584 -118583 -220344 -107965 137418 -109116 -274737 79394 170350
10419 170350 -238208 218980 190585 180020 -25833 -62919 -66114 -386889 16513 -140839 -347366
10408 -347366 -146515 -1932 98137 179446 -33874 -11622 -135046 -96887 -121464 -246025 -63599
10396 -427186 104202 -38581 235771 871 121886 311579 113454 150679 113583 225714 -159676
10384 94335 577247 248376 -11475 411092 288741 -60440 143740 347783 124517 454930
10374D54930A07743O2253J82504j02370a7169g208A6998K45497K29817j33493
10364C58819I8638O54882H3141J42859I5734R5233R5233H0447P7430h4814I1144
10352b5894G2896K34580N03797A76182J04638n6090J66491A9704q328M30085Q3507
10341E24968j07131j95826K73171A10525J63955b2808A09326a69580B82306J9326
10331C01632K9032j53110C6182J36213J25254e9681B1216Q926b69222E39138A7862
10319G062K72716c2411B04317H9254Q244L08502b369C52575C9507J34683h5436
10307b07077R0214j10100g5568B68367C7089i2006p8261a0493j78768K2589d334
10295a86693f9258J4080A08643a47349j44744E9494b12289E3010a93195h5751
$$ plain form
10374 454930 107743 169996 352500 250130 -17169 -7208 16998 262495 492312 358819
10364 358819 98638 753520 83141 226000 95734 190967 286200 80447 157877 -84814 91144
10352 -25894 72896 307476 811273 176182 280820 224730 391221 19704 11376 441461 524968
10341 524968 417837 222011 495182 110525 274480 -22808 109326 -169580 282306 301632
10331 301632 330664 177554 36182 172395 297649 -59681 21216 30142 -269222 539138 17862
10319 7062 279778 -32411 204317 89254 97498 406000 -2369 352575 39507 174190 -85436
10307 -207077 -116863 -226963 -75568 268367 37089 -92006 -170267 -10493 -189261 -166672 -4334
10295 -186693 -69258 -55178 108643 -147349 -292093 59494 -212289 53010 -193195 -85751
10284D6403R3771a23974r9177i9794q2487a192j59169k4690P2516F9196a35141
10272C00948a56186P1443B66133A21906B1224F058a80758A61561g2234m93594
10262e65828F0244J15130J94462H8241L17478J31976H6961R1014J57918e1249
10251A25084G473N1081f7832A55838n272a69435A25848K01174a96061d2607A27287
10239f8556J8932k81233D9726a20849B11165k3020B3853b2479A50955m5917K25154
10228C30192a05185d2551J655p484H234M4325a72641n4876j49266J05823a1255
10216h0348a4653A33549a46013E9809h808k10064m7821P4661A3971a65972A03173
10204b71568M722h6877L0083A93258J2517p3558b78563A70346d0334o8544A85871
$$ plain form
10284 46403 140174 -123974 -223151 -99794 -182281 -1192 -160361 -185051 -112535 69196 -135141
10272 300948 -156186 -84743 266133 121906 21224 6058 -180758 161561 -72234 -565828
10262 -565828 60244 175374 369836 88241 405719 537695 86961 177975 335893 -51249
10251 125084 7473 58554 -67832 155838 150566 -169435 125848 327022 -196061 -42607 127287
10239 -68556 -49624 -330857 49726 -120849 211165 188145 23853 -22479 150955 105038 330192
10228 330192 -105185 -42551 -40896 -48380 8234 52559 -172641 -227517 -376783 -270960 -11255
10216 -80348 -14653 133549 -146013 59809 -8808 -218872 -266693 -192032 13971 -165972 103173
10204 -271568 -266846 -86877 -56794 193258 205775 132217 -278563 170346 -40334 -108878 185871
10192B39582a62623D6518J67216J21942a30163M9405j89912I0622J9780d442l31820
10181c36262h4962K780m7469k67730a51004j06950B32329b90415F7526c51720
10170e2672j24480A44620a60696q745m8786A36832b01554A42323b7821A17046
10159e07910A69821l0956f22438b58427J22620A63176b62991b6730D11783A19644
10148b66050a11663H548J20201J10941F7678c63449O5630a37719J0665B96327
10137e9975H4321i621B4259O0788b36840d7246m22994b9357D7777a75543N4033
10126a21510k41791k74452a2864A37171a0084k75040D1857a98094G6478a04052
10115a89820I9520h084b258j2561j85775N1284o5565a04016i184j17483k01640
$$ plain form
10192 239582 -162623 46518 213734 335676 -130163 -80758 -270670 90622 110402 -4442 -336262
10181 -336262 -84962 -82182 -129651 -397381 -151004 -257954 232329 -290415 67526 -351720
10170 -52672 -177152 144620 -160696 -169441 -218227 136832 -201554 142323 -27821 117046
10159 -507910 169821 138865 -622438 -258427 -135807 163176 -262991 -26730 411783 119644
10148 -266050 -111663 8548 128749 239690 67678 -363449 -297819 -137719 -127054 296327
10137 -59975 84321 -9621 24259 85047 -236840 -47246 -470240 -29357 47777 -175543 -121510
10126 -121510 -363301 -637753 -12864 137171 -10084 -285124 41857 -198094 76478 -104052
10115 -189820 99520 -8084 -2258 -14819 -200594 -149310 -214875 -104016 -9184 -126667 -328307
10104c28307j6113a70755H4526c5156R470B4231J19565a28873E1785b66495H9264
10092b07428K0334I1852b70016a34932A73134a83974j00660P4312P7236C17142
10081g8139A64856c73773J77423k06455g9111n4797j5013a9350k77279J14062
10071a82567b7990A5041J5108a00690j19018e5468j33306B3940c39731A67424
10060a13022C4918c2289o8931j43207D7016j109J98306i4404A14241Q5646G4743
10048h761B14489A9907J1949c8192A79557b7087k22953I1708a23675B08145A9664
10036c45136J59528j02048A11579F565c02147A99942c76815a11841A12510E3414
10025d3354E363a71271C0943N9545c14385b1819l04728m832A10761c10893a37257
$$ plain form
10104 -328307 -344420 -170755 84526 -35156 -25686 24231 143796 -128873 51785 -266495 89264
10092 -207428 -187094 91852 -270016 -134932 173134 -183974 -284634 -210322 -133086 317142
10081 -78139 164856 -373773 -196350 -402805 -79111 -133908 -148921 -19350 -296629 -182567
10071 -182567 -27990 15041 30149 -100690 -219708 -55468 -188774 23940 -339731 167424
10060 -113022 34918 -32289 -101220 -244427 47016 45907 244213 -94404 114241 199887 74743
10048 -8761 214489 19907 31856 -38192 179557 -27087 -250040 91708 -123675 208145 19664
10036 -345136 -185608 -287656 111579 6565 -302147 199942 -376815 -111841 112510 53414
10025 -43354 5363 -171271 30943 90488 -314385 -21819 -326547 -331379 110761 -310893 -137257
10013d19266J98276E4895J9631N0304o349J40743a58342C6106a86418k36069c5958
10001b60829a21086l6304C45676j13629b42619a15007j17523r5706H8658b57452
9990A28323J56425J6072a9520j95903j11005J8002J17508j13448J02259A5880
9979i5604A74431i6463H9707i0987j43955J01986F5852L8007a74852A41417a90641
9967e0254m1976G1493g7505o296B93300a89330d408j92607B61642a32171N159
9956a27012j19035L5985A32494B9137P3184A5427b52517J10421C0854H561c2542
9944G4777N4903a24634a5762j77392a6996o4303j32754c9590A06409L5838K70359
9933D12606A64950C3476A3148a13942A22798c84650J44894A98764d0412A91353
$$ plain form
10013 -419266 -220990 54895 74526 124830 118481 259224 -158342 36106 -186418 -422487 -35958
10001 -260829 -121086 -157390 345676 232047 -242619 -115007 -232530 -328236 88658 -257452
9990 128323 284748 300820 -19520 -215423 -326428 -308426 -190918 -304366 -202107 15880
9979 -95604 174431 -96463 89707 -90987 -234942 -132956 65852 103859 -174852 141417 -190641
9967 -50254 -92230 71493 -77505 -83801 293300 -189330 -4408 -197015 261642 -132171 -127012
9956 -127012 -246047 -210062 132494 29137 102321 15427 -252517 -142096 30854 8561 -32542
9944 74777 129680 -124634 -15762 -193154 -16996 -81299 -214053 -39590 106409 142247 412606
9933 412606 164950 33476 13148 -113942 122798 -384650 -239756 198764 -40412 191353
9922B4820c4666j61799b8924j48735B13925i3405A0895c13380H4445a33850m0660
9911a74510h1921g444q6137r974G1890c7656j02235F8761f56242K46106a89217
9899a15007L7447l17426B271b8505k33756C8947a67954B8790h0108A06610a27000
9887A50133f9539p4652j22106P2986L1683m2946c7507i054B3097J16795c39728
9875a87107A23321E2062j6411K43419c37413A00453k7948a77400j46541C44989
9864H9981a5053A12003h6894c4827B86823d05483a79482N1046D0608a53187k81589
9853d34776a88266J9094A84468c0833k9620I065a78652O8868n1942c4016A51151
9841G1282c1326B33337A6037b37636l96008b01801A31741l4149a42145A47023
$$ plain form
9922 24820 -34666 -196465 -28924 -177659 213925 -93405 10895 -313380 84445 -133850 -174510
9911 -174510 -81921 -7444 -93581 -103555 71890 -37656 -139891 68761 -656242 -410136 -189217
9899 -115007 -77560 -394986 2271 -28505 -262261 38947 -167954 28790 -80108 106610 -127000
9887 150133 -69539 -144191 -266297 -193311 -161628 -204574 -37507 -9054 23097 139892 -339728
9875 -187107 123321 52062 35651 279070 -337413 100453 72505 -177400 -323941 344989
9864 89981 -15053 112003 -86894 -34827 286823 -405483 -179482 -128436 40608 -153187 -434776
9853 -434776 -188266 -169172 184468 -30833 -60453 9065 -178652 -109784 -161726 -34016 151151
9841 71282 -31326 233337 16037 -237636 -633644 -201801 131741 97592 -142145 147023
9830A11529c25734g57I2697j3925G23a24070p3701Q3368j0019E0372a87109A97215
9817D10419a88571A3164J87323b02051k16013J2697h4437l0906A01745M1487a52392
9805B9444L5631Q685A929a05718A71582E4773K0235L8480a83792g122l52815E3308
9792f6730l8328a9164r2765e3277D11943C9139a24689e6207H2367C0107b65491
9780b959o6299K446A91941b98413Q348C97330c03949G9310O5670a76720c0760
9768E7313D166b64808C8341l552c61541A53310b26690g7046l2599n5160J4324
9757a50481c0902k80277B9963c33376K2384J41062B24973d45535g4030a6706n33407
9746e50113I8948a3525l77717a38459F7405C2006c31655a34898j35492j99368
$$ plain form
9830 111529 -325734 -757 92697 78772 723 -124070 -197771 -114403 -124422 50372 -187109 197215
9817 410419 -188571 13164 200487 -202051 -418064 -405367 -84437 -115343 101745 143232 -152392
9805 29444 65075 73760 1929 -105718 171582 54773 75008 113488 -183792 -7122 -359937 53308
9792 -66730 -105058 -19164 -111929 -53277 411943 39139 -124689 -56207 82367 30107 -265491
9780 -2959 -69258 -66812 191941 -298413 -290065 397330 -303949 79310 144980 -176720 -30760
9768 57313 4166 -264808 38341 34789 -361541 153310 -226690 -77046 -109645 -164805 -150481
9757 -150481 -30902 -311179 29963 -333376 -310992 -169930 224973 -445535 -74030 -16706 -550113
9746 -550113 98948 -13525 -391242 -138459 67405 32006 -331655 -134898 -270390 -469758
9736d69758h8998c539m9553k2953j82513d1843K02C6360b08267A39224b23881
9724A02835c3723p242A21905O9019a48315m6980L2577h883A28459b77492a10151
9712a0715B25716c41561F0468a28918c5317A58015e7944k95942M6382I38M8280
9701D9218J61125a32617A05562a59037M9118A03725g1382j82080B98969c83006
9690a8503C14374c7225m5017A63666g8249B13584a05634A27872m8945h3254H1944
9678h8436A32918N6752k4289g0217j36070h4847B80531f9216B54809b18677M1017
9667a77660k26833a71125j15799a2402j03943A48067e58j23736c8391n2882r7599
9656a88872a9819r2561C9977M4866i0424A60503h5495A87494b64987A22556k3782
$$ plain form
9736 -469758 -88998 -3539 -53092 -76045 -258558 -41843 -41641 36360 -208267 139224 -223881
9724 102835 -33723 -40965 121905 190924 -148315 -195295 -162718 -8883 128459 -277492 -110151
9712 -10715 225716 -341561 60468 -128918 -35317 158015 -57944 -353886 -307504 938 49218
9701 49218 210343 -132617 105562 -159037 -109919 103725 -71382 -253462 298969 -383006
9690 -18503 314374 -37225 -82242 163666 -78249 213584 -105634 127872 78927 -83254 81944
9678 -88436 132918 189670 165381 -70217 -206287 -84847 280531 -69216 254809 -218677 -177660
9667 -177660 -404493 -171125 -286924 -12402 -116345 148067 -558 -124294 -38391 -91273 -188872
9656 -188872 -19819 -112380 39977 84843 -90424 160503 -85495 187494 -264987 122556 98774
9645I8774d03579H0678b65605a06111m8636q5094a4787A22060b4126j06967J8529
9634a12564k1638A53137B2513B466J94154a38214N404l81724d4599A7327f5700
9622A65694a02785A28203f2654l2216j1475C9207J20722J37581j02242b73575
9611a40384H1937a43590B0793a24720A06075a15683r9617k3981K087A27337a85839
9599A00589D6077g6318A20626b69918E47320c0637p874j28420M6916H9418L0868
9588A20286b98782A09136d95073a86280E1700a13113K2402C4925a41833C31f9242
9576e9765l98527d5989A8850i588C4080b3163k32490a22200C9848J59624a53862
9564H7497o895d13514d0369j38311G4794c8742m4485k7741r4291A09115a03651
$$ plain form
9645 98774 -403579 80678 -265605 -106111 -154747 -239841 -14787 122060 -24126 -131093 -112564
9634 -112564 -134202 153137 22513 2466 196620 -138214 -132810 -514534 -44599 17327 -65700
9622 165694 -102785 128203 -62654 -94870 -106345 39207 159929 297510 195268 -273575
9611 -140384 81937 -143590 20793 -124720 106075 -115683 -215300 -239281 -237194 127337 -185839
9599 100589 46077 -76318 120626 -269918 547320 -30637 -38511 -166931 -120015 89418 120286
9588 120286 -298782 109136 -495073 -186280 51700 -113113 -90711 34925 -141833 331 -69242
9576 -59765 -458292 -45989 18850 -9588 34080 -23163 -255653 -122200 39848 199472 -153862
9564 87497 80602 -413514 -40369 -178680 74794 -38742 -83227 -110968 -205259 109115 -103651
9552c92087c3528E3153K6920r411b634j87187m6425h6545A06254d15747e9869
9540a2449E3099A8371a06218M907j34024h4810D28365j93059a78104Q2469o420
9529a02055d7195k1583b3907D2437d54676a27215c5638k16154J14186A40081A7022
9517I1774b72833i8881c6794A25287k9351a65417q1414p5859c9448j61879E7616
9505H6903P068A777N7687P4462c26006a56937H8226C859b9642A89688b20077j61088
9493c81165A2424f0286G4851O2828c16632J54483A64917a11983l0368j30511J30434
9482a42428J0345c765j29161M1656A5350L457b06147d3710A03053h9635j03009
9471a92644a3472F6892N8652a84493o9273C3874b08162B87844A1902l076d1511
$$ plain form
9552 -392087 -33528 53153 80073 70662 -2634 -189821 -236246 -86545 106254 -415747 -59869
9540 -12449 53099 18371 -106218 -101311 -235335 -84810 428365 235306 -178104 -95635 -102055
9529 -102055 -47195 -68778 -23907 42437 -454676 -127215 -35638 -251792 -137606 140081 17022
9517 91774 -272833 -98881 -36794 125287 95936 -165417 -246831 -322690 -39448 -201327 57616
9505 86903 93971 1777 59464 133926 -326006 -156937 88226 3859 -29642 189688 -220077 -381165
9493 -381165 12424 -60286 74851 137679 -316632 -162149 164917 -111983 -142351 -272862 -142428
9482 -142428 -132083 -3765 -132926 -91270 15350 18807 -206147 -43710 103053 -89635 -192644
9471 -192644 -13472 66892 125544 -184493 -253766 33874 -208162 287844 11902 8826 -41511
9459I7115a32516E9550K8752R1934a49155O4267k7163H3021Q3068b52714B43309
9447E0297b61535q1682C755d0317A45870a3401q6541C07723h5922o2069F9636
9435B6321a67580n2281Q0778O2673J3094M02A9215a44635B03080b67031B83596
9423A8894d8934l21926A55722A0237J69517H1865J1359J7890a49632o7225B182
9411C1732b87318a09198B4034a10465j14491O5616k00528N5484h7653a3527m6140
9400e9667k93788f0177A91232a50508j88148a4695l44631c8871k54276B2396a6942
9388A02226D5349l76j4853a29713B03R2476k8283a38874e332A40415a04078A26204
9375A0650b49287o1192J31364D1502A5382a93006F2780d3251o7975k300p0165
$$ plain form
9459 97115 -132516 59550 88302 180236 -149155 -84888 -112051 83021 166089 -252714 243309
9447 50297 -261535 -343217 3755 -40317 145870 -13401 -99942 307723 -85922 -147991 69636
9435 26321 -167580 -219861 -139083 -76410 -63316 -62914 19215 -144635 203080 -267031 283596
9423 18894 -48934 -370860 155722 10237 179754 81865 93224 111114 -149632 -216857 2182
9411 31732 -287318 -109198 24034 -110465 -224956 -159340 -359868 -304384 -87653 -13527 -59667
9400 -59667 -353455 -60177 191232 -150508 -338656 -14695 -359326 -38871 -293147 22396 -16942
9388 102226 45349 44973 30120 -129713 203 92679 64396 -138874 -5332 140415 -104078 126204
9375 10650 -249287 -310479 -179115 41502 15382 -193006 62780 -43251 -111226 -113526 -183691
9364a83691H509a95074j25081a14668A01411d10169c0508E5406c67919B04324
9353a27195N2289m9875K967e1677k34209B65196a12351c029A75916M8915g0066
9341F0434A553a51031B15432a54954i995A71498e5857q6319J0082O3017p8571
9330a47648j96463i8550k8296B10304b02663l7756g6518J860A1659a10330a063
9318d7965K1875o1624l4247A35627j5627b0323k32809K0337m7376J21161C96979
9306d2257E7580B1892N0217K50398c03459N8351N4415C2708J02920h7069A9461
9294A7774i7891K1254k07251A55173L9527c46505j31336R8199A63709c0429H8409
9282f1639n4111k69052A72727h9763q4755c5592l34167J33244B1710h0963C3164
$$ plain form
9364 -183691 8509 -195074 -320155 -114668 101411 -410169 -30508 55406 -367919 204324
9353 -127195 -74906 -124781 -121814 -51677 -285886 265196 -112351 -3029 175916 224831 -70066
9341 60434 1553 -151031 215432 -154954 -9995 171498 -55857 -142176 -132094 -69077 -147648
9330 -147648 -344111 -98550 -126846 210304 -202663 -240419 -76518 -74658 11659 -110330 -1063
9318 -47965 -26090 -87714 -121961 135627 120000 -20323 -253132 -232795 -280171 -159010 396979
9306 -42257 57580 21892 72109 322507 -303459 -245108 -190693 32708 135628 -87069 19461
9294 17774 -97891 -76637 -283888 155173 194700 -346505 -477841 -379642 163709 -30429 88409
9282 -61639 -115750 -384802 172727 -89763 -174518 -35592 -369759 -236515 21710 -80963 33164
9270a24660j20962k9392m7907A92036b61483D7949J77588A8125f4006A98314d85875
9258a27631A43255b44405j39162a29509G6436J69235i3382q3615K3745p2804r4685
9247c20741B3582c18230h5917A24884a54690C36160a24155E7101K75945A28443
9236a3748C42023a41352N4977K7975B5844J01053b36915g0461A6441M5959b6846
9224b38053A49611j9166b98065C08617a03768j68059D95315d72769A60669C893
9213d1966R094D7711h6606l4007j98673e8818l10453C477i6466M3985I3568c16624
9200d62547D2641c84588c8675j62026n3910J3784B21939M0157J2304i8919k2588
9189a21507Q364F4836g0873Q584I7269a93889D0273b14644k1288G0277a27784
$$ plain form
9270 -124660 -245622 -275014 -322921 192036 -261483 47949 225537 18125 -64006 198314 -485875
9258 -127631 143255 -244405 -383567 -129509 76436 245671 -93382 -176997 -153252 -226056 -320741
9247 -320741 23582 -318230 -85917 124884 -154690 336160 -124155 57101 333046 128443
9236 -13748 342023 -141352 -86375 -58400 25844 126897 -236915 -70461 16441 62400 -26846
9224 -238053 149611 130445 -298065 308617 -103768 -271827 495315 -472769 160669 3893
9213 -41966 -32872 47711 -86606 -120613 -319286 -58818 -369271 3477 -96466 -52481 93568 -316624
9200 -462547 42641 -384588 -38675 -200701 -254611 -240827 221939 262096 274400 -98919 -121507
9189 -121507 -113143 64836 -70873 -62289 97269 -193889 40273 -214644 -235932 70277 -127784
9177a97692d2303o2350b1890m27122B62115a72800A11001P7021b45198p5902k45813
9166e66913d3664j1065A62875g635j90126k18877a3273k29677D1583K7739e6831
9154B01342a2454k54252b0564A10749A07a58929O2807A07606i9449l7860A8715
9142b42402h1591m9619A16678a26338M1384j19409B17892a31102A07512a10407
9131d0218a6763n2205k11099D97984A63140c22100A83292k1376D7616p109b5599
9119a92896q3022F6363b73151h998B2821b42692j6873D84041m8464c10440P915
9108c02525B22188a45792j19877g0922J3098j84761L2603H6545a47029b1553k76587
9097b98140J05275G9281a77877i23o0410o1437k55705i306j70073l2708f7416
$$ plain form
9177 -197692 -42303 -104653 -21890 -449012 262115 -172800 111001 188022 -245198 -321100 -566913
9166 -566913 -43664 -54729 162875 -7635 -197761 -416638 -13273 -242950 41583 69322 -56831
9154 201342 -12454 -266706 -20564 110749 107 -158929 -96122 107606 -99449 -137309 18715
9142 -242402 -81591 -131210 116678 -126338 -84954 -204363 217892 -131102 107512 -110407
9131 -40218 -16763 -68968 -280067 497984 163140 -322100 183292 161916 47616 40507 -25599
9119 -192896 -275918 66363 -273151 -8998 22821 -242692 -259565 484041 435577 -310440 -302525
9108 -302525 222188 -145792 -265669 -70922 -57824 -242585 -209982 86545 -147029 -21553 -298140
9097 -298140 -192865 79281 -177877 -923 -61333 -122770 -378475 -9306 -179379 -212087 -67416
9085a74022j53858a37837D1922c06272B89211f7543j07796n0405f7281K6490m7711
9074h8502a1009B34404c13989a32210k3636e2967k06781a20107C10897A17334
9063h2010l1109j06062B2056M0323b30751E221c17524J48504C71400c68154a75595
9051a32970A02573c6744n9152A50962K1414D3014J7249J45253a3981B2364J351
9040B3715h2521C4729d208j092j01157B8979a01340k32271d6187C45336f3202
9028c60584f806m4473j04067l5851c7155a4161G709h654m5803j79410o4974A23416
9015f9470l711F2771f6122F6854A5173R9845c97670C28993E3939i4405d5011k14658
9003b59669B24097E8530K7565c48894P8183h0589l02453A39440b43543A71028
$$ plain form
9085 -174022 -327880 -137837 41922 -306272 289211 -67543 -175339 -225744 -67281 -40791 -88502
9074 -88502 -11009 234404 -313989 -132210 -155846 -52967 -259748 -120107 310897 117334
9063 -82010 -113119 -219181 22056 62379 -230751 5221 -317524 -169020 371400 -368154 -175595
9051 -132970 102573 -36744 -95896 150962 172376 43014 60263 205516 -13981 22364 23715
9040 23715 -82521 34729 -4208 -5300 -106457 28979 -101340 -333611 -46187 345336 -63202
9028 -360584 -6806 -51279 -155346 -191197 -37155 -14161 7709 -8654 -54457 -233867 -298841 123416
9015 -69470 -73181 62771 -66122 66854 15173 115018 -397670 328993 53939 -94405 -45011 -259669
9003 -259669 224097 58530 86095 -348894 -270711 -80589 -383042 139440 -243543 171028
8992a45128O938A13569J83609D5198d82365A90245g7203A42403r292L388E7991
8980A6963a12595k6893C2933j0595J88813c89714d9386A36300a39759n1389e0530
8968d77074i6596k38985a26202A90888b34028J3413b2780G595a8229F5620a90687
8956b09695J5108Q8823A47767a90235L9212e8992K8209k52436A54166a9665B09268
8944f7687j58724C05139a2568A32317a73834A43155o5542a26380C3220o504K65808
8933B92524g5404B05692e357H8838J82184c0280B96443A15573a938E31017L61321
8922H92338J671498N264227C288277H17205A22697J15163a68634c3823C7918J02866
8912A40784c3864k97800I8266c8000n2226A56919a08072A54549a08222k0308K2470
$$ plain form
8992 -145128 -138190 113569 297178 45198 -482365 190245 -77203 142403 133111 136499 57991
8980 16963 -112595 -139488 32933 22338 211151 -389714 -49386 136300 -139759 -191148 -50530
8968 -477074 -96596 -335581 -126202 190888 -234028 -220615 -22780 7595 -18229 65620 -190687
8956 -209695 -194587 -105764 147767 -190235 -151023 -58992 -30783 -283219 154166 -19665 209268
8944 -67687 -226411 305139 -12568 132317 -173834 143155 77613 -126380 33220 26716 292524
8933 292524 -75404 205692 -5357 88838 271022 -30280 296443 115573 -1938 531017 892338
8922 892338 2563836 7828063 3288277 817205 122697 237860 -168634 -33823 37918 140784
8912 140784 -33864 -331664 98266 -38000 -90226 156919 -108072 154549 -108222 -128530 -106060
8901a06060d2350k11982P9535D9927g3858C62481b08101J2332l6204C8356J72891
8890B11247i0725A73054A2466a69883j16018J7007c8348p1420D9803J24131b34432
8878b3032j19142A94088q1294h06A1573J07403L1894d3209E2302b22487A67950
8866A07700L54746a03889m7281j02083g1332r7581r4113a30051N5090p3434A60450
8854B43283C2228a64216c1698j3012l28277a74154O9838K6383b4404D976L55460
$$ plain form
8901 -106060 -42350 -254332 -174797 49927 -73858 362481 -208101 -195769 -231973 38356 211247
8890 211247 -90725 173054 12466 -169883 -285901 -268894 -38348 -109768 49803 173934 -234432
8878 -23032 -142174 194088 112794 -806 11573 118976 150870 -43209 52302 -222487 167950
8866 107700 462446 -103889 -151170 -253253 -71332 -168913 -263026 -130051 -74961 -148395 160450
8854 243283 32228 -164216 -31698 -44710 -372987 -174154 -104316 -77933 -24404 4976 360436
$$ [...]
##END NTUPLES=NMR SPECTRUM
##END=
