##TITLE=AC1642_ETIAN13375_8569649_POWvS8Shdt
##JCAMPDX= 6.0         $$ Bruker NMR JCAMP-DX V2.0
##DATA TYPE= NMR SPECTRUM
##DATA CLASS= NTUPLES
##ORIGIN= BRUKER
##OWNER= Administrator
$$ 1.72 TOPSPIN		Version 2.1
$$ 2014-04-10 15:51:24.974 -0700  Administrator@X
$$ Compression mode = diff/dup
##.OBSERVE FREQUENCY= 400.02188249412
##.OBSERVE NUCLEUS= ^1H
##.ACQUISITION MODE= SIMULTANEOUS (DQD)
##.ACQUISITION SCHEME= undefined
##.AVERAGES= 64
##.DIGITISER RES= 22
##SPECTROMETER/DATA SYSTEM= spect
##.PULSE SEQUENCE= noesygpps1d.comp
##.SOLVENT NAME= COFFEE_meoh
##.SHIFT REFERENCE= INTERNAL, COFFEE_meoh, 1, 14.96134
##AUDIT TRAIL= $$ (NUMBER, WHEN, WHO, WHERE, PROCESS, VERSION, WHAT)
$$ ##TITLE= Audit trail, TOPSPIN		Version 2.1
$$ ##JCAMPDX= 5.01
$$ ##ORIGIN= Bruker BioSpin GmbH
$$ ##OWNER= Administrator
$$ $$ E:\/data/COFFEE/nmr/AC1642_ETIAN13375_8569649_POWvS8Shdt/12/pdata/1/auditp.txt
$$ ##AUDIT TRAIL=  $$ (NUMBER, WHEN, WHO, WHERE, PROCESS, VERSION, WHAT)
(   1,<2014-04-10 15:51:19.318 -0700>,<Administrator>,<X>,<go>,<TOPSPIN 2.1>,
      <created by zg
	started at 2014-04-10 15:39:49.767 -0700,
	POWCHK enabled, PULCHK disabled,
       configuration hash MD5:
       C8 4E 4E 5D D3 5C D8 9E 9F 52 82 E0 59 8A DE 15
       data hash MD5: 64K
       0F 38 FA 83 0B 7F D9 E7 68 28 E1 CA B0 9C 3E ED>)
(   2,<2014-04-10 15:51:22.802 -0700>,<Administrator>,<X>,<proc1d>,<TOPSPIN 2.1>,
      <Start of raw data processing
       efp LB = 0.3 FT_mod = 6 PKNL = 1 PHC0 = 0 PHC1 = 0 SI = 128K 
       data hash MD5: 128K
       04 45 D6 BE 5D D3 BD B6 ED 21 45 7D 76 E4 34 E3>)
(   3,<2014-04-10 15:51:23.818 -0700>,<Administrator>,<X>,<proc1d>,<TOPSPIN 2.1>,
      <pk PHC0 = -82.82043 PHC1 = 0 
       data hash MD5: 128K
       D8 07 6D DD 67 89 7E EE 99 72 28 32 79 85 80 81>)
(   4,<2014-04-10 15:51:24.318 -0700>,<Administrator>,<X>,<proc1d>,<TOPSPIN 2.1>,
      <abs ABSG = 1 
       data hash MD5: 128K
       26 84 74 52 4F AB 7C C8 52 53 E7 A9 26 8B 68 62>)
(   5,<2014-04-10 15:51:24.427 -0700>,<Administrator>,<X>,<proc1d>,<TOPSPIN 2.1>,
      <abs ABSG = 2 
       data hash MD5: 128K
       1F 23 E2 3F A6 66 94 94 15 C7 4B 0C 0E CC EA 8F>)
(   6,<2014-04-10 15:51:24.536 -0700>,<Administrator>,<X>,<proc1d>,<TOPSPIN 2.1>,
      <abs ABSG = 3 
       data hash MD5: 128K
       B1 FA 51 88 0C F9 A8 EF 4C E8 96 CA A6 44 24 A3>)
(   7,<2014-04-10 15:51:24.646 -0700>,<Administrator>,<X>,<proc1d>,<TOPSPIN 2.1>,
      <abs ABSG = 4 
       data hash MD5: 128K
       E6 93 A8 EA 07 23 9A 88 3A BC 76 EB 86 7D 32 80>)
(   8,<2014-04-10 15:51:24.739 -0700>,<Administrator>,<X>,<proc1d>,<TOPSPIN 2.1>,
      <abs ABSG = 5 
       data hash MD5: 128K
       71 47 53 C7 FA 56 D3 13 87 1B 44 AC 10 DF 59 C3>)
$$ ##END=
$$ 
$$ $$ hash MD5
$$ $$ 21 E2 9F 6E 62 6D 1C 91 18 91 3C 83 A3 5E E9 70
##$RELAX= 
##$RELAX= 
##$RELAX= 
##$RELAX= 
##$RELAX= 
##$RELAX= 
##$RELAX= 
##$RELAX= 
$$ Bruker specific parameters
$$ --------------------------
##$DU= <E:\>
##$EXPNO= 12
$$ [...]
##$TP07= 0
##$TPNAME0= <>
##$TPNAME1= <>
##$TPNAME2= <>
##$TPNAME3= <>
##$TPNAME4= <>
##$TPNAME5= <>
##$TPNAME6= <>
##$TPNAME7= <>
##$TPOAL= (0..7)
0.5 0.5 0.5 0.5 0.5 0.5 0.5 0.5
##$TPOFFS= (0..7)
0 0 0 0 0 0 0 0
##$TUNHIN= 0
##$TUNHOUT= 0
##$TUNXOUT= 0
##$USERA1= <user>
##$USERA2= <user>
##$USERA3= <user>
##$USERA4= <user>
##$USERA5= <user>
##$V9= 5
##$VALIST= <valist>
##$VCLIST= <CCCCCCCCCCCCCCC>
##$VD= 0
##$VDLIST= <DDDDDDDDDDDDDDD>
##$VPLIST= <PPPPPPPPPPPPPPP>
##$VTLIST= <TTTTTTTTTTTTTTT>
##$WBST= 1024
##$WBSW= 4
##$XGAIN= (0..3)
0 0 0 0
##$XL= 0
##$YL= 0
##$YMAX_a= 6409770
##$YMIN_a= -13975725
##$ZGOPTNS= <>
##$ZL1= 120
##$ZL2= 120
##$ZL3= 120
##$ZL4= 120
##$ABSF1= 14.96134
##$ABSF2= -5.596842
##$ABSG= 5
##$ABSL= 3
##$ALPHA= 0
##$AQORDER= 0
##$ASSFAC= 0
##$ASSFACI= 0
##$ASSFACX= 0
##$ASSWID= 0
##$AUNMP= <proc_prof1d_extract.lims>
##$AXLEFT= 0
##$AXNAME= <>
##$AXNUC= <1H>
##$AXRIGHT= 0
##$AXTYPE= 0
##$AXUNIT= <>
##$AZFE= 0.1
##$AZFW= 0.1
##$BCFW= 0
##$BC_mod= 0
##$BYTORDP= 0
##$COROFFS= 0
##$CY= 15
##$DATMOD= 1
##$DC= 0
##$DFILT= <>
##$DTYPP= 0
##$F1P= 0
##$F2P= 0
##$FCOR= 0.5
##$FTSIZE= 131072
##$FT_mod= 6
##$GAMMA= 0
##$GB= 0
##$INTBC= 1
##$INTSCL= 1
##$ISEN= 128
##$LB= 0.3
##$LEV0= 0
##$LPBIN= 0
##$MAXI= 10000
##$MC2= 0
##$MEAN= 0
##$ME_mod= 0
##$MI= 0
##$NCOEF= 0
##$NC_proc= -2
##$NLEV= 6
##$NOISF1= 0
##$NOISF2= 0
##$NSP= 0
##$NTH_PI= 0
##$NZP= 0
##$OFFSET= 14.96134
##$PC= 1
##$PHC0= -82.82043
##$PHC1= 0
##$PH_mod= 1
##$PKNL= yes
##$PPARMOD= 0
##$PPDIAG= 0
##$PPIPTYP= 0
##$PPMPNUM= 2147483647
##$PPRESOL= 1
##$PSCAL= 4
##$PSIGN= 0
##$PYNMP= <proc.py>
##$REVERSE= no
##$SF= 400.020009499486
##$SI= 131072
##$SIGF1= 0
##$SIGF2= 0
##$SINO= 400
##$SIOLD= 131072
##$SPECTYP= <>
##$SREGLST= <1H.CDCl3>
##$SSB= 0
##$STSI= 131072
##$STSR= 0
##$SW_p= 8223.68421052631
##$SYMM= 0
##$S_DEV= 0
##$TDeff= 65536
##$TDoff= 0
##$TI= <>
##$TILT= no
##$TM1= 0
##$TM2= 0
##$TOPLEV= 0
##$USERP1= <user>
##$USERP2= <user>
##$USERP3= <user>
##$USERP4= <user>
##$USERP5= <user>
##$WDW= 1
##$XDIM= 131072
##$YMAX_p= 415134568
##$YMIN_p= -12851
##$CURPLOT= <Network HP LaserJet P1505>
##$CURPRIN= <$Network HP LaserJet P1505>
##$DFORMAT= <normdp>
##$LAYOUT= <+/1D_H.xwp>
##$LFORMAT= <normlp>
##$PFORMAT= <normpl>
##$SURQMSG= 1
$$ End of Bruker specific parameters
$$ ---------------------------------
##NTUPLES= NMR SPECTRUM
##VAR_NAME=  FREQUENCY,     SPECTRUM/REAL,   SPECTRUM/IMAG
##SYMBOL=    X,             R,               I
##VAR_TYPE=  INDEPENDENT,   DEPENDENT,       DEPENDENT
##VAR_FORM=  AFFN,          ASDF,            ASDF
##VAR_DIM=   131072,        131072,          131072
##UNITS=     HZ,            ARBITRARY UNITS, ARBITRARY UNITS
##FACTOR=    0.0627417313425164, 1,          1
##FIRST=     8223.62146879497, 457,          -59970
##LAST=      0,             2137,            -60442
##MIN=       0,             -12851,          0
##MAX=       8223.62146879497, 415134568,    0
$$ Real data points
##PAGE= N=1
##DATA TABLE= (X++(R..R)), XYDATA
$$ [...]
$$ plain form
61472 588819 586680 584033 581642 579999 578881 577727 576288 574818 573712 572968 571958 569758 565935 561055
61458 561055 556324 552630 550025 548120 546791 546341 547094 549026 551772 554857 557924 560935 564176 567966 572326
61443 572326 577009 581792 586602 591283 595444 598715 601107 602986 604664 606093 606989 607216 607000 606793 606994
61428 606994 607780 609067 610456 611352 611460 611336 612178 614741 618545 622435 625900 629504 633960 639106 644002
61413 644002 647790 650285 651882 653118 654174 654639 653913 652033 649971 648767 648348 647450 644851 640504 635360
61398 635360 630286 625441 620703 616322 612813 610225 607924 605292 602421 599834 597742 595956 594425 593341
61384 593341 592712 592289 592104 592614 594038 595970 597977 600192 602953 606214 609853 614156 619340 624770 629354
61369 629354 632799 635757 638602 640735 641444 640905 639828 638512 636755 634541 632298 630511 629471 629452 630805
$$ packed form
61472E88819k139k647k391j643j118j154j439j470j106p44j010k200l823m880
61458E61055m731l694k605j905j329m50P53J932K746L085L067L011L241L790M360
61443E72326M683M783M810M681M161L271K392J879J678J429Q96K27k16k07K01
61428F06994P86J287J389Q96J08j24Q42K563L804L890L465L604M456N146M896
61413F44002L788K495J597J236J056M65p26j880k062j204m19q98k599m347n144
61398F35360n074m845m738m381l509k588k301k632k871k587k092j786j531j084
61384E93341o29m23j85N10J424J932K007K215K761L261L639M303N184N430M584
61369F29354L445K958K845K133P09n39j077j316j757k214k243j787j040j9J353
$$ plain form
61354 630805 633725 638066 643479 649633 656286 663228 670208 676837 682595 687078 690290 692620 694415 695665
61340 695665 696179 696109 696039 696407 696953 697029 696471 695859 695742 695862 695451 694071 691855 689068 685919 682881 680691 679724
61322 679724 679587 679672 679932 680812 682473 684506 686616 689351 693825 700709 709629 719613 729986 740762 752412
61307 752412 765496 780439 797279 815513 834282 852704 869808 884267 894694 900472 902029 900054
61295 900054 894796 886403 875615 863575 850988 837893 824205 810139 796141 782734 770439 759474
61283 759474 749534 740187 731528 724088 718101 713283 709422 706785 705724 706197 707915 710634 714087 717764
61269 717764 721036 723435 724803 725383 725885 727202 729890 734022 739577 746699 755395 765163 775087 784160 791462
61254 791462 796379 798921 799682 799283 797986 796016 794024 792841 792761 793319 793824 794003 794142 794742 796113 798159
$$ packed form
61354F30805K920M341N413O154O653O942O980O629N758M483L212K330J795J250
61340F95665N14p0p0L68N46P6n58o12j17J20m11j380k216k787l149l038k190r67
61322F79724j37Q5K60Q80J661K033K110K735M474O884Q920R984J0373J0776J1650
61307G52412J3084J4943J6840J8234J8769J8422J7104J4459J0427N778J557j975
61295I00054n258q393j0788j2040j2587j3095j3688j4066j3998j3407j2295j0965
61283G59474r940r347q659p440n987m818l861k637j061M73J718K719L453L677
61269G17764L272K399J368N80N02J317K688M132N555P122Q696R768R924R073P302
61254G91462M917K542P61l99j297j970j992j183q0N58N05J79J39O00J371K046
$$ plain form
61238 798159 800456 802541 804146 805213 805722 805568 804709 803559 803117 804375 807461 811657 816495 822522 830529
61223 830529 840247 850319 859587 867872 875470 882438 888647 894155 899162 903853 908420 912929 917018 920101
61209 920101 922055 923371 924460 925285 925975 927270 929814 933412 937589 942647 949547 958872 970534 984380
61195 984380 1000351 1017975 1036385 1055027 1073630 1091137 1105383 1114543 1118626 1119070 1117178 1113540 1108616
61182 1108616 1102976 1096720 1089334 1080407 1070066 1058469 1045408 1030860 1015477 1000022 984598 968976
61170 968976 953482 938876 925370 912396 899472 886778 874730 863537 853358 844375 836396 828974
61158 828974 822313 817570 815758 816674 819362 823253 828331 834558 841893 850694 861370 873568 886141 897881
61144 897881 907858 915274 919749 921878 923057 924682 927783 933212 941473 952363 965390 980582 998418
$$ packed form
61238G98159K297K085J605J067N09j54q59j150m42J258L086M196M838O027Q007
61223H30529R718J0072R268Q285P598O968O209N508N007M691M567M509M089L083
61209I20101J954J316J089Q25O90J295K544L598M177N058O900R325J1662J3846
61195I84380J5971J7624J8410J8642J8603J7507J4246R160M083M44j892l638m924
61182A108616n640o256p386q927j0341j1597j3061j4548j5383j5455j5424j5622
61170I68976j5494j4606j3506j2974j2924j2694j2048j1193j0179q983p979p422
61158H28974o661m743j812R16K688L891N078O227P335Q801J0676J2198J2573J1740
61144H97881R977P416M475K129J179J625L101N429Q261J0890J3027J5192J7836
$$ plain form
61131 998418 1019040 1042183 1067838 1096208 1126950 1159378 1193648 1230923 1271922 1315976 1361967
61120 1361967 1409534 1458921 1510205 1563167 1617411 1672076 1725930 1778286 1829371 1879267 1926842
61109 1926842 1970295 2008385 2040578 2066335 2084969 2096160 2100122 2097262 2087864 2071854 2048593 2017350
61097 2017350 1978424 1933518 1884591 1832651 1778057 1721548 1664325 1607403 1551551 1497737 1446930
61086 1446930 1399462 1355063 1313509 1274776 1238666 1204921 1173789 1145979 1121827 1100777 1081841
61075 1081841 1064319 1047986 1032804 1018633 1005202 992337 980151 968862 958474 948922 940504 933724
61063 933724 928579 924383 920475 916740 913261 910055 907489 906471 907766 911375 916889 924031 932536 942003
61049 942003 952314 963787 976517 990091 1004399 1020108 1037603 1056007 1074090 1091780 1109959
$$ packed form
61131I98418K0622K3143K5655K8370L0742L2428L4270L7275M0999M4054M5991
61120A361967M7567M9387N1284N2962N4244N4665N3854N2356N1085M9896M7575
61109A926842M3453L8090L2193K5757J8634J1191L962k860r398j6010k3261l1243
61097B017350l8926m4906m8927n1940n4594n6509n7223n6922n5852n3814n0807
61086A446930m7468m4399m1554l8733l6110l3745l1132k7810k4152k1050j8936
61075A081841j7522j6333j5182j4171j3431j2865j2186j1289j0388r552q418o780
61063I33724n145m196l908l735l479l206k566j018J295L609N514P142Q505R467
61049I42003J0311J1473J2730J3574J4308J5709J7495J8404J8083J7690J8179
$$ plain form
61038 1109959 1128982 1148240 1167072 1185374 1203332 1221151 1239054 1257081 1275045 1293012 1311453
61027 1311453 1330498 1349630 1368873 1389734 1414048 1442185 1473290 1506925 1543522 1583451 1626718
61016 1626718 1673438 1723689 1777178 1834204 1896882 1968309 2050613 2144879 2252667 2376081 2516282
61005 2516282 2673692 2850432 3051622 3284107 3555231 3873226 4247419 4687431 5203333
60996 5203333 5807063 6512568 7334502 8288921 9396687 10685406 12186678 13927584 15910505
60987 15910505 18075815 20264596 22225367 23694206 24514520 24713377 24478962 24066041 23703565
60978 23703565 23544824 23640994 23913997 24152263 24073534 23447422 22202435 20443315 18378578
60969 18378578 16224193 14144434 12239871 10558484 9110628 7883550 6854169 5996769
$$ packed form
61038A109959J9023J9258J8832J8302J7958J7819J7903J8027J7964J7967J8441
61027A311453J9045J9132J9243K0861K4314K8137L1105L3635L6597L9929M3267
61016A626718M6720N0251N3489N7026O2678P1427Q2304R4266J07788J23414J40201
61005B516282J57410J76740K01190K32485K71124L17995L74193M40012N15902
60996E203333O03730P05505Q21934R54419J107766J288719J501272J740906J982921
60987A5910505K165310K188781J960771J468839Q20314J98857k34415m12921l62476
60978B3703565j58741R6170K73003K38266p8729o26112j244987j759120k064737
60969A8378578k154385k079759j904563j681387j447856j227078j029381q57400
$$ plain form
60961 5996769 5285856 4697897 4212952 3814222 3486109 3213792 2984686 2789163 2619836
60952 2619836 2471144 2339549 2222733 2118029 2022312 1933590 1851839 1777832 1711614 1652159
60942 1652159 1597830 1546807 1497494 1448902 1400678 1352967 1306403 1261783 1219245 1178163 1138364
60931 1138364 1101030 1067627 1038281 1011999 988155 966772 947582 929951 913818 899609 887028
60920 887028 874933 862768 851197 840901 831575 822607 813993 806047 798835 792435 787184 783019 779049
60907 779049 774422 769350 764674 760620 756514 751549 745364 737925 729336 719948 710465 701730 694268 687872
60893 687872 681676 674912 667620 660404 653593 647060 640925 635914 632799 631797 632711 635229 638745 642181
60879 642181 644440 645075 644481 643546 643059 643127 643051 642082 640381 638937 638474 638854 639625 640596 641576 642104 641904 641390
$$ packed form
60961E996769p10913n87959m84945l98730l28113k72317k29106j95523j69327
60952B619836j48692j31595j16816j04704r5717q8722q1751p4007o6218n9455
60942A652159n4329n1023m9313m8592m8224m7711m6564m4620m2538m1082l9799
60931A138364l7334l3403k9346k6282k3844k1383j9190j7631j6133j4209j2581
60920H87028j2095j2165j1571j0296r326q968q614p946p212o400n251m165l970
60907G79049m627n072m676m054m106m965o185p439q589r388r483q735p462o396
60893F87872o196o764p292p216o811o533o135n011l115j002R14K518L516L436
60879F42181K259O35n94r35m87O8p6r69j701j444m63L80P71R71R80N28k00n14
$$ plain form
60861 641390 641285 641913 643066 644307 645230 645760 646484 648255 651111 653966 655762 656494 656586 655756 653323 649482
60845 649482 645438 642163 639676 637611 635808 633953 631193 626578 619727 610885 600595 589584 578740
60832 578740 568764 559725 551085 542281 533414 525377 519107 514582 510770 506812 502999 500197 498606 497709
60818 497709 497347 498016 499798 501690 502496 502027 501002 500146 499832 500214 501108 501896 502105 502060 502493 503600 504974
60801 504974 506394 508045 509886 511396 512209 512510 512519 512059 511028 509911 509281 508970 508247 506752 504830 502876
60785 502876 500773 498133 494848 491191 487505 483939 480488 477158 474017 471007 467845 464311 460654 457487
60771 457487 455100 453187 451402 449941 449260 449390 449927 450588 451426 452572 454223 456846 460826 465666 469971
60756 469971 472606 473682 474201 474996 476302 478024 479920 481563 482606 483257 484228 486075 488718 491696 494651
$$ packed form
60861F41390j05O28J153J241R23N30P24J771K856K855J796P32R2q30k433l841
60845F49482m044l275k487k065j803j855k760m615o851q842j0290j1011j0844
60832E78740r976r039q640q804q867q037o270m525l812l958l813k802j591q97
60818D97709l62O69J782J892Q06m69j025q56l14L82Q94P88K09m5M33J107J374
60801E04974J420J651J841J510Q13L01Rm60j031j117o30l11p23j495j922j954
60785E02876k103k640l285l657l686l566l451l330l141l010l162l534l657l167
60771D57487k387j913j785j461o81J30N37O61Q38J146J651K623L980M840M305
60756D69971K635J076N19P95J306J722J896J643J043O51R71J847K643K978K955
$$ plain form
60741 494651 497386 499605 500888 500954 499858 497880 495400 492907 490912 489665 488996 488640 488706 489705 492081 495788
60725 495788 500207 504269 506825 507354 506465 505382 504752 504224 503335 502298 501567 501060 500375 499475 498450 496730
60709 496730 493368 488340 482932 478484 475191 472420 469781 467377 465255 463103 460595 457820 455291 453583
60695 453583 452835 452625 452451 452299 452527 453211 453966 454546 455301 456789 459110 461795 464243 466211 468075 470573
60679 470573 474053 477936 481303 484047 487030 490966 495596 500259 504780 509382 513977 517985 520712 521722
60665 521722 521076 519462 517745 516035 513530 509717 505387 501975 500099 499336 499188 499523 500092 500391 500286 500267
60649 500267 500829 502045 503969 506936 510919 514925 517555 518161 517107 515028 512276 509165 506198 503662 501283
60634 501283 498758 496534 495588 496218 497536 498496 499114 500202 502081 504154 505749 506804 507454 507500 506729 505513
$$ packed form
60741D94651K735K219J283O6j096j978k480k493j995j247o69l56O6R99K376L707
60725D95788M419M062K556N29q89j083o30n28q89j037p31n07o85r00j025j720
60709D96730l362n028n408m448l293k771k639k404k122k152k508k775k529j708
60695D53583p48k10j74j52K28O84P55N80P55J488K321K685K448J968J864K498
60679D70573L480L883L367K744K983L936M630M663M521M602M595M008K727J010
60665E21722o46j614j717j710k505l813m330l412j876p63j48L35N69K99j05j9
60649E00267N62J216J924K967L983M006K630O06j054k079k752l111k967k536k379
60634E01283k525k224r46O30J318R60O18J088J879K073J595J055O50M6p71j216
$$ plain form
60618 505513 504649 504644 505425 506652 508036 509346 510329 510775 510685 510356 510194 510338 510578 510755 511007 511325 511181 510113
60600 510113 508562 507457 506990 506532 505854 505573 506005 506441 506194 505740 506093 507564 509808 512677 516169 519847
60584 519847 523210 526479 530231 534251 537594 539823 541472 543099 544579 545587 546322 547451 549713 553640
60570 553640 559233 565715 571999 577620 583019 588878 595495 602860 610918 619591 628813 638598 648845 659054
60556 659054 668452 676382 682328 685788 686629 685478 683232 680161 676044 671263 667106 664713 664181 665049 667213
60541 667213 670949 676269 682712 689770 697333 705778 715763 727892 742447 759378 778395 799045 820885
60528 820885 843733 867503 891508 914234 934215 950946 964420 973953 978172 976243 968632 956591
60516 956591 941415 924341 906565 889009 872317 857137 844041 833149 824297 817663 813733 812562
$$ packed form
60618E05513q64nP81J227J384J310R83M46r0l29j62J44K40J77K52L18j44j068
60600E10113j551j105m67m58o78k81M32M36k47m54L53J471K244K869L492L678
60584E19847L363L269L752M020L343K229J649J627J480J008P35J129K262L927
60570E53640N593O482O284N621N399N859O617P365Q058Q673R222R785J0247J0209
60556F59054R398P930N946L460Q41j151k246l071m117m781m157k393n32Q68K164
60541F67213L736N320O443P058P563Q445R985J2129J4555J6931J9017K0650K1840
60528H20885K2848K3770K4005K2726J9981J6731J3474R533M219j929p611j2041
60516I56591j5176j7074j7776j7556j6692j5180j3096j0892q852o634l930j171
$$ plain form
60504 812562 813616 816566 821736 829556 840029 853045 868773 887455 909268 934578 963904 997250
60492 997250 1033883 1073054 1114444 1157518 1200827 1242433 1280707 1314435 1342671 1365199 1383038
60481 1383038 1398010 1411815 1425599 1439894 1454289 1467261 1476746 1480772 1477322 1464049 1439062 1402237
60469 1402237 1355497 1301788 1243973 1184432 1125065 1067364 1012667 962247 916906 876526 840396
60458 840396 808008 779301 754193 732250 712939 695939 681114 668362 657536 648315 640183 632826
60446 632826 626522 621815 618621 615987 613005 609792 607238 605802 604860 603383 601077 598656 597028 596450 596471
60431 596471 596463 596003 594927 593322 591471 589640 587948 586611 586171 587181 589630 592957 596664 600614 604646
60416 604646 608252 610905 612540 613562 614468 615576 616945 618461 620104 622152 624908 628244 631655 634837
$$ packed form
60504H12562J054K950N170P820J0473J3016J5728J8682K1813K5310K9326L3346
60492I97250L6633L9171M1390M3074M3309M1606L8274L3728K8236K2528J7839
60481A383038J4972J3805J3784J4295J4395J2972R485M026l450j3273k4987l6825
60469A402237m6740n3709n7815n9541n9367n7701n4697n0420m5341m0380l6130
60458H40396l2388k8707k5108k1943j9311j7000j4825j2752j0826r221q132p357
60446F32826o304m707l194k634k982l213k554j436r42j477k306k421j628n78K1
60431E96471qm60j076j605j851j831j692j337m40J010K449L327L707L950M032
60416F04646L606K653J635J022R06J108J369J516J643K048K756L336L411L182
$$ plain form
60402 634837 637909 640997 643980 646819 649774 652974 656114 658923 661730 665190 669498 674205 678724 682774
60388 682774 686409 689867 693390 696985 700422 703683 707264 711703 716803 721673 725667 729062 732601 736570
60374 736570 740536 743948 746719 749170 751657 754467 757876 761938 766163 769721 772211 774046 775993 778580
60360 778580 782090 786765 792694 799770 808064 817967 829504 841851 854146 866623 880278 895497 911675
60347 911675 928095 944274 959194 971077 978502 981315 980078 975143 966694 955207 941376 925924
60335 925924 909871 894541 880838 868806 858251 849392 842425 836932 832316 828518 825612 822937 819419
60322 819419 814707 809421 804287 799677 796022 794026 794161 796431 800813 807512 816559 827591 840402 855336
60308 855336 872634 891391 909553 925119 937218 946014 951848 954806 955126 953695 951812 950370 949302
$$ packed form
60402F34837L072L088K983K839K955L200L140K809K807L460M308M707M519M050
60388F82774L635L458L523L595L437L261L581M439N100M870L994L395L539L969
60374G36570L966L412K771K451K487K810L409M062M225L558K490J835J947K587
60360G78580L510M675N929P076Q294R903J1537J2347J2295J2477J3655J5219J6178
60347I11675J6420J6179J4920J1883P425K813j237m935q449j1487j3831j5452
60335I25924j6053j5330j3703j2032j0555q859o967n493m616l798k906k675l518
60322H19419m712n286n134m610l655j996J35K270M382O699R047J1032J2811J4934
60308H55336J7298J8757J8162J5566J2099Q796N834K958L20j431j883j442j068
$$ plain form
60295 949302 947730 944552 939053 931225 921418 909570 895039 877625 858610 840194 823863 809733
60283 809733 797419 786854 777974 770263 763105 756231 749526 742811 736155 729961 724323 718685 712594 706429
60269 706429 700916 696199 691825 687421 682976 678747 675307 673370 673031 673421 673569 673352 673157 672967 672512 672086
60253 672086 672404 673624 675172 676584 677911 679232 680345 681100 681523 681495 680843 679864 679223 679067 678715 677574 675976
60236 675976 674810 674600 675293 676750 679077 682433 686724 691572 696640 702016 708223 715681 724199 733134 742010
60221 742010 750851 759992 769798 780455 791808 803379 814764 826039 837640 849841 862481 875145
60209 875145 887458 899240 910489 921189 931121 940076 948240 956077 963614 970193 975190 978681 981059
60196 981059 982322 982172 980546 977593 973260 967396 960187 952053 943220 933754 923896 913942 903991 894308
$$ packed form
60295I49302j572l178n499p828r807j1848j4531j7414j9015j8416j6331j4130
60283H09733j2314j0565q880p711p158o874o705o715o656o194n638n638o091o165
60269G06429n513m717m374m404m445m229l440j937l39L90J48k17j95j90m55m26
60253F72086L18J220J548J412J327J321J113P55M23k8o52r79o41j56l52j141j598
60236F75976j166k10O93J457K327L356M291M848N068N376O207P458Q518Q935Q876
60221G42010Q841R141R806J0657J1353J1571J1385J1275J1601J2201J2640J2664
60209H75145J2313J1782J1249J0700R932Q955Q164P837P537O579M997L491K378
60196I81059J263j50j626k953m333n864p209q134q833r466r858r954r951r683
$$ plain form
60182 894308 885730 879001 873709 868547 862823 857177 852635 849442 847040 844777 842372 840028 838321 837686
60168 837686 837837 837912 837226 835603 832958 829052 823896 818034 812204 806945 802618 799427 797173 795366 793846
60153 793846 793090 793625 795347 797664 800138 802780 805873 809730 814458 819712 824811 829386 833897 839252 845779
60138 845779 852726 858847 863471 867003 870521 875040 881082 888604 897017 905376 912924 919568 925591 930930
60124 930930 935089 937902 939948 941968 944227 946804 950099 954501 959711 964885 969430 973346 976875 980188
60110 980188 983356 986242 988509 990001 991041 991981 992583 992342 991375 990516 990399 990784 990919 990325 989165 988035
60094 988035 987425 987201 986625 984979 982012 977723 972063 965184 957653 949969 942028 933553 924877 916814 909815
60079 909815 903655 897815 891771 885117 877932 870851 864189 857206 848941 839724 831040 823827 817648 811801
$$ packed form
60182H94308q578o729n292n162n724n646m542l193k402k263k405k344j707o35
60168H37686J51P5o86j623k645l906n156n862n830n259m327l191k254j807j520
60153G93846p56N35J722K317K474K642L093L857M728N254N099M575M511N355O527
60138H45779O947O121M624L532L518M519O042P522Q413Q359P548O644O023N339
60124I30930M159K813K046K020K259K577L295M402N210N174M545L916L529L313
60110I80188L168K886K267J492J040R40O02k41r67q59j17L85J35n94j160j130
60094I88035o10k24n76j646k967m289n660o879p531p684p941q475q676q063o999
60079I09815o160n840o044o654p185p081o662o983q265r217q684p213o179n847
$$ plain form
60065 811801 806478 802339 799394 796801 793637 789661 785516 782238 780308 779167 777956 776647 775982 776320 777144
60050 777144 777849 778534 779724 781748 784645 788380 792920 798262 804446 811316 818245 824414 829379 833105 835489
60035 835489 836266 835390 833155 829978 826355 822872 819756 816460 812132 806517 800009 792970 785434 777296 768273
60020 768273 757982 746726 735994 727323 720706 714880 709035 703361 698090 693141 688848 685874 684089
60007 684089 682521 680765 679394 678666 677924 676823 676047 676158 676750 677478 678897 681411 684293 686749 689130 692092
59991 692092 695278 698053 700985 705290 711057 717144 722708 727728 732089 735273 737154 738217 738636 737816 735177
59976 735177 731013 726385 722307 719007 715726 711481 706303 701410 697834 695318 693065 691086 690047 690128 690927
59961 690927 692406 695120 699390 704826 710717 716366 721108 724579 727022 728897 730251 730925 731182 731518 731980
$$ packed form
60065H11801n323m139k945k593l164l976m145l278j930j141j211j309o65L38Q24
60050G77144P05O85J190K024K897L735M540N342O184O870O929O169M965L726K384
60035H35489P77q76k235l177l623l483l116l296m328n615o508p039p536q138r023
60020G68273j0291j1256j0732q671o617n826n845n674n271m949m293k974j785
60007F84089j568j756j371p28p42j101p76J11N92P28J419K514K882K456K381K962
59991F92092L186K775K932M305N767O087N564N020M361L184J881J063M19q20k639
59976G35177m164m628m078l300l281m245n178m893l576k516k253j979j039Q1P99
59961F90927J479K714M270N436N891N649M742L471K443J875J354O74K57L36M62
$$ plain form
59946 731980 732339 732804 733749 734648 734182 731786 728492 725814 724294 723524 723195 723589 725197 728169 732190 736782
59930 736782 741827 747785 755189 763881 772892 780994 787171 790709 791364 789632 786662 783695 781664 781166 782505
59915 782505 785645 790328 796283 803180 810523 817875 825140 832268 838685 843439 846022 846695 845870 843559 839723
59900 839723 834858 829736 824628 819248 813609 808530 804994 803212 802707 803184 804805 807530 810781 814148 817979
59885 817979 822765 828290 833979 839811 846226 853257 860526 868027 876072 884377 892048 898748 905028 911160
59871 911160 916423 920071 922239 923284 922894 920586 916633 911780 906426 900664 894764 888938 882960 876721
59857 876721 870935 866644 864165 862998 862540 862358 862043 861404 860681 860162 859893 860227 862184 866572 873060 880814
59841 880814 889751 900376 912594 925491 938233 950448 961709 971358 978981 984645 988772 992250 996417
$$ packed form
59946G31980L59M65R45Q99m66k396l294k678j520p70l29L94J608K972M021M592
59930G36782N045N958P404Q692R011Q102O177L538O55j732k970k967k031m98J339
59915G82505L140M683N955O897P343P352P265P128O417M754K583O73q25k311l836
59900H39723m865n122n108n380n639n079l536j782n05M77J621K725L251L367L831
59885H17979M786N525N689N832O415P031P269P501Q045Q305P671O700O280O132
59871I11160N263L648K168J045l90k308l953m853n354n762n900n826n978o239
59857H76721n786m291k479j167m58j82l15o39p23n19k69L34J957M388O488P754
59841H80814Q937J0625J2218J2897J2742J2215J1261R649P623N664M127L478M167
$$ plain form
59828 996417 1002242 1009473 1016927 1023287 1027141 1026894 1021809 1013085 1002958 992769 982679 973069 964926 958526
59814 958526 952864 946893 940627 934571 928816 923209 917875 913076 908986 905868 903978 902980 901948 900320
59800 900320 898421 896764 895300 893689 891854 889908 887861 885694 883427 880942 878110 875248 872897 870839
59786 870839 867927 863361 857779 852544 848226 844264 839978 835433 831272 828043 825804 824258 823166 822543
59772 822543 822419 822626 823105 824264 826622 830056 833825 837512 841574 846842 853716 862025 871399 881613 892686
59757 892686 904731 917563 930568 943171 955281 966926 977568 986336 993062 998647 1004206 1010072
59745 1010072 1015701 1020258 1023270 1024991 1026177 1027300 1028100 1028178 1027766 1027434 1027220 1026678 1025722 1024730 1023810 1022637
59729 1022637 1021155 1019746 1018546 1017252 1015908 1015125 1015116 1015097 1014149 1012253 1010038 1007893 1005826 1003947 1002596 1002071
$$ packed form
59828I96417N825P231P454O360L854k47n085q724j0127j0189j0090r610q143o400
59814I58526n662n971o266o056n755n607n334m799m090l118j890r98j032j628
59800I00320j899j657j464j611j835j946k047k167k267k485k832k862k351k058
59786H70839k912m566n582n235m318l962m286m545m161l229k239j546j092o23
59772H22543j24K07M79J159K358L434L769L687M062N268O874Q309R374J0214J1073
59757H92686J2045J2832J3005J2603J2110J1645J0642Q768O726N585N559N866
59745A010072N629M557L012J721J186J123Q00P8m12l32k14n42r56r92r20j173
59729A022637j482j409j200j294j344p83rj9r48j896k215k145k067j879j351n25
$$ plain form
59713 1002071 1002453 1003657 1005617 1008719 1013997 1022358 1033409 1045614 1057936 1070838 1085308 1101435 1118447
59700 1118447 1135675 1152759 1169174 1184309 1198084 1210982 1223381 1235208 1246335 1256907 1267096
59689 1267096 1276712 1285224 1292104 1297065 1300021 1300965 1300003 1297473 1293748 1288768 1281989 1273053 1262357 1250650
59675 1250650 1238280 1225296 1212187 1199871 1188865 1179020 1170266 1163057 1157720 1153891 1151092 1149653 1150548
59662 1150548 1154316 1160448 1167899 1176077 1185292 1196251 1209112 1223100 1237074 1250278 1262357 1272907
59650 1272907 1281368 1287150 1289414 1286956 1278958 1265924 1249308 1230119 1208441 1184420 1159029 1133478
59638 1133478 1108373 1083937 1060774 1039996 1022549 1008532 997071 986846 976959 967164 957107 945753
59626 945753 932270 917309 902508 888554 874577 859754 844666 830557 817963 806796 797219 789608
$$ packed form
59713A002071L82J204J960L102N278Q361J1051J2205J2322J2902J4470J6127J7012
59700A118447J7228J7084J6415J5135J3775J2898J2399J1827J1127J0572J0189
59689A267096R616Q512O880M961K956R44r62k530l725m980o779q936j0696j1707
59675A250650j2370j2984j3109j2316j1006r845q754p209n337l829k799j439Q95
59662A150548L768O132P451Q178R215J0959J2861J3988J3974J3204J2079J0550
59650A272907Q461N782K264k458p998j3034j6616j9189k1678k4021k5391k5551
59638A133478k5105k4436k3163k0778j7447j4017j1461j0225r887r795j0057j1354
59626I45753j3483j4961j4801j3954j3977j4823j5088j4109j2594j1167r577p611
$$ plain form
59614 789608 783809 779115 774957 771235 768090 765807 764846 765499 767413 769691 771566 772907 774168 775899 778179
59599 778179 780428 781936 782572 782802 783076 783525 784236 785338 786683 787892 788889 789964 791066 791509 790739 789080
59583 789080 787378 786129 785192 784131 782594 780489 777991 775257 772152 768515 764592 760807 757119 753169
59569 753169 749131 745823 743729 742472 741504 740769 740330 739875 739067 737995 736911 735882 735055 734857 735463 736397
59553 736397 737113 737747 738909 740947 743775 747180 750986 755107 759728 765290 772094 780150 789547 800587
59539 800587 813377 827683 843514 861448 881865 903922 925468 943807 956599 962672 962647 958770
59527 958770 953800 949789 947527 946588 945847 944410 942220 939536 936065 931232 925187 918611 911472 902911 892717
59512 892717 881961 871642 861601 851439 841633 832874 824890 816869 808730 801204 794951 790258 787322
$$ packed form
59614G89608n799m694m158l722l145k283r61O53J914K278J875J341J261J731K280
59599G78179K249J508O36K30K74M49P11J102J345J209R97J075J102M43p70j659
59583G89080j702j249r37j061j537k105k498k734l105l637l923l785l688l950
59569G53169m038l308k094j257r68p35m39m55q08j072j084j029q27j98O06R34
59553G36397P16O34J162K038K828L405L806M121M621N562O804Q056R397J1040
59539H00587J2790J4306J5831J7934K0417K2057K1546J8339J2792O073k5l877
59527I58770m970m011k262r39p41j437k190k684l471m833o045o576p139q561j0194
59512H92717j0756j0319j0041j0162r806q759p984q021q139p526o253m693k936
$$ plain form
59499 787322 786087 786052 786795 788498 791435 795320 799763 805015 811550 819148 827038 834765 842276 849346 855552
59484 855552 860747 864980 868135 870183 871614 873023 874386 875301 875811 876377 877122 877714 878027 878387 879063 879938
59468 879938 880757 881400 881857 882176 882455 882791 883353 884576 886981 890645 895157 900228 905938 912256 918881 925825
59452 925825 933496 941753 949520 955927 961248 966042 969888 971798 971482 969419 965970 961220 955514 949376
59438 949376 943024 936620 930863 926663 924332 923646 924480 926742 929876 933239 936997 942052 949123 958423 970071
59423 970071 984115 1000138 1017509 1036214 1056896 1079859 1104398 1129295 1153765 1177847 1202000
59412 1202000 1226424 1250810 1274736 1297742 1318286 1332938 1337939 1332295 1318730 1301279 1282749 1264832
59400 1264832 1249283 1237764 1231077 1229304 1231716 1235465 1235363 1226767 1208815 1184152 1156205 1127833 1101646
$$ packed form
59499G87322j235l5P43J703K937L885M443N252O535P598P890P727P511P070O206
59484H55552N195M233L155K048J431J409J363R15N10N66P45N92L13L60O76Q75
59468H79938Q19O43M57L19K79L36N62J223K405L664M512N071N710O318O625O944
59452I25825P671Q257P767O407N321M794L846J910l16k063l449m750n706o138
59438I49376o352o404n757m200k331o86Q34K262L134L363L758N055P071R300J1648
59423I70071J4044J6023J7371J8705K0682K2963K4539K4897K4470K4082K4153
59412A202000K4424K4386K3926K3006K0544J4652N001n644j3565j7451j8530j7917
59400A264832j5549j1519o687j773K412L749j02q596j7952k4663k7947k8372k6187
$$ plain form
59387 1101646 1079462 1061163 1045499 1032250 1022456 1016513 1013400 1012020 1012056 1013259 1015136 1017816 1022174
59374 1022174 1028489 1035750 1042685 1048848 1054468 1059996 1066134 1073614 1082601 1092725 1103662 1115139 1126545
59361 1126545 1137383 1148024 1159146 1170521 1181315 1191523 1201994 1213000 1223928 1234613 1245841
59350 1245841 1258190 1271365 1285002 1299134 1313522 1327483 1340728 1353439 1365169 1374639 1380987 1384254
59338 1384254 1384364 1380761 1373559 1363902 1352481 1338709 1322021 1303075 1282871 1261599 1239213 1216380
59326 1216380 1193930 1171950 1150237 1129135 1109173 1090313 1072231 1054948 1038573 1022907 1007865
59315 1007865 993829 981034 969117 957755 947151 937317 927571 917475 907729 899331 892370 886416
59303 886416 881597 878392 876727 876254 877312 880583 885815 891801 897904 904920 914206 926448 941542 959161
$$ packed form
59387A101646k2184j8299j5664j3249r794n943l113j380L6J203J877K680M358
59374A022174O315P261O935O163N620N528O138P480Q987J0124J0937J1477J1406
59361A126545J0838J0641J1122J1375J0794J0208J0471J1006J0928J0685J1228
59350A245841J2349J3175J3637J4132J4388J3961J3245J2711J1730R470O348L267
59338A384254J10l603p202r657j1421j3772j6688j8946k0204k1272k2386k2833
59326A216380k2450k1980k1713k1102j9962j8860j8082j7283j6375j5666j5042
59315A007865j4036j2795j1917j1362j0604r834r746j0096r746q398o961n954
59303H86416m819l205j665m73J058L271N232N986O103P016R286J2242J5094J7619
$$ plain form
59289 959161 978944 1000025 1020494 1037477 1048239 1051740 1049390 1044254 1039386 1036567 1036106 1037583 1040895
59276 1040895 1046694 1055785 1068255 1083409 1100332 1118187 1136207 1154034 1172086 1190980 1210541 1229819
59264 1229819 1248029 1264810 1279536 1291143 1298954 1303131 1304144 1302294 1297801 1290704 1280530 1266767
59252 1266767 1249903 1231383 1212444 1193635 1175511 1158823 1143689 1129509 1116148 1104402 1094778
59241 1094778 1086647 1079129 1072093 1065677 1059610 1053665 1048175 1043358 1038714 1033740 1028686 1023881 1018823 1012763
59227 1012763 1005850 998954 992553 986408 980190 973951 968075 963082 959243 956251 953643 951664 951085 951956
59213 951956 953358 954792 956971 960561 964840 968324 970197 970524 969726 968610 968300 969110 969823 968894 966217 963053
59197 963053 960516 958800 957579 956479 955290 954250 953879 954157 954336 954051 953973 954658 955329 954744 952795 950321
$$ packed form
59289I59161J9783K1081K0469J6983J0762L501k350n136m868k819m61J477L312
59276A040895N799R091J2470J5154J6923J7855J8020J7827J8052J8894J9561J9278
59264A229819J8210J6781J4726J1607P811M177J013j850m493p097j0174j3763
59252A266767j6864j8520j8939j8809j8124j6688j5134j4180j3361j1746r624
59241A094778q131p518p036o416o067n945n490m817m644m974n054m805n058o060
59227A012763o913o896o401o145o218o239n876m993l839k992k608j979n79Q71
59213I51956J402J434K179L590M279L484J873L27p98j116l10Q10P13r29k677l164
59197I63053k537j716j221j100j189j040l71K78J79k85p8O85O71n85j949k474
$$ plain form
59181 950321 947607 944137 939690 934708 929565 924282 919028 914120 909475 904799 900395 897117 895325 894483
59167 894483 893907 893421 893084 892766 892227 891365 890222 888906 887499 885955 884148 882001 879280 875238 869123 861344
59151 861344 853570 847187 842057 837264 832445 827705 822739 816969 810379 803480 796510 789381 782304 775807
59137 775807 770099 764950 760182 755870 752167 749410 748217 748996 751441 754954 759353 764713 770790 777288
59123 777288 784569 793451 804189 816189 828852 842329 857316 874214 892438 910523 927217 942638
59111 942638 957889 973323 987763 999873 1009605 1017594 1023733 1027282 1028099 1026846 1024034 1019672 1013825
59098 1013825 1006791 998707 989616 980003 970747 962428 955111 948760 943423 939043 935545 933012 931364 929945
59084 929945 927883 924833 921042 916787 912107 906987 901482 895779 890306 885480 881170 876865 872618 869218
$$ packed form
59181I50321k714l470m447m982n143n283n254m908m645m676m404l278j792q42
59167H94483n76m86l37l18n39q62j143j316j407j544j807k147k721m042o115p779
59151H61344p774o383n130m793m819m740m966n770o590o899o970p129p077o497
59137G75807n708n149m768m312l703k757j193P79K445L513M399N360O077O498
59123G77288P281Q882J0738J2000J2663J3477J4987J6898J8224J8085J6694J5421
59111I42638J5251J5434J4440J2110R732P989O139L549Q17j253k812m362n847
59098A013825p034q084r091r613r256q319p317o351n337m380l498k533j648j419
59084I29945k062l050l791m255m680n120n505n703n473m826m310m305m247l400
$$ plain form
59070 869218 866961 864962 862303 859249 856498 853791 850188 845380 839820 833887 827886 822567 818577 815434
59056 815434 812044 808233 804863 802431 800564 798990 798022 797769 797749 797688 798023 799214 801021 802791 804034 804509
59040 804509 804191 803389 802585 802011 801593 801246 800943 800615 800414 800964 802886 806188 810613 816417 824199 833991 845141
59023 845141 857130 869956 883557 897293 910103 920913 928953 934063 936668 937174 935565 931893 926834
59010 926834 921316 915829 910548 905888 902378 900203 899327 899830 901641 904337 907788 912613 919271 926955 934115
58995 934115 939876 944293 947562 949814 951476 952940 953962 954136 953824 953860 954474 955395 956900 959835 964629 971132
58979 971132 979467 990058 1002641 1016135 1029815 1043975 1059169 1075332 1091895 1108310 1124343 1140146
58967 1140146 1155962 1171364 1185074 1196070 1204583 1211452 1216854 1220435 1222203 1222298 1220074 1214477 1205303
$$ packed form
59070H69218k257j999k659l054k751k707l603m808n560n933o001n319l990l143
59056H15434l390l811l370k432j867j574r68k53k0o1L35J191J807J770J243M75
59040H04509l18q02q04n74m18l47l03l28k01N50J922L302M425N804P782R792J1150
59023H45141J1989J2826J3601J3736J2810J0810Q040N110K605N06j609l672n059
59010I26834n518n487n281m660l510k175q76N03J811K696L451M825O658P684P160
58995I34115N761M417L269K252J662J464J022J74l12L6O14R21J505K935M794O503
58979I71132Q335J0591J2583J3494J3680J4160J5194J6163J6563J6415J6033J5803
58967A140146J5816J5402J3710J0996Q513O869N402L581J768R5k224n597r174
$$ plain form
58954 1205303 1193171 1178432 1161097 1141727 1121255 1099924 1077582 1055146 1034497 1016496 1000203
58943 1000203 984557 969917 957406 947562 940237 935182 932164 930859 930963 932091 933499 934423 934770 934933
58929 934933 934869 933946 931746 928444 924456 920310 916773 914344 912669 911170 910111 910215 911387 912769 913993
58914 913993 915376 916894 918179 919684 922729 928004 934961 942972 952168 962801 974690 987579 1001347
58901 1001347 1015706 1030551 1046661 1065037 1085409 1106405 1127315 1148530 1170130 1191417 1212268
58890 1212268 1233678 1256381 1280124 1304782 1330811 1357794 1383717 1406652 1426271 1442944 1456402
58879 1456402 1466277 1473085 1477601 1479810 1479374 1476542 1471767 1464988 1456137 1445912 1435223 1424248 1412679
58866 1412679 1400487 1387816 1374501 1360268 1345072 1328855 1311436 1293078 1274546 1256160 1237374
$$ packed form
58954A205303j2132j4739j7335j9370k0472k1331k2342k2436k0649j8001j6293
58943A000203j5646j4640j2511r844p325n055l018j305J04J128J408R24L47J63
58929I34933o4r23k200l302l988m146l537k429j675j499j059J04J172J382J224
58914I13993J383J518J285J505L045N275O957Q011R196J0633J1889J2889J3768
58901A001347J4359J4845J6110J8376K0372K0996K0910K1215K1600K1287K0851
58890A212268K1410K2703K3743K4658K6029K6983K5923K2935J9619J6673J3458
58879A456402R875O808M516K209m36k832m775o779q851j0225j0689j0975j1569
58866A412679j2192j2671j3315j4233j5196j6217j7419j8358j8532j8386j8786
$$ plain form
58855 1237374 1217814 1198094 1179016 1160577 1142436 1124850 1108337 1092731 1077203 1061069 1044165
58844 1044165 1026668 1008914 991182 973451 955749 938803 923837 911460 901267 892617 885145 878438
58832 878438 872061 866215 861631 858497 856243 854663 854366 855727 858299 861684 866071 871331 876551 881161
58818 881161 885769 891106 896847 902105 906493 910022 912533 913932 914474 914332 913357 911730 910168 909005 907647
58803 907647 905370 901972 897331 891221 884126 877335 871531 866117 860573 855644 852364 850701 849981 850016 851040
58788 851040 853152 856629 862198 870240 880190 891371 903822 917665 932343 947211 962203 977183
58776 977183 991198 1003153 1012672 1019675 1023682 1024172 1020946 1013614 1001598 985439 967249 948995 931030
58763 931030 913128 896071 881050 868105 856374 845555 836155 828523 822495 817725 813773 810236 807311
$$ packed form
58855A237374j9560j9720j9078j8439j8141j7586j6513j5606j5528j6134j6904
58844A044165j7497j7754j7732j7731j7702j6946j4966j2377j0193q650p472o707
58832H78438o377n846m584l134k254j580k97J361K572L385M387N260N220M610
58818H81161M608N337N741N258M388L529K511J399N42j42r75j627j562j163j358
58803I07647k277l398m641o110p095o791n804n414n544m929l280j663p20L5J024
58788H51040K112L477N569Q042R950J1181J2451J3843J4678J4868J4992J4980
58776I77183J4015J1955R519P003M007M90l226p332j2016j6159j8190j8254j7965
58763I31030j7902j7057j5021j2945j1731j0819r400p632o028m770l952l537k925
$$ plain form
58750 807311 805673 805350 805498 805850 807446 811137 816379 822394 829578 838591 848894 859432 870014 880802
58736 880802 891161 900430 909298 919005 929517 939742 949152 957873 965534 971504 976181 980761 985657
58723 985657 990259 994300 998411 1003249 1008908 1015232 1022026 1029007 1036205 1044082 1052551 1060284 1065731 1068392
58709 1068392 1068282 1064761 1057018 1045260 1030272 1012173 990721 966536 940828 914164 886713 859484
58697 859484 833991 810681 788860 768226 749402 732885 718522 706110 695590 686587 678682 672180
58685 672180 667633 664554 661537 657804 653832 650379 647705 645776 644427 643246 642041 641436 642256 644330 646747
58670 646747 649312 652899 658238 665205 673572 683710 696113 710605 726220 741525 754903 764758 769685
58657 769685 768684 761730 750282 736730 722922 709487 696617 684704 673939 664157 655536 648668
$$ packed form
58750H07311j638l23J48L52J596L691N242O015P184R013J0303J0538J0582J0788
58736H80802J0359R269Q868R707J0512J0225R410Q721P661N970M677M580M896
58723I85657M602M041M111M838N659O324O794O981P198P877Q469P733N447K661
58709A068392j10l521p743j1758j4988j8099k1452k4185k5708k6664k7451k7229
58697H59484k5493k3310k1821k0634j8824j6517j4363j2412j0520r003p905o502
58685F72180m547l079l017l733l972l453k674j929j349j181j205o05Q20K074K417
58670F46747K565L587N339O967Q367J0138J2403J4492J5615J5305J3378R855M927
58657G69685j001o954j1448j3552j3808j3435j2870j1913j0765r782q621o868
$$ plain form
58645 648668 643393 638570 633631 629393 626589 624701 623257 623080 624927 627780 629962 631224 632345 633375
58631 633375 633797 633854 634068 633814 631959 628782 625785 623761 622361 621381 621072 621315 621887 623454 626962 632067
58615 632067 637532 643104 649640 657295 664903 671368 676586 680968 685116 689888 695585 701077 704955 707497
58601 707497 710276 713872 717334 719994 722388 725040 727584 729584 731319 733405 736431 741156 748246 757633
58587 757633 768777 781562 796220 812489 829642 847173 864675 881245 895957 908757 920110
58576 920110 930108 938761 946672 954396 961630 968298 976013 987066 1002206 1020747 1042576 1068560 1098938
58563 1098938 1132644 1168360 1205065 1241501 1276099 1307419 1333834 1353219 1364128 1367041 1363514 1354667
58551 1354667 1341688 1326967 1312898 1299824 1286763 1273771 1261855 1250762 1238740 1224479 1207624
$$ packed form
58645F48668n275m823m939m238k804j888j444j77J847K853K182J262J121J030
58631F33375M22N7K14k54j855l177k997k024j400r80l09K43N72J567L508N105
58615F32067N465N572O536P655P608O465N218M382M148M772N697N492L878K542
58601G07497K779L596L462K660K394K652K544K000J735K086L026M725P090R387
58587G57633J1144J2785J4658J6269J7153J7531J7502J6570J4712J2800J1353
58576I20110R998Q653P911P724P234O668P715J1053J5140J8541K1829K5984L0378
58563A098938L3706L5716L6705L6436L4598L1320K6415J9385J0909K913l527q847
58551A354667j2979j4721j4069j3074j3061j2992j1916j1093j2022j4261j6855
$$ plain form
58540 1207624 1187469 1163002 1134499 1103478 1070972 1037366 1003916 972668 944544 919016 895794
58529 895794 875349 857665 842039 828280 816660 806636 797186 788461 781542 776514 772335 768579 765635
58516 765635 763200 760376 757317 755044 753616 752298 751476 752291 754225 755226 754605 753763 753692 753788 753662 754013 755050
58499 755050 755948 756491 757466 758895 759814 760333 761972 765333 769423 773945 780200 788905 799097 810123 822808
58484 822808 837702 853982 871194 890404 912565 937152 963165 989885 1015823 1038504 1056119
58473 1056119 1068096 1073734 1072126 1064005 1051684 1036498 1018331 998340 979815 965094 953603 944198
58461 944198 937575 935072 936806 942322 951543 963865 977827 992763 1009252 1026969 1043680 1057276
58449 1057276 1067038 1072015 1070234 1060980 1046196 1028311 1008251 986705 965468 946028 928358 912537
$$ packed form
58540A207624k0155k4467k8503l1021l2506l3606l3450l1248k8124k5528k3222
58529H95794k0445j7684j5626j3759j1620j0024r450q725o919n028m179l756k944
58516G65635k435k824l059k273j428j318q22Q15J934J001o21q42p1R6j26L51J037
58499G55050Q98N43R75J429R19N19J639L361M090M522O255Q705J0192J1026J2685
58484H22808J4894J6280J7212J9210K2161K4587K6013K6720K5938K2681J7615
58473A056119J1977N638j608q121j2321j5186j8167j9991j8525j4721j1491r405
58461I44198o623k503J734N516R221J2322J3962J4936J6489J7717J6711J3596
58449A057276R762M977j781r254j4784j7885k0060k1546k1237j9440j7670j5821
$$ plain form
58437 912537 900017 891861 887093 884183 882869 883320 884913 887189 890761 896129 902810 910594 920226 931740
58423 931740 943500 953859 962378 968546 970961 968979 963678 956151 946337 934478 922108 910483 899503
58410 899503 889094 880005 872313 864822 856902 849334 842611 836275 830639 827038 825504 824406 823360 824120
58396 824120 827453 831618 835289 839482 845017 850488 854482 857607 860662 863023 864528 866647 869988 872852
58382 872852 874144 875483 878521 882400 885914 889992 895806 902416 908540 914917 922849 932088 942042 953277
58368 953277 966033 979150 992180 1006497 1022589 1038488 1052758 1066676 1081441 1095663 1107785
58357 1107785 1118548 1128684 1136515 1140421 1141534 1141618 1140441 1137673 1135068 1134152 1133928 1133398 1134140 1137823 1143427
58342 1143427 1149640 1157715 1169214 1183163 1198203 1215221 1234945 1255245 1273865 1291629 1309999 1327715
$$ packed form
58437I12537j2520q156m768k910j314M51J593K276L572N368O681P784R632J1514
58423I31740J1760J0359Q519O168K415j982n301p527r814j1859j2370j1625j0980
58410H99503j0409r089p692p491p920p568o723o336n636l601j534j098j046P60
58396H24120L333M165L671M193N535N471L994L125L055K361J505K119L341K864
58382H72852J292J339L038L879L514M078N814O610O124O377P932R239R954J1235
58368I53277J2756J3117J3030J4317J6092J5899J4270J3918J4765J4222J2122
58357A107785J0763J0136P831L906J113Q4j177k768k605r16k24n30P42L683N604
58342A143427O213Q075J1499J3949J5040J7018J9724K0300J8620J7764J8370J7716
$$ plain form
58330 1327715 1342914 1356180 1368351 1377708 1382745 1385383 1387996 1389569 1388440 1386465 1386567 1388212 1389298
58317 1389298 1390572 1394181 1399630 1405155 1411530 1420575 1431410 1441998 1452871 1465591 1479111 1491417
58305 1491417 1503258 1516587 1530908 1544849 1559565 1576662 1594443 1610122 1624286 1639527 1656366
58294 1656366 1674141 1693865 1716262 1739047 1760137 1781592 1806356 1833373 1860164 1887811 1918758
58283 1918758 1951978 1985123 2019382 2057305 2097827 2138464 2180590 2227790 2280958 2339689 2405646
58272 2405646 2478727 2552028 2616669 2670505 2717378 2760318 2801229 2844741 2895401 2952032 3010521
58261 3010521 3070755 3135218 3202761 3269790 3335891 3402448 3467738 3529640 3591140 3656871 3726347
58250 3726347 3796990 3871281 3953910 4044251 4138883 4239209 4349114 4467428 4590456 4719607
$$ packed form
58330A327715J5199J3266J2171R357N037K638K613J573j129j975J02J645J086
58317A389298J274L609N449N525O375R045J0835J0588J0873J2720J3520J2306
58305A491417J1841J3329J4321J3941J4716J7097J7781J5679J4164J5241J6839
58294A656366J7775J9724K2397K2785K1090K1455K4764K7017K6791K7647L0947
58283A918758L3220L3145L4259L7923M0522M0637M2126M7200N3168N8731O5957
58272B405646P3081P3301O4641N3836M6873M2940M0911M3512N0660N6631N8489
58261C010521O0234O4463O7543O7029O6101O6557O5290O1902O1500O5731O9476
58250C726347P0643P4291Q2629R0341R4632J00326J09905J18314J23028J29151
$$ plain form
58240 4719607 4858605 5005535 5156049 5312138 5479252 5657108 5842093 6036269 6244806
58231 6244806 6467041 6699582 6945731 7211993 7497906 7799547 8120276 8467244 8840285
58222 8840285 9235684 9658002 10116366 10612334 11144067 11719047 12349125 13036416 13778670
58213 13778670 14585456 15474195 16454148 17531052 18724369 20063046 21568726 23262945
58205 23262945 25188545 27405872 29974802 32965580 36484943 40666549 45636747 51513093
58197 51513093 58432025 66552966 76046468 87116092 100028845 115089406 132597387
58190 132597387 152884851 176400156 203693565 235239990 271084417 310204332 349666463
58183 349666463 384288652 407757569 415134568 405169660 380678673 346856697 309034624
$$ packed form
58240D719607J38998J46930J50514J56089J67114J77856J84985J94176K08537
58231F244806K22235K32541K46149K66262K85913L01641L20729L46968L73041
58222H840285L95399M22318M58364M95968N31733N74980O30078O87291P42254
58213A3778670Q06786Q88739R79953J076904J193317J338677J505680J694219
58205B3262945J925600K217327K568930K990778L519363M181606M970198N876346
58197E1513093O918932Q120941R493502J1069624J2912753J5060561J7507981
58190A32597387K0287464K3515305K7293409L1546425L5844427L9119915L9462131
58183C49666463L4622189K3468917P376999r964908k4490987l3821976l7822073
$$ plain form
58176 309034624 271338101 236448625 205842741 180054441 158902554 141693797 127396669
58169 127396669 114874883 103225334 92037471 81355675 71411425 62397424 54410939
58162 54410939 47471228 41523864 36458914 32158379 28520706 25445623 22829370 20587616
58154 20587616 18663260 17006169 15564982 14302775 13200113 12236070 11382051 10617390
58146 10617390 9933946 9321057 8760986 8242696 7765754 7327331 6918663 6536947 6187365
58137 6187365 5870237 5578186 5308199 5064241 4845387 4643108 4452997 4277959 4117132
58128 4117132 3962537 3809731 3661916 3520908 3383704 3250394 3125954 3011471 2902412
58119 2902412 2797741 2701803 2614891 2530946 2447337 2368512 2297205 2230177 2165478 2105963 2052461
$$ packed form
58176C09034624l7696523l4889476l0605884k5788300k1151887j7208757j4297128
58169A27396669j2521786j1649549j1187863j0681796r944250r014001p986485
58162E4410939o939711n947364n064950m300535l637673l075083k616253k241754
58154B0587616j924356j657091j441187j262207j102662r64043q54019p64661
58146A0617390o83444o12889n60071n18290m76942m38423m08668l81716l49582
58137F187365l17128k92051k69987k43958k18854k02279j90111j75038j60827
58128D117132j54595j52806j47815j41008j37204j33310j24440j14483j09059
58119B902412j04671r5938q6912q3945q3609p8825p1307o7028o4699n9515n3502
$$ plain form
58108 2052461 2000788 1948597 1898377 1850886 1802267 1750434 1698059 1646685 1594022 1539439 1486078
58097 1486078 1435436 1386139 1340550 1306262 1287919 1282644 1285588 1294239 1305051 1312097 1312599 1309145 1303924
58084 1303924 1295588 1284057 1272995 1264464 1255728 1244192 1231157 1218041 1203255 1185671 1167265 1149616
58072 1149616 1131375 1111607 1092128 1074294 1056838 1038893 1021785 1005981 989719 972483 956440
58061 956440 942744 929836 916908 905446 895684 885249 873134 861445 851370 840971 828871 816622
58049 816622 805528 794534 783290 773900 767414 761733 755150 748962 744428 740057 734159 727488 721208
58036 721208 714697 707287 699966 693583 687503 681416 676159 671494 665552 657791 650000 643226 636311 628659
58022 628659 621663 616101 610843 605447 601223 598410 595219 591063 587871 586667 585787 584001 582440 581685 580023
$$ packed form
58108B052461n1673n2191n0220m7491m8619n1833n2375n1374n2663n4583n3361
58097A486078n0642m9297m5589l4288j8343n275K944Q651J0812P046N02l454n221
58084A303924q336j1531j1062q531q736j1536j3035j3116j4786j7584j8406j7649
58072A149616j8241j9768j9479j7834j7456j7945j7108j5804j6262j7236j6043
58061I56440j3696j2908j2928j1462r762j0435j2115j1689j0075j0399j2100j2249
58049H16622j1094j0994j1244r390o486n681o583o188m534m371n898o671o280
58036G21208o511p410p321o383o080o087n257m665n942p761p791o774o915p652
58022F28659o996n562n258n396m224k813l191m156l192j204q80j786j561p55j662
$$ plain form
58007 580023 576618 573567 572644 572549 571521 570249 570009 570223 570066 570469 572392 574972 577229 579744 582968 585752
57991 585752 587254 588362 589684 590147 589139 587939 587393 586295 583744 580957 578995 576864 573707 570819 569548
57976 569548 569213 568971 569757 572343 575418 577691 580118 583952 588192 591042 592415 593011 592344 589651 585456
57961 585456 580477 574303 566892 559910 554731 550331 544895 538332 531636 525073 518609 512923 508450 504589
57947 504589 501135 499147 499142 499996 500997 503244 507511 512541 517252 522899 531107 541248 551752 562568
57933 562568 574280 586069 596593 605800 613947 619852 622052 620763 617005 610797 601934 591479 580688
57920 580688 569357 556927 544276 532718 522218 512293 503759 497818 494207 491902 490809 491152 492072
57907 492072 492452 492392 492356 491753 489889 487406 485154 482551 478693 474222 470339 466755 462436 457751 454180 452328
$$ packed form
58007E80023l405l051r23r5j028j272k40K14j57M03J923K580K257K515L224K784
57991E85752J502J108J322M63j008j200n46j098k551k787j962k131l157k888j271
57976E69548l35k42P86K586L075K273K427L834M240K850J373N96o67k693m195
57961E85456m979o174p411o982n179m400n436o563o696o563o464n686m473l861
57947E04589l454j988nQ54J001K247M267N030M711N647Q208J0141J0504J0816
57933E62568J1712J1789J0524R207Q147N905K200j289l758o208q863j0455j0791
57920E80688j1331j2430j2651j1558j0500r925q534n941l611k305j093L43R20
57907D92072L80o0l6o03j864k483k252k603l858m471l883l584m319m685l571j852
$$ plain form
57891 452328 451711 451998 453044 454296 455519 457501 460739 464209 466727 468629 470638 472031 471710 470314 469458
57876 469458 469349 468866 467621 466320 465455 465146 466017 468777 473079 478003 483344 489419 496107 503214 511220
57861 511220 520468 530118 539045 547161 554856 561917 568187 574401 581002 586888 590705 592662 593650 593382 590987
57846 590987 586796 581902 576430 569808 562337 554976 547940 540943 534434 529174 524922 520938 517435 515156
57832 515156 513892 512803 511922 512008 513141 514814 517102 520474 524551 528284 531216 533665 535899 538054 540407
57817 540407 542827 544505 545182 545881 547406 548956 549439 549274 549516 550050 550196 550300 550893 550798 547953 541954 534204
57800 534204 525837 517051 508300 500496 493942 488344 483813 480703 478673 477110 476169 476232 476716 476699 476321 476288
57784 476288 476507 476600 477284 479604 483146 486562 489614 493081 496856 499854 501807 503616 505739 507552 508400
$$ packed form
57891D52328o17K87J046J252J223J982L238L470K518J902K009J393l21j396q56
57876D69458j09m83j245j301q65l09Q71K760M302M924N341O075O688P107Q006
57861E11220R248R650Q927Q116P695P061O270O214O601N886L817J957R88k68k395
57846E90987m191m894n472o622p471p361p036o997o509n260m252l984l503k279
57832E15156j264j089q81Q6J133J673K288L372M077L733K932K449K234K155K353
57817E40407K420J678O77O99J525J550M83j65K42N34J46J04N93r5k845n999p750
57800E34204q367q786q751p804o554n598m531l110k030j563r41O3M84j7l78l3
57784D76288K19R3O84K320L542L416L052L467L775K998J953J809K123J813Q48
$$ plain form
57769 508400 508079 506308 502858 498147 492693 486335 479082 472155 466770 462421 457843 453187 449540 446777
57755 446777 443819 440828 439198 439343 440320 441705 443960 446796 449130 451152 454595 460283 466898 472774 477576
57740 477576 481704 485417 489192 493796 499303 504867 509808 514102 517747 520657 523292 526341 529650 532474
57726 532474 534719 536863 538719 539505 539102 538037 536373 533941 531459 529873 528695 526580 523577 521101 519558
57711 519558 517816 515346 513048 511430 509666 507176 504584 502423 500299 498035 496311 495506 495197 495374 496831
57696 496831 499674 502711 505077 507283 510036 513188 516446 519926 523280 525562 526686 527909 530174 533156
57682 533156 536664 541728 549381 559416 571270 585235 601934 621494 644089 670566 701810 738229
57670 738229 780445 829664 886841 952475 1027700 1114003 1209999 1308266 1395819 1457875 1482491
$$ packed form
57769E08400l21j771l450m711n454o358p253o927n385m349m578m656l647k763
57755D46777k958k991j630J45R77J385K255K836K334K022L443N688O615N876M802
57740D77576M128L713L775M604N507N564M941M294L645K910K635L049L309K824
57726E32474K245K144J856P86m03j065j664k432k482j586j178k115l003k476j543
57711E19558j742k470k298j618j764k490k592k161k124k264j724q05l09J77J457
57696D96831K843L037K366K206K753L152L258L480L354K282J124J223K265K982
57682E33156L508N064P653J0035J1854J3965J6699J9560K2595K6477L1244L6419
57670G38229M2216M9219N7177O5634P5225Q6303R5996R8267Q7553O2056K4616
$$ plain form
57659 1482491 1464673 1408494 1325112 1227486 1126038 1028052 938701 861039 795666 741559 697154
57648 697154 660573 629960 604464 584217 568777 556401 545459 535675 527244 519636 512143 504870
57636 504870 498209 491902 485500 479279 473962 469880 466934 464877 463105 460787 457824 455144 453470 452325
57622 452325 450742 448433 445715 442901 440283 438172 436435 434552 432514 431028 430406 430012 429239 428288 427434
57607 427434 426382 425014 424019 424007 424598 425080 425386 425773 426103 426163 426236 426727 427573 428411 428904 428604 427193 425231
57589 425231 423948 423850 424211 424283 424160 424028 423586 422779 422164 421807 420791 418589 415949 413556 410763 406756 402126
57572 402126 398058 394665 391311 388055 385434 383111 380075 376156 372313 369333 367082 365114 363289 361626
57558 361626 360091 358679 357486 356773 357031 358549 360781 362723 364201 366118 369105 372758 376732 381570 387607
$$ packed form
57659A482491j7818n6179q3382r7626j01448r7986q9351p7662o5373n4107m4405
57648F97154l6581l0613k5496k0247j5440j2376j0942r784q431p608p493p273
57636E04870o661o307o402o221n317m082k946k057j772k318k963k680j674j145
57622D52325j583k309k718k814k618k111j737j883k038j486o22l94p73r51q54
57607D27434j052j368r95j2N91M82L06L87L30O0P3M91Q46Q38M93l00j411j962
57589D25231j283r8L61P2j23j32m42q07o15l57j016k202k640k393k793m007m630
57572D02126m068l393l354l256k621k323l036l919l843k980k251j968j825j663
57558C61626j535j412j193p13K58J518K232J942J478J917K987L653L974M838O037
$$ plain form
57543 387607 393806 398696 401935 404065 405293 405523 405177 404909 404701 404119 403235 402506 401900 400927 399413 397601
57527 397601 395710 394027 393125 393334 394181 394910 395313 395571 395761 396079 397066 398899 400899 402478 404132 406720
57511 406720 410116 413425 416191 418589 420712 422566 424539 427038 429780 432095 433714 434686 434950 434779 435164
57496 435164 436796 438933 440197 440227 439642 438734 437413 436203 435959 436393 436084 434306 431861 429686 427579 424860
57480 424860 421590 418524 416287 415041 414582 414359 413697 412367 410785 409455 408388 407183 405462 403144 400481
57465 400481 397918 395867 394573 394158 394527 395193 395549 395567 395874 396932 398488 400125 401922 404160 406713 409200
57449 409200 411411 413188 414275 414781 415461 416997 419274 421796 424446 427288 430026 432356 434635 437553 441279
57434 441279 445471 449870 454329 458460 461945 465040 468175 471204 473598 475222 476288 476693 476082 474600 473032
$$ packed form
57543C87607O199M890L239K130J228K30l46k68k08n82q84p29o06r73j514j812
57527C97601j891j683r02K09Q47P29M03K58J90L18R87J833K000J579J654K588
57511D06720L396L309K766K398K123J854J973K499K742K315J619R72K64j71L85
57496D35164J632K137J264L0n85r08j321j210k44M34l09j778k445k175k107k719
57480D24860l270l066k237j246m59k23o62j330j582j330j067j205j721k318k663
57465D00481k563k051j294m15L69O66L56J8L07J058J556J637J797K238K553K487
57449D09200K211J777J087N06O80J536K277K522K650K842K738K330K279K918L726
57434D41279M192M399M459M131L485L095L135L029K394J624J066M05o11j482j568
$$ plain form
57419 473032 472135 472155 472851 473658 474011 473944 474164 475225 477000 479338 482666 487332 492816 498342 503796 509147
57403 509147 513384 515175 514530 512869 511436 510592 510643 512223 515376 519086 522288 524899 527490 530361 533283
57388 533283 535919 538266 540847 544447 549368 554983 560348 565203 570048 575312 580810 585986 590340 593720
57374 593720 596467 599191 602169 605123 607781 610265 612608 614421 615561 616746 618862 622017 625849 630348
57360 630348 635561 640827 645292 649058 653062 657852 663301 669454 676714 685014 693585 701779 709602 717316
57346 717316 725090 733120 741475 749727 757247 763943 770259 776477 782558 788583 794659 800423 805372 809830
57332 809830 814905 821258 828519 836034 843568 851032 858141 864736 871127 877790 884991 892773 901057 909670
57318 909670 918561 927973 938105 948755 959678 971165 983683 997013 1010326 1023204 1036098 1049638
$$ packed form
57419D73032q97K0O96Q07L53o7K20J061J775K338L328M666N484N526N454N351
57403E09147M237J791o45j661j433q44N1J580L153L710L202K611K591K871K922
57388E33283K636K347K581L600M921N615N365M855M845N264N498N176M354L380
57374E93720K747K724K978K954K658K484K343J813J140J185K116L155L832M499
57360F30348N213N266M465L766M004M790N449O153P260Q300Q571Q194P823P714
57346G17316P774Q030Q355Q252P520O696O316O218O081O025O076N764M949M458
57332H09830N075O353P261P515P534P464P109O595O391O663P201P782Q284Q613
57318I09670Q891R412J0132J0650J0923J1487J2518J3330J3313J2878J2894J3540
$$ plain form
57306 1049638 1063950 1078744 1093759 1108967 1124619 1141060 1158349 1176174 1194384 1213238 1232803
57295 1232803 1252516 1271942 1291633 1312479 1334478 1356894 1379438 1402478 1426200 1450386 1475009
57284 1475009 1500216 1525755 1551328 1577600 1605879 1636447 1668080 1699642 1731434 1764563 1799608
57273 1799608 1836463 1874937 1914975 1956503 1999401 2043360 2087657 2131563 2175349 2220526 2268727
57262 2268727 2320518 2375377 2432449 2491024 2550625 2611055 2672332 2734458 2797372 2861175 2926235
57251 2926235 2992961 3061554 3131937 3203833 3276964 3351307 3426983 3503821 3581243 3658724 3735979
57240 3735979 3812414 3886815 3958047 4025798 4090309 4151769 4210450 4266976 4321772 4374528 4424932
57229 4424932 4473709 4522371 4572173 4623970 4678782 4737736 4801535 4870623 4945570 5026477 5112235
$$ packed form
57306A049638J4312J4794J5015J5208J5652J6441J7289J7825J8210J8854J9565
57295A232803J9713J9426J9691K0846K1999K2416K2544K3040K3722K4186K4623
57284A475009K5207K5539K5573K6272K8279L0568L1633L1562L1792L3129L5045
57273A799608L6855L8474M0038M1528M2898M3959M4297M3906M3786M5177M8201
57262B268727N1791N4859N7072N8575N9601O0430O1277O2126O2914O3803O5060
57251B926235O6726O8593P0383P1896P3131P4343P5676P6838P7422P7481P7255
57240C735979P6435P4401P1232O7751O4511O1460N8681N6526N4796N2756N0404
57229D424932M8777M8662M9802N1797N4812N8954O3799O9088P4947Q0907Q5758
$$ plain form
57218 5112235 5201205 5292481 5385597 5479246 5571454 5661119 5748330 5833047 5914512 5992311 6067040
57207 6067040 6139470 6209930 6279056 6348424 6419797 6494106 6571546 6652202 6736136 6823195 6913180
57196 6913180 7006028 7101609 7199541 7299343 7400604 7503041 7606621 7711591 7818086 7925780
57186 7925780 8034170 8143050 8252352 8361790 8471048 8580023 8688363 8795161 8899785
57177 8899785 9002758 9105053 9206627 9306369 9403319 9497194 9587816 9674889 9758384 9838446 9914809
57166 9914809 9986771 10053452 10113308 10163586 10201340 10225296 10236187 10235388 10224087 10203893 10177292 10147010
57154 10147010 10115163 10083155 10052005 10022829 9997250 9977251 9964406 9959626 9963848 9978052 10001738
57143 10001738 10031924 10064357 10095155 10120513 10135839 10136669 10120284 10085607 10032393 9962010 9878609
$$ packed form
57218E112235Q8970R1276R3116R3649R2208Q9665Q7211Q4717Q1465P7799P4729
57207F067040P2430P0460O9126O9368P1373P4309P7440Q0656Q3934Q7059Q9985
57196F913180R2848R5581R7932R9802J01261J02437J03580J04970J06495J07694
57186G925780J08390J08880J09302J09438J09258J08975J08340J06798J04624
57177H899785J02973J02295J01574R9742R6950R3875R0622Q7073Q3495Q0062P6363
57166I914809P1962O6681N9856N0278L7754K3956J0891p99j1301k0194k6601l0282
57154A0147010l1847l2008l1150k9176k5579j9999j2845m780M222J4204K3686
57143A0001738L0186L2433L0798K5358J5326Q30j6385l4677n3214p0383q3401
$$ plain form
57132 9878609 9788110 9696263 9608748 9532091 9472112 9430988 9407008 9396784 9396011 9398398 9396449 9384774
57120 9384774 9362212 9331156 9296442 9264916 9244103 9239817 9254929 9289590 9341444 9406429 9481794
57109 9481794 9569244 9674736 9805954 9971399 10180953 10444959 10773028 11176186 11670985 12280717
57099 12280717 13033915 13964290 15111736 16520224 18233398 20292651 22737652 25605581
57091 25605581 28929992 32742217 37071276 41936908 47340508 53260828 59647324 66401017
57083 66401017 73354943 80278269 86901187 92930006 98043914 101908774 104236922 104864913
57075 104864913 103791840 101157282 97187241 92142542 86282692 79847702 73058557 66125848
57067 66125848 59248995 52602741 46325070 40515805 35239448 30525801 26372666 22754679
$$ packed form
57132I878609r0499r1847q7515p6657n9979m1124k3980j0224p73K387j949j1675
57120I384774k2562l1056l4714l1526k0813m286J5112L4661N1854O4985P5365
57109I481794Q7450J05492J31218J65445K09554K64006L28069M03158M94799O09732
57099A2280717P53198R30375J147446J408488J713174K059253K445001K867929
57091B5605581L324411L812225M329059M865632N403600N920320O386496O753693
57083F6401017O953926O923326O622918O028819N113908L864860K328148O27991
57075A04864913j073073k634558l970041n044699n859850o434990o789145o932709
57067F6125848o876853o646254o277671n809265n276357m713647m153135l617987
$$ plain form
57059 22754679 19633032 16960782 14686459 12758926 11130548 9756693 8595589 7611013
57051 7611013 6773910 6060227 5448607 4921139 4464346 4067647 3721676 3418740 3153258
57042 3153258 2920295 2714538 2531476 2368309 2222772 2092085 1973865 1867010 1770845 1684256
57032 1684256 1606217 1536213 1473570 1417314 1367144 1323625 1287091 1257411 1235063 1221217 1216445
57021 1216445 1220683 1235075 1262658 1306281 1365807 1436207 1506260 1559253 1578322 1554290 1489373
57010 1489373 1393983 1281188 1163372 1050539 948635 859300 781908 715505 658938 610803
57000 610803 570326 537480 511652 491256 475225 463724 456699 453007 451893 454197 461023 472052
56988 472052 486118 502679 521804 543401 567371 593823 622081 649760 673474 690180 697632 694575
$$ packed form
57059B2754679l121647k672250k274323j927533j628378j373855j161104r84576
57051G611013q37103p13683o11620n27468m56793l96699l45971l02936k65482
57042C153258k32963k05757j83062j63167j45537j30687j18220j06855r6165q6589
57032A684256p8039p0004o2643n6256n0170m3519l6534k9680k2348j3846m772
57021A216445M238J4392K7583M3623N9526P0400P0053N2993J9069k4032o4917
57010A489373r5390j12795j17816j12833j01904q9335p7392o6403n6567m8135
57000F10803m0477l2846k5828k0396j6031j1501p025l692j114K304O826J1029
56988D72052J4066J6561J9125K1597K3970K6452K8258K7679K3714J6706P452l057
$$ plain form
56976 694575 681542 661192 637125 612311 588589 566893 547471 530376 516107 505392 498253 493980
56964 493980 492133 492878 496244 501988 510443 522544 538669 558252 580601 604815 628338 646683 655488
56951 655488 652554 638047 614035 584325 553383 524269 497956 474853 455945 441906 432207 425963
56939 425963 422973 423330 426839 433494 443832 458253 476724 499631 528068 562429 601013 639959
56927 639959 673619 695074 698415 682336 651165 611615 568876 525933 485007 448018 415994 389094
56915 389094 367057 349139 334141 321260 310603 302441 296428 291910 288413 285461 282600 280025 278468
56902 278468 278102 278322 278926 280539 283468 287160 291390 296886 304002 311820 319474 327524 337192 349061 363464
56887 363464 381315 403468 429612 458357 487574 513871 532704 540418 536336 522647 502967 481294
$$ packed form
56976F94575j3033k0350k4067k4814k3722k1696j9422j7095j4269j0715p139m273
56964D93980j847P45L366N744Q455J2101J6125J9583K2349K4214K3523J8345Q805
56951F55488k934j4507k4012k9710l0942k9114k6313k3103j8908j4039r699o244
56939D25963k990L57L509O655J0338J4421J8471K2907K8437L4361L8584L8946
56927F39959L3660K1455L341j6079l1171l9550m2739m2943m0926l6989l2024k6900
56915C89094k2037j7918j4998j2881j0657q162o013m518l497k952k861k575j557
56902B78468l66K20O04J613K929L692M230N496P116P818P654Q050R668J1869J4403
56887C63464J7851K2153K6144K8745K9217K6297J8833P714m082j3689j9680k1673
$$ plain form
56875 481294 461048 443832 429567 418384 411595 410181 413510 420603 431803 448107 469729 496491
56863 496491 528966 568005 613762 666345 726612 794446 865772 931982 982519 1008480 1005783 976964
56851 976964 930002 874165 816491 761751 713839 675393 646679 626627 615052 612885 620654 638076
56839 638076 665073 702069 749308 806955 875952 957913 1053688 1161631 1275741 1384148 1470329
56828 1470329 1518543 1520280 1476983 1398184 1297634 1189276 1083763 987148 902506 831967 776471
56817 776471 734774 704593 684850 675784 677262 688481 709312 740591 782809 835578 898434 970605
56805 970605 1048788 1125161 1187987 1224880 1227352 1194471 1133055 1053907 967208 880538 799259 726925
56793 726925 665243 614558 574506 543959 521228 505309 496548 495320 500817 512122 529661 554231
$$ packed form
56875D81294k0246j7216j4265j1183o789j414L329P093J1200J6304K1622K6762
56863D96491L2475L9039M5757N2583O0267O7834P1326O6210N0537K5961k697k8819
56851I76964m6962n5837n7674n4740m7912l8446k8714k0052j1575k167P769J7422
56839F38076K6997L6996M7239N7647O8997Q1961R5775J07943J14110J08407Q6181
56828A470329M8214J737m3297p8799j00550j08358j05513r6615q4642p0539n5496
56817G76471m1697l0181j9743r066J478J1219K0831L1279M2218N2769O2856P2171
56805I70605P8183P6373O2826L6893K472l2881o1416p9148q6699q6670q1279p2334
56793G26925o1682n0685m0052l0547k2731j5919q761j228N497J1305J7539K4570
$$ plain form
56781 554231 585163 620713 659355 698622 732857 754313 757380 741064 707820 661884 608882 554849
56769 554849 504032 458035 417295 382331 353170 328791 307996 290260 275349 262797 252153
56758 252153 243179 235517 228738 222832 218008 213974 210084 206157 202423 198761 194924 191438 189213 188116
56744 188116 187012 185397 183963 183229 182630 181446 179777 178095 176554 175232 174467 174518 175266 176454 177887 179386
56728 179386 181054 183417 186670 189925 192028 193119 194494 196875 199692 202166 204245 206238 208311 210582
56714 210582 213087 215552 217696 219639 221384 222242 221699 220595 220331 221069 221823 222191 222671 223277 223336 222923 223044
56697 223044 223992 224868 225264 226046 227776 229628 230742 231598 233134 235346 237626 239740 241583 242709 242951 243016
56681 243016 243677 244755 245548 245872 246083 246403 246715 246714 245976 244310 242307 241025 240806 240900 240543 239810 239128 238521
$$ packed form
56781E54231L0932L5550L8642L9267L4235K1456L067j6316l3244m5936n3002n4033
56769E54849n0817m5997m0740l4964k9161k4379k0795j7736j4911j2552j0644
56758B52153q974p662o779n906m824m034l890l927l734l662l837l486k225j097
56744A88116j104j615j434p34n99j184j669j682j541j322p65N1P48J188J433J499
56728A79386J668K363L253L255K103J091J375K381K817K474K079J993K073K271
56714B10582K505K465K144J943J745Q58n43j104k64P38P54L68M80O06N9m13J21
56697B23044R48Q76L96P82J730J852J114Q56J536K212K280K114J843J126K42O5
56681B43016O61J078P93L24K11L20L12jp38j666k003j282k19R4l57p33o82o07
$$ plain form
56663 238521 237770 236860 235911 235029 234368 233926 233262 231980 230412 229150 228005 226432 224977 225123 227382 230569
56647 230569 233337 235427 237070 238294 239371 240838 242472 243229 242889 242660 243356 244025 243328 241409 239283 237198
56631 237198 234767 232155 229923 228003 225932 223916 222632 222068 221422 220196 218669 217267 216090 215139 214489
56616 214489 214146 214027 214115 214433 214927 215462 215769 215391 214075 212343 211271 211514 212909 214985 217247 218896 219077
56599 219077 217866 216405 215705 215833 216496 217661 219144 220346 221034 221864 223489 225603 227459 228877 230183
56584 230183 231487 232622 233538 234300 234911 235501 236389 237627 238789 239562 240291 241640 243962 247168 250844 254363
56568 254363 257321 260075 263455 267822 272883 278466 284823 292016 299777 308316 318513 330773 344103
56555 344103 356671 366859 373581 376280 375132 370966 364756 357437 350035 343306 337233 331507 326413 322361
$$ packed form
56663B38521p51r10r49q82o61m42o64j282j568j262j145j573j455J46K259L187
56647B30569K768K090J643J224J077J467J634P57l40k29O96O69o97j919k126k085
56631B37198k431k612k232j920k071k016j284n64o46j226j527j402j177r51o50
56616B14489l43j19Q8L18M94N35L07l78j316j732j072K43J395K076K262J649J81
56599B19077j211j461p00J28O63J165J483J202O88Q30J625K114J856J418J306
56584B30183J304J135R16P62O11N90Q88J238J162P73P29J349K322L206L676L519
56568B54363K958K754L380M367N061N583O357P193P761Q539J0197J2260J3330
56555C44103J2568J0188O722K699j148m166o210p319p402o729o073n726n094m052
$$ plain form
56541 322361 318743 314432 309567 305601 303286 301805 300259 298628 296695 293436 288444 282920 278295 274751
56527 274751 271905 269956 269099 268601 267518 265823 264114 262877 262657 264004 266316 267578 266327 263305 260315
56512 260315 258108 256285 254501 252683 250583 248112 245712 243630 241370 238673 236388 235442 235554 235835 236047
56497 236047 236331 236331 235674 234800 234378 234379 234607 235454 237136 238864 239868 240630 241899 243148 243406 243151 243840 245734
56479 245734 247570 248370 248356 248077 247768 247665 247918 248133 247852 247393 247410 247820 248100 248407 249324 250615 251353 251268 250913
56460 250913 250481 249556 248170 247069 246598 246253 245653 245222 245567 246720 248258 249693 250631 251015 251311 252101 253517
56443 253517 255363 257527 259838 261823 263140 264051 264973 265841 266432 266887 267329 267365 266669 265709 265151 264866 264229
56426 264229 263118 261821 260325 258511 256842 256022 256085 256492 256979 257661 258565 259724 261424 263702 265903 267404
$$ packed form
56541C22361l618m311m865l966k315j481j546j631j933l259m992n524m625l544
56527B74751k846j949q57m98j083j695j709j237k20J347K312J262j251l022k990
56512B60315k207j823j784j818k100k471k400k082k260k697k285r46J12K81K12
56497B36047K84%o57q74m22JK28Q47J682J728J004P62J269J249K58k55O89J894
56479B45734J836Q00j4k79l09j03K53K15k81m59J7M10K80L07R17J291P38q5l55
56460B50913m32r25j386j101m71l45o00m31L45J153J538J435R38L84K96P90J416
56443B53517J846K164K311J985J317R11R22Q68N91M55M42L6o96r60n58k85o37
56426B64229j111j297j496j814j669q20O3M07M87O82R04J159J700K278K201J501
$$ plain form
56410 267404 268444 269536 270390 270307 269309 268139 267343 267076 267493 268577 269813 270719 271445 272269 272952 273250 273588
56393 273588 274491 275862 277493 279682 282492 285083 286726 287879 289210 290207 289926 288627 287453 286914 286817 287306
56377 287306 288683 290510 291989 293043 294017 294761 295109 295717 297222 299022 300176 301043 302599 304574 305798
56362 305798 306100 306349 306816 307055 307248 308120 309581 311013 312808 315932 319881 322792 323936 324533 325722 327192
56346 327192 328311 329239 330322 331522 332957 335008 337493 339677 341380 343155 345207 347157 349034 351450
56332 351450 354633 358293 362523 367723 373443 378447 382145 385056 387774 390529 393738 397781 402057 405356
56318 405356 407246 408076 407709 405638 402466 399886 398827 398746 398992 399698 401086 402989 405330 408175 411267 414511
56302 414511 418734 424805 432125 439345 446405 454349 463203 471651 478982 485731 492260 498393 504733 512548
$$ packed form
56410B67404J040J092Q54q3r98j170p96k67M17J084J236R06P26Q24O83K98L38
56393B73588R03J371J631K189K810K591J643J153J331R97k81j299j174n39r7M89
56377B87306J377J827J479J054R74P44L48O08J505J800J154Q67J556J975J224
56362C05798L02K49M67K39J93Q72J461J432J795L124L949K911J144N97J189J470
56346C27192J119R28J083J200J435K051K485K184J703J775K052J950J877K416
56332C51450L183L660M230N200N720N004L698K911K718K755L209M043M276L299
56318D05356J890Q30l67k071l172k580j059q1K46P06J388J903K341K845L092L244
56302D14511M223O071P320P220P060P944Q854Q448P331O749O529O133O340P815
$$ plain form
56288 512548 521836 531117 539741 548840 559418 571013 582948 595483 608854 622356 635166 647147
56276 647147 658423 669188 680229 692471 705734 719182 733180 749285 768158 789006 811466
56265 811466 836449 864663 895904 930393 969234 1012890 1060800 1113214 1171948 1238531 1313055
56254 1313055 1395592 1487267 1589062 1700939 1822935 1955795 2099576 2252887 2414299 2583252
56244 2583252 2758682 2937865 3117358 3293964 3464054 3623098 3766652 3890903 3992003
56235 3992003 4066296 4111823 4128441 4116163 4074961 4006620 3915071 3804139 3676539 3535639 3386280
56224 3386280 3232703 3077166 2921459 2768119 2619103 2474850 2335792 2203395 2078721
56215 2078721 1961419 1851151 1748523 1653568 1564868 1481345 1403497 1331814 1265542 1204197 1148682
$$ packed form
56288E12548R288R281Q624R099J0578J1595J1935J2535J3371J3502J2810J1981
56276F47147J1276J0765J1041J2242J3263J3448J3998J6105J8873K0848K2460
56265H11466K4983K8214L1241L4489L8841M3656M7910N2414N8734O6583P4524
56254A313055Q2537R1675J01795J11877J21996J32860J43781J53311J61412J68953
56244B583252J75430J79183J79493J76606J70090J59044J43554J24251J01100
56235C992003P4293M5527J6618j2278m1202o8341r1549j10932j27600j40900j49359
56224C386280j53577j55537j55707j53340j49016j44253j39058j32397j24674
56215B078721j17302j10268j02628r4955q8700q3523p7848p1683o6272o1345n5515
$$ plain form
56204 1148682 1099503 1055309 1014600 977567 944786 915366 887912 862352 839411 819199 801557
56193 801557 786796 774844 764445 754302 744296 734876 726201 718602 712681 708113 703514 698296 693499
56180 693499 690198 688365 687841 688835 690748 692225 693203 695238 698974 703099 706734 710909 716599 723178 730031
56165 730031 737793 746843 756448 766625 778724 792858 806841 819223 831294 844478 857958 870714
56153 870714 883920 899277 916826 936337 959055 986031 1016474 1049844 1087985 1133201 1185901
56142 1185901 1246095 1315500 1395962 1487346 1589017 1701648 1825174 1956110 2088732 2217537
56132 2217537 2337063 2441721 2528664 2599796 2659135 2709707 2754299 2796143 2835620 2868042 2887676
56121 2887676 2892777 2884589 2863804 2831272 2790318 2744469 2693303 2633142 2560766 2474176 2371677
$$ packed form
56204A148682m9179m4194m0709l7033l2781k9420k7454k5560k2941k0212j7642
56193H01557j4761j1952j0399j0143j0006r420q675p599n921m568m599n218m797
56180F93499l301j833n24R94J913J477R78K035L736M125L635M175N690O579O853
56165G30031P762R050R605J0177J2099J4134J3983J2382J2071J3184J3480J2756
56153H70714J3206J5357J7549J9511K2718K6976L0443L3370L8141M5216N2700
56142A185901O0194O9405Q0462R1384J01671J12631J23526J30936J32622J28805
56132B217537J19526J04658Q6943P1132N9339N0572M4592M1844L9477L2422J9634
56121B887676N101q188k0785l2532m0954m5849n1166o0161p2376q6590j02499
$$ plain form
56110 2371677 2253910 2126113 1995471 1866850 1743321 1629100 1528395 1442062 1368390 1306541
56100 1306541 1256474 1216477 1183839 1157455 1137179 1121420 1108111 1097272 1089980 1085569 1082410 1080537
56088 1080537 1080886 1082881 1085339 1088764 1094126 1100501 1106558 1113188 1121982 1132339 1142883 1154305 1167928
56075 1167928 1182889 1197819 1213771 1232265 1251896 1270325 1288169 1307346 1326922 1344460 1360275
56064 1360275 1376462 1392628 1406495 1417951 1428773 1439004 1447317 1454294 1461833 1470096 1478487 1488572
56052 1488572 1502370 1518766 1535358 1552799 1573504 1597233 1621997 1648180 1677566 1709260 1740825
56041 1740825 1772600 1806712 1842840 1879227 1916935 1958879 2005852 2057758 2116980 2185050 2256752
56030 2256752 2322842 2378554 2425436 2466288 2503479 2540934 2581949 2625102 2667092 2708848 2754221
$$ packed form
56110B371677j17767j27797j30642j28621j23529j14221j00705q6333p3672o1849
56100A306541n0067l9997l2638k6384k0276j5759j3309j0839p292m411l159j873
56088A080537L49J995K458L425N362O375O057O630Q794J0357J0544J1422J3623
56075A167928J4961J4930J5952J8494J9631J8429J7844J9177J9576J7538J5815
56064A360275J6187J6166J3867J1456J0822J0231Q313O977P539Q263Q391J0085
56052A488572J3798J6396J6592J7441K0705K3729K4764K6183K9386L1694L1565
56041A740825L1775L4112L6128L6387L7708M1944M6973N1906N9222O8070P1702
56030B256752O6090N5712M6882M0852L7191L7455M1015M3153M1990M1756M5373
$$ plain form
56019 2754221 2804112 2857263 2915234 2980657 3051755 3124643 3199889 3280694 3366039 3452359 3540826
56008 3540826 3635961 3737936 3843324 3952545 4069174 4192591 4318997 4449294 4588307 4736596
55998 4736596 4890763 5051312 5222187 5403013 5590099 5784735 5992039 6212217 6441804
55989 6441804 6682927 6941986 7219864 7513219 7824786 8161844 8524952 8909302 9317146
55980 9317146 9757683 10234899 10747427 11300211 11903664 12561475 13272728 14046245 14898968
55971 14898968 15840607 16875497 18019997 19302056 20744053 22364919 24201209 26308791
55963 26308791 28745602 31576840 34900773 38846405 43541068 49101874 55660521 63372440
55955 63372440 72405109 82953293 95269972 109646382 126361545 145704723 168071043
$$ packed form
56019B754221M9891N3151N7971O5423P1098P2888P5246Q0805Q5345Q6320Q8467
56008C540826R5135J01975J05388J09221J16629J23417J26406J30297J39013J48289
55998D736596J54167J60549J70875J80826J87086J94636K07304K20178K29587
55989F441804K41123K59059K77878K93355L11567L37058L63108L84350M07844
55980I317146M40537M77216N12528N52784O03453O57811P11253P73517Q52723
55971A4898968R41639J034890J144500J282059J441997J620866J836290K107582
55963B6308791K436811K831238L323933L945632M694663N560806O558647P711919
55955F3372440R032669J0548184J2316679J4376410J6715163J9343178K2366320
$$ plain form
55948 168071043 193995758 224040496 258511064 296886549 336922974 373999465 401752787
55941 401752787 414341187 409090319 387587855 354521257 315409354 274877952 236089920
55934 236089920 200877393 170037472 143652391 121420479 102890806 87554497 74887919
55927 74887919 64414392 55738577 48527012 42491451 37404486 33102021 29452045 26334931
55919 26334931 23655904 21349742 19359454 17625234 16099717 14755396 13568500 12510174
55911 12510174 11559116 10707326 9946246 9259905 8636732 8074809 7569787 7109548 6685720
55902 6685720 6298856 5947387 5622533 5318897 5039465 4785249 4549801 4328396 4123069
55893 4123069 3934085 3755603 3584365 3424128 3277155 3139388 3008109 2886407 2775917
$$ packed form
55948A68071043K5924715L0044738L4470568L8375485M0036425L7076491K7753322
55941D01752787J2588400n250868k1502464l3066598l9111903m0531402l8788032
55934B36089920l5212527l0839921k6385081k2231912j8529673j5336309j2666578
55927G4887919j0473527q675815p211565o035561n086965m302465l649976l117114
55919B6334931k679027k306162j990288j734220j525517j344321j186896j058326
55911A2510174r51058q51790p61080o86341o23173n61923n05022m60239m23828
55902F685720l86864l51469l24854l03636k79432k54216k35448k21405k05327
55893D123069j88984j78482j71238j60237j46973j37767j31279j21702j10490
$$ plain form
55884 2775917 2672735 2574535 2484444 2403845 2328383 2255157 2187295 2127497 2073447 2023332 1979522
55873 1979522 1942598 1907381 1868740 1826191 1779600 1726100 1665034 1600857 1537480 1474361 1411080
55862 1411080 1350685 1295003 1241381 1187362 1134274 1083312 1033058 984553 944532 919678 910608
55851 910608 913855 925669 941025 953020 957179 953965 945085 930597 911642 892019 874295 857514
55839 857514 840817 825764 812914 799906 785431 771618 760079 749076 736999 725158 714649
55828 714649 703925 692073 681147 672608 664666 655729 647279 640578 633659 624523 614512 605717 597721
55815 597721 589671 582968 579090 577060 575693 576087 579380 584265 589235 595147 603153 612170 620662 628854
55801 628854 636955 643341 646719 647977 647677 643922 634973 621934 606575 588738 568322 547757 529740
$$ packed form
55884B775917j03182r8200r0091q0599p5462p3226o7862n9798n4050n0115m3810
55873A979522l6924l5217l8641m2549m6591n3500o1066o4177o3377o3119o3281
55862A411080o0395n5682n3622n4019n3088n0962n0254m8505m0021k4854r070
55851I10608L247J1814J5356J1995M159l214q880j4488j8955j9623j7724j6781
55839H57514j6697j5053j2850j3008j4475j3813j1539j1003j2077j1841j0509
55828G14649j0724j1852j0926q539p942q937q450o701o919r136j0011q795p996
55815E97721q050o703l878k030j367L94L293M885M970N912Q006R017Q492Q192
55801F28854Q101O386L378J258l00l755q949j3039j5359j7837k0416k0565j8017
$$ plain form
55788 529740 514124 499521 486476 476742 470784 468089 468459 470903 472717 471770 468606 464730 460410 455867
55774 455867 452855 452933 455577 459702 465538 473283 481525 488745 494672 498356 496796 487744 472496 454114
55760 454114 434456 414843 397696 384846 375324 367019 359633 354109 350324 347410 345344 344289 343185
55747 343185 340741 336999 332434 326570 319009 310763 303088 296058 289604 284572 281262 278256 274362 270387
55733 270387 267423 264814 261584 258512 256899 256428 256038 255683 255429 254062 250549 245857 241503 237354 232663
55718 232663 228154 225101 223255 221596 220299 220094 220502 220601 220839 222373 225257 228873 233289 238472 242982
55703 242982 245315 245881 246006 245650 243810 240484 236461 231678 225581 218789 212855 208544 205547 203507 202215
55688 202215 201334 200934 201665 203554 205562 207270 209768 213745 218036 221429 224572 228455 232320 234833 236190
$$ packed form
55788E29740j5616j4603j3045r734n958k695L70K444J814r47l164l876m320m543
55774D55867l012P8K644M125N836P745Q242P220N927L684j560r052j5248j8382
55760D54114j9658j9613j7147j2850r522q305p386n524l785k914k066j055j104
55747C43185k444l742m565n864p561q246p675p030o454n032l310l006l894l975
55733B70387k964k609l230l072j613m71l90l55k54j367l513m692m354m149m691
55718B32663m509l053j846j659j297k05M08R9K38J534K884L616M416N183M510
55703B42982K333N66J25l56j840l326m023m783o097o792n934m311k997k040j292
55688B02215q81m00P31J889K008J708K498L977M291L393L143L883L865K513J357
$$ plain form
55673 236190 237203 237384 235943 233797 232590 232353 232012 231509 231634 232338 233053 234131 236290 239191 242152 245598
55657 245598 250153 255059 259116 262428 265451 267195 266343 263421 259924 255937 250645 244503 238687 232852
55643 232852 225669 217356 209558 202874 196541 190470 185539 181779 178193 174512 171434 169101 167110 166036
55629 166036 167132 170213 173411 175287 175884 175710 175043 174297 173725 172759 170803 168471 166804 165652 164191 162564
55613 162564 161452 160482 158741 156545 155019 154250 153584 153307 154090 155071 154588 152747 151207 150384 148994 146527
55597 146527 144015 141908 139186 135212 130770 126733 123290 120842 120009 120225 119891 118495 117175 116834 117164
55582 117164 117903 119431 121614 123555 125005 126635 128543 130020 131176 133216 136614 140579 144864 150370
55568 150370 157143 163481 168082 171726 175717 179778 182567 183396 182468 180205 177121 173759 170146 165908 161234
$$ packed form
55673B36190J013J81j441k146j207k37l41n03J25P04P15J078K159K901K961L446
55657B45598M555M906M057L312L023J744q52k922l497l987n292o142n816n835
55643B32852p183q313p798o684o333o071m931l760l586l681l078k333j991j074
55629A66036J096L081L198J876N97j74o67p46n72r66j956k332j667j152j461j627
55613A62564j112r70j741k196j526p69o66k77P83R81m83j841j540q23j390k467
55597A46527k512k107k722l974m442m037l443k448q33K16l34j396j320l41L30
55582A17164P39J528K183J941J450J630J908J477J156K040L398L965M285N506
55568A50370O773O338M601L644L991M061K789Q29r28k263l084l362l613m238m674
$$ plain form
55553 161234 156908 153140 149351 145448 142270 140341 139212 138452 138229 138423 138205 137107 135686 134652 134169
55538 134169 134301 135159 136204 136451 135830 135406 135743 135989 135068 132990 130504 128257 126622 125574 124429 122496
55522 122496 120088 118063 116361 114200 111717 110109 109838 110063 110196 110594 111203 110978 109435 107562 106385 105686
55506 105686 104830 103815 102844 101916 101537 102711 105413 108064 109290 109338 109065 108620 107955 107636 108102 108859 109285
55489 109285 109588 110256 111215 112204 113261 114272 114801 114937 115442 116474 117123 116873 116520 116839 117304 117052 116190 115169
55471 115169 113755 111666 109510 107931 106431 104159 101448 99451 98592 98289 98021 97779 97621 97480 97279 96731
55455 96731 95381 93277 91248 89994 89341 88863 88669 88980 89498 89840 90187 90866 91686 92274 92653 93002 93263 93499
55437 93499 94127 95299 96532 97433 98261 99278 100148 100553 100821 101282 101552 101101 100084 99003 98018 97131 96559
$$ packed form
55553A61234m326l768l789l903l178j929j129p60k23J94k18j098j421j034m83
55538A34169J32Q58J045K47o21m24L37K46r21k078k486k247j635j048j145j933
55522A22496k408k025j702k161k483j608k71K25J33L98O09k25j543j873j177o99
55506A05686q56j015r71r28l79J174K702K651J226M8k73m45o65l19M66P57M26
55489A09285L03O68R59R89J057J011N29J36N05J032O49k50l53L19M65k52q62j021
55471A15169j414k089k156j579j500k272k711j997q59l03k68k42j58j41k01n48
55455I6731j350k104k029j254o53m78j94L11N18L42L47O79Q20N88L79L49K61K36
55437I3499O28J172J233R01Q28J017Q70M05K68M61K70m51j017j081r85q87n72
$$ plain form
55420 96559 96310 95863 94901 93843 93139 92537 91678 90849 90525 90664 91086 91984 93373 94533 94766 94382 94263 94767
55402 94767 95642 96594 97453 98125 98892 100254 102001 103047 102748 101801 101208 100994 100668 100333 100488 101145 101936 102760
55384 102760 103661 104468 105136 105940 106768 106806 105669 104218 103473 103252 102699 101575 100193 98676 97288 96904 98044
55367 98044 99782 100694 100598 100319 100099 99401 98144 96994 96372 96138 96221 96698 97207 97103 96238 94914 93338 91849
55349 91849 91361 92480 94286 95081 94467 93744 94175 95734 97626 99071 99357 98128 95997 94195 93287 92819
55333 92819 92336 92002 92002 92098 92128 92294 92603 92622 92197 91908 92359 93349 94124 94260 94023 93994 94501 95325 95933 96115 96221
55312 96221 96600 97072 97305 97463 98024 99111 100433 101657 102375 102005 100368 98216 96560 95583 94814 94171 94038
55295 94038 94406 94766 94999 95583 96732 97985 98857 99298 99339 99001 98809 99659 101735 104057 105510 105898 105654 105016
$$ packed form
55420I6559k49m47r62j058p04o02q59q29l24J39M22Q98J389J160K33l84j19N04
55402I4767Q75R52Q59O72P67J362J747J046k99r47n93k14l26l35J55O57P91Q24
55384A02760R01Q07O68Q04Q28L8j137j451p45k21n53j124j382j517j388l84J140
55367I8044J738R12r6k79k20o98j257j150o22k34Q3M77N09j04q65j324j576j489
55349I1849m88J119J806P95o14p23M31J559J892J445K86j229k131j802r08m68
55333I2819m83l34%R6L0J66L09J9m25k89M51R90P75J36k37k9N07Q24O08J82J06
55312I6221L79M72K33J58N61J087J322J224P18l70j637k152j656r77p69o43j33
55295I4038L68L60K33N84J149J253Q72M41M1l38j92Q50K076K322J453L88k44o38
$$ plain form
55277 105016 104045 103123 102820 103190 103555 103084 101518 99363 97446 96257 95705 95505 95586 95948 96367 96593 96746 97148
55259 97148 97851 98679 99648 100892 102143 102735 102270 101062 99872 99431 100073 101431 102512 102490 101529 100525 100064
55242 100064 99991 99996 100106 100489 101124 101883 102689 103450 104006 104222 103942 102951 101301 99656 98895 99187 99756 99744 99141
55223 99141 98642 98686 98803 98039 96098 94004 93331 94676 97153 99533 101435 103048 104195 104409 103831 103294 103310
55206 103310 103489 103174 102301 101410 101063 101455 102414 103596 104716 105640 106256 106434 106265 106147 106407 106963 107520 107914
55188 107914 108057 107781 107081 106283 105628 104873 103782 102756 102420 102669 102747 102337 101995 102326 103181 103952 104303 104335 104300
55169 104300 104420 104867 105709 106919 108474 110301 112101 113413 114038 114343 114996 116303 117811 118739 118859 118744
55153 118744 118921 119051 118464 117328 116511 116173 115356 113435 111248 110093 110176 110735 111277 111755 111828 110932 109217 107644
$$ packed form
55277A05016r71r22l03L70L65m71j566k155j917j189n52k00Q1L62M19K26J53M02
55259I7148P03Q28R69J244J251N92m65j208j190m41O42J358J081k2r61j004m61
55242A00064p3NJ10L83O35P59Q06P61N56K16k80r91j650j645p61K92N69j2o03
55223I9141m99M4J17p64j941k094o73J345K477K380J902J613J147K14n78n37J6
55206A03310J79l15q73q91l47L92R59J182J120R24O16J78j69j18K60N56N57L94
55188A07914J43k76p00p98o55p55j091j026l36K49P8m10l42L31Q55P71L51L2l5
55169A04300J20M47Q42J210J555J827J800J312O25L05O53J307J508R28J20j15
55153A18744J77J30n87j136q17l38q17j921k187j155Q3N59N42M78P3q96j715j573
$$ plain form
55135 107644 106955 107062 107538 108203 109076 110112 111120 111731 111562 110719 109975 109996 110551 110945 111065 111420 112282 113393
55117 113393 114460 115313 115574 114866 113507 112441 112264 112776 113547 114412 115224 115661 115590 115331 115361 116006 117396 119337
55099 119337 121175 122247 122614 122927 123426 123458 122232 119767 116971 114989 114521 115416 116805 117850 118483 119246
55083 119246 120501 122112 123831 125552 127162 128509 129597 130536 131216 131318 130699 129567 128317 127392 127119 127320
55067 127320 127258 126437 125308 124755 124995 125504 125911 126320 126657 126401 125269 123761 122741 122665 123273 123771 123354 121915
55049 121915 120235 119144 118596 117964 117106 116568 116743 117432 118284 119114 119655 119556 118835 117934 117244 117001 117586 119255
55031 119255 121390 122674 122415 121308 120575 120702 121240 121527 121303 120832 120588 120670 120620 120112 119668 120096 121286 122216
55013 122216 122297 122060 122286 123028 123843 124485 124997 125456 125970 126624 127216 127357 127017 126695 126854 127498 128407 129380 130087
$$ packed form
55135A07644o89J07M76O65Q73J036J008O11j69q43p44K1N55L94J20L55Q62J111
55117A13393J067Q53K61p08j359j066j77N12P71Q65Q12M37p1k59L0O45J390J941
55099A19337J838J072L67L13M99L2j226k465k796j982m68Q95J389J045O33P63
55083A19246J255J611J719J721J610J347J088R39O80J02o19j132j250r25k73K01
55067A27320o2q21j129n53K40N09M07M09L37k56j132j508j020p6O08M98m17j439
55049A21915j680j091n48o32q58n38J75O89Q52Q30N41r9p21r01o90k43N85J669
55031A19255K135J284k59j107p33J27N38K87k24m71k44Q2n0n08m44M28J190R30
55013A22216Q1k37K26P42Q15O42N12M59N14O54N92J41l40l22J59O44R09R73P07
$$ plain form
54994 130087 130115 129434 128530 127862 127493 127326 127325 127354 127220 127094 127509 128694 130184 131297 131756 131744 131647 131824 132360 132996
54974 132996 133508 134054 134751 135129 134624 133560 132990 133455 134555 135820 137235 138726 139899 140659 141429 142322 142753
54957 142753 142322 141523 141077 141083 141303 141853 142974 144459 145808 146774 147400 147730 147847 147928 147998 147888 147676 147821 148570
54938 148570 149587 150408 150933 151296 151686 152593 154724 158322 162902 167975 173607 179998 187058 194770 203445
54923 203445 213118 223099 232619 241421 249177 254797 257094 255942 252098 246086 237983 228254 218115 208812
54909 208812 200907 194276 188451 182922 177478 172453 168467 165837 164259 163044 161633 159987 158555 157764
54895 157764 157561 157575 157652 158001 158886 160481 162971 166383 170364 174550 179121 184557 190972 198252 206756 216975
54879 216975 228392 239547 249488 258297 265765 270488 271011 267277 260342 251271 240956 230426 220449
$$ packed form
54994A30087K8o81r04o68l69j67jK9j34j26M15J185J490J113M59j2r7J77N36O36
54974A32996N12N46O97L78n05j064n70M65J100J265J415J491J173P60P70Q93M31
54957A42753m31p99m46OK20N50J121J485J349R66O26L30J17Q1P0j10k12J45P49
54938A48570J017Q21N25L63L90R07K131L598M580N073N632O391P060P712Q675
54923B03445R673R981R520Q802P756N620K297j152l844o012q103r729j0139r303
54909B08812p905o631n825n529n444n025l986k630j578j215j411j646j432p91
54895A57764k03J4P7L49Q85J595K490L412L981M186M571N436O415P280Q504J0219
54879B16975J1417J1155R941Q809P468M723N23l734o935r071j0315j0530r977
$$ plain form
54866 220449 210996 201705 192688 184494 177576 172121 167998 164495 160679 156489 152921 150684 149277 147947
54852 147947 146791 146171 145717 144906 144107 143980 144208 143839 142689 141325 139825 137654 134869 132447 131138 130718
54836 130718 130560 130223 129345 127702 125717 124352 124199 125013 126257 127621 128933 130025 130851 131397 131424 130668 129380
54819 129380 128299 127988 128485 129564 130983 132464 133749 134662 134996 134568 133708 133335 134042 135283 136051 136174 136371
54802 136371 137111 138105 138903 139368 139476 139236 138982 139238 140097 141125 141988 142804 143765 144785 145700 146553 147594 149127
54784 149127 151300 153870 156349 158610 161077 164002 166892 169200 171338 174349 178689 183962 189847 196669
54770 196669 204927 214693 225508 236413 246175 254000 260011 264595 267332 267149 263493 256848 248149 238402
54756 238402 228837 220590 213821 207613 201034 193974 186946 180595 175583 172338 170604 169596 168814 168321 168143
$$ packed form
54866B20449r453r291r017q194o918n455m123l503l816m190l568k237j407j330
54852A47947j156o20m54q11p99j27K28l69j150j364j500k171k785k422j309m20
54836A30718j58l37q78j643j985j365j53Q14J244J364J312J092Q26N46K7p56j288
54819A29380j081l11M97J079J419J481J285R13L34m28q60l73P07J241P68J23J97
54802A36371P40R94P98M65J08k40k54K56Q59J028Q63Q16R61J020R15Q53J041J533
54784A49127K173K570K479K261K467K925K890K308K138L011M340N273N885O822
54770A96669Q258R766J0815J0905R762P825O011M584K737j83l656o645q699r747
54756B38402r565q247o769o208o579p060p028o351n012l245j734j008p82m93j78
$$ plain form
54741 168143 167930 167503 167235 167582 168564 169959 171653 173524 175333 177115 179489 183247 188700 195560 203278
54726 203278 211343 219451 227546 235603 243252 249657 253837 255085 253215 248620 242046 234167 225410 216198
54712 216198 207062 198302 189858 181845 174915 169635 165768 162683 160293 158973 158692 158812 158773 158377 157405 155608
54696 155608 153243 151097 149751 149151 148932 148785 148427 147671 146614 145493 144407 143502 143172 143557 144017 143790 143033
54679 143033 142505 142299 141730 140560 139400 138622 137741 136350 134893 133985 133524 133054 132572 132425 132711 133233 133777
54662 133777 134107 133987 133565 133481 134260 135751 137356 138538 138984 138650 137925 137441 137514 137997 138729 139701 140672 141200
54644 141200 141297 141578 142386 143211 143320 142661 141807 141285 141223 141330 141003 139812 138104 136771 136219 135997 135674 135519
54626 135519 135956 136798 137508 137831 137756 137290 136719 136642 137217 137674 137193 135998 135053 134880 135289 136057 137198 138568
$$ packed form
54741A68143k13m27k68L47R82J395J694J871J809J782K374L758N453O860P718
54726B03278Q065Q108Q095Q057P649O405M180J248j870m595o574p879q757r212
54712B16198r136q760q444q013o930n280l867l085k390j320k81J20l9l96r72j797
54696A55608k365k146j346o00k19j47l58p56j057j121j086r05l30L85M60k27p57
54679A43033n28k06n69j170j160p78q81j391j457r08m61m70m82j47K86N22N44
54662A33777L30j20m22q4P79J491J605J182M46l34p25m84P3M83P32R72R71N28
54644A41200R7K81Q08Q25J09o59q54n22o2J07l27j191j708j333n52k22l23j55
54626A35519M37Q42P10L23p5m66n71p7N75M57m81j195r45j73M09P68J141J370
$$ plain form
54608 138568 139798 140790 141716 142451 142488 141702 140831 140842 141891 143146 143685 143429 143088 143235 143654 143775 143580 143722
54590 143722 144698 146271 147802 148833 149194 148879 148146 147528 147382 147546 147606 147400 147091 146861 146760 146734 146648 146351 145874
54571 145874 145479 145411 145670 146054 146386 146678 147147 148008 149125 149970 150085 149512 148560 147358 145967 144699 143857 143299
54553 143299 142743 142433 142907 144149 145569 146896 148376 150043 151501 152720 154297 156553 158915 160608 161450
54538 161450 161606 161160 160347 159693 159451 159311 159081 159103 159520 159702 159099 158224 158078 158855 159891 160653 161063 160981 160131
54519 160131 158629 157061 155873 155048 154424 154028 154057 154681 155776 156795 157170 157067 157316 158265 159090 158734 157247
54502 157247 155667 154801 154706 155161 155972 156789 157186 157055 156544 155627 154231 152810 152278 153088 154645 155920 156499
54485 156499 156897 157830 159314 160615 161129 161139 161418 162189 162937 163319 163659 164321 165167 166075 167507 169880 172676
$$ packed form
54608A38568J230R92R26P35L7p86q71J1J049J255N39k56l41J47M19J21j95J42
54590A43722R76J573J531J031L61l15p33o18j46J64O0k06l09k30j01k6q6k97m77
54571A45874l95o8K59L84L32K92M69Q61J117Q45J15n73r52j202j391j268q42n58
54553A43299n56l10M74J242J420J327J480J667J458J219J577K256K362J693Q42
54538A61450J56m46q13o54k42j40k30K2M17J82o03q75j46P77J036P62M10q2q50
54519A60131j502j568j188q25o24l96K9O24J095J019L75j03K49R49Q25l56j487
54502A57247j580q66r5M55Q11Q17L97j31n11r17j396j421n32Q10J557J275N79
54485A56499L98R33J484J301N14J0K79P71P48L82L40O62Q46R08J432K373K796
$$ plain form
54468 172676 174796 175745 176017 176408 177396 179049 181038 182719 183605 183797 183691 183423 182870 182049 181089 179955 178604
54451 178604 177326 176508 176091 175640 174931 174117 173315 172422 171406 170421 169578 168795 167998 167343 167206 167884 169180 170295
54433 170295 170420 169529 168321 167375 166779 166617 167131 168075 168521 167891 166735 165989 165874 166104 166728 167991 169690
54416 169690 171343 172831 174223 175243 175652 175980 177047 178779 180289 181124 181683 182299 182706 182645 182359 182189 182205
54399 182205 182463 183174 184315 185460 186167 186287 185918 185404 185324 185976 186794 186804 185728 184199 182828 181595 180271
54382 180271 178926 177792 177033 176856 177502 178985 181115 183812 187006 190272 193083 195494 198020 200755 203162
54367 203162 204895 206209 207288 207774 207344 206266 204985 203583 202099 200967 200567 200525 199983 198521 196469 194367
54351 194367 192487 190953 190008 189907 190515 191132 190944 189775 188257 187123 186516 186179 186051 186197 186265 185554 183804
$$ packed form
54468A72676K120R49K72L91R88J653J989J681Q86J92j06k68n53q21r60j134j351
54451A78604j278q18m17m51p09q14q02q93j016r85q43p83p97o55j37O78J296J115
54433A70295J25q91j208r46n96j62N14R44M46o30j156p46j15K30O24J263J699
54416A69690J653J488J392J020M09L28J067J732J510Q35N59O16M07o1k86j70J6
54399A82205K58P11J141J145P07J20l69n14q0O52Q18J0j076j529j371j233j324
54382A80271j345j134p59j77O46J483K130K697L194L266K811K411K526K735K407
54367B03162J733J314J079M86m30j078j281j402j484j132m00m2n42j462k052k102
54351A94367j880j534r45j01O08O17j88j169j518j134o07l37j28J46O8p11j750
$$ plain form
54334 183804 181581 179791 179031 179336 180192 180805 180732 180333 180295 180814 181590 182510 183683 184835 185308 184926 184332 184201
54316 184201 184531 184900 184976 184565 183626 182473 181522 180639 179212 177174 175413 174783 175100 175565 175793 175945 176157 176388
54298 176388 176666 176988 177023 176380 175196 174119 173655 173745 174057 174459 175097 176089 177259 178239 178865 179319 179764 179993
54280 179993 179739 179179 178769 178599 178341 177885 177614 177890 178620 179465 180215 180818 181303 181789 182354 182877 183328 184135 185820
54261 185820 188242 190679 192734 194604 196384 197702 198328 198566 198712 198613 198103 197413 196817 196349 196133 196463 197105
54244 197105 197128 195980 194252 192783 191461 189614 187299 185448 184817 185376 186631 188006 188977 189346 189355 189255 188958
54227 188958 188450 188205 188575 189006 188555 187108 185478 184363 183810 183702 184058 184682 185079 184956 184431 183683 182769 181841
54209 181841 181088 180479 180023 180202 181476 183259 184147 183447 181822 180140 178439 176577 175214 175298 176843 178943
$$ packed form
54334A83804k223j790p60L05Q56O13p3l99l8N19P76R20J173J152M73l82n94j31
54316A84201L30L69P6m11r39j153r51q83j427k038j761o30L17M65K28J52K12K31
54298A76388K78L22L5o43j184j077m64R0L12M02O38R92J170R80O26M54M45K29
54280A79993k54n60m10j70k58m56k71K76P30Q45P50O03M85M86N65N23M51Q07J685
54261A85820K422K437K055J870J780J318O26K38J46r9n10o90n96m68k16L30O42
54244A97105K3j148j728j469j322j847k315j851o31N59J255J375R71L69Rj00k97
54227A88958n08k45L70M31m51j447j630j115n53j08L56O24L97j23n25p48r14r28
54209A81841p53o09m56J79J274J783Q88p00j625j682j701j862j363Q4J545K100
$$ plain form
54193 178943 180836 182327 183296 183473 182852 181858 180977 180547 180881 182115 183878 185548 186955 188447 190202 191979
54177 191979 193691 195646 197878 199733 200552 200419 199739 198464 196354 193793 191604 190065 188757 187487 186722
54162 186722 186856 187608 188424 189028 189237 188762 187673 186704 186565 187125 187663 187734 187425 186963 186550 186384 186391 186083 185153
54143 185153 184157 184033 184983 186330 187519 188747 190414 192411 194209 195442 196187 196915 198228 200457 203352
54128 203352 206192 208220 208950 208390 207211 206439 206577 207212 207855 208839 210801 213494 215899 217470 218483 219098
54112 219098 218950 217975 216852 216120 215422 214074 211948 209366 206582 203819 201449 199698 198485 197803 197882 198597
54096 198597 199193 199056 198402 197788 197349 196947 196678 196661 196633 196342 196081 196228 196527 196442 196128 196341 197354 198567 199323
54077 199323 199622 199872 200384 201337 202954 205395 208502 211786 214671 216860 218504 219894 220970 221406 221229 221010
$$ packed form
54193A78943J893J491R69J77o21r94q81m30L34J234J763J670J407J492J755J777
54177A91979J712J955K232J855Q19j33o80j275k110k561k189j539j308j270p65
54162A86722J34P52Q16O04K09m75j089r69j39N60N38P1l09m62m13j66Pl08r30
54143A85153r96j24R50J347J189J228J667J997J798J233P45P28J313K229K895
54128B03352K840K028P30n60j179p72J38O35O43R84J962K693K405J571J013O15
54112B19098j48r75j123p32o98j348k126k582k784k763k370j751j213o82P9P15
54096A98597N96j37o54o14m39m02k69j7k8k91k61J47K99q5l14K13J013J213P56
54077A99323K99K50N12R53J617K441L107L284K885K189J644J390J076M36j77k19
$$ plain form
54061 221010 221195 221565 221614 221133 220134 218595 216762 215423 215318 216369 217910 219559 221390 223346 225068 226434
54045 226434 227875 230013 233131 237007 241103 244991 248779 253005 257991 263594 269717 276588 284098 291311
54031 291311 297336 302471 307779 313640 319446 324749 329940 335521 341255 346360 350187 352528 353623 354039
54017 354039 354269 354327 354042 353656 353614 353654 352742 350253 346729 343072 339311 334708 328938 322657 316877 312064 307930
54000 307930 303896 299662 295385 291436 287998 284946 282045 279236 276779 275157 274644 274871 274974 274468 273818
53985 273818 273900 275003 276683 278533 280690 283530 287268 291945 297383 302820 306777 307751 305244 300144 294054
53970 294054 288141 282476 276480 269999 263821 259055 256203 254987 254772 254893 254773 254199 253530 253323 253791 254848
53954 254848 256577 259209 262581 265956 268621 270545 272481 275471 280010 285387 290094 293307 295873 299385
$$ packed form
54061B21010J85L70M9m81r99j539j833j339j05J051J541J649J831J956J722J366
54045B26434J441K138L118L876M096L888L788M226M986N603O123O871P510P213
54031B91311O025N135N308N861N806N303N191N581N734N105L827K341J095M16
54017C54039K30N8k85l86m2M0r12k489l524l657l761m603n770o281n780m813m134
54000C07930m034m234m277l949l438l052k901k809k457j622n13K27J03n06o50
53985B73818Q2J103J680J850K157K840L738M677N438N437L957R74k507n100o090
53970B94054n913n665n996o481o178m766k852j216k15J21j20n74o69k07M68J057
53954B54848J729K632L372L375K665J924J936K990M539N377M707L213K566L512
$$ plain form
53940 299385 304432 310336 316480 323057 330255 337462 343763 348738 352341 354470 355203 355145 354912 354450 353397
53925 353397 352008 351198 351592 353090 355501 359150 364482 371241 378392 384900 390432 395373 400374 406012 412728
53910 412728 420735 429800 439223 448233 456448 463875 470561 476375 481027 484102 485143 484015 481344 478320
53896 478320 475902 474203 472635 470436 467000 462018 455616 448341 440771 433061 424986 416427 407690 399265
53882 399265 391367 383827 376410 369074 361952 355315 349644 345400 342393 339635 336245 332379 328708 325150
53868 325150 320911 315954 311441 308143 305190 301281 296581 292424 289390 286747 283853 281056 278892 277156
53854 277156 275195 272601 269399 266040 263443 262384 262519 262563 261766 260679 260115 259962 259582 258806 257866 256754
53838 256754 255442 254478 254561 255533 256461 256795 256819 256856 256698 256119 255434 255121 255243 255589 256126 256854 257463 257564 257253
$$ packed form
53940B99385N047N904O144O577P198P207O301M975L603K129P33n8k33m62j053
53925C53397j389q10L94J498K411L649N332O759P151O508N532M941N001N638O716
53910D12728Q007R065R423R010Q215P427O686N814M652L075J041j128k671l024
53896D78320k418j699j568k199l436m982o402p275p570p710q075q559q737q425
53882C99265p898p540p417p336p122o637n671m244l007k758l390l866l671l558
53868C25150m239m957m513l298k953l909m700m157l034k643k894k797k164j736
53854B77156j961k594l202l359k597j059J35M4p97j087n64j53l80p76r40j112
53838B56754j312r64Q3R72R28L34K4L7j58n79o85l13J22L46N37P28O09J01l11
$$ plain form
53819 257253 257001 256991 257070 257397 258601 260878 263404 265254 266662 268652 271444 274047 275694 276931 278777 281387
53803 281387 284307 287636 292042 297635 303626 309358 315120 321654 329250 337527 345795 353415 360075 365918
53789 365918 371172 375570 378437 379510 379443 379269 379443 379488 378453 375787 371919 367905 364261 360339 355241 349219
53773 349219 343617 339453 336536 334004 331059 327084 321784 315668 309864 305045 300891 296871 292999 289429
53759 289429 285917 282344 279354 277737 277322 277082 276202 274521 272142 269309 266623 264739 263691 263013 262579
53744 262579 262753 263598 264511 264958 265088 265261 265358 265033 264416 264037 264069 264062 263556 262653 261805 261267 260994 260944 261120 261312
53724 261312 261139 260622 260523 261732 264290 267265 269673 271337 272753 274408 276390 278522 280637 282736 284974
53709 284974 287390 289639 291148 291693 291724 291997 293028 295051 298298 302974 308926 315619 322552 329502 336230
$$ packed form
53819B57253k52j0P9L27J204K277K526J850J408J990K792K603J647J237J846K610
53803B81387K920L329M406N593N991N732N762O534P596Q277Q268P620O660N843
53789C65918N254M398K867J073o7j74J74M5j035k666l868m014l644l922n098o022
53773C49219n602m164k917k532k945l975n300o116n804m819m154m020l872l570
53759B89429l512l573k990j617m15k40q80j681k379k833k686j884j048o78m34
53744B62579J74Q45R13M47J30J73R7l25o17l79L2pn06r03q48n38k73n0J76J92
53724B61312j73n17r9J209K558K975K408J664J416J655J982K132K115K099K238
53709B84974K416K249J509N45L1K73J031K023L247M676N952O693O933O950O728
$$ plain form
53694 336230 342131 346531 349364 351328 353173 354986 356345 357075 357475 357834 358088 358135 358150 358289 358328 357918 357038
53677 357038 355926 354745 353632 352911 352871 353415 354202 354974 355437 355109 353845 352338 351482 351255 350888 350099 349419
53660 349419 349161 348859 348152 347616 348163 349908 352076 353771 354596 354805 355064 355790 356592 356777 356500 356806 358254
53643 358254 360134 361588 362937 365220 368708 372565 375856 378331 380283 382125 384084 385993 387457 388514
53629 388514 389894 392200 394973 397014 397576 396963 396071 395697 396240 397665 399695 402119 404819 407445 409442
53614 409442 410689 411768 413272 415227 417606 420907 425547 430918 435786 439640 443050 446668 450462 454004
53600 454004 456995 459336 461129 462785 464786 467142 469362 470998 471919 472031 471171 469467 467480 465746 464258
53585 464258 462560 460278 457568 455120 453663 453316 453441 453244 452397 451005 449189 446963 444347 441386 438139
$$ packed form
53694C36230N901M400K833J964J845J813J359P30M00L59K54M7J5J39L9m10q80
53677C57038j112j181j113p21m0N44P87P72M63l28j264j507q56k27l67p89o80
53660C49419k58l02p07n36N47J745K168J695Q25K09K59P26Q02J85k77L06J448
53643C58254J880J454J349K283L488L857L291K475J952J842J959J909J464J057
53629C88514J380K306K773K041N62o13q92l74N43J425K030K424K700K626J997
53614D09442J247J079J504J955K379L301M640N371M868L854L410L618L794L542
53600D54004K991K341J793J656K001K356K220J636R21J12q60j704j987j734j488
53585D64258j698k282k710k448j457l47J25j97q47j392j816k226k616k961l247
$$ plain form
53570 438139 434849 431887 429369 427140 425332 424483 424662 424949 424446 423493 423162 423724 424378 424488 424300 424311 424644
53553 424644 425342 426615 428434 430281 431645 432515 433234 434176 435627 437587 439634 441368 443068 445442 448662
53538 448662 452161 455474 458697 461887 464662 466850 469067 472194 476623 482322 489203 496985 505088 513209
53524 513209 521806 531484 542090 552891 563563 574534 586372 599280 613177 627934 643440 659712
53512 659712 676994 695496 715019 735108 755678 777207 800127 824129 848251 871637 894149
53501 894149 916199 938158 959976 981293 1001752 1021166 1039613 1057473 1075223 1093040 1110711
53490 1110711 1128106 1145542 1163431 1181790 1200442 1219495 1239121 1258872 1277782 1295331 1311899
53479 1311899 1328151 1344430 1360910 1377832 1395159 1412318 1428642 1443814 1457551 1469136 1477831
$$ packed form
53570D38139l290k962k518k229j808q49J79K87n03r53l31N62O54J10j88J1L33
53553D24644O98J273J819J847J364Q70P19R42J451J960K047J734J700K374L220
53538D48662L499L313L223L190K775K188K217L127M429N699O881P782Q103Q121
53524E13209Q597R678J0606J0801J0672J0971J1838J2908J3897J4757J5506J6272
53512F59712J7282J8502J9523K0089K0570K1529K2920K4002K4122K3386K2512
53501H94149K2050K1959K1818K1317K0459J9414J8447J7860J7750J7817J7671
53490A110711J7395J7436J7889J8359J8652J9053J9626J9751J8910J7549J6568
53479A311899J6252J6279J6480J6922J7327J7159J6324J5172J3737J1585Q695
$$ plain form
53468 1477831 1483673 1487471 1489962 1491210 1490722 1487812 1481845 1472579 1460502 1446706 1432265 1417802 1403610
53455 1403610 1389927 1376867 1364145 1351105 1337128 1322004 1305920 1289178 1272002 1254518 1236715
53444 1236715 1218401 1199493 1180485 1162422 1146109 1131463 1117876 1105119 1093544 1083511 1075034
53433 1075034 1068129 1063105 1060261 1059484 1060257 1061874 1063605 1065039 1066536 1069108 1073559 1079844 1087412 1095971
53419 1095971 1105613 1116333 1127895 1140319 1154221 1170419 1189206 1210120 1232412 1255597 1279469
53408 1279469 1303723 1327902 1351878 1376199 1401713 1428859 1457478 1487252 1518188 1550746 1585633
53397 1585633 1623379 1663859 1706356 1750350 1796166 1844499 1895311 1947606 2000348 2053196 2106194
53386 2106194 2159176 2211810 2264013 2315892 2367274 2417509 2465877 2512088 2556309 2598598 2638397
$$ packed form
53468A477831N842L798K491J248m88k910n967r266j2077j3796j4441j4463j4192
53455A403610j3683j3060j2722j3040j3977j5124j6084j6742j7176j7484j7803
53444A236715j8314j8908j9008j8063j6313j4646j3587j2757j1575j0033q477
53433A075034o905n024k844p77P73J617J731J434J497K572M451O285P568Q559
53419A095971R642J0720J1562J2424J3902J6198J8787K0914K2292K3185K3872
53408A279469K4254K4179K3976K4321K5514K7146K8619K9774L0936L2558L4887
53397A585633L7746M0480M2497M3994M5816M8333N0812N2295N2742N2848N2998
53386B106194N2982N2634N2203N1879N1382N0235M8368M6211M4221M2289L9799
$$ plain form
53375 2638397 2674806 2707448 2736758 2763151 2786226 2805194 2819893 2830767 2837922 2840725 2838459 2830794
53363 2830794 2817475 2798055 2772294 2740495 2703316 2661573 2616353 2568825 2519686 2469119 2417502
53352 2417502 2365703 2314460 2263998 2214561 2166831 2121410 2078318 2037416 1998800 1962184 1926330
53341 1926330 1889882 1852598 1815163 1778058 1741400 1705787 1672371 1641801 1613696 1587390 1562671
53330 1562671 1539517 1517730 1497272 1478631 1462364 1448507 1436667 1426394 1417010 1407328 1396193 1383407
53318 1383407 1369712 1355726 1341280 1326043 1310437 1295517 1282025 1269933 1258894 1248723 1239421
53307 1239421 1231185 1224609 1220450 1218799 1218758 1219414 1220879 1223824 1228167 1232950 1237678 1243137 1250585 1260584 1272953
53292 1272953 1287377 1303596 1321243 1339962 1359621 1380218 1401701 1424034 1447184 1470787 1494096
$$ packed form
53375B638397L6409L2642K9310K6393K3075J8968J4699J0874P155K803k266p665
53363B830794j3319j9420k5761l1799l7179m1743m5220m7528m9139n0567n1617
53352B417502n1799n1243n0462m9437m7730m5421m3092m0902l8616l6616l5854
53341A926330l6448l7284l7435l7105l6658l5613l3416l0570k8105k6306k4719
53330A562671k3154k1787k0458j8641j6267j3857j1840j0273r384r682j1135j2786
53318A383407j3695j3986j4446j5237j5606j4920j3492j2092j1039j0171r302
53307A239421q236o576m159j651m1O56J465K945M343M783M728N459P448R999J2369
53292A272953J4424J6219J7647J8719J9659K0597K1483K2333K3150K3603K3309
$$ plain form
53281 1494096 1516503 1537908 1558335 1577447 1594706 1609719 1622105 1631325 1637137 1640065 1640904 1639781
53269 1639781 1636133 1629673 1620951 1610787 1599336 1585922 1569732 1550659 1529458 1507012 1483520 1458611
53257 1458611 1432250 1405135 1378018 1351022 1323840 1296310 1268457 1240337 1212261 1184906 1158745
53246 1158745 1133543 1108853 1084742 1061553 1039140 1016955 994821 973017 951627 930413 909484
53235 909484 889513 871037 853933 837808 822526 808146 794636 781906 769960 758886 748809
53224 748809 739888 732084 724895 717532 709463 700598 691051 680957 670473 659586 647958 635293 621821
53211 621821 608023 593911 579196 564246 550223 537914 526892 516230 505634 495493 486152 477581
53199 477581 469514 461414 452536 442555 432133 422397 413760 405629 397297 388742 380403 372494 364870 357443
$$ packed form
53281A494096K2407K1405K0427J9112J7259J5013J2386R220N812K928Q39j123
53269A639781l648o460q722j0164j1451j3414j6190j9073k1201k2446k3492k4909
53257A458611k6361k7115k7117k6996k7182k7530k7853k8120k8076k7355k6161
53246A158745k5202k4690k4111k3189k2413k2185k2134k1804k1390k1214k0929
53235I09484j9971j8476j7104j6125j5282j4380j3510j2730j1946j1074j0077
53224G48809q921p804p189p363q069q865r547j0094j0484j0887j1628j2665j3472
53211F21821j3798j4112j4715j4950j4023j2309j1022j0662j0596j0141r341q571
53199D77581q067q100q878r981j0422r736q637q131q332q555q339p909p624p427
$$ plain form
53185 357443 350477 344392 339368 335210 331596 328374 325517 322845 319997 316805 313494 310377 307492 304820
53171 304820 302767 302012 302701 303982 304588 303877 302202 300342 298801 297665 296901 296493 296259 295796 294765 293231
53155 293231 291597 290210 289107 288208 287606 287518 287909 288348 288395 288068 287693 287266 286272 284382 282075 280249 279296
53138 279296 278883 278542 278046 277228 276023 274883 274681 275859 277929 280140 282257 284417 286625 288925 291737
53123 291737 295352 299172 302114 303841 305104 306783 309070 311699 314490 317363 320243 323212 326473 329858
53109 329858 332579 333741 333070 331083 328728 326854 325695 324629 322685 319539 315804 312186 308636 304654
53095 304654 300267 296263 293399 291673 290497 289388 288312 287458 286861 286356 285832 285399 285203 285132 284809 283856 282157
53078 282157 279938 277724 276111 275340 275059 274707 274099 273511 273190 273087 273155 273572 274412 275200 275166 274003 272244 270780
$$ packed form
53185C57443o966o085n024m158l614l222k857k672k848l192l311l117k885k672
53171C04820k053p55O89J281O06p11j675j860j541j136p64m08k34m63j031j534
53155B93231j634j387j103q99o02q8L91M39M7l27l75m27r94j890k307j826r53
53138B79296m13l41m96q18j205j140k02J178K070K211K117K160K208K300K812
53123B91737L615L820K942J727J263J679K287K629K791K873K880K969L261L385
53109C29858K721J162o71j987k355j874j159j066j944l146l735l618l550l982
53095C04654m387m004k864j726j176j109j076q54n97n05n24m33j96p1l23r53j699
53078B82157k219k214j613p71k81l52o08n88l21j03O8M17Q40P88l4j163j759j464
$$ plain form
53060 270780 270029 269679 269181 268361 267483 266827 266436 266292 266444 266863 267343 267738 268127 268567 268905 269053 269278 269896 270765
53041 270765 271376 271372 270726 269593 268324 267507 267553 268242 268981 269461 269659 269376 268380 267062 266289 266421 266999 267585 268284
53022 268284 269134 269705 269905 270583 272582 275459 277900 279225 279819 280160 280248 280152 280339 281075 281949 282439 282566 282607
53004 282607 282457 281822 280982 280858 282105 284354 286554 288009 288927 290006 291540 293039 293716 293358 292641 292581 293739
52987 293739 295974 298806 301781 304484 306490 307606 308150 308700 309481 310098 309990 308994 307413 305701 304254 303381
52971 303381 303228 303761 304898 306564 308431 309812 310137 309546 308759 308359 308443 308898 309586 310141 310039 309204 308277 307903
52953 307903 307901 307494 306299 304703 303210 301805 300212 298493 297016 295855 294627 293144 291925 291685 292402 293275
52937 293275 293658 293622 293468 293158 292634 292396 293151 294909 296829 298003 298103 297324 296077 294820 293829 293062 292478
$$ packed form
53060B70780p51l50m98q20q78o56l91j44J52M19M80L95L89M40L38J48K25O18Q69
53041B70765O11mo46j133j269q17M6O89P39M80J98k83r96j318p73J32N78N86O99
53022B68284Q50N71K00O78J999K877K441J325N94L41Q8r6J87P36Q74M90J27M1
53004B82607j50o35q40j24J247K249K200J455R18J079J534J499O77l58p17o0J158
52987B93739K235K832K975K703K006J116N44N50P81O17j08r96j581j712j447q73
52971C03381j53N33J137J666J867J381L25n91p87m00Q4M55O88N55j02q35r27l74
52953C07903km07j195j596j493j405j593j719j477j161j228j483j219k40P17Q73
52937B93275L83l6j54l10n24k38P55J758J920J174J00p79j247j257r91p67n84
$$ plain form
52920 292478 292417 293245 294667 295890 296566 297066 297692 298194 298421 298862 299980 301316 301874 301250 299972 298815 298177
52903 298177 298056 298211 298292 298124 297908 297964 298245 298311 297814 296876 295989 295648 296000 296775 297590 298376 299342 300528 301709
52884 301709 302813 304043 305294 305912 305491 304631 304362 304994 306096 307538 309800 313111 316953 320815 324952
52869 324952 329857 335199 339833 342849 344232 344408 343536 341506 338452 334866 331162 327325 323201 318972 315042
52854 315042 311473 307892 304088 300442 297480 295144 292787 289932 286798 284071 282198 280938 279607 277845
52840 277845 276113 275193 275219 275550 275717 275997 276762 277735 278482 279258 280583 282097 282689 281937 280680 279849 279370 278668
52822 278668 277685 276830 276286 275981 276007 276478 277094 277405 277486 277783 278326 278631 278528 278524 279093 279994 280603 280552 279765 278254
52802 278254 276250 274332 272954 271937 270725 269063 267142 265229 263553 262400 261877 261562 260841 259661 258581
$$ packed form
52920B92478o1Q28J422J223O76N00O26N02K27M41J118J336N58o24j278j157o38
52903B98177j21J55Q1j68k16N6K81O6m97r38q87l41L52P75Q15P86R66J186J181
52884C01709J104J230J251O18m21q60k69O32J102J442K262L311L842L862M137
52869C24952M905N342M634L016J383J76q72k030l054l586l704l837m124m229l930
52854C15042l569l581l804l646k962k336k357k855l134k727j873j260j331j762
52840B77845j732r20K6L31J67K80P65R73P47P76J325J514N92p52j257q31m79p02
52822B78668r83q55n44l05K6M71O16L11Q1K97N43L05j03mN69R01O09n1p87j511
52802B78254k004j918j378j017j212j662j921j913j676j153n23l15p21j180j080
$$ plain form
52787 258581 258044 257997 258267 258756 259162 259132 258986 259712 261735 264246 266250 267789 269410 270898 271498 271232 270985
52770 270985 271136 271031 270145 268975 268311 268232 268367 268622 269116 269698 270108 270392 270702 270897 270794 270673 271081 272156
52752 272156 273457 274410 274711 274405 273914 273868 274622 275968 277521 279206 281119 283081 284702 285811 286510 286837
52736 286837 286724 286255 285704 285340 285376 286038 287382 289105 290808 292413 294020 295407 295977 295305 293528 291187
52720 291187 288901 287150 286054 285304 284463 283399 282304 281425 280981 281231 282210 283422 284156 284236 284144 284298 284560
52703 284560 284653 284695 284995 285479 285728 285619 285629 286329 287662 288851 289034 287967 286142 284334 283063 282367 281933 281468
52685 281468 281083 281291 282375 283822 284691 284639 284217 284022 283969 283756 283647 284245 285587 286995 287804 287862 287316 286414
52667 286414 285598 285359 285760 286386 286910 287402 287943 288302 288314 288371 289148 290890 293209 295632 298118 300908 303998
$$ packed form
52787B58581n37m7K70M89M06l0j46P26K023K511K004J539J621J488O00k66k47
52770B70985J51j05q86j170o64p9J35K55M94N82M10K84L10J95j03j21M08J075
52752B72156J301R53L01l06m91m6P54J346J553J685J913J962J621J109O99L27
52736B86837j13m69n51l64L6O62J344J723J703J605J607J387N70o72j777k341
52720B91187k286j751j096p50q41j064j095q79m44K50R79J212P34Q0r2J54K62
52703B84560R3M2L00M84K49j09J0P00J333J189J83j067j825j808j271o96m34m65
52685B81468l85K08J084J447Q69n2m22j95n3k13j09N98J342J408Q09N8n46r02
52667B86414q16k39M01O26N24M92N41L59J2N7P77J742K319K423K486K790L090
$$ plain form
52650 303998 306946 309240 310736 311593 311899 311595 310752 309573 308049 305913 303208 300582 298686 297453 296347
52635 296347 295175 294286 294026 294422 295366 296719 298174 299483 300885 302970 305923 309166 311856 313482 313905
52620 313905 313205 311721 310041 308654 307676 306974 306498 306381 306795 307663 308475 308526 307601 306364 305715 305789 305930 305691
52602 305691 305443 305860 307178 309124 311229 312979 313976 314326 314675 315515 316542 316967 316483 315733 315773 317077 319061
52585 319061 320572 320926 320496 320233 320767 322098 323926 325880 327495 328386 328607 328493 328069 327032 325369 323565
52569 323565 321965 320361 318567 317022 316398 316750 317434 317742 317382 316493 315527 314991 314995 315119 314894 314306 313562 312602
52551 312602 311211 309566 308210 307418 306896 306213 305326 304564 304265 304531 305190 305898 306338 306447 306481 306860 307895 309524
52533 309524 311262 312523 313111 313335 313560 313766 313738 313585 313923 315406 318068 321124 323498 324745 325484 326797
$$ packed form
52650C03998K948K294J496Q57L06l04q43j179j524k136k705k626j896j233j106
52635B96347j172q89k60L96R44J353J455J309J402K085K953L243K690J626M23
52620C13905p00j484j680j387r78p02m76j17M14Q68Q12N1r25j237o49P4J41k39
52602C05691k48M17J318J946K105J750R97L50L49Q40J027M25m84p50M0J304J984
52585C19061J511L54m30k63N34J331J828J954J615Q91K21j14m24j037j663j804
52569C23565j600j604j794j545o24L52O84L08l60q89r66n36MJ24k25n88p44r60
52551C12602j391j645j356p92n22o83q87p62k99K66O59P08M40J09L4L79J035J629
52533C09524J738J261N88K24K25K06k8j53L38J483K662L056K374J247P39J313
$$ plain form
52517 326797 329119 331888 334391 336699 339557 343437 347979 352367 356058 359113 361919 364648 366879 367732
52503 367732 366453 363017 358180 352938 347873 343000 338234 333823 330168 327310 324939 323000 321916 321922 322508
52488 322508 322919 322999 323122 323451 323818 324259 325067 326205 327184 327690 327862 327881 327769 327767 328331 329508 330842 332177 333957
52469 333957 336359 338767 340676 342556 345209 348650 352372 356330 360769 365193 368348 369419 368658 366735
52455 366735 364015 360562 356379 351460 346041 340858 336745 333867 331665 329609 327612 325726 323939 322398
52441 322398 321323 320518 319422 317915 316653 316281 316619 316964 316915 316624 316433 316553 317007 317610 318117 318568 319333 320621
52423 320621 322113 323295 324049 324659 325285 325683 325590 325266 325547 327216 330258 333750 336678 338817 340725 343055
52407 343055 346134 350099 355006 360642 366618 372855 379704 387325 395143 402090 407168 409633 409050 405630
$$ packed form
52517C26797K322K769K503K308K858L880M542M388L691L055K806K729K231Q53
52503C67732j279l436m837n242n065m873m766m411l655k858k371j939j084ON86
52488C22508M11Q0J23L29L67M41Q08J138R79N06J72J9j12kN64J177J334J335J780
52469C33957K402K408J909J880K653L441L722L958M439M424L155J071p61j923
52455C66735k720l453m183m919n419n183m113k878k202k056j997j886j787j541
52441C22398j075q05j096j507j262l72L38L45m9k91j91J20M54O03N07M51P65J288
52423C20621J492J182P54O10O26L98r3l24K81J669L042L492K928K139J908K330
52407C43055L079L965M907N636N976O237O849P621P818O947N078K465n83l420
$$ plain form
52393 405630 400426 394753 389372 384430 380028 376418 373610 371197 368802 366494 364616 363400 362868 362886 363130
52378 363130 363176 362909 362770 363407 365104 367803 371613 376873 383477 390380 396171 400189 402854 404918 406613
52363 406613 407572 407328 405746 403161 400306 397986 396579 395847 395350 395035 395298 396492 398479 400678 402497 403742
52347 403742 404699 405776 407068 408332 409385 410351 411433 412692 414258 416527 419842 424005 428409 432660 436871
52332 436871 441401 446592 452780 460235 468944 478610 488950 499887 511439 523579 536159 548742 560526
52319 560526 570804 579638 587964 596946 607355 619490 633253 648098 663285 678605 694767 712763
52307 712763 732862 754377 776343 798284 820397 843264 867389 892806 918953 944946 969999
52296 969999 993681 1015829 1036241 1054413 1069610 1081383 1090050 1096577 1101965 1106862 1111617 1116261 1120247
$$ packed form
52393D05630n204n673n381m942m402l610k808k413k395k308j878j216n32J8K44
52378C63130M6k67j39O37J697K699L810N260O604O903N791M018K665K064J695
52363D06613R59k44j582k585k855k320j407p32m97l15K63J194J987K199J819J245
52347D03742R57J077J292J264J053R66J082J259J566K269L315M163M404M251M211
52332D36871M530N191O188P455Q709R666J0340J0937J1552J2140J2580J2583J1784
52319E60526J0278Q834Q326Q982J0409J2135J3763J4845J5187J5320J6162J7996
52307G12763K0099K1515K1966K1941K2113K2867K4125K5417K6147K5993K5053
52296I69999K3682K2148K0412J8172J5197J1773Q667O527N388M897M755M644L986
$$ plain form
52283 1120247 1122612 1122823 1121351 1119171 1116769 1113945 1110433 1106308 1101781 1097009 1092260 1087981 1084465 1081606
52269 1081606 1079170 1077189 1075918 1075532 1076030 1077343 1079369 1081978 1085243 1089700 1096113 1104855 1115622 1127910
52255 1127910 1141654 1157251 1174964 1194491 1215100 1235963 1256237 1275039 1291631 1305699 1317361
52244 1317361 1326870 1334447 1340336 1344791 1347915 1349602 1349758 1348477 1345938 1342213 1337237 1330913 1323196 1314225
52230 1314225 1304423 1294260 1283752 1272338 1259537 1245619 1231321 1216974 1202294 1187155 1172106
52219 1172106 1157807 1144275 1131091 1118178 1105948 1094741 1084626 1075777 1068548 1062950 1058497 1054825
52207 1054825 1052079 1050303 1048901 1047323 1046084 1046420 1048830 1052504 1056383 1060284 1064716 1070056 1076271 1083180
52193 1083180 1090539 1097958 1105043 1111564 1117285 1121756 1124504 1125319 1124165 1120959 1115753 1108999 1101370 1093363
$$ packed form
52283A120247K365K11j472k180k402k824l512m125m527m772m749m279l516k859
52269A081606k436j981j271l86M98J313K026K609L265M457O413Q742J0767J2288
52255A127910J3744J5597J7713J9527K0609K0863K0274J8802J6592J4068J1662
52244A317361R509P577N889M455L124J687J56j281k539l725m976o324p717q971
52230A314225r802j0163j0508j1414j2801j3918j4298j4347j4680j5139j5049
52219A172106j4299j3532j3184j2913j2230j1207j0115q849p229n598m453l672
52207A054825k746j776j402j578j239L36K410L674L879L901M432N340O215O909
52193A083180P359P419P085O521N721M471K748Q15j154l206n206o754p629q007
$$ plain form
52179 1093363 1085334 1077823 1071461 1066399 1062007 1057272 1051537 1045028 1038824 1034117 1031263 1029607 1028435 1027826
52165 1027826 1028214 1029348 1030344 1030871 1031693 1033721 1036929 1040492 1043693 1046244 1047938 1048463 1047708 1046026 1044133
52150 1044133 1042789 1042469 1043163 1044508 1046241 1048459 1051356 1054757 1058156 1061224 1064157 1067397 1071064 1074749
52136 1074749 1077868 1080164 1081839 1083324 1085097 1087796 1092321 1099507 1109572 1121869 1135236 1148716 1162156
52123 1162156 1176223 1191745 1208982 1227576 1247090 1267233 1287471 1306937 1325186 1342725 1360262
52112 1360262 1377640 1394144 1409837 1425852 1443081 1461193 1479335 1497388 1516045 1535836 1556529
52101 1556529 1577401 1597725 1616955 1634655 1650399 1663739 1674356 1682161 1687085 1688852 1687294 1682932
52089 1682932 1676862 1669931 1662282 1653722 1644011 1632664 1619145 1603775 1587960 1572991 1558916 1545109
$$ packed form
52179A093363q029p511o362n062m392m735n735o509o204m707k854j656j172o09
52165A027826L88J134R96N27Q22K028L208L563L201K551J694N25p55j682j893
52150A044133j344l20O94J345J733K218K897L401L399L068K933L240L667L685
52136A074749L119K296J675J485J773K699M525P186J0065J2297J3367J3480J3440
52123A162156J4067J5522J7237J8594J9514K0143K0238J9466J8249J7539J7537
52112A360262J7378J6504J5693J6015J7229J8112J8142J8053J8657J9791K0693
52101A556529K0872K0324J9230J7700J5744J3340J0617P805M924J767j558m362
52089A682932o070o931p649q560r711j1347j3519j5370j5815j4969j4075j3807
$$ plain form
52077 1545109 1531500 1518444 1505672 1492342 1478286 1464409 1451621 1440084 1429809 1421311 1415121 1411155
52065 1411155 1409072 1409001 1411399 1416415 1423861 1433650 1445792 1460037 1475922 1493145 1511460 1530232 1548506
52052 1548506 1565581 1581194 1595054 1606622 1615582 1622195 1626894 1629775 1630781 1630236 1628790 1626875 1624510
52039 1624510 1621660 1618453 1614904 1610658 1605220 1598337 1590069 1580620 1570238 1559164 1547483 1534994 1521269
52026 1521269 1505804 1488268 1468926 1448875 1429511 1411359 1393631 1375241 1356104 1337078 1318785
52015 1318785 1301129 1283999 1267871 1253353 1240521 1228983 1218290 1207931 1197163 1185305 1172095
52004 1172095 1157530 1141542 1124178 1106013 1087985 1070856 1055082 1041015 1028740 1017630 1006504
51993 1006504 994460 981330 967254 952086 935438 917044 896875 875111 852270 829339 807427
$$ packed form
52077A545109j3609j3056j2772j3330j4056j3877j2788j1537j0275q498o190l966
52065A411155k083p1K398N016P446R789J2142J4245J5885J7223J8315J8772J8274
52052A548506J7075J5613J3860J1568Q960O613M699K881J006n45j446j915k365
52039A624510k850l207l549m246n438o883q268r449j0382j1074j1681j2489j3725
52026A521269j5465j7536j9342k0051j9364j8152j7728j8390j9137j9026j8293
52015A318785j7656j7130j6128j4518j2832j1538j0693j0359j0768j1858j3210
52004A172095j4565j5988j7364j8165j8028j7129j5774j4067j2275j1110j1126
51993A006504j2044j3130j4076j5168j6648j8394k0169k1764k2841k2931k1912
$$ plain form
51982 807427 787125 768220 750052 732205 714902 698809 684472 672028 661434 652784 646229 641757
51970 641757 639365 639327 641881 646546 652133 657671 663014 668306 673169 676823 678792 679052 677605 674466 670197
51955 670197 666001 663030 661835 662658 665899 672032 681314 693949 710406 731208 756424 785641 818178
51942 818178 852727 886643 916148 937840 950150 953443 949160 939159 925477 909958 893723 877036
51930 877036 859712 841637 822985 804166 785506 766829 747437 726781 705140 683450 662510
51919 662510 642602 623849 606630 591471 578770 568680 561079 555583 551797 549663 549406 551023 554054
51906 554054 557871 561969 565869 569046 571125 571942 571224 568455 563287 555943 546990 536851 525744 514002
51892 514002 502172 490839 480477 471458 464096 458749 455829 455467 457086 459659 462616 466266 471137 477273
$$ packed form
51982H07427k0302j8905j8168j7847j7303j6093j4337j2444j0594q650o555m472
51970F41757k392l8K554M665N587N538N343N292M863L654J969K60j447l139m269
51955F70197m196k971j195Q23L241O133R282J2635J6457K0802K5216K9217L2537
51942H18178L4549L3916K9505K1692J2310L293m283j0001j3682j5519j6235j6687
51930H77036j7324j8075j8652j8819j8660j8677j9392k0656k1641k1690k0940
51919F62510j9908j8753j7219j5159j2701j0090p601n496l786k134k57J617L031
51906E54054L817M098L900L177K079Q17p18k769n168p344q953j0139j1107j1742
51892E14002j1830j1333j0362r019p362n347k920l62J619K573K957L650M871O136
$$ plain form
51878 477273 484451 492669 501888 511521 520781 529423 537570 544765 549798 551744 550812 548068 544661 541500
51864 541500 539265 538325 538673 540058 542156 544652 547318 549980 552230 553341 552845 551095 548785 545916 541706
51849 541706 535622 527947 519153 509324 498589 487635 477221 467561 458699 451226 445901 442667 440611
51836 440611 439039 438042 437849 438114 438223 438046 438057 438761 440143 441666 442736 443211 443542 444321 445633 446862 447173
51819 447173 446189 444280 442342 441243 441336 442295 443391 443918 443509 442231 440493 438783 437382 436340 435744 435814
51803 435814 436585 437648 438477 439030 439841 441482 444054 447190 450390 453324 455915 458219 460158 461409 461673
51788 461673 461024 459872 458585 457335 456277 455652 455498 455416 454781 453274 451184 449314 448651 449916 453190 457917
51772 457917 463407 469433 476322 484455 493603 502678 510150 514881 516725 516306 514156 510207 504235 496629
$$ packed form
51878D77273P178Q218R219R633R260Q642Q147P195N033J946r32k744l407l161
51864E41500k235r40L48J385K098K496K666K662K250J111m96j750k310k869m210
51849E41706o084p675q794r829j0735j0954j0414r660q862p473n325l234k056
51836D40611j572r97j93K65J09j77J1P04J382J523J070M75L31P79J312J229L11
51819D47173r84j909j938j099R3R59J096N27m09j278j738j710j401j042n96P0
51803D35814P71J063Q29N53Q11J641K572L136L200K934K591K304J939J251K64
51788D61673o49j152j287j250j058o25j54q2o35j507k090j870o63J265L274M727
51772D57917N490O026O889Q133R148R075P472M731J844m19k150l949n972p606
$$ plain form
51758 496629 488423 480550 473376 467022 461715 457476 453676 449421 444457 439382 434893 431129 427894 425189
51744 425189 423233 422143 421896 422519 424029 426222 428786 431646 434936 438591 442255 445716 449222 453193 457677
51729 457677 462140 465743 467859 468545 468650 469308 471246 474609 479298 485113 491335 496483 498919 497872 493879
51714 493879 488435 483257 479563 477620 476872 476643 476698 477074 477615 478019 478339 479083 480724 483185 485846 487859
51698 487859 488461 487201 484019 479154 473138 466981 462075 459413 458754 458800 458331 456990 455010 452648 450109
51683 450109 447664 445418 443123 440559 438072 436410 436003 436586 437481 438061 437995 437337 436462 435795 435623 436290 438444
51666 438444 442744 449285 457617 467389 478647 491261 504261 516053 525227 531062 533424 532579 529211
51653 529211 524438 519607 515925 514168 514614 517237 521918 528326 535451 541505 544582 543577 538403 529467
$$ packed form
51758D96629q206p873p174o354n307m239l800m255m964n075m489l764l235k705
51744D25189j956j090k47O23J510K193K564K860L290L655L664L461L506L971M484
51729D57677M463L603K116O86J05O58J938L363M689N815O222N148K436j047l993
51714D93879n444n178l694j943p48k29N5L76N41M04L20P44J641K461K661K013
51698D87859O02j260l182m865o016o157m906k662o59M6m69j341j980k362k539
51683D50109k445k246k295k564k487j662m07N83Q95N80o6o58q75o67j72O67K154
51666D38444M300O541Q332R772J1258J2614J3000J1792R174N835K362q45l368
51653E29211m773m831l682j757M46K623M681O408P125O054L077j005n174q936
$$ plain form
51639 529467 517332 502965 487894 473588 460678 449055 438710 430100 423545 418675 414857 412013
51627 412013 410529 410344 410577 410323 409578 409047 409138 409411 409038 407591 405328 402830 400454 398130 395622 392957
51611 392957 390465 388400 386721 385347 384385 383875 383552 383227 383287 384427 386878 390228 394019 398144 402642 407596
51595 407596 413447 420951 430491 441621 453462 465140 475571 483310 487205 487162 483981 478731 472695 467513
51581 467513 464542 463955 465013 467388 471709 478630 487828 498256 509134 520410 532432 545356 558877
51568 558877 572518 586344 601138 617413 634271 649898 663536 676586 691434 709529 730917
51557 730917 755184 782103 811228 841282 870149 895415 915065 927997 934125 933994 928350 917988
51545 917988 903696 886000 864932 840239 811981 780942 748554 716333 685256 655680 627879
$$ packed form
51639E29467j2135j4367j5071j4306j2910j1623j0345q610o555m870l818k844
51627D12013j484j85K33k54p45n31R1K73l73j447k263k498k376k324k508k665
51611C92957k492k065j679j374r62n10l23l25O0J140K451L350L791M125M498M954
51595D07596N851P504R540J1130J1841J1678J0431P739L895m3l181n250o036n182
51581D67513k971n87J058K375M321O921R198J0428J0878J1276J2022J2924J3521
51568E58877J3641J3826J4794J6275J6858J5627J3638J3050J4848J8095K1388
51557G30917K4267K6919K9125L0054K8867K5266J9650J2932O128j31n644j0362
51545I17988j4292j7696k1068k4693k8258l1039l2388l2221l1077k9576k7801
$$ plain form
51534 627879 602473 580003 560295 542757 527309 514370 503761 494334 485215 476850 470071 464536
51522 464536 458957 452809 446999 442639 439785 437693 435760 433854 432075 430638 429829 429762 430192 430766 431447 432526
51506 432526 434176 436016 437183 437013 435772 434540 434179 434577 435107 435586 436338 437465 438608 439511 440340 441215
51490 441215 441954 442536 443378 444687 445829 445829 444419 442119 439363 436010 431897 427450 423438 420253 417649 415154
51474 415154 412587 410155 408150 406547 404878 402578 399608 396718 394907 394526 394995 395430 395351 394700 393528 392086
51458 392086 391091 391292 392653 394407 396091 398092 400890 404279 407874 412035 417639 425054 433936 443955
51444 443955 455072 466973 478872 490164 500810 510656 518706 523574 524638 522586 518924 515138 512116
51431 512116 510003 508347 506363 503179 498122 491147 482971 474580 466492 458653 450974 443668 437067 431356
$$ packed form
51534F27879k5406k2470j9708j7538j5448j2939j0609r427r119q365o779n535
51522D64536n579o148n810m360k854k092j933j906j779j437q09o7M30N74O81J079
51506D32526J650J840J167j70j241j232l61L98N30M79P52J127J143R03Q29Q75
51490D41215P39N82Q42J309J142%j410k300k756l353m113m447m012l185k604k495
51474D15154k567k432k005j603j669k300k970k890j811l81M69M35p9o51j172j442
51458C92086r95K01J361J754J684K001K798L389L595M161N604P415Q882J0019
51444D43955J1117J1901J1899J1292J0646R846Q050M868J064k052l662l786l022
51431E12116k113j656j984l184n057o975q176q391q088p839p679p306o601n711
$$ plain form
51417 431356 426650 423130 421019 420466 421363 423010 424203 424162 423457 423558 425314 428290 431683 435296 439309 443685
51401 443685 448317 453376 458873 464128 468301 471437 474512 478406 483276 488938 495402 502880 511569 521588
51387 521588 532978 545664 559622 575096 592487 612034 633812 658048 685180 715519 749005
51376 749005 785301 823898 864081 904897 945022 982250 1013125 1033826 1042089 1038351 1024728 1003092
51364 1003092 974439 939895 901484 861453 821182 781175 741930 704323 669196 637079 608437
51353 608437 583728 562924 545349 530325 517745 507602 499232 491578 484158 477232 470875 464404 457055
51340 457055 448933 440947 433900 427871 422427 417259 412551 408742 405934 403681 401544 399695 398647 398416
51326 398416 398334 397732 396547 395180 394174 394120 395369 397503 399439 400455 400913 401636 402805 403912 404750 405966
$$ packed form
51417D31356m706l520k111n53Q97J647J193m1p05J01J756K976L393L613M013M376
51401D43685M632N059N497N255M173L136L075L894M870N662O464P478Q689J0019
51387E21588J1390J2686J3958J5474J7391J9547K1778K4236K7132L0339L3486
51376G49005L6296L8597M0183M0816M0125L7228L0875K0701Q263l738j3623k1636
51364A003092k8653l4544l8411m0031m0271m0007l9245l7607l5127l2117k8642
51353F08437k4709k0804j7575j5024j2580j0143q370p654p420o926o357o471p349
51340D57055q122p986p047o029n444n168m708l809k808k253k137j849j048k31
51326C98416q2o02j185j367j006n4J249K134J936J016M58P23J169J107Q38J216
$$ plain form
51310 405966 408496 412614 417672 422666 426933 430219 432202 432305 430337 427125 423956 421324 418684 415596
51296 415596 412555 410306 408851 407617 406357 405378 405025 405351 406209 407334 408477 409762 411726 414616 417892
51281 417892 420835 423499 426615 430628 435255 439862 443767 446340 447417 447671 447974 448296 447792 446133 444179
51266 444179 442991 442761 443161 444338 446843 450668 454851 458180 459997 460314 459423 457635 455289 452768 450427
51251 450427 448465 446875 445519 444206 442743 440959 438788 436336 433907 431898 430528 429537 428251 426187
51237 426187 423572 421025 418769 416540 414313 412603 411775 411448 410989 410290 409681 409395 409590 410612 412625 415072
51221 415072 417117 418573 419900 421323 422579 423673 425197 427559 430315 432686 434501 436296 438635 441538
51207 441538 444526 447079 449142 451154 453472 455768 457337 458012 458480 459558 461307 462947 463487 462503 460532
$$ packed form
51310D05966K530M118N058M994M267L286J983J03j968l212l169k632k640l088
51296D15596l041k249j455j234j260r79l53L26Q58J125J143J285J964K890L276
51281D17892K943K664L116M013M627M607L905K573J077K54L03L22n04j659j954
51266D44179j188k30M00J177K505L825M183L329J817L17q91j788k346k521k341
51251D50427j962j590j356j313j463j784k171k452k429k009j370r91j286k064
51237D26187k615k547k256k229k227j710q28l27m59o99o09k86J95J022K013K447
51221D15072K045J456J327J423J256J094J524K362K756K371J815J795K339K903
51207D41538K988K553K063K012K318K296J569O75M68J078J749J640N40r84j971
$$ plain form
51192 460532 458747 458002 458235 458918 459838 460944 461648 461033 458923 456154 453548 451167 448792 446489 444234 441596
51176 441596 438458 435650 434107 433574 432871 431472 430211 430214 431579 433372 434586 434921 434789 434844 435464 436632 438205
51159 438205 440164 442485 444931 447266 449632 452435 455727 458923 461307 462707 463537 464157 464436 464033 463005
51144 463005 461880 461071 460423 459518 458242 456823 455447 454194 453309 453144 453648 454206 454192 453544 452677 452126 452375
51127 452375 453737 456067 458768 461361 464016 467250 471094 474737 477076 477613 476904 476172 476361 477413 478504
51112 478504 478995 479037 479262 480106 481612 483672 486166 488808 491106 492625 493366 493843 494732 496353 498553 501097
51096 501097 504000 507318 510736 513668 515724 516834 517040 516587 516178 516575 517744 518807 519113 518995 519207 519951
51080 519951 520815 521325 521235 520564 519840 520048 521802 524526 526993 528716 530387 532890 536347 540419 545193 551340
$$ packed form
51192D60532j785p45K33O83R20J106P04o15k110k769k606k381k375k303k255k638
51176D41596l138k808j543n33p03j399j261LJ365J793J214L35j32N5O20J168J573
51159D38205J959K321K446K335K366K803L292L196K384J400Q30O20K79m03j028
51144D63005j125q09o48r05j276j419j376j253q85j65N04N58j4o48q67n51K49
51127D52375J362K330K701K593K655L234L844L643K339N37p09p32J89J052J091
51112D78504M91M2K25Q44J506K060K494K642K298J519P41M77Q89J621K200K544
51096E01097K903L318L418K932K056J110K06m53m09L97J169J063L06j18K12P44
51080E19951Q64N10r0o71p24K08J754K724K467J723J671K503L457M072M774O147
$$ plain form
51064 551340 559469 569580 581192 593796 607113 621060 635649 650923 666803 682875 698340 712179
51052 712179 723306 730622 733400 732055 728419 724802 722590 721866 722148 722994 723889 724198 723592 722236 720308
51037 720308 717578 713686 708607 702736 696864 692208 689849 689673 690108 689337 686610 682216 676748 670967 666047
51022 666047 663112 662442 663605 666294 670516 675967 681774 687120 691789 696029 700122 704173 707988 711087
51008 711087 713109 714243 714992 715475 715228 713840 711552 709092 706987 705118 702980 700453 698282 697508 698389
50993 698389 700294 702885 706826 712861 720694 729525 739295 750470 762814 775527 788788 804023 822075
50980 822075 842003 862449 883589 906913 933401 962589 993179 1023917 1054137 1084214 1115581
50969 1115581 1149820 1187713 1229574 1276234 1328889 1387763 1451523 1518405 1587570 1659118 1733148
$$ packed form
51064E51340Q129J0111J1612J2604J3317J3947J4589J5274J5880J6072J5465J3839
51052G12179J1127P316K778j345l636l617k212p24K82Q46Q95L09o06j356j928
51037G20308k730l892n079n871n872m656k359j76M35p71k727m394n468n781m920
51022F66047k935o70J163K689M222N451N807N346M669M240M093M051L815L099
51008G11087K022J134P49M83k47j388k288k460k105j869k138k527k171p74Q81
50993F98389J905K591L941O035P833Q831R770J1175J2344J2713J3261J5235J8052
50980H22075J9928K0446K1140K3324K6488K9188L0590L0738L0220L0077L1367
50969A115581L4239L7893M1861M6660N2655N8874O3760O6882O9165P1548P4030
$$ plain form
50958 1733148 1809190 1886291 1963115 2037902 2108578 2173095 2229758 2277506 2316098 2345983 2367752
50947 2367752 2381669 2387824 2386634 2379040 2366257 2349630 2330674 2310875 2291062 2271057 2250124 2227747
50935 2227747 2203845 2178477 2151728 2123950 2095727 2067301 2038208 2007712 1975441 1941281 1904692
50924 1904692 1864624 1820386 1772480 1722268 1670854 1618544 1565456 1512309 1460296 1410294 1362589
50913 1362589 1317487 1275789 1238269 1204862 1174690 1146894 1121153 1097444 1075640 1055530 1036980
50902 1036980 1019952 1004441 990435 977819 966332 955891 946852 939613 933977 929298 925367 922632
50890 922632 921359 921042 920997 921158 921903 923489 926130 930300 936333 943802 951852 960152 969123 979290 990836
50875 990836 1003738 1017888 1032992 1048762 1065247 1082677 1101013 1120070 1140094 1161738 1185408
$$ packed form
50958A733148P6042P7101P6824P4787P0676O4517N6663M7748L8592K9885K1769
50947B367752J3917O155j190p594j2783j6627j8956j9799j9813k0005k0933k2377
50935B227747k3902k5368k6749k7778k8223k8426k9093l0496l2271l4160l6589
50924A904692m0068m4238m7906n0212n1414n2310n3088n3147n2013n0002m7705
50913A362589m5102m1698l7520l3407l0172k7796k5741k3709k1804k0110j8550
50902A036980j7028j5511j4006j2616j1487j0441r039p239n636m679l931k735
50890I22632j273l17m5J61P45J586K641M170O033P469Q050Q300Q971J0167J1546
50875I90836J2902J4150J5104J5770J6485J7430J8336J9057K0024K1644K3670
$$ plain form
50864 1185408 1211025 1238578 1268529 1301475 1337812 1377914 1422372 1471872 1527088 1588859 1658209
50853 1658209 1736017 1822834 1919154 2025585 2142564 2270044 2407526 2554178 2708864 2870342
50843 2870342 3037633 3209921 3385825 3562835 3737557 3906323 4065381 4210627 4337525
50834 4337525 4441702 4520066 4571670 4597500 4599280 4578546 4537027 4477629 4404622 4322798 4236672
50823 4236672 4150262 4067004 3989647 3920285 3860294 3809662 3766407 3727178 3688624 3647943 3602426
50812 3602426 3549430 3487159 3414932 3332429 3239301 3135891 3023712 2904710 2780498 2652822
50802 2652822 2524252 2397732 2275644 2159748 2051620 1952456 1862671 1782293 1711651 1651058
50792 1651058 1599923 1556809 1520384 1489791 1464200 1442711 1424999 1411473 1402417 1397166 1394314 1392463
$$ packed form
50864A185408K5617K7553K9951L2946L6337M0102M4458M9500N5216O1771O9350
50853A658209P7808Q6817R6320J06431J16979J27480J37482J46652J54686J61478
50843B870342J67291J72288J75904J77010J74722J68766J59058J45246J26898
50834D337525J04177P8364N1604K5830J780k0734m1519n9398p3007q1824q6126
50823D236672q6410q3258p7357o9362n9991n0632m3255l9229l8554m0681m5517
50812C602426n2996o2271p2227q2503r3128j03410j12179j19002j24212j27676
50802B652822j28570j26520j22088j15896j08128r9164q9785q0378p0642o0593
50792A651058n1135m3114l6425l0593k5591k1489j7712j3526r056n251k852j851
$$ plain form
50780 1392463 1390639 1388278 1385142 1381242 1376747 1371897 1366874 1361587 1355643 1348719 1340860 1332200 1322505 1311283
50766 1311283 1298382 1284252 1269651 1255213 1241191 1227378 1213404 1199355 1186054 1174477 1165020
50755 1165020 1157643 1152522 1150032 1150159 1152548 1157324 1165364 1177365 1192954 1211090 1231171 1253475 1278600
50742 1278600 1306811 1338002 1372176 1409812 1451781 1498892 1551559 1609860 1673745 1743089 1817705
50731 1817705 1897493 1982433 2072113 2165285 2260117 2354907 2448399 2539589 2627538 2711346 2789899
50720 2789899 2861557 2924297 2976138 3015141 3039159 3046226 3035531 3007866 2965083 2909547 2844288
50709 2844288 2773241 2700775 2630884 2566680 2510169 2462137 2422428 2390586 2366074 2347762 2333533
50698 2333533 2320810 2307329 2291131 2270096 2242040 2205411 2159743 2105561 2044148 1977301 1906892
$$ packed form
50780A392463j824k361l136l900m495m850n023n287n944o924p859q660r695j1222
50766A311283j2901j4130j4601j4438j4022j3813j3974j4049j3301j1577r457
50755A165020p377n121k490J27K389M776Q040J2001J5589J8136K0081K2304K5125
50742A278600K8211L1191L4174L7636M1969M7111N2667N8301O3885O9344P4616
50731A817705P9788Q4940Q9680R3172R4832R4790R3492R1190Q7949Q3808P8553
50720B789899P1658O2740N1841L9003K4018P067j0695k7665m2783n5536o5259
50709B844288p1047p2466o9891o4204n6511m8032l9709l1842k4512j8312j4229
50698B333533j2723j3481j6198k1035k8056l6629m5668n4182o1413o6847p0409
$$ plain form
50687 1906892 1834594 1762191 1691973 1626285 1566531 1512961 1465524 1424513 1390136 1361897 1338959
50676 1338959 1321055 1308662 1302245 1301630 1306162 1315179 1328129 1344376 1363203 1383991 1406271 1429503
50664 1429503 1452864 1475384 1496343 1515605 1533633 1551171 1568837 1586837 1604904 1622540 1639430
50653 1639430 1655726 1671870 1688121 1704421 1720822 1737916 1756564 1777242 1799892 1824498 1851513
50642 1851513 1881583 1915054 1951914 1991935 2034620 2079203 2125056 2171992 2219777 2267433 2313477
50631 2313477 2356879 2397403 2435041 2469630 2501206 2530183 2556959 2581843 2605618 2629256 2652013
50620 2652013 2669935 2677316 2670350 2649532 2618996 2584185 2549923 2519502 2494571 2475646 2462767 2455583
50608 2455583 2453035 2453534 2455682 2458437 2460407 2459406 2453014 2439378 2417379 2386513 2346942 2299274 2243882
$$ packed form
50687A906892p2298p2403p0218o5688n9754n3570m7437m1011l4377k8239k2938
50676A338959j7904j2393o417o15M532R017J2950J6247J8827K0788K2280K3232
50664A429503K3361K2520K0959J9262J8028J7538J7666J8000J8067J7636J6890
50653A639430J6296J6144J6251J6300J6401J7094J8648K0678K2650K4606K7015
50642A851513L0070L3471L6860M0021M2685M4583M5853M6936M7785M7656M6044
50631B313477M3402M0524L7638L4589L1576K8977K6776K4884K3775K3638K2757
50620B652013J7922P381o966k0818l0536l4811l4262l0421k4931j8925j2879p184
50608B455583k548M99K148K755J970j001o392j3636k1999l0866l9571m7668n5392
$$ plain form
50595 2243882 2180739 2110387 2034853 1957132 1879808 1804410 1731832 1662735 1597566 1536660 1480462
50584 1480462 1429373 1383366 1342069 1305191 1272549 1243793 1218628 1197319 1180405 1167728 1158288
50573 1158288 1151371 1147335 1146889 1149908 1155485 1162891 1172054 1183299 1197057 1213654 1232806 1253324 1273875
50560 1273875 1294197 1315096 1337138 1359854 1382589 1405702 1430417 1457609 1487171 1518511 1551206
50549 1551206 1584970 1619213 1652945 1685230 1715761 1745014 1773791 1802681 1831978 1862134 1893999
50538 1893999 1928614 1966967 2010131 2059260 2114984 2176765 2243141 2312682 2384580 2458640 2535348
50527 2535348 2616158 2703086 2797406 2898679 3005247 3115523 3228516 3343237 3457933 3569958
50517 3569958 3676167 3773456 3859304 3932074 3990764 4034423 4061876 4072071 4064588 4039744 3998322
$$ packed form
50595B243882o3143p0352p5534p7721p7324p5398p2578o9097o5169o0906n6198
50584A480462n1089m6007m1297l6878l2642k8756k5165k1309j6914j2677r440
50573A158288o917m036m46L019N577P406R163J1245J3758J6597J9152K0518K0551
50560A273875K0322K0899K2042K2716K2735K3113K4715K7192K9562L1340L2695
50549A551206L3764L4243L3732L2285L0531K9253K8777K8890K9297L0156L1865
50538A893999L4615L8353M3164M9129N5724O1781O6376O9541P1898P4060P6708
50527B535348Q0810Q6928R4320J01273J06568J10276J12993J14721J14696J12025
50517C569958J06209R7289Q5848P2770N8690M3659K7453J0195p483k4844m1422
$$ plain form
50506 3998322 3941308 3869949 3786112 3692653 3593428 3492768 3394813 3303271 3221553 3152698 3098805
50495 3098805 3060620 3037866 3029933 3035995 3054454 3082599 3117088 3154649 3192038 3225392 3250004 3260978
50483 3260978 3254107 3226341 3176141 3104073 3013052 2907372 2791149 2667665 2540034 2411777
50473 2411777 2286247 2165701 2051368 1944339 1845954 1757289 1678654 1609708 1549735 1497632
50463 1497632 1452002 1411730 1376510 1346627 1322215 1302893 1288106 1277643 1271691 1270432 1273652 1280777
50451 1280777 1291290 1305027 1321960 1341639 1363091 1385448 1408630 1433173 1459458 1487435 1517195
50440 1517195 1549397 1584579 1621892 1658643 1691119 1715901 1730780 1735238 1730586 1719586 1705473 1690898
50428 1690898 1677488 1665959 1656435 1648796 1643114 1639819 1639354 1641726 1646626 1654018 1664410 1678472 1696544
$$ packed form
50506C998322n7014p1359q3837r3459r9225j00660r7955r1542q1718o8855n3893
50495C098805l8185k2754p933O062J8459K8145L4489L7561L7389L3354K4612J0974
50483C260978o871k7766n0200p2068r1021j05680j16223j23484j27631j28257
50473B411777j25530j20546j14333j07029r8385q8665p8635o8946n9973n2103
50463A497632m5630m0272l5220k9883k4412j9322j4787j0463n952j259L220P125
50451A280777J0513J3737J6933J9679K1452K2357K3182K4543K6285K7977K9760
50440A517195L2202L5182L7313L6751L2476K4782J4879M458m652j1000j4113j4575
50428A690898j3410j1529r524p639n682l295m65K372M900P392J0392J4062J8072
$$ plain form
50415 1696544 1718642 1744814 1775368 1810822 1851624 1897773 1948603 2002969 2059691 2117787 2176397
50404 2176397 2234703 2291940 2347252 2399491 2447356 2489835 2526324 2556258 2578848 2593310 2599008
50393 2599008 2595103 2580267 2553155 2513289 2461442 2399383 2329535 2254776 2178149 2102456 2030031
50382 2030031 1962730 1901966 1848767 1803949 1768242 1742188 1725948 1719210 1721151 1730396 1745184 1763692
50370 1763692 1784033 1803894 1820572 1831717 1835847 1831934 1818952 1796573 1766181 1730513 1692068 1652301
50358 1652301 1612217 1572767 1534007 1494445 1452070 1406121 1357618 1308406 1260217 1214444 1172097
50347 1172097 1133564 1098720 1067522 1040376 1017754 999634 985411 974281 965603 959061 954690 952719
50335 952719 953152 955402 958411 961210 963428 965278 967195 969533 972560 976546 981677 987830 994583 1001597
$$ packed form
50415A696544K2098K6172L0554L5454M0802M6149N0830N4366N6722N8096N8610
50404B176397N8306N7237N5312N2239M7865M2479L6489K9934K2590J4462N698
50393B599008l905j4836k7112l9866n1847o2059o9848p4759p6627p5693p2425
50382B030031o7301o0764n3199m4818l5707k6054j6240o738J941R245J4788J8508
50370A763692K0341J9861J6678J1145M130l913j2982k2379l0392l5668l8445l9767
50358A652301m0084l9450l8760l9562m2375m5949m8503m9212m8189m5773m2347
50347A172097l8533l4844l1198k7146k2622j8120j4223j1130q678o542m371j971
50335I52719M33K250L009K799K218J850J917K338L027L986N131O153O753P014
$$ plain form
50321 1001597 1009077 1017727 1028173 1040425 1053996 1068493 1083862 1099972 1116206 1131739 1146268 1160291
50309 1160291 1174667 1190065 1206830 1225216 1245680 1269057 1296448 1328735 1366207 1408768 1456499
50298 1456499 1509854 1569553 1636496 1710952 1789920 1864207 1919299 1941608 1925682 1876171 1803616
50287 1803616 1718921 1630776 1545618 1467722 1398992 1339558 1288978 1246867 1212679 1185573 1164790
50276 1164790 1149937 1140727 1136609 1136817 1140802 1148523 1160250 1175996 1195190 1216969 1240759 1266388
50264 1266388 1293619 1321729 1349669 1376531 1401784 1425220 1446860 1466953 1485966 1504446 1522672
50253 1522672 1540168 1555547 1567030 1573269 1573639 1567872 1555730 1537190 1512783 1483676 1451539 1418394
50241 1418394 1386317 1357053 1331752 1310871 1294016 1279810 1266301 1251809 1235498 1217238 1197276
$$ packed form
50321A001597P480Q650J0446J2252J3571J4497J5369J6110J6234J5533J4529J4023
50309A160291J4376J5398J6765J8386K0464K3377K7391L2287L7472M2561M7731
50298A456499N3355N9699O6943P4456P8968P4287N5092K2309j5926m9511p2555
50287A803616q4695q8145q5158p7896o8730n9434n0580m2111l4188k7106k0783
50276A164790j4853r210m118K08L985P721J1727J5746J9194K1779K3790K5629
50264A266388K7231K8110K7940K6862K5253K3436K1640K0093J9013J8480J8226
50253A522672J7496J5379J1483O239L70n767j2142j8540k4407k9107l2137l3145
50241A418394l2077k9264k5301k0881j6855j4206j3509j4492j6311j8260j9962
$$ plain form
50230 1197276 1176130 1154571 1133475 1113740 1096243 1081523 1069378 1059070 1050099 1042457 1036023 1030112
50218 1030112 1024044 1017881 1012154 1007015 1002051 996845 991304 985367 978827 971603 964016 956655 950031 944302
50204 944302 939217 934250 928830 922425 914632 905562 896192 887811 880774 874177 867138 859987 853655 848237
50190 848237 842935 837328 831885 827115 822971 819422 817007 816306 817199 818954 820779 822004 822180 821414 820367
50175 820367 819518 818641 817380 816081 815616 816491 818471 820925 823167 824671 825511 826607 829103 833460 839505
50160 839505 847249 857042 868849 882028 896209 911961 930265 951703 976615 1005700 1039834 1079265
50148 1079265 1123321 1170793 1220197 1269728 1317488 1362131 1403190 1440806 1475413 1507693 1538487
50137 1538487 1568414 1597547 1625282 1650161 1669733 1681109 1682175 1672404 1652454 1623227 1585576 1540755
$$ packed form
50230A197276k1146k1559k1096j9735j7497j4720j2145j0308q971p642o434n911
50218A030112o068o163n727n139m964n206n541n937o540p224p587p361o624n729
50204I44302n085m967n420o405p793r070r370q381p037o597p039p151o332n418
50190H48237n302n607n443m770m144l549k415p01Q93J755J825J225J76p66j047
50175H20367q49q77j261j299m65Q75J980K454K242J504Q40J096K496M357O045
50160H39505P744R793J1807J3179J4181J5752J8304K1438K4912K9085L4134L9431
50148A079265M4056M7472M9404M9531M7760M4643M1059L7616L4607L2280L0794
50137A538487K9927K9133K7735K4879J9572J1376J066r771j9950k9227l7651m4821
$$ plain form
50125 1540755 1490739 1437884 1384287 1331419 1280250 1231757 1187287 1148214 1115031 1086870 1062125
50114 1062125 1039533 1018585 999193 981407 965500 951933 940991 932604 926666 923318 922598 923816
50102 923816 925444 925854 924300 921220 917600 914029 910422 906503 902265 897848 893336 888971 885313 882677
50088 882677 880439 877379 872881 867498 862214 857480 853188 849256 845886 843327 841683 841014 841477 843307 846644
50073 846644 851334 857013 863467 870842 879276 888468 897922 907531 917504 927662 937338 946188 954577 962827
50059 962827 970481 976795 981623 985298 987897 989200 989318 988738 987719 986191 984379 983013 982612 982950 983515
50044 983515 984213 985381 987418 990791 996186 1004180 1014730 1027343 1041820 1058563 1077995 1100006 1124333
50031 1124333 1151340 1181961 1216591 1254295 1293395 1332762 1372104 1410966 1447888 1481045 1509653
$$ packed form
50125A540755n0016n2855n3597n2868n1169m8493m4470l9073l3183k8161k4745
50114A062125k2592k0948j9392j7786j5907j3567j0942q387n938l348p20J218
50102I23816J628M10j554l080l620l571l607l919m238m417m512m365l658k636
50088H82677k238l060m498n383n284m734m292l932l370k559j644o69M63J830L337
50073H46644M690N679O454P375Q434R192R454R609R973J0158R676Q850Q389Q250
50059I62827P654O314M828L675K599J303J18n80j019j528j812j366m01L38N65
50044I83515O98J168K037L373N395P994J0550J2613J4477J6743J9432K2011K4327
50031A124333K7007L0621L4630L7704L9100L9367L9342L8862L6922L3157K8608
$$ plain form
50020 1509653 1534434 1556647 1576939 1595183 1610997 1623873 1632651 1635241 1629353 1613708 1588499 1554762
50008 1554762 1513753 1467143 1417404 1367223 1318372 1271512 1227182 1186491 1150571 1119786 1093850
49997 1093850 1072342 1054619 1039538 1025903 1013262 1001854 991794 982654 973795 964588 954339 942567
49985 942567 929565 916212 902978 889504 875417 861133 847477 834883 823475 813662 805987 800345
49973 800345 795831 791561 787362 783573 780516 778301 776845 775792 774586 772832 770561 768121 766067 765279
49959 765279 766724 770556 775605 780371 784707 789980 797310 805983 814029 820056 824064 826688 828356 829342
49945 829342 829995 830394 829965 827863 823801 818271 812031 805600 799268 793295 787843 782696 777227 770840 763503
49930 763503 755775 748232 740957 733731 726644 720315 715420 712071 709727 707702 705843 704722 705037 706769
$$ packed form
50020A509653K4781K2213K0292J8244J5814J2876Q778K590n888j5645k5209l3737
50008A554762m1009m6610m9739n0181m8851m6860m4330m0691l5920l0785k5936
49997A093850k1508j7723j5081j3635j2641j1408j0060r140q859r207j0249j1772
49985I42567j3002j3353j3234j3474j4087j4284j3656j2594j1408r813p675n642
49973H00345m514m270m199l789l057k215j456j053j206j754k271k440k054p88
49959G65279J445L832N049M766M336N273P330Q673Q046O027M008K624J668R86
49945H29342O53L99m29k102m062n530o240o431o332n973n452n147n469o387p337
49930G63503p728p543p275p226p087o329m895l349k344k025j859j121L15J732
$$ plain form
49916 706769 709177 711754 714865 719126 724434 730105 735795 741706 747982 754611 762034 771121 782135 794184
49902 794184 805970 816593 825434 831948 836187 839074 841568 843741 844978 844642 842143 836930 829102 819736
49888 819736 809953 799955 789583 779375 770180 761944 753892 745928 738869 733152 728225 723581 719588 716785
49874 716785 714984 713638 712760 713020 715128 719285 724916 730773 735730 739775 743891 748851 754568 760766 767691
$$ packed form
49916G06769K408K577L111M261N308N671N690N911O276O629P423R087J1014J2049
49902G94184J1786J0623Q841O514M239K887K494K173J237l36k499n213p828r366
49888H19736r783r998j0372j0208r195q236q052p964p059n717m927m644l993k803
49874G16785j801j346q78K60K108M157N631N857M957M045M116M960N717O198O925
$$ [...]
##END NTUPLES=NMR SPECTRUM
##END=
