##TITLE=AC1643_HPIAH13376_8569605_5OwWgHdadT
##JCAMPDX= 6.0         $$ Bruker NMR JCAMP-DX V2.0
##DATA TYPE= NMR SPECTRUM
##DATA CLASS= NTUPLES
##ORIGIN= BRUKER
##OWNER= Administrator
$$ 1.72 TOPSPIN		Version 2.1
$$ 2014-04-10 18:52:54.583 -0700  Administrator@X
$$ Compression mode = diff/dup
##.OBSERVE FREQUENCY= 400.02188249412
##.OBSERVE NUCLEUS= ^1H
##.ACQUISITION MODE= SIMULTANEOUS (DQD)
##.ACQUISITION SCHEME= undefined
##.AVERAGES= 8
##.DIGITISER RES= 22
##SPECTROMETER/DATA SYSTEM= spect
##.PULSE SEQUENCE= zg30
##.SOLVENT NAME= COFFEE_meoh
##.SHIFT REFERENCE= INTERNAL, COFFEE_meoh, 1, 14.98509
##AUDIT TRAIL= $$ (NUMBER, WHEN, WHO, WHERE, PROCESS, VERSION, WHAT)
$$ ##TITLE= Audit trail, TOPSPIN		Version 2.1
$$ ##JCAMPDX= 5.01
$$ ##ORIGIN= Bruker BioSpin GmbH
$$ ##OWNER= Administrator
$$ $$ E:\/data/COFFEE/nmr/AC1643_HPIAH13376_8569605_5OwWgHdadT/10/pdata/1/auditp.txt
$$ ##AUDIT TRAIL=  $$ (NUMBER, WHEN, WHO, WHERE, PROCESS, VERSION, WHAT)
(   1,<2014-04-10 18:52:45.778 -0700>,<Administrator>,<X>,<go>,<TOPSPIN 2.1>,
      <created by zg
	started at 2014-04-10 18:51:39.559 -0700,
	POWCHK enabled, PULCHK disabled,
       configuration hash MD5:
       C8 4E 4E 5D D3 5C D8 9E 9F 52 82 E0 59 8A DE 15
       data hash MD5: 64K
       54 D9 3C 56 3A 3E 02 A6 A7 66 8E 81 98 70 EB 3B>)
(   2,<2014-04-10 18:52:49.306 -0700>,<Administrator>,<X>,<proc1d>,<TOPSPIN 2.1>,
      <Start of raw data processing
       efp LB = 0 FT_mod = 6 PKNL = 1 PHC0 = 0 PHC1 = 0 SI = 32K 
       data hash MD5: 32K
       A8 6D 8B A7 8F 59 33 09 1C 09 7A 18 CC 3D 8C 66>)
(   3,<2014-04-10 18:52:49.839 -0700>,<Administrator>,<X>,<proc1d>,<TOPSPIN 2.1>,
      <pk PHC0 = 96.16882 PHC1 = 0 
       data hash MD5: 32K
       61 CC 54 78 C5 C2 57 63 6D DE 0D 03 D8 0C F5 FE>)
(   4,<2014-04-10 18:52:50.080 -0700>,<Administrator>,<X>,<proc1d>,<TOPSPIN 2.1>,
      <abs ABSG = 1 
       data hash MD5: 32K
       D1 D3 88 6A 3F 24 1B F0 10 79 8A 57 96 64 75 B8>)
(   5,<2014-04-10 18:52:50.234 -0700>,<Administrator>,<X>,<proc1d>,<TOPSPIN 2.1>,
      <abs ABSG = 2 
       data hash MD5: 32K
       31 DF F0 74 BA 05 58 A6 52 05 F7 A5 9E C5 8E F6>)
(   6,<2014-04-10 18:52:50.423 -0700>,<Administrator>,<X>,<proc1d>,<TOPSPIN 2.1>,
      <abs ABSG = 3 
       data hash MD5: 32K
       B5 68 74 73 35 97 5C 4E 54 B3 97 8F 22 FA 95 01>)
(   7,<2014-04-10 18:52:50.544 -0700>,<Administrator>,<X>,<proc1d>,<TOPSPIN 2.1>,
      <abs ABSG = 4 
       data hash MD5: 32K
       DF 6F 84 67 1A AB C2 DE 8F C8 3B 96 6A 5E 4D 23>)
(   8,<2014-04-10 18:52:50.716 -0700>,<Administrator>,<X>,<proc1d>,<TOPSPIN 2.1>,
      <abs ABSG = 5 
       data hash MD5: 32K
       ED 7E 17 4D D7 E6 A7 B8 9A 49 D6 95 FA 33 CC 06>)
$$ ##END=
$$ 
$$ $$ hash MD5
$$ $$ 9B 61 4C 3F 33 A4 BB EA 2E EA DD 53 65 03 68 E9
##$RELAX= 
##$RELAX= 
##$RELAX= 
##$RELAX= 
##$RELAX= 
##$RELAX= 
##$RELAX= 
$$ Bruker specific parameters
$$ --------------------------
##$DU= <E:\>
##$EXPNO= 10
##$NAME= <AC1643_HPIAH13376_8569605_5OwWgHdadT>
$$ [...]
##$TP= (0..7)
150 150 150 150 150 150 150 150
##$TP07= 0
##$TPNAME0= <>
##$TPNAME1= <>
##$TPNAME2= <>
##$TPNAME3= <>
##$TPNAME4= <>
##$TPNAME5= <>
##$TPNAME6= <>
##$TPNAME7= <>
##$TPOAL= (0..7)
0.5 0.5 0.5 0.5 0.5 0.5 0.5 0.5
##$TPOFFS= (0..7)
0 0 0 0 0 0 0 0
##$TUNHIN= 0
##$TUNHOUT= 0
##$TUNXOUT= 0
##$USERA1= <user>
##$USERA2= <user>
##$USERA3= <user>
##$USERA4= <user>
##$USERA5= <user>
##$V9= 5
##$VALIST= <valist>
##$VCLIST= <CCCCCCCCCCCCCCC>
##$VD= 0
##$VDLIST= <DDDDDDDDDDDDDDD>
##$VPLIST= <PPPPPPPPPPPPPPP>
##$VTLIST= <TTTTTTTTTTTTTTT>
##$WBST= 1024
##$WBSW= 4
##$XGAIN= (0..3)
0 0 0 0
##$XL= 0
##$YL= 0
##$YMAX_a= 631256
##$YMIN_a= -534553
##$ZGOPTNS= <>
##$ZL1= 120
##$ZL2= 120
##$ZL3= 120
##$ZL4= 120
##$ABSF1= 14.98509
##$ABSF2= -5.573092
##$ABSG= 5
##$ABSL= 3
##$ALPHA= 0
##$AQORDER= 0
##$ASSFAC= 0
##$ASSFACI= 0
##$ASSFACX= 0
##$ASSWID= 0
##$AUNMP= <proc_prof1d_extract_pilot.lims>
##$AXLEFT= 0
##$AXNAME= <>
##$AXNUC= <1H>
##$AXRIGHT= 0
##$AXTYPE= 0
##$AXUNIT= <>
##$AZFE= 0.1
##$AZFW= 0.1
##$BCFW= 0
##$BC_mod= 0
##$BYTORDP= 0
##$COROFFS= 0
##$CY= 15
##$DATMOD= 1
##$DC= 0
##$DFILT= <>
##$DTYPP= 0
##$F1P= 0
##$F2P= 0
##$FCOR= 0.5
##$FTSIZE= 32768
##$FT_mod= 6
##$GAMMA= 0
##$GB= 0
##$INTBC= 1
##$INTSCL= 1
##$ISEN= 128
##$LB= 0
##$LEV0= 0
##$LPBIN= 0
##$MAXI= 10000
##$MC2= 0
##$MEAN= 0
##$ME_mod= 0
##$MI= 0
##$NCOEF= 0
##$NC_proc= -8
##$NLEV= 6
##$NOISF1= 0
##$NOISF2= 0
##$NSP= 0
##$NTH_PI= 0
##$NZP= 0
##$OFFSET= 14.98509
##$PC= 1
##$PHC0= 96.16882
##$PHC1= 0
##$PH_mod= 1
##$PKNL= yes
##$PPARMOD= 0
##$PPDIAG= 0
##$PPIPTYP= 0
##$PPMPNUM= 2147483647
##$PPRESOL= 1
##$PSCAL= 4
##$PSIGN= 0
##$PYNMP= <proc.py>
##$REVERSE= no
##$SF= 400.02
##$SI= 32768
##$SIGF1= 0
##$SIGF2= 0
##$SINO= 400
##$SIOLD= 32768
##$SPECTYP= <>
##$SREGLST= <1H.CDCl3>
##$SSB= 0
##$STSI= 32768
##$STSR= 0
##$SW_p= 8223.68421052631
##$SYMM= 0
##$S_DEV= 0
##$TDeff= 65536
##$TDoff= 0
##$TI= <>
##$TILT= no
##$TM1= 0
##$TM2= 0
##$TOPLEV= 0
##$USERP1= <user>
##$USERP2= <user>
##$USERP3= <user>
##$USERP4= <user>
##$USERP5= <user>
##$WDW= 1
##$XDIM= 32768
##$YMAX_p= 449478779
##$YMIN_p= -665776
##$CURPLOT= <Network HP LaserJet P1505>
##$CURPRIN= <$Network HP LaserJet P1505>
##$DFORMAT= <normdp>
##$LAYOUT= <+/1D_H.xwp>
##$LFORMAT= <normlp>
##$PFORMAT= <normpl>
##$SURQMSG= 1
$$ End of Bruker specific parameters
$$ ---------------------------------
##NTUPLES= NMR SPECTRUM
##VAR_NAME=  FREQUENCY,     SPECTRUM/REAL,   SPECTRUM/IMAG
##SYMBOL=    X,             R,               I
##VAR_TYPE=  INDEPENDENT,   DEPENDENT,       DEPENDENT
##VAR_FORM=  AFFN,          ASDF,            ASDF
##VAR_DIM=   32768,         32768,           32768
##UNITS=     HZ,            ARBITRARY UNITS, ARBITRARY UNITS
##FACTOR=    0.250966925370066, 1,           1
##FIRST=     8223.43324360094, 18318,        -71954
##LAST=      0,             -37506,          12530
##MIN=       0,             -665776,         0
##MAX=       8223.43324360094, 449478779,    0
$$ Real data points
##PAGE= N=1
##DATA TABLE= (X++(R..R)), XYDATA
$$ [...]
19544b52515A72466A7317K17892D9694h3974A785a94185M6757d1136A2772a011
19532d00877a08165k12964J3132C307J0538K34432a4575k42448q871C1156c11946
19520f9878B62911c0493H2344d27499A74542j9826C2245J09270c22723c8390j80403
19509b18793Q3598o5905a4590A76984d5992I9699L66986f4356k09365a4611E7349
19497a34889B5990i730l61255F1859f8588G6722b15458c7762m168f665k11057
19486b17722K397K9803Q4831J4829j15282D9384a8107k67297a05353K8781A86616
19474A3350b2018j04175A35057D5559a63553j01979a602l33428J48481M701j66632
19463c48480P2949A71714a79937j17567c2317A2772d69014A60600A8797a11042
$$ y = [-252515, 172466, 17317, 235209, 49694, -83974, 1785, -194185, -147428, -41136, 12772, -1011, -400877, -108165, -321129, -307997, 3307, 13845, 248277, -14575, -257023, -265894, 31156, -311946, -69878, 262911, -30493, 82344, -427499, 174542, 154716, 32245, 141515, -322723, -38390, -218793, -135195, -201100, -14590, 176984, -45992, 99699, 466685, -64356, -273721, -14611, 57349, -134889, 25990, -9730, -370985, 61859, -68588, 76722, -215458, -37762, -41930, -6665, -217722, -215325, -185522, -100691, -85862, -201144, 49384, -18107, -285404, -105353, -76572, 186616, 13350, -22018, -126193, 135057, 45559, -163553, -265532, -1602, -335030, -186549, -181848, -348480, -275531, 171714, -179937, -297504, -32317, 12772, -469014, 160600, 18797, -111042]
19452B66267a70751j3629D0367b49939c1310j66517a2959k63916O3599A00842
19441a36584E5738a4989D6688a74334B53291a52571a5811j47296D59107e23431
19430B36967c29897F1773c23701e9274j3273C35683b2510B3034g0953C23240B5396
19418a12934A54658H653J32693b17427F1163R8365c5753B21906g617G7010c7405
19406a26822A3531b06866B47935a10179m5161B0370J10664c4717G8029a97122
19395A91663a59841j91874H5506b94231J12421n8317a16671E774J53795A6656
19384A77764p8688K77850b13229A84952d44018E7588H020c35093B24724b78655
19373f799j2432B5678g5716H4786r060a61570n9303J2350k84887j16745b7915
$$ y = [266267, -170751, -184380, 40367, -249939, -31310, -197827, -12959, -276875, -213276, 100842, -136584, 55738, -14989, 46688, -174334, 253291, -152571, -15811, -163107, 459107, -523431, 236967, -329897, 61773, -323701, -59274, -72547, 335683, -22510, 23034, -70953, 323240, 25396, -112934, 154658, 8653, 141346, -217427, 61163, 159528, -35753, 221906, -7617, 77010, -37405, -126822, 13531, -206866, 247935, -110179, -155340, 20370, 131034, -34717, 78029, -197122, 191663, -159841, -351715, 85506, -294231, -181810, -240127, -116671, 5774, 159569, 16656, 177764, 99076, 376926, -213229, 184952, -444018, 57588, 8020, -335093, 224724, -278655, -6799, -19231, 25678, -75716, 84786, 75726, -161570, -220873, -208523, -493410, -610155, -27915]
19361a5712m38191K02408A65945B7986L3585a51589j35256A96795P2860a11265
19350d57051i1326b2788p8833J900B233b11654Q7618e7311A86371i1121A56863
19338b28007j53908a59746N3635A62325A0044J37658D9446e0502a9804j36913
19328a56717k64097N9001J25896J02117k41729A49258a88112C8708h7378B3938
19317I2194c46063I0234c58133d0449I9712M6967m4430c8338E376e1620F2562
19305f8385k2701k86013D3470a57307n0642r3038c0826r3261e508k61694B01109
19293B5089f18263A84493O3598d3442l17337A21395e793A88593c79043B18546
19282b37685A31605a01A30146L0468D8548k2546j0630a74898m4804P6843f5242
$$ y = [-15712, -453903, -251495, 165945, 27986, 61571, -151589, -286845, 196795, 269655, -111265, -457051, -91326, -22788, -101621, -99721, 2233, -211654, -124036, -57311, 186371, -91121, 156863, -228007, -381915, -159746, -106111, 162325, 10044, 147702, 49446, -50502, -19804, -156717, -420814, -361813, -235917, -133800, -375529, 149258, -188112, 38708, -87378, 23938, 92194, -346063, 90234, -358133, -40449, 99712, 146679, 102249, -38338, 5376, -51620, 62562, -68385, -91086, -377099, 43470, -157307, -207949, -300987, -30826, -124087, -5508, -267202, 201109, 25089, -618263, 184493, 248091, -43442, -360779, 121395, -5793, 188593, -379043, 218546, -237685, 131605, -101, 130146, 160614, 48548, 26002, 15372, -174898, -219702, -142859, -65242]
19270a55398A61619c07348d3938a4804j71465A20231K6779B5702a90283J3099
19260a77184D098a86489D0060f2560G3961B0862O0935P1660C8421g5476A81229
19248D8613a17482A12933b45093e7534k14435P1376C3284K58744b22277C9288
19237A55876d68470a59736N0380k08318a22970j81727H7479f9466A27505k2918
19227A04587c1575j05312K3342j16413B636K16126b34222c3316j34785B46321
19216a43762k6888g0937a8760F5530B0310d4424k37230E2807a06916G5051C269
19204a43696A85841q9834i0045c4907r0042J5433m1554K4113R24E7213a44743
19192a57119r4492r2848B14015j00934c21170E125K16449a16929A73850b7742
$$ y = [-155398, 161619, -307348, -43938, -14804, -186269, 120231, 147010, 25702, -190283, -177184, 4098, -186489, 40060, -62560, 73961, 20862, 81797, 153457, 38421, -75476, 181229, 48613, -117482, 112933, -245093, -57534, -271969, -200593, 33284, 292028, -222277, 39288, 155876, -468470, -159736, -109356, -317674, -122970, -304697, 87479, -69466, 127505, 104587, -31575, -136887, -113545, -229958, 2636, 218762, -234222, -33316, -168101, 246321, -143762, -170650, -70937, -18760, 65530, 20310, -44424, -281654, 52807, -106916, 75051, 3269, -143696, 185841, 96007, -90045, -34907, -124949, -109516, -151070, -126957, -126033, 57213, -144743, -157119, -251611, -344459, 214015, 113081, -321170, 5125, 221574, -116929, 173850, -27742]
19181b34901f054A34320k7997l1793a46880M2790M6170j93921R3089N0598H525
19169a9865k43609A61119g5859b3976k01217A90886I0116O029b76639O4064A92794
19157b19544b7477j6271j45280i3868r2184A90306d9060n8771M063A33797D4910
19145A05249I086J2539a71599A18647b31473J0426e7460n151A03102N9486D1242
19133C966N8936a21069B9184a79602A93391b11786Q4179j3081f8264j7790k98412
19122c84466e9158j87816i2852J3434j30654C596a53438B39540A2627b75909H3022
19110c18090D0014J6864a36973j17376e4389G0492a43401a5061C36982A4957J21389
19099A36346A9748K85036b17451L7918n6802e0582C8115L0380J43871F2256a815
$$ y = [-234901, -6054, 134320, 106323, 74530, -146880, -104090, -57920, -251841, -158752, -108154, 8525, -19865, -263474, 161119, -75859, -23976, -225193, 190886, 90116, 96145, -276639, -212575, 192794, -219544, -27477, -43748, -189028, -93868, -186052, 190306, -49060, -107831, -103768, 133797, 44910, 105249, 9086, 21625, -171599, 118647, -231473, -221047, -57460, -62611, 103102, 162588, 41242, 3966, 62902, -121069, 29184, -179602, 193391, -211786, -127607, -140688, -68264, -86054, -384466, -59158, -246974, -92852, -79418, -210072, 3596, -153438, 239540, 12627, -275909, 83022, -318090, 40014, 56878, -136973, -254349, -54389, 70492, -143401, -15061, 336982, 14957, 136346, 19748, 304784, -217451, -179533, -236335, -50582, 38115, 68495, 212366, 62256, -1815]
19087a46389A62897n3969a93046c179G1060e7278j01182a0791A30075K8817A5221
19075A17966J05445q9975C5069c03973A38590D1250J11577F48K25680a53956j30884
19064b84840N5616F2110a85529A95984a20489n8565l54571g0366n7315C33765
19053b04919j81311a74088g8607A5448a09466C9439f2737j19630B7190c9772G096
19041C8505b83144a36936A35722a18935n5549f3961F3260a48155I6358n249K65748
19030C56857M6641c4769A92345R0405c2792A22668g3614B32218q5362E9957P8521
19019A38478a84845D3733Q2938m3913a73751D65760I7840d0535B61188c8753H9716
19007e286A91316b25344R855b4199l04478A47523p0460b91131C4836g5517q5074
$$ y = [-146389, 162897, 108928, -193046, -3179, 71060, -57278, -158460, -10791, 130075, 158892, 15221, 117966, 223411, 133436, 35069, -303973, 138590, 41250, 152827, 648, 226328, -153956, -284840, -229224, 62110, -185529, 195984, -120489, -179054, -533625, -70366, -127681, 333765, -204919, -386230, -174088, -78607, 15448, -109466, 39439, -62737, -182367, 27190, -39772, 7096, 38505, -283144, -136936, 135722, -118935, -174484, -63961, 63260, -148155, 96358, 91109, 356857, 403498, -34769, 192345, 282750, -32792, 122668, -73614, 232218, 146856, 59957, 138478, -184845, 43733, 126671, 82758, -173751, 465760, 97840, -40535, 261188, -38753, 89716, -5286, 191316, -225344, -215489, -24199, -328677, 147523, 77063, -291131, 34836, -75517, -160591]
18996a60591f8631o7052I9143g9234B81105j11073a91988h8067n6484E96J95176
18985A95772a78758I3276D3270b92902C34938b47997B33998d6777B09769b82041
18974A49336c3704l91123a78376o5787b9681o9969K7620B84211C1270g9520E2659
18962a3340p0574B02870c19867A76574c2655r3080B85942A36689b83046B0470
18951B15159i4798j17645J652b2011Q062m4834B54139J3468a13805A65526b84833
18939a12113F2919l425b54754j52747A96585l7887B0174J82706o8432J73628m7474
18928B60602a73892h2372K0804a9970j79917C5301m633K410a50958B58286h5059
18916a84011p964P2445K3747p4638B09449a37461B08325I9011a13954f006r2990
$$ y = [-160591, -68631, -135683, 99143, -79234, 281105, 170032, -191988, -88067, -144551, 596, 195772, -178758, 93276, 43270, -292902, 334938, -247997, 233998, -46777, 209769, -282041, 149336, -33704, -424827, -178376, -244163, -29681, -99650, -72030, 284211, 31270, -79520, 52659, -13340, -83914, 202870, -319867, 176574, -32655, -125735, 285942, 136689, -283046, 20470, 215159, -94798, -212443, -210791, -22011, -13949, -58783, 254139, 267607, -113805, 165526, -284833, -112113, 62919, 59494, -254754, -407501, 196585, 158698, 20174, 202880, 134448, 308076, 260602, -173892, -82372, -61568, -19970, -199887, 35301, 30668, 33078, -150958, 258286, -85059, -184011, -191975, -119530, -95783, -170421, 209449, -137461, 208325, 99011, -113954, -6006, -98996]
18905i8996j9782C14499g1052q8573a6614r3898H4832a36689I1659l6305K6467
18894H1821d8245b1661l04336L0785G1341h4716b7862A7069a28777o1839j67027
18883c57643i4386j3662A6858a03968A78387b31601d2807o6161k4058E2621d4110
18871c6579B47346a95721P9114o482o2221p179j10694C5129J77350b71226a09834
18859a73352G275a51636F2326K07906f0574D06010e811o7065A95816a35157N4166
18848h0991b9638G3427h250j2126A57846B5116b20908f682j16463M8987A86090
18836A72051Q0764G3077k7564f9245k12215e2183j818A69069a04545I3591l8987
18825E4604a11479b6291B35149E2430c76260a25336C1187J08108d7439j49324
$$ y = [-98996, -118778, 314499, -71052, -159625, -16614, -110512, 84832, -136689, 91659, 55354, 81821, -48245, -21661, -325997, -295212, 71341, -84716, -27862, 17069, -128777, -190616, -357643, -94386, -108048, 16858, -103968, 178387, -231601, -42807, -108968, -133026, 52621, -44110, -36579, 247346, -195721, -116607, -123089, -185310, -192489, -303183, 35129, 212479, -271226, -109834, -173352, 7275, -151636, 62326, 270232, -60574, 406010, -5811, -72876, 195816, -135157, -80991, -29638, 73427, -8250, -20376, 157846, 25116, -220908, -6682, -123145, -74158, 186090, 172051, 252815, 73077, 45513, -69245, -281460, -52183, -54001, 169069, -104545, 93591, 54604, -111479, -26291, 235149, 52430, -376260, -125336, 31187, 139295, -47439, -196763]
18815a96763D9586J25745a26551m2575E0899L51152e2396p8675A90J85883b56098
18803A07567J70431f9711l12556A43771c0546j79551A3656a59918i880l61046
18793c70926a51175p7693f7668j5263l2457M6831D1510a52962e6326o6333L3905
18782h8754m2444K0754A08414b08473E9664J66876b44255c3962A1170a1614B41104
18770a96599N6581J5495A64297H529K1792J26916b9965A4460b25026b4363k32656
18759b57019A73184a18423j6622L5065C7354N9645d4372k3525B58650j00897c08498
18747a95222b2311B88192g0472C36168G6912b16337J2461b0129l0606i002k9566
18736c8568l09731J61704L9935D4199d3757j35695C42688b78482R028J16437c0267
$$ y = [-196763, 49586, 175331, -126551, -169126, 50899, 402051, -52396, -131071, 190, 186073, -256098, 107567, 277998, -69711, -382267, 143771, -30546, -210097, 13656, -159918, -9880, -370926, -151175, -228868, -67668, -82931, -115388, -68557, 41510, -152962, -56326, -122659, -88754, -131198, -110444, 108414, -208473, 59664, 226540, -244255, -33962, 11170, -11614, 241104, -196599, -140018, -124523, 164297, 8529, 30321, 157237, -29965, 14460, -225026, -24363, -257019, 173184, -118423, -135045, -99980, 37354, 96999, -44372, -67897, 258650, 157753, -308498, -195222, -22311, 288192, -70472, 336168, 76912, -216337, -203876, -20129, -50735, -9002, -38568, -348299, -186595, -146660, 44199, -43757, -179452, 342688, -278482, -269454, -153017, -30267]
18724c19821a56373l3091c1877A04035O572i7396k47597b6211E354a40060j23924
18713b63984G342Q0200g584k6269H0293J3600C145J08436Q7680F3506a14875E8993
18700C13739f5445k70417C62352f1924B684A189d533l9443r879A04940b62725
18688c74476A41259a77104B13035a29403k81266a72990A77178d6114o0361H3932
18677E599e1847D5821b8257I0916a8278a966A3236a97662R1383C50384A19696
18665A857c0308D4610j1183a92381k46557a62519a2297j65864O9633k39440J72273
18654a75695n0283A60468a88278C90320G5752a16192a4643k53912Q2939c7084
18643f53055a45081m2840C9055Q0119L643d755H5037c92262H9744f3456j61369
$$ y = [-319821, -156373, -189464, -31877, 104035, 110607, -97396, -344993, -26211, 5354, -140060, -263984, 7342, 87542, -7584, -33853, 80293, 93893, 3145, 111581, 199261, 63506, -114875, 58993, 313739, -65445, -335862, 362352, -61924, 2684, 1189, -4533, -43976, -53855, 104940, -262725, -374476, 141259, -177104, 213035, -129403, -410669, -172990, 177178, -46114, -106475, 83932, 5599, -51847, 45821, -28257, 90916, -18278, -1966, 13236, -197662, -106279, 350384, 119696, 1857, -30308, 44610, 33427, -192381, -438938, -162519, -12297, -178161, -108528, -347968, -175695, -225978, 160468, -188278, 390320, 75752, -116192, -14643, -268555, -185616, -37084, -653055, -145081, -187921, 39055, 119174, 122817, -4755, 85037, -392262, 89744, -63456, -224825]
18632b24825B1218a47428d1710E0995a22076j22714a5391j82235a7795j05104
18622a22899k9071j13276g5412r0087I6285m4432i3083A02941c3366H6280b62545
18610c27769a24292K2489D8948K36923a05139H8423g0415F7821b9394j66236r82
18599a96612N1985A58105a43101e9793j96387a1696j23851B64787b01912H7784
18588H6223c45455a68029d311j37939k7418d7026G8966C4123f9645D07378D2523
18576I6762L5242c7396r1142I1813b7908l9812j49483O4503A68735a0532j62989
18565a73521e9705j12299C24375i1614A39382a60680L5266q3707B7034a4570A88120
18553c64997A42883c24514A97101b3671B5274b01706B1983a44828k0840c9829
$$ y = [-224825, 21218, -147428, -41710, 50995, -122076, -244790, -15391, -197626, -17795, -122899, -151970, -265246, -75412, -165499, 96285, 51853, -93083, 102941, -33366, 86280, -262545, -327769, -124292, -101803, 48948, 285871, -105139, 88423, -70415, 67821, -29394, -195630, -196612, -144627, 158105, -143101, -59793, -256180, -11696, -135547, 264787, -201912, 87784, 86223, -345455, -168029, -4311, -142250, -169668, -47026, 78966, 34123, -69645, 407378, 42523, 96762, 132004, -37396, -128538, 91813, -27908, -67720, -217203, -152700, 168735, -10532, -173521, -59705, -172004, 324375, -91614, 139382, -160680, -125414, -209121, 27034, -14570, 188120, -364997, 142883, -324514, 197101, -23671, 25274, -201706, 21983, -144828, -165668, -39829]
18542D5335c09987A50095L5599a40414k52133J31502F6072a74525B27493A09347
18531g8785H3205M8160h3384j49980P9977C06763b52557a13621k0455j38115G023
18519A13177P8789C2890g0360N896l0954f657H658c86662b7071p5936d5182c217
18506a63177A69095F0476a75700j543e7514B23549a35741C8789J81538D9100a1411
18494b65274g6009n4761A98462a21359A70446a16832e0500e727j9327p940A59300
18482a27076L9159p5230E9100N2533e9075k3205j16750N8420l4691A32690K0148
18471A52838c61921M7750J04017k55655J48391E0702N4690j1273J62237c441k29755
18460b33196C51916j52791A700K08010g5140A95053o6186a98477k90113J810a33009
$$ y = [45335, -309987, 150095, 185694, -140414, -392547, -261045, 66072, -174525, 227493, 109347, -78785, 83205, 131365, -83384, -233364, -153387, 306763, -252557, -113621, -134076, -272191, 7023, 113177, 191966, 32890, -70360, -64464, -95418, -6657, 8658, -386662, -27071, -103007, -45182, -3217, -163177, 169095, 60476, -175700, -177243, -57514, 223549, -135741, 38789, 220327, 49100, -11411, -265274, -76009, -130770, 198462, -121359, 170446, -116832, -50500, -5727, -25054, -32994, 159300, -127076, -87917, -163147, 59100, 111633, -59075, -82280, -199030, -140610, -175301, 132690, 152838, -361921, -314171, -210154, -465809, -317418, 50702, 105392, 94119, 256356, -3441, -233196, 351916, 199125, 1700, 209710, -75140, 195053, 128867, -198477, -488590, -486780, -133009]
18448b3486j18794J9899N0084k52269A07619J56675q968j15475j9533E1541f8689
18436b01855D4734h8857o8632D6826K23238C1325a92612c7056A7541J0204J01590
18425A29335F138J23120P0772p7300b99367P4564c8927B86844I5551C0769L2777
18414F3546B3389J0786A5200c22849A58114c35425b4692j10722A94132b05594
18403A26903a66240d9271B59888a06113p2786D1055e9635l18509C34004n2705
18393B81299E8682d5839j10422N0405D02652d1058q0577l20058b4592r8668m9694
18382a72954e5975B97314k4491q1567e0315G5353k1366d2609B0933c9033k31285
18371b70318C77724A9787R1882J6790a52592A62324J45972b57991H0040N9429
$$ y = [-23486, -142280, -122381, -72297, -324566, 107619, 264294, 255326, 139851, 120318, 51541, -68689, -201855, 44734, -88857, -157489, 46826, 270064, 31325, -192612, -37056, 17541, 27745, 129335, 6138, 129258, 200030, 122730, -299367, -224803, -38927, 286844, 95551, 30769, 63546, 23389, 34175, 15200, -322849, 158114, -335425, -24692, -135414, 194132, -205594, 126903, -166240, -49271, 259888, -106113, -178899, 41055, -59635, -378144, 334004, 281299, 58682, -45839, -156261, -105856, 402652, -41058, -121635, -441693, -24592, -123260, -172954, -55975, 297314, 272823, 191256, -50315, 75353, 53987, -42609, 20933, -39033, -270318, 377724, 19787, 111669, 128459, -152592, 162324, 308296, -257991, 80040, 139469]
18361A39469C7655b09254A21602a55892l1863L7611J5299A3764b57747D50979
18350b23800d6867j33426A13169D7218a30736C8528a41983G833a08894k8228B26982
18338d24894a76748p9352H5804j2131b8140k1821G2732b21637a2303k29327f0902
18326a68375B53226c7771j63241b9515A52880a25629j63877J07504A39873J58262
18316B98135b76148J35235j19293B5486a13946d0518j45313h7003A11037D2012
18305H5589b87732G4896g4104l3876k67197c8265m5423j19749H1232c11972E7739
18293a45544J5851I4766R1494C8810b07461A18727J70051A00377J57373a84084
18282G2998a40723f7002N268k29892a39019B7798J88708a169j8718C01713a19691
$$ y = [139469, 37655, -209254, 121602, -155892, -187755, -150144, -134845, 13764, -257747, 450979, -223800, -46867, -180293, 113169, 47218, -130736, 38528, -141983, 7833, -108894, -137122, 226982, -424894, -176748, -256100, 85804, 73673, -28140, -49961, 72732, -221637, -12303, -241630, -60902, -168375, 253226, -37771, -201012, -29515, 152880, -125629, -289506, -182002, 139873, 298135, -276148, -140913, -260206, 25486, -113946, -40518, -185831, -87003, 111037, 42012, 85589, -287732, 74896, -74104, -107980, -375177, -38265, -83688, -203437, 81232, -311972, 57739, -145544, -129693, 94766, 186260, 38810, -207461, 118727, 288778, 100377, 257750, -184084, 72998, -140723, -67002, -61734, -291626, -139019, 27798, 216506, -1169, -19887, 301713, -119691]
18270H6676c5689o4772d1659H3365P8353G8571K3272l471a66980g5064D9539c2593
18257e6324r8929H1346N3446a52206j10737e9389E6716N30433b87550J11715n3597
18246b29432b8939j46445j07307F0410a36037j72809B336L3085a30338p4197c3175
18234A9220a93051I5158a43709A77161C2675b8053j99283D01540b94666f5605
18223c00329C7004d4F1272j764a59608d1211B09794e6727B7613b56433J20480
18212a35953n2347A7842J18617c41121A05150a06359B13029a43366B5699Q805
18202C4504a89819n5467A93142b7957A592N6445K27158a97578A3138g7444Q852
18191f8592b67j38227O3600A69278c602k92703F0319a67519j06466B41038E3162
$$ y = [86676, -35689, -100461, -41659, 83365, 161718, 78571, 101843, 98372, -166980, -75064, 49539, -32593, -56324, -155253, 81346, 134792, -152206, -262943, -59389, 56716, 587149, -287550, -175835, -229432, -28939, -175384, -282691, 60410, -136037, -308846, 2336, 35421, -130338, -204535, -33175, 19220, -193051, 95158, -143709, 177161, 32675, -28053, -227336, 401540, -294666, -65605, -300329, 37004, -44, 61272, 59508, -159608, -41211, 209794, -56727, 27613, -256433, -135953, -188300, 17842, 136459, -341121, 105150, -106359, 213029, -143366, 25699, 34504, -189819, -245286, 193142, -27957, 1592, 58037, 285195, -197578, 13138, -77444, -68592, -267, -138494, -74894, 169278, -3602, -296305, 60319, -167519, -273985, 241038, 53162]
18179A71272a25627A41764l0334j7303J71976a50470l4826e3290A59577G3857
18168a14849o9315C45583f0869l0574k15545I2878l0425a71270A89736b95564
18157B92254f9405n0145k8742B84205G8393l6898b74499A56942a94226f357m61636
18146d67993c3417m9315c4399n4262n5182l0377g5929j0380k25229A01061N9274
18135A60335b17271E7204a05088A08219A9621f05217g6115m9664I8210P3959a89071
18123a67974l0688B93984a80091A29448i6354B71624f2905m9663J8663G5961d06771
18111B50258C3925b54448b030j63145K0682B10938c01830P9261A60816c0387r9699
18100a30086b9475n2239A3189J044d328A70793a34758B22180f3272A18427b68326
$$ y = [171272, -125627, 141764, 111430, 94127, 266103, -150470, -185296, -53290, 159577, 73857, -114849, -184164, 345583, -60869, -91443, -306988, 92878, 62453, -171270, 189736, -295564, 292254, -69405, -119550, -148292, 284205, 78393, 41495, -274499, 156942, -194226, -6357, -467993, -33417, -82732, -34399, -88661, -143843, -174220, -75929, -86309, -311538, 101061, 160335, -217271, 57204, -105088, 108219, 19621, -605217, -76115, -125779, 98210, 172169, -189071, -167974, -198662, 293984, -180091, 129448, -96354, 271624, -62905, -112568, -93905, 75961, -406771, 250258, 33925, -254448, -2030, -165175, -144493, 210938, -301830, -222569, 160816, -30387, -130086, -29475, -81714, 13189, 14233, -4328, 170793, -134758, 222180, -63272, 118427, -268326]
18088b21077M6692A69278d01016J86910J554I2772a36608K3931B71365E610a75173
18076a82678g2375B41887c15005a08068L9474B21465b23153A41001C2521a33533
18065A73665R8031I2379g7163A11057a06672A60713a3963r3105f621B70842b48126
18053H8162J92093c0301B03181q1200E8175K48743I3833a84002L6622A29912b0727
18041i03m8145l0692k59023a59683f3961C17673c14316O1464I6454l8332a26365
18029c125j67478N9660d6884A75378h0598b9329B53937c31470C2737L6607k8209
18018D1135R1916a82644C2155b78041a00042a3498r28j5991A22606A8536a75302
18006A6914G452N5478A5722d3922r9569B51410J75956I2381J1823a22261N9560
$$ y = [-221077, -174385, 169278, -401016, -214106, -212552, 92772, -136608, -112677, 271365, 5610, -175173, -182678, -72375, 241887, -315005, -108068, -68594, 221465, -223153, 141001, 32521, -133533, 173665, 271696, 92379, -77163, 111057, -106672, 160713, -13963, -107068, -6621, 270842, -248126, 88162, 280255, -30301, 203181, 121981, 58175, 306918, 93833, -184002, -147380, 129912, -20727, -903, -49048, -79740, -338763, -159683, -63961, 317673, -314316, -252852, 96454, 58122, -126365, -3125, -170603, -110943, -46884, 175378, -80598, -29329, 253937, -331470, 32737, 69344, 41135, 133051, -182644, 32155, -278041, -100042, -13498, -14426, -30417, 122606, 18536, -175302, 16914, 7452, 62930, 15722, -43922, -143491, 251410, 427366, 92381, 104204, -122261, -62701]
17995f2701d296H6186a43268A86923a31572H9620a86166o1909b922j27777F8377
17983D15799R048I870b04271j2875n7802A31268a58699A33420F2440c08679D325
17971b92188a354A33691h6384a1804o0320C12426f9920C00960a82304A20558d23146
17959A35035a52118r5740J22867H3153a30924b3122A10623a43146A40976b208
17948B03252C7992L0902b30791J03526j28206J13724A73212K7717K02738a24073
17937a66301b7735B65855Q4553b77699B71891g6694C12822a31572B78493b43050
17926A57544a62682e7388B12294b14797k00557J14149C81588A17232C4904b22737
17915A1273e829A56557G997b26766l2293O7925D7870a19817A61494p4397h3296
$$ y = [-62701, -4296, 86186, -143268, 186923, -131572, 89620, -186166, -248075, -2922, -130699, 68377, 415799, 424847, 9870, -204271, -217146, -274948, 131268, -158699, 133420, 62440, -308679, 4325, -292188, -1354, 133691, -86384, -11804, -72124, 312426, -69920, 300960, -182304, 120558, -423146, 135035, -152118, -247858, -124991, 83153, -130924, -23122, 110623, -143146, 140976, -2208, 203252, 37992, 68894, -230791, -127265, -255471, -141747, 173212, 200929, 403667, -124073, -166301, -27735, 265855, 350408, -277699, 271891, -76694, 312822, -131572, 278493, -243050, 157544, -162682, -57388, 212294, -214797, -415354, -301205, 381588, 117232, 34904, -222737, 11273, -5829, 156557, 7997, -226766, -259059, -191134, 47870, -119817, 161494, 87097, -83296]
17903h6890A60291M6872d3682o7933j2997E493J16218f0468k00996G3087a52285
17891A27478b08355A7922h7769r3815A39855a09796n7325M7322B6888a55146J4866
17880a40280O7262I4906J51152b79498B57476a25754J2501J6311A28514a6542
17869A59150J807d47101i7237A27857i3050A96981H0219b355B04850r2971C1287
17857E8665B5500c09003C210a05454D01108b62986E7371a16040J1129A73308H4362
17845A39624a04758A10845g7726c7464j56520A49358b55296B56372c1464I6127
17834C87564A79057i4066n565C3822c7625j86643C39625b77619e1414l41421a7926
17822I3646L22506a40245A73930K0940b49625G0965a43228C10692E3932b97072
$$ y = [-86890, 160291, 207163, -43682, -111615, -124612, 5493, 121711, -60468, -261464, 73087, -152285, 127478, -208355, 17922, -87769, -181584, 139855, -109796, -167121, -119799, 26888, -155146, -140280, -73018, 94906, 246058, -279498, 257476, -125754, -113253, -96942, 128514, -16542, 159150, 160957, -447101, -97237, 127857, -93050, 196981, 80219, -2355, 204850, 111879, 31287, 58665, 25500, -309003, 3210, -105454, 401108, -262986, 57371, -116040, -104911, 173308, 84362, 139624, -104758, 110845, -77726, -37464, -193984, 149358, -255296, 256372, -31464, 96127, 387564, 179057, -94066, -99631, 33822, -37625, -224268, 339625, -277619, -51414, -392835, -17926, 93646, 416152, -140245, 173930, 194870, -249625, 70965, -143228, 310692, 53932, -297072]
17811a13712a8909A06677b23703N7453q5794a25682I8684c11159R5271R7731j07597
17800b25754A19186R541P6113g3953j55129C15343A26325a99736O3463C50866
17789D9159a40022J6097k9945g6819c6825D8474P1702b4957j91508D8847A4600
17777d2397B2639b23239A46478a85272B33111b43969B5511P2630O4443B4245c8103
17765E801b35755B5914b9804j34007f2786j14383A5504A553R6061K64c32960G249
17752A13944C0885J96709G8032i0072j76234I792a31568A77471E6001J93676B1684
17740B29848i2412G7695A8567b32481A92108a44201A45557a35951A72264F6996
17729B46784a65072I2775B2272K21937j094a81624L4994A60526m7540L16290A41692
$$ y = [-113712, -18909, 106677, -223703, -166250, -252044, -125682, 98684, -311159, -215888, -118157, -225754, 119186, 128727, 204840, -73953, -229082, 315343, 126325, -199736, -136273, 350866, 49159, -140022, -123925, -153870, -76819, -36825, 48474, 120176, -24957, -216465, 48847, 14600, -42397, 22639, -223239, 146478, -185272, 233111, -243969, 25511, 98141, 162584, 24245, -38103, 5801, -235755, 25914, -29804, -163811, -62786, -177169, 15504, 1553, 97614, 97878, -332960, 7249, 113944, 30885, 227594, 78032, -90072, -266306, 9792, -131568, 177471, 56001, 249677, 21684, 229848, -92412, 77695, 18567, -232481, 192108, -144201, 145557, -135951, 172264, 66996, 246784, -165072, 92775, 22272, 244209, 243115, -181624, -146630, 160526, 112986, 429276, 141692]
17717A17447J42432E8982N7756J56366E8781K62473F420c38390A45271a05925
17706c34092C31600a06054H7942b23052A90433J07583o5669J23353g7397A93065
17695a73277O9579A70849a3206l9779j90759g0526G3724a80123c4086A0135a3447
17683B9696J35029a38954A85897a32672d1312E3294J07224B9693b91236E4950
17672b21163A32639J34520Q5850H0288f7423H8307d9984A61426g2428n0779j00220
17661b23427A15122K55782a9786p9178b0869H1839J48536a9532B53966D9051K5883
17650G4934a70812A25376a98697A7001c7089H4424K46931D3678J89021B5416a58236
17638a14997A71275h0972A25084E2751K3286K11017a24624A47015m5794J81024
$$ y = [117447, 259879, 58982, 116738, 273104, 58781, 321254, 6420, -338390, 145271, -105925, -334092, 331600, -106054, 87942, -223052, 190433, 298016, 232347, 355700, -77397, 193065, -173277, -103698, 170849, -13206, -52985, -243744, -70526, 73724, -180123, -34086, 10135, -13447, 29696, 164725, -138954, 185897, -132672, -41312, 53294, 160518, 29693, -291236, 54950, -221163, 132639, 267159, 353009, 80288, -67423, 88307, -49984, 161426, -72428, -123207, -223427, 115122, 370904, -19786, -98964, -20869, 81839, 230375, -19532, 253966, 49051, 74934, -170812, 125376, -198697, 17001, -37089, 84424, 331355, 43678, 232699, 25416, -158236, -114997, 171275, -80972, 125084, 52751, 76037, 287054, -124624, 147015, 101221, 282245]
17628B82245L8947b28223E3219k5356L6833K9182g3391q7366B54208I0589R5538
17617A86127o9337J74217A07543b14393A61663o0538d1122B1306L55041i9157
17606c26955e1948E7913g8344A48977A8316K1584a11237A07692g7463B9127a31235
17594I5237a39017M4750J3325A39379c22905B90125d0101m6026A6799c52478C48453
17582E6021m365P8882a51550F5154a23118C14793F6256b61497e004C23048E9368
17570A00862a34987B2694b18038b7381B15235f5126j37800A6404b52816E17048
17559b30458d0477B08861g62B2108Q8868K00004a22401H2144a423A00966a17372
17547C00389E2829P4334a43198B29319A02222f1586j43192k45260A84205G0925
$$ y = [282245, 321192, -228223, 53219, 27863, 64696, 93878, -73391, -160757, 254208, 90589, 186127, 116790, 291007, 107543, -214393, 161663, 101125, -41122, 21306, 376347, -99157, -326955, -51948, 57913, -78344, 148977, 18316, 39900, -111237, 107692, -77463, 29127, -131235, 95237, -139017, -94267, -80942, 139379, -322905, 290125, -40101, -86127, 16799, -352478, 348453, 56021, 51656, 130538, -151550, 65154, -123118, 314793, 66256, -261497, -5004, 323048, 59368, 100862, -134987, 22694, -218038, -27381, 215235, -65126, -202926, 16404, -252816, 517048, -230458, -40477, 208861, -762, 22108, 110976, 310980, -122401, 82144, -1423, 100966, -117372, 300389, 52829, 127163, -143198, 229319, 102222, -61586, -204778, -450038, 184205, 70925]
17536A17653e4597A71510K06958A30047b5777q2447C76659A2413J15535m2701
17526H5247K06572A5256K73642j01199f330B7749O1831g2659j2584E4865A2390
17514C51435a55034B6784J8976A5430K89411j52065e1669n1883J0192B86442m9861
17503B36581n703E9734K49356f1576h999j02125D5686G687K04508I1263P3710
17492A64973G3299K24327K28023a29059A63455D3748J09763D9939N3685a7471
17481B05013M7420A23779d4540A80616l7278m2765J31155M6033m3963C4933J89552
17470B24485a92711B64764r6227G2893J43896J45097D6826a2796G8825i0749j7216
17459a07965B54542J60916b09267D9625L4482K61793A09681K01990r6405a4715
$$ y = [117653, -54597, 171510, 378468, 130047, -25777, -108224, 376659, 12413, 127948, 85247, 291819, 15256, 288898, 187699, -6330, 27749, 89580, -72659, -85243, 54865, 12390, 351435, -155034, 26784, 45760, 15430, 304841, 152776, -51669, -103552, -93360, 286442, 236581, 230878, 59734, 309090, -61576, -8999, -111124, 45686, 7687, 212195, 91263, 164973, 73299, 297626, 525649, -129059, 163455, 43748, 153511, 49939, 103624, -17471, 205013, 252433, 123779, -44540, 180616, 143338, 100573, 231728, 277761, 233798, 34933, 224485, -192711, 264764, 168537, 72893, 216789, 361886, 46826, -12796, 78825, -90749, -107965, 254542, 415458, -209267, 49625, 84107, 345900, 109681, 311671, 215266, -14715]
17448F11811k58390A12832J34115n107L7380l7871J59142A64921J29088O7318
17438C61327a98309B12108A05651E500b9242A58036J24434J70236K02765C06102
17427B36663O7027J52115j56352J7571A55388L70034m8040A10293K50721j18823
17417B42191q8583K41714J61818B35333b45820A15143E5528J07498J57491A59362
17406B45055M91481d12A04339B2116e8091D86100f66H7382N0608h8586B04745
17394B65998A07827J2034K21514A60359J2326J88787o2096A03245J11409b05373
17383B07089L49411d0718D12894a05551A24844N714P7302B1456L74512o5605a42329
17371b27276C7464i9142j6726A8686e32775B09635K07698e679A19590b02222C06341
$$ y = [611811, 353421, 112832, 246947, 241840, 279220, 241349, 400491, 164921, 294009, 361327, -198309, 212108, 105651, 5500, -29242, 158036, 282470, 452706, 655471, 306102, 236663, 303690, 455805, 299453, 317024, 155388, 525422, 477382, 110293, 361014, 242191, 153608, 395322, 557140, 235333, -245820, 115143, 55528, 163026, 320517, 159362, 245055, 736536, -412, 104339, 22116, -58091, 486100, -666, 87382, 137990, -88586, 204745, 265998, 107827, 119861, 341375, 160359, 172685, 361472, 299376, 103245, 214654, -205373, 207089, 556500, -40718, 412894, -105551, 124844, 130558, 207860, 21456, 395968, 330363, -142329, -227276, 37464, -99142, -115868, 18686, -532775, 209635, 417333, -5679, 119590, -202222, 306341]
17359A78142J66721o3246M3968d4627A95585h6906A15104K0151E4657M96465C9018
17347B24529L54251B48846L885G8352O6269M79410G2775P067J28867k3304E4236
17335a27011I4923P0781a19279A54458F9168J0533J2898J74786r8094C5513J0358
17324D5871Q8461l4569P9534D4751Q097O05566k95346p4037J92425A26575a68019
17312b5709A78102K82208B09746K03590j9990C4528K25840j25684J17269b6962
17301a84383C17442j48982k3451K23496b48092h0657b5370I9018J6327l1236a4241
17289B03110K82651r5904i4405B73764A33735J21632M8890j33434a59070A98324
17278D7839a3096A25757J1596P873n662J10023E9104J25919H8285l4217L8998
$$ y = [178142, 344863, 281617, 325585, -44627, 195585, -86906, 115104, 135255, 54657, 551122, 39018, 224529, 578780, 248846, 252731, 78352, 144621, 624031, 72775, 79842, 208709, 185405, 54236, -127011, 94923, 165704, -119279, 154458, 69168, 79701, 92599, 267385, 169291, 35513, 45871, 134332, 99763, 179297, 44751, 52848, 658414, 363068, 289031, 481456, 126575, -168019, -25709, 178102, 460310, 209746, 413336, 393346, 34528, 260368, 134684, 251953, -26962, -184383, 317442, 168460, 145009, 368505, -248092, -80657, -25370, 99018, 115345, 84109, -14241, 203110, 485761, 389857, -94405, 273764, 133735, 255367, 304257, 170823, -159070, 198324, 47839, -13096, 125757, 137353, 145226, 139564, 249587, 59104, 185023, 88285, 54068, 93066]
17267I3066b5359C83902A17393d69399A09871h1891B11749K29312I2046N9488
17257A51534D8450H792K70786a14994A22060O3732L5708J82751B02049K33022
17247D35071j65266R9156c6006A88099C7749M91822F7586L33481j51425R4336
17237C43978i7192l5901E2717J43659M0790D375K50249j8577D3732L09548j8615
17226C34665j55961J41289J88009j39874A43115K45660A68137O5834K45141A79439
17215B10820J4320C8910K22358I9159C5084J60710h0902B55743j03705N6241J24426
17204C32705j22039d5629A53059R2234K66954k26549m0880I4597A055L14278j54780
17193A60553G3996Q0504J1713K0647J92288a26876B94768A33728J88347j03761
$$ y = [93066, -25359, 383902, 117393, -469399, 109871, -81891, 211749, 441061, 92046, 151534, 48450, 8792, 279578, -114994, 122060, 185792, 221500, 404251, 202049, 435071, 269805, 368961, -36006, 188099, 37749, 529571, 67586, 401067, 249642, 343978, -97192, -133093, 52717, 196376, 237166, 4375, 254624, 236047, 43732, 353280, 334665, 178704, 319993, 508002, 368128, 143115, 388775, 168137, 233971, 479112, 179439, 210820, 225140, 38910, 261268, 99159, 35084, 195794, -80902, 255743, 152038, 208279, 332705, 210666, -45629, 153059, 245293, 512247, 285698, 244818, 94597, 1055, 315333, 160553, 73996, 154500, 166213, 186860, 379148, -126876, 294768, 133728, 322075, 218314]
17183B18314N56299B75428J67033j65164J86880k03933p4666J08816j20394J50740
17173C24740A55807M45352B38434a66991C74817C7297N14661j50416j25327r4202
17163A82013H5445J70764m3116L19142k31580j0307R3846D3982M55774J9163j00951
17152D17968n3101J361a82903D36444H5524M44902c809C43951O907j528A26961
17140C60908N225q3418j23517K00291r9097J63636M9422j35371J61291k14358
17130B85012m4384J29258J9837J08733o1975j38121j01833K21025J13853A39677
17119H4911M11034j53932o3118J54251l1013L7625k13204J36347L01699j83455
17109D81145J23973B65825J92352B11801O3587L23950q2176k00705K84288n0397
$$ y = [218314, 774613, 275428, 442461, 277297, 464177, 260244, 185578, 294394, 174000, 324740, 155807, 601159, 238434, -166991, 374817, 37297, 551958, 401542, 276215, 182013, 85445, 256209, 213093, 532235, 300655, 290348, 384194, 43982, 499756, 518919, 417968, 364867, 366228, -182903, 436444, 85524, 530426, -3809, 343951, 350858, 349330, 126961, 360908, 366133, 282715, 159198, 359489, 260392, 424028, 473450, 338079, 499370, 285012, 240628, 369886, 389723, 498456, 436481, 298360, 196527, 417552, 531405, 139677, 84911, 495945, 342013, 278895, 433146, 402133, 439758, 226554, 362901, 664600, 481145, 605118, 265825, 458177, 211801, 275388, 599338, 517162, 316457, 600745, 550348]
17099E50348j14700j12428K78593l2808k59975O620K19476J07123k11489I2376
17088D46867K9500K7799B03647K13761L39083B7787L49941K93575j45755K42315
17078G67863L5023A40726L27949P0472m2651O1912L7767k16666O4251j2822L35291
17067G66229m1767l3912Q78K28994j66463k05036k37862K91237k3372B37235L79307
17056F16542j2902k06354K31420j52103k32381L26970B09306M33430q3419B77467
17045D20183J27285J33517o38J2607k00234L83150l47093M5116J36719O353o0086
17034F56879q6007j46758K44968K07006j24417k56298M9057K07180C59288L77355
17024G36643k53147k6264L53169L57749E39499J14114P1428j05786P2534k05163
$$ y = [550348, 435648, 323220, 601813, 569005, 309030, 315650, 535126, 642249, 430760, 92376, 446867, 476367, 504166, 203647, 417408, 756491, 27787, 377728, 671303, 525548, 767863, 802886, 140726, 468675, 539147, 496496, 558408, 596175, 379509, 443760, 430938, 766229, 724462, 690550, 691428, 920422, 753959, 548923, 311061, 602298, 578926, 237235, 616542, 603640, 397286, 628706, 476603, 244222, 571192, 209306, 642736, 559317, 277467, 420183, 547468, 680985, 680347, 692954, 492720, 875870, 528777, 573893, 710612, 716965, 656879, 570872, 424114, 669082, 876088, 751671, 495373, 544430, 751610, 359288, 736643, 483496, 457232, 810401, 1168150, 539499, 653613, 725041, 619255, 691789, 486626]
17014D86626L48135D07937L63045N0094L6157k56204q1021L21766l9039m7206
17004G55529p9932O2532K4815J7287J35797l90421l293M45705l40722J42202j30484
16993F39015L99535j35821K60432l90188J176Q4710o6412j94595M67904j35897
16983I29859l9476L87744m02522O23522o16041o0827O6482r4782L28999m00506
16973G22452K50679R925j16359K60459m62828N76421l19670J22036l15801L91126
16963A118440j78478K78791m84690J88030P5844j49330R1748M01813j09854k76150
16953I56164L43671j37167J7437k33792J99615Q9376k70808Q6974n3903J07583
16943A105150K2004L64503l34809Q9976R0625k74510M24609o5845r9954K06073
$$ y = [486626, 834761, 407937, 770982, 821076, 857233, 601029, 520008, 841774, 802735, 755529, 675597, 738129, 762944, 780231, 916028, 525607, 522314, 968019, 627297, 769499, 639015, 1038550, 902729, 1163161, 772973, 774149, 858859, 792447, 597852, 1065756, 929859, 890383, 1278127, 875605, 1499127, 883086, 822259, 888741, 793959, 1122958, 722452, 973131, 983056, 866697, 1127156, 664328, 1240749, 921079, 1043115, 727314, 1118440, 939962, 1218753, 734063, 922093, 997937, 848607, 940355, 1342168, 1232314, 956164, 1299835, 1162668, 1180105, 946313, 1145928, 1235304, 964496, 1051470, 997567, 1105150, 1127154, 1491657, 1156848, 1246824, 1337449, 1062939, 1487548, 1421703, 1321749, 1527822]
16933A527822l48665K44972j91548k40890M03528L0243j86647J18494j03814K62086
16923A515581R0867J6092j21536L09720l26547K02386l09403k7361L5589j14407
16913A270981J80615M40588j29869n4313r1556J0827L32869k18588o6269o3483
16903A611802K51995K15306j22209k17732J86535K17134o82685O48794j33384
16894A975556J85538j02744J8979j01205L03591k93745M79325R3359m74886K97553
16884B381321m07614J88003M4506j50015L49233Q3291k11107m77J96964J98146
16874B672251l5263K63664l57512j51424M93230m3965j19624j43704K57898K00859
16864C036410m35424M65404l4709j20745O2470J08711K2283K86895J08794J23528
$$ y = [1527822, 1179157, 1424129, 1232581, 991691, 1395219, 1425462, 1238815, 1357309, 1253495, 1515581, 1606448, 1622540, 1501004, 1810724, 1484177, 1686563, 1377160, 1349799, 1385388, 1270981, 1451596, 1892184, 1762315, 1708002, 1616446, 1627273, 1960142, 1741554, 1675285, 1611802, 1863797, 2079103, 1956894, 1739162, 1925697, 2142831, 1460146, 2108940, 1975556, 2161094, 2058350, 2077329, 1976124, 2279715, 1985970, 2465295, 2558654, 2083768, 2381321, 1973707, 2161710, 2206216, 2056201, 2405434, 2488725, 2277618, 2277141, 2474105, 2672251, 2636988, 2900652, 2543140, 2391716, 2884946, 2840981, 2721357, 2577653, 2835551, 3036410, 2600986, 3066390, 3031681, 2910936, 2973406, 3082117, 3104400, 3391295, 3500089, 3623617]
16854C623617m96278M7356J11693L85773n6799j76197K30903m6080P056L8214
16844C669258P5045j3232N08407l78302N72859l86438J3751K6162K99185L31660
16834D718355n5635j71924j376L82210J44346m24302m7290P90574l29307O8356
16824E074007J44313m2624K29278o6056N10243m3694J54417k11796N9740L81111
16814F188939J27224p0720M53332N0699J03829L48482R7788J12767J62986k376
16804G572950L51734J82433K41012J14072Q2038M43316j77515K06367M73008M4514
16794I533929J82708K59154L58992j885M23940M11290K47875r9996J064690q3437
16784A2297260Q4576P66929o1887P84888L71045K30762J96009N62491N27265L67834
$$ y = [3623617, 3127339, 3174695, 3286388, 3672161, 3615362, 3439165, 3670068, 3623988, 3631044, 3669258, 3744303, 3731071, 4239478, 3861176, 4434035, 4047597, 4061348, 4087510, 4386695, 4718355, 4662720, 4490796, 4489420, 4871630, 5015976, 4591674, 4544384, 5334958, 5005651, 5074007, 5218320, 5175696, 5404974, 5338918, 5849161, 5805467, 5959884, 5748088, 5807828, 6188939, 6316163, 6245443, 6698775, 6749474, 6853303, 7201785, 7299573, 7412340, 7575326, 7572950, 7924684, 8107117, 8348129, 8462201, 8544239, 8987555, 8810040, 9016407, 9489415, 9533929, 9716637, 9975791, 10334783, 10332898, 10756838, 11168128, 11416003, 11316007, 12380697, 12297260, 12381836, 13148765, 13086878, 13871766, 14242811, 14473573, 14669582, 15232073, 15759338, 16127172]
16774A6127172M75232R30624M47747P30002J86623J030295L64963O74021Q67460
16765B1834139O41412O33050J127084J087013Q98420J155169O73156J374424Q53600
16756C0277467J425407J424492J259571J736870J374554J680606J573775K029193
16748D2781935J748694K609858K214210K352729K350138K548767L039310K843998
16740F2489639L284271L635662L863910L749768M313582M387157M531022M614637
16732I4869648N509686M837987N784603N526818N936521N497063O268463N791849
16724A40022638N531822N354384N130478M324074M041585K927514K937944J347833
16716A71618272P22186m40335j187225k042532k889467l866417m581972m884847
$$ y = [16127172, 16602404, 17533028, 17980775, 18710777, 18897400, 19927695, 20292658, 20966679, 21834139, 22475551, 23108601, 24235685, 25322698, 26221118, 27376287, 28049443, 29423867, 30277467, 31702874, 33127366, 34386937, 36123807, 37498361, 39178967, 40752742, 42781935, 44530629, 47140487, 49354697, 51707426, 54057564, 56606331, 59645641, 62489639, 65773910, 69409572, 73273482, 77023250, 81336832, 85723989, 90255011, 94869648, 100379334, 105217321, 111001924, 116528742, 122465263, 127962326, 134230789, 140022638, 145554460, 150908844, 156039322, 160363396, 164404981, 167332495, 170270439, 171618272, 172340458, 171900123, 170712898, 168670366, 165780899, 161914482, 157332510, 152447663]
16708A52447663n339254n663935n664392o288677n692891o002883o304777n493746
16700A05997108n566685n240588n442733m527625m766114m279370m239895l398110
16692F8535988l788224l276127l119740k879338k915097k569867k101497k652872
16684D5233226k151939j815174j950562j880598j669431j469516j616558j104102
16676C1575346j586100j190009q88216j304648r67483j266965o29257j058630
16668B2684038j050820p71799m62050j010393n07747p66845n49408o81681m78378
16659A6404917l81171n56909o98344l65372q43535j06822k64814n06840m93013
16650A2188097m75814l27092k03838j95032n09464J29451l24334q90314J89889
$$ y = [152447663, 147108409, 141444474, 135780082, 129491405, 123798514, 117795631, 111490854, 105997108, 100430423, 95189835, 89747102, 85219477, 80453363, 76173993, 71934098, 68535988, 64747764, 61471637, 58351897, 55472559, 52557462, 49987595, 47886098, 45233226, 43081287, 41266113, 39315551, 37434953, 35765522, 34296006, 32679448, 31575346, 29989246, 28799237, 27911021, 26606373, 25638890, 24371925, 23742668, 22684038, 21633218, 20861419, 20399369, 19388976, 18881229, 18114384, 17564976, 16883295, 16404917, 16023746, 15466837, 14768493, 14403121, 13559586, 13452764, 13187950, 12681110, 12188097, 11712283, 11385191, 11181353, 10986321, 10476857, 10606308, 10281974, 9391660, 9581549]
16641I581549o41262j7228N8859p16221J95094k96546j90381l13765k50163m1343
16631G368593m12431o0922k74845o2019P7430K03330q32273k10838O389p7213
16621E725201r8391k13936K31270l61312J91134o8978m67291M2618j40925K13500
16611E052890m48968P6857l16238l3288m9366j5281J65504p02587K82534P8578
16601D090635l4168l15889j14783K17735k35728p9835m2433k13476K17657K7111
16591C516826j24017o3685l29635j11754M00627k06279j47812j23079J77162r4866
16581B893488L09874k46252m71032J8008K01464k27268o296K59879k17743J77242
16571B691364l72387q5139M6859l56982J81431j00988k45572L09490Q5242M1875
$$ y = [9581549, 8940287, 8923059, 8981918, 8265697, 8460791, 8164245, 7973864, 7660099, 7409936, 7368593, 6956162, 6895240, 6620395, 6558376, 6635806, 6839136, 6006863, 5796025, 5802414, 5725201, 5626810, 5412874, 5644144, 5282832, 5473966, 5404988, 4937697, 4980315, 4839390, 5052890, 4603922, 4680779, 4364541, 4331253, 4281887, 4266606, 4432110, 3729523, 4012057, 4090635, 4056467, 3740578, 3625795, 3843530, 3607802, 3527967, 3485534, 3272058, 3489715, 3516826, 3392809, 3329124, 2999489, 2887735, 3288362, 3082083, 2934271, 2811192, 2988354, 2893488, 3203362, 2957110, 2486078, 2504086, 2705550, 2478282, 2471986, 2731865, 2514122, 2691364, 2318977, 2233838, 2280697, 1923715, 2105146, 2004158, 1758586, 2068076, 2153318, 2195193]
16561B195193J6163O5623j35027p8364k18699K06048J86489n06624K23039m22508
16551A531333L15532m6510l2714k76985J35278K9412k36422K31128j62856K09801
16541A696997L0599J4515j72799r5554k05993L35392k18279L32773n9267j61800
16531A496584j47660J79087P2441l97686m4018J50259r9014K34502l60015J17992
16521A202472k22410O19516l30490m00952K42496j13988L66251j17694j04953
16512A140248k4103n7438L8021k82924N12595j55590m13811O71710k06851j18071
16502A103786L7743k98843J0706J79838l42409L59584l07122K61688m94383M01296
16492I11884J47524l60406m3908M5733M73508l74596K49909k83632q697j47039
$$ y = [2195193, 2211356, 2276979, 2141952, 2063588, 1844889, 2050937, 2237426, 1730802, 1953841, 1531333, 1846865, 1800355, 1767641, 1490656, 1625934, 1655346, 1418924, 1650052, 1487196, 1696997, 1727596, 1742111, 1569312, 1473758, 1267765, 1603157, 1384878, 1717651, 1658384, 1496584, 1348924, 1528011, 1600452, 1202766, 1158748, 1309007, 1209993, 1444495, 1084480, 1202472, 980062, 1599578, 1269088, 868136, 1110632, 996644, 1362895, 1245201, 1140248, 1116145, 1058707, 1096728, 813804, 1326399, 1170809, 756998, 1428708, 1221857, 1103786, 1141529, 842686, 853392, 1033230, 690821, 1050405, 743283, 1004971, 510588, 911884, 1059408, 699002, 655094, 700827, 1174335, 799739, 1049648, 766016, 757319, 610280]
16482F10280L45984k05349J28252j40192K7888L4671J23266j79688L09264l66073
16472F88303K21550m53615J67909M99887n23834K71001k78968N6689J94916j96165
16462F47673O0941L7860C35706M85640N9874j26613r4406j53792K88910k48223
16452E47096L16212k35338l2521J16957j70176j41275R5290R998J16063L5971
16442F58277P7838l31083K55636p9453J4501m5520k3963j39679L51104j29485
16432F08173I365O54724j75951j97253j42034O02680k64843J19077K04510l16698
16422D93577j43481K79442C13093J74002M1501o1745N4980L08617j40595q0307
16412F09546B93930K28173j1943P7516J32621k93405p7961J86500k52659d78C09351
$$ y = [610280, 956264, 750915, 879167, 738975, 766863, 801534, 924800, 745112, 1054376, 688303, 909853, 456238, 624147, 1124034, 600200, 871201, 592233, 648922, 843838, 647673, 708614, 746474, 335706, 821346, 881220, 754607, 660201, 506409, 795319, 547096, 863308, 627970, 595449, 712406, 542230, 400955, 496245, 506243, 622306, 658277, 736115, 405032, 660668, 581215, 595716, 550196, 526233, 386554, 737658, 608173, 9365, 664089, 488138, 290885, 148851, 751531, 486688, 605765, 810275, 493577, 350096, 629538, 313093, 487095, 528596, 466851, 521831, 830448, 689853, 609546, 293930, 522103, 510160, 587676, 720297, 426892, 348931, 535431, 282772, -478, 309351]
16400B72632R2268J18261A97272K34015j18637J57379j41718L52135j50188j5568
16390E14690j1802k03474m1250a02246B19657J79986P7808B14236L91161k90923
16380C14474a4055A90286J71859J25631k9415r6639r1482m0665J36416J57165
16370E23156k01629K33618j28526N7523p3280j21234J73062k7412D5589L12502
16360C58091M1543p1840r3282J08197F5709O51179k20789j18794D4533L88200
16350D32733j81462Q0406q2804E1355L05095j7257n0671m2475B4178N9600f4606
16338e2722B94760J88142E8201K04264q5682N03747G5007L55038l2777A75235
16327D25371M3322B6706P4169K29361J14333j71499G6091k935K60928j47721A5419
$$ y = [272632, 364900, 483161, 197272, 431287, 312650, 470029, 328311, 680446, 530258, 514690, 502888, 299414, 258164, -102246, 219657, 399643, 477451, 214236, 605397, 314474, -14055, 190286, 362145, 487776, 458361, 361722, 270240, 229575, 365991, 523156, 321527, 555145, 426619, 484142, 410862, 289628, 462690, 435278, 45589, 358091, 399634, 327794, 234512, 342709, 65709, 716888, 496099, 377305, 44533, 432733, 251271, 331677, 248873, 51355, 356450, 339193, 288522, 246047, 24178, 83778, -64606, -52722, 294760, 482902, 58201, 262465, 176783, 680530, 75007, 430045, 397268, 175235, 425371, 468693, 26706, 100875, 330236, 444569, 273070, 76091, 73156, 334084, 186363, 15419]
16315A89415h831B76013a4821p1681B6000J25433j5614a2954A5375Q708J50985
16304A75068H379K17512G6614j8348K24596R7047m9222A45600L30979D1235K75149
16293C16384C6760r980J77203a39714L2064b1913A78266d9028C45744C5640a45623
16281C11188I4916R5022c9671D46173A80082E2664K837J2426f2940B68543j31205
16270A37338n7216N5107J72843A40047R0284a29587G6762L13804A93086B1523
16259A74531K53311H4736R3038a00224B89873b47934f9865A43291p853h9129L7519
16248e1610A93133D8112L0440J1955R1755l5757b26337a02398H7125J06349b17732
16236A73395b5709H1621a10770E9145a07021G6351M892L6371c6153k6140C10588
$$ y = [189415, -8831, 276013, -14821, -86502, 26000, 151433, 135819, -12954, 15375, 24083, 175068, 8379, 225891, 76614, 58266, 282862, 379909, 330687, 145600, 476579, 41235, 316384, 36760, 26780, 203983, -139714, -107650, -21913, 178266, -49028, 345744, 35640, -145623, 311188, 94916, 189938, -39671, 446173, 180082, 52664, 55501, 67927, -62940, 268543, 137338, 80122, 135229, 308072, 140047, 230331, -129587, 76762, 390566, 193086, 21523, 174531, 427842, 84736, 177774, -100224, 289873, -247934, -69865, 143291, 135438, -89129, -51610, 193133, 48112, 78552, 90507, 182262, 146505, -226337, -102398, 87125, 193474, -217732, 173395, -25709, 81621, -110770, 59145, -107021, 76351, 81243, 117614, -36153, -62293, 310588]
16224H4484a20645L2414B39587G2842k2865d05438i1582o4917B50714a1994C40371
16212C81096j48133j08169J64908h2328K398A71003a00445B8916P2530L10432
16202D11878A29896L58287A88498a02554C36100a45379D31655I2102i8601H4412
16191B47935E9084L88556A59829a0920B12739b08281A78982K006M0129l7459A1392
16179A84498e9866B17408p1086D5656L6351a03735A87176J15219O0718j77826
16169A85287J7270q9445m1895a92854A55209J73226a205H3238d7385C9950L53307
16158C93257j07335e0666k8140r7577M546j18072A34865c05017a18060d66j72109
16147a72575A24702E0132b53209P7901L3902B17654a45059A15051a37927A0185
$$ y = [84484, -120645, -88231, 239587, 72842, 49977, -405438, -91582, -156499, 250714, -11994, 340371, 381096, 232963, 124794, 289702, -82328, -79930, 171003, -100445, 28916, 101446, 411878, 129896, 488183, 188498, -102554, 336100, -145379, 431655, 92102, -98601, 84412, 247935, 59084, 447640, 159829, -10920, 212739, -208281, 178982, 180988, 221117, 183658, 11392, 184498, -59866, 217408, 146322, 45656, 82007, -103735, 187176, 302395, 363113, 185287, 202557, 113112, 71217, -192854, 155209, 328435, -1205, 83238, -47385, 39950, 393257, 285922, -50666, -78806, -176383, -171837, -289909, 134865, -305017, -118060, -466, -172575, 124702, 50132, -253209, -175308, -141406, 217654, -145059, 115051, -137927, 10185]
16136B04806l7467J8164o9996J5658a95666l9837A38506f8187G1053J76497b1249
16124A02782N2000J1703b06455D8387K95951a62209C3433A3935K67131A00506
16113C52372A22401d051B30878J38779b01995E4149N12175a11995A52132M2059
16103A94191P6217A00400K6328a1877B22820a35471A63221m206P795m853L6877
16092A98834b04158j5640B81O0916b33314m1173G6166b4460C49376F373J55001
16081A61374E2815e5287m2653c5160C1237g7871j72889A6629h7829f785j52576
16070a59361I0703d1411D9998J69566a20351L4595D0090a11228m06078a05198
16059a5863k2860A47827a83420L5547F9758e2267A50196H280c33175a39137n0697
$$ y = [204806, 167339, 185503, 115507, 131165, -195666, -235503, 138506, -68187, 71053, 247550, -21249, 102782, 154782, 166485, -206455, 48387, 344338, -162209, 33433, 13935, 281066, 100506, 352372, 122401, -4051, 230878, 369657, -201995, 54149, 566324, -111995, 152132, 194191, 270408, 100400, 126728, -11877, 222820, -135471, 163221, 159015, 166810, 161957, 198834, -204158, -219798, 281, 61197, -233314, -274487, 76166, -24460, 349376, 6373, 161374, 52815, -55287, -97940, -35160, 31237, -77871, -250760, 16629, -87829, -6785, -159361, 90703, -41411, 49998, 219564, -120351, -85756, 40090, -111228, -517306, -105198, -15863, -38723, 147827, -183420, -147873, 69758, -52267, 150196, 8280, -333175, -139137, -189834]
16048a89834J1159A21879K31732k5757a40556e5464A79549d18989a81157A32397
16037b2313H1848l2379r891e4289f079A44483l5768L78522E3759R014d6348j12511
16025a58859d5032J0853N762I2139J21773A4705b45417i2801n5021A91772C9212
16013a69968F483a02771H1303a54104A03242P0635a37030C1720b32023c4075B27845
16001C69039c06390I5260J05179Q6685a03676A42231b213I0743b81771D7791a75697
15989e8777j86988a9871A46323a2360k15384C69795h8188C35923P1128A31108
15978B37985I1828b0492j0873A05274K67946a9233k03148g4313B4124J68755f8641
15966g6052l01707B80882o8274G4433a4457A06480L2347b00871K6761j07684l1510
$$ y = [-189834, -178675, 121879, 353611, 327854, -140556, -55464, 179549, -418989, -181157, 132397, -22313, 81848, 49469, 39578, -54289, -6079, 144483, 108715, 487237, 53759, 62773, -46348, -158859, -45032, -34179, -28417, 92139, 213912, 14705, -245417, -92801, -147822, 191772, 39212, -169968, 6483, -102771, 81303, -154104, 103242, 173877, -137030, 31720, -232023, -34075, 227845, 369039, -306390, 95260, 200439, 287124, -103676, 142231, -2213, 90743, -281771, 47791, -175697, -58777, -245765, -19871, 146323, -12360, -227744, 369795, -88188, 335923, 407051, 131108, 237985, 91828, -20492, -31365, 105274, 373220, -19233, -222381, -74313, 24124, 192879, -68641, -76052, -377759, 280882, 212608, 74433, -14457, 106480, 138827, -200871, -174110, -281794, -313304]
15955c13304a33339b520B09782a01127P817C7150M15312h6801D8896f0261C9910
15943I590J87143C6032b0876o5958B50871b68063E9881a5749D0699c7103p0757
15932a07860o9347A77545m6108j3335a54284p132b6900A94756a53636l09787G1878
15920c66604A56311a44438n2072A07148b00948f1803H7471M5398f7721A19023
15909A40903K6135b676l06980a42835B86159C511N6415O2040b42736A47478a55120
15897H2873b51852P7059A07420a93457h0913B32631a86701E3863b47128G325f4286
15885a14371j9132G3801C25a82995k9584b1745A98520p5665B4100a01843A31401
15873A79165d0019g058j23652k49532J81486C43311a9379l6220I8224O458B9186
$$ y = [-313304, -133339, -2520, 209782, -101127, -93310, 37150, 452462, -86801, 48896, -60261, 39910, 9590, 196733, 36032, -20876, -86834, 250871, -268063, 59881, -15749, 40699, -37103, -107860, -177207, 177545, 131437, 118102, -154284, -161416, -26900, 194756, -153636, -463423, 71878, -366604, 156311, -144438, -196510, 107148, -200948, -61803, 87471, 132869, -67721, 119023, 140903, 167038, -2676, -309656, -142835, 286159, 3511, 59926, 121966, -242736, 147478, -155120, 82873, -251852, -174793, 107420, -193457, -80913, 232631, -186701, 53863, -247128, 7325, -64286, -114371, -133503, 73801, 325, -182995, -212579, -21745, 198520, 122855, 24100, -101843, 131401, 179165, -40019, -7058, -130710, -380242, -198756, 343311, -19379, -55599, 98224, 104682, 29186]
15861b66477B7253a38828A6249f6936n5548c2466j92742E8830a29941L3045c9214
15849A48893c03297j7568b3687k56428F5926j3960J11002a11805k7572A50495
15838A42893b3388j76907B7055a31265A53420n8941L12345b60634d4560j89678
15828b34238M5977G0538a27082I3985a3734j70356H0398C5886D088K71130H3986
15816a26805B53548F0835b92604D1583a74353A5942b55951I1296i895A15532c50085
15804i5991d6044A27033g8816d562A43198N0264e8067I0383K67552b3364G6934
15792c38613j44306a1528l2622k510j05102g28k68132i4552o8100B01708A410
15780a49480B98307f1581C39787q2548c00309k6937a76A33151P5248c26671j04125
$$ y = [-266477, 27253, -138828, 16249, -66936, -122484, -32466, -225208, 58830, -129941, -96896, -39214, 148893, -303297, -320865, -23687, -280115, 65926, 51966, 162968, -111805, -139377, 150495, 142893, -23388, -200295, 27055, -131265, 153420, 94479, 406824, -260634, -44560, -234238, -188261, 70538, -127082, 93985, -13734, -184090, 80398, 35886, 4088, 275218, 83986, -126805, 253548, 60835, -292604, 41583, -174353, 15942, -255951, 91296, -9895, 115532, -350085, -95991, -46044, 127033, -78816, -4562, 143198, 193462, -58067, 90383, 357935, -23364, 76934, -338613, -482919, -11528, -44150, -46660, -151762, -728, -268860, -94552, -162652, 201708, 1410, -149480, 298307, -61581, 339787, 257239, -300309, -327246, -176, 133151, 208399, -326671, -430796]
15769d30796B30873G2502h9559C75807b7412m8656E1526J7547a81614Q9273B20659
15757A12104J33477a41308I1136J60136a24896M9529l4849A02240g1520H8614
15746B26146a04301C19332j58640a04733D4761f2776H4484b37613Q7522A27208
15735C9110J29119q3132c10125D41857b29194k6525j27596J24430A39799b20406
15724I7933A1386e7105B15897a68193c4330j65782b8740A70484J03215b285j12730
15713a15015k61167C24616I1268d10522a74734N6066A52599G3095j7191a0834
15702a4480B25794m387a33283c6485J1323C3516d8342A13623l0452k3688P4358
15691A33841L58310D5144B0200J76366b4009m250A7997C272d6728r8970A10112
$$ y = [-430796, 230873, 72502, -89559, 375807, -27412, -76068, 51526, 69073, -181614, -92341, 220659, 112104, 245581, -141308, 91136, 251272, -124896, -75367, -110216, 102240, -71520, 88614, 226146, -104301, 319332, 160692, -104733, 44761, -62776, 84484, -237613, -150091, 127208, 39110, 168229, 85097, -310125, 441857, -229194, -255719, -383315, -258885, 139799, -220406, 97933, 11386, -57105, 215897, -168193, -34330, -200112, -28740, 170484, 273699, -2285, -115015, -376182, 324616, 91268, -410522, -174734, -118668, 152599, 73095, 55904, -10834, -14480, 225794, 221407, -133283, -36485, -25162, 33516, -48342, 113623, 83171, 59483, 133841, 492151, 45144, 20200, 196566, -24009, -28259, 17997, 3272, -46728, -145698, 110112]
15679G9155J4628D0197g722j68514F6233b38841N7827h5243I1920a39439o4605
15668b04044A68015b1867I1986a26986A25344h093k68730P2676J4368B10582j00187
15657A10395j5931m3930n874J81d463B56522j01771a28227E3766L2133h8506J6016
15645g2490H28K42037j11037J29775a72452N1791e5852j84846f4599j53914f8121
15633A15688i3906A47690b46315c9434C9904H887J66019C3986J86088a0031A73146
15621a40316B33936q3369J6409J76244A0883O3745A2203d12098J43004J32329
15611a36765b2478A7724Q4903c19605A59366j8199n910a61695H9629a42913O3254
15600g9659C0086b38331k8320H6433B2248Q212b55585f1435q4292L7232H0759
$$ y = [79155, 93783, 40197, -7722, -176236, 66233, -238841, -181014, -85243, 91920, -139439, -204044, 168015, -21867, 91986, -126986, 125344, -8093, -276823, -204147, -189779, 210582, 110395, 94464, 50534, 44660, 44841, -4463, 256522, 154751, -128227, 53766, 85899, -88506, -72490, 828, 242865, 131828, 261603, -172452, -120661, -55852, -240698, -64599, -218513, -68121, 115688, -93906, 147690, -246315, -39434, 39904, 8887, 174906, 33986, 220074, -10031, 173146, -140316, 233936, 150567, 166976, 343220, 10883, 74628, 12203, -412098, -269094, -136765, -22478, 17724, 102627, -319605, 159366, 141167, 135257, -161695, 89629, -142913, -79659, 30086, -238331, -266651, 86433, 22248, 30460, -255585, -61435, -145727, -108495, 80759]
15588d7598B62827a66931k31541G146c08205A65423K3653a40396A9904K99828
15578C19732a5795F5232B3178a75363A33013l554b20605B21411b32739a14261
15567b3084B56925a81284O4191j19074H6127A3184J19318o4986M7435O8930J64790
15556C48671a45028B9743O5558c8836E117N53c24934a09190r8172k2372d5527
15544A11820B9001J15735b06776q9808A66706m0799M7701d5789j70350F9502L60987
15533D30489A69901b6439I441J2188e9493a8481k73279A09995A167b16915F5783
15521a13740G2358R7287A4465a56931c4230n3169B88940l8164b06559i0577B77412
15509b85966A1160A775a80733A09670a86962r2268G7203R9371m8173b8911E3469
$$ y = [-47598, 262827, -166931, -398472, 7146, -308205, 165423, 189076, -140396, 19904, 319732, -15795, 65232, 23178, -175363, 133013, 129459, -220605, 221411, -232739, -114261, -23084, 256925, -181284, -117093, -236167, 86127, 13184, 132502, 67516, 114951, 183881, 348671, -145028, 29743, 95301, -38836, 5117, 5670, -324934, -109190, -207362, -229734, -45527, 111820, 29001, 144736, -206776, -296584, 166706, 125907, 173608, -45789, -216139, 69502, 430489, 169901, -26439, 9441, 21629, -59493, -18481, -291760, 109995, 1167, -216915, 65783, -113740, 72358, 169645, 14465, -156931, -34230, -87399, 288940, 250776, -206559, -90577, 277412, -285966, 11160, 1775, -180733, 109670, -186962, -279230, 77203, 176574, 128401, -28911, 53469]
15497e13103f4985A9602b08238e9799j05047B89144D3100a28541d0024G300a95198
15485f5779o6601L769m4790L4349d8911j6598L0864j45664J97N2612A13592a56042
15472A20540l0630a76032A76662o5691g4321A10634J7559A17R8084b14275D0209
15460H8053a20605B56367j16605A5845a05678D861e2537A41885Q3223k8585a14244
15448B42820D7866a52588c5502j49294E3487F940b45934i887j60497P5109A68436
15436C1251J31916J43684a74203M8014A9837a54281b8298F2777Q4564o2566B4289
15424H8265f9437E535Q1621a36889d0694D4676a7970k11691b6477H3229J64105
15413B47334j01272K2851O1982a09759j45065A95040a6588j02818j09976A30820
$$ y = [-513103, -64985, 19602, -208238, -59799, -164846, 289144, 43100, -128541, -40024, 7300, -195198, -65779, -132380, -128611, -173401, -139052, -48911, -65509, -34645, -180309, -180112, -127500, 113592, -156042, 120540, 89910, -176032, 176662, 110971, -74321, 110634, 128193, 117, 98201, -214275, 40209, 88053, -120605, 256367, 139762, 15845, -105678, 4861, -52537, 141885, 225108, 196523, -114244, 242820, 47866, -152588, -35502, -184796, 53487, 6940, -245934, -9887, -170384, -95275, 168436, 31251, 163167, 306851, -174203, -126189, 19837, -154281, -28298, 62777, 147341, 84775, 24289, 88265, -69437, 5535, 87156, -136889, -40694, 44676, -17970, -229661, -26477, 83229, 247334, 146062, 168913, 230895, -109759, -254824, 195040, -16588, -119406, -229382, 130820]
15402b11920O8152a677B4920R7825A5814a11325C715K1634d5008k59032J28983
15391a75057h0859K4705j97515H331b28804A13596A3938N0915e5135A37238K66686
15380D03924A00513b92899h4750B1455a50652A46975B0924K49561a07044b1288
15369A38381Q9842g5930G2635f2640m4882A36066a76938q26B03176a88974Q5448
15358a03526A46596P433j1204c7770m9451k97569J88485B42308b45704D1624a11062
15346b15686n6740B44558p9283f5904A95593g3975B98297b8013A03041a58986
15335A4108J87627a49640B35532F3819J32080G154K65860A984Q2353j4351K13663
15324B83649i1103k0199C04260G6455Q0252n0967a5773F9122J6440Q0737J68020
$$ y = [-211920, -143768, -1677, 24920, 122745, 15814, -111325, 3715, 25349, -45008, -304040, -175057, -80859, -56154, -253669, 8331, -228804, 113596, 13938, 64853, -55135, 137238, 403924, 100513, -292899, -84750, 21455, -150652, 146975, 20924, 270485, -107044, -21288, 138381, 228223, -75930, 72635, -62640, -107522, 136066, -176938, -177764, 203176, -188974, -103526, 146596, 154029, 142825, -37770, -87221, -384790, -196305, 242308, -245704, 41624, -111062, -215686, -272426, 244558, 165275, -65904, 195593, -73975, 298297, -28013, 103041, -158986, 14108, 201735, -149640, 235532, 63819, 195899, 7154, 273014, 1984, 84337, 69986, 283649, -91103, -111302, 304260, 76455, 156707, 105740, -15773, 69122, 85562, 166299, 334319]
15313C34319b00566A26046B9779d6492A44289a49057C37376A47395B9104a08893
15302b04831B55054r2175D5922K99520h7682k0739a461A55736M5355J76318c4109
15290E5484a06517F2376b03248C08420O3271c7898j6993A75814I521i1822G4314
15278E7488M9813e8063A7802c2441A46942E3543b3739k59435C80214j50172c04461
15266h123H9080k3579g7076A66712b71848A58588G1995J28206o8306O7339M5260
15255B44494D6266d8379A07150d6785B79171K88808G5510O56511K05588P24770
15245A662379J77879l48573j06431n45966A34032k1733A0548K17598b16680B5908
15234b524H6111L6728J91810j328A36119c9530B68499K2249a37839A1087K82923
$$ y = [334319, -200566, 126046, 29779, -46492, 144289, -149057, 337376, 147395, 29104, -108893, -204831, 255054, 162879, 45922, 345442, -87682, -108421, -1461, 155736, 201091, 377409, -34109, 55484, -106517, 62376, -203248, 308420, 371691, -37898, -54891, 175814, 9521, -91822, 74314, 57488, 107301, -58063, 17802, -32441, 146942, 53543, -23739, -283174, 380214, 230042, -304461, -8123, 89080, 65501, -77076, 166712, -271848, 158588, 71995, 200201, 131895, 199234, 244494, 46266, -48379, 107150, -46785, 279171, 567979, 75510, 732021, 937609, 1662379, 1840258, 1491685, 1385254, 839288, 134032, 112299, 10548, 228146, -216680, 25908, -2524, 86111, 122839, 314649, 313321, 136119, -39530, 268499, 290748, -137839, 11087, 294010]
15223B94010b34318A05569K39176D9491J19470o2317i9256F6768J85105d6829
15212a5646E0172J2095J1979a9334k75617G0369J96635l0086I9466P1685l1452
15201A39699d7111B920a44608A08965K0920Q6627J70679A46925Q0691N2854q312
15190B72158J30443A11264J91546I5080l1883O242K4841A9067i222B31040k4041
15179B06999j02581K13039G9540i4265n3686H5838J11817j6933n9614b4097C97202
15167B40529a5792r2571D12082A6072h8892a3918n8124a4197C1608K26824a90238
15155f7686D9029M92794c580m5732B04536H9766c3603l3975F0056Q129a40245
15143H1765d55B4324N7022N682J6261B7834N3969g4544r3364f0785H3047K00564
$$ y = [294010, -234318, 105569, 344745, 49491, 168961, 106644, -99256, 66768, 251873, -46829, -15646, 50172, 62267, 74246, -19334, -294951, 70369, 267004, 236918, 99466, 171151, 139699, -47111, 2920, -144608, 108965, 129885, 216512, 387191, 146925, 227616, 280470, 272158, 402601, 111264, 302810, 95080, 63197, 69439, 94280, 19067, -9222, 231040, 206999, 104418, 317457, 79540, -94265, -147951, 85838, 197655, 180722, 121108, -24097, 397202, 240529, -15792, -108363, 412082, 16072, -88892, -13918, -72042, -14197, 31608, 258432, -190238, -67686, 49029, 541823, -3580, -49312, 204536, 89766, -33603, -67578, 60056, 68185, -140245, 81765, -455, 24324, 81346, 87028, 103289, 27834, 81803, -74544, -167908, -60785, 83047, 283611]
15131B83611J63134g5191A66916P7515p2672m3401K10318q1617m3995a87728j2137
15120a99865d9210E7096a26660A22175C0334j0024K50068j20465c0265A48300
15109I4569K67628D4953M26457B15039j06547a81551H6824f8449E3630P4430b4630
15097a28045A87414n1397e0464A88929c27209a17780D6311J89133M5868G4190
15086B55015F8759J67765b92692C96465A82864B351L0560J69384E481J40618K7767
15075A73866k0267a48977B25832j49i1589I3380R37Q6759b11014A9376O2872h7183
15062a4728B02037K86471j57905A38665e7640G2642A6607J63021a41238B90338
15051E6770J12007K76011j35362R0816b01797B49778o9161J83128j69783N1770
$$ y = [283611, 446745, -75191, 166916, 244431, 171759, 128358, 338676, 257059, 213064, -187728, -199865, -49210, 57096, -126660, 122175, 30334, 20310, 270378, 149913, -30265, 148300, 94569, 362197, 44953, 471410, 215039, 108492, -181551, 86824, -68449, 53630, 128060, -24630, -128045, 187414, 136017, -50464, 188929, -327209, -117780, 46311, 235444, 281312, 74190, 255015, 68759, 236524, -292692, 396465, 182864, 2351, 32911, 202295, 5481, 146099, 173866, 153599, -148977, 225832, 225683, -91589, 93380, 94317, 181076, -211014, 19376, 82248, -87183, -14728, 202037, 488508, 330603, 138665, -57640, 72642, 16607, 179628, -141238, 290338, 56770, 168777, 444788, 309426, 400242, -201797, 249778, 180617, 363745, 193962, 245732]
15041B45732p0749J45025b503F58424B03518n214K42827j28041d7641D24622A10117
15029B04403n5015K09014j35379e3389A52483N6036Q7947o1528J04935N696L024
15018C48593F7391K93152A26881N505m6128K93749j53336K0994G4495d7833A22874
15006A30223P4047Q6019o5822p1754J16980q2166K66551j49332A42387J42132
14996B84519a50174A45789j5324K87740A58271K33537I0914L46184A63575J59672
14986C23247r4086o8626D4115P8117a75635B38903Q2344m4952K7287r8321I0188
14974C08251K81154A56762P248o5807K50004F3487J69850m6240b22999B74095
14963d364D2492b7842A36786n2137M11224j23413j62172J26179L11054B51087
$$ y = [245732, 174983, 320008, -2503, 658424, 203518, 198304, 441131, 313090, -47641, 424622, 110117, 204403, 149388, 358402, 223023, -53389, 152483, 208519, 296466, 234938, 339873, 345569, 348593, 67391, 360543, 126881, 132386, 86258, 380007, 226671, 247665, 74495, -47833, 122874, 130223, 204270, 290289, 224467, 152713, 269693, 187527, 454078, 304746, 142387, 284519, -150174, 145789, 130465, 418205, 158271, 391808, 90914, 437098, 163575, 323247, 229161, 160535, 44115, 122232, -175635, 238903, 321247, 276295, 303582, 205261, 90188, 308251, 589405, 156762, 164010, 98203, 348207, 63487, 233337, 187097, -222999, 274095, -4364, 42492, -27842, 136786, 84649, 495873, 372460, 210288, 336467, 647521, 251087]
14952A35538J35088j28977M02126G4410L31314A7031N41770B13451I8528J09429
14942B07957J00037E1619K58206Q1573j00973C5040L06009L04138k44538k0862
14932C79787M8742k10500j0317H1061L50256j06494j07795J71553d00E32825j27732
14921D05093k0435j3586A76475Q0588l690R8276j02852N4757P4930j47737l403
14910B27344K87078r1582A83381M9513a1104A10034P7091K89647r9169o7621j2325
14899B97657O06997C7174K63310J24586j95749o521J42916R4873a7187D77694
14888D72694j13669J8038N5324G6964N11865R6182k18847f9169B53928K23462
14878D77390r4648j75614J63259m0577m1504R0174k3293H8718D4228L51340A60653
$$ y = [135538, 270626, 141649, 543775, 74410, 405724, 17031, 558801, 213451, 98528, 207957, 307994, 51619, 309825, 391398, 290425, 35040, 341049, 645187, 400649, 379787, 428529, 218029, 207712, 81061, 431317, 324823, 217028, 388581, -400, 532825, 405093, 384658, 371072, 176475, 257063, 253373, 351649, 248797, 303554, 378484, 230747, 227344, 514422, 422840, 183381, 232894, -11104, 110034, 187125, 476772, 377603, 309982, 297657, 904654, 37174, 300484, 425070, 229321, 222800, 365716, 460589, -17187, 477694, 472694, 359025, 377063, 432387, 76964, 588829, 685011, 466164, -69169, 253928, 477390, 382742, 207128, 370387, 329810, 288306, 378480, 355187, 88718, 44228, 395568, 160653]
14866D97237B03565J24879M20380k61524r0492K2411d9090C67805E7895K56777
14856C14672J44510P7217p2445l8275o1295J54664I9084k4472L12336M401j52468
14845B38881Q5642M0117l7345R2969Q1646j72157A38689J67919n0283J10733P1239
14834D38297j67132J98523O8185j59450J87025l5333p2199K8721k33699K58795
14824E11733k51760R2626K04867A54412L27413L33376l08604J0200k7179A10982
14813E45142j83621j69871K68701K22199k02572m0902A48899L94445K96206M940
14803H44490k55152N9619j58911j77422K27973K9390K9939j81207M4509R8474
14793E61702K15390k38398o3418Q4077L32255l83203P4003m5029R7605Q9888P5763
$$ y = [497237, 203565, 328444, 748824, 487300, 396808, 419219, -49090, 367805, 57895, 314672, 459182, 536399, 463954, 425679, 364384, 519048, 99084, 74612, 386948, 391349, 238881, 324523, 364640, 327295, 420264, 501910, 329753, 138689, 306608, 256325, 367058, 438297, 271165, 469688, 537873, 378423, 565448, 530115, 457916, 486637, 252938, 511733, 259973, 352599, 557466, 154412, 481825, 815201, 506597, 516797, 489618, 110982, 545142, 361521, 191650, 460351, 682550, 479978, 439076, 148899, 543344, 839550, 844490, 589338, 648957, 490046, 312624, 540597, 569987, 599926, 418719, 463228, 561702, 777092, 538694, 475276, 559353, 891608, 508405, 582408, 537379, 634984, 724872, 800635]
14782H00635l24517M4502J51549j19067B67295K18960j29035J20110j0116J48955
14772F16169k48369Q5221O1194q9630j03580L03997J53678k32678K26791p3351
14762F99442K2045l45931N5524J2431J16424J7645k65255J66321J80035M65517
14752A124198E33186J37952m7558j52224J58395j1730n3193j83031L04821K08253
14742H94871p6983k17903m079M76437E20213L04455K44211m68869L36112k99671
14732F36451J84843r8715B88923L05141j78436J18184L62769J73418j42331k55537
14722F72131L83727k14352n7369m6351r237q1308q1603L72217l32897j48187K41953
14711F98724J21169j25377J26851J9602M7994q982k58578Q1408m6038K51171K0033
$$ y = [800635, 476118, 520620, 672169, 553102, 267295, 486255, 357220, 477330, 467214, 616169, 367800, 453021, 514215, 424585, 321005, 625002, 778680, 546002, 772793, 699442, 721487, 375556, 431080, 443511, 559935, 577580, 312325, 478646, 658681, 1124198, 533186, 671138, 623580, 471356, 629751, 618021, 564828, 381797, 686618, 894871, 817888, 599985, 595906, 1072343, 520213, 824668, 1068879, 600010, 936122, 636451, 821294, 722579, 288923, 594064, 415628, 533812, 896581, 1069999, 927668, 672131, 1055858, 841506, 784137, 737786, 728549, 647241, 565638, 937855, 604958, 456771, 698724, 819893, 694516, 821367, 840969, 888963, 879981, 621403, 702811, 656773, 907944, 927977]
14700I27977p6200J30877D86153M65806n2845k21497N49260k29762l5404J36675
14690A098386r7765j43534K67068k55332K1571q3254K19086k1498l40915L13924
14680I77737o6791O7448J29654k98501K0037J41143l38267J15372L62670P9624
14670A190126j18950q4216J56195l5908k87338L21785j69683J03911J00838o2178
14660A114582k12193M99078o74851L38968J99580j82481k44017K92739j11545
14651A019860j42832O21135m73047J48834m2503l47602L22585m769K15810R6178
14641A413649k05090J16284N0316l11808o821k65733N21079l57120P2750o1665
14631I65841N60244n91198R0718K86162M22652l79919k67273L2865K14692K11616
$$ y = [927977, 851777, 982654, 486153, 951959, 899114, 677617, 1226877, 997115, 961711, 1098386, 1000621, 857087, 1124155, 868823, 890394, 807140, 1026226, 1004728, 663813, 977737, 910946, 978394, 1108048, 809547, 829584, 970727, 632460, 747832, 1110502, 1190126, 1071176, 986960, 1143155, 1107247, 819909, 1141694, 972011, 1075922, 1176760, 1114582, 902389, 1401467, 726616, 1065584, 1265164, 1082683, 838666, 1131405, 1019860, 877028, 1498163, 1025116, 1173950, 1131447, 783845, 1106430, 1101661, 1317471, 1413649, 1208559, 1324843, 1375159, 1063351, 1056530, 790797, 1311876, 954756, 1027506, 965841, 1526085, 934887, 1025605, 1311767, 1734419, 1354500, 1087227, 1120092, 1334784, 1546400]
14621A546400l53990l06719K67688L83964O8390k44123j40226K61564K8183p3575
14611A437556p3609k40168O6692o4783K51137J87598N9424m070J17554J47679
14601A885010j93684k1360j51262k2659R3840J0727M36006m88884K63174o5916
14591A744992K877l29321M30558j67608k48777L72202K30008l63608J86419k46034
14581A611708L70116n8580O540K8626J85823j44555r0560j9285j46500Q4139M44323
14570B271795l33565J44021J88306l42163L51962o2460J58348Q2883j13278q307
14560B337542O7769M7555J43798L31404R5560K00625Q0481K51998L08396R29330
14550D794458J097021K182854N563526J0457449P042091O099171j5344795j0501966
$$ y = [1546400, 1192410, 885691, 1153379, 1537343, 1605733, 1361610, 1221384, 1482948, 1511131, 1437556, 1363947, 1123779, 1190471, 1125688, 1376825, 1564423, 1623847, 1619777, 1737331, 1885010, 1691326, 1669966, 1518704, 1496045, 1589885, 1600612, 2036618, 1547734, 1810908, 1744992, 1747869, 1418548, 1849106, 1681498, 1432721, 1804923, 2034931, 1671323, 1857742, 1611708, 1981824, 1923244, 1929784, 1958410, 2144233, 1999678, 1909118, 1889833, 1743333, 1827472, 2271795, 1938230, 2082251, 2270557, 1928394, 2280356, 2217896, 2376244, 2459127, 2345849, 2337542, 2405311, 2452866, 2596664, 2928068, 3023628, 3224253, 3304734, 3556732, 3865128, 4794458, 5891479, 8074333, 13637859, 24095308, 31137399, 37236570, 21891775, 11389809]
14542A1389809l937069k907680j783833o94970L10747l16495O0975m38166J48865
14533A832183l589J05416J71245j65502O3288J90564j51735K22952K69366p5736
14523B458452k05907L06954j9381l56579N55052l34898P0869k30575L42034L98798
14513B984819n38267L64330l2285k74738J96351K0895P1978j49916j2830M60060
14503C090397m42837M67264q538k03840j16947K12607L10489Q3314R1813k72121
14493C211601m3402q0941L55425r1286K88201k24565K22862n0570l69465K18870
14483C436730N17691n2741j54996k6997j44458K58321j06532P8786j3210K28400
14473D020994P7028K08574j73274K61012l06450N1798K95617j36194K70921j61042
$$ y = [11389809, 7452740, 4545060, 2761227, 2066257, 2377004, 2060509, 2121484, 1683318, 1832183, 1828594, 1934010, 2105255, 1939753, 2003041, 2193605, 2041870, 2264822, 2534188, 2458452, 2252545, 2559499, 2540118, 2183539, 2738591, 2403693, 2474562, 2243987, 2586021, 2984819, 2446552, 2810882, 2778597, 2503859, 2700210, 2721105, 2793083, 2643167, 2630337, 3090397, 2647560, 3114824, 3106286, 2902446, 2785499, 2998106, 3308595, 3391909, 3483722, 3211601, 3168199, 3087258, 3442683, 3351397, 3639598, 3415033, 3637895, 3587325, 3217860, 3436730, 3954421, 3901680, 3746684, 3719687, 3575229, 3833550, 3727018, 3805804, 3792594, 4020994, 4098022, 4306596, 4133322, 4394334, 4087884, 4139682, 4435299, 4299105, 4570026, 4408984]
14463D408984P203N6684O3212K36861q1741M0612P5166J45964j04280k38040N61501
14452E172126p3132N7183L42713j94414M26809k86533k20100L03243l9079M20142
14442E908958j7749J29230l04156M02106O3336k12609J12806L11383l72707Q44813
14432F865411j22527J76763l64270K13299j59363N33501Q4506k02386M03665j68559
14422G260040J48455J00284N9635K16167K2766L25458L9785J09778k09212N12918
14412H586074Q1300k6774L04584L5257j75296N92015k43439L77788K51070j87907
14402I594672L91454J63266j54125L25169j73822N99075J89162J41880J23647
14393A1200378K02130O15577o2243r2690M79260j33278M37114J91060J10547N99950
$$ y = [4408984, 4416187, 4472871, 4536083, 4772944, 4691203, 4731815, 4806981, 4952945, 4848665, 4610625, 5172126, 5098994, 5156177, 5498890, 5304476, 5731285, 5444752, 5224652, 5527895, 5488816, 5908958, 5891209, 6020439, 5716283, 6118389, 6181725, 5969116, 6081922, 6393305, 6020598, 6865411, 6742884, 6919647, 6555377, 6768676, 6609313, 7142814, 7227320, 7024934, 7428599, 7260040, 7408495, 7508779, 7568414, 7784581, 7807347, 8132805, 8172590, 8282368, 8073156, 8586074, 8667374, 8640600, 8945184, 8980441, 8805145, 9397160, 9153721, 9531509, 9782579, 9594672, 9986126, 10149392, 9995267, 10320436, 10146614, 10745689, 10934851, 11076731, 11200378, 11402508, 12018085, 11955842, 11863152, 12342412, 12209134, 12646248, 12837308, 12947855, 13547805]
14383A3547805j99139N53717L52461K32109P894M75746P7014M10042P48268k957
14373A6202960K39169J25199M01553K59333K86958N89687K19082K49516M39050
14364A9012507L53459P35732K34165O67619K31631L58042N77222N73388Q28076
14355B3571841m646R26771M41994P52444N30784P91713M15728N87969Q60460O67787
14345B9542845P45448Q04139R99506M86694Q90559J042196J005359P88128J100533
14336C7405407J084032R23048J487297J258301Q10657J123113J683774J462669
14328D7238298J187287J989500J205492J593659J985170J827751J673713K451381
14320F1152251K014737K242271K143651L206263K364238K817322L006787L159093
$$ y = [13547805, 13348666, 13902383, 14254844, 14486953, 14494847, 14970593, 15047607, 15457649, 16205917, 16202960, 16442129, 16567328, 16968881, 17228214, 17515172, 18104859, 18323941, 18573457, 19012507, 19365966, 20101698, 20335863, 21003482, 21235113, 21593155, 22170377, 22743765, 23571841, 23567195, 24493966, 24935960, 25688404, 26219188, 27010901, 27426629, 28014598, 28875058, 29542845, 30288293, 31092432, 32091938, 32578632, 33469191, 34511387, 35516746, 36304874, 37405407, 38489439, 39412487, 40899784, 42158085, 42968742, 44091855, 45775629, 47238298, 48425585, 50415085, 51620577, 53214236, 55199406, 57027157, 58700870, 61152251, 63166988, 65409259, 67552910, 70759173, 73123411, 75940733, 78947520, 82106613]
14312H2106613L195839L437409M122621M015141L775542M341720M677395M484045
14304A14156325N197318N344176N683218N982600O005455P186931P158765P459526
14296A64174314Q266845Q567600Q780114R471318J0228012J0623400J0948545
14289B31060148J1645434J2401726J2547953J3198174J3606235J4166125J4380831
14282C23006626J4692231J4913131J4582512J4883940J4548203J3435924J2718978
14275D22781545J1531657Q959959N151987J053631n335633l25542M571711m00334
14267D47988981l936320l920304m377778r201750j2175355j3670600j4797238
14260C85909636j5510378j5853007j5794039j5845770j5539635j4943777j4518243
$$ y = [82106613, 85302452, 88739861, 92862482, 96877623, 100653165, 104994885, 109672280, 114156325, 119353643, 124697819, 130381037, 136363637, 142369092, 149556023, 156714788, 164174314, 172441159, 181008759, 189788873, 199260191, 209488203, 220111603, 231060148, 242705582, 255107308, 267655261, 280853435, 294459670, 308625795, 323006626, 337698857, 352611988, 367194500, 382078440, 396626643, 410062567, 422781545, 434313202, 443273161, 448425148, 449478779, 444143146, 443817604, 448389315, 447988981, 444052661, 440132357, 435754579, 426552829, 414377474, 400706874, 385909636, 370399258, 354546251, 338752212, 322906442, 307366807, 292423030, 277904787]
14253B77904787j3538588j2562088j2861251j2148732j1411443j0884738j0118806
14246A94379141r511450q983729q744067p601658p692947p122276o848623o042105
14238A31832286n674523n597593n280840n328227m411440m648211l868454l681254
14230I3341744m073930l132470l735141k960396l168296k857276k584797k687166
14222F8142272k571418k061620k068450k016786k327906j925811j846437j674840
14214E1649004j437713j274310j279364k002366j383938j569000r29330j087818
14206D0685165p50695j599686j376322o49350j266370o89326p06192j030425j150147
14197C1466652o15661j279312m67917n84626p35228o40337o47131p22434p34585
$$ y = [277904787, 264366199, 251804111, 238942860, 226794128, 215382685, 204497947, 194379141, 184867691, 175883962, 167139895, 159538237, 151845290, 144723014, 137874391, 131832286, 126157763, 120560170, 115279330, 109951103, 105539663, 100891452, 97022998, 93341744, 89267814, 86135344, 82400203, 79439807, 76271511, 73414235, 70829438, 68142272, 65570854, 63509234, 61440784, 59423998, 57096092, 55170281, 53323844, 51649004, 50211291, 48936981, 47657617, 45655251, 44271313, 42702313, 41772983, 40685165, 39934470, 38334784, 36958462, 36309112, 35042742, 34353416, 33647224, 32616799, 31466652, 30850991, 29571679, 29103762, 28519136, 27783908, 27143571, 26496440, 25774006, 25039421]
14188B5039421m27348o56290l21349j74891p01473p83123m52148l06985o11567
14179B0604247p35031k82016J9303o39771n12973k85076o54324m21227K66667
14170A7359799l76094l85997n9938o44485m72652r8676n56653k91394K12524n39830
14160A4146604k28552k75198m19522k68056l3626j04471O3175o02603l07112k03862
14150A1766777K01649n54201J8636l96272j44367j76270Q7756l73001L8570l06806
14140A0162471k94331j16049k3623l45954K24807l4080m81545k05058n0705j16641
14130H719292k23852r9581k72451K46697l37672J3295K25766n62046J00110j03258
14120G706300N9602l72977j14985l20965J07570j5230O2351k13125J29560l21105
$$ y = [25039421, 24612073, 23955783, 23634434, 23459543, 22758070, 21974947, 21522799, 21215814, 20604247, 19869216, 19587200, 19606503, 18966732, 18453759, 18168683, 17514359, 17093132, 17359799, 16983705, 16597708, 16537770, 15893285, 15420633, 15321957, 14765304, 14473910, 14686434, 14146604, 13918052, 13642854, 13223332, 12955276, 12921650, 12817179, 12880354, 12277751, 11970639, 11766777, 11968426, 11414225, 11432861, 11036589, 10892222, 10715952, 10803708, 10430707, 10469277, 10162471, 9868140, 9752091, 9728468, 9382514, 9607321, 9573241, 9091696, 8886638, 8835933, 8719292, 8495440, 8395859, 8123408, 8370105, 8032433, 8045728, 8271494, 7709448, 7809558, 7706300, 7765902, 7392925, 7277940, 6956975, 7064545, 7049315, 7111666, 6898541, 7028101, 6706996]
14110F706996k12089J81099k1384k26079j29274l3639M8219m84755o2709J28381
14100E894766k9895m19403K85032j13771P7119k98590J6497Q2733k72099J25903
14090E348292K11218l10165K0847k96500j34307M5395L2737J33745o18289L04444
14080D737417J31190m58262J89177j57345K06285l29292q2152m2199K50318k55890
14070D189247M7604j61906k32154O2427K87392j92152J28808n65498j6154M13620
14060C961234j6822K75351j75599o7434o1275k60156K75894m89582p072K91040
14050C725579k99517Q3514P4377k13743j93626J75050j07646j86233k17763K29706
14040C069698J26609k24753j38896L36828l66106L21361J81881l96930l1185Q2310
$$ y = [6706996, 6494907, 6676006, 6654622, 6428543, 6299269, 6265630, 6313849, 5829094, 5766385, 5894766, 5864871, 5445468, 5730500, 5616729, 5693848, 5395258, 5411755, 5494488, 5222389, 5348292, 5559510, 5249345, 5270192, 4973692, 4839385, 4884780, 4917517, 5051262, 4432973, 4737417, 4868607, 4410345, 4599522, 4442177, 4648462, 4319170, 4237018, 4194819, 4445137, 4189247, 4236851, 4074945, 3842791, 3905218, 4192610, 4000458, 4129266, 3563768, 3547614, 3961234, 3944412, 4219763, 4044164, 3976730, 3915455, 3655299, 3931193, 3441611, 3434539, 3725579, 3426062, 3509576, 3583953, 3370210, 3176584, 3351634, 3243988, 3057755, 2839992, 3069698, 3196307, 2971554, 2832658, 3169486, 2803380, 3124741, 3306622, 2909692, 2878507, 2960817]
14030B960817J9391Q8726o9462J64337p21444J43605R1684p3025K57969j87022
14020B675576l09644K53734m79058K01077L66152k58465J91990j82348J41396
14011B600410l46961J86407K49904j51935l50616O02708m80308j36474j21119
14002B052016Q5920o2530J76936l67148M72166j2716l59091O8187L0775j02151
13992A982364J12161K43680P04013J276833L830491J0873284P849444J1077773
13984C7950043j1622023j1513534n383863l364915j575371p94567l39626j82064
13976C174080l05727k35783M7065j23172l99612L7500J26628O2779j77006k33612
13966A973140L66208M533k72269O853M1007j84626O35583n64995P554p2825l6951
$$ y = [2960817, 2980208, 3068934, 2999472, 3163809, 2442365, 2585970, 2677654, 2604629, 2862598, 2675576, 2365932, 2619666, 2140608, 2341685, 2707837, 2449372, 2641362, 2459014, 2600410, 2253449, 2439856, 2689760, 2537825, 2187209, 2789917, 2309609, 2173135, 2052016, 2137936, 2075406, 2252342, 1885194, 2357360, 2344644, 1985553, 2053740, 2084515, 1982364, 2094525, 2338205, 3042218, 4319051, 8149542, 19022826, 26872270, 37950043, 26328020, 14814486, 9430623, 6065708, 4490337, 3695770, 3356144, 3174080, 2868353, 2632570, 2679635, 2556463, 2156851, 2194351, 2320979, 2383758, 2206752, 1973140, 2339348, 2343881, 2071612, 2078465, 2119472, 1934846, 2570429, 2005434, 2012988, 1940163, 1903212]
13955A903212J39624J15883k76326K9181m4147J25899k93271K59348k31846K31600
13945A959157k34815K1068p5489K58885j90243j21594J75014j21824K81061m66811
13935A484409O5508J64560j95798L91985m72870l2395M03020k4517m18401R4252
13925A459753K00832k7934l06603R574J86554q2139J15605j84451j11113N56764
13915A816842n2644k25339j96182j54027K51210K13797j87621J30154r9974j83103
13905A313113k01075N73998o70543L74938l07620j43576K32204J31343k6051K650
13895A279381K8827j05015J91084m91263K93353N5445j80034L39787j78348o0053
13885A173164K2564j89959J31361j67315o6588M19639o8421j90987K42717k72907
$$ y = [1903212, 2042836, 2158719, 1882393, 1911574, 1867427, 1993326, 1700055, 1959403, 1727557, 1959157, 1724342, 1745410, 1669921, 1928806, 1738563, 1616969, 1791983, 1670159, 1951220, 1484409, 1549917, 1714477, 1518679, 1910664, 1437794, 1405399, 1808419, 1783902, 1365501, 1459753, 1660585, 1632651, 1326048, 1335622, 1522176, 1440037, 1555642, 1371191, 1260078, 1816842, 1764198, 1538859, 1342677, 1188650, 1439860, 1653657, 1466036, 1596190, 1496216, 1313113, 1112038, 1686036, 1015493, 1390431, 1082811, 939235, 1171439, 1302782, 1276731, 1279381, 1308208, 1203193, 1394277, 903014, 1196367, 1251812, 1071778, 1411565, 1233217, 1173164, 1195728, 1005769, 1137130, 969815, 903227, 1322866, 1254445, 1063458, 1306175, 1033268]
13875A033268K15475j89543M7504j1489J32590L3186J89396l47981m9028O7274
13865A120652j17886K71863k21163k27816L12440k97358K00631j1146J28317j31404
13855A027130p8487J63267K30527j67191q8993j38679q8002J81497o9387J31922
13845A103604n7925k59916O4195P9283J62619k35892J34450K23723q6030k41185
13835H86926J28278j30215k86502l5348O69410m07422M0795j75120Q9044q6269
13825F93577J94258J90670k61555J88395k26217r3168N3573p3670j62239L47338
13815H50962q0437J92664p1254N1243N7300k07054K70477k29981P244k1423J39629
13804I59370O2950k71597J20007j77834p2945K73813C65470L10416L77082k07367
$$ y = [1033268, 1248743, 1059200, 1106704, 1095215, 1227805, 1260991, 1450387, 1102406, 1053378, 1120652, 1002766, 1274629, 1053466, 825650, 1138090, 840732, 1041363, 1030217, 1158534, 1027130, 948643, 1111910, 1342437, 1175246, 1086253, 947574, 859572, 1041069, 971682, 1103604, 1045679, 785763, 849958, 929241, 1091860, 855968, 990418, 1214141, 1128111, 886926, 1015204, 884989, 598487, 563139, 1232549, 825127, 865922, 690802, 779846, 693577, 887835, 1078505, 816950, 1005345, 779128, 685960, 739533, 665863, 503624, 850962, 770525, 963189, 891935, 943178, 1000478, 793424, 1063901, 833920, 841164, 819741, 959370, 1022320, 750723, 870730, 692896, 619951, 893764, 365470, 675886, 1052968, 845601]
13794H45601j38471J38446l64067J39202m2051J18846L9093j81791N89139E30204
13783G87101l38944K84459J14944q0514J09738j88863J07848k23485O0577K40089
13773H72950k87179K54679B77176M77058o7878k55060K51617l26843K21169J1670
13763E88909J33659R7632j29137J69179l16824J7521p9518o0699J00735j51755
13753C69702L43767K72087A83057M43737J63396j63728j1271Q7477k40528P601
13743D69741n3235J00023J39788k10162j16760q1887l582N17050B40366K21006
13733D61372J14933j39298m3345j26538L37672J22570C51242J76276j1207R0276
13723F06587M607K51526k5855l18749M1253j08720k2583Q6468J54358j08065B51874
$$ y = [845601, 707130, 845576, 481509, 620711, 578660, 697506, 736599, 554808, 1143947, 530204, 787101, 448157, 732616, 847560, 767046, 876784, 687921, 795769, 572284, 632861, 872950, 585771, 840450, 277176, 754234, 686356, 431296, 682913, 356070, 577239, 588909, 722568, 820200, 691063, 860242, 543418, 560939, 481421, 420722, 521457, 369702, 713469, 985556, 183057, 626794, 790190, 626462, 615191, 702668, 462140, 469741, 416506, 516529, 656317, 446155, 329395, 247508, 243926, 760976, 240366, 461372, 576305, 437007, 393662, 267124, 604796, 727366, 351242, 527518, 516311, 606587, 611194, 862720, 836865, 518116, 559369, 450649, 428066, 514534, 668892, 560827, 251874]
13711G33363C29591K70126k74798K59881P1060q2464j38743J94999k45089J89037
13701E73600J3543j01939L43944l89428N3916K14308k99180j31133K80961K33861
13691G92453l47979r8890K23031k61232A19061N87961A34247L27844j83109J14120
13681C93102P1687l5593q5581J94706k53395J79871o5364J88887k47036R5470
13671D36754j73210J64176d0574A01460J37689r5308L60390j28878M14165B36283
13660D26460r843O6601j71402o5583K92876K8566k31363J75845j90441R1107j48637
13649B64186L6561M40658C57908L54402j04046B88348J31621J42300B40942J26639
13639C67581j27068H5920J94661q9192J07638Q102J00112J54918Q6195J48790
$$ y = [733363, 329591, 599717, 324919, 584800, 655860, 573396, 434653, 629652, 384563, 573600, 587143, 485204, 829148, 439720, 493636, 707944, 408764, 277631, 558592, 792453, 444474, 345584, 568615, 307383, 119061, 707022, 134247, 462091, 278982, 393102, 464789, 429196, 343615, 538321, 284926, 464797, 399433, 588320, 341284, 436754, 263544, 427720, -40574, 101460, 239149, 143841, 504231, 375353, 789518, 236283, 426460, 416617, 483218, 311816, 246233, 539109, 567675, 336312, 512157, 321716, 412823, 264186, 300747, 741405, 357908, 712310, 608264, 288348, 419969, 562269, 240942, 367581, 240513, 85920, 280581, 191389, 299027, 307129, 407241, 562159, 648354, 797144]
13629G97144C39624L01826o2655j42819j24380l0652O6858P3356A06665J24899
13619B31564R4204M7561q0396J32528a1222B76118K88650k06837p5403L32581
13609F15109C06129M80718n1307k88993L4769k13454M20499j37613A23293K60489
13599C83782A67857Q6163K80253l4685k02645l4904K8671m1814K97260k06475
13589C39681J28648M1602j35448A68422K59279l1323j96753L64122k78441M1935
13579C27241L70200B66093p2795M762M5156K50343B0438L97115j97343A00580
13568D76365A70309C7345J77044K36009q9489M9431j98430o3866M43677j52559
13558D39162A83283O8874A14259K6432K97777k6896A21962n3517N5786K16444
$$ y = [797144, 339624, 641450, 578795, 435976, 311596, 280944, 347802, 421158, 106665, 231564, 325768, 373329, 292933, 425461, -11222, 276118, 564768, 357931, 282528, 615109, 306129, 786847, 735540, 446547, 481316, 267862, 688361, 550748, 123293, 383782, 167857, 254020, 534273, 499588, 296943, 262039, 290710, 248896, 546156, 339681, 468329, 509931, 374483, 168422, 427701, 396378, 199625, 563747, 285306, 327241, 697441, 266093, 193298, 198060, 243216, 493559, 20438, 417553, 220210, 100580, 476365, 170309, 37345, 214389, 450398, 360909, 410340, 211910, 148044, 591721, 439162, 183283, 252157, 114259, 140691, 438468, 411572, 121962, 68445, 124231, 340675]
13548C40675o5729b7794D1021J82613i0314A87722J23349b6601C84985o7126j39448
13537A78411l9396K72002J24622C4018M79071j36771J70352k37577R6388j15347
13527B90134o1440l2908M5997r8546K20065A55389K51396J556j84361o62O9078
13516B92396o7536N1280Q6275J60895b0947B54389J43454g1826C13310J27072
13506D40382A49277J80582q8003J31713n3605j8025F0343Q0429f7103C33629l9808
13495B93821L3426R9865M1196A56127J35055p5795K9273n6979L9726q1013L16547
13484D62941F8140K01038L26011H4838K78998j54342E7276J33148J43340l8415
13474B95349j24846K38941j83946C3132L86519o1313A27512J8203j3945F3099
$$ y = [340675, 274946, -27794, 41021, 223634, -90314, 187722, 311071, -26601, 384985, 317859, 178411, 139015, 411017, 535639, 34018, 513089, 376318, 546670, 309093, 405481, 290134, 228694, 195786, 241783, 143237, 363302, 155389, 406785, 408341, 223980, 223318, 292396, 224860, 276140, 362415, 523310, -20947, 254389, 397843, -71826, 313310, 440382, 149277, 329859, 241856, 373569, 319964, 301939, 60343, 140772, -67103, 333629, 293821, 327247, 427112, 468308, 156127, 291182, 215387, 244660, 187681, 227407, 146394, 462941, 68140, 269178, 595189, 84838, 363836, 209494, 57276, 190424, 333764, 295349, 170503, 409444, 225498, 33132, 419651, 358338, 127512, 145715, 131770, 63099]
13463A70769M53221I7873Q4993J69019D4580J1159K50916a64039B15433B4737
13452C33133A04971P8074D7334N5690b7906B75120B6249J912L18397R930J1167
13441C67655r3511f9670B0899J86831H6859K34564j29315J96954d3622N02k29895
13430b73015A11899L35678j07754a5873B56531D9020J97513I8879D339J37001
13420A41340O7821J39325j5871j26232Q0674L3559Q9206a40209D15028B9250P8622
13409A07872J64119D8067K54349p1848N9119K07910A77696f9950f47B25091l1439
13398A93652e332B24378a573A34883N5476F2197L70585B12354D2567J02590J69800
13387C14957A08102J06629a585A59026O358O9062Q7687j01419r4850b7400C13697
$$ y = [170769, 623990, 97873, 182866, 351885, 44580, 55739, 306655, -164039, 215433, 24737, 333133, 104971, 183045, 47334, 103024, -27906, 275120, 26249, 28161, 346558, 356488, 367655, 274144, -69670, 20899, 207730, 86859, 321423, 192108, 389062, -43622, -43120, -273015, 111899, 447577, 339823, -15873, 256531, 49020, 246533, 98879, 4339, 141340, 209161, 348486, 332615, 206383, 287057, 320616, 409822, -140209, 415028, 29250, 107872, 271991, 48067, 302416, 230568, 289687, 497597, 177696, -69950, -647, 225091, 193652, -5332, 224378, -1573, 134883, 190359, 62197, 432782, 212354, 42567, 145157, 314957, 108102, 214731, -1585, 159026, 165384, 234446, 322133, 220714, 125864, -27400, 313697]
13375A43553K3295G5280M35124B37462J24277j14776j04510L03513E9728K60101
13365C19829M7555G8281O0686J17088G7601L23942I9716L0806J61486j42608J54877
13354C04277C6443P1088N39424A23805O1126f3687A27424J07006o2144K8753J43715
13343C44754O2647B02824q1458J00275j547r5438K42546j62437L08784j72446
13333C41103I0692l9914K591N73155k22234j66958J2637P3038R1523A13557A9408
13321A85952J30562D2796J85972K0180j20309K977n4141a47648A24991n381i613
13309B36728E9368J3895K88560k4756I9422e7484I9057K09520J5814a1779A54556
13297D6201L36873F2244j5899O61714A22761M3413R5189i0228I773M05482A99861
$$ y = [143553, 166848, 75280, 510404, 237462, 361739, 246963, 142453, 445966, 59728, 319829, 367384, 78281, 138967, 256055, 77601, 401543, 99716, 130522, 292008, 149400, 304277, 36443, 107531, 646955, 123805, 184931, -63687, 127424, 234430, 172286, 201039, 344754, 407401, 202824, 121366, 221641, 220094, 124656, 367202, 204765, 513549, 341103, 90692, 50778, 53369, 626524, 404290, 237332, 249969, 323007, 414530, 113557, 19408, 185952, 316514, 42796, 228768, 248948, 128639, 131616, 77475, -147648, 124991, 119610, -9613, 236728, 59368, 73263, 361823, 337067, 99422, -57484, 99057, 308577, 324391, -11779, 154556, 46201, 383074, 62244, 46345, 708059, 122761, 166174, 261363, -90228, 9773, 415255, 199861]
13285B13710J35352A7794J67941D6002d0980D23396B05445a24929G7136c8361
13274A63332k5187L6337D7390J7339K08311J9702a89766C6269J30318p231j4219
13263A45137B8532J81770D483K71149G877K23858P4301L0334H904L0540P4379
13252A13823a25095d3604j31033A53769P733o7315J8958K92373e6530a2115l40040
13241c52155a27690A68722C845Q9819B567K6777a65542E99J12209K88526A12852
13229C43994B3231J03527J60578C690a17085q3205R5533a2688B75895a19087A29104
13217C5883d2853B61923b00399A17019M7343f5716L936B32693P3031D9959b6272
13205h9189E7018a72515m7307A24306K1489N2020g3157C2763a7049B35902L29449
$$ y = [213710, 349062, 17794, 185735, 46002, -40980, 423396, 205445, -124929, 77136, -38361, 163332, 138145, 174482, 47390, 64729, 273040, 292742, -189766, 36269, 166587, 159356, 145137, 28532, 210302, 4483, 275632, 7877, 231735, 306036, 336370, 8904, 39444, 113823, -125095, -43604, -174637, 153769, 161502, 94187, 113145, 405518, -56530, -12115, -352155, -127690, 168722, 3845, 93664, 2567, 29344, -165542, 599, 112808, 401334, 112852, 343994, 23231, 126758, 287336, 3690, -117085, -200290, -104757, -12688, 275895, -119087, 129104, 35883, -42853, 261923, -200399, 117019, 164362, -65716, -61780, 232693, 305724, 49959, -26272, -89189, 57018, -172515, -219822, 124306, 145795, 197815, -73157, 32763, -17049, 235902, 565351]
13194E65351a16127A94297E1535J2324L11251A06261J97033k7734l8950q0001
13184A56609J4680k6929a5249r7077G5545g0793D7820J51877g4036B06153K1042
13173B27195q4957b1431A39965D6236J78740A05998j2698M1046a50054j1091A09088
13161C12223j41596a02054A67653C0019P3653H863d3746C25376b24638h268H0284
13149A15001A2809J24683A3856N3977b6396A72239J21898A13125B0085R7840b1122
13137a13730B03800F0646K12153j0225h8131B62113O1033A24326c1854B05792
13126I8334B9808O614J20199a39734B88852A30325N7054O8024D9316j4561K17165
13115B51920L534A02995K1023b3722C5744a46754k1081b8953I9534Q8609b79116
$$ y = [565351, -116127, 194297, 51535, 63859, 375110, 106261, 303294, 275560, 236610, 156609, 171289, 144360, -15249, -112326, 75545, -70793, 47820, 199697, -74036, 206153, 227195, 142238, -21431, 139965, 46236, 224976, 105998, 93300, 134346, -150054, -161145, 109088, 312223, 170627, -102054, 167653, 30019, 103672, 8863, -43746, 325376, -224638, -8268, 80284, 115001, 12809, 137492, 13856, 67833, -26396, 172239, 294137, 113125, 20085, 117925, -21122, -113730, 203800, 60646, 272799, 262574, -88131, 262113, 323146, 124326, -31854, 205792, 98334, 29808, 36422, 156621, -139734, 288852, 130325, 187379, 255403, 49316, 34755, 251920, 255454, 102995, 124018, -23722, 35744, -146754, -167835, -28953, 99534, 188143, -279116]
13103A17078N8213a12603c9428j02375F2089L4653a0445n331G8419K55952E3841
13091e4486p8881j08409j06180c199E6763J65336e7841A02545J02988G2807K20127
13080B92934A1862J13638a30204A34665K4589o1491a52911D16744a5552l1686
13070d7238D06394A02472L9981c687j46906B36714a58114P0387L7567B20145I6429
13058d4665D03992j68004H4442K24190r1591R9445E4642O3483b20222A38645L70437
13047E09082a495A47336A8763L57536e4745C44155F7458B7269J51437A6791P111
13036B3902Q9868J35532n8047E5276M4644D8341K33115O0033A54933i7072F8207
13024B17411N2128A1326J01329L8889J96651a8366k45486F6048K54194A50653
$$ y = [117078, 175291, -112603, -39428, -141803, 62089, 96742, -10445, -15776, 78419, 334371, 53841, -54486, -133367, -241776, -347956, -3199, 56763, 222099, -57841, 102545, 205533, 72807, 292934, 11862, 125500, -130204, 134665, 159254, 97763, -152911, 416744, -15552, -47238, 406394, 102472, 142453, -3687, -150593, 236714, -158114, -87727, -50160, 220145, 96429, -44665, 403992, 235988, 84442, 308632, 217041, 316486, 54642, 118125, -220222, 138645, 509082, -1495, 147336, 18763, 376299, -54745, 344155, 67458, 27269, 178706, 16791, 23902, 113770, 249302, 191255, 55276, 99920, 48341, 281456, 341489, 154933, -97072, 68207, 217411, 269539, 11326, 112655, 151544, 348195, -18366, -263852, 66048, 320242, 150653]
13013I7248A2253c4377A43188K99490k17384f9654E13381H5285D0526J54331P817
13002B02674a92666G3539L06306e7023R931C8351a72412B3365a44795H8584P9445
12991A68029g7687B51589b10750B73049q9744d4747A50046a59362C92997c12901
12980A00567b89507C29127q4084n5410a33924D1008J19617J04132a95535J4161
12970a81374d2366j98898C6214h8963j93362A32450d581k77032C23157C6633J26043
12959A62676F6925K18252k4876O6805a48492N5891B33538q9831A6346J90059b06914
12947A10866O1685a97807D5350K87206A2696b48910a18121D53363j55024c2671
12936A35634p121b53264B41019a33417F23658a71393f0278C34419C3603P8190
$$ y = [97248, 12253, -34377, 143188, 442678, 225294, -69654, 513381, 85285, 40526, 194857, 202674, -192666, 73539, 379845, -57023, -47092, 38351, -172412, 23365, -144795, 88584, 168029, -77687, 251589, -210750, 273049, 183305, -44747, 150046, -159362, 392997, -312901, 100567, -289507, 329127, 245043, 189633, -133924, 41008, 160625, 264757, -195535, -181374, -42366, -241264, 36214, -88963, -282325, 132450, -4581, -281613, 323157, 36633, 162676, 66925, 285177, 260301, 327106, -148492, -92601, 233538, 143707, 16346, 206405, -206914, 110866, 172551, -197807, 45350, 332556, 12696, -248910, -118121, 453363, 298339, -32671, 135634, 128513, -253264, 241019, -133417, 623658, -171393, -60278, 334419, 33603, 111793]
12926A11793d3688n2813F3383J00693N9730A8079c281p8880j09545A99881a79563
12914B8823a21170B41079E5794a5292A69567c89855a67794A65212b56771C3657
12903a26823A88103F0214i3513b7082A2530K1723J36155g0133p8117M318N4081
12892h9851A16759b8249A33679B0258J07899c0976B32340r2674e6581B09768a42832
12880a19393j42770Q0275F5651C0214k880b56693a00046C5781j7422c1883H8800
12868A43930n1755J33669b32997D49558j43982g0492B6879L59437G5350j0215
12858F5135J42249k8764a98042B44677a8962j05548A11955d6927A41652F8824
12847b09886A24772E1715a39855G299K54236o0325a209I3891h0612B64273b1578
$$ y = [111793, -43688, -96501, 63383, 164076, 223806, 18079, -3281, -82161, -191706, 199881, -179563, 28823, -121170, 241079, 55794, -15292, 169567, -389855, -167794, 165212, -256771, 33657, -126823, 188103, 60214, -93513, -27082, 12530, 34253, 170408, -70133, -148250, -143932, -89851, 116759, -28249, 133679, 20258, 128157, -30976, 232340, 139666, -56581, 209768, -142832, -119393, -262163, -181888, 65651, 30214, 27334, -256693, -100046, 35781, 18359, -31883, 88800, 143930, 92175, 225844, -232997, 449558, 305576, -70492, 26879, 386316, 75350, 65135, 207384, 178620, -198042, 244677, -18962, -124510, 111955, -46927, 141652, 68824, -209886, 124772, 51715, -139855, 7299, 261535, 201210, -1209, 93891, -80612, 264273, -21578]
12835B67921p2759M3249C6990L01568b02849l8593l9269i980B06991a41221A35643
12823B4397a23313A21276P7619g184q4039A31917E4785J62698J07224f0262m5867
12812a06129A84766G9400a35922c226j93137C19147h7406H44h170j60386j1803
12801a80359o9438a11913M335K9991B17420A0613K14867i1043I0162J14300m1815
12790A62647a16941A60056B1801a00900k36688A10464e1080q0472L2246A48978
12779G60810F7808O5475b8834k14992H0886b67758A72189F0094e1662m4888j02689
12768a99239a0340j14751H5179K94707c0714m3256A76954a82313A11562J80042
12758B91604m0191a72672c3346j88601a03184C2300a11447A94802E6381A091d7326
$$ y = [267921, 195162, 238411, 36990, 338558, -202849, -241442, -280711, -9980, 206991, -141221, 135643, 24397, -123313, 121276, 198895, -7184, -91223, 131917, 54785, 217483, 324707, -60262, -106129, 184766, 79400, -135922, -3226, -196363, 319147, -87406, 844, -8170, -168556, -180359, -249797, -111913, -107578, -77587, 217420, 10613, 225480, -91043, 90162, 204462, 162647, -116941, 160056, 21801, -100900, -337588, 110464, -51080, -131552, -99306, 148978, 760810, 67808, 133283, -28834, -243826, 80886, -267758, 172189, 60094, -51662, -96550, -199239, -10340, -125091, 85179, 379886, -30714, -73970, 176954, -182313, 111562, 291604, 251413, -172672, -33346, -221947, -103184, 32300, -111447, 194802, 56381, 1091, -47326]
12746B39267H9817M15611A74869o5377l7241B4704N5947a27402A70451p5248P186
12735A02389L06061j39824A27233D0996J27098e2079H3851K7832c2107C07516
12724d86386C12145a47787o0521C7796B744e0236b4531A671K16806b81057A21481
12712D96583h2617B29851g5134C01586k495d5410B90640d1413B45122h1536B96513
12700a66753I230K05170J1207M64O6793J14570i5815F3821a31876A72260F2512
12688B08767f2344A58038Q9369A335K29712a95283A6536J52584j3641a10113a7963
12676B16446a58823A64030n567h5705m3863d2057A69317m8778K01052A03690l9462
12665F4228M18928F4888M4654R3569K03087i6454F28232B59629j9402f7057b9909
$$ y = [239267, 89817, 505428, 174869, 109492, 72251, 24704, 80651, -127402, 170451, 95203, 102389, 408450, 268626, 127233, 40996, 168094, -52079, 83851, 111683, -32107, 307516, -486386, 312145, -147787, -208308, 37796, 2744, -50236, -24531, 1671, 218477, -281057, 121481, 496583, -82617, 229851, -75134, 301586, 299091, -45410, 290640, -41413, 245122, -81536, 296513, -166753, 9230, 214400, 225607, 226071, 292864, 407434, -95815, 63821, -131876, 172260, 62512, 208767, -62344, 158038, 247407, 1335, 231047, -195283, 16536, 169120, 155479, -110113, -17963, 216446, -158823, 164030, 158463, -85705, -129568, -42057, 169317, 120539, 321591, 103690, 64228, 483156, 64888, 109542, 203111, 406198, -96454, 628232, 259629, 240227, -67057, -29909]
12653i9917g553A40117d3946A09547K6220F5153J09112a85604G5150b32244b4434
12641a40386H8323k7374J10298a2219B6687J92104E0171J83845a01752A54065
12630A80700O1373r7863R899m1289J45465b2954l35073B1715a8819B82293A5225
12618D69942A40582k4371b16850D30949A64304C3900L1592b88237F5323a31569
12607B47497c6370A64960d16178G4461K4382N4610a06827B04224L8649M7212o6517
12596B23568p152C7697a52181G9329J27679o9718g4847j17115c7167A29619a65204
12584c7517h900n5816A04545a72658A31409m1642c7122j40089B87449J76217A51607
12572F8043b6768A58538J33354e2008B01343n2634m9907a69625P5462c920j38887
$$ y = [-99917, -7553, 140117, -43946, 109547, 135767, 65153, 174265, -185604, 75150, -232244, -24434, -140386, 88323, 60949, 171247, -12219, 26687, 218791, 50171, 234016, -101752, 154065, 180700, 242073, 144210, 154109, 112820, 258285, -22954, -358027, 21715, -18819, 282293, 15225, 469942, 140582, 116211, -216850, 430949, 164304, 33900, 65492, -288237, 65323, -131569, 247497, -36370, 164960, -416178, 74461, 98843, 153453, -106827, 204224, 242873, 290085, 223568, 216416, 37697, -152181, 79329, 207008, 137290, -74847, -191962, -37167, 129619, -165204, -37517, -8900, -64716, 104545, -172658, 131409, 89767, -37122, -177211, 287449, 463666, 151607, 68043, -26768, 158538, 291892, -52008, 201343, 148709, 98802, -169625, -94163, -3920, -142807]
12561a42807C1696J71565B5619b14482A57337F2995L0690a92520j02691a7039
12550A4952L31821a28649B38792a46955b1064A48767a2149k07096A88228o7756
12540A20472R651r737b3668B34925b16551M6697A54841b21611G8446a73086B26746
12528D6713b3993R305A29232K14299F7622c00286B7072K31573A05911K91881b12127
12516H939a90045B75824d02567C29714c1163k38665A52000P2909b26693B5930
12505B11659a56796A79594b77874A08051R3130a0530F5018f0140l5914A08342
12494a95960j08028d9038q6610A03219N0188a33628A7913c414j30945E1565a53782
12482b48030G2013J47a40823o8286b466D12282D8180b25410A3471J58013b9928
$$ y = [-142807, 31696, 203261, 25619, -214482, 157337, 62995, 93685, -192520, -295211, -17039, 14952, 346773, -128649, 238792, -146955, -21064, 148767, -12149, -219245, 188228, 120472, 130123, 120386, -23668, 234925, -216551, -169854, 154841, -221611, 78446, -173086, 226746, 46713, -23993, -14688, 129232, 343531, 67622, -300286, 27072, 258645, 105911, 397792, -212127, 8939, -190045, 275824, -402567, 329714, -31163, -269828, 152000, 224909, -226693, 25930, 211659, -156796, 179594, -277874, 108051, 201181, -10530, 65018, -60140, -96054, 108342, -195960, -303988, -49038, -135648, 103219, 153407, -133628, 17913, -3414, -134359, 51565, -153782, -248030, 72013, 72160, -140823, -209109, -2466, 412282, 48180, -225410, 13471, 171484, -29928]
12470I3007D1430J3441i0031j68603i3566L9936C0580N8478b15420A40549f2998
12458b5305B13441a69313b2455H571O6046a97334A9848a51231m9295A51098c51931
12446f2461a3273k24588B60268g815B36659c9510j3774j62850F9674b24270e6105
12434C6695O5275K1593l3287J43239a80622K7112J9468l8429e6405B00987a71882
12422b75859b8501E1189b671B40928a34522C07692a09913A38838J98787K1873
12412C59498b4978q0634B69107a85293F4276j847j7936A8464K71177H1653M4603
12401A26256i2594A434f4561j81348A93324b21769D4220a02769k06491i119l00049
12390c09168a04916K6907A34923l1362d54366G3226K8474a66367L9767A8575L05213
$$ y = [93007, 41430, 54871, -90031, -258634, -93566, -53630, 30580, 89058, -215420, 140549, -62998, -25305, 213441, -169313, -22455, 8571, 74617, -197334, 19848, -151231, -200526, 151098, -351931, -62461, -13273, -237861, 260268, -7815, 236659, -39510, -53284, -216134, 69674, -224270, -56105, 36695, 101970, 123563, 90276, 233515, -180622, -153510, -134042, -172471, -56405, 200987, -171882, -275859, -28501, 51189, -2671, 240928, -134522, 307692, -109913, 138838, 337625, 359498, -24978, -105612, 269107, -185293, 64276, 62429, 44493, 18464, 289641, 81653, 126256, -92594, 1434, -64561, -245909, 193324, -221769, 44220, -102769, -309260, -9119, -309168, -104916, -78009, 134923, 103561, -454366, 73226, 101700, -166367, -126600, 18575, 323788]
12379C23788a89344A5562J51240a44792F8818M8626b09293M2082A25502J24348
12369B49850f879A33798a13917j30708C4216b7488m6587k8429j5789C54789G7488
12357C2723i2535B83830h4253d699D71281a26874J527k8372J4437A96166G7360
12345H6676e7540I0317b93820A202K22985p7584K63920b71250A50267P2O0969
12334B11308J02236f494j0929j3824m13321g8368q5637A18964h8101A03493b8242
12322b66868L3156A59950D0444e0799b2405B51498j03475e2074k38450C26303
12311A82129Q3431a63410c4283A65697D805I25J16386a66847C41295b50850B4138
12299b62957I7002J31483q2685J81765B8789b51379A07013e44139B61076A10692
$$ y = [323788, -189344, 15562, 166802, -144792, 68818, 117444, -209293, -167211, 125502, 249850, -6879, 133798, -113917, -244625, 34216, -27488, -74075, -102504, -118293, 354789, 77488, 32723, -92535, 283830, -84253, -4699, 471281, -126874, -125347, -153719, -139282, 196166, 77360, 86676, -57540, 90317, -293820, 1202, 224187, 146603, 410523, -271250, 150267, 150339, 211308, 313544, -6494, -17423, -31247, -444568, -78368, -164005, 118964, -88101, 103493, -28242, -266868, -233712, 159950, 40444, -50799, -22405, 251498, 148023, -52074, -290524, 326303, 182129, 265560, -163410, -34283, 165697, 4805, 925, 117311, -166847, 341295, -250850, 24138, -262957, 97002, 228485, 145800, 327565, 28789, -251379, 107013, -544139, 261076, 110692]
12288B91087m0973j08185K873C9984R1276b0952D46J86312J97648j27158I2006
12276e6884A86092C9860J1162J91383l1600R3110n5783c7040A88794K87036j80223
12265B95607b8287G1053L7539D8430j8734L17336A34428r502n4416Q4532i6232
12253g681C34719F2390P6943a25833A15492e5504B0433J9611P2941R6252A4772
12241d2138G395J32014K35635A79016f4432A09022J53454b52371A94466a11091
12230D25192a19708A76760F351K43586P4287m3948h6539K8203D07411m1094C2622
12218B22200J75776A0982h7910B39679j02393b9704m0459B41508p7067r524J19455
12207B74372p1323J57748C9499J24043j3200J08828l3907i626j48425B97704E9280
$$ y = [291087, 250114, 141929, 144802, 39984, 131260, -20952, 446, 186758, 384406, 257248, 92006, -56884, 186092, 39860, 51022, 242405, 210805, 303915, 248132, -37040, 188794, 475830, 295607, -28287, 71053, 108592, 48430, 29696, 347032, 134428, 124926, 70510, 155042, -96232, -7681, 334719, 62390, 139333, -125833, 115492, -55504, 20433, 40044, 112985, 209237, 14772, -42138, 7395, 139409, 375044, 179016, -64432, 109022, 262476, -252371, 194466, -111091, 425192, -119708, 176760, 6351, 249937, 324224, 280276, -86539, -58336, 407411, 366317, 32622, 222200, 397976, 10982, -87910, 239679, 137286, -29704, -70163, 241508, 164441, 154917, 274372, 203049, 360797, 39499, 163542, 150342, 259170, 225263, -9626, -158051, 297704, 59280]
12195C77957J616c6420H4855J87706I6370P6361J65434H0651a47295j50344A98230
12183B62673a81871A36605D7663c2840A30055M9604l9076Q0724L2854J4726C441
12171B20347G0991L1368a12656A16792K83802F3819a60089N1336B07380o8475
12161A38905N5755m0929K03921A4510l6a47705e7905A9385m804a61411F1794O2074
12149A23868n7842b05918A22637b4503q4771c1216A66925P0915L20744D4525a60838
12137a86311B03714b38188f8134O175j87934i5057A8215a3209k47365D9476f4207
12125i7366A06255i0900A26518J15705L5659D7016j978J11392Q3168A2411K3715
12114C6126i2746j17862Q2689J933d7032C0325P1018a8090F3370B3003a56367
$$ y = [377957, 379573, -36420, 84855, 272561, 96370, 172731, 338165, 80651, -147295, -297639, 198230, 262673, -181871, 136605, 47663, -32840, 130055, 179659, 140583, 221307, 254161, 268887, 3441, 220347, 70991, 102359, -112656, 116792, 400594, 63819, -160089, -108753, 207380, 138905, 194660, 153731, 357652, 14510, 14474, -147705, -57905, 19385, 14581, -161411, 61794, 123868, 66026, -205918, 122637, -24503, -109274, -31216, 166925, 237840, 558584, 44525, -160838, -186311, 203714, -238188, -68134, -61959, -249893, -95057, 18215, -13209, -260574, 49476, -64207, -97366, 106255, -90900, 126518, 242223, 277882, 47016, 45038, 156430, 239598, 12411, 36126, -92746, -210608, -127919, -125986, -47032, 30325, 101343, -18090, 63370, 23003, -156367]
12102c0952j43826B86712i4707A17549J58147j33518F1988A4068J08260g2005
12091b57903B25326G2515J11748b4377j32305p0271h9506d196k85246J39023A11782
12079c42838C9983h8726A37320J3151l7582J27401N69826K41434R75458j008905
12069A018103D21893j37803p1718a66916f5293n5600C21789a00948a7247l53474
12059c70721F3431J15515M0960b16013E8776O6526m2346B0483J6551J10600b27635
12047D79518a54469M3566H4350P602k114O462a53937k10251A24020a27454N7140
12036g0314E4194a56938k8387M3513N3306E7163G187a90665A08828a52535A09134
12024C19439m1940R2810B0242a84814f1484n921m7672B10037H507O6501e1049
$$ y = [-30952, -174778, 286712, -94707, 117549, 275696, 142178, 61988, 14068, 122328, -72005, -257903, 225326, 72515, 184263, -24377, -156682, -226953, -89506, -4196, -289442, -150419, 111782, -342838, 39983, -88726, 137320, 150471, 112889, 240290, 810116, 1051550, 2027008, 1018103, 421893, 284090, 212372, -166916, -65293, -120893, 321789, -100948, -17247, -370721, 63431, 178946, 219906, -216013, 58776, 125302, 82956, 20483, 37034, 147634, -227635, 479518, -154469, -110903, 84350, 91952, 89838, 96300, -153937, -364188, 124020, -127454, -70314, 54194, -156938, -185325, -141812, -88506, 57163, 7187, -190665, 108828, -152535, 109134, 319439, 277499, 370309, 20242, -184814, -61484, -67405, -115077, 210037, 8507, 75008, -51049]
12012A68620m2161b3322p502A90850c5102j56767P2077o3896g1965D4303A6239
12000H2371e3500J7783H0882b49032H8961c77123f0581C42899A08160j4994a23524
11988a12916B02144i3577n5685A56542h7918b5587e641F4516c8358k17328C0221
11976A30876K1693j9615a09147C65341B5324b0679A22630q13g5995k48032D09152
11964c43682A57117J36224d44869J62003B07931a40580L5072L6031l015K3949
11954d8543j69271G5554B6812O1839l8451r236g0824C30105a72329C70467B1073
11942c0251A50995G0582d34261E5379b50272E996c13927C16097b4806k25454a01149
11930A23294a02267F9102l722J82502b51623J22557I3081J06924H5087K02518
$$ y = [168620, 126459, -23322, -30824, 190850, -35102, -191869, -119792, -183688, -71965, 44303, 16239, 82371, -53500, -35717, 80882, -249032, 88961, -377123, -60581, 342899, 108160, 93166, -123524, -112916, 202144, -93577, -149262, 156542, -87918, -25587, -5641, 64516, -38358, -255686, 30221, 130876, 152569, 132954, -109147, 365341, 25324, -20679, 122630, 121817, -75995, -324027, 409152, -343682, 157117, 293341, -444869, -282866, 207931, -140580, -105508, -69477, -72492, -48543, -217814, 75554, 26812, 88651, 50200, 40964, -70824, 330105, -172329, 370467, 21073, -30251, 150995, 70582, -434261, 55379, -250272, 5996, -313927, 316097, -24806, -250260, -101149, 123294, -102267, 69102, 65380, 247882, -251623, -129066, 93081, 200005, 85087, 287605]
11920B87605D4880J12226a46820c7389j40607A27971B761e5157k3640k59585E0776
11908a28341F1060A9969h1578C34155b8124j5671k25597A9671h9750A6806h7552
11896D3484d5292B1905L01923D4676a18992J3807B08424D3839n363a68838A49765
11884e8660A00425a03660I4116a91462c0042A39655a59735J718b1533I4207O8272
11873A62479a6421A31131F0056a75633I567a16048j6687e714E5862a18839a5813
11861H1983k9813g7588l9724j6007k69654a08661J4273D157J29448b56072a15740
11849C7170i3527H4704a09563j5529I3524g0784i185k30954f0610k63334J24275
11838a99669B00579F1811i9908j63552A91690N7541b5447E7882J9340b35530j71643
$$ y = [287605, 44880, 157106, -146820, -37389, -177996, 127971, 2761, -55157, -78797, -338382, 50776, -128341, 61060, 19969, -81578, 334155, -28124, -43795, -269392, 19671, -89750, 16806, -87552, 43484, -45292, 21905, 323828, 44676, -118992, -105185, 208424, 43839, 38476, -168838, 149765, -58660, 100425, -103660, 94116, -191462, -30042, 139655, -159735, -158017, -21533, 94207, 162479, -16421, 131131, 60056, -175633, 9567, -116048, -132735, -5714, 55862, -118839, -15813, 81983, 52170, -77588, -117312, -133319, -402973, -108661, -94388, 4157, 133605, -256072, -115740, 37170, -93527, 84704, -109563, -125092, 93524, -70784, -9185, -240139, -60610, -323944, -199669, 200579, 61811, -99908, -263460, 191690, 249231, -25447, 57882, 77222, -235530, -407173]
11827d07173B4567b30018D55264a14170j86458J4048B11506e5912a5694l28193
11817c43887b8012A74509m4562B2990a38253G2213a03482k1779e7386o6499d9776
11805c7569j16828k31645B24529i4352l17084A14236d65083A324J79197e0483
11794A19561L2357b28560O6952q1896D797K9288c3438a0920A5106a5170m0225
11783e5395k19858E1383a13875e3266n7360F4925J02088a14925l9102E0015c4895
11771a71395A86691p4580K13731I1697a90747j193A53737e1016j37290D1355a62523
11759B1533a0962p5959l8590B68068m435B7830J96273a75295j31744h3160j04366
11748a87526E4483C397M7806p346J87865C2634J85996F4843a19342C4413g924
$$ y = [-407173, 24567, -230018, 455264, -114170, -300628, -286580, 211506, -55912, -15694, -343887, -28012, 174509, 129947, 22990, -138253, 72213, -103482, -125261, -57386, -123885, -49776, -37569, -154397, -386042, 224529, -94352, -411436, 114236, -465083, 1324, 180521, -50483, 119561, 151918, -228560, -161608, -243504, 4797, 34085, -33438, -10920, 15106, -15170, -55395, -275253, 51383, -113875, -53266, -110626, 64925, 167013, -114925, -154027, 50015, -34895, -171395, 186691, 112111, 325842, 91697, -190747, -191940, 153737, -51016, -188306, 41355, -162523, 21533, -10962, -86921, -125511, 268068, 263633, 27830, 224103, -175295, -307039, -83160, -187526, 54483, 3397, 51203, 43857, 231722, 32634, 218630, 64843, -119342, 34413, -7924]
11736b8546j29454e8457j56012B32161o0519a8442k45943R1936C72093A37179
11725b28456P1674c9654I715e9245q8026A32149b11405P0493A24610N0738k4065
11714A51283C1342j5095J21261E708J83482a09992A40095m7379B736a04525j07311
11703b11836B55884h3777C4684N3301N692J6446n1236m400B5629e4035q0292k47810
11691c82137d1352A29203J16486J02618j29689h1990L8235j19901C09987G1922
11680A63653J99540j60133a05307F5322Q5156K55050j59794a25662C6092a57427
11669I609f3146A92217O0617j20800B9458N5384F387J23353d9471m254C17088
11657b19738a7434l66200d0153j1781B45715b42454G5671b07440D3725J05993
$$ y = [-28546, -158000, -58457, -214469, 232161, 171642, -18442, -264385, -172449, 372093, 137179, -228456, -156782, -39654, 9715, -59245, -147271, 132149, -211405, -140912, 124610, 175348, 151283, 31342, 16247, 137508, 5708, 189190, -109992, 140095, 92716, 2736, -104525, -211836, 255884, -83777, 34684, 87985, 93677, 110123, 58887, 54487, 25629, -54035, -134327, -382137, -41352, 129203, 245689, 348307, 218618, -81990, -43755, -163656, 309987, 71922, 163653, 363193, 203060, -105307, 65322, 150478, 405528, 245734, -125662, 36092, -157427, 9609, -63146, 192217, 252834, 132034, 29458, 84842, 6387, 129740, -49471, -53725, 317088, -219738, -17434, -383634, -40153, -51934, 245715, -242454, 75671, -207440, 43725, 149718]
11647A49718a01617j9240a4592j48503d732C64708r3731a73792E6646J68706a05248
11635B13487f0225m0471D3675b4750A2505J05678E8787h9619q0940N6296q4611
11624a98874F0687d3428j9547D9053B3515i9237j81624a23378c4135G4106b74087
11612b45482Q7395H7786C3078c4623A68894N6937k0020d0271B09206l0454k7915
11601A50837J78712i072B10647J57264e49C29291i2329A13273Q5534c13737a9278
11589C59719D587Q7360K08087I9476a47557B24913k0769J84976n67A31529L3297
11578A64826Q5717F4059l015c1615A00569B7890q311P1892L04468H7474K38904
11567C26378A26963f9743D7717K47961m6618h7715d0275A54836B3481O8938J17216
$$ y = [149718, -101617, -120857, -14592, -163095, -4732, 364708, 270977, -173792, 56646, 225352, -105248, 213487, -60225, -100696, 43675, -24750, 12505, 118183, 58787, -89619, -170559, -114263, -198874, 60687, -43428, -62975, 49053, 23515, -99237, -280861, -123378, -34135, 74106, -274087, -245482, -158087, 87786, 33078, -34623, 168894, 225831, 205811, -40271, 209206, 178752, 150837, 329549, -9072, 210647, 367911, -549, 329291, -92329, 113273, 198807, -313737, -19278, 359719, 4587, 91947, 300034, 99476, -147557, 224913, 204144, 389120, 388553, 131529, 164826, 250543, 64059, 61044, -31615, 100569, 27890, 19579, 91471, 395939, 87474, 326378, 126963, -69743, 47717, 295678, 249060, -87715, -40275, 154836, 23481, 92419, 209635]
11556B09635N992I357a61622B48696K54460k40833F1598B0785e9171A14448l9595
11545G4853G915J61461K3478o6339J05912A14801J22091b00384f3522C18362A37241
11533D7888K26914b407A94770b55687I2939J16411q8324c1333B35532g7741b8114
11521A86410q7440a39196N2705b7755j52561A18643b02275e2221j88209c2966
11510a95001C61740C6659J29776K94220G9054f9661J9101B57727E3521K62747
11500C16268A26302J86263a12523B5185f9727j6064C17669I4411N110J49008k0825
11489B27704J82301A6314b16654B67987j3073H0850j2518O3992i0331A50286J71810
11478C22096A18626J08535N0583P5393J70009A78493b37435c1717A83187R3368
$$ y = [209635, 215627, 9357, -161622, 248696, 503156, 262323, 61598, 20785, -59171, 114448, 74853, 7915, 169376, 192854, 126515, 232427, 114801, 236892, -200384, -63522, 318362, 137241, 47888, 274802, -2407, 194770, -255687, 92939, 209350, 121026, -31333, 235532, -77741, -28114, 186410, 98970, -139196, -86491, -27755, -180316, 118643, -202275, -52221, -240430, -32966, -195001, 361740, 36659, 166435, 460655, 79054, -69661, -50560, 257727, 53521, 316268, 126302, 312565, -112523, 25185, -69727, -85791, 317669, 94411, 99521, 248529, 227704, 410005, 16314, -216654, 267987, 254914, 80850, 68332, 132324, -90331, 150286, 322096, 118626, 227161, 277744, 353137, 523146, 178493, -237435, -31717, 183187, 276555]
11468B76555j07708J79509m6852d0911I0772j1758O742L8057N4346i1361I1529
11456d0292C30916m8429b42996Q6469B03795G6258l3600K59049q8673c2547I4760
11444B03912E6398a99428A84993B8518a72801F9835b78442B4859J62362G9512
11433g940A46990a86456D1360a8352B37854D5142J97020K46733E6164a2365A61252
11421a25274A23273Q3264g1605B64182A3976M7184a25288k9200A89479a83089
11410a40744N4896b855C2532a51456K2783H8372A0580N105O7859Q6970M3488A01770
11397d9657G2701J27834a69313C7228j8392K95699A23989j0222b38658a16298
11386a0955F6344J27849G7533a72940C3808a88739i1490k6899q1189C5807d4944
$$ y = [276555, 168847, 348356, 301504, -40911, 90772, 79014, 85756, 123813, 178159, -91361, 91529, -40292, 330916, 282487, -242996, -156527, 203795, 76258, 42658, 301707, 213034, -32547, 94760, 203912, 56398, -199428, 184993, 28518, -172801, 69835, -278442, 24859, 187221, 79512, -7940, 146990, -186456, 41360, -18352, 237854, 45142, 242162, 488895, 56164, -12365, 161252, -125274, 123273, 206537, -71605, 264182, 13976, 61160, -125288, -154488, 189479, -183089, -140744, -85848, -2855, 32532, -151456, -128673, 88372, 10580, 15685, 83544, 170514, 214002, 101770, -49657, 72701, 200535, -169313, 37228, 18836, 314535, 123989, 113767, -238658, -116298, -10955, 66344, 194193, 77533, -172940, 33808, -188739, -91490, -118389, -199578, 35807, -44944]
11374b06076A30296C7084f5677j83309K9086e0898H8977c8552j92542i680E0971
11362C65774f9117l12556A89558a8497C35480a57382j19464g821l11987B43458
11351a96507A01300b2898B83479j34980l9919A1018J90539b33513a03120d6184
11340c6708A56079M0425F5414B9013f0421H6691a27034m4713B1642O3149K03713
11329B88504b87630H3659a38249M3783l1823C73830e1535E664J66952M6050a36003
11317B70651i1950M3527A26249l5621K23588e8039B16908F8542a11390j5170A08296
11305d18042a75097A42122a555l62091F8854h1648j61969H9270d4746d503p9256
11294h3759B66619a73249j9165A67979g4334J2229G9516l6731Q8590g9717A91221
$$ y = [-206076, 130296, 37084, -65677, -248986, -219900, -50898, 88977, -38552, -231094, -9680, 50971, 365774, -69117, -381673, 189558, -18497, 335480, -157382, -276846, -7821, -319808, 243458, -196507, 101300, -22898, 283479, 148499, 108580, 11018, 201557, -233513, -103120, -46184, -36708, 156079, 196504, 65414, 29013, -60421, 86691, -127034, -171747, 21642, 84791, 288504, -287630, 83659, -138249, -94466, -126289, 373830, -51535, 5664, 172616, 218666, -136003, 270651, -91950, -48423, 126249, 90628, 314216, -58039, 216908, 68542, -111390, -126560, 108296, -418042, -175097, 142122, -1555, -363646, 68854, -81648, -243617, 89270, -44746, -4503, -83759, 266619, -173249, -192414, 167979, -74334, -62105, 79516, 42785, 131375, -79717, 191221]
11282a32646j6130g4103A08512a33875k7911A06461P7495P5465f855K76l3071
11271c9650A47985g9293a465F373J46588g9564F7124a57417C08121b39063B53125
11259B9341b9021C78728e9973f141j09603j19766r9256J23767g9973n2692A4268
11247B75566j13827K3044a44577j39586j06192J15137i558k3742A47973C60a31551
11235a07225j45420f8624B07014n8651b00958j879N6312n5614A09581b70891D4656
11223E039J61802a62084r5277C1756h3665k0313B0512K3039N3413k5432l534A1041
11210a06262m2199j25152a368m23176a39721q3508J0631B90122i5447C1049a61301
11198d4901l39217J5167J67196a9726A50214a85084P4250F5257c9943G1400i950
$$ y = [-132646, -148776, -74103, 108512, -133875, -161786, 106461, 183956, 259421, -6855, -6579, -39650, 147985, -79293, -1465, 6373, 152961, -79564, 67124, -157417, 308121, -239063, 253125, 29341, -29021, 378728, -59973, -6141, -115744, -235510, -334766, -210999, -79973, -132665, 14268, 275566, 161739, 184783, -144577, -284163, -390355, -275218, -9558, -33300, 147973, 360, -131551, -107225, -252645, -68624, 207014, 148363, -200958, -202837, -146525, -202139, 109581, -270891, 44656, 5039, 166841, -162084, -257361, 31756, -83665, -103978, 20512, 43551, 96964, 71532, 67998, 11041, -106262, -148461, -273613, -1368, -424544, -139721, -223229, -212598, 290122, -95447, 31049, -161301, -44901, -384118, -368951, -201755, -19726, 150214, -185084, -110834, 65257, -39943, 71400, -9950]
11186d977C3128c64958O9163g6938g057D8352E869a91449J9263B4145a33373G4918
11173a36261A8092a69010B45072G5338J74244d12112A31945j3216R2622a7484
11162H47i339p3823A67580p887a300j01083m5524a2861B02045a45026f6899m20801
11150d87700D3696c0718A08663j1584h4289k2020B27142h2821J1673K0875q1378
11139a31651k58128i0444B47028a04953A55195a20104k6476j23923C41493F7093
11128C42048d5655P933j20385A64920F5875L9334L1757k437R7126a21048L152
11117a17896A21510M7998a6214d217E0155L89463b22610f0248p4552B3927K63981
11106B87908p4837N4465b354B32227N7622H7873J2095i7283A00710M9506P9061
$$ y = [-4977, 33128, -364958, -295795, -76938, -7057, 48352, 5869, -191449, -172186, 24145, -133373, 74918, -136261, 18092, -169010, 245072, 75338, 249582, -412112, 131945, 118729, 211351, -17484, 847, -9339, -83162, 167580, 159693, -1300, -102383, -147907, -12861, 202045, -145026, -66899, -487700, 43696, -30718, 108663, 97079, -84289, -106309, 227142, -82821, -71148, -50273, -131651, -389779, -90444, 247028, -104953, 155195, -120104, -146580, -270503, 341493, 67093, 342048, -45655, -37722, -158107, 164920, 65875, 105209, 136966, 134529, 231655, -121048, -117896, 121510, 169508, -16214, -4217, 50155, 439618, -222610, -60248, -134800, 23927, 287908, 213071, 267536, -2354, 232227, 289849, 87873, 99968, -97283, 100710, 150216, 229277]
11095B29277L3883e5083A82511R6118P7528J3883G639L00925A04231L0646F683
11083B34438K5419q5426L3381C5865J28702b1262o6768A60923J21043J89343j18521
11072C52788O4710A97512m5782a38922C58269K72528k20322J2582o7498F9279
11061E30683o9776j92707m7697L65196J60840C55898M67657k09495J56584o5392
11051G05252j21702J41999k43239p319K33165k3002J07150L5312r6031l9148J06787
11040G99224k39111K2624J78832j95256J16705K22011k69449M3653K27072m30072
11030D76233J70149L13759l10077J83949j84876j91964J78128j8756J92363J06834
11020I15742k82624L8581k01489J2602K42187k98189L08553k07335P3197K21825
$$ y = [229277, 263160, -55083, 182511, 278629, 356157, 370040, 7639, 308564, 104231, 134877, 6683, 234438, 259857, 174431, 207812, 35865, 164567, -21262, -88030, 160923, 281966, 471309, 352788, 417498, 197512, 151730, -138922, 358269, 630797, 410475, 423057, 355559, 69279, 530683, 460907, 268200, 220503, 585699, 746539, 355898, 823555, 614060, 770644, 705252, 583550, 725549, 482310, 474991, 708156, 685154, 792304, 827616, 731585, 692437, 799224, 560113, 582737, 761569, 566313, 683018, 905029, 635580, 679233, 906305, 476233, 646382, 960141, 650064, 834013, 649137, 457173, 635301, 616545, 808908, 915742, 633118, 671699, 470210, 482812, 724999, 426810, 735363, 528028, 601225, 823050]
11010H23050k41411O8857m6924O2978k86179J46546j26486A57886L70618J99271
11000G27775k39368J03856k09800O12599j59476M8102l0790j07846P7091q7777
10990G34366Q2129j56019j23418P41698l97984L24352j27297j19744K5645J14195
10980A097923M0781Q4951k17135K62579L84745K49335M70195j0541k29186K50524
10970B384171K95366L59733j80745k33371m16489k25738q6650J7961k70904m7232
10960A596102J5795J17268l2677R8769J54155r5789k49340j10195j11324m23134
10950I59630J80647k12466k52834j20691j5089B31196K29737N5412C7224J56131
10940A93355F1543K01399n2178k4184J49482a3763B12723J43450J4138A61090
$$ y = [823050, 581639, 650496, 603572, 666550, 380371, 526917, 400431, 157886, 528504, 727775, 488407, 592263, 382463, 995062, 835586, 883688, 852898, 745052, 822143, 734366, 816495, 660476, 537058, 1278756, 880772, 1205124, 1077827, 958083, 983728, 1097923, 1138704, 1223655, 1006520, 1269099, 1653844, 1903179, 2373374, 2362833, 2133647, 2384171, 2679537, 3039270, 2858525, 2625154, 2208665, 1982927, 1896277, 1914238, 1643334, 1596102, 1611897, 1729165, 1696488, 1795257, 1949412, 1853623, 1604283, 1494088, 1382764, 959630, 1140277, 927811, 674977, 554286, 539197, 231196, 460933, 516345, 37224, 193355, 61543, 262942, 210764, 186580, 336062, -13763, 212723, 356173, 370311, 161090]
10929C47559D5168k492e9469b3788j90076A6143J16288b76805D779J91115O0172
10918B56066b20901a1420k30496M8098H9291b15867j76980A07956a65940A0180
10907h2995A98941r0680H056g7591k18751B6093Q3867a55384A58091l1001C9020
10895i9873n1840B8474b11560n024j41916a64026J9495A35119B8080a10988M5906
10884f5082A73410b20443A31512d3480l40533d6201o9490L6717G885c74813a9650
10872d0554B7541c24918f1374A85444p3710g8138j0993B21229b83373H8336K69344
10861C57680d9657D8960J44779E724Q5959J50492h9728l44009f6645A98285p7654
10850A20631b7553B17385I581L6565g9822N139A27698J01482i6143A9504b78849
$$ y = [347559, 45168, 42676, -59469, -23788, -213864, 16143, 132431, -276805, 4779, 195894, 256066, -220901, -11420, -241916, -193818, 89291, -215867, -392847, 107956, -165940, 10180, -82995, 198941, 108261, 8056, -77591, -296342, 26093, 109960, -155384, 158091, 127090, 39020, -99873, -151713, 28474, -211560, -216584, -358500, -164026, -144531, 135119, 28080, -110988, -65082, 173410, -220443, 131512, -43480, -384013, -46201, -115691, -78974, 7885, -374813, -19650, -40554, 27541, -324918, -61374, 185444, 111734, -78138, -89131, 221229, -283373, 88336, 357680, -49657, 48960, 193739, 5724, 91683, 242175, -89728, -433737, -66645, 198285, 120631, -27553, 217385, 9581, 46146, -79822, -74683, 127698, 229180, -96143, 19504, -278849]
10838A98961r5354a46748b9513C09609f2560n3911J9493A22372a81123e4130k53994
10827c08124g2762k9083B0840r952d0165C06880d3646j34559f3084B0472a18241
10815B06532a07874k7711A0534a79134n7330j8941F3303a54607B56885g3953H7894
10803A50553i9016K1439j23001A75982h0919K9154j00471K3934p8992C5503c41902
10791a16316L9708j9920j69053a24556B24589C0113J1961a31061A25277b8489
10780a90727B54499b84050k24122b37435C8273c28858h4136B7559J04153a71299
10769A79168i4961l0951B98259j24921b95390h671j59478K8563J1736j5316B33735
10757A29119R929F0934f9709K2360j53600B4303J44129B8580L7587a04971B66766
$$ y = [198961, 103607, -146748, -29513, 309609, -62560, -116471, -96978, 122372, -181123, -54130, -308124, -72762, -101845, 20840, 10888, -40165, 306880, -43646, -178205, -63084, 20472, -118241, 206532, -107874, -135585, 10534, -179134, -236464, -255405, 63303, -154607, 256885, -73953, 87894, 150553, -99016, -77577, -200578, 175982, -80919, -51765, -152236, -128302, -207294, 35503, -341902, -116316, -76608, -96528, -265581, -124556, 224589, 30113, 42074, -131061, 125277, -28489, -190727, 254499, -284050, -508172, -237435, 38273, -328858, -84136, 27559, 131712, -171299, 179168, -94961, -125912, 298259, 173338, -295390, -8671, -168149, -139586, -127850, -143166, 233735, 129119, 139048, 60934, -69709, -47349, -200949, 24303, 168432, 28580, 66167, -104971, 266766]
10745e3172B7409P6328J70714j24550J92c73829E7559M21538g6074n7834B45695
10733A6099M8216b48980h860D60a4208j99297G3410c44142M2074A07120K7747
10722A34867f4535J9089A1377L7855a25888o0602a5040j74895r929f1044k59550
10711c20594a10252j83542f6744q2814B32762p9613a3700B1131c79314O8037D00211
10699F0111i5788j99661j38117J75899D27237b19344J0313c623H6724b1638j42664
10688a64302G099P6925c7924k27306J08484G0563a0695l26149E8446a20911r3593
10677b14504d3102F6132Q8318b22193A17918N0275b95688d4264k21601B67285
10666c14072d6169k2469A24835b5993j62271I1604a97866a8258k48581P3491N8299
$$ y = [-53172, 27409, 103737, 274451, 149901, 150093, -373829, 57559, 479097, -76074, -133908, 245695, 16099, 64315, -248980, -8860, 460, -14208, -213505, 73410, -344142, -302068, 107120, 134867, -64535, -45446, 11377, 49232, -125888, -186490, -15040, -189935, -199864, -61044, -320594, -110252, -293794, -66744, -149558, 232762, 153149, -13700, 21131, -379314, -311277, 400211, 60111, -95788, -295449, -433566, -257667, 427237, -219344, -209031, -3623, 86724, -21638, -164302, 7099, 84024, -37924, -265230, -156746, 70563, -10695, -336844, 58446, -120911, -214504, -43102, 66132, 154450, -222193, 117918, 168193, -295688, -44264, -265865, 267285, -314072, -46169, -68638, 124835, -25993, -188264, 91604, -197866, -18258, -266839, -193348, -135049]
10655a35049j48096p2138e6963G0126a46187D7716b7948H069h7720D01175c0035
10643A0757a96758p162D179L84879L5187a69169A84940a0805k02405f1445q5425
10632a46870j30766J027g8006B10574G5926a89875b1557k95617B02848a40663
10621G9432K246b12159C13059B390O92e6147k40835A9422e23405A61804a25429
10609b19653O3080C4303c20294B79748b26491p1257k12467J69907a48905l7504
10599a86409A62606b57680A3864K03023G786a50069b0804C774b48450L0315J04856
10588a13279F4197M8593a16496h380o0050l3767B1942a96319A44994b26867J6028
10577b10839H4196P3010g6572j44141N0154A607K06033C6685C888a54017C952
$$ y = [-135049, -283145, -355283, -56963, 70126, -146187, 47716, -27948, 8069, -87720, 401175, -30035, 10757, -196758, -203920, 4179, 389058, 424245, -169169, 184940, -10805, -213210, -61445, -146870, -277636, -276609, -78006, 210574, 75926, -189875, -21557, -317174, 202848, -140663, 79432, 81678, -212159, 313059, 2390, 3082, -56147, -296982, 19422, -523405, 161804, -125429, -219653, -156573, 34303, -320294, 279748, -226491, -297748, -510215, -340308, -148905, -186409, 162606, -257680, 13864, 216887, 7786, -150069, -20804, 3774, -248450, -218135, -113279, 64197, 112790, -116496, -8380, -68430, -102197, 21942, -196319, 144994, -226867, -210839, 84196, 157206, -76572, -220713, -170559, 1607, 207640, 36685, 3888, -154017, 3952]
10565a10822o4542n0362A91333P2178a77386B19146D5250L36720p2156i4079c9794
10553e0152j10698L0605L1420k64225b9591j74081c8942j85850Q0868M5069k06845
10542c05700h6272A29860Q7152b8979A71703d0389o2160C8063R944j5819a37656
10530i5598j5460j94908A97652n3132b21479A2667a10757c1493B7070J15050c08311
10518h1186B95464b66626a26732e654m38620D0577b29765C55931i9481J0380l40088
10507d29189b5191A63114J52927m6064B3278M33476d8890j76060A03344f0205
10496C3861d6578C82077b4855m0148I8630k5085A4323a29380I9356f9480B91027
10484d1772B34800L0129A21766B3240L23525J06538J29687k50465K37061K4327
$$ y = [-110822, -175364, -225726, 191333, 263511, -177386, 219146, 45250, 381970, 309814, -94079, -39794, -50152, -160850, -130245, -98825, -363050, -29591, -203672, -38942, -224792, -143924, -98855, -305700, -86272, 129860, 217012, -28979, 171703, -40389, -102549, 38063, 48007, 32188, -137656, -95598, -111058, -305966, 197652, 144520, -221479, 12667, -110757, -31493, 27070, 142120, -308311, -81186, 295464, -266626, -126732, -5654, -444274, 40577, -229765, 355931, -99481, -89101, -429189, -25191, 163114, 316041, 269977, 23278, 456754, -48890, -224950, 103344, -60205, 33861, -46578, 382077, -24855, -65003, 98630, 73545, 14323, -129380, 99356, -69480, 291027, -41772, 234800, 264929, 121766, 23240, 346765, 453303, 582990, 332525, 569586, 593913]
10474E93913k85238c7567D5236B2204H21J9917J79037B8765J0057K61229a08369
10462A77261g584j58614J4873A81018h7065A6467c8547j22474K9375I3642C4055
10450A12527a64779D04312i8701H3848N5099c40354a66196Q2352A10738J69724
10440B80462H5737l6513I622h8295m1223D09678a78494a2148B47233g2056a0309
10428A27531C0326c2126E0163a51565g800A08658b07790K9745L4450b6535j05896
10417a32431C11945H764c52564B54797a54600A95991J01287B6307a71037B22488
10406a96465L323O4270k1728G7580C1813A1214R8112a03746A49053g9856B21572
10394F3293B9811J8423J65550F3997b1729C28162j61414I03K40811G150J80239
$$ y = [593913, 308675, -37567, 45236, 22204, 821, 20738, 199775, 28765, 38822, 300051, -108369, 177261, -7584, -166198, -151325, 181018, -87065, 16467, -38547, -161021, -131646, 93642, 34055, 112527, -164779, 404312, -98701, 83848, 138947, -340354, -166196, -83844, 110738, 280462, 85737, 49224, 9622, -88295, -129518, 409678, -178494, -12148, 247233, -72056, -10309, 127531, 30326, -32126, 50163, -151565, -7800, 108658, -207790, -178045, -143595, -26535, -132431, 311945, 8764, -352564, 254797, -154600, 195991, 297278, 26307, -171037, 222488, -196465, -193142, -128872, -150600, 77580, 31813, 11214, 109326, -103746, 149053, -79856, 221572, 63293, 29811, 48234, 213784, 63997, -21729, 328162, 166748, 903, 241714, 7150, 187389]
10383A87389J02012J50543b59249A03723b955D5504k1440J58179M605c3495k0534
10372e4029C91955H636J45526R3688J48780J01425J32260B95428m2645K16893
10362D69676R5799a19668C14397J17679a89328L5540E16794h0340C4229J61882
10352A96111J72739K6011J02427P2329p0298n710j18790m0840A36462L01654j99008
10341B39108J05745A0851L35329J62684a5743A31337J60451j26816d9011n1055
10331a00066B59849c2930C03579B1593J63174r0621c169C01144A1260d46672D48337
10319F01398B36782G0820J49020f2870C6043R9139D5867K85229b8483l2206a7227
10307A22472D9661R1356J75802e6157k579j25933B69930j0449a18100j6292J5947
$$ y = [187389, 289401, 439944, -259249, 103723, -2955, 45504, 24064, 182243, 186848, -33495, -54029, 391955, 8636, 154162, 247850, 396630, 498055, 630315, 295428, 252783, 469676, 565475, -119668, 314397, 432076, -189328, -153788, 516794, -80340, 34229, 196111, 368850, 394861, 497288, 569617, 499319, 493609, 374819, 333979, 136462, 438116, 239108, 344853, 10851, 346180, 508864, -15743, 131337, 291788, 164972, -49011, -100066, 259849, -32930, 303579, 21593, 184767, 94146, -3169, 301144, 11260, -446672, 448337, 601398, 236782, 70820, 219840, -62870, 36043, 135182, 45867, 331096, -28483, -60689, -17227, 122472, 49661, 141017, 316819, -56157, -58736, -184669, 269930, 259481, -118100, -134392, -118445]
10296a18445B33147A2055K77913g9884A34696q843c61066b7697j90806D9702K19766
10285B69468b70263D8471b93635p7274J63296A32220b6710o9202K8401A6576a88963
10273b47127C9118g3885l64311c8288I7586a38217J1822d0369j36205j16515C7023
10261E3030f7197m14235A70811b27391A04374L0178L45790A49145b834l9909k06779
10250b49522A61229J40545G2019a39930j42215K8204L0285E7148c8855A79368
10239a60313L6445c9879m51101P2093C94J86657L2256k8822a09347L0416F8592
10227c00520c2566m5051C85180D7783Q6481A7673f8030q9234c8738a6976j84355
10216b01331J8806N5121G1393b38212D2896K47959D1097i1998l23393f6114A99026
$$ y = [-118445, 233147, 12055, 289968, -79884, 134696, 125853, -361066, -27697, -218503, 49702, 269468, -270263, 48471, -293635, -370909, -207613, 132220, -26710, -95912, -67511, 16576, -188963, -247127, 39118, -73885, -438196, -38288, 97586, -138217, -126395, -40369, -176574, -293089, 37023, 53030, -67197, -481432, 170811, -227391, 104374, 134552, 480342, 149145, -2834, -42743, -249522, 161229, 301774, 72019, -139930, -282145, -253941, -223656, 57148, -38855, 179368, -160313, -123868, -39879, -490980, -418887, 394, 187051, 219307, 190485, -109347, -78931, 68592, -300520, -32566, -77617, 385180, 47783, 134264, 17673, -68030, -157264, -38738, -16976, -201331, -182525, -127404, 71393, -238212, 42896, 290855, 41097, -91998, -415391, -66114, 199026]
10204c00228i2058A53789a49159j07010J11035c1457j61715A94943A5511a22186
10193F9311M9172a38061a6149C4979M1117j6225A9459P9721a35874B09829a6818
10181a9411k73305n8609b6910k65196J32314c3674n8782A6168a37572F9853c01653
10169a86697A12615a03329a5388A28622a81591D0311e7351B8331c46898a54025
10158a55238D3701a28004A00144R2282c16281C42260A46503a21576c1299l2350
10148f3649j67839E5688d3060j63064c9105j6687h785j32463n8541J8148B23374
10136g9837G0287a23530I1035b83587J32627a8296C2094i1425A23434b49493R6434
10125a53059L8163B00664c8617l333o7498M1509B49421F3141c87076a38963m4369
$$ y = [-300228, -92058, 153789, -149159, -256169, -145134, -31457, -193172, 194943, 15511, -122186, 69311, 118483, -138061, -16149, 34979, 76096, 59871, 19459, 99180, -135874, 209829, -16818, -19411, -292716, -351325, -26910, -292106, -159792, -33674, -92456, 16168, -137572, 69853, -301653, -186697, 112615, -103329, -15388, 128622, -181591, 40311, -57351, 28331, -346898, -154025, -155238, 43701, -128004, 100144, 192426, -316281, 342260, 146503, -121576, -31299, -63649, -231488, 55688, -43060, -206124, -39105, -55792, -8785, -141248, -199789, -181641, 223374, -79837, 70287, -123530, 91035, -283587, -150960, -18296, 32094, -91425, 123434, -249493, -153059, -114896, 200664, -38617, -41950, -109448, -67939, 249421, 63141, -387076, -138963, -183332]
10114a83332e2762k56420a48018j49761f6040o5705d8787a5132B19833B7409a84460
10102b84482R8338H8032L7037E5821a72041d9761j86762C0644J95052g5748B79588
10090c79055G8887N3625o1056a8925j01639A13005d27860A42013C7072b09619
10079A75481d7665p3748k64460J0409b3930A56678g9947k50432d4688q1832K8873
10068i7647L8283A60098P4340E6356i2892A29172b09755k5836l9414C998J94867
10057A98865K19126A40621K1092a54821l8939k40748A58744G6977a92667b5769
10046B3689n035c70073A70126a27165d9925r3708c7934O732j51265J8494A85944
10034a85734I4275e9439B0670a65064j7604E7943b38622A34156N4176b21722A09531
$$ y = [-183332, -52762, -309182, -148018, -297779, -66040, -131745, -48787, -15132, 219833, 27409, -184460, -284482, -186144, 88032, 125069, 55821, -172041, -49761, -236523, 30644, 225696, -75748, 279588, -379055, 78887, 132512, 71456, -18925, -120564, 113005, -427860, 142013, 37072, -209619, 175481, -47665, -121413, -385873, -375464, -23930, 156678, -79947, -330379, -44688, -126520, -97647, -59364, 160098, 234438, 56356, -92892, 129172, -209755, -235591, -275005, 3998, 198865, 417991, 140621, 161713, -154821, -193760, -434508, 158744, 76977, -192667, -25769, 23689, 18654, -370073, 170126, -127165, -49925, -143633, -37934, -31202, -182467, -163973, 185944, -185734, 94275, -59439, 20670, -165064, -182668, 57943, -238622, 134156, 188332, -221722, 109531]
10022c64211a03335G1332M8899g3798o9266E6907Q6503a98182B8676a19927m7359
10011a67286f9099A11577a35860C26120h1657H5891a34562d7768B12853a63657
10000b56009i3553b8028n069A61416c2364I8024h9644H9147a54127o8816E1371
9988a79655h4452G0696h6089J9268l49082A52720m1820a95137A17706N2423d6915
9976a15851j19585F1392J63175a92071D49b22409A42533d013A65206a5389J373
9965a4016A76256a13725L9012K2198j61621C4288b39438A81108D4418K1467b16289
9953c00178J04000h4972j14863A95839G2412B6344b25716d2906B44764n8246c66676
9941c36221f0777B7649K26995b48455a19621M0224c1263k24897a02010e0288F516
$$ y = [-364211, -103335, 71332, 120231, -73798, -143064, 56907, 143410, -198182, 28676, -119927, -167286, -69099, 111577, -135860, 326120, -81657, 85891, -134562, -47768, 212853, -163657, -256009, -93553, -28028, -33097, 161416, -32364, 98024, -89644, 89147, -154127, -222943, 51371, -179655, -84452, 70696, -86089, -66821, -415903, 152720, 110900, -195137, 117706, 170129, -46915, -115851, -235436, 61392, 224567, -192071, 449, -222409, 142533, -4013, 165206, -15389, -14016, 176256, -113725, -74713, -52515, -214136, 34288, -239438, 181108, 44418, 65885, -216289, -300178, -196178, -84972, -199835, 195839, 72412, 26344, -225716, -42906, 244764, 186518, -366676, -336221, -60777, 27649, 254644, -248455, -119621, -79397, -31263, -256160, -102010, -50288, 6516]
9929i387A90846d9067n6447j43743a4046C5845b63651N9867e1891R092A66424
9917d89415b4818R900I9867m1237a01833k41650e8020j28637r4392a21956A05677
9905a01385A57315h3693A8296O3064k901g8323B20579I7918i0632c1311A35958
9893b26830J9218h5537D8917a15469k9174F0470c36125J36173r6770h3663j54113
9882b37776C10269D5724K8494b48725Q7244D9759f3292C7190f3442o6398I2949
9870b64216a13598r305j08974a8523A9380a87095Q0861B20107b85569q0679h6154
9858a27497j316k02549H4478d6934j50103j2649c7222k03341a10024A35805a14586
9846b34707E9697b29678P3206J4773I9470h0669A37087i4637A76105f1873B346
$$ y = [-9387, 190846, -49067, -105514, -249257, -14046, 35845, -263651, -203784, -51891, -42799, 166424, -489415, -24818, -14918, 99867, 58630, -101833, -343483, -58020, -186657, -281049, -121956, 105677, -101385, 157315, -83693, 18296, 81360, 78459, -78323, 220579, 97918, -90632, -31311, 135958, -226830, -207612, -85537, 48917, -115469, -144643, 60470, -336125, -199952, -296722, -83663, -237776, 310269, 45724, 74218, -248725, -161481, 49759, -63292, 37190, -63442, -129840, 92949, -264216, -113598, -122903, -231877, -18523, 19380, -187095, -106234, 220107, -285569, -366248, -86154, -127497, -128813, -331362, 84478, -46934, -197037, -209686, -37222, -240563, -110024, 135805, -114586, -234707, 59697, -229678, -156472, -141699, 99470, -80669, 137087, -94637, 176105, -61873, 2346]
9834C45559c65024J65097G9922c09181A12597a40854C1700N7850e8678J7068C26551
9822h3100j23588k337F7865J57222a00096H5319A4903N6464J68513g2952j59952
9811b32904G9399b55682A24512N1232p6679a33919a3874m2611j2412j9276D5670
9799a0112E3842d993r9583D748c94187J88832g7369l31953A92047E4842K5101
9788G9943b09567N250F7283f6519p0483H5092c66001o4900E9838N2857a39515
9776a78337B03649d2399A12654c0558A5068d4865G4473C4703b10574A04317d3702
9764a03350c8850C07466K0536j36416a72289F804b14934A78824i1401H768e3954
9752c5253j97766a8953j03994A9055g2115j76026C27246a16329k7875C09706c06908
$$ y = [345559, -365024, -199927, 79922, -309181, 112597, -140854, 31700, 89550, -58678, -41610, 326551, -83100, -206688, -209025, 67865, 225087, -100096, 85319, 14903, 71367, 239880, -72952, -232904, 79399, -255682, 124512, 175744, 99065, -133919, -13874, -56485, -68897, -88173, 45670, -10112, 53842, -4993, -104576, 4748, -394187, -205355, -77369, -409322, 192047, 54842, 79943, -209567, -204317, 67283, -66519, -137002, 85092, -366001, -430901, 59838, 112695, -139515, -178337, 203649, -42399, 112654, -30558, 15068, -44865, 74473, 34703, -210574, 104317, -43702, -103350, -38850, 307466, 328002, 191586, -172289, 6804, -214934, 178824, -91401, 8768, -53954, -35253, -233019, -18953, -122947, 19055, -72115, -248141, 327246, -116329, -144204, 309706, -306908]
9740c21030h7103I2837l6176a27864B616a44098j68690J19628O6601I0164h3000
9728G2988a88A15101F102c6438j23053A09374i3954J3390l09561G0030c18726
9716c6904A22740c13588D6145J3799B553a20342o9722H901a00846j15417n4450
9705b70713f6821k8863j09134m8214a1705C1658f386j47663O5255A68750Q4096
9694B52846a90456K0917N929B22078c15098N7792A77266b01573c8080j8484P481
9683d9083K0668o6348k08004a19078b6967l0591n5883K2760A52141d5069l9295
9672h4364C5200a82777G0011L7382K65269j70942a2636j51793o1072j15496h3818
9660a88296G5477a15468B67496a80330h3975E9088a65111A99954p8936a53761
$$ y = [-321030, -87103, 92837, 56661, -127864, 2616, -144098, -312788, -193160, -126559, 90164, -83000, 72988, -188, 115101, 6102, -36438, -159491, 109374, -93954, -80564, -390125, 70030, -318726, -36904, 122740, -313588, 46145, 59944, 2553, -120342, -190064, 8901, -100846, -216263, -270713, -66821, -95684, -204818, -253032, -11705, 31658, -6386, -154049, -88794, 168750, 252846, -190456, -169539, -163610, 222078, -315098, -257306, 177266, -201573, -38080, -56564, -49083, -28415, -94763, -302767, -119078, -26967, -57558, -113441, -90681, 152141, -45069, -84364, 35200, -182777, 70011, 107393, 372662, 201720, -12636, -164429, -225501, -340997, -83818, -188296, 75477, -115468, 267496, -180330, -83975, 59088, -165111, 199954, 121018, -153761]
9649a77814P3A09688c61378B27476a27251j51180R7578A4017g2896D2808J0119
9638E2927b7941j85323C51204g7531m996q8380r2209B0214O3230f1822k81714
9627c43536J42480O5091G2172a76429m4734g7715n942k05802K1786Q6011C9252
9615G1042c0731l68913J90532O6113a4921r3929N3117A85835H369M8463c30081
9603h3842c660m77645C8685c38885h0329j39836o009d8086D2683K039c67493A30494
9590D1257d9574l13792a4507o5329l399L0874k26549k751A65843a27147L4817
9579i2330l9124N5321J9999m2429D1314a78689f4965A99227a91135h474j86631
9568a95105P3373B47551M1411a22455j53951C94774c8489C11719G584P7576b80317
$$ y = [-177814, -177741, 109688, -361378, 227476, -127251, -278431, -180853, 14017, -72896, 42808, 52927, -27941, -213264, 351204, -77531, -82527, -170907, -263116, 20214, 83444, -61822, -343536, -201056, -135965, 72172, -176429, -221163, -77715, -83657, -289459, -267673, -181662, 39252, 71042, -30731, -399644, -209112, -142999, -14921, -108850, -55733, 185835, 8369, 56832, -330081, -83842, -3660, -481305, 38685, -338885, -80329, -220165, -226174, -48086, 42683, 44722, -367493, 130494, 41257, -49574, -363366, -14507, -79836, -83235, -52361, -278910, -281661, 165843, -127147, -92330, -131454, -76133, -56134, -98563, 41314, -178689, -64965, 199227, -191135, -8474, -195105, -121732, 247551, 288962, -122455, -276406, 394774, -38489, 311719, 7584, 85160, -280317]
9556a32262r7872k8594L5960a0523A29225a29745J2805K1769p7821A97470C7357
9544b55384L3291p7808O0630O002J5227a2222j70813M3221M2987B2014a46174
9532b07800C5051K4252e7994I8329P2480a16182k58946J79692l88392b07838f0720
9520A93727H2160a61179A87741a37055k7063l70334A19651c57608A19818k990
9510A16828a14270a7099A80628P4039b5346l15919a40160r2768b3446A26369B5015
9498e1203m5986J5428l6057A15551D0316i1325j61770a17976B33817a30206j32572
9487b62778J7408K6381d2105A2647b5787l0145D4033n840M6220b14791j88562
9476d03353a81354A82526b8216j35380a1105K638k428C56663a9043j71053m7132
$$ y = [-132262, -230134, -258728, -222768, -10523, 129225, -129745, -116940, -95171, -172992, 197470, 37357, -255384, -222093, -299901, -239271, -233269, -218042, -12222, -183035, -139814, -96827, 22014, -146174, -207800, 35051, 59303, -57994, 98329, 170809, -116182, -375128, -195436, -583828, -207838, -60720, 193727, 82160, -161179, 187741, -137055, -164118, -534452, 119651, -357608, 119818, 116828, -114270, -17099, 180628, 254667, -25346, -341265, -140160, -232928, -23446, 126369, 25015, -51203, -97189, -81761, -117818, 115551, 40316, -91325, -253095, -117976, 233817, -130206, -262778, -245370, -218989, -42105, 12647, -25787, -55932, 44033, 38193, 84413, -214791, -403353, -181354, 182526, -28216, -163596, -11105, -8467, -10895, 356663, -19043, -190096, -237228]
9465b37228G8004G327J19791h3753A44289p0466f7560K2332j94646f3016J2782
9454e0234G3492a10112A06789m7053b27793k721a8817j61909A15751m1616a79170
9442A86460b3985A61986c74936b6721n0346A4387K0656J05314B3265J43629L3939
9431B00833C5275a30713B1475a31607J8870j75445j06936J91176A66021a8886
9420E9179c35249e8601j33951h9461A77680D6505K1130b64087b0428k4023C5375
9408b52882J09252k1025p1029J17214A3378Q7426a21721j98737J06739a9044l27353
9397c46397I3265K38032B9113k341a37617O3400j6021a7577k15047F047a27280
9385a99139O0880o0453R7557b9054j22237A80194B2210P8516K2618Q0528a08862
$$ y = [-237228, 78004, 7327, 127118, -83753, 144289, 73823, -67560, -45228, -239874, -63016, -50234, 73492, -110112, 106789, 59736, -227793, -230514, -18817, -180726, 115751, 74135, -179170, 186460, -23985, 161986, -374936, -26721, -77067, 14387, 35043, 140357, 23265, 166894, 200833, 35275, -130713, 21475, -131607, -112737, -288182, -395118, -203942, 166021, -18886, 59179, -335249, -58601, -192552, -89461, 177680, 46505, 67635, -264087, -20428, -44451, 35375, -252882, -143630, -164655, -235684, -118470, 13378, 100804, -121721, -320458, -213719, -19044, -346397, 93265, 331297, 29113, 26772, -137617, -74217, -90238, -17577, -232624, 6047, -127280, -199139, -138259, -198712, -101155, -29054, -151291, 180194, 22210, 100726, 123344, 203872, -108862]
9373I2793L9005a47906E07177b77357c9533A60321c16350a55074J6666b6995A13154
9361B548J7171J91435i4654k2607L2799F1039K50653c52612A09702K8489k3623
9350A14568e6596B8136L688b44943f6207I4674g5615j95144G1122c23018E4656
9338a33694j22334h4263A97195H6463a00464c8785I0379J45344b44489A43961
9327a74605d9717q2079l92949H2712b39760h631A56081L1485G4039c98406R9810
9316b98596g7648C06969B7379b24813q039F8254a70347e9754m2139j23692m7396
9305b72981B571a34809r7859D2343A0557b47849C10691L5347b72226D0205a9686
9293b02491O1858e7247j37112A38988c90488f7889G1451l0736N3383c40718c7463
$$ y = [92793, 131798, -147906, 507177, -277357, -39533, 160321, -316350, -155074, -138408, -26995, 113154, 2548, 19719, 211154, -94654, -117261, -84462, 61039, 311692, -352612, 109702, 138191, 114568, -56596, 28136, 31824, -244943, -66207, 94674, -75615, -270759, 71122, -323018, 54656, -133694, -256028, -84263, 197195, 86463, -100464, -38785, 90379, 235723, -244489, 143961, -174605, -49717, -131796, -524745, 82712, -239760, -8631, 156081, 187566, 74039, -398406, -298596, -77648, 306969, 27379, -224813, -232852, 68254, -170347, -59754, -101893, -225585, -272981, 2571, -134809, -232668, 42343, 10557, -247849, 310691, 346038, -272226, 40205, -19686, -202491, -140633, -57247, -194359, 138988, -390488, -67889, 71451, 40715, 94098, -340718, -37463]
9281B1694c855k7464A9635c70579E0368A1947b16854A1675L2468g616k12219A7208
9268c7005A00085b51249B87752j02725m1619B794a74591p8625i6888M6701j92532
9257b42719B01998a79237A02334a70660m0510P9517A18960a00996I3346L764b4126
9245a11326B08271a06132D9241b451k88085c3052k33655A73873a39023E7602b73647
9233H893a8595A13923I881b16132g7937j45587A03880A5885L34604J0182a48209
9221a85840E4281b87635a38817j50370p729A37706C1785b84052A53582c27017
9210A30317A2067b31703A57261C5587b27508C926K78395E5392a19749A38563a10071
9198c0305m4415o4813O3105o4832c0809l23459d2316k21401B55907a27306N944
$$ y = [21694, -3855, -31319, 19635, -370579, 50368, 11947, -216854, 11675, 44143, -7616, -219835, 17208, -37005, 100085, -251249, 287752, 185027, 143408, 2794, -174591, -253216, -96888, -50187, -242719, 201998, -179237, 102334, -170660, -211170, -131653, 118960, -100996, 93346, 97110, -24126, -111326, 208271, -106132, 49241, -2451, -290536, -33052, -266707, 173873, -139023, 57602, -273647, 8893, -18595, 113923, 9881, -216132, -77937, -223524, 103880, 15885, 350489, 360671, -148209, -185840, 54281, -287635, -138817, -289187, -296916, 137706, 31785, -284052, 153582, -327017, 130317, 12067, -231703, 157261, 35587, -227508, 3926, 282321, 55392, -119749, 138563, -110071, -30305, -74720, -139533, -76428, -141260, -30809, -354268, -42316, -263717, 255907, -127306, -121362]
9187a21362B16879m1792a23177B1441c69890R5372h0556j22500M6979d1528j89615
9176b31143B2571c20736i6259k30008a58221l6961A19212j6342b72292D6071P6060
9165A22131b4329o6884A47873a76134q4904k8542j2185A34495J37127b5937B98528
9153C7835c14274f8433J7265j07541D7096b25594r242B14903b28952A47895b79835
9141A37022a15159L0145p7115A41222a31065A30629n3308b93620a7289A06022
9130B10459G0869d43677a65491J9420N826B61456a52394A39110a28948A41140
9119b18049R6186j64154j00991C61759c52740A86441l0025b50434e6339A55326
9108D1371b2869k86506a07201b6964j09423A07988a59852m79057K99692g5455
$$ y = [-121362, 216879, 175087, -123177, 21441, -369890, -274518, -80556, -203056, -156077, -41528, -231143, 22571, -320736, -96259, -326267, -158221, -195182, 119212, 102870, -272292, 46071, 122131, -24329, -91213, 147873, -176134, -261038, -289580, -301765, 134495, 271622, -25937, 298528, 37835, -314274, -68433, -51168, -158709, 47096, -225594, -234836, 214903, -228952, 147895, -279835, 137022, -115159, -85014, -162129, 141222, -131065, 130629, 77321, -293620, -17289, 106022, 210459, 70869, -443677, -165491, -146071, -140245, 261456, -152394, 139110, -128948, 141140, -218049, -121863, -286017, -387008, 361759, -352740, 186441, 156416, -250434, -56339, 155326, 41371, -22869, -309375, -107201, -26964, -136387, 107988, -159852, -638909, -339217, -75455]
9097h6291m4346O396o8423J1571B31685f8449j76970A9634d5268m3849k21533
9086c10650R4391A18947n1430a91184M2886M4825k05971A42165j7000a76156A0121
9074B01938J81841i4500j68887h5739b5494k8960o9073j65472a23016o8454j35723
9063c27193G0758f3185k0566a685l14776i3290C070a42372H9101c47164a1732
9051g3568k35295e8919j56163B8348D867a1950q3359q8147D6993g5432A47569
9039B36479B1147J001J4237K6665b35951M930R7501d3533n8589N0495j05661A45724
9026b19218D279K3436c8661l64522B36575E9415j4512a92016g9865K6976l9659
9015i2548j43815L5904D06367A54582A0290c49729J8492e5273m07820E1705A3492
$$ y = [-86291, -130637, -124241, -192664, -181093, 231685, -68449, -245419, 19634, -45268, -89117, -310650, -216259, 118947, 67517, -191184, -148298, -103473, -309444, 142165, 125165, -176156, 10121, 201938, 383779, -94500, -263387, -85739, -25494, -54454, -123527, -288999, -123016, -191470, -327193, 70758, -63185, -83751, -1685, -316461, -93290, 3070, -142372, 89101, -347164, -11732, -73568, -308863, -58919, -215082, 28348, 4867, -11950, -95309, -183456, 46993, -75432, 147569, 236479, 21147, 22148, 36385, 63050, -235951, -231021, -133520, -43533, -102122, -51627, -157288, 145724, -219218, 4279, 27715, -38661, -403183, 236575, 59415, 44903, -192016, -79865, -52889, -92548, -236363, -200459, 406367, 154582, 10290, -349729, -331237, -55273, -463093, 51705, 13492]
9003h5867B5406a2923B3960M5697b1282q9914d8422A14228A2928h8862C55769
8991c11047C26642a88059A91322i8809B9596a52415C201a19871l9307m3627B7032
8979a59911B08848E5758P525a96860h8908b402B73294b54989M7793N9859E360
8967E59339A21922m7279a31551r5752A1123c674k96062g4634a2357I6349b18453
8955C6736J1815N4879h3797A99364k7366a2146r8784r7885n0169d0905k5291e706
8942b58121D09693c93359B37254a36348N0671j2744d0124p3800A48511P0332b19021
8930i9320L6641B80904b26378r7485d2288D55930J53960J325388J142847K462454
8920E540579k089927F59535C05127A24777D5973K77980A42377f5957k0566B30848
$$ y = [-85867, 25406, -12923, 23960, 69657, -21282, -111196, -48422, 114228, 12928, -88862, 355769, -311047, 326642, -188059, 191322, -98809, 29596, -152415, 3201, -119871, -159178, -202805, 27032, -159911, 208848, 55758, 63283, -196860, -88908, -2402, 273294, -254989, -207196, -147337, 5360, 559339, 121922, 74643, -131551, -227303, 11123, -3674, -299736, -74634, -12357, 96349, -218453, 36736, 48551, 103430, -83797, 199364, 171998, -12146, -110930, -208815, -258984, -40905, -66196, -5706, -258121, 409693, -393359, 237254, -136348, -85677, -98421, -40124, -113924, 148511, 218843, -219021, -99320, -62679, 280904, -226378, -323863, -42288, 455930, 609890, 1935278, 3078125, 5540579, 3450652, 659535, 305127, 124777, 45973, 323953, 142377, -65957, -86523, 230848]
8909B82417I3714a41792A68521b00390h0033k2212H5639d86984e1412C7408J2937
8898E0345A024M3977b282k51045O0966E69677c1841j66926K8123j09065B59313
8886B85770a45459L7139k21099N5094a31257M9773o9911D1977b68458a271o5239
8875f6510k36129a2837B4333d3606J2465j54727c7184A04296a7508j356n5640
8864g4504k64265J29729g6936G6624i7028c1876k18217n135D8404b88905J26030
8853a62875A91627d44106h6820H5091a77812A22282b02558O4272M6038D3045h9175
$$ y = [282417, 93714, -141792, 168521, -200390, -80033, -102245, 85639, -486984, -51412, 37408, 50345, 1024, 45001, -2282, -253327, -192361, 569677, -31841, -198767, -170644, -279709, 259313, 285770, -145459, -108320, -329419, -274325, -131257, -81484, -151395, 41977, -268458, -1271, -66510, -302639, -12837, 24333, -43606, -31141, -185868, -37184, 104296, -17508, -18864, -74504, -338769, -209040, -76936, 76624, -97028, -31876, -250093, -255228, 48404, -288905, -162875, 191627, -444106, -86820, 85091, -177812, 122282, -202558, -138286, -92248, 43045, -89175]
$$ [...]
##END NTUPLES=NMR SPECTRUM
##END=
