##TITLE=AC1643_HPIAH13376_8569605_5OwWgHdadT
##JCAMPDX= 6.0         $$ Bruker NMR JCAMP-DX V2.0
##DATA TYPE= NMR SPECTRUM
##DATA CLASS= NTUPLES
##ORIGIN= BRUKER
##OWNER= Administrator
$$ 1.72 TOPSPIN		Version 2.1
$$ 2014-04-10 19:05:55.925 -0700  Administrator@X
$$ Compression mode = diff/dup
##.OBSERVE FREQUENCY= 400.02188249412
##.OBSERVE NUCLEUS= ^1H
##.ACQUISITION MODE= SIMULTANEOUS (DQD)
##.ACQUISITION SCHEME= undefined
##.AVERAGES= 64
##.DIGITISER RES= 22
##SPECTROMETER/DATA SYSTEM= spect
##.PULSE SEQUENCE= noesygpps1d.comp
##.SOLVENT NAME= COFFEE_meoh
##.SHIFT REFERENCE= INTERNAL, COFFEE_meoh, 1, 14.96139
##AUDIT TRAIL= $$ (NUMBER, WHEN, WHO, WHERE, PROCESS, VERSION, WHAT)
$$ ##TITLE= Audit trail, TOPSPIN		Version 2.1
$$ ##JCAMPDX= 5.01
$$ ##ORIGIN= Bruker BioSpin GmbH
$$ ##OWNER= Administrator
$$ $$ E:\/data/COFFEE/nmr/AC1643_HPIAH13376_8569605_5OwWgHdadT/12/pdata/1/auditp.txt
$$ ##AUDIT TRAIL=  $$ (NUMBER, WHEN, WHO, WHERE, PROCESS, VERSION, WHAT)
(   1,<2014-04-10 19:05:49.425 -0700>,<Administrator>,<X>,<go>,<TOPSPIN 2.1>,
      <created by zg
	started at 2014-04-10 18:54:19.728 -0700,
	POWCHK enabled, PULCHK disabled,
       configuration hash MD5:
       C8 4E 4E 5D D3 5C D8 9E 9F 52 82 E0 59 8A DE 15
       data hash MD5: 64K
       C7 19 A2 C1 34 BA AF F6 9B 52 82 16 3F 09 5A C4>)
(   2,<2014-04-10 19:05:52.863 -0700>,<Administrator>,<X>,<proc1d>,<TOPSPIN 2.1>,
      <Start of raw data processing
       efp LB = 0.3 FT_mod = 6 PKNL = 1 PHC0 = 0 PHC1 = 0 SI = 128K 
       data hash MD5: 128K
       47 06 1A 50 F0 12 71 D2 70 64 AA C6 86 54 86 F4>)
(   3,<2014-04-10 19:05:54.050 -0700>,<Administrator>,<X>,<proc1d>,<TOPSPIN 2.1>,
      <pk PHC0 = -81.77673 PHC1 = 0 
       data hash MD5: 128K
       BE 94 F9 B9 DB 71 19 8D 33 9C D4 DD CA 29 FC E5>)
(   4,<2014-04-10 19:05:54.847 -0700>,<Administrator>,<X>,<proc1d>,<TOPSPIN 2.1>,
      <abs ABSG = 1 
       data hash MD5: 128K
       5E F6 1A 2C 83 83 64 5B C8 8D 97 38 EA CF 88 40>)
(   5,<2014-04-10 19:05:55.035 -0700>,<Administrator>,<X>,<proc1d>,<TOPSPIN 2.1>,
      <abs ABSG = 2 
       data hash MD5: 128K
       68 F2 53 3A 34 FE F8 9F D0 AE 26 37 99 00 CE F4>)
(   6,<2014-04-10 19:05:55.191 -0700>,<Administrator>,<X>,<proc1d>,<TOPSPIN 2.1>,
      <abs ABSG = 3 
       data hash MD5: 128K
       EF 1F 80 27 23 A0 65 75 80 FE 12 71 FA 2D DD C9>)
(   7,<2014-04-10 19:05:55.378 -0700>,<Administrator>,<X>,<proc1d>,<TOPSPIN 2.1>,
      <abs ABSG = 4 
       data hash MD5: 128K
       69 25 E7 94 D7 E7 CC 86 5B 7A 86 5C BF 96 7E B1>)
(   8,<2014-04-10 19:05:55.566 -0700>,<Administrator>,<X>,<proc1d>,<TOPSPIN 2.1>,
      <abs ABSG = 5 
       data hash MD5: 128K
       10 41 A1 9E F7 0C BB D1 89 31 D7 98 57 52 5D 4C>)
$$ ##END=
$$ 
$$ $$ hash MD5
$$ $$ DC 7B 12 FF AC 27 05 54 97 74 D0 B1 DC AF 82 BA
##$RELAX= 
##$RELAX= 
##$RELAX= 
##$RELAX= 
##$RELAX= 
##$RELAX= 
##$RELAX= 
##$RELAX= 
$$ Bruker specific parameters
$$ --------------------------
##$DU= <E:\>
##$EXPNO= 12
$$ [...]
150 150 150 150 150 150 150 150
##$TP07= 0
##$TPNAME0= <>
##$TPNAME1= <>
##$TPNAME2= <>
##$TPNAME3= <>
##$TPNAME4= <>
##$TPNAME5= <>
##$TPNAME6= <>
##$TPNAME7= <>
##$TPOAL= (0..7)
0.5 0.5 0.5 0.5 0.5 0.5 0.5 0.5
##$TPOFFS= (0..7)
0 0 0 0 0 0 0 0
##$TUNHIN= 0
##$TUNHOUT= 0
##$TUNXOUT= 0
##$USERA1= <user>
##$USERA2= <user>
##$USERA3= <user>
##$USERA4= <user>
##$USERA5= <user>
##$V9= 5
##$VALIST= <valist>
##$VCLIST= <CCCCCCCCCCCCCCC>
##$VD= 0
##$VDLIST= <DDDDDDDDDDDDDDD>
##$VPLIST= <PPPPPPPPPPPPPPP>
##$VTLIST= <TTTTTTTTTTTTTTT>
##$WBST= 1024
##$WBSW= 4
##$XGAIN= (0..3)
0 0 0 0
##$XL= 0
##$YL= 0
##$YMAX_a= 6064071
##$YMIN_a= -13575498
##$ZGOPTNS= <>
##$ZL1= 120
##$ZL2= 120
##$ZL3= 120
##$ZL4= 120
##$ABSF1= 14.96139
##$ABSF2= -5.596792
##$ABSG= 5
##$ABSL= 3
##$ALPHA= 0
##$AQORDER= 0
##$ASSFAC= 0
##$ASSFACI= 0
##$ASSFACX= 0
##$ASSWID= 0
##$AUNMP= <proc_prof1d_extract.lims>
##$AXLEFT= 0
##$AXNAME= <>
##$AXNUC= <1H>
##$AXRIGHT= 0
##$AXTYPE= 0
##$AXUNIT= <>
##$AZFE= 0.1
##$AZFW= 0.1
##$BCFW= 0
##$BC_mod= 0
##$BYTORDP= 0
##$COROFFS= 0
##$CY= 15
##$DATMOD= 1
##$DC= 0
##$DFILT= <>
##$DTYPP= 0
##$F1P= 0
##$F2P= 0
##$FCOR= 0.5
##$FTSIZE= 131072
##$FT_mod= 6
##$GAMMA= 0
##$GB= 0
##$INTBC= 1
##$INTSCL= 1
##$ISEN= 128
##$LB= 0.3
##$LEV0= 0
##$LPBIN= 0
##$MAXI= 10000
##$MC2= 0
##$MEAN= 0
##$ME_mod= 0
##$MI= 0
##$NCOEF= 0
##$NC_proc= -2
##$NLEV= 6
##$NOISF1= 0
##$NOISF2= 0
##$NSP= 0
##$NTH_PI= 0
##$NZP= 0
##$OFFSET= 14.96139
##$PC= 1
##$PHC0= -81.77673
##$PHC1= 0
##$PH_mod= 1
##$PKNL= yes
##$PPARMOD= 0
##$PPDIAG= 0
##$PPIPTYP= 0
##$PPMPNUM= 2147483647
##$PPRESOL= 1
##$PSCAL= 4
##$PSIGN= 0
##$PYNMP= <proc.py>
##$REVERSE= no
##$SF= 400.02000948086
##$SI= 131072
##$SIGF1= 0
##$SIGF2= 0
##$SINO= 400
##$SIOLD= 131072
##$SPECTYP= <>
##$SREGLST= <1H.CDCl3>
##$SSB= 0
##$STSI= 131072
##$STSR= 0
##$SW_p= 8223.68421052631
##$SYMM= 0
##$S_DEV= 0
##$TDeff= 65536
##$TDoff= 0
##$TI= <>
##$TILT= no
##$TM1= 0
##$TM2= 0
##$TOPLEV= 0
##$USERP1= <user>
##$USERP2= <user>
##$USERP3= <user>
##$USERP4= <user>
##$USERP5= <user>
##$WDW= 1
##$XDIM= 131072
##$YMAX_p= 321010336
##$YMIN_p= -13762
##$CURPLOT= <Network HP LaserJet P1505>
##$CURPRIN= <$Network HP LaserJet P1505>
##$DFORMAT= <normdp>
##$LAYOUT= <+/1D_H.xwp>
##$LFORMAT= <normlp>
##$PFORMAT= <normpl>
##$SURQMSG= 1
$$ End of Bruker specific parameters
$$ ---------------------------------
##NTUPLES= NMR SPECTRUM
##VAR_NAME=  FREQUENCY,     SPECTRUM/REAL,   SPECTRUM/IMAG
##SYMBOL=    X,             R,               I
##VAR_TYPE=  INDEPENDENT,   DEPENDENT,       DEPENDENT
##VAR_FORM=  AFFN,          ASDF,            ASDF
##VAR_DIM=   131072,        131072,          131072
##UNITS=     HZ,            ARBITRARY UNITS, ARBITRARY UNITS
##FACTOR=    0.0627417313425164, 1,          1
##FIRST=     8223.62146879497, -38,          -61614
##LAST=      0,             1709,            -62460
##MIN=       0,             -13762,          0
##MAX=       8223.62146879497, 321010336,    0
$$ Real data points
##PAGE= N=1
##DATA TABLE= (X++(R..R)), XYDATA
$$ [...]
63852A374703Q776N711J900k353o682j1056j5387j9422k3164k6890l0611l3878
$$ 1374703 1383479 1389190 1391090 1388737 1382055 1370999 1355612 1336190 1313026 1286136 1255525 1221647
63840A221647l6355l8190l9687m0853m1453m1320m0485l9232l8097l7484l7120
$$ 1221647 1185292 1147102 1107415 1066562 1025109 983789 943304 904072 865975 828491 791371
63829G91371l6254l4548l2459l0483k8380k5633k2460j9823j8368j7758j7146
$$ 791371 755117 720569 688110 657627 629247 603614 581154 561331 542963 525205 508059
63818E08059j6020j4449j2800j1372j0214r140p946o642n473m741m617n034n666
$$ 508059 492039 477590 464790 453418 443204 434064 426118 419476 414003 409262 404645 399611 393945
63805C93945o114o189n947n400m530l624l311l802m460m555m286m382m888n023
$$ 393945 387831 381642 375695 370295 365765 362141 358830 355028 350568 346013 341727 337345 332457 327434
63791C27434m308l124k030j187p33r64j664j979j580j308j965k976l117k214j122
$$ 327434 323126 320002 317972 316785 316052 315088 313424 311445 309865 308557 306592 303616 300499 298285 297163
63776B97163l36L49P79K75j100k115j784o00K53L25L0k22l39k37J57O63R80J026
$$ 297163 296827 297176 297955 298230 297130 295015 293231 292631 292884 293209 293239 293017 292678 292441 292598 293261 294241 295267
63758B95267Q70N25O1k57k34L1L86P83J037P89J18k02L98J427J947J815J708K059
$$ 295267 296137 296662 296723 296466 296232 296263 296649 297432 298469 299258 299376 299174 299572 300999 302946 304761 306469 308528
63740C08528K613L038L204K836J701M01K01J478K934L096K227J919K873L982L890
$$ 308528 311141 314179 317383 320219 321920 322321 322522 324000 326934 330030 332257 334176 337049 341031 344921
63725C44921K770J959K190K925L334L346L351L401L232K810K336J789J007K90
$$ 344921 347691 349650 351840 354765 358099 361445 364796 368197 371429 374239 376575 378364 379371 379661
63711C79661K42P59Q42j35j437j912j475r54o99k69M46P74L09l12k43M34J007
$$ 379661 379903 380662 381504 381369 379932 378020 376545 375591 374892 374623 375069 375843 376152 375840 375597 376031 377038
63694C77038J231J515K061K457K294J814J622J885K060J560N36k47l53j78k34
$$ 377038 378269 379784 381845 384302 386596 388410 390032 391917 393977 395537 396073 395826 395473 395295 395061
63679C95061l13J61J069J576J270O47K65j6n12r60r05m74j86j49n0J10j20r13
$$ 395061 394748 394909 395978 397554 398824 399471 399736 399720 399208 398248 397343 396869 396683 396534 396484 396594 396474 395561
63661C95561j762k001j484o79k92p34j755k577k669k293k068k117k028j552q31
$$ 395561 393799 391798 390314 389635 389343 388609 386854 384277 381608 379315 377247 375130 373102 371550 370719
63646C70719l9P33J165R01K86K88J301K561L169L325L877M999O019O488O656O761
$$ 370719 370680 371413 372578 373479 373765 374053 375354 377915 381084 384409 388286 393285 399304 405792 412448 419209
63630D19209O560N942N512N983P229Q410R020R371J0043J1243J2758J4272J5543
$$ 419209 425769 431711 437223 443206 450435 458845 467865 477236 487279 498522 511280 525552 541095
63617E41095J6498J7329J8356J9640K0850K1658K2082K2325K2403K2167K1606
$$ 541095 557593 574922 593278 612918 633768 655426 677508 699833 722236 744403 766009
63606G66009K0871J9989J8740J6897J4448J1581Q601N735K923j30l456o477q506
$$ 766009 786880 806869 825609 842506 856954 868535 877136 882871 885794 885664 882208 875731 867225
63593H67225r556j0267j1074j1874j2654j3770j5311j6614j7015j6723j6529j6711
$$ 867225 857669 847402 836328 824454 811800 798030 782719 766105 749090 732367 715838 699127
63581F99127j6824j6430j5546j4379j3094j1905j0949r915q239n821l302j368
$$ 699127 682303 665873 650327 635948 622854 610949 600000 590085 581846 576025 572723 571355
63569E71355o0J103K503M071N386O082O256O502P321Q621J0013J1449J3146J4959
$$ 571355 571295 572398 574901 578972 584358 590440 596696 603198 610519 619140 629153 640602 653748 668707
63555F68707J6447J7665J9211K1268K3133K4139K4425K4416K4086K3416K3054
$$ 668707 685154 702819 722030 743298 766431 790570 814995 839411 863497 886913 909967
63544I09967K3543K4102K3068J9694J4731R194L405k392p333j0546j2107j2812
$$ 909967 933510 957612 980680 1000374 1015105 1024299 1027704 1025312 1017979 1007433 995326 982514
63532I82514j3257j3616j4063j4771j5609j6314j7038j8248k0012k1875k3499
$$ 982514 969257 955641 941578 926807 911198 894884 877846 859598 839586 817711 794212
63521G94212k4998k6345k6909k6077k4175k2319k1239k0627j9697j8112j6171
$$ 794212 769214 742869 715960 689883 665708 643389 622150 601523 581826 563714 547543
63510E47543j4330j2796j1533j0389r232q090p239o950p122p241o834n885m716
$$ 547543 533213 520417 508884 498495 489263 481173 473934 466984 459862 452621 445787 439902 435186
63497D35186l588k588j769j209q66n83k95j30j61k18o3L09P16J080J534K130K669
$$ 435186 431598 429010 427241 426032 425166 424583 424288 424158 423997 423779 423716 424025 424741 425821 427355 429485 432154
63480D32154K860K620K185J898J943K167K188J756J070N74L22k02j324k502k780
$$ 432154 435014 437634 439819 441717 443660 445827 448015 449771 450841 451415 451737 451535 450211 447709 444929
63465D44929k016j155j122j755k192j947j281o25j80M5J98O37J585K713L435L777
$$ 444929 442913 441758 440636 438881 436689 434742 433461 432836 432656 432701 432899 433536 435121 437834 441269 445046
63449D45046M452N924P794R369J0452J1270J2019J2883J4136J5727J6982J7376
$$ 445046 449498 455422 463216 472585 483037 494307 506326 519209 533345 549072 566054 583430
63437E83430J7431J8180J9794K1352K2137K2421K2739K2974K2598K1341J9221
$$ 583430 600861 619041 638835 660187 682324 704745 727484 750458 773056 794397 813618
63426H13618J6403J3564J1973J2341J3796J4666J4473J4380J5528J7565J9237
$$ 813618 830021 843585 855558 867899 881695 896361 910834 925214 940742 958307 977544
63415I77544J9892J9808J9336J8383J6673J4083J0593O263J466l141p007r979
$$ 977544 997436 1017244 1036580 1054963 1071636 1085719 1096312 1102575 1104041 1100900 1093893 1083914
63403A083914j2205j3865j5058j5779j6068j6244j6942j8611k0971k3237k4919
$$ 1083914 1071709 1057844 1042786 1027007 1010939 994695 977753 959142 938171 914934 890015
63392H90015k6102k6909k7156k6684k5685k4321k2428k0003j7641j5916j4553
$$ 890015 863913 837004 809848 783164 757479 733158 710730 690727 673086 657170 642617
63381F42617j2773j0418q047n966l878j666K11J532K866M829P233R529J1631J3723
$$ 642617 629844 619426 611379 605413 601535 599869 600080 601612 604478 609307 616540 626069 637700 651423
63367F51423J5586J6884J7914J9277K0885K2027K2552K3193K4430K5727K6276
$$ 651423 667009 683893 701807 721084 741969 763996 786548 809741 834171 859898 886174
63356H86174K6003K5368K4579K3483K1987K0083J7594J4348J0477O318K074k122
$$ 886174 912177 937545 962124 985607 1007594 1027677 1045271 1059619 1070096 1076414 1078488 1076366
63344A076366n908q835j0786j2086j3175j4342j5657j6945j7994j8935k0220k1951
$$ 1076366 1070458 1061623 1050837 1038751 1025576 1011234 995577 978632 960638 941703 921483 899532
63332H99532k3465k4033k3736k3183k2449k0998j8742j6499j5073j4370j3834
$$ 899532 876067 852034 828298 805115 782666 761668 742926 726427 711354 696984 683150
63321F83150j3274j2737j1930j0520q938q224q857j0320j1889j3281j4245j4199
$$ 683150 669876 657139 645209 634689 625751 617527 608670 598350 586461 573180 558935 544736
63309E44736j2946j1393j0691j0727j0250q690p060o563o969p046o262n271m727
$$ 544736 531790 520397 509706 498979 488729 480039 472979 466416 459447 452401 446139 440868 436141
63296D36141m494m127l560k985k494k172k175k401k418k012j502j256j189j091
$$ 436141 431647 427520 423960 420975 418481 416309 414134 411733 409315 407303 405801 404545 403356 402265
63282D02265j025j020p49k5O31N87O4j24J96L40j26p31q02k63N92J590K559L122
$$ 402265 401240 400220 399471 399446 400077 400664 400728 400604 400800 401140 401014 400283 399481 399218 399810 401400 403959 407081
63264D07081L055K620K244K076K110K431L001L483L617L609L765L984M035M144
$$ 407081 410136 412756 415000 417076 419186 421617 424618 428101 431718 435327 439092 443076 447111 451255
63250D51255M765N776O498O631O715P423Q675R832J0550J1065J1682J2300J2741
$$ 451255 456020 461796 468294 474925 481640 489063 497738 507570 518120 529185 540867 553167 565908
63237E65908J3363J4896J7465K0102K1637K1981K2037K2413K2851K3115K3654
$$ 565908 579271 594167 611632 631734 653371 675352 697389 719802 742653 765768 789422
63226G89422K4849K6112K6468K5826K4946K4293K3541K2340K0899J9654J8776
$$ 789422 814271 840383 866851 892677 917623 941916 965457 987797 1008696 1028350 1047126
63215A047126J8196J7678J6801J5267J3330J1516R810P590M513R90k467n925r730
$$ 1047126 1065322 1083000 1099801 1115068 1128398 1139914 1149724 1157314 1161827 1162817 1160350 1154425 1144695
63202A144695j3848j7823k1154k3512k4855k5470k5646k5204k3746k1500j9265
$$ 1144695 1130847 1113024 1091870 1068358 1043503 1018033 992387 967183 943437 921937 902672
63191I02672j7325j5048j2027q928o537m471j725J777N101P659R759J1774J3529
$$ 902672 885347 870299 858272 849344 842807 838336 836611 838388 843489 851148 860907 872681 886210
63178H86210J4735J5382J5495J5101J4615J4642J5161J5428J4901J3715J2105
$$ 886210 900945 916327 931822 946923 961538 976180 991341 1006769 1021670 1035385 1047490
63167A047490J0074P947O469N707M525J908j663m976p794j0814j4142j6943j8871
$$ 1047490 1057564 1065511 1071980 1077687 1082212 1084120 1082457 1077481 1069687 1058873 1044731 1027788 1008917
63154A008917k0739k3184k5443k6296k5780k5131k5125k5211k4452k2699k0529
$$ 1008917 988178 964994 939551 913255 887475 862344 837219 812008 787556 764857 744328
63143G44328j8385j6234j4011j1990j0565r761r095q023o506n096m320l989l315
$$ 744328 725943 709709 695698 683708 673143 663382 654287 646264 639758 634662 630342 626353 623038
63130F23038j838k0J313J978K480L136L592L507L253L496M228M812M908M848M970
$$ 623038 621200 621180 622493 624471 626951 630087 633679 637186 640439 643935 648163 652975 657883 662731 667701
63115F67701N076M868M502M236L870L013J889J243J342J505R49j73j006j077p41
$$ 667701 672777 677645 682147 686383 690253 693266 695155 696398 697740 699245 700194 700021 699015 697938 697197
63100F97197n53o18p70r92j268j300q44k21J9o0K10J023J650J410O55K13L31O95
$$ 697197 696644 696026 695256 694264 692996 691696 690852 690631 690650 690590 690800 691823 693473 694883 695538 695751 696082 696777
63082F96777J274K308L562M380M652N016N849O695P051P179P655Q541R448J0179
$$ 696777 698051 700359 703921 708301 712953 717969 723818 730513 737564 744743 752398 760939 770387 780566
63068G80566J0916J1917J3289J4961J6698J8391K0321K2785K5389K7372K8788
$$ 780566 791482 803399 816688 831649 848347 866738 887059 909844 935233 962605 991393
63057I91393L0676L3578L6651L8889M0602M2796M5568M8149N0246N2343N4667
$$ 991393 1022069 1055647 1092298 1131187 1171789 1214585 1260153 1308302 1358548 1410891 1465558
63046A465558N6820N8560O0057O1190O1403O0565N9271N7976N6386N4057N1093
$$ 1465558 1522378 1580938 1640995 1702185 1763588 1824153 1883424 1941400 1997786 2051843 2102936
63035B102936M7998M5211M2890M0694L7734L3411K8336K3658J9312J3893O621
$$ 2102936 2150934 2196145 2239035 2279729 2317463 2350874 2379210 2402868 2422180 2436073 2442694
63024B442694j507r154j6368k3992l1991l9363m5409n0215n3981n6673n8263n8719
$$ 2442694 2441187 2432033 2415665 2391673 2359682 2320319 2274910 2224695 2170714 2114041 2055778 1997059
63012A997059n7807n5456n2212m8695m4759l9762l3661k7223k1133j5418r873
$$ 1997059 1939252 1883796 1831584 1782889 1738130 1698368 1664707 1637484 1616351 1600933 1591060
63001A591060m433R58O375J1565J5946J9108K1176K2621K3901K5256K6532K7216
$$ 1591060 1586627 1587585 1593960 1605525 1621471 1640579 1661755 1684376 1708277 1733533 1760065 1787281
62989A787281K6936K5886K4554K3138K1509J9535J7098J3912R825N233P13l677
$$ 1787281 1814217 1840103 1864657 1887795 1909304 1928839 1945937 1959849 1969674 1974907 1975620 1971943
62977A971943q341j3399j8534k3586k8750l4058l9062m3217m6290m8340m9614
$$ 1971943 1963602 1950203 1931669 1908083 1879333 1845275 1806213 1762996 1716706 1668366 1618752
62966A618752n0461n0988n0845m9715m7978m6375m5074m3535m1385l8867l6387
$$ 1618752 1568291 1517303 1466458 1416743 1368765 1322390 1277316 1233781 1192396 1153529 1117142
62955A117142l4113l2168l0655k9338k7778k5944k4235k2781k1302j9749j8483
$$ 1117142 1083029 1050861 1020206 990868 963090 937146 912911 890130 868828 849079 830596
62944H30596j7585j6583j5157j3565j2123j0849r822r281r035q432p294o230n567
$$ 830596 813011 796428 781271 767706 755583 744734 734912 725631 716596 708164 700870 694640 689073
62931F89073m790l579k653k733l319l347k613j701r25k92j62q77j913k389k303
$$ 689073 684283 680704 678051 675318 671999 668652 666039 664338 663413 663121 662959 662082 660169 657780 655477
62916F55477k363k654k548k028j968k717l417l298k874l131m031m525l834k252
$$ 655477 653114 650460 647912 645884 643916 641199 637782 634484 631610 628479 624448 619923 616089 613837
62902F13837p51q7j80k59K18Q01N25q46k439l240l011k147j135l54J4K16O99J391
$$ 613837 613086 612999 612819 612560 612778 613579 614104 613258 610819 607579 604568 602421 601286 600932 600946 601162 601861 603252
62884F03252J572Q18l04p93l15N27Q62K78r05j856j932j317q18r29j364j557j297
$$ 603252 604824 605642 605338 604545 604230 604757 605619 605897 604992 603136 601204 599887 599069 598140 596776 595219 593922
62867E93922o96L4N21L35m83j218j242o72n2M16Q56J143Q94J19n02k61P87J796
$$ 593922 593226 593260 593781 594116 593633 592415 591173 590501 590449 590865 591721 592864 593758 593877 593375 593114 593901 595697
62849E95697J949J254M54J48K10K10Q0l6l47j150k024k050j126l50o15j390j492
$$ 595697 597646 598900 599354 599502 599712 599922 600002 599966 599619 598469 596445 594395 593269 592919 592304 590914 589422
62832E89422o63K71O35O28Q30J399J917J866J319J083J846L115L634L066K571
$$ 589422 588759 589030 589665 590293 591123 592522 594439 596305 597624 598707 600553 603668 607302 610368 612939
62817F12939L189M319M649M037L490L567L890M168M609N138N217M872M966N977
$$ 612939 616128 620447 625096 629133 632623 636190 640080 644248 648857 653995 659212 664084 669050 675027
62803F75027P204P797P904Q207Q825R417J0016J1007J2406J3878J5467J7676K0684
$$ 675027 682231 690028 697932 706139 714964 724381 734397 745404 757810 771688 787155 804831 825515
62790H25515K3949K6870K9498L2343L5590L8859M1747M4474M7713N1814N6333
$$ 825515 849464 876334 905832 938175 973765 1012624 1054371 1098845 1146558 1198372 1254705
62779A254705O0571O4340O7913P1264P3807P5050P5152P4548P3321P1236O8128
$$ 1254705 1315276 1379616 1447529 1518793 1592600 1667650 1742802 1817350 1890671 1961907 2030035
62768B030035O3880N8193N0792M1865L1987K1536J0414j527j3995k6250l7530
$$ 2030035 2093915 2152108 2202900 2244765 2276752 2298288 2308702 2307175 2293180 2266930 2229400
62757B229400m7358n5646o2571o8370p3132p6726p8919p9627p9081p7725p5846
$$ 2229400 2182042 2126396 2063825 1995455 1922323 1845597 1766678 1687051 1607970 1530245 1454399
62746A454399p3310o9815o5434o0749n6337n2253m8135m3741l9230l4961l1227
$$ 1454399 1381089 1311274 1245840 1185091 1128754 1076501 1028366 984625 945395 910434 879207
62735H79207k8171k5819k3940k1982j9359j6074j2919j0807r788q999p708o142
$$ 879207 851036 825217 801277 779295 759936 743862 730943 720136 710348 701349 693641 687499
62723F87499m957m121k888q62J378L028M016M913O112P496Q881J0354J2118J4222
$$ 687499 682542 678421 675533 674671 676049 679077 683093 688006 694118 701614 710495 720849 732967 747189
62709G47189J6616J9302K2227K5102K7564K9639L1884L4790L8143M1179M3497
$$ 747189 763805 783107 805334 830436 858000 887639 919523 954313 992456 1033635 1077132
62698A077132M5473M7644M9947N1912N3379N4526N5275N5186N4015N1943M9114
$$ 1077132 1122605 1170249 1220196 1272108 1325487 1380013 1435288 1490474 1544489 1596432 1645546
62687A645546M5316M0348L4383K7664K0131J1672K520o841j6041k4790l2710l9567
$$ 1645546 1690862 1731210 1765593 1793257 1813388 1825060 1827580 1820739 1804698 1779908 1747198 1707631
62675A707631m5563n1107n6135n9957o1863o1832o0561n8889n7180n5206n2606
$$ 1707631 1662068 1610961 1554826 1494869 1433006 1371174 1310613 1251724 1194544 1139338 1086732
62664A086732m9365m5776m2092l8400l4811l1517k8605k6096k4118k2730k1484
$$ 1086732 1037367 991591 949499 911099 876288 844771 816166 790070 765952 743222 721738
62653G21738j9632j7009j4341j2472j1537j1171j1062j0920j0253q769o898n429
$$ 721738 702106 685097 670756 658284 646747 635576 624514 613594 603341 594572 587674 582245
62641E82245m678m336m013l537k857k111j725j974k436k367j648r49q51j243j693
$$ 582245 577567 573231 569218 565681 562824 560713 558988 557014 554578 552211 550563 549614 548763 547520 545827
62626E45827j968j963j544p62P7P59J420K141K645K621K279K232K807L703M350
$$ 545827 543859 541896 540352 539590 539667 540426 541846 543987 546632 549253 551532 553764 556571 560274 564624
62611E64624M557M719N375O591P939R129J0357J1848J3344J4548J5802J7714K0138
$$ 564624 569181 573900 579275 585866 593805 602934 613291 625139 638483 653031 668833 686547 706685
62598G06685K2215K3625K5051K7075K9231L0790L1940L3446L5359L6776L6956
$$ 706685 728900 752525 777576 804651 833882 864672 896612 930058 965417 1002193 1039149
62587A039149L6048L4617L2903L0713K7679K3504J8276J2653P379K477k783q909
$$ 1039149 1075197 1109814 1142717 1173430 1201109 1224613 1242889 1255542 1262921 1265398 1262615 1253706
62575A253706j5441k1376k6039k9416l1837l3666l5108l6065l6204l5433l4212
$$ 1253706 1238265 1216889 1190850 1161434 1129597 1095931 1060823 1024758 988554 953121 918909
62564I18909l3093l2040l0544k8412k6078k4022k2207k0358j8521j6953j5634
$$ 918909 885816 853776 823232 794820 768742 744720 722513 702155 683634 666681 651047
62553F51047j4274j2810j1538j0556r458p812n798m093l161k833k593k122j488
$$ 651047 636773 623963 612425 601869 592411 584599 578801 574708 571547 568714 566121 563999 562511
62540E62511r49o26m42l26l99p53j101q92R2J443K567L330M051N087O518Q169
$$ 562511 561562 560936 560494 560168 559769 559016 557915 557023 557115 558558 561125 564455 568506 573593 580111 588280
62524E88280R727J0971J2016J3261J4941J6965J9247K1842K4457K6325K7151K7892
$$ 588280 598007 608978 620994 634255 649196 666161 685408 707250 731707 758032 785183 813075
62512H13075K9795L2697L5084L5953L5861L5851L6128L6252L5978L5235L3729
$$ 813075 842870 875567 910651 946604 982465 1018316 1054444 1090696 1126674 1161909 1195638
62501A195638L1337K8578K6033K3479K0266J6522J3229J1010R484Q011O568N604
$$ 1195638 1226975 1255553 1281586 1305065 1325331 1341853 1355082 1366092 1375576 1383587 1390155 1395759
62489A395759N453O179P628R295J0370J0316R362Q132O917N420L173n9m246r235
$$ 1395759 1401212 1407391 1415019 1424314 1434684 1445000 1454362 1462494 1469411 1474831 1478004 1477945 1473699 1464464
62475A464464j4729k0253k5295k9590l3300l6822m0358m3711m6473m8318m9023
$$ 1464464 1449735 1429482 1404187 1374597 1341297 1304475 1264117 1220406 1173933 1125615 1076592
62464A076592m8436m6638m4095m1413l8856l6229l3203k9718k6012k2469j9389
$$ 1076592 1028156 981518 937423 896010 857154 820925 787722 758004 731992 709523 690134
62453F90134j6796j4434j2003r451o966m748k829j077O58K364L704M264M067L712
$$ 690134 673338 658904 646901 637450 630484 625736 622907 621830 622488 624852 628556 632820 636887 640599
62439F40599L729L959L893L446K979K572J799M39j072k255l283m627o218p464
$$ 640599 644328 648287 652180 655626 658605 661177 662976 663415 662343 660088 656805 652178 645960 638496
62425F38496q115q615r402j0226j0421r726q557p473o675o124n838n819n819n485
$$ 638496 630381 621766 612364 602138 591717 581991 573434 565961 559286 553162 547324 541505 535686 530201
62411E30201m841m311m111l884l211k255j589j457j553j451r19J07J442K479K582
$$ 530201 525360 521049 516938 513054 509843 507588 505999 504542 502989 501538 500619 500726 502168 504647 507229
62396E07229J890J379J824L031M200M843M968M793M645M880N526O086O146N986
$$ 507229 509119 510498 512322 515353 519553 524396 529364 534157 538802 543682 549208 555294 561440 567426
62382E67426O196O764P152P209P470Q264R130R508R605J0060J0969J1773J2183
$$ 567426 573622 580386 587538 594747 602217 610481 619611 629119 638724 648784 659753 671526 683709
62369F83709J2718J4090J6295J8638K0574K2319K4493K7317L0350L2943L4836
$$ 683709 696427 710517 726812 745450 766024 788343 812836 840153 870503 903446 938282
62358I38282L6206L7335L8390L9425M0326M0755M0310L8816L6368L3078K9028
$$ 938282 974488 1011823 1050213 1089638 1129964 1170719 1211029 1249845 1286213 1319291 1348319
62347A348319K4427J9532J4339Q614K485l269p894j1512j4932j8584k1996k4483
$$ 1348319 1372746 1392278 1406617 1415231 1417716 1414447 1406553 1395041 1380109 1361525 1339529 1315046
62335A315046k6034k7218k8362k9201k9372k8965k8384k7854k7264k6522k5789
$$ 1315046 1289012 1261794 1233432 1204231 1174859 1145894 1117510 1089656 1062392 1035870 1010081
62324A010081k5259k4869k4371k3708k3069k2576k2079k1399k0630j9989j9413
$$ 1010081 984822 959953 935582 911874 888805 866229 844150 822751 802121 782132 762719
62313G62719j8520j7091j5432j4053j3034j1885j0195q259o821o199n894n210
$$ 762719 744199 727108 711676 697623 684589 672704 662509 654250 647429 641230 635336 630126
62301F30126m076k990k291j784j177n33m6L75J012J853K498K591K166J550J063
$$ 630126 626050 623060 620769 618985 617808 617275 617229 617604 618616 620469 622967 625558 627724 629274 630337
62286F30337R26J246J928K615K929K847K740K950L312L331K942K840L748N426
$$ 630337 631263 632509 634437 637052 639981 642828 645568 648518 651830 655161 658103 660943 664691 670117
62272F70117O869P580Q253R824J2247J4662J6603J8432K0578K3017K5681K8849
$$ 670117 676986 684566 692819 702643 714890 729552 746155 764587 785165 808182 833863 862712
62260H62712L2649L6544L9752M2065M3771M4929M5177M4438M3356M2628M2040
$$ 862712 895361 931905 971657 1013722 1057493 1102422 1147599 1192037 1235393 1278021 1320061
62249A320061M0460L6913L1517K5263J8977J2755O380k5o053j1495j6408k0766
$$ 1320061 1360521 1397434 1428951 1454214 1473191 1485946 1492326 1492301 1486248 1474753 1458345 1437579
62237A437579k4374k7257k9721l1962l3814l4998l5335l4633l2802l0272k7917
$$ 1437579 1413205 1385948 1356227 1324265 1290451 1255453 1220118 1185485 1152683 1122411 1094494
62226A094494k6255k5055k3929k2908k2064k0989j9217j6967j5027j4034j4145
$$ 1094494 1068239 1043184 1019255 996347 974283 953294 934077 917110 902083 888049 873904
62215H73904j5057j5963j5908j4840j3895j3936j4233j3478j1813j0563j0042
$$ 873904 858847 842884 826976 812136 798241 784305 770072 756594 744781 734218 724176
62204G24176q991o705m349l353l459l314k295q09P66K345L668M420M830N409O160
$$ 724176 715185 708480 704131 700778 697319 694005 691710 690901 691667 694012 697680 702100 706930 712339 718499
62189G18499O673O912P257P785Q119Q063P942Q177Q848R629R964R503Q769Q924
$$ 718499 725172 732084 739341 747126 755245 763308 771250 779427 788275 797904 807868 817371 826140 835064
62175H35064J0425J2231J3075J3201J3935J5775J7835J9320K0517K2050K3919
$$ 835064 845489 857720 870795 883996 897931 913706 931541 950861 971378 993428 1017347
62164A017347K5702K7094K7839K7681K6760K5568K4181K2032J8713J4516R882
$$ 1017347 1043049 1070143 1097982 1125663 1152423 1177991 1202172 1224204 1242917 1257433 1267315
62153A267315M883l44n184r066j2091j4746j7276j9670k1892k3755k4881k5156
$$ 1267315 1272198 1271854 1266670 1257604 1245513 1230767 1213491 1193821 1171929 1148174 1123293 1098137
62141A098137k4922k4467k3666k2403k0903j9242j7031j4105j1091q804p364o413
$$ 1098137 1073215 1048748 1025082 1002679 981776 962534 945503 931398 920307 911503 904139 897726
62129H97726n783n443n094m439l599k742j650k24R44J335J557K754M984P009P829
$$ 897726 891943 886500 881406 876967 873368 870626 868976 868752 869696 871031 872588 875342 880326 887335 895164
62114H95164P663P301P126O988O575N683M516L681L473L240K110K22j404k225
$$ 895164 902827 910128 917254 924242 930817 936500 941016 944697 948170 951410 953520 953742 952338 950113
62100I50113k595k785k478j526m06M61J100J386Q68k17n48Q54L293N172N809N844
$$ 950113 947518 944733 942255 940729 940323 940784 941884 943270 944138 943921 943373 944227 947520 952692 958501 964345
62084I64345O182P128Q456R742J0760J1795J3311J5064J6044J5809J5312J5806
$$ 964345 970527 977655 986111 995853 1006613 1018408 1031719 1046783 1062827 1078636 1093948 1109754
62072A109754J7299J8854J9934K0694K1131K0975K0363J9746J9042J7719J5839
$$ 1109754 1127053 1145907 1165841 1186535 1207666 1228641 1249004 1268750 1287792 1305511 1321350
62061A321350J4211J3235J2293J0628Q200N297J918k028o254j0268j3689j6250
$$ 1321350 1335561 1348796 1361089 1371717 1379917 1385214 1387132 1385104 1378850 1368582 1354893 1338643
62049A338643j7908j9257k1289k4325k7492k9724l0975l2048l3439l4819l5531
$$ 1338643 1320735 1301478 1280189 1255864 1228372 1198648 1167673 1135625 1102186 1067367 1031836
62038A031836l5241l4134l2767l1644l0776k9678k7970k5795k3548k1471j9623
$$ 1031836 996595 962461 929694 898050 867274 837596 809626 783831 760283 738812 719189
62027G19189j8006j6481j4849j3228j2035j1350j0674r635q558p966p782p519
$$ 719189 701183 684702 669853 656625 644590 633240 622566 612931 604373 596407 588625 581106
62015E81106o959o176n148l855k630j827j244l97P50J809K689L661M727N500N830
$$ 581106 574147 567971 562823 558968 556338 554511 553267 552870 553620 555429 558118 561779 566506 572006 577836
62000E77836N961N986N739N313N078M981M406L120J776J117J083J122R49N85j4
$$ 577836 583797 589783 595522 600835 605913 610894 615300 618420 620196 621313 622396 623518 624467 625052 625038
61985F25038r12j996l170m518n942o952p181o834o293n637m940m555m581m414
$$ 625038 624126 622130 618960 614442 608500 601548 594367 587533 581240 575603 570663 566108 561527 557113
61971E57113l550k595k647l782m913n234m975m567l869k708j539r52q82p51k02
$$ 557113 553563 550968 548321 544539 539626 534392 529417 524850 520981 518273 516734 515782 514900 514149 513947
61956E13947P25J882L049L843L997L790L871M659O050P612Q890R626R942J0278
$$ 513947 514672 516554 519603 523446 527443 531233 535104 539763 545813 553425 562315 571941 581883 592161
61942E92161J0930J1738J2314J2566J2763J3138J3609J3956J4069J3978J3659
$$ 592161 603091 614829 627143 639709 652472 665610 679219 693175 707244 721222 734881
61931G34881J2872J1300Q991O623N035M322L646K241M23p60r11q03j349k440l202
$$ 734881 747753 759053 768044 774667 779702 784024 787670 789911 790334 789574 788663 787860 786511 784071 780869
61916G80869l172k681k054j022O53K445L552M063M836O120O989O663N694N152
$$ 780869 777697 775016 772962 771940 772593 775038 778590 782653 787489 793609 800598 807261 812955 818107
61902H18107N022M316K625O03j199k960m775o104o709p337q684j0187j0749j0309
$$ 818107 823129 827445 830070 830673 829474 826514 821739 815635 808926 801589 792905 782718 771969 761660
61888G61660r776r588r297q660q147q113q195p956p543p296p163o885o368n591
$$ 761660 751884 742296 732999 724339 716192 708079 699884 691928 684385 677089 669926 663041 656673 651082
61874F51082m532l475k935k894k589j506j32Q82J853L569N915P856Q862R481J0344
$$ 651082 646550 643075 640140 637246 634657 633151 633019 633901 635754 639323 645238 653094 661956 671437 681781
61859F81781J1403J2500J3914J5739J7302J7931J8027J8661K0140K1627K2219
$$ 681781 693184 705684 719598 735337 752639 770570 788597 807258 827398 849025 871244
61848H71244K1875K1164K0506J9899J9094J7831J6065J4076J2128J0027P304L927
$$ 871244 893119 914283 934789 954688 973782 991613 1007678 1021754 1033882 1043909 1051213 1055140
61836A055140N24k184l949m858n041m752m392m119l720l102k643k687k912k730
$$ 1055140 1055664 1053480 1049531 1044673 1039632 1034880 1030488 1026369 1022649 1019547 1016904 1014217 1011305 1008575
61822A008575k127j680j825k550l758n405p323r318j1546j4213j6973j9041k0093
$$ 1008575 1006448 1004768 1002943 1000393 996635 991230 983907 974589 963043 948830 931857 912816 892723
61809H92723k0504k0643k0415j9742j8870j7945j6758j5275j3952j3133j2584
$$ 892723 872219 851576 831161 811419 792549 774604 757846 742571 728619 715486 702902
61798G02902j1908j0967r617p670n585m480m707n091m456l370l208l908l972k781
$$ 702902 690994 680027 670410 662740 657155 652675 647968 642877 638421 635051 631843 627935 623963 621182
61784F21182j477j204j625j787j517j234j133j182j469j820j687r36l23m47p67
$$ 621182 619705 618501 616876 615089 613572 612338 611205 610023 608554 606734 605047 604111 603788 603341 602574
61769F02574m18L65N34k09r85r22j24P25J091Q33J82l26k23M39J157J519J433
$$ 602574 602156 602521 603055 602846 601861 600939 600815 601540 602631 603464 603646 603320 603097 603536 604693 606212 607645
61752F07645R76L36k38p25j416k335k866k549j980k161k982l238k327j099o20
$$ 607645 608621 608957 608719 607994 606578 604243 601377 598828 596848 594687 591705 588467 586140 585041 584421
61737E84421q26r88q80q14q76q10n21j11M63J257J966K164J928J763J932K211
$$ 584421 583595 582607 581727 580913 580037 579227 578706 578595 579058 580315 582281 584445 586373 588136 590068 592279
61721E92279K338K292K067J628J178J104J473J859J835J359N87m14j514k376k777
$$ 592279 594617 596909 598976 600604 601782 602886 604359 606218 608053 609412 609999 609585 608071 605695 602918
61706F02918k912l124l381l319k765k065j796k285l395m633n464n672n437n028
$$ 602918 600006 596882 593501 590182 587417 585352 583556 581271 577876 573243 567779 562107 556670 551642
61692E51642m518l895l356l215l521l936m101l957l617l160k688k360k149j756
$$ 551642 547124 543229 539873 536658 533137 529201 525100 521143 517526 514366 511678 509318 507169 505413
61678E05413j066n35p16j480k136k321k329k391k204j568j018j155j681j736j144
$$ 505413 504347 503812 503096 501616 499480 497159 494830 492439 490235 488667 487649 486494 484813 483077 481933
61663D81933o21o96j046j135r23n69oP55J259J160Q54J041J726K185J919J205
$$ 481933 481312 480616 479570 478435 477512 476943 476937 477692 478951 480111 480965 482006 483732 485917 487836 489041
61647D89041O51N69Q71J298J636J837J952J860J262J77q08j163j104j221j620
$$ 489041 489692 490261 491132 492430 494066 495903 497855 499715 500977 501154 500346 499183 498079 496858 495238
61632D95238j956k203k688l299l408k821k189k125k478k798k978k961k427j348
$$ 495238 493282 491079 488391 485092 481684 478863 476674 474549 472071 469273 466295 463334 460907 459559
61618D59559m41m39j189j952k412k757l017k960k552k032j556j250j354j933k568
$$ 459559 459118 458679 457490 455538 453126 450369 447352 444392 441840 439808 438252 437002 435648 433715 431147
61603D31147k935l315l962m316l740k787k679l515m113l825l374l393l302k434
$$ 431147 428212 424897 420935 416619 412879 410092 407413 403898 399785 395960 392586 389193 385891 383457
61589C83457j330j036j583k085j969j355n75k7k02j141k077k222j710j187p68
$$ 383457 382127 381091 379508 377423 375454 374099 373524 373497 373295 372154 370077 367855 366145 364958 364190
61574C64190j56M96O53K45l01p79j246j406p82L73J143J016L80j57k91J29J074
$$ 364190 364034 364530 365183 365428 365127 364348 363102 361696 360914 361287 362430 363446 363826 363669 363378 363507 364581
61557C64581J969K133J737J599J850J716Q69J63L61J030J337J333J619K207K567
$$ 364581 366550 368683 370420 372019 373869 375585 376454 376617 376978 378008 379345 380678 382297 384504 387071
61542C87071K512K306K049J642J220J049J058R85Q49P78O17K11m3L60J146J410
$$ 387071 389583 391889 393938 395580 396800 397849 398907 399892 400741 401519 402136 402347 402304 402664 403810 405220
61526D05220P18n27j752k657k994k541j579p97n35m78k81k4R5L2k96j006j752
$$ 405220 405938 405411 403659 401002 398008 395467 393888 393091 392556 392078 391797 391773 391868 391900 391604 390598 388846
61509C88846j791r31J2J52m39j055j352j420j191m71L76N17l06j267j332m01P70
$$ 388846 387055 386124 386136 386288 385849 384794 383442 382022 380831 380360 380736 381253 380947 379680 378348 377947 378717
61492C78717J532J855J969J936J778J702J839J862J274J57o40m03O47J648K071
$$ 378717 380249 382104 384073 386009 387787 389489 391328 393190 394464 394621 393981 393578 394225 395873 397944
61477C97944K025J738J209N27N3K1J72J18p4NN01J057J204Q79M23J84J22q2m96
$$ 397944 399969 401707 402916 403443 403496 403517 403689 403807 403733 403738 404239 405296 406500 407379 407802 407986 408108 408026 407530
61458D07530o53n7J049J824J840J553J571J774J647J144P50P35Q74R31R76J128
$$ 407530 406877 406820 407869 409693 411533 413086 414657 416431 418078 419222 419972 420707 421581 422512 423488 424616
61442D24616J362J646J986K203K033J603J429J766K292K659K991L478L842L624
$$ 424616 425978 427624 429610 431813 433846 435449 436878 438644 440936 443595 446586 450064 453906 457530
61428D57530K867K033J389Q63M51L31N34Q21J002J087J086R53P91P99R22Q51M58
$$ 457530 460397 462430 463819 464682 465133 465464 465998 466819 467821 468908 469994 470947 471738 472537 473459 474310 474768
61411D74768l9m49q11j089j032n80j43j09l38n02p12j339k256k766k434j637j048
$$ 474768 474729 474280 473469 472380 471348 470768 470625 470516 470178 469676 468964 467625 465369 462603 460169 458532 457484
61394D57484p86m08L55J133J326Q21J04l00k98j22N1J70K19L11P74J708K540K433
$$ 457484 456698 456290 456645 457778 459104 459925 460029 459729 459431 459309 459360 459530 459749 460060 460834 462542 465082 467515
61376D67515J404N29P31J698K414K436K186K099K060J865J696J889K409K917L305
$$ 467515 468919 469448 470179 471877 474291 476727 478913 481012 483072 484937 486633 488522 490931 493848 497153
61361D97153L882M873N861O075N422M902N504O872P652P279O717P072Q147Q943
$$ 497153 501035 505908 511769 517844 523266 528168 533672 540544 548196 555475 562192 569264 577411 586354
61347E86354Q980Q448P480O128M877M305M166L642K480J257L66m72j482k315k588
$$ 586354 595334 603782 611262 617390 622267 626572 630738 634380 636860 638117 638483 638011 636529 634214 631626
61332F31626k365j911j398j075j127j241q54q4L51L24O88J932L299L785L571L671
$$ 631626 629261 627350 625952 624877 623750 622509 621655 621571 621922 622246 622934 624866 628165 631950 635521 639192
61316F39192M626O203P985R587J0559J0820J0993J1752J2929J3824J4134J4063
$$ 639192 643818 650021 658006 667593 678152 688972 699965 711717 724646 738470 752604 766667
61304G66667J3700J2959J2002J1051R812P702M738J707o56k302l666n150o846
$$ 766667 780367 793326 805328 816379 826191 833893 838631 840338 839682 837380 833714 828564 821718
61291H21718q461r619j0370j1144j1945j2044j0988r446q429p908p065n661m338
$$ 821718 813257 803638 793268 782124 770179 758135 747147 737701 729272 721364 714299 708638 704300
61278G04300l528k932k192j306k45J151K622L608M074M602N410O000O078O096
$$ 704300 700772 697840 695648 694342 694097 695248 697870 701478 705552 710154 715564 721564 727642 733738
61264G33738O459O804O661O268O221O664P298P802P851P089N643M196L182K175
$$ 733738 740197 747001 753662 759930 766151 772815 780113 787915 795766 802855 808498 812694 815876 818051
61250H18051O89q91j820k170k680l536m061l758k951k219j699j274r41o31qJ114
$$ 818051 818740 817849 816029 813859 811179 807643 803582 799824 796873 794654 792955 791681 790740 790109 790101 791215
61234G91215K353L103L285L391L825M485N093N625O212O817P332P861Q594R336
$$ 791215 793568 796671 799956 803347 807172 811657 816750 822375 828587 835404 842736 850597 859191 868527
61220H68527R567R116Q494Q273Q390Q388Q103P686P190O655O531P397R045J0297
$$ 868527 878094 887210 895704 903977 912367 920755 928858 936544 943734 950389 956920 964317 973362 983659
61206I83659J0148Q791P301O629P126Q713J1029J3432J5323J6592J7555J8422
$$ 983659 993807 1002598 1009899 1016528 1023654 1032367 1043396 1056828 1072151 1088743 1106298 1124720
61194A124720J8932J8703J7762J6582J5535J4448J2824J0424P468M309J195j651
$$ 1124720 1143652 1162355 1180117 1196699 1212234 1226682 1239506 1249930 1257398 1261707 1262902 1261251
61182A261251m011n927p696r481j1161j2750j4512j6425j7921j8623j8966j9598
$$ 1261251 1257240 1251313 1243617 1234136 1222975 1210225 1195713 1179288 1161367 1142744 1123778 1104180
61170A104180k0470k1154k1668k2261k2552k1856k0382j9198j8700j8006j6237
$$ 1104180 1083710 1062556 1040888 1018627 996075 974219 953837 934639 915939 897933 881696
61159H81696j3730j1494r987q921p847o452m601k533q74p6pk05k95j22K15K64
$$ 881696 867966 856472 846485 837564 829717 823265 818664 816131 815257 815181 815174 814969 814674 814552 814767 815031
61143H15031l67j393k035j995j753j686j489p55M34J864L694O071Q700J1217J3598
$$ 815031 814664 813271 811236 809241 807488 805802 804313 803558 803992 805856 809550 815621 824321 835538 849136
61128H49136J5790J7407J8375J9474K1599K4616K7505K9491L0617L1302L1843
$$ 849136 864926 882333 900708 920182 941781 966397 993902 1023393 1054010 1085312 1117155
61117A117155L2344L2691L2607L1939L0840K9490K7798K5637K3162K0696J8371
$$ 1117155 1149499 1182190 1214797 1246736 1277576 1307066 1334864 1360501 1383663 1404359 1422730
61106A422730J6008J3167R354M591k35m099p116j0481j4900j9651k3601k6508
$$ 1422730 1438738 1451905 1461259 1465850 1465615 1461516 1454400 1443919 1429019 1409368 1385767 1359259
61094A359259k8868l0997l2925l4654l5931l6135l5042l3408l2221l1601l0873
$$ 1359259 1330391 1299394 1266469 1231815 1195884 1159749 1124707 1091299 1059078 1027477 996604
61083I96604k9372k6770k3144j9260j6343j4844j3868j2423j0702r470q728p890
$$ 996604 967232 940462 917318 898058 881715 866871 853003 840580 829878 820408 811680 803790
61071H03790o809n633m107k052j93O65J036K139L977N392O044O952Q674J0296
$$ 803790 796981 791348 787241 785189 784996 785661 786697 788836 792813 798205 804249 811201 819875 830171
61057H30171J0932J1163J2179J4161J6337J8122J9527K0704K1696K2579K3557
$$ 830171 841103 852266 864445 878606 894943 913065 932592 953296 974992 997571 1021128
61046A021128K4919K6811K8939L0581L1327L1578L1869L1985L1415L0511L0230
$$ 1021128 1046047 1072858 1101797 1132378 1163705 1195283 1227152 1259137 1290552 1321063 1351293
61035A351293L0736L1180L1059L0907L1319L2110L2860L3558L4260L4750L5055
$$ 1351293 1382029 1413209 1444268 1475175 1506494 1538604 1571464 1605022 1639282 1674032 1709087
61024A709087L5743L7385M0027M3534M7897N2968N8398O4159P0702P8382Q7296
$$ 1709087 1744830 1782215 1822242 1865776 1913673 1966641 2025039 2089198 2159900 2238282 2325578
61013B325578R7886J11136J27872J48380J72856K01696K35236K74007L19473L73657
$$ 2325578 2423464 2534600 2662472 2810852 2983708 3185404 3420640 3694647 4014120 4387777
61003D387777M37484N09929N88885O72239P58128Q45063R31940J016852J096104
$$ 4387777 4825261 5335190 5924075 6596314 7354442 8199505 9131445 10148297 11244401
60994A1244401J166446J228857J287684J344425J394667J433426J459702J468160
$$ 11244401 12410847 13639704 14927388 16271813 17666480 19099906 20559608 22027768
60986B2027768J434311J315877J080455P38442L48482j2219k86518m54490n26167
$$ 22027768 23462079 24777956 25858411 26596853 26945335 26933116 26646598 26192108 25665941
60977B5665941n30474n13277n33799o44124q58898j141422j421449j631265j733453
$$ 25665941 25135467 24622190 24088391 23444267 22585369 21443947 20022498 18391233 16657780
60968A6657780j726581j634456j490811j326857j164394j014829q82154p66441
$$ 16657780 14931199 13296743 11805932 10479075 9314681 8299852 7417698 6651257
60960F651257o65941n78305n01349m33387l73249l20408k74787k35951k02777
$$ 6651257 5985316 5407011 4905662 4472275 4099026 3778618 3503831 3267880 3065103
60951C065103j74265j50203j30449j13971r9505q6795p6306o7855o0543n4036
$$ 3065103 2890838 2740635 2610186 2496215 2396710 2309915 2233609 2165754 2105211 2051175
60941B051175m8845m5091m1933l8653l5642l3608l2357l0907k8667k6001k3660
$$ 2051175 2002330 1957239 1915306 1876653 1841011 1807403 1775046 1744139 1715472 1689471 1665811
60930A665811k1969k0685j9513j8530j7971j7712j7304j6612j6024j5872j6008
$$ 1665811 1643842 1623157 1603644 1585114 1567143 1549431 1532127 1515515 1499491 1483619 1467611
60919A467611j6241j6722j7560j8436j9057j9568k0101k0302j9946j9536j9572
$$ 1467611 1451370 1434648 1417088 1398652 1379595 1360027 1339926 1319624 1299678 1280142 1260570
60908A260570j9607j8914j7824j7424j7982j8610j8630j8342j8179j7966j7435
$$ 1260570 1240963 1222049 1204225 1186801 1168819 1150209 1131579 1113237 1095058 1077092 1059657
60897A059657j6817j6455j6306j6155j5926j5505j4666j3485j2438j1870j1659
$$ 1059657 1042840 1026385 1010079 993924 977998 962493 947827 934342 921904 910034 898375
60886H98375j1583j1601j1568j1132j0263r512r300r234q536p109n849n803p084
$$ 898375 886792 875191 863623 852491 842228 832716 823416 814182 805646 798537 792688 786885 779801
60873G79801q672r292q596p327o353n807n413n223n513o118o434o141n467m750
$$ 779801 771129 761837 753241 745914 739561 733754 728341 723118 717605 711487 705053 698912 693445 688695
60859F88695m113l613l255k854k278j719j394j067m26J77J4j004k186l023l604
$$ 688695 684582 680969 677714 674860 672582 670863 669469 668402 667976 668153 668167 667163 664977 661954 658350
60844F58350m054m210m103m099m264m214l879l811m378n176n636n759n792n638
$$ 658350 654296 650086 645983 641884 637620 633406 629527 625716 621338 616162 610526 604767 598975 593337
60830E93337n047m106l130k329j851j791j886j596q37k43k92o32o78m84m52n14
$$ 593337 588290 584184 581054 578725 576874 575083 573197 571601 570764 570521 570229 569597 568919 568435 567983 567469
60814E67469k62K87O02L59k89j047j725k113k065j760j616j816k145k310k235
$$ 567469 567207 567494 568096 568455 568166 567119 565394 563281 561216 559456 557840 556024 553879 551569 549334
60799E49334k067k010k117k228k250k481l296m376m695l739k378j950k626l295
$$ 549334 547267 545257 543140 540912 538662 536181 532885 528509 523814 520075 517697 515747 513121 509826
60785E09826l133k590k562l071l315k889k355k466l138l592l370k817k459k246
$$ 509826 506693 504103 501541 498470 495155 492266 489911 487445 484307 480715 477345 474528 472069 469823
60771D69823j763r30o4O94J551K574L434L843L927L938L865L547K983K315J691
$$ 469823 468060 467130 467066 467760 469311 471885 475319 479162 483089 487027 490892 494439 497422 499737 501428
60756E01428J289J320J752K201K281J976J546J193R77Q78P66M09k50r30j352j621
$$ 501428 502717 504037 505789 507990 510271 512247 513793 514986 515963 516841 517607 518016 517766 516836 515484 513863
60740E13863k103k910l680l982l870l946m720n875o415n752m456l589l435l374
$$ 513863 511760 508850 505170 501188 497318 493372 488652 482777 476362 470610 466154 462565 459130 455756
60726D55756k977k649k895l410l417k670j755j328j375j385j087q21j067j683
$$ 455756 452779 450130 447235 443825 440408 437738 435983 434655 433280 431895 430808 429987 428920 427237
60712D27237j943j399m74J20K43K31K03L9p8K34Q52J180J105J251K007K819K944
$$ 427237 425294 423895 423421 423541 423784 424015 424218 424257 424179 424413 425265 426445 427550 428801 430808 433627 436571
60695D36571K417J913J896K320K938L510L881M069M182M138L821L540L831M567
$$ 436571 438988 440901 442797 445117 448055 451565 455446 459515 463697 467835 471656 475196 479027 483594
60681D83594M890M432L974M379N273N631N321N178N542N578M440K517J055P31
$$ 483594 488484 492916 496890 501269 506542 512173 517494 522672 528214 533792 538232 540749 541804 542535
60667E42535J042J033L20p70j853k893l872m447m316l759l335l120k783k367k310
$$ 542535 543577 544610 544930 544160 542307 539414 535542 531095 526779 523020 519685 516565 513782 511415 509105
60652E09105k613k633j990j117n72m14n54j104j847k080j562j087j402k010j922
$$ 509105 506492 503859 501869 500752 500180 499766 499212 498108 496261 494181 492619 491532 490130 488120 486198
60637D86198j177p43j065j656k054k348k615k542j902r16J3N97O77L89K46N93
$$ 486198 485021 484278 483213 481557 479503 477155 474540 471998 470096 469180 469193 469790 470467 470856 471102 471695
60621D71695J093J185R80J039J375J356P11m3m39o24q08p70k73M56J051J425J517
$$ 471695 472788 473973 474953 475992 477367 478723 479434 479391 478952 478328 477520 476750 476477 476933 477984 479409 480926
60604D80926J010j91j429j762j018j2L36o3m99l26L75R88J107R20Q38R68J207
$$ 480926 481936 481745 480316 478554 477536 477524 477860 477797 477298 476972 477347 478335 479442 480362 481200 482168 483375
60587D83375J626K387L355M038M017L292K215J248P64Q73J403K029K415K331J963
$$ 483375 485001 487388 490743 494781 498798 502090 504305 505553 506317 507190 508593 510622 513037 515368 517331
60572E17331K048L262N288O978P666P883Q388R108R567R826J0221J0503J0155
$$ 517331 519379 522641 527929 534907 542573 550456 558844 567952 577519 587345 597566 608069 618224
60559F18224R407Q985Q904Q310O719M693K972J637L81r05k158l271l997l997l255
$$ 618224 627631 636616 645520 653830 660549 665242 668214 669851 670232 669327 667169 663898 659901 655904 652649
60544F52649k076o55J036K880M579O008P190P945Q114Q190Q978J0526J1957J2575
$$ 652649 650573 649918 650954 653834 658413 664421 671611 679556 687670 695860 704838 715364 727321 739896
60530G39896J2553J2297J1746J0683R228P609N859M005K123R2k186m197n113n025
$$ 739896 752449 764746 776492 787175 796403 804012 809871 813876 815999 816091 813905 809708 804595 799570
60516G99570n060n789o271n381l483j929j339j149o22N22K292M473O547Q218J0017
$$ 799570 794510 788721 782450 777069 773586 771657 770318 769169 768547 769069 771361 775834 782381 790599 800616
60501H00616J2721J6170J9390K1923K4365K7272L0304L2838L4964L7274L9845
$$ 800616 813337 829507 848897 870820 895185 922457 952761 985599 1020563 1057837 1097682
60490A097682M1962M2777M1969L9699L6253L1970K7279K2436J7182J0901L358
$$ 1097682 1139644 1182421 1224390 1264089 1300342 1332312 1359591 1382027 1399209 1410110 1413468
60479A413468m826j2711j9872k6479l2578l7796m1863m4949m7208m8312m7890
$$ 1413468 1408642 1395931 1376059 1349580 1317002 1279206 1237343 1192394 1145186 1096874 1048984
60468A048984m6170m3820m1176l8056l4451l0990k8410k6698k5023k2704k0027
$$ 1048984 1002814 958994 917818 879762 845311 814321 785911 759213 734190 711486 691459
60457F91459j7845j6418j5100j3341j1517j0357r817r170q032o693n485m457l737
$$ 691459 673614 657196 642096 628755 617238 606881 597064 587894 579862 573169 567684 563227 559490
60444E59490l533l589l315k689k377k656k849k293j300n75k79j75k65n96q51p31
$$ 559490 555957 552368 549053 546364 543987 541331 538482 536189 534889 534314 534035 533860 533595 532999 532148 531417
60428E31417n16n38m83J16R10J034L52l74m83j1P06J325J337M64o24o87N63J902
$$ 531417 530901 530363 529880 529996 530906 531940 532292 531918 531435 531424 532130 533455 534792 535256 534632 533945 534508 536410
60410E36410K020J059K39K95Q19J088R28O54N40O62J071J760K395K453J881J396
$$ 536410 538430 539489 539728 540023 540842 541930 542858 543512 544052 544714 545785 547545 549940 552393 554274 555670
60394E55670J716K610L226L323L521M107M343L511K114J297J457K081K690L202
$$ 555670 557386 559996 563222 566545 570066 574173 578516 582027 584141 585438 586895 588976 591666 594868
60380E94868L521L553L562L827M009L591K883K726L127L187K573K124K482L110
$$ 594868 598389 601942 605504 609331 613340 616931 619814 622540 625667 628854 631427 633551 636033 639143
60366F39143L284L160L134K828J806P85R84K374L679M162M437N251O325O910O925
$$ 639143 642427 645587 648721 651549 653355 654140 655124 657498 661177 665339 669776 675027 681352 688262 695187
60351F95187O961P492Q431R282R516R062Q547Q676R179Q900P256N084L451K076
$$ 695187 702148 709640 718071 727353 736869 745931 754478 763154 772333 781233 788489 793573 797024 799100
60337G99100k15l624o868q791r627j0320j1149j1692j1669j1192j0331r069p670
$$ 799100 798885 795261 788393 779602 769975 759655 748506 736814 725145 713953 703622 694553 686883
60324F86883o553n749m900l903l086k667k379j858j071j24J037K445L905N240
$$ 686883 680330 674581 669681 665778 662692 660025 657646 655788 654717 654593 655630 658075 661980 667220
60310F67220O576Q103R702J1109J2354J3728J5268J6577J7246J7262J6910J6388
$$ 667220 673796 681899 691601 702710 715064 728792 744060 760637 777883 795145 812055 828443
60298H28443J5715J4891J3896J2415R751N440l4n351r488j2500j5027j7322j9035
$$ 828443 844158 859049 872945 885360 895111 900551 900517 895166 885678 873178 858151 840829 821794
60285H21794j9800j9590j8609j7264j6147j5538j4897j3475j1426r796r130q790
$$ 821794 801994 782404 763795 746531 730384 714846 699949 686474 675048 665252 656122 647332
60273F47332p948o705n770n461n497n482n145m309l074j857r56k81K42L70j4n16
$$ 647332 639384 632679 626909 621448 615951 610469 605324 601015 597941 596084 595128 594847 595089 595459 595445 594929
60257E94929o90n66l44K4N03O69L79K99R84J742J331k62j678j956j563j356j296
$$ 594929 594239 593673 593329 593353 593856 594525 594904 595203 596187 597929 599260 598998 597320 595364 593801 592445 591149
60240E91149p36M92J786K380J980J029M44Q30J813K481K540K624L296M269M911
$$ 591149 590413 590905 592691 595071 597051 598080 598524 599354 601167 603648 606188 608812 612108 616377 621288
60225F21288N186N629O534P506P926P680P305P361P711P701P129O706P226Q580
$$ 621288 626474 632103 638637 646143 654069 661749 669054 676415 684126 691827 698956 705662 712888 721468
60211G21468R921J0660J0773J0358R499Q509P704O904N652M042K771K264K221
$$ 721468 731389 742049 752822 763180 772679 781188 788892 795796 801448 805490 808261 810525 812746
60198H12746K127J704P84p01k345l419l682l709m178n185o332p088o968n939m789
$$ 812746 814873 816577 817361 816660 814315 810896 807214 803505 799327 794142 787810 780722 773754 767815 763026
60183G63026m512n083n432m847l796l066k814k864l213l608l333k116q19m05o42
$$ 763026 758514 753431 747999 743152 739356 736290 733476 730612 727399 723791 720458 718342 717523 717118 716476
60168G16476o11j60L8k30l67N2O54R00P73N91N62O83Q45R04Q69R92J409J816J874
$$ 716476 715865 715705 715743 715513 715146 715198 715852 716752 717525 718116 718678 719361 720206 721110 721979 722971 724380 726196 728070
60149G28070J851K388L575M718N159M993M820N073N732O495P034P209P082O773
$$ 728070 729921 732309 735884 740602 745761 750754 755574 760647 766379 772874 779908 787117 794199 800972
60135H00972O367N999N850N917N980N888N710N450M940M197L505K907K066J025
$$ 800972 807339 813338 819188 825105 831085 836973 842683 848133 853073 857270 860775 863682 865748 866773
60121H66773N61J127J922J818R48L56K81r8j136k086k467k912l976m989n017m391
$$ 866773 867334 868461 870383 872201 873149 873505 873786 873688 872552 870466 867999 865087 861111 856122 851105 846714
60105H46714m239m801n158m636l610k816k519k543k608k438j927j394j257j347
$$ 846714 842475 837674 832516 827880 824270 821454 818935 816392 813784 811346 809419 808025 806768 805421
60091H05421r57J91J428J883J444P01J41j45k08p7O2r9o72j488k376l299m177
$$ 805421 804464 804655 806083 807966 809410 810111 810252 810107 809899 809822 809884 809785 809113 807625 805249 801950 797773
60074G97773m848n351n992o927p865q394q451q203p713p023o441o242o123n431
$$ 797773 792925 787574 781582 774655 766790 758396 749945 741742 734029 727006 720565 714323 708200 702769
60060G02769m121k967k571k507j907o02P76J653K016K121K139K189K413K815L246
$$ 702769 698648 695681 693110 690603 688696 688094 688870 690523 692539 694660 696799 698988 701401 704216 707462
60045G07462L577L795L913L978M069M091L675K603J253K13n52j648l283m857n817
$$ 707462 711039 714834 718747 722725 726794 730885 734560 737163 738416 738629 738077 736429 733146 728289 722472
60030G22472o361o918p305p070o453o356p197q306q669q029p030o449o461o582
$$ 722472 716111 709193 701888 694818 688365 682009 674812 666506 657837 649808 642778 636329 629868 623286
60016F23286o196n192m071l379l091k776k234j686j341j136j032j172j428j249
$$ 623286 617090 611898 607827 604448 601357 598581 596347 594661 593320 592184 591152 589980 588552 587303
60002E87303l20P96J219Q92O62J128J900K247K137K248L060M250M992M698L553
$$ 587303 586983 587779 588998 589890 590552 591680 593580 595827 597964 600212 603272 607522 612514 617212 620765
59987F20765K352J734J608J412Q87K08o08j880l572m885n056m311l545l237l156
$$ 620765 623117 624851 626459 627871 628758 628966 628358 626478 622906 618021 612965 608654 605109 601872 598716
59972E98716k939k437j559m06M19K90n42j074o87K71J179J808K158K267K495L257
$$ 598716 595777 593340 591781 591375 591794 592084 591542 590468 589781 590052 591231 593039 595197 597464 599959 603216
59956F03216M131L933K340O97M51J293J822J585J380J605J628R83J83k05m23q96
$$ 603216 607347 611280 613620 614317 614768 616061 617883 619468 620848 622453 624081 625064 625247 625042 624619 623723
59940F23723j414j582j612j959k469k546k027j322p33j70M76J181K017L080M084
$$ 623723 622309 620727 619115 617156 614687 612141 610114 608792 608059 607889 608365 609546 611563 614643 618727
59925F18727M512M290L967L956L997L681L210L160L627M111M294M457M845N026
$$ 618727 623239 627529 631496 635452 639449 643130 646340 649500 653127 657238 661532 665989 670834 675860
59911F75860M350K907J624J259J673K204K435K356K016J386O09L5j04O2K55M29
$$ 675860 680210 683117 684741 686000 687673 689877 692312 694668 696684 698070 698679 698714 698610 698672 698927 699356
59895F99356P65J371K120K890L771M814N623N610M871M375M882N817N900M851
$$ 699356 700121 701492 703612 706502 710273 715087 720710 726320 731191 735566 740448 746265 752165 757016
59881G57016L764L572L842L627K909K434K406K195J391L27o32j670l004m294n030
$$ 757016 760780 764352 768194 771821 774730 777164 779570 781765 783156 783483 782851 781181 778177 773883 768853
59866G68853n274n604o399p426q062p773o514m860l670l368l564l501k858j981
$$ 768853 763579 757975 751576 744150 736088 728315 721801 716941 713271 709903 706339 702838 699980 697999
59852F97999j318p57K86K078M038N298N732O113P019Q023Q403Q305Q524R258R798
$$ 697999 696681 695924 696210 698288 702326 707624 713356 719469 726488 734511 742914 751219 759743 769001 778799
59837G78799R586Q896Q166P239N785L918J992J11j548k361j921r42p40j852l736
$$ 778799 788385 797281 805447 812686 818471 822389 824381 824492 822944 820583 818662 817720 816980 815128 811392
59822H11392n804p952r908j0980j0946j0553j0455j0180q930p081n948n999o232
$$ 811392 805588 797636 787728 776748 765802 755249 744794 734614 725684 718603 712655 706656 700424
59809G00424n660m625m083m120l940l147k289k061k527l276l846l833l009j688
$$ 700424 694764 690139 686056 681936 677996 674849 672560 670499 667972 664696 660850 657017 654008 652320
59795F52320o95o23j219j787j966j909j823j736j627j466j128m88K66P06O13J99
$$ 652320 651625 651002 649783 647996 646030 644121 642298 640562 638935 637469 636341 635853 636119 636825 637438 637637
59779F37637j64l85o53j101j550j642j285q04n23k63M20J484K304K502K380K292
$$ 637637 637473 637088 636435 635334 633784 632142 630857 630053 629530 629267 629687 631171 633475 635977 638357 640649
59763F40649K094J727J875L166M931N736N236M647N057O056O573O316N770N219
$$ 640649 642743 644470 646345 649511 654442 660178 665414 670061 675118 681174 687747 694063 699833 705052
59749G05052M626M206M361M965N346N113M601M259M004L392K321J268P88Q84R71
$$ 705052 709678 713884 718245 723210 728556 733669 738270 742529 746533 749925 752246 753514 754302 755186 756157
59734G56157O50K77M75J149J514J267J086J529J986J507L57j89L88J149J098M69
$$ 756157 756807 757084 757559 758708 760222 761489 762575 764104 766090 767597 767954 767765 768153 769302 770400 770869
59718G70869J41L11M61L32J93K03R0k81n59l76P8L16K39J92L66N46N05M19N52
$$ 770869 771010 771321 771782 772114 772307 772510 772600 772319 771760 771384 771462 771778 772017 772209 772575 773121 773626 774045 774597
59699G74597P64O96M09M21R66J577J667J286R50Q69P16Q8j075k488l693m227l963
$$ 774597 775361 776057 776466 776887 777853 779430 781097 782383 783333 784202 784918 785006 783931 781443 777750 773523 769560
59682G69560l322k956l133l613m081m397m518m509m698n310n892n624m505l717
$$ 769560 766238 763282 760149 756536 752455 748058 743540 739031 734333 729023 723131 717507 713002 709285
59668G09285m249n529o065n287m038l188k553j474M5J352K002K099J934J662J415
$$ 709285 705036 699507 693442 688155 684117 680929 678376 676902 676947 678299 680301 682400 684334 685996 687411
59653F87411J384J661K124K530K596K093J033k44j336k117k680l079l345l629
$$ 687411 688795 690456 692580 695110 697706 699799 700832 700588 699252 697135 694455 691376 688031 684402
59639F84402m043m330m153l677l457l564l362k482j541j344j737j903j612j420
$$ 684402 680359 676029 671876 668199 664742 661178 657816 655334 653793 652449 650712 648809 647197 645777
59625F45777j633j852j764j646j773j873j677j446j425j291p64l67p57j505j431
$$ 645777 644144 642292 640528 638882 637109 635236 633559 632113 630688 629397 628633 628266 627509 626004 624573
59610F24573k15J187J856J889J799J725J652J786K128K150J517P11L55L06M2l52
$$ 624573 624358 625545 627401 629290 631089 632814 634466 636252 638380 640530 642047 642758 643113 643419 643461 643109
59594F43109m15l02o37j382j742j423j113j405j909j998j797j792j942j795j295
$$ 643109 642694 642392 641755 640373 638631 637208 636095 634690 632781 630783 628986 627194 625252 623457 622162
59579F22162q55p33q39j066j356j500j273p80l20J4L36O33P62O43K42m14r64p73
$$ 622162 621307 620574 619735 618669 617313 615813 614540 613760 613440 613454 613790 614423 615185 615828 616070 615656 614692 613919
59561F13919K06J014P62q8k87M76J268J321R02O42Q16J597L126M889N819N619
$$ 613919 614125 615139 615901 615813 615526 616002 617270 618591 619493 620135 620951 622548 625674 630563 636382 642001
59545F42001N253N614O328O624O699P364Q714J0077J0990J1459J1450J0967J0490
$$ 642001 647254 652868 659196 665820 672519 679883 688597 698674 709664 721123 732573 743540 754030
59532G54030J0421J0141Q457N203J659p66j744j764j383j023r52j158j432j773
$$ 754030 764451 774592 783049 788252 789911 789145 787401 785637 784254 783231 782279 781121 779689 777916
59518G77916k374l291m407n690p114q406r328j0001j0505j0394r368q191p926
$$ 777916 775542 772251 767844 762154 755040 746634 737306 727305 716800 706406 697038 688847 680921
59505F80921q281p832o140m491m074m443m465l890l097k142r79r0J04P3N34J286
$$ 680921 672640 664808 658668 654177 650103 645660 641195 637305 634208 632066 631087 630997 631101 631174 631708 632994
59489F32994J598J467J561K028K354K445K912M062N348O109O262O076N811N824
$$ 632994 634592 636059 637620 639648 642002 644447 647359 651421 656769 662878 669140 675216 681027 686851
59475F86851O399P231P554P098O420O083N947N676N366N183M818L934K955K803
$$ 686851 693250 700481 708035 715133 721553 727636 733583 739259 744625 749808 754626 758560 761515 764318
59461G64318L819N423O904Q010Q664Q626P880P054O891P301P452O828N794M843
$$ 764318 768137 773560 780464 788474 797138 805764 813644 820698 827589 834890 842342 849170 854964 859807
59447H59807L792K218L30j197k210l227m574n931o947p739q410q576p821o353
$$ 859807 863599 865817 866147 864950 862740 859513 854939 849008 842061 834322 825912 817336 809515 803162
59433H03162m792l555k639j782n55J353L645N559O816Q024R704J1464J2708J3709
$$ 803162 798370 794815 792176 790394 789839 791192 794837 800396 807212 815236 824940 836404 849112 862821
59419H62821J5117J6665J7328J6769J5777J5001J4093J2470J0383Q641P616O813
$$ 862821 877938 894603 911931 928700 944477 959478 973571 986041 996424 1005065 1012681 1019494
59407A019494N287K326j956o521j0107j2180j3040j3056j2198j0418q061n719
$$ 1019494 1024781 1027107 1025151 1018630 1008523 996343 983303 970247 958049 947631 939570 933851
59395I33851l960l360m405p081j0660j4020j6120j6354j4865j2577j0488q773
$$ 933851 929891 926531 922126 915045 904385 890365 874245 857891 843026 830449 819961 811188
59383H11188o967n014l613l157k988k157o48O69J208J304J665K550L626M432M843
$$ 811188 804221 799207 795594 792437 789449 787292 786644 787313 788521 789825 791490 794040 797666 802098 806941
59368H06941N090N428N849O140O183O134O400P359Q917J0310J0753J0488J0752
$$ 806941 812031 817459 823308 829448 835631 841765 848165 855524 864441 874751 885504 895992 906744
59355I06744J2310J4419J5814J6308J6666J7186J7470J7495J7738J7985J7171
$$ 906744 919054 933473 949287 965595 982261 999447 1016917 1034412 1052150 1070135 1087306
59344A087306J4959J2506J0879R507P102L599J95k278m164o274r006j2136j4973
$$ 1087306 1102265 1114771 1125650 1135157 1142259 1145858 1146053 1143775 1139611 1133337 1124331 1112195 1097222
59331A097222j6888j7983j8975k0050k0399j9487j8166j7609j7579j6858j5237
$$ 1097222 1080334 1062351 1043376 1023326 1002927 983440 965274 947665 930086 913228 897991
59320H97991j3793j3103j2398j0971r374q511q307q027p398o672o011n444n213
$$ 897991 884198 871095 858697 847726 838352 829841 821534 813507 806109 799437 793426 787982 782769
59307G82769n444n582m838l227j667q69n67J1J227K845M504O005P119P496P062
$$ 782769 777325 771743 766905 763678 762011 761142 760575 760586 761813 764658 769162 775167 782286 789782 796844
59292G96844O381O285P059Q220R201R830R969R084O837L909J572L76j63n20m17
$$ 796844 803225 809510 816569 824789 833990 843820 853789 862873 869710 873619 875191 875567 875404 874884 874467
59277H74467N63K195L870N313O604P782Q802R708J0392J0449R645Q428P435O536
$$ 874467 875030 877225 881095 886408 893012 900794 909596 919304 929696 940145 949790 958218 965653 972189
59263I72189M849J885j687m688o586p828r039j0204j0749j0390r595r039q727
$$ 972189 977038 978923 977236 972548 965962 958134 949095 938891 928142 917752 908157 899118 890391
59250H90391p994o486m765l659l186k510r10J442L674M921M902M079L342L386
$$ 890391 882397 875911 871146 867487 864301 861791 860881 862323 865997 870918 875820 879899 883241 886627
59236H86627M143M865M804L807K305Q28m01j413k179k609k894l632n218p239q836
$$ 886627 890770 895635 900439 904246 906551 907379 906978 905565 903386 900777 897883 894251 889033 881794 872958
59221H72958r683j0132j0387j0110r209q354q163q240p720o512n338m648m267
$$ 872958 863275 853143 842756 832646 823437 815083 806920 798680 790960 784448 779110 774462 770195
59208G70195m100m396m994n065m092k679j871j953k301k239j691j014m89k7O60
$$ 770195 766095 761699 756705 751640 747548 744869 742998 741045 738744 736505 734814 733800 733311 733284 733944
59193G33944J549K169K232K211K765L697M117L754L373L608M165M593N102N919
$$ 733944 735493 737662 739894 742105 744870 748567 752684 756438 759811 763419 767584 772177 777279 783198
59179G83198O528O434O181O666P677Q183P919P670P875P962P437O743O551O783
$$ 783198 789726 796160 802341 809007 816684 824867 832786 840456 848331 856293 863730 870473 877024 883807
59165H83807O846O406N536M385L043J494m48k837n204o941q128r404j0909j2007
$$ 883807 890653 897059 902595 906980 910023 911517 911069 908232 903028 896087 887959 878555 867646 855639
59151H55639j2388j2698j3513j4293j4109j2979j1824j1201j0791j0087r045p945
$$ 855639 843251 830553 817040 802747 788638 775659 763835 752634 741843 731756 722711 714766
59139G14766p040o392n916n454m892m141l081j808q05m28j75Q84K783M443N129
$$ 714766 707726 701334 695418 689964 685072 680931 677850 676042 675237 674809 674634 675518 678301 682744 687873
59124F87873N430O194P275Q065Q642R526J0654J1563J2359J3469J4585J4771J3704
$$ 687873 693303 699497 706772 714837 723479 733005 743659 755222 767581 781050 795635 810406 824110
59111H24110J1984J0239Q711P709P522P669P131N591L748K232R59k21j072j609
$$ 824110 836094 846333 855044 862753 870275 877944 885075 890666 894414 896646 897605 897384 896312 894703
59097H94703k321l367m143m214m001m047m251m336m508m955n251m967m495m542
$$ 894703 892382 889015 884872 880658 876657 872610 868359 864023 859515 854560 849309 844342 839847 835305
59083H35305n112n691o207p029q125q937r146q942q488p688o585n558m946m755
$$ 835305 830193 824502 818295 811266 803141 794204 785058 776116 767628 759940 753355 747797 742851 738096
59069G38096m815m928m857m466l903l421l011k523k074j953k106k064j544q95
$$ 738096 733281 728353 723496 719030 715127 711706 708695 706172 704098 702145 700039 697975 696431 695536
59055F95536p09j157j842k141j715p34K13N79L01j89m05k44ON2m4K7L68P15Q32
$$ 695536 694827 693670 691828 689687 687972 687238 687451 688030 688331 688142 687737 687493 687499 687551 687507 687534 687902 688617 689449
59036F89449Q66J075J388J656K182L447N278O796P458P618P829Q123Q294Q406
$$ 689449 690315 691390 692778 694434 696616 700063 705341 712137 719595 727213 735042 743165 751459 759865
59022G59865Q520Q303P538O720O554O918O920N907M052J965K17q04r99p07l74
$$ 759865 768385 776688 784226 790946 797500 804418 811338 817245 821297 823262 823479 822675 821676 820969 820595
59007H20595n9N07J383K307L122L898M654N272N760O299O833O999O594N952N639
$$ 820595 820536 821043 822426 824733 827855 831753 836407 841679 847439 853738 860571 867570 874164 880116 885755
58992H85755N844O160N977N052L744K632J943J493J168J137J488K020K663L656
$$ 885755 891599 897759 903736 908788 912532 915164 917107 918600 919768 920905 922393 924413 927076 930732
58978I30732M992O134O822P719R518J1673J2931J3070J3133J3769J4356J4195
$$ 930732 935724 941858 948680 956399 965917 977590 990521 1003591 1016724 1030493 1044849 1059044
58966A059044J3633J3309J2978J1983J0448R057P803N910L049j62l143o050r137
$$ 1059044 1072677 1085986 1098964 1110947 1121395 1130452 1138255 1144165 1147214 1147052 1143909 1137859 1128722
58953A128722j1996j4070j5541j7053j8686j9766j9789j9018j8010j6930j5645
$$ 1128722 1116726 1102656 1087115 1070062 1051376 1031610 1011821 992803 974793 957863 942218
58942I42218j4151j2579j0932r127p301n744m600l782l164k637k137j783j869
$$ 942218 928067 915488 904556 895429 888128 882384 877784 874002 870838 868201 866064 864281 862412
58929H62412k454l100l358l343l368l267k609j562q14n94m99m14o97j130o56J118
$$ 862412 859958 856858 853500 850157 846789 843522 840913 839351 838537 837943 837444 837030 836333 835203 834547 835665
58913H35665L007L782L967M991O956Q535R073R486J0780J2622J4005J4632J5105
$$ 835665 838672 842454 846421 851412 858368 866903 875976 885462 896242 908864 922869 937501 952606
58900I52606J6089J7688J9394K0509K0896K1349K2684K4440K5180K4267K2653
$$ 952606 968695 986383 1005777 1026286 1047182 1068531 1091215 1115655 1140835 1165102 1187755
58889A187755K1501K0762J9678J8146J6716J5511J3951J1570Q542N189J533k442
$$ 1187755 1209256 1230018 1249696 1267842 1284558 1300069 1314020 1325590 1334132 1339321 1340854 1338412
58877A338412o386r752j2369j4639j7031j9442k1197k1808k1499k0806j9840j8446
$$ 1338412 1332026 1322274 1309905 1295266 1278235 1258793 1237596 1215788 1194289 1173483 1153643 1135197
58865A135197j6903j5854j5390j4845j3769j2629j2065j2007j2008j2096j2509
$$ 1135197 1118294 1102440 1087050 1072205 1058436 1045807 1033742 1021735 1009727 997631 985122
58854I85122j2898j2491j1242j0079r835j0346j0871j1006j0872j0697j0564j0441
$$ 985122 972224 959733 948491 938412 928577 918231 907360 896354 885482 874785 864221 853780
58842H53780j0268r994r678r411r062q289o984n559m534l906l220k252j294o25
$$ 853780 843512 833518 823840 814429 805367 797078 790094 784535 780001 776095 772875 770623 769329 768704
58828G68704m4P81J666K102K108K430L599N099N865N507M622L906L392K743J923
$$ 768704 768660 769441 771107 773209 775317 777747 781346 786445 792310 797817 802439 806345 809737 812480 814403
58813H14403J197O09r7j011j833k268k475k812l295l593l583l605m011m737n566
$$ 814403 815600 816209 816112 815101 813268 811000 808525 805713 802418 798825 795242 791637 787626 782889 777323
58798G77323o475p403p832p273o082n204m921m431l048j261j07J71J88M81J080
$$ 777323 770848 763445 755613 748340 742258 737054 732133 727702 724654 723393 723286 723457 723645 724126 725206
58783G25206J874K712L163K797J865J128R28Q81O79N76P98R91O15l11j351k295
$$ 725206 727080 729792 732955 735752 737617 738745 739673 740554 741233 741809 742607 743598 744213 743902 742551 740256
58767G40256l285m378n287n631n243m322l331k652k229j611n18P51J609J770J527
$$ 740256 736971 732593 727306 721675 716432 712110 708779 706127 703898 702287 701769 702520 704129 705899 707426
58752G07426J498K142L351M478M949M916N102N929P047P894Q430Q992R630R951
$$ 707426 708924 711066 714417 718895 723844 728760 733862 739791 746838 754732 763162 772154 781784 791735
58738G91735R711R161Q699Q442Q285Q253Q398Q528Q288P619O908O491O235N829
$$ 791735 801446 810607 819306 827748 836033 844286 852684 861212 869500 877119 884027 890518 896753 902582
58724I02582N262M715M132L349K557K237K455K671K399J720R21N1r26j935l072
$$ 902582 907844 912559 916691 920040 922597 924834 927289 929960 932359 934079 935000 935051 934125 932190 929118
58709I29118m663o667q383r262r699j0518j1880j3235j4223j5005j5813j6600
$$ 929118 924455 917788 909405 900143 890444 879926 868046 854811 840588 825583 809770 793170
58697G93170j7200j7420j7038j6038j4695j3191j1416r545q328q160q193p307
$$ 793170 775970 758550 741512 725474 710779 697588 686172 676627 668299 660139 651946 644639
58685F44639n737m773m890n195m907m306l782k979j538M3J036J485J959K687L612
$$ 644639 638902 634129 629239 624044 619137 614831 611049 608070 606532 606575 607611 609096 611055 613742 617354
58670F17354M884O615Q295R174R178Q953Q938Q869Q304P243N988M605K827N26
$$ 617354 622238 628853 637148 646322 655500 664453 673391 682260 690564 697807 703795 708400 711227 711753
58656G11753j933m000n510o717p705q109p680o738n783m947m207l778l731l522
$$ 711753 709820 705820 700310 693593 685888 677779 670099 663361 657578 652631 648424 644646 640915 637393
58642F37393k638j484q80p31n7J522L125L717L270K492J932J658J402Q68J27k75
$$ 637393 634755 633271 632391 631660 631603 633125 636250 639967 643237 645729 647661 649319 650721 651589 651716 651441
58626F51441j2M53N73P09J615L112M267M887N677O778P344O985O471O463O576
$$ 651441 651429 651882 652455 653164 654779 657891 662158 667045 672722 679500 686844 693829 700300 706763 713339
58611G13339O307N908N597M877L422J854Q12K8r39j732j825j501j367j488j599
$$ 713339 719646 725554 731151 736028 739450 741304 742116 742144 741205 739473 737648 736147 734780 733292 731693
58596G31693j602j212R0K058L541M157N056P025Q880R167Q579R040J0902J2699
$$ 731693 730091 728879 728969 731027 734568 738725 743781 750806 759686 768853 777432 786472 797374 810073
58582H10073J3428J3464J3295J2899J2518J2605J2825J2311J1222J0839J1813
$$ 810073 823501 836965 850260 863159 875677 888282 901107 913418 924640 935479 947292
58571I47292J3433J4918J6317J7768J8919J9635K0376K1365K2129K2337K2378
$$ 947292 960725 975643 991960 1009728 1028647 1048282 1068658 1090023 1112152 1134489 1156867
58560A156867K2601K2614K1733J9641J6372J2176P686L686L83k623n559q232j0563
$$ 1156867 1179468 1202082 1223815 1243456 1259828 1272004 1279690 1283376 1283759 1281136 1275577 1267345 1256782
58547A256782j2690j4331j4917j4625j4555j5421j6722j7680j8419j9600k1303
$$ 1256782 1244092 1229761 1214844 1200219 1185664 1170243 1153521 1135841 1117422 1097822 1076519
58536A076519k2843k3502k3065k1851k0407j9038j7503j5408j2927j0635q634
$$ 1076519 1053676 1030174 1007109 985258 964851 945813 928310 912902 899975 889340 880706
58525H80706o458m074k305j789k039k057j591j238j472k041k385k292j986j764
$$ 880706 874248 870174 867869 866080 864041 861984 860393 859155 857683 855642 853257 850965 848979 847215
58511H47215j711j843k304l163m021m220l660l055l015l232l032k435k069k181
$$ 847215 845504 843661 841357 838194 834173 829953 826293 823238 820223 816991 813959 811524 809455 807274
58497H07274k279j805p06P41K218L526M737O068P427Q330Q645R048J0146J1559
$$ 807274 804995 803190 802484 803225 805443 808969 813706 819774 827201 835531 844176 853224 863370 874929
58483H74929J2452J2753J3060J3573J3948J4064J4085J3780J2584J0477Q069N659
$$ 874929 887381 900134 913194 926767 940715 954779 968864 982644 995228 1005705 1013774 1019433
58471A019433K954j97l395o176q293r376r069p666o021m585l114j346N57K424
$$ 1019433 1022387 1022190 1018795 1012619 1004326 994950 985881 978215 972194 967609 964495 963149 963706 966130
58457I66130M295N985P029P220O794N971M792L458K254J052o07k793n026o885
$$ 966130 970425 976410 983439 990659 997453 1003424 1008216 1011674 1013928 1014980 1014373 1011580 1006554 999669
58443I99669q341r406r918r731q814p199n177l282j692kJ947L503M148M484N327
$$ 999669 991328 981922 972004 962273 953459 946260 941083 937801 936109 936107 938054 941557 945705 950189 955516
58428I55516O321O576O238O171O330N813M565L529L037K285P61j095k959n094
$$ 955516 961837 968413 974651 980822 987152 992965 997530 1001059 1004096 1006381 1007142 1006047 1003088 997994
58414I97994p391r077r795r983r851r201q433q453r158r268q182o750n721m759
$$ 997994 990603 981526 971731 961748 951897 942696 934263 925810 916652 907384 899202 892452 886731 881972
58400H81972l646l027l152l066k046p13J71R05J913K697K737K506K570K605K326
$$ 881972 878326 875299 872147 869081 867035 866322 866493 867398 869311 872008 874745 877251 879821 882426 884752
58385H84752K360L103L701L447L258M319O000O765O640P122Q755J0348J0876J0770
$$ 884752 887112 890215 893916 897363 900621 904940 910940 917705 924345 931467 940222 950570 961446 972216
58371I72216J0924J1410J1745J1820J2061J2898J4273J5533J5875J5073J3690
$$ 972216 983140 994550 1006295 1018115 1030176 1043074 1057347 1072880 1088755 1103828 1117518
58360A117518J2440J1608J1072J0548R647Q102O132M184K393P48l82n92k30J38
$$ 1117518 1129958 1141566 1152638 1163186 1172833 1180935 1187067 1191251 1193644 1194392 1194010 1193418 1193188 1193326
58346A193326R44L095O135Q354R124R729J1253J2992J3867J4152J4681J5385J5680
$$ 1193326 1194270 1197365 1203500 1211854 1220978 1230707 1241960 1254952 1268819 1282971 1297652 1313037 1328717
58333A328717J5528J5123J4325J3244J2556J2357J1549R379O692M687L276J853
$$ 1328717 1344245 1359368 1373693 1386937 1399493 1411850 1423399 1432778 1439470 1444157 1447433 1449286
58321A449286Q08R70K042K967L426L994N009O318P835R528J1028J1987J2545J3017
$$ 1449286 1450094 1451064 1453106 1456073 1459499 1463493 1468502 1474820 1482655 1492183 1503211 1515198 1527743 1540760
58307A540760J3498J4161J5298J6638J7418J7524J7725J8383J8971J9332K0171
$$ 1540760 1554258 1568419 1583717 1600355 1617773 1635297 1653022 1671405 1690376 1709708 1729879
58296A729879K1586K2479K2276K1972K2532K3543K4421K5625K7465K9050K9730
$$ 1729879 1751465 1773944 1796220 1818192 1840724 1864267 1888688 1914313 1941778 1970828 2000558
58285B000558L0412L2025L3870L4846L5248L5904L6670L7312L8721M1578M4780
$$ 2000558 2030970 2062995 2096865 2131711 2166959 2202863 2239533 2276845 2315566 2357144 2401924
58274B401924M6868M8186N0044N2524N4686N6185N7190N7521N7311N7728N9572
$$ 2401924 2448792 2496978 2547022 2599546 2654232 2710417 2767607 2825128 2882439 2940167 2999739
58263B999739O2005O3911O5500O7244O8473O8654O8761O9729P0816P1166P1776
$$ 2999739 3061744 3125655 3191155 3258399 3326872 3395526 3464287 3534016 3604832 3675998 3747774
58252C747774P3955P7157Q0272Q3831Q8792R4433R9667J05247J12399J20387J27751
$$ 3747774 3821729 3898886 3979158 4062989 4151781 4246214 4345881 4451128 4563527 4683914 4811665
58241D811665J34964J43465J53014J62362J71641J81824J92747K03858K15895
$$ 4811665 4946629 5090094 5243108 5405470 5577111 5758935 5951682 6155540 6371435
58232F371435K29696K44552K59820K76829K96845L18813L41521L66283L94833
$$ 6371435 6601131 6845683 7105503 7382332 7679177 7997990 8339511 8705794 9100627
58223I100627M26494M60338M98181N42296N92137O46720P08345P80538Q64324
$$ 9100627 9527121 9987459 10485640 11027936 11620073 12266793 12975138 13755676 14620000
58214A4620000R60211J071885J204392J361181J547083J771870K046563K378231
$$ 14620000 15580211 16652096 17856488 19217669 20764752 22536622 24583185 26961416
58206B6961416K772147L236419L781618M421120N176443O074485P128130Q318671
$$ 26961416 29733563 32969982 36751600 41172720 46349163 52423648 59551778 67870449
58198F7870449R601223J0924506J2244064J3525502J4738068J5830739J6709850
$$ 67870449 77471672 88396178 100640242 114165744 128903812 144734551 161444401
58191A61444401J7269341J7470643J7375061J7068641J6579162J5909398J5104176
$$ 161444401 178713742 196184385 213559446 230628087 247207249 263116647 278220823
58184B78220823J4146322J2712746J0135315N795130l15647p384647j4121869
$$ 278220823 292367145 305079891 315215206 321010336 320694689 313310042 299188173
58177B99188173j9355719k2459748k3439354k2758752k1057690j8899323j6662244
$$ 299188173 279832454 257372706 233933352 211174600 190116910 171217587 154555343
58170A54555343j4584678j2842343j1548221j0697315j0156457r731764r255886
$$ 154555343 139970665 127128322 115580101 104882786 94726329 84994565 75738679
58163G5738679q638633p874654p020917o155385n339135m604673l965220l422069
$$ 75738679 67100046 59225392 52204475 46049090 40709955 36105282 32140062 28717993
58155B8717993k964957k577408k246605j965043j724449j515010j330876j170777
$$ 28717993 25753036 23175628 20929023 18963980 17239531 15724521 14393645 13222868
58147A3222868j032735r12784q08794p20681o46632n83123n28547m82834m43735
$$ 13222868 12190133 11277349 10468555 9747874 9101242 8518119 7989572 7506738 7063003
58138G063003m07496l73143l42339l15142k89424k64501k41808k21914k03942
$$ 7063003 6655507 6282364 5940025 5624883 5335459 5070958 4829150 4607236 4403294
58129D403294j88011j75183j65027j55965j47921j41871j37017j31235j24254
$$ 4403294 4215283 4040100 3875073 3719108 3571187 3429316 3292299 3161064 3036810
58120C036810j17649j11808j05491r8445r1808q5973q0322p5085p1105o7891o4215
$$ 3036810 2919161 2807353 2701862 2603417 2511609 2425636 2345314 2270229 2199124 2131233 2067018
58109B067018o0503n8315n7486n6103n3434n0697m8782m7322m6083m5291m4409
$$ 2067018 2006515 1948200 1890714 1834611 1781177 1730480 1681698 1634376 1588293 1543002 1498593
58098A498593m2549m0177l8651l7954l6723l4383l1558k8444k4687k0846j8053
$$ 1498593 1456044 1415867 1377216 1339262 1302539 1268156 1236598 1208154 1183467 1162621 1144568
58087A144568j6225j4409j2825j2665j3856j4979j5466j6029j6750j6787j6203
$$ 1144568 1128343 1113934 1101109 1088444 1074588 1059609 1044143 1028114 1011364 994577 978374
58076I78374j6181j6975j7507j7348j7332j7673j7252j5547j3624j2488j1769
$$ 978374 962193 945218 927711 910363 893031 875358 858106 842559 828935 816447 804678
58065H04678j0820r871r389r276r318r511r535q821p533o525o130n867n604n847
$$ 804678 793858 783987 774598 765322 756004 746493 736958 728137 720604 714079 707949 702082 696478 690631
58051F90631o723p610q035q071p688o820o168o685q019q550p480n852n070n329
$$ 690631 683908 676298 668263 660192 652504 645684 639516 632831 624812 616262 608782 602930 597860 592531
58037E92531n943o422o664o739o859p097p048o255n096m538n027o135p222p765
$$ 592531 586588 580166 573502 566763 559904 552807 545759 539504 534408 529870 524843 518708 511486 503721
58023E03721p284n778m170l532l883m441m722m708m224l193k240k030k257k253
$$ 503721 496437 490659 486489 482957 479074 474633 469911 465203 460979 457786 455546 453516 451259 449006
58009D49006k203k617k981k303q67P5K41N40J298J805J809J950K350K244J445
$$ 449006 446803 444186 441205 438902 438035 438110 438351 438891 440189 441994 443803 445753 448103 450347 451792
57994D51792Q42R11J012P31O59J151J452Q96n1o67j095j807k657l160l200k974
$$ 451792 452634 453545 454557 455288 455947 457098 458550 459446 459395 458728 457633 455826 453169 450009 446809 443835
57978D43835k691k611k849k945k330j367j092j686k196k015j639j499j121j61
$$ 443835 441144 438533 435684 432739 430409 429042 427950 426264 424068 422053 420414 418915 417794 417633
57964D17633O16K38j096k275k512j856q38k7L48O16J216K010K401K152J483O18
$$ 417633 418249 418487 417391 415116 412604 410748 409910 409883 410231 410847 412063 414073 416474 418626 420109 420727
57948D20727j00J90K067M620O205O568P078Q531R997J0422J0202J0288J0684J0767
$$ 420727 420627 420817 422884 427504 433709 440277 447355 455886 465883 476305 486507 496795 507479 518246
57934E18246J0453J0190J0116R925R293Q040O148L923J797j33k005l601m600n356
$$ 518246 528699 538889 549005 558930 568223 576263 582411 586334 588131 587998 585993 582392 577792 572436
57920E72436o583q146r078r057q828q905q838q267p669p452p244o605n744m986
$$ 572436 565853 557707 548629 539572 530744 521839 513001 504734 497065 489613 482369 475764 470020 465034
57906D65034m248l558l243l188k812k165k104k819l313k968k470k413k140j067
$$ 465034 460786 457228 453985 450797 447985 445820 443716 440897 437584 434616 432146 429733 427593 426526
57892D26526k0M5k95J33J122J610J605K127L331M147L906L166K628K224J548N68
$$ 426526 426506 426551 426256 426389 427511 429121 430726 432853 436184 440331 444237 447403 450031 452255 453803 454371
57876D54371m21j098j250r49n60l41k00n1n3j81k3N75J164J407J628K119K497
$$ 454371 453950 452852 451602 450653 450093 449752 449552 449501 449448 449267 449244 449819 450983 452390 454018 456137 458634
57859D58634K409K278K621L104L067K570K120J760J252P18K74n30j985l359l799
$$ 458634 461043 463321 465942 469046 472113 474683 476803 478563 479815 480533 480807 480277 478292 474933 471134
57844D71134l778m467n845o696o485n979n768n378m354l213k707k794k900k714
$$ 471134 467356 462889 457044 450348 443863 437884 432116 426738 422384 419171 416464 413670 410770 408056
57830D08056k233j434l95O04J367K002K567K811K482J645N22p30j834k255j598
$$ 408056 405823 404389 403994 404598 405965 407967 410534 413345 415827 417472 417994 417264 415430 413175 411577
57815D11577j58J093J314N94j72l21j60l62q57r17l94j10o74j594j990j740j341
$$ 411577 411419 412512 413826 414420 414248 413927 413767 413405 412548 411631 411237 411127 410453 408859 406869 405129 403788
57798D03788j173j420k185l049k932j296Q99K168K261K140K482L120L755M332
$$ 403788 402615 401195 399010 395961 393029 391733 392632 394800 397061 399201 401683 404803 408558 412890
57784D12890M594M232L579L431L893M189L821L228K946K817K400J672Q43j09j297
$$ 412890 417484 421716 425295 428726 432619 436808 440629 443857 446803 449620 452020 453692 454535 454426 453129
57769D53129k535l500m129m577m943n193n335n467n691n991o203o110n633m832
$$ 453129 450594 447094 442965 438388 433445 428252 422917 417450 411759 405768 399565 393455 387822 382990
57755C82990l739k378r84N9O40R54J035P11K13K14Q74J391J091M53M03R81J467
$$ 382990 379251 376873 375889 375948 376588 377542 378577 379288 379501 379715 380589 381980 383071 383524 383927 384908 386375
57738C86375J497J226O82k03j013j202j005j179j792k175k094k117k515k744k368
$$ 386375 387872 389098 389780 389577 388564 387362 386357 385178 383386 381211 379117 377000 374485 371741 369373
57723C69373j833j782k104k173j719j126j015j664k628k977k271j230r20j365
$$ 369373 367540 365758 363654 361481 359762 358636 357621 355957 353329 350352 348081 346851 345931 344566
57709C44566j619j212p60q97j416j843k242k839l284k884j462L96J884K530K353
$$ 344566 342947 341735 340975 340078 338662 336819 334577 331738 328454 325570 324108 324504 326388 328918 331271
57694C31271J703Q77oo59n00O89K094K590K139J889K749M511O605R033J2127J5834
$$ 331271 332974 333851 333845 333186 332686 333375 335469 338059 340198 342087 344836 349347 355952 364985 377112 392946
57678C92946J9661K3112K5990K8547L1379L4777L8116M0357M1290M1690M2084
$$ 392946 412607 435719 461709 490256 521635 556412 594528 634885 676175 717865 759949
57667G59949M2089M1234L9721L7782L4707K9075J9760O488r988k7641m3496n4884
$$ 759949 802038 843272 882993 920775 955482 984557 1004317 1010805 1000817 973176 929680 874796
57655H74796o0636o1137n7684n2039m5935m0298l5052l0014k5662k2531k0255
$$ 874796 814160 753023 695339 643300 597365 557067 522015 492001 466339 443808 423553
57644D23553j7839j4853j1915r899q995q536p648o076m461l598l403l015j998
$$ 423553 405714 390861 378946 369047 360052 351516 343868 337792 333331 329733 326330 323315 321317
57631C21317r85p59j173j433j145o11k47j86l51o27r78j571k555l574l804k845
$$ 321317 320332 319573 318400 316967 315822 315211 314964 314778 314427 313800 312822 311251 308696 305122 301318 298473
57615B98473j305j98L9l28q13j051q71m80l29n43p65p82q66j172j324j062p80
$$ 298473 297168 296970 297009 296681 295868 294817 293946 293466 293137 292594 291829 291047 290181 289009 287685 286623 285843
57598B85843q29q00k27M14L06l85p44n41m84r97j641j933j923j751j436j319j861
$$ 285843 285014 284214 283987 284401 284707 284322 283578 283037 282553 281556 279915 277982 276059 274308 272872 271553 269692
57581B69692k681k648j467l71n54j549k022j635j215j320j583j576j460j523j619
$$ 269692 267011 264363 262896 262525 261971 260422 258400 256765 255550 254230 252647 251071 249611 248088 246469
57566B46469j410q24l3P90J399J478R72K95mJ97N74Q23J004J314J731K041K178
$$ 246469 245059 244235 244202 244992 246391 247869 248841 249136 249132 249329 249903 250726 251730 253044 254775 256816 258994
57549B58994K292K406K257J721J248J490K443L298L328K639J833J238Q34P26J141
$$ 258994 261286 263692 265949 267670 268918 270408 272851 276149 279477 282116 283949 285187 286021 286747 287888
57534B87888J893K267J762P42Q2K31Q10J120R10N45N06Q90J413J846K195K374
$$ 287888 289781 292048 293810 294552 294634 294865 295675 296795 297705 298250 298756 299646 301059 302905 305100 307474
57518C07474J995Q77l65o78K79J714K659L028L318L618L461K718J974J797K008
$$ 307474 309469 310346 309981 309303 309582 311296 313955 316983 320301 323919 327380 330098 332072 333869 335877
57503C35877K024J672J305J247J352J215O16k23q08q27m55j26l3k9N1J95L37L96
$$ 335877 337901 339573 340878 342125 343477 344692 345308 345085 344277 343450 342995 342869 342836 342807 342858 343053 343390 343786
57485C43786J74l65p36l10P49J490J387J011J043J229R66M58M38R35J220J004
$$ 343786 343960 343595 342859 342549 343298 344788 346175 347186 348229 349458 350424 350882 351320 352255 353475 354479
57469C54479Q38J228J986K703L195L275K686J625P89O59J160K115L440M660M962
$$ 354479 355317 356545 358531 361234 364429 367704 370390 372015 372804 373463 374623 376738 380178 384838 389800
57454C89800M284L639L781M070L467K168J385J632K235K574K946L777M646M727
$$ 389800 394084 397723 401504 405574 409041 411209 412594 414226 416461 419035 421981 425758 430404 435131
57440D35131L920K990K616K691K709K527K447K664K918K873K607K499K737L183
$$ 435131 439051 442041 444657 447348 450057 452584 455031 457695 460613 463486 466093 468592 471329 474512
57426D74512L669M089M243L908L271K988L559M735N669N703M964M285M344M914
$$ 474512 478181 482270 486513 490421 493692 496680 500239 504974 510643 516346 521310 525595 529939 534853
57412E34853N123M614M045M157M740N107N176N322N380M838M000L913M822N719
$$ 534853 539976 544590 548635 552792 557532 562639 567815 573137 578517 583355 587355 591268 596090 601809
57398F01809N819N549N551N589N296N192O024P599R057R887R982R236P931P088
$$ 601809 607628 613177 618728 624317 629613 634805 640829 648428 657485 667372 677354 686590 694521 701609
57384G01609P445Q405Q871Q801Q966R430R387Q558P645P236P104O902O750O897
$$ 701609 709054 717459 726330 735131 744097 753527 762914 771472 779117 786353 793457 800359 807109 814006
57370H14006P351Q023Q730Q951Q308P244O642O685O860P099Q021R725J1238J1676
$$ 814006 821357 829380 838110 847061 855369 862613 869255 875940 882800 889899 897920 907645 918883 930559
57356I30559J1266J0804J0624J0619J0700J0814J0866J0990J1506J2278J2570
$$ 930559 941825 952629 963253 973872 984572 995386 1006252 1017242 1028748 1041026 1053596
57345A053596J1936J0921J0484J0988J2009J2840J2960J2307J1349J0755J0834
$$ 1053596 1065532 1076453 1086937 1097925 1109934 1122774 1135734 1148041 1159390 1170145 1180979
57334A180979J1497J2559J3660J4057J3350J2354J2403J3638J4841J5225J5316
$$ 1180979 1192476 1205035 1218695 1232752 1246102 1258456 1270859 1284497 1299338 1314563 1329879
57323A329879J5641J5710J5090J4555J5025J6057J6507J6185J5796J5635J5471
$$ 1329879 1345520 1361230 1376320 1390875 1405900 1421957 1438464 1454649 1470445 1486080 1501551
57312A501551J5502J6162J7006J6993J6143J5864J7189J9413K1016K1330K0818
$$ 1501551 1517053 1533215 1550221 1567214 1583357 1599221 1616410 1635823 1656839 1678169 1698987
57301A698987K0211J9933K0125K0765K1704K2727K3576K3997K3974K3899K4222
$$ 1698987 1719198 1739131 1759256 1780021 1801725 1824452 1848028 1872025 1895999 1919898 1944120
57290A944120K4984K5880K6629K7092K7178K7107K7508K8758L0269L1047L0953
$$ 1944120 1969104 1994984 2021613 2048705 2075883 2102990 2130498 2159256 2189525 2220572 2251525
57279B251525L0871L1503L2584L3456L3920L4183L4352L4377L4245L4048L3944
$$ 2251525 2282396 2313899 2346483 2379939 2413859 2448042 2482394 2516771 2551016 2585064 2619008
57268B619008L4220L5099L6408L7655L8566L9357M0340M1521M2663M3609M4389
$$ 2619008 2653228 2688327 2724735 2762390 2800956 2840313 2880653 2922174 2964837 3008446 3052835
57257C052835M5187M6241M7636M9192N0713N2185N3581N4724N5756N7501O0718
$$ 3052835 3098022 3144263 3191899 3241091 3291804 3343989 3397570 3452294 3508050 3565551 3626269
57246C626269O4941O8677P0895P1840P2249P2343P1939P1149P0490P0455P1103
$$ 3626269 3691210 3759887 3830782 3902622 3974871 4047214 4119153 4190302 4260792 4331247 4402350
57235D402350P1985P2505P2621P3075P4466P6327P7648P8246P8745P9188P8654
$$ 4402350 4474335 4546840 4619461 4692536 4767002 4843329 4920977 4999223 5077968 5157156 5235810
57224E235810P6578P3535P0191O6438O2188N8199N5255N3203N1734N1303N2231
$$ 5235810 5312388 5385923 5456114 5522552 5584740 5642939 5698194 5751397 5803131 5854434 5906665
57213E906665N3482N3680N2946N2404N2089N0906M8843M7521M7999M9357N0299
$$ 5906665 5960147 6013827 6066773 6119177 6171266 6222172 6271015 6318536 6366535 6415892 6466191
57202F466191N0923N1855N2598N2122N0545M8914M7493M5486M2593L9780L8082
$$ 6466191 6517114 6568969 6621567 6673689 6724234 6773148 6820641 6866127 6908720 6948500 6986582
57191F986582L7442L7157L6896L6829L7110L7745L8774M0167M1657M2994M4210
$$ 6986582 7024024 7061181 7098077 7134906 7172016 7209761 7248535 7288702 7330359 7373353 7417563
57180G417563M5369M6188M6294M5830M5364M5128M4746M4020M3468M3542M3543
$$ 7417563 7462932 7509120 7555414 7601244 7646608 7691736 7736482 7780502 7823970 7867512 7911055
57169G911055M1970L8210L3355K9116K6283K4483K3057K1726K0603J9940J9886
$$ 7911055 7953025 7991235 8024590 8053706 8079989 8104472 8127529 8149255 8169858 8189798 8209684
57158H209684K0270K0726K1150K1674K2106K1859K0741J9372J8222J6722J4061
$$ 8209684 8229954 8250680 8271830 8293504 8315610 8337469 8358210 8377582 8395804 8412526 8426587
57147H426587J0506P008L664m40n796j1877j8239k5244l3070m0778m7034n1426
$$ 8426587 8437093 8444101 8447765 8447325 8441529 8429652 8411413 8386169 8353099 8312321 8265287 8213861
57135H213861n4461n6609n7879n8185n7654n6642n5626n4945n4585n4413n4657
$$ 8213861 8159400 8102791 8044912 7986727 7929073 7872431 7816805 7761860 7707275 7652862 7598205
57124G598205n5795n7971o0958o4639o8917p2959p5266p4717p1103o4539n5296
$$ 7598205 7542410 7484439 7423481 7358842 7289925 7216966 7141700 7066983 6995880 6931341 6876045
57113F876045m4513l4157k5483j7964r997O7J4076L4278O2419R8829J42686J92642
$$ 6876045 6831532 6797375 6771892 6753928 6743931 6743998 6758074 6792352 6854771 6953600 7096286 7288928
57101G288928K47022L04516L65267M30241M98741N67497O32624O90112P30853
$$ 7288928 7535950 7840466 8205733 8635974 9134715 9702212 10334836 11024948 11755801
57092A1755801P33860O66250M95632K12877j45995m97071p36182p83630o14187
$$ 11755801 12489661 13155911 13651543 13864420 13718425 13221354 12485172 11701542 11087355
57083A1087355k55274K30577P55931J215371J509049J579529J432268J123650
$$ 11087355 10832081 11062658 11818589 13033960 14543009 16122538 17554806 18678456
57075A8678456P33803L45541K7782j84025k98599l54187l87913m17151m44140
$$ 18678456 19412259 19757800 19785582 19601557 19302958 18948771 18560858 18143707 17699567
57066A7699567m68813m94190n25399n68593o28878p05712p90502q70162r32649
$$ 17699567 17230754 16736564 16211165 15642572 15013694 14307982 13517480 12647318 11714669
57057A1714669r69425r75758r51574r01602q33214p53998o71076n90795n17356
$$ 11714669 10745244 9769486 8817912 7916310 7083096 6329098 5658022 5067227 4549871
57048D549871m52241l95545l47104l06046k70657k39653k12702j89156j67576
$$ 4549871 4097630 3702085 3354981 3048935 2778278 2538625 2325923 2136767 1969191
57039A969191j47381j29632j15099j02686r0861p9574o9511o0452n1754m3618
$$ 1969191 1821810 1692178 1577079 1474393 1383532 1303958 1234447 1173995 1122241 1078623
57029A078623l6453k9559k1973j4153p307j424M536J0641J5717J9192K1796K4135
$$ 1078623 1042170 1012611 990638 976485 969178 967754 972290 982931 998648 1017840 1039636 1063771
57017A063771K5808K6305K5625K3380J8252R153l520j8139l2793m5639n5008n9898
$$ 1063771 1089579 1115884 1141509 1164889 1183141 1192294 1188774 1170635 1137842 1092203 1037195 977297
57005I77297o0390n7408n2280m6406m0821l5755l1031k6883k3925k2130k0484
$$ 977297 916907 859499 807219 760813 719992 684237 653206 626323 602398 580268 559784
56994E59784j8128j5343j2959j1136r377p567o288n969o179o176n822n567n609
$$ 559784 541656 526313 513354 502218 492841 485274 478986 473017 466838 460662 454840 449273 443664
56981D43664n606n397n562o845r187j1796j4052j5795j6766j6439j4746j2329
$$ 443664 438058 432661 427099 420254 411067 399271 385219 369424 352658 336219 321473 309144
56969C09144r738o832l471k44K130L803N451P108Q129Q243P956P831P976Q412
$$ 309144 299406 292574 289103 288859 290989 294792 300243 307351 315480 323723 331679 339510 347486 355898
56955C55898R207R952R556P119K788k411p310j1031j3126j3695j3211j1943r750
$$ 355898 365105 375057 384613 391732 394520 392109 384799 373768 360642 346947 333736 321793 312043
56942C12043o628l243n14J268K622M168N967P631Q854R673J0287J0813J1269J1688
$$ 312043 305415 302172 301658 302926 305548 309716 315683 323314 332168 341841 352128 362941 374210 385898
56928C85898J1946J1508R536N495l44p062j3537j8701k1727k2489k1787k0626
$$ 385898 397844 409352 418888 424383 424039 416977 403440 384739 363012 340523 318736 298110
56916B98110j9244j7241j4711j2641j1750j1417j0329q117n735m212l591l284
$$ 298110 278866 261625 246914 234273 222523 211106 200777 192660 186925 182713 179122 175838
56904A75838k940k453j586j67J381K409K993L986N871Q029R563J0391J1070J1840
$$ 175838 172898 170445 168859 168692 170073 172482 175475 179461 185332 193361 202924 213315 224385 236225
56890B36225J2506J3033J3602J4073J4013J3416J2848J2641J2365J1298R021N496
$$ 236225 248731 261764 275366 289439 303452 316868 329716 342357 354722 366020 375041 380537
56878C80537J109l080n741o345n545m179k333K91L560P061J0721J4662J8582K1832
$$ 380537 381646 378566 372825 366480 360935 356756 354423 354714 358274 365335 376056 390718 409300 431132
56864D31132K4027K5238K5721K5846K6082K6603K6997K6763K5781K3757J9527
$$ 431132 455159 480397 506118 531964 558046 584649 611646 638409 664190 687947 707474
56853G07474J1892J383r452j7767k2138k2671k0182j5649r903l309M133J2123
$$ 707474 719366 720749 711297 693530 671392 648721 628539 612890 602987 599678 603811 615934
56841F15934J9741K6025L0771L4492L7664M0198M1655M1887M1385M0831M0139
$$ 615934 635675 661700 692471 726963 764627 804825 846480 888367 929752 970583 1010722
56830A010722L8059L2876K3506R913o978k5148m1462n2706n7336n6095n0898m3373
$$ 1010722 1048781 1081657 1105163 1115076 1108098 1082950 1041488 988782 931446 875351 824453 781080
56818G81080l4522k5209j6303q345j329M996J0666J5374J8791K1001K2482K3564
$$ 781080 746558 721349 705046 696701 695372 700368 711034 726408 745199 766200 788682 812246
56806H12246K4090K3720K2242J9176J3414L990q582k2136l4254m3473m9138n0815
$$ 812246 836336 860056 882298 901474 914888 918878 910296 888160 853906 810433 761295 710480
56794G10480m8445m2946l5957k8840k2032j5453r320m350j081Q27K354M085N685
$$ 710480 662035 619089 583132 554292 532260 516807 507487 503137 502056 502883 505237 509322 515007
56781E15007O622P079P677Q314P808M931m80p470j4724k1203k6335k9929l1922
$$ 515007 521629 528708 536385 544699 552507 557438 556958 549488 534764 513561 487226 457297 425375
56768D25375l2241l0896k8205k4783k1351j8616j6948j5929j4531j2212r687q067
$$ 425375 393134 362238 334033 309250 287899 269283 252335 236406 221875 209663 199976 191909
56756A91909p443o955o137n400n035m640l908l259l069k897k167j158o22o77p57
$$ 191909 184466 177511 171374 165974 160939 156299 152391 149132 146063 143166 140999 139841 139219 138542 137785
56741A37785n81m55o14q08o86k39K96O79P84O99P47J099J464J421J037P97R04
$$ 137785 137204 136749 136135 135327 134641 134402 134698 135377 136161 136860 137607 138706 140170 141591 142628 143425 144329
56724A44329J020Q39N91P10J199J604J559J171Q56Q93J186J443J532J597J736
$$ 144329 145349 146188 146779 147489 148688 150292 151851 153022 153878 154771 155957 157400 158932 160529 162265
56709A62265J715J183K50l87p4R75J754J504M96l35n01l76n10q57r67o66k08J33
$$ 162265 163980 165163 165413 165026 164952 165927 167681 169185 169681 169346 168845 168469 167959 167102 166135 165469 165261 165394
56691A65394K99K38q7n12p50q12j033j508j823j493n86L64R25J057R38O75L34
$$ 165394 165693 165931 165844 165332 164582 163770 162737 161229 159406 157913 157327 157691 158616 159673 160611 161286 161620
56674A61620R0J90O69J132J111O70M18P26J231J402J338J516J909J991J659J503
$$ 161620 161710 161900 162569 163701 164812 165482 165900 166626 167857 169259 170597 172113 174022 176013 177672 179175
56658A79175J907K419K391J865J383J191J121J104J319J803K273K404K086J334
$$ 179175 181082 183501 185892 187757 189140 190331 191452 192556 193875 195678 197951 200355 202441 203775
56644B03775K97n83o91J26J148J380O31k83o26o53j016j620j771j445j469k151
$$ 203775 204072 203489 202798 202924 204072 205452 206083 205800 205174 204521 203505 201885 200114 198669 197200 195049
56628A95049k634k217j529j528j973j923j362j086j218j128q53j225k232k628
$$ 195049 192415 190198 188669 187141 185168 183245 181883 180797 179579 178451 177598 176373 174141 171513
56614A71513j766o48l53m30N2P79P05j44o41k53L50M25N4l26n52o13l88J70P94
$$ 171513 169747 169099 168746 168316 168368 169147 169852 169708 169067 168814 169164 169589 169643 169317 168765 168152 167764 167934 168728
56595A68728J103R46N40L48O43J146J287R33N79O33Q95R91R69J093J341J503J580
$$ 168728 169831 170777 171317 171665 172308 173454 174741 175674 176253 176886 177781 178772 179741 180834 182175 183678 185258
56578A85258J685J743J647J518J541J734K129K898L982M920N409N680O042O362
$$ 185258 186943 188686 190333 191851 193392 195126 197255 200153 204135 209055 214464 220144 226186 232548
56564B32548O398O311O414O729P135P654Q161Q223P697P132P013O998O394N084
$$ 232548 238946 245257 251671 258400 265535 273189 281350 289573 297270 304402 311415 318413 324807 329891
56550C29891L422J612j68j408j815j918k376k944k960k560k516l017l581m100
$$ 329891 333313 334925 334757 333349 331534 329616 327240 324296 321336 318776 316260 313243 309662 305562
56536C05562m937n908o198n617m991m935n043m772m303l981l548k688j861j888
$$ 305562 300625 294717 288519 282902 277911 272976 267933 263161 258858 254877 251329 248641 246780 244892
56522B44892k754l506l336k440j686j651k128k487k421k116j814j479j100r30
$$ 244892 242138 238632 235296 232856 231170 229519 227391 224904 222483 220367 218553 217074 215974 215044
56508B15044j042j032n63M2K28Kk51m77q77j300j371j116q60n78j05J92j88q37
$$ 215044 214002 212970 212407 212449 212677 212679 212428 211951 211074 209774 208403 207287 206427 205849 205744 205936 205748 204911
56490B04911p00L70J240J019J94j92J15N77O54K08n35j039q22k9O77R58J146J552
$$ 204911 204211 204581 205821 206840 207034 206842 206957 207534 208188 208396 207861 206822 206000 205971 206648 207606 208752 210304
56472B10304J911J758J057J84l92l93j1Q7m90j210j234o47l05m76n12m9M21M88
$$ 210304 212215 213973 215030 215214 214822 214429 214418 214505 214015 212805 211571 210924 210619 210143 209631 209582 210003 210491
56454B10491M64O63Q01P06Q11J298J493Q63N4M9P44J153Q02J62j30R2N94R32P78
$$ 210491 210955 211618 212419 213125 213936 215234 216727 217590 217644 217693 218437 219590 220392 220554 220424 220516 221110 222042 222820
56435B22820L45K67O93Q99L11n24o53o4L55R9m09n58k32K66N63M82K27K42O36
$$ 222820 223165 223432 224125 225024 225335 224811 224158 224094 224449 224548 224139 223581 223349 223615 224178 224660 224887 225129 225765
56416B25765R59Q43O14P96J213J151L63n87j013p96l10R0M10R31J745K411K293
$$ 225765 226724 227567 228181 228977 230190 231341 231704 231117 230104 229308 228998 229088 229498 230429 232174 234585 236878
56399B36878J343K45l70n09m37j82K63O15O80P19J079J572J657J178O03O21J538
$$ 236878 238221 238466 238096 237587 237150 236968 237231 237846 238526 239245 240324 241896 243553 244731 245334 245955 247493
56382B47493K891L647L129J877J051J018J073P44M77O19O50J55k17L14J291J615
$$ 247493 250384 254031 257160 259037 260088 261106 262179 262923 263400 264019 264669 264824 264607 264921 266212 267827
56366B67827J117N36J90j89m25J18J332K158J989J451J376J670J730J453J240
$$ 267827 268944 269480 269670 269481 269056 269174 270506 272664 274653 276104 277480 279150 280880 282333 283573
56351B83573J350J705K184K641K779K322J468R14J211K117K769K640K145K013
$$ 283573 284923 286628 288812 291453 294232 296554 298022 298936 300147 302264 305033 307673 309818 311831
56337C11831K258K279J948J874K402L062L366L513L703L478K513J599J759K711
$$ 311831 314089 316368 318316 320190 322592 325654 329020 332533 336236 339714 342227 343826 345585 348296
56323C48296L171K646J988K003K389K410J964J476J214J074R14Q35J104J847K749
$$ 348296 351467 354113 356101 358104 360493 362903 364867 366343 367557 368631 369545 370380 371484 373331 376080
56308C76080L283L385L569M137M671M755M765N257N904N849N075M591N101O179
$$ 376080 379363 382748 386317 390454 395125 399880 404645 409902 415806 421655 426730 431321 436422 442601
56294D42601O948O985O449N786N606O322P700R057R973J0516J0801J0858J0953
$$ 442601 449549 456534 462983 468769 474375 480697 488397 497454 507427 517943 528744 539602 550555
56281E50555J1507J2517J3502J4120J4498J4802J5090J5713J7363K0249K3603
$$ 550555 562062 574579 588081 602201 616699 631501 646591 662304 679667 699916 723519
56270G23519K6382K8335L0097L2373L5347L8888M3003M7856N3331N8922O4351
$$ 723519 749901 778236 808333 840706 876053 914941 957944 1005800 1059131 1118053 1182404
56259A182404P0182P7303Q5699R4310J02317J10005J18003J26168J33900J41027
$$ 1182404 1252586 1329889 1415588 1509898 1612215 1722220 1840223 1966391 2100291 2241318
56249B241318J47712J53707J58413J61433J62511J61143J56907J50007J40861
$$ 2241318 2389030 2542737 2701150 2862583 3025094 3186237 3343144 3493151 3634012
56240C634012J29329J15008R8064P9003N7872L4583R948j4524l7924o0261q1405
$$ 3634012 3763341 3878349 3976413 4055416 4113288 4147871 4157819 4143295 4105371 4045110 3963705
56229C963705j00563j16989j30457j40908j48289j52953j55444j55823j53806
$$ 3963705 3863142 3746153 3615696 3474788 3326499 3173546 3018102 2862279 2708473
56220B708473j49762j44714j39261j33185j26297j18895j11213j03238r5360q8295
$$ 2708473 2558711 2413997 2274736 2141551 2015254 1896359 1785146 1681908 1586548 1498253
56210A498253q2060p5838o9315o3293n8416n4097m9410m4402l9789l5829l2244
$$ 1498253 1416193 1340355 1271040 1207747 1149331 1095234 1045824 1001422 961633 925804 893560
56199H93560k8958k6236k4201k2617k1041j8996j6289j3408j1222j0019r198q151
$$ 893560 864602 838366 814165 791548 770507 751511 735222 721814 710592 700573 691375 683224
56187F83224p024o310o133o209o135n502m150k564j527j137p27K4N74N68O77J672
$$ 683224 676200 669890 663757 657548 651413 645911 641761 639197 637670 636533 635806 635830 636404 636972 637649 639321
56171F39321L243M486N153N681O194O377O262O399P113Q174R377J0854J2575J4069
$$ 639321 642564 647050 652203 657884 664078 670455 676717 683116 690229 698403 707780 718634 731209 745278
56157G45278J5055J6128J8213K1423K4959K8268L1827L6351M1679M7100N2596
$$ 745278 760333 776461 794674 816097 841056 869324 901151 937502 979181 1026281 1078877
56146A078877N8887O6064P3187P9595Q5790R2285R8484J03660J08367J13580J18792
$$ 1078877 1137764 1203828 1277015 1356610 1442400 1534685 1633169 1736829 1845196 1958776 2077568
56135B077568J22224J22899J21331J17996J12309J03484R1654P7799O3331M9892
$$ 2077568 2199792 2322691 2444022 2562018 2674327 2777811 2869465 2947264 3010595 3060487
56125C060487L8678K9524K1116J2173K059r587k2761l6588m9649o1062p0693p8574
$$ 3060487 3099165 3128689 3149805 3161978 3164037 3154450 3131689 3095101 3045452 2984390 2913697 2835123
56113B835123q5080r1498r9216j07924j15650j20686j22657j21610j17408j10356
$$ 2835123 2750043 2658545 2559329 2451405 2335755 2215069 2092412 1970802 1853394 1743038
56103A743038j01421r1327q0348o9218n9187n0800m3578l7139l1657k6921k2218
$$ 1743038 1641617 1550290 1469942 1400724 1341537 1290737 1247159 1210020 1178363 1151442 1129224
56092A129224j7487j3542j0700q329o075m282k818q70J517L118L463L663M626
$$ 1129224 1111737 1098195 1087495 1079166 1073091 1068809 1065991 1065121 1066638 1069756 1073219 1076882 1081508
56079A081508N804O546P315Q537R532R790J0072J1125J2303J2672J2539J2763
$$ 1081508 1087312 1093858 1101173 1109710 1119242 1129032 1139104 1150229 1162532 1175204 1187743 1200506
56067A200506J3402J4081J4828J5581J5685J4887J3971J3564J3316J3002J3274
$$ 1200506 1213908 1227989 1242817 1258398 1274083 1288970 1302941 1316505 1329821 1342823 1356097
56056A356097J4379J5302J5285J5013J5230J5458J5347J5944J8134K0881K2556
$$ 1356097 1370476 1385778 1401063 1416076 1431306 1446764 1462111 1478055 1496189 1517070 1539626
56045A539626K3117K3591K4327K5145K6281K7799K8968K9509L0449L2416L4253
$$ 1539626 1562743 1586334 1610661 1635806 1662087 1689886 1718854 1748363 1778812 1811228 1845481
56034A845481L4791L4849L5817L7393L8483L9283M0617M2171M3294M4746M7654
$$ 1845481 1880272 1915121 1950938 1988331 2026814 2066097 2106714 2148885 2192179 2236925 2284579
56023B284579N1397N4326N6105N7655N9445O1405O3843O6846O9521P1276P3046
$$ 2284579 2335976 2390302 2446407 2504062 2563507 2624912 2688755 2755601 2825122 2896398 2969444
56012B969444P5802P9010Q2072Q5842R0958R6077R9900J03531J08660J14773J20557
$$ 2969444 3045246 3124256 3206328 3292170 3383128 3479205 3579105 3682636 3791296 3906069 4026626
56001D026626J26597J34053J41984J48856J55666J64635J75686J87053J98400
$$ 4026626 4153223 4287276 4429260 4578116 4733782 4898417 5074103 5261156 5459556
55992E459556K10473K22719K34377K47116K63439K83055L03860L25671L50050
$$ 5459556 5670029 5892748 6127125 6374241 6637680 6920735 7224595 7550266 7900316
55983G900316L77292M06814M39692M77680N20651N68198O22479O86201P59302
$$ 7900316 8277608 8684422 9124114 9601794 10122445 10690643 11313122 11999323 12758625
55974A2758625Q41452R36386J049941J185543J346217J539392J774970K059854
$$ 12758625 13600077 14536463 15586404 16771947 18118164 19657556 21432526 23492380
55966B3492380K398631K797770L265498L811989M456171N227278O148596P217282
$$ 23492380 25891011 28688781 31954279 35766268 40222439 45449717 51598313 58815595
55958E8815595Q403352R663792J0952205J2222629J3433163J4536472J5457371
$$ 58815595 67218947 76882739 87834944 100057573 113490736 128027208 143484579
55951A43484579J6102588J6426075J6475861J6337985J6037687J5543171J4856197
$$ 143484579 159587167 176013242 192489103 208827088 224864775 240407946 255264143
55944B55264143J3983048J2712014J0471460O589880Q54756o129112j3135032
$$ 255264143 269247191 281959205 292430665 299020545 299875301 293746189 280611157
55937B80611157j8899279k2638575k4214359k3986561k2546409k0477290j8215978
$$ 280611157 261711878 239073303 214858944 190872383 168325974 147848684 129632706
55930A29632706j6025278j4034314j2285756j0767303r440030q265956p219533
$$ 129632706 113607428 99573114 87287358 76520055 67080025 58814069 51594536
55923E1594536o282720n441511m689469m026689l451701k957886k537667k184516
$$ 51594536 45311816 39870305 35180836 31154147 27702446 24744560 22206893 20022377
55915B0022377j889880j642926j434849j260111j113182r87738q79580p86869
$$ 20022377 18132497 16489571 15054722 13794611 12681429 11693691 10814111 10027242
55907A0027242p07053o36543n73569n18398m70535m28286l90880l58321l29374
$$ 10027242 9320189 8683646 8110077 7591679 7121144 6692858 6301978 5943657 5614283
55898E614283l02332k77477k56177k37777k20171k03129j88242j75721j63957
$$ 5614283 5311951 5034474 4778297 4540520 4320349 4117220 3928978 3753257 3589300
55889C589300j52271j41499j31716j21951j12372j04329r7920r1711q5177p9354
$$ 3589300 3437029 3295530 3163814 3041863 2929491 2825162 2727242 2635531 2550354 2471000
55879B471000p4735p0528o6305o2666n9928n7583n5202n2606m9505m6416m5333
$$ 2471000 2396265 2325737 2259432 2196766 2136838 2079255 2024053 1971447 1921942 1875526 1830193
55868A830193m7582n1481n4042n4565n4540n4526n3558n1473m9267m7034m3903
$$ 1830193 1782611 1731130 1677088 1622523 1567983 1513457 1459899 1408426 1359159 1312125 1268222
55857A268222m0322l8024l7249l6207l3848l1050k8441k5226k1135j7499j5358
$$ 1268222 1227900 1189876 1152627 1116420 1082572 1051522 1023081 997855 976720 959221 943863
55846I43863j4179j3439j3771j5321j6572j6168j4751j3822j3688j3675j3523
$$ 943863 929684 916245 902474 887153 870581 854413 839662 825840 812152 798477 784954
55835G84954j3406j3244j2866j2441j2078j1489j0541r571q699p512n902m578
$$ 784954 771548 758304 745438 732997 720919 709430 698889 689318 680619 673107 667205 662627
55823F62627m246m748n365n476m838l776l253l939n077n037l294j013N04J151
$$ 662627 658381 653633 648268 642792 637954 634178 630925 626986 621909 616872 613578 612565 613069 614220
55809F14220J515J867K164K292K063J448R99J248J646J063m70j611j716j910l420
$$ 614220 615735 617602 619766 622058 624121 625569 626568 627816 629462 630525 630055 628444 626728 624818 621398
55794F21398n792p648q594r375j0451j1253j0987r682q219p420p146o459m822
$$ 621398 615606 607958 599364 589989 579538 568285 557298 547616 539397 531977 524831 518372 513550
55781E13550k901j761j576j731j889k269k867l252l149k616j742p71l48q34j568
$$ 513550 510649 508888 507312 505581 503692 501423 498556 495304 492155 489539 487797 487026 486678 485844 484276
55766D84276j777j996l405n873p969r085j0082j1468j2325j1828j0559r414q256
$$ 484276 482499 480503 477098 471225 463256 454171 444089 432621 420296 408468 397909 388495 380239
55753C80239o655n085m303m160l971l663l587l656l502l240l282l606l841l883
$$ 380239 373584 368499 364196 360036 356065 352402 348815 345159 341657 338417 335135 331529 327688 323805
55739C23805l826l518k825k094j820j996k220k258k164k022j965k119k250j864
$$ 323805 319979 316461 313636 311542 309722 307726 305506 303248 301084 299062 297097 294978 292728 290864
55725B90864j069q35j768l027l205k076q12m72r23j330j160n51PJ94J80M50J144
$$ 290864 289795 288960 287192 284165 280960 278884 278072 277600 276677 275347 274187 273636 273643 273837 274017 274467 275611
55708B75611J790J874J472J076R27Q48N71K8o66j281j642j853k233k836l217k899
$$ 275611 277401 279275 280747 281823 282750 283598 284169 284197 283531 282250 280608 278755 276522 273686 270469 267570
55692B67570j951r32l22j66j37J25P16J418K026K667L502M259M392L837L166K879
$$ 267570 265619 264687 264365 264199 264062 264187 264903 266321 268347 271014 274516 278775 283167 287004 290170 293049
55676B93049K891K868K690K389J916J237M74k40q01r82n56K44P43N37m2l36n6
$$ 293049 295940 298808 301498 303887 305803 307040 307514 307274 306473 305491 304935 305179 305922 306459 306417 306081 306025
55659C06025N82J162J333R94L25m73j430k540l394l560l289l314l901m615n094
$$ 306025 306607 307769 309102 310096 310421 309948 308518 305978 302584 299024 295735 292421 288520 283905 278811
55644B78811n429n688n752n778o139o532o025m462l022k814l460l852l641l248
$$ 278811 273382 267694 261942 256164 250025 243493 237468 233006 229984 227170 223710 219858 216217 212969
55630B12969k897k517k299k406k373j597l65M04L16l24j300k513l263k651r85
$$ 212969 210072 207555 205256 202850 200477 198880 198515 198919 199235 198911 197611 195098 191835 189184 188199
55615A88199J20l63j672k418k291j942j713j360q40n49o86r53j086j241j575j809
$$ 188199 188319 187956 186284 183866 181575 179633 177920 176560 175720 175171 174485 173532 172446 171205 169630 167821
55599A67821j521p67j30o7l97n23j76K80M24M46Q80J653J919J187K37K71J301
$$ 167821 166300 165533 165403 165336 164939 164416 164240 164520 164944 165390 166270 167923 169842 171029 171266 171537 172838
55582A72838K097J892J332J319J713J886J961K529L374L601L070K666K878L154
$$ 172838 174935 176827 178159 179478 181191 183077 185038 187567 190941 194542 197612 200278 203156 206310
55568B06310L038K962L271L446L048K610K609K263O26j659k924k606j642q95n19
$$ 206310 209348 212310 215581 219027 222075 224685 227294 229557 230183 228524 225600 222994 221352 220457 219938
55553B19938p59k006l697m414l672k553k135k179j943j376q08k37K95L55k06p30
$$ 219938 219179 217173 213476 209062 205390 202837 200702 198523 196580 195204 194396 194159 194454 194809 194603 193873
55537A93873o37k72k53m79n06m39o66j057j225j373k054l195m039m091l579k981
$$ 193873 193236 192964 192711 192232 191726 191287 190621 189564 188339 186966 184912 181717 177678 173587 170008 167027
55521A67027k570k426k501k596k501k162j637j097q54j084j391j161n07l05r39
$$ 167027 164457 162031 159530 156934 154433 152271 150634 149537 148683 147599 146208 145047 144540 144235 143296
55506A43296j692j813j499j271j033n67l08o82j064n27O20J104N40j12n8K83J65
$$ 143296 141604 139791 138292 137021 135988 135421 135113 134431 133367 132840 133460 134564 135104 134992 134934 135217 135382
55489A35382l67p39o77k68L93J137J560J310N02l42o96l88L03Q88J161J348J568
$$ 135382 135015 134276 133599 133331 133724 134861 136421 137731 138233 137891 137195 136807 137110 137998 139159 140507 142075
55472A42075J478P88k2j35M70R04M96m24j120j351j398j475j486j239o82rL63
$$ 142075 143553 144341 144319 144184 144654 145558 146054 145630 144510 143159 141761 140286 138800 137561 136879 136870 137233
55455A37233Q5p47j547j711j091l3R34J417J288P22Q6k45j47J50L11L06L82N04
$$ 137233 137318 136571 135024 133313 132222 132189 133123 134540 135828 136550 136636 136391 136244 136394 136705 137011 137393 137897
55437A37897J54r12j965k006j086k24K5J68O57J093J030Q21R16R61M42k16j73
$$ 137897 138051 137139 135174 133168 132082 131858 131883 132051 132708 133801 134831 135652 136568 137529 137971 137755 137582
55420A37582M92R00P61P29J232J752J565O43l60p53k87N85J042P56L12L42N40
$$ 137582 138074 138974 139735 140464 141696 143448 145013 145656 145296 144543 144256 144841 145883 146639 146951 147293 147833
55403A47833J98n87j080j180j533k201k254j162K29P84N39L35L52q0j254k366
$$ 147833 148031 147444 146364 145184 143651 141450 139196 138034 138263 139047 139586 139921 140273 140193 138939 136573
55387A36573k351j117L91J175J031M43n7k45q2L70P98P39jj158k257k831k482
$$ 136573 134222 133105 133496 134671 135702 136145 136088 135843 135761 136131 136929 137668 137667 136509 134252 131421 128939
55370A28939j203J59M80k77q62l02Q99J670J784J551Q28n38j690j463j38P36M22
$$ 128939 127736 127895 128375 128098 127236 126934 127833 129503 131287 132838 133666 133128 131438 129975 129837 130573 130995
55353A30995k32l52k14l64n71l27K24N53N08K83M3p1R7L77M10K84N00J037J134
$$ 130995 130763 130411 130197 129833 129262 128935 129159 129712 130220 130503 130546 130475 130572 130949 131359 131643 132143 133180 134314
55334A34314M53k02rO19N93l00j206j391j042p84r01j113r56l48K60L73J39J41
$$ 134314 134767 134565 134556 135175 135768 135468 134262 132871 131829 131045 130144 129031 128075 127727 127987 128360 128499 128640
55316A28640N15P05L19l09o63o96n81l16O2K44J13M4K96M94K51q5R8P11J150J263
$$ 128640 129155 129860 130179 129870 129207 128511 127930 127614 127676 127920 128033 128077 128373 128867 129118 129033 129131 129842 130992 132255
55296A32255J421J637J372M50m83o83j99L64O08N67L21k43j108j783j579l48J092
$$ 132255 133676 135313 136685 137135 136652 135969 135770 136134 136742 137309 137630 137387 136279 134496 132917 132569 133661
55279A33661J616R59Jk90K0R4m52j053j009l83J80L16K85M44P91J104J230J014
$$ 133661 135277 136236 136237 135947 135967 136061 135609 134556 133547 133164 133344 133660 133945 134389 135180 136284 137514 138528
55261A38528K61q41j485r73K95J144R89L69p8m13q04r32n44r7k8L5N63J051O96
$$ 138528 138789 137948 136463 135490 135785 136929 137918 138287 138209 137796 136992 136060 135516 135419 135391 135426 135989 137040 137736
55242A37736j87n05q2J51l09q85j022r53r68q38m02O8M03P60R87O02l07r72j085
$$ 137736 137549 137044 136962 137113 136804 135919 134897 133944 132976 132138 131736 131804 132207 132967 133954 134556 134249 133277 132192
55223A32192j135j236p27M47J134N87k44p6P95J147O89J51r2k59l06O2N99P57
$$ 132192 131057 129821 129094 129541 130675 131262 131018 130942 131737 132884 133573 133724 133632 133373 133067 133129 133728 134485
55205A34485O65Q63J120N47r26k146k147j239l62P1L17O78J130J397J263Q98P32
$$ 134485 135150 136013 137133 137680 136754 134608 132461 131222 130860 130931 131248 131926 133056 134453 135716 136614 137346
55188A37346Q21O44j14q98r13k46K79K49N2J34M22O08N48K66r3k86k28j61l08
$$ 137346 138167 138811 138697 137799 136886 136640 136919 137168 137220 137354 137776 138384 138932 139198 139105 138819 138591 138430 138122
55169A38122n00m73l43l66l98q0M99Q46O65J02n10p98m28M65J166J164Q64R68
$$ 138122 137622 137149 136806 136440 136042 135962 136461 137307 137972 138074 137564 136766 136338 136803 137969 139133 139997 140965
55151A40965J371J259L26p96j317j063m34o9m06j170j428o35N87J241J222J090
$$ 140965 142336 143595 143921 143125 141808 140745 140311 140242 139836 138666 137238 136603 137190 138431 139653 140743
55135A40743R20K81o34r19k10P54J133Q97M60N8j93j41J40L26K49N1j18j95k9
$$ 140743 141663 141944 141310 140391 140181 140935 142068 142965 143425 143483 143290 143149 143289 143615 143864 143915 143797 143602 143573
55116A43573L88O54M22M9O9K31j01o48l70R23K110K324J967J764J678J381R68
$$ 143573 143961 144615 145037 145086 145155 145386 145285 144637 144267 145190 147300 149624 151591 153355 155033 156414 157382
55099A57382N82j6q15j150n78L69R19J014Q99M17n31j312j289p81n16m21Q9Q76
$$ 157382 157964 157948 157133 155983 155405 155774 156693 157707 158606 159023 158492 157180 155891 155110 154594 154173 154262 155138
55081A55138J123N81p0l00k87k78j31K25M83N01N20N78K21p00j366q58N44J504
$$ 155138 156261 156842 156772 156472 156185 155907 155776 156001 156484 156985 157505 158083 158304 157604 156238 155380 155924 157428
55063A57428J183J52m92m38k01j49j35n5j93o94j153j122o68o2O43J246J025m08
$$ 157428 158611 158763 158271 157833 157632 157483 157348 157293 157100 156406 155253 154131 153463 153401 154044 155290 156315 155907
55045A55907k137k705j888q44m38l63j59j15n12q40n13J94O12O31N07K17k63m56
$$ 155907 153770 151065 149177 148333 147895 147532 147373 147258 146746 145906 145393 145587 146199 146830 147337 147554 147291 146835
55027A46835J0O13N68P7N4O64J070P08O2j63L4K24K91M91R69J547J857J651J089
$$ 146835 146845 147458 148026 148103 148157 148821 149891 150599 150661 150498 150532 150756 151047 151538 152507 154054 155911 157562 158651
55008A58651O20M48K65j77m68n7P73J142P71L29L52M80J79l62o18n48m66k60M46
$$ 158651 159271 159719 159984 159807 159339 159282 160055 161197 161968 162297 162649 163129 163308 162946 162328 161780 161314 161054 161500
54989A61500J411J715Q67m13r54m25M47Q30N88J25j85k39j07R0K50M01O39Q71
$$ 161500 162911 164626 165493 165080 164126 163701 164148 164978 165566 165691 165506 165267 165160 165250 165500 165901 166540 167411
54971A67411Q27M47J03K09O81J048J004N75m2n12l95L83J119J002J67m45l82k30
$$ 167411 168238 168685 168788 168997 169678 170726 171730 172305 172263 171751 171356 171739 172858 173860 174027 173582 173200 172970
54953A72970n56r70p58L3P25R42Q48O07K45q3r9K66Q61J562K164K245J614Q58
$$ 172970 172414 171444 170686 170719 171444 172386 173234 173841 174086 174003 173904 174170 175031 176593 178757 181002 182616 183474
54935A83474R14J991L346M224M577M716M724M572M470M663N045N334N565N959
$$ 183474 184388 186379 189725 193949 198526 203242 207966 212538 217008 221671 226716 232050 237615 243574
54921B43574O213N486L434R60o54j304k131l891n849o821o709o287n855n074m051
$$ 243574 249787 255273 258707 259667 259013 257709 255578 251687 245838 239017 232308 226021 220166 215092 211041
54906B11041l584l923m241l824l092k786k723k163j034l0M16N56P86J178J618
$$ 211041 207457 203534 199293 195469 192377 189591 186868 184705 183671 183641 184057 184613 185399 186577 188195
54891A88195J952K065K141K723M075N575O236N805M955M401M243M188L922L267
$$ 188195 190147 192212 194353 197076 201151 206726 212962 218767 223722 228123 232366 236554 240476 243743
54877B43743K333J611J505J658J153m98k763m678n760o186o327o266n878n184
$$ 243743 246076 247687 249192 250850 252003 251505 248742 244064 238304 232118 225791 219525 213647 208463
54863B08463m539m240m119l756l140k721k636k418j769j131j038j276j290j124
$$ 208463 203924 199684 195565 191809 188669 185948 183312 180894 179125 177994 176956 175680 174390 173266
54849A73266j302j850k151j832j231q40p16o17m05j70j41n02j077j373j111o05
$$ 173266 171964 170114 167963 166131 164900 164060 163344 162727 162322 162152 162011 161509 160432 159059 157948 157343
54833A57343k95j98j02l2r7j43RK25M08P74J233J023j84j212o05J238K299J507
$$ 157343 157048 156850 156748 156716 156619 156476 156485 156710 157118 157892 159125 160148 159964 158752 158147 159385 161684 163191
54815A63191m7p52k96N81J232J367R42L47J82M18L72j82n79l10K58O69J025J322
$$ 163191 163144 162392 162096 162677 163909 165276 166218 166565 166747 167165 167537 167355 166776 166466 166724 167393 168418 169740
54797A69740R72j23q72k69J133K010K019J781J537J006M26N28J326J942J883J648
$$ 169740 170712 170589 169717 169448 170581 172591 174610 176391 177928 178934 179360 179888 181214 183156 185039 186687
54781A86687J796K182K466K748L307M102M855N320N330M939M651N026N923O495
$$ 186687 188483 190665 193131 195879 199186 203288 208143 213463 218793 223732 228383 233409 239332 245827
54767B45827O112M907L318J669L28k86l04n62j676l206m192m305m062m042m355
$$ 245827 251939 256846 260164 261833 262161 261875 261571 261009 259333 256127 251935 247630 243568 239526 235171
54752B35171m815n228n360n035m381l790l420k971k108j040l49l08n03l25L63
$$ 235171 230356 225128 219768 214733 210352 206562 203142 200171 198063 197023 196674 196366 195863 195538 195901
54737A95901J209J887K466L137L847M274M144L513K806K545K913L569L965L900
$$ 195901 197110 198997 201463 204600 208447 212721 216865 220378 223184 225729 228642 232211 236176 240076
54723B40076L574L156K536J606N17n63j665k804l771m379m767n118n262m938m377
$$ 240076 243650 246806 249342 250948 251465 250902 249237 246433 242662 238283 233516 228398 223136 218198 213821
54708B13821m149m335m290l473k222j414j451j864j954j627j439j843k533k714
$$ 213821 209672 205337 201047 197574 195352 193938 192487 190623 188669 187042 185603 183760 181227 178513
54694A78513k025r86l54k18k4N46J053Q44j01j119j562j387j009p74p25p11o10
$$ 178513 176488 175502 175148 174930 174906 175452 176505 177349 177248 176129 174567 173180 172171 171397 170672 169961 169351
54677A69351m26k47j94l16m62l89n2L16N12N81O14M62o4p82j232j193q75n56l27
$$ 169351 168925 168678 168484 168168 167706 167317 167265 167581 168093 168674 169288 169750 169686 168904 167672 166479 165604 165048 164721
54658A64721k55m63q58j003n18M54J354J679J293M77k88o79p73p95o93k79K58
$$ 164721 164466 164003 163145 162142 161624 162078 163432 165111 166404 166881 166593 165914 165141 164346 163653 163374 163632
54641A63632M47K55K51P53J271J184O16J33k8JK24O05O25k97j768k553j938n92
$$ 163632 164079 164334 164585 165338 166609 167793 168409 168542 168514 168515 168739 169344 169969 169672 167904 165351 163413 162821
54623A62821K85K74j27l48l14k02n3K65P68J261J466J317R86O34K35k56o67o92
$$ 162821 163106 163380 163253 162905 162591 162389 162336 162601 163369 164630 166096 167413 168399 169033 169268 169012 168345 167653
54605A67653k46M32R98J256J194Q72L36l57j006j268r22j16P22J248J321R22K58
$$ 167653 167407 167839 168837 170093 171287 172159 172495 172138 171132 169864 168942 168826 169548 170796 172117 173039 173297
54588A73297k07j96q7m28r87r59k34K57n9m84j54N89P67K07n28j187j804j909
$$ 173297 173090 172894 172807 172379 171392 170433 170199 170456 170397 169913 169759 170348 171115 171322 170794 169607 167803 165894
54570A65894r67L50O03m62j473j261j72R26J795K382K185J044p0r1O82J055O35
$$ 165894 164927 165277 165880 165418 163945 162684 162512 163438 165233 167615 169800 170844 170774 170683 171365 172420 173055
54553A73055J47K22O74J059J235J170P53Q2m29l70L04J282K061K262K007J789
$$ 173055 173202 173424 174098 175157 176392 177562 178315 178397 177968 177598 177902 179184 181245 183507 185514 187303
54537A87303J727J300K34p56p90j71n8p50j213o82Q9j45j328k174j830p89L2M20
$$ 187303 189030 190330 190564 189808 189018 188847 188789 188039 186826 186144 186233 186088 184760 182586 180756 179967 179999 180419
54519A80419P27R64O69l23j423j831j374n91q2l6l17o67p69l71M29J164J416J151
$$ 180419 181146 182110 182779 182456 181033 179202 177828 177237 177155 177119 176802 176135 175366 174995 175424 176588 178004 179155
54501A79155N65j51p83j027p51k29Q8Nk95n00m20j25N8j20m36l72J65O32O02L79
$$ 179155 179720 179569 178786 177759 177008 176779 176867 176872 176577 176077 175657 175532 175590 175470 175034 174662 174827 175459 176061 176440
54481A76440M64P62P92M50O8j84l65l12K45J044J391J065O57P42J154J376J267
$$ 176440 176904 177666 178458 178908 178976 178792 178427 178115 178360 179404 180795 181860 182517 183259 184413 185789 187056
54464A87056J087J065J154J093N33n71j627j863j221m34m2K12P02J185J175O97
$$ 187056 188143 189208 190362 191455 191988 191417 189790 187927 186706 186272 186230 186442 187144 188329 189504 190201
54448A90201J78j65l80m49l36k02j67p7J59K55L7q1L04P58M79m80j204j170p34
$$ 190201 190379 190214 189834 189385 189049 188847 188680 188603 188762 189017 189054 188973 189277 190035 190514 190034 188830 187660 186926
54429A86926l26Q9M78M05k77r38q56k7J017J795J967J384M30j17K1K22p3n15m79
$$ 186926 186600 186689 187167 187572 187295 186357 185501 185474 186491 188286 190253 191637 192067 191950 191971 192193 192120 191605 191126
54410A91126p2K01L41N85N66k56j449j825j006J85J044J787K623K984K345J222
$$ 191126 191054 191255 191596 192181 192747 192491 191042 189217 188211 188396 189440 191227 193850 196834 199179 200401
54394B00401N69N97P95Q45Q06O53K58k19m59m98o05p36n61r7K58L62N11Q41R96
$$ 200401 200970 201567 202362 203207 204013 204666 204924 204705 204246 203748 203143 202407 201846 201749 202007 202369 202880 203721 204717
54375B04717O76J99J18M99Q95J000R73J001Q56J99o62p49N44K519L805L869L500
$$ 204717 205393 205592 205710 206209 207104 208104 209077 210078 210934 211133 210471 209722 210266 212785 216590 220459 223959
54358B23959L618M108M217L672K852K159J744J731K068K239J708P07L5m3p8m90
$$ 223959 227577 231685 235902 239574 242426 244585 246329 248060 250128 252367 254075 254782 254817 254774 254696 254206
54342B54206r96j289j672k511l483l921l704l268k908k555k121j676j295j066
$$ 254206 253210 251921 250249 247738 244255 240334 236630 233362 230454 227899 225778 224102 222807 221741
54328B21741j169j581j807j399o66m15q41j210q29L3N76M85J29j54n24j295k335
$$ 221741 220572 218991 217184 215785 215119 214704 213863 212653 211824 211857 212433 212918 213047 212893 212369 211074 208739
54311B08739l049k880j858o13J39K10k1j20l3J01L39Q16J245J007l7j088j207
$$ 208739 205690 202810 200952 200339 200478 200688 200667 200547 200514 200615 200954 201770 203015 204022 203985 202897 201690
54294B01690m25L57N58N10O76Q92P42L78K89M60L57j80o15m86j3K81K49J24J69
$$ 201690 201265 201622 202180 202690 203366 204258 205000 205378 205667 206127 206484 206304 205689 205203 205190 205471 205720 205844 206013
54275B06013N58J314K037K018R91l77j079p84nO24Q36O96M77N03Q06Q93K54q80
$$ 206013 206571 207885 209922 211940 212931 212554 211475 210691 210686 211310 212146 212842 213319 213822 214628 215521 215775 214895
54257B14895j628j410m83N39J308J674J452O56k13n11j43L39M00O5k73m13n37
$$ 214895 213267 211857 211374 211913 213221 214895 216347 217003 216790 216279 216136 216475 216875 216940 216667 216254 215717
54240B15717q05r84o99m5K97j73j054j419r47l15l35q80j059l54P38J288R39J56
$$ 215717 214912 213928 213229 213184 213481 213308 212254 210835 209888 209573 209238 208358 207299 206945 207683 208971 209910 210066
54222B10066l51k24M26J190J602J399P71J97r8m04r59j294o27J015K493K712J774
$$ 210066 209715 209491 209917 211107 212709 214108 214879 215076 214978 214574 213615 212321 211694 212709 215202 217914 219688
54205B19688P02J99J21k2m75j173j832k051j628r19n62p04q28n22r7q3l92m38
$$ 219688 220390 220589 220710 220688 220213 219040 217208 215157 213529 212610 212048 211344 210516 209994 209897 209814 209422 208984
54187B08984q8N5m42j068r28j1O65L41m53o57j13L61L13K49O16R12M71l71p24
$$ 208984 208896 208951 208509 207441 206513 206502 207167 207508 207055 206398 206285 206646 206959 207208 207824 208736 209207 208836 208112
54168B08112m93m23q16j076p75l15j48n4K91N34J40o74j158j013n67j31L09P45
$$ 208112 207619 207196 206380 205304 204529 204214 204066 204012 204303 204837 204977 204303 203145 202132 201565 201434 201743 202488
54150B02488J016J079J017Q26M93K41K68L26L7l62j39Q74J861J936J168L54M0
$$ 202488 203504 204583 205600 206426 206919 207160 207428 207754 207791 207429 207290 208164 210025 211961 213129 213483 213523
54133B13523R1P5k18n82o14j17O30J130J204J107J082J043Q39N29K49L3j00k5
$$ 213523 213614 213689 213471 212889 212275 212158 212788 213918 215122 216229 217311 218354 219193 219722 219971 220004 219904 219879
54115B19879K70N73P07P79R10R55P64N86P91J270J455J030L02k55n47p18p20l51
$$ 219879 220149 220722 221429 222208 223118 224073 224837 225423 226214 227484 228939 229969 230271 230016 229469 228751 228031 227680
54097B27680L05P71O94K94J25M01P87R24R85J475K541L703M303M071L332K787
$$ 227680 227985 228756 229450 229744 229869 230270 231057 231981 232966 234441 236982 240685 244988 249059 252391 255178
54081B55178L063M182N482O280O508O488O201N346M122L276L070K854K063J043
$$ 255178 258241 262423 267905 274185 280693 287181 293382 298728 302850 306126 309196 312050 314113 315156
54067C15156K62p27k611m973o574o968o868o807o424n360m019k924k012j139o31
$$ 315156 315418 314691 312080 307107 300533 293565 286697 279890 273466 268106 264087 261163 259151 258012 257381
54052B57381o87p98l56N09J340K088K773K904K193J528K172L889N007M563L467
$$ 257381 256694 255896 255540 256049 257389 259477 262250 265154 267347 268875 271047 274936 279943 284506 287973
54037B87973L035L278L370L179L408M434N759O703P013O736N993N072M391M136
$$ 287973 291008 294286 297656 300835 304243 308677 314436 321139 328152 334888 340881 345953 350344 354480
54023C54480M058L792L245K570K001J810K201K959L363K845J749J053J098J051
$$ 354480 358538 362330 365575 368145 370146 371956 374157 377116 380479 383324 385073 386126 387224 388275
54009C88275J6j605k545k399k140k679l613m030l976m320n409o597p158o980o313
$$ 388275 388291 386686 384141 381742 379602 376923 373310 369280 365304 360984 355575 348978 341820 334840 328527
53994C28527n413m591m053l609k991k524k832l743m220l732k993k844l015k670
$$ 328527 323114 318523 314470 310861 307870 305346 302514 298771 294551 290819 287826 284982 281967 279297
53980B79297j751r57n91k24M29R60P69j83j284j744j258l46P4l31r17r04l34J43
$$ 279297 277546 276589 275998 275774 276203 277163 277932 277749 276465 274721 273463 273117 273191 272860 271943 271039 270705 270848
53962B70848J82m5k86m35m07k53k22k94J26J435K982L751L757L936M568M803M059
$$ 270848 271030 270985 270699 270264 269857 269604 269382 269088 269214 270649 273631 277382 281139 285075 289643 294446 298505
53945B98505L001K516K494K421K579L692N530O854O867O143N833O375P308P940
$$ 298505 301506 304022 306516 308937 311516 315208 320738 327592 334459 340602 346435 352810 360118 368058
53931C68058P981P611P235P202P614Q302Q886Q971Q429P625P210P608Q589R347
$$ 368058 376039 383650 390885 398087 405701 414003 422889 431860 440289 447914 455124 462732 471321 480668
53917D80668R006P271M709K332P16l78j370k116k210j733j207q29l41K18L36j77
$$ 480668 489674 496945 501654 503986 504702 504324 502954 500838 498628 496895 495688 494859 494518 494736 495072 494895
53901D94895q36j285j850k816l729l991l764l635l732l780l846m302n150o050
$$ 494895 494059 492774 490924 488108 484379 480388 476624 472989 469257 465477 461631 457329 452179 446129
53887D46129o889p684q012p309n907n011n294o109o438o148n810n637n230m358
$$ 446129 439240 431556 423544 416235 410328 405317 400023 393914 387476 381328 375518 369881 364651 360293
53873C60293l544l606m700n921o069m832l112k076k063k577l058l248l063k630
$$ 360293 356749 353143 348443 342522 336453 331621 328509 326433 324370 321793 318735 315487 312424 309794
53859C09794k416k783l387l484k856k010j414j135j209j749k423k540j999j509
$$ 309794 307378 304595 301208 297724 294868 292858 291444 290309 289100 287351 284928 282388 280389 278880
53845B78880j481j361o02L01M91P3j04K64O40N47P7n63j287j780j571p36k8J9
$$ 278880 277399 276038 275436 275737 276228 276301 276197 276461 277101 277648 277725 277162 275875 274095 272524 271788 271760 271779
53827B71779l13m49l06k33m30o61m93L62J699K723K591J347P5j72N38J312J642
$$ 271779 271466 271017 270711 270478 270048 269387 268894 269256 270955 273678 276269 277616 277691 277519 278057 279369 281011
53810B81011J926K617L332L299K534K029K538L607M232M200M175M534M863M814
$$ 281011 282937 285554 288886 292185 294719 296748 299286 302893 307125 311325 315500 320034 324897 329711
53796C29711M764N132N566N444M884M525M527M418L906L168K327J301K46m50q03
$$ 329711 334475 339607 345173 350617 355501 360026 364553 368971 372877 376045 378372 379673 379919 379469 378666
53781C78666j222j736j835j402j137j640k585l315l757m225m655m692m370m143
$$ 378666 377444 375708 373873 372471 371334 369694 367109 363794 360037 355812 351157 346465 342095 337952
53767C37952m313m721m963m663l731k625k074k253k605k791l254m233m837m047
$$ 337952 333639 328918 323955 319292 315561 312936 310862 308609 306004 303213 299959 295726 290889 286842
53753B86842k329j220j309j703j631j430j552j612j123m32q2J20O00J043Q58L41
$$ 286842 284513 283293 281984 280281 278650 277220 275668 274056 272933 272501 272419 272539 273139 274182 275040 275381
53737B75381M18J246J906J649P16k32q68j092q32k94M3N8K21Q23J401J387J007
$$ 275381 275799 277045 278951 280600 281316 281084 280216 279124 278292 277998 278041 278099 278320 279143 280544 281931 282938
53720B82938J002J552K038J871J090J40n58o72p4Q95J606J748J576J434J428J645
$$ 282938 283940 285492 287530 289401 290491 290631 290073 289401 289327 290222 291828 293576 295152 296586 298014 299659
53704B99659K304L265L810L494K933L092L893M252L691L064L267L887L788K686
$$ 299659 301963 305228 309038 312532 315465 318557 322450 326702 330393 333457 336724 340611 344399 347085
53690C47085J366N31J61j0k8Q7J55J48K22L78M03K86K98N01O10M82K84No53j548
$$ 347085 348451 348982 349143 349133 349105 349192 349347 349495 349717 350095 350498 350784 351082 351583 352193 352675 352959 352964 352311 350763
53670C50763j878j201k30Q2j87k71JR4j57l39l48o20j201j387p44J80O04N06L45
$$ 350763 348885 347684 347454 347536 347349 347078 347079 347173 347016 346677 346329 345709 344508 343121 342377 342557 343161 343667 344012
53651C44012K91K82M04P04Q47N01j22n93q08p82k77P86J782K045J883K108K638
$$ 344012 344303 344585 344989 345693 346540 347041 346919 346326 345518 344736 344459 345245 347027 349072 350955 353063 355701
53634C55701K454J191j29m46L4M77P55J400K453L213L098K331J660J674K375L207
$$ 355701 358155 359346 359217 358771 358805 359282 360037 361437 363890 367103 370201 372532 374192 375866 378241 381448
53618C81448L526L270K989L077L231L022K657K742L414M217M837N394N949O180
$$ 381448 384974 388244 391233 394310 397541 400563 403220 405962 409376 413593 418430 423824 429773 435953
53604D35953N803M989M234L973M318M887N031M469L725L446L461L065K257J869
$$ 435953 441756 446745 450979 454952 459270 464157 469188 473657 477382 480828 484289 487354 489611 491480
53590D91480K170K171R76p58j571j149o57j141k319l208l268k695j960j473j515
$$ 491480 493650 495821 496797 496039 494468 493319 492662 491521 489202 485994 482726 480031 478071 476598 475083
53575D75083k098k904l425l237k291j149p20j396k435k689j965j185j021r88l49
$$ 475083 472985 470081 466656 463419 461128 459979 459259 457863 455428 452739 450774 449589 448568 447580 447231
53560D47231O19R58M56l1K07Q70J327J591K064K671K821K275J479R51P01M86K76
$$ 447231 447850 448808 449264 449233 449440 450310 451637 453228 455292 457963 460784 463059 464538 465489 466190 466676 466952
53543D66952K00K56L99P81J568K616L576M301M869N287N533N818O433P208P596
$$ 466952 467152 467408 467807 468588 470156 472772 476348 480649 485518 490805 496338 502156 508589 515797 523393
53528E23393P401P099P168P505P812Q239R201J0658J2036J2908J3438J4179J5502
$$ 523393 530794 537893 545061 552566 560378 568617 577818 588476 600512 613420 626858 641037 656539
53515F56539J7204J8514J8697J7836J6920J6918J7891J9182K0192K0745K0923
$$ 656539 673743 692257 710954 728790 745710 762628 780519 799701 819893 840638 861561
53504H61561K0968K1231K1822K2448K2824K3098K3465K3603K3050K2003K1189
$$ 861561 882529 903760 925582 948030 970854 993952 1017417 1041020 1064070 1086073 1107262
53493A107262K0897K0685K0150J9515J9274J9611K0312K0933K1041K0599K0071
$$ 1107262 1128159 1148844 1168994 1188509 1207783 1227394 1247706 1268639 1289680 1310279 1330350
53482A330350J9765J9258J8005J6414J5530J5582J5662J5048J4072J3309J2610
$$ 1330350 1350115 1369373 1387378 1403792 1419322 1434904 1450566 1465614 1479686 1492995 1505605
53471A505605J1482R829P786N352K689K95j610l468n636p709r148j0128j1119
$$ 1505605 1517087 1526916 1534702 1540054 1542743 1543038 1541428 1537960 1532324 1524615 1515467 1505339 1494220
53458A494220j2063j2657j3132j3978j5086j5915j6317j6569j6749j6734j6797
$$ 1494220 1482157 1469500 1456368 1442390 1427304 1411389 1395072 1378503 1361754 1345020 1328223
53447A328223j7403j8419j9105j9007j8305j7235j5791j4144j2804j2089j1756
$$ 1328223 1310820 1292401 1273296 1254289 1235984 1218749 1202958 1188814 1176010 1163921 1152165
53436A152165j1270j0220q546o654n220m498l899k638p10J153K363K951L322M021
$$ 1152165 1140895 1130675 1122129 1115475 1110255 1105757 1101858 1099220 1098510 1099663 1102026 1104977 1108299 1112320
53422A112320N429P314Q924J0019J1334J3370J5266J5946J5950J6817J8757K0400
$$ 1112320 1117749 1125063 1133987 1144006 1155340 1168710 1183976 1199922 1215872 1232689 1251446 1271846
53410A271846K1051K1744K3447K5548K7003K7961K9308L1285L3486L5644L7644
$$ 1271846 1292897 1314641 1338088 1363636 1390639 1418600 1447908 1479193 1512679 1548323 1585967
53399A585967L9171M0135M1043M2320M3705M4946M6472M8634N0780N1938N2099
$$ 1585967 1625138 1665273 1706316 1748636 1792341 1837287 1883759 1932393 1983173 2035111 2087210
53388B087210N1966N1767N1246N0573N0266N0214M9685M8388M6733M4924M2586
$$ 2087210 2139176 2190943 2242189 2292762 2343028 2393242 2442927 2491315 2538048 2582972 2625558
53377B625558L9549L6321L3379L0444K6876K2567J8129J4265J0975P410K701k954
$$ 2625558 2665107 2701428 2734807 2765251 2792127 2814694 2832823 2847088 2858063 2865473 2868174 2865220
53365B865220q284j2374j5708j9460k4021k8832l3352l7446m0947m3564m5366
$$ 2865220 2856936 2844562 2828854 2809394 2785373 2756541 2723189 2685743 2644796 2601232 2555866
53354B555866m6787m7981m8705m8890m8806m8555m7926m6897m5759m4584m3116
$$ 2555866 2509079 2461098 2412393 2363503 2314697 2266142 2218216 2171319 2125560 2080976 2037860
53343B037860m1348l9704l8431l7333l6368l5897l5942l5685l4297l1968k9584
$$ 2037860 1996512 1956808 1918377 1881044 1844676 1808779 1772837 1737152 1702855 1670887 1641303
53332A641303k7608k5811k3951k2163k0643j9392j8377j7593j6862j5860j4532
$$ 1641303 1613695 1587884 1563933 1541770 1521127 1501735 1483358 1465765 1448903 1433043 1418511
53321A418511j3249j2399j1940j1584j1267j1180j1342j1393j0915r821q297o630
$$ 1418511 1405262 1392863 1380923 1369339 1358072 1346892 1335550 1324157 1313242 1303421 1295124 1288494
53309A288494n227m465m205l640k175k66J143K032L318N340P149P960Q525J0188
$$ 1288494 1283267 1278802 1274597 1270957 1268782 1268516 1269659 1271691 1275009 1280349 1287498 1295458 1303983 1314171
53295A314171J2932J5336J6442J6749J7257J8261J9395K0346K1046K1503K1767
$$ 1314171 1327103 1342439 1358881 1375630 1392887 1411148 1430543 1450889 1471935 1493438 1515205
53284A515205K1905K1882K1537K0729J9384J7497J5329J3395J1921J0390Q109
$$ 1515205 1537110 1558992 1580529 1601258 1620642 1638139 1653468 1666863 1678784 1689174 1697283
53273A697283N169K421M24j106k760m766p087r677j2447j5220j7866k0251k2015
$$ 1697283 1702452 1704873 1705297 1704191 1701431 1696665 1689578 1679901 1667454 1652234 1634368 1614117 1592102
53260A592102k2832k2941k3157k4096k5642k7191k8132k8126k7351k6551k6389
$$ 1592102 1569270 1546329 1523172 1499076 1473434 1446243 1418111 1389985 1362634 1336083 1309694
53249A309694k6628k6441k5647k5098k5562k6590k7008k6171k4464k2771k1793
$$ 1309694 1283066 1256625 1230978 1205880 1180318 1153728 1126720 1100549 1076085 1053314 1031521
53238A031521k1636k1815k1699k1106k0382j9789j9169j8250j7033j5699j4433
$$ 1031521 1009885 988070 966371 945265 924883 905094 885925 867675 850642 834943 820510
53227H20510j3485j2996j2669j1968j0901j0171j0259j0788j1177j1503j2170
$$ 820510 807025 794029 781360 769392 758491 748320 738061 727273 716096 704593 692423
53216F92423j2955j3025j2002j0579r883j0405j1628j2628j2908j2631j2140j1515
$$ 692423 679468 666443 654441 643862 633979 623574 611946 599318 586410 573779 561639 550124
53204E50124j0753j0069r647r276q671q039p723p482o815n990n913o757p608p764
$$ 550124 539371 529302 519655 510379 501708 493669 485946 478464 471649 465659 459746 452989 445381 437617
53190D37617p573p519p364o748n923n151m154k916k298k852l673l544k817k836
$$ 437617 430044 422525 415161 408413 402490 397339 393185 390269 387971 385119 381446 377902 375085 372249
53176C72249l750m240l512k301j598j489j652k006k339k156j474j119j621k401
$$ 372249 368499 364259 360747 358446 356848 355359 353707 351701 349362 347206 345732 344613 342992 340591
53162C40591k618k286j923j608j090m98k41l82o84j146j851k415k245j459r71
$$ 340591 337973 335687 333764 332156 331066 330568 330327 329945 329261 328115 326264 323849 321604 320145 319174
53147C19174j391k211k388j483k2J069J234O59J08K43J001J681J789J557J413
$$ 319174 317783 315572 313184 311701 311679 312748 313982 314641 314749 314992 315993 317674 319463 321020 322433
53132C22433J193L81q28j380n94Q32J611J426J103J312J722J696J216P84O76O83
$$ 322433 323626 324007 323179 321799 321205 322037 323648 325074 326177 327489 329211 330907 332123 332907 333583 334266
53116C34266M30k86j248j847j608q49m12o24r29q72q50j404k202k380j699p88
$$ 334266 334696 334410 333162 331315 329707 328858 328446 327822 326893 326021 325171 323767 321565 319185 317486 316698
53100C16698l14m19q58j203j010k65M65O42M39L44L27L5m10m60k2M18N76O45O85
$$ 316698 316384 315965 315107 313904 312894 312629 313094 313736 314175 314519 314846 314881 314471 314011 313989 314407 314983 315628 316313
53081C16313M02k14o67o38m04l43m38n15n62n34k89O7J37k06n90o78n55l72m9
$$ 316313 316715 316501 315834 315196 314792 314449 314011 313496 312934 312400 312111 312178 312315 312109 311519 310841 310286 309914 309865
53062C09865L77N53K64k36o49j003j296j248p74l07k33k51J80R31J305R34K29
$$ 309865 310242 310795 311059 310823 310174 309171 307875 306627 305853 305546 305313 305062 305242 306173 307478 308412 308641
53045C08641j85r9K39N09P10J065J582J780J187P1p58r67j042j368j529r54J01
$$ 308641 308456 308357 308596 309105 309815 310880 312462 314242 315429 315500 314742 313775 312733 311365 309836 308882 308983
53028C08983P75O43R0k63j42L39R08J322J553J707J703J311O35K49N14J114J511
$$ 308983 309758 310401 310491 310228 310086 310425 311333 312655 314208 315915 317618 318929 319564 319813 320327 321441 322952
53011C22952J598J530J258O64k3m49n75m83QR37J575J014n09j546j046M56J531
$$ 322952 324550 326080 327338 328002 327979 327530 326955 326472 326480 327417 328992 330006 329497 327951 326905 327361 328892
52994C28892J376L38p58j302j085k63O96J265J288J075J018J124J082Q14P15J163
$$ 328892 330268 330606 329848 328546 327461 327198 327894 329159 330447 331522 332540 333664 334746 335560 336275 337438
52978C37438J948K523K715K742K603K010J141P70J249J812J565P56L51O09P70
$$ 337438 339386 341909 344624 347366 349969 351979 353120 353890 355139 356951 358516 359272 359623 360232 361002
52963C61002K37p27j551j978j954j456p60l95n25p46q00j043j860k911l464l288
$$ 361002 361239 360512 358961 356983 355029 353573 352813 352418 351893 351147 350347 349304 347444 344533 341069 337781
52947C37781k831k536k379k053j365l47Q28J894K578K655K033Q15n89j599j855
$$ 337781 334950 332414 330035 327982 326617 326270 327098 328992 331570 334225 336258 337073 336484 334885 333030
52932C33030j488r45n97n55p55j039j134q09j25M72O05M27M92R86J378J024M4
$$ 333030 331542 330597 330000 329445 328690 327651 326517 325708 325583 326055 326660 327087 327579 328565 329943 330967 331011
52915C31011p71r13o72n33n05l03O5L20L55K42q6q08j723k218j850q52P6M21L07
$$ 331011 330240 329327 328655 328122 327617 327314 327379 327699 328054 328296 328210 327402 325679 323461 321611 320759 320835 321256 321563
52896C21563L30R09J679J845J184M48L58N88K98n28r73n32J81L67Q5q5pn3m09
$$ 321563 321893 322802 324481 326326 327510 327958 328316 328904 329202 328674 327701 327169 327350 327717 327802 327717 327710 327657 327248
52877C27248q15r07n64J02P71J069R16P03Q45J265J519J451J353J546J952K183
$$ 327248 326433 325526 324962 325064 325835 326904 327820 328523 329368 330633 332152 333603 334956 336502 338454 340637
52861C40637J923J205M22j6j08k64p59j401j878k225k610k885k782k511k615l122
$$ 340637 342560 343765 344187 344171 344063 343799 343040 341639 339761 337536 334926 332041 329259 326748 324133 321011
52845C21011l309k666j659j184j498k066k303k027j308l55M15N51lq37j445j466
$$ 321011 317702 315036 313377 312193 310695 308629 306326 304299 302991 302636 303051 303602 303599 302762 301317 299851
52829B99851p73K91Q52L43n74n84M75J220O05n11n60N86J673J997J976J848J071
$$ 299851 299078 299369 300221 300564 299990 299406 299881 301101 301706 301195 300635 301221 302894 304891 306867 308715 309786
52812C09786m18j493j199l2Q86J282J541J603J063J35m64o12q60j428j853j871
$$ 309786 309368 307875 306676 306644 307530 308812 310353 311956 313019 313154 312690 312078 311218 309790 307937 306066
52796C06066j834k017k071j580p42o3L00N37P26O89L36j04k37J03N78P03M83M35
$$ 306066 304232 302215 300144 298564 297822 297759 298059 298596 299322 300011 300347 300243 300006 300109 300687 301390 301873 302308
52778C02308P84J007O10m6k48%J11k0J15O52J046R47O06K29l43r45r34k14K48
$$ 302308 303092 304099 304709 304663 304415 304415 304526 304506 304621 305273 306319 307266 307872 308101 307758 306813 305879 305665 305913
52759C05913l12j269j420o02L26Q52J308J939K301J845P22k57l63M17J296J388
$$ 305913 305601 304332 302912 302310 302636 303488 304796 306735 309036 310881 311603 311346 310983 311400 312696 314084
52743C14084O50m0N9O77J023Q90P69J063J630K103K187J721Q74K48L45Q91J116
$$ 314084 314734 314694 314753 315430 316453 317343 318112 319175 320805 322908 325095 326816 327690 327938 328283 329174 330290
52726C30290P61L52M19Q10R91P14J51l93p16q20q80j003j080r89q66r00r37o48
$$ 330290 331051 331403 331822 332632 333623 334337 334488 334095 333379 332559 331679 330676 329596 328607 327741 326841 325904 325256
52708C25256r6K50J72k7mJ78K87K91K72K09R5J04L62O81P28L33l79j081j329q30
$$ 325256 325160 325410 325582 325555 325551 325729 326016 326307 326579 326788 326883 326987 327349 328030 328758 329091 328712 327631 326302 325472
52688C25472J74R67J047O34L05K71K93K29K47M49N64K86k75o85p10n44n00o02
$$ 325472 325646 326613 327660 328294 328599 328870 329163 329392 329639 330088 330652 330938 330663 329978 329268 328724 328224 327622
52670C27622o08l55P0M56O80P38P06O67O48N79L63N3j55j66p5k8o0j24j75o8L93
$$ 327622 327014 326659 326729 327185 327865 328603 329309 329976 330624 331203 331566 331619 331464 331298 331223 331195 331135 331011 330836 330768 331161
52649C31161J181J891K114J872J517J276J038O51K09J3K67Q39J302J308R49N90
$$ 331161 332342 334233 336347 338219 339736 341012 342050 342701 342910 342923 343190 344029 345331 346639 347588 348178
52633C48178L77J35j85m07o16j246k268k721j789p1R09M69o31j389j611j557j304
$$ 348178 348555 348690 348505 348098 347482 346236 343968 341247 339458 339387 340296 340765 340134 338745 337134 335577 334273
52616C34273q89o10o97j022j424j909k172j525J30J709K034J291O40N88N71J83
$$ 334273 333384 332774 332077 331055 329631 327722 325550 324025 324155 325864 327898 329189 329829 330417 330988 331171
52600C31171p8L17J040J347J045N44K26K29N90J174J580J520J159Q08M20j42n60
$$ 331171 331093 331410 332450 333797 334842 335386 335612 335841 336431 337605 339185 340705 341864 342672 343092 342950 342390
52583C42390l25L45N40j61j059j289r21o09m76q2O14J038Q53M15J18j54n56p92
$$ 342390 342065 342410 342950 342789 341730 340441 339520 338911 338435 338353 338967 340005 340858 341273 341391 341237 340681 339889
52565C39889n72k06k67q02j397j774j885j569o66M95J271J405J192Q70L07o02
$$ 339889 339317 339111 338844 338042 336645 334871 332986 331417 330751 331246 332517 333922 335114 335984 336291 335689
52549C35689j579k120j852p96M91J171R59N29O50J072R23J15m81l70n6p7k23j78
$$ 335689 334110 331990 330138 329342 329833 331004 331963 332492 333142 334214 335137 335252 334771 334401 334345 334268 334045 333867
52531C33867j44k47o8O07J215J289J290J759K267K171J855K105K599K306J293
$$ 333867 333723 333476 333408 334015 335230 336519 337809 339568 341835 344006 345861 347966 350565 352871 354164
52516C54164P73J278J997K296K592L181L323K377J036M72P55R35L57q08k022k757
$$ 354164 354937 356215 358212 360508 363100 366281 369604 371981 373017 373489 374244 375179 375536 374728 372706 369949
52500C69949k658j960j493j758k248k215j789j612j719j545j004o89q66r56l98
$$ 369949 367291 365331 363838 362080 359832 357617 355828 354216 352497 350952 349948 349259 348393 347437 347039
52485C47039N95J389J627J284M99k95m63J67R78J270J190J515K497L391L311K336
$$ 347039 347634 349023 350650 351934 352433 352138 351675 351842 352820 354090 355280 356795 359292 362683 365994 368330
52469C68330J428J273J559J531J039O37P57J178J460J531J526J253L06j338l139
$$ 368330 369758 371031 372590 374121 375160 375797 376554 377732 379192 380723 382249 383502 383808 382470 379331
52454C79331m440m968m900m578m189l645k872k192k080k405k356j503n48m44j059
$$ 379331 374891 369923 365023 360445 356256 352611 349739 347547 345467 343062 340706 339203 338655 338211 337152
52439C37152j383r67l75j12O1M44P26N04k3l94n31n73m29L1N11N93L29P3q9k47
$$ 337152 335769 334802 334427 334315 334376 334820 335546 336050 336027 335633 335102 334529 334100 334131 334642 335235 335564 335637 335548 335301
52419C35301k04L57J223J840K155K718L710M476M401L865L785M433N139N228M817
$$ 335301 335097 335454 336677 338517 340672 343390 347100 351576 355977 359842 363627 368060 373199 378427 383244
52404C83244M525M629M777M590M261M239M391L907K335L11j221k230l441m946
$$ 383244 387769 392398 397175 401765 406026 410265 414656 418563 420898 421209 419988 417758 414317 409371
52390D09371n796n250l837k692k239k054j728j241o46L4N80P87R05J408K199K594
$$ 409371 403575 398325 394488 391796 389557 387503 385775 384534 383888 383922 384502 385289 386194 387602 389801 392395
52374C92395K258J746J785K365K897K993K734K318J852J403R91M96j62q14j147
$$ 392395 394653 396399 398184 400549 403446 406439 409173 411491 413343 414746 415737 416233 416071 415257 414110
52359D14110r98l70O15J584J890J221J71k13L78J191J376R44N06M92R57J814K825
$$ 414110 413112 412742 413357 414941 416831 418052 418223 418010 418388 419579 420955 421899 422405 422897 423854 425668 428493
52342D28493L433L220K558K379L088M050M438M241M158M603N304N833O168O550
$$ 428493 431926 435146 437704 440083 443171 447221 451659 455900 460058 464661 469965 475798 481966 488516
52328D88516P080P722Q521R524J0504J1020J0880J0356R900R725R732R687R464
$$ 488516 495596 503318 511839 521363 531867 542887 553767 564123 574023 583748 593480 603167 612631
52315F12631R223R432J0413J1898J3214J4115J5022J6209J7162J7332J7159J7593
$$ 612631 621854 631286 641699 653597 666811 680926 695948 712157 729319 746651 763810 781403
52303G81403J8680J9466J9498J9469J9956K0335J9763J8568J7735J7312J6389
$$ 781403 800083 819549 839047 858516 878472 898807 918570 937138 954873 972185 988574
52292I88574J4641J2866J1688J0631R049P268O133N762N407M504L320K439K065
$$ 988574 1003215 1016081 1027769 1038400 1047449 1054717 1060850 1066612 1072019 1076523 1079843 1082282 1084347
52279A084347J932J706J286Q20M78K20k09r44j687j855j209k11L81M05N16J369
$$ 1084347 1086279 1087985 1089271 1090091 1090569 1090789 1090580 1089636 1087949 1086094 1084885 1084674 1085055 1085460 1085976 1087345
52263A087345K697L626L849L979M598N520O370P312Q620R929J0611J0770J1100
$$ 1087345 1090042 1093668 1097517 1101496 1106094 1111614 1117984 1125296 1133916 1143845 1154456 1165226 1176326
52250A176326J1828J2468J2616J2325J1671J0646R571Q934Q649Q155P327O567
$$ 1176326 1188154 1200622 1213238 1225563 1237234 1247880 1257451 1266385 1275034 1283189 1290516 1297083
52238A297083N888M824L480K642K439J880L89j217k086k708l928n340n940n820
$$ 1297083 1302971 1307795 1311275 1313917 1316356 1318236 1318625 1317408 1315322 1312614 1308686 1303346 1297406 1291586
52224A291586n974o725p548q217q909r321q886p916p396p487p370o710o114n919
$$ 1291586 1285612 1278887 1271339 1263122 1254213 1244892 1236006 1228090 1220694 1213207 1205837 1199127 1193013 1187094
52210A187094n629m945m287l771k798j244j20k11q42p36M13J972L354M297M612
$$ 1187094 1181465 1176520 1172233 1168462 1165664 1164420 1164300 1164089 1163247 1162511 1162924 1164896 1168250 1172547 1177159
52195A177159M429M361M856N578N906N613M667K956P23j189k225k773l368l717
$$ 1177159 1181588 1185949 1190805 1196383 1202289 1207902 1212569 1215525 1216248 1215059 1212834 1210061 1206693 1202976
52181A202976l345k737k905l992n164n747n781n482m986m549m361m143l524k787
$$ 1202976 1199631 1196894 1193989 1189997 1184833 1179086 1173305 1167823 1162837 1158288 1153927 1149784 1146260 1143473
52167A143473k537k633k240j060J75O85N10J72K7K11P58J427J739J443O94k04
$$ 1143473 1140936 1138303 1136063 1135003 1135178 1135863 1136373 1136545 1136572 1136783 1137541 1138968 1140707 1142150 1142844 1142640
52151A142640r93j375j211q93r56j219q10O34K338L295L411L304L307L195K786
$$ 1142640 1141647 1140272 1139061 1138168 1137212 1135993 1135183 1135817 1138155 1141450 1144861 1148165 1151472 1154667 1157453
52136A157453K329K166K425L080M047N085N821O160O563P595R150J0445J0995
$$ 1157453 1159782 1161948 1164373 1167453 1171500 1176585 1182406 1188566 1195129 1202724 1211874 1222319 1233314
52123A233314J1329J2270J3683J4557J4374J3806J3729J4137J4486J4629J4830
$$ 1233314 1244643 1256913 1270596 1285153 1299527 1313333 1327062 1341199 1355685 1370314 1385144
$$ [...]
##END NTUPLES=NMR SPECTRUM
##END=
