##TITLE=AC1645_HPIAH13378_8569767_NZvJ1gqTjF
##JCAMPDX= 6.0         $$ Bruker NMR JCAMP-DX V2.0
##DATA TYPE= NMR SPECTRUM
##DATA CLASS= NTUPLES
##ORIGIN= BRUKER
##OWNER= Administrator
$$ 1.72 TOPSPIN		Version 2.1
$$ 2014-04-10 23:12:30.970 -0700  Administrator@X
$$ Compression mode = diff/dup
##.OBSERVE FREQUENCY= 400.02188249412
##.OBSERVE NUCLEUS= ^1H
##.ACQUISITION MODE= SIMULTANEOUS (DQD)
##.ACQUISITION SCHEME= undefined
##.AVERAGES= 8
##.DIGITISER RES= 22
##SPECTROMETER/DATA SYSTEM= spect
##.PULSE SEQUENCE= zg30
##.SOLVENT NAME= COFFEE_meoh
##.SHIFT REFERENCE= INTERNAL, COFFEE_meoh, 1, 14.98509
##AUDIT TRAIL= $$ (NUMBER, WHEN, WHO, WHERE, PROCESS, VERSION, WHAT)
$$ ##TITLE= Audit trail, TOPSPIN		Version 2.1
$$ ##JCAMPDX= 5.01
$$ ##ORIGIN= Bruker BioSpin GmbH
$$ ##OWNER= Administrator
$$ $$ E:\/data/COFFEE/nmr/AC1645_HPIAH13378_8569767_NZvJ1gqTjF/10/pdata/1/auditp.txt
$$ ##AUDIT TRAIL=  $$ (NUMBER, WHEN, WHO, WHERE, PROCESS, VERSION, WHAT)
(   1,<2014-04-10 23:12:23.127 -0700>,<Administrator>,<X>,<go>,<TOPSPIN 2.1>,
      <created by zg
	started at 2014-04-10 23:11:16.861 -0700,
	POWCHK enabled, PULCHK disabled,
       configuration hash MD5:
       C8 4E 4E 5D D3 5C D8 9E 9F 52 82 E0 59 8A DE 15
       data hash MD5: 64K
       AC 3B 94 56 F6 7E 28 F8 AD C2 9A EB F7 DA 48 39>)
(   2,<2014-04-10 23:12:26.361 -0700>,<Administrator>,<X>,<proc1d>,<TOPSPIN 2.1>,
      <Start of raw data processing
       efp LB = 0 FT_mod = 6 PKNL = 1 PHC0 = 0 PHC1 = 0 SI = 32K 
       data hash MD5: 32K
       76 0B 42 9C 1A E7 C8 EB 25 43 B6 83 4E C6 E7 58>)
(   3,<2014-04-10 23:12:26.720 -0700>,<Administrator>,<X>,<proc1d>,<TOPSPIN 2.1>,
      <pk PHC0 = 95.44373 PHC1 = 0 
       data hash MD5: 32K
       48 67 6B 89 D0 9A 3A AB E1 41 E8 D1 49 CB 4F A4>)
(   4,<2014-04-10 23:12:26.939 -0700>,<Administrator>,<X>,<proc1d>,<TOPSPIN 2.1>,
      <abs ABSG = 1 
       data hash MD5: 32K
       6F 9C 36 3B 36 7D 9E 97 CF E8 A9 09 A0 11 E8 78>)
(   5,<2014-04-10 23:12:27.142 -0700>,<Administrator>,<X>,<proc1d>,<TOPSPIN 2.1>,
      <abs ABSG = 2 
       data hash MD5: 32K
       35 6D DD 64 90 6A EB 49 FE 2F 8F 8A 9E FB 91 DE>)
(   6,<2014-04-10 23:12:27.330 -0700>,<Administrator>,<X>,<proc1d>,<TOPSPIN 2.1>,
      <abs ABSG = 3 
       data hash MD5: 32K
       18 10 22 92 10 E4 6D 31 4E 0A B9 3C 83 6B E2 53>)
(   7,<2014-04-10 23:12:27.455 -0700>,<Administrator>,<X>,<proc1d>,<TOPSPIN 2.1>,
      <abs ABSG = 4 
       data hash MD5: 32K
       61 1A 22 DC DB 1A D0 09 85 D7 BF 09 88 91 A6 6E>)
(   8,<2014-04-10 23:12:27.548 -0700>,<Administrator>,<X>,<proc1d>,<TOPSPIN 2.1>,
      <abs ABSG = 5 
       data hash MD5: 32K
       25 CB 23 8D 70 B2 27 7C 93 1B E9 6C 7B 0E B6 59>)
$$ ##END=
$$ 
$$ $$ hash MD5
$$ $$ 97 3A 12 EA EE A9 53 07 59 D0 05 4F 2F D5 E6 DD
##$RELAX= 
##$RELAX= 
##$RELAX= 
##$RELAX= 
##$RELAX= 
##$RELAX= 
##$RELAX= 
$$ Bruker specific parameters
$$ --------------------------
##$DU= <E:\>
##$EXPNO= 10
##$NAME= <AC1645_HPIAH13378_8569767_NZvJ1gqTjF>
$$ [...]
150 150 150 150 150 150 150 150
##$TP07= 0
##$TPNAME0= <>
##$TPNAME1= <>
##$TPNAME2= <>
##$TPNAME3= <>
##$TPNAME4= <>
##$TPNAME5= <>
##$TPNAME6= <>
##$TPNAME7= <>
##$TPOAL= (0..7)
0.5 0.5 0.5 0.5 0.5 0.5 0.5 0.5
##$TPOFFS= (0..7)
0 0 0 0 0 0 0 0
##$TUNHIN= 0
##$TUNHOUT= 0
##$TUNXOUT= 0
##$USERA1= <user>
##$USERA2= <user>
##$USERA3= <user>
##$USERA4= <user>
##$USERA5= <user>
##$V9= 5
##$VALIST= <valist>
##$VCLIST= <CCCCCCCCCCCCCCC>
##$VD= 0
##$VDLIST= <DDDDDDDDDDDDDDD>
##$VPLIST= <PPPPPPPPPPPPPPP>
##$VTLIST= <TTTTTTTTTTTTTTT>
##$WBST= 1024
##$WBSW= 4
##$XGAIN= (0..3)
0 0 0 0
##$XL= 0
##$YL= 0
##$YMAX_a= 645841
##$YMIN_a= -548325
##$ZGOPTNS= <>
##$ZL1= 120
##$ZL2= 120
##$ZL3= 120
##$ZL4= 120
##$ABSF1= 14.98509
##$ABSF2= -5.573092
##$ABSG= 5
##$ABSL= 3
##$ALPHA= 0
##$AQORDER= 0
##$ASSFAC= 0
##$ASSFACI= 0
##$ASSFACX= 0
##$ASSWID= 0
##$AUNMP= <proc_prof1d_extract_pilot.lims>
##$AXLEFT= 0
##$AXNAME= <>
##$AXNUC= <1H>
##$AXRIGHT= 0
##$AXTYPE= 0
##$AXUNIT= <>
##$AZFE= 0.1
##$AZFW= 0.1
##$BCFW= 0
##$BC_mod= 0
##$BYTORDP= 0
##$COROFFS= 0
##$CY= 15
##$DATMOD= 1
##$DC= 0
##$DFILT= <>
##$DTYPP= 0
##$F1P= 0
##$F2P= 0
##$FCOR= 0.5
##$FTSIZE= 32768
##$FT_mod= 6
##$GAMMA= 0
##$GB= 0
##$INTBC= 1
##$INTSCL= 1
##$ISEN= 128
##$LB= 0
##$LEV0= 0
##$LPBIN= 0
##$MAXI= 10000
##$MC2= 0
##$MEAN= 0
##$ME_mod= 0
##$MI= 0
##$NCOEF= 0
##$NC_proc= -8
##$NLEV= 6
##$NOISF1= 0
##$NOISF2= 0
##$NSP= 0
##$NTH_PI= 0
##$NZP= 0
##$OFFSET= 14.98509
##$PC= 1
##$PHC0= 95.44373
##$PHC1= 0
##$PH_mod= 1
##$PKNL= yes
##$PPARMOD= 0
##$PPDIAG= 0
##$PPIPTYP= 0
##$PPMPNUM= 2147483647
##$PPRESOL= 1
##$PSCAL= 4
##$PSIGN= 0
##$PYNMP= <proc.py>
##$REVERSE= no
##$SF= 400.02
##$SI= 32768
##$SIGF1= 0
##$SIGF2= 0
##$SINO= 400
##$SIOLD= 32768
##$SPECTYP= <>
##$SREGLST= <1H.CDCl3>
##$SSB= 0
##$STSI= 32768
##$STSR= 0
##$SW_p= 8223.68421052631
##$SYMM= 0
##$S_DEV= 0
##$TDeff= 65536
##$TDoff= 0
##$TI= <>
##$TILT= no
##$TM1= 0
##$TM2= 0
##$TOPLEV= 0
##$USERP1= <user>
##$USERP2= <user>
##$USERP3= <user>
##$USERP4= <user>
##$USERP5= <user>
##$WDW= 1
##$XDIM= 32768
##$YMAX_p= 456096981
##$YMIN_p= -715869
##$CURPLOT= <Network HP LaserJet P1505>
##$CURPRIN= <$Network HP LaserJet P1505>
##$DFORMAT= <normdp>
##$LAYOUT= <+/1D_H.xwp>
##$LFORMAT= <normlp>
##$PFORMAT= <normpl>
##$SURQMSG= 1
$$ End of Bruker specific parameters
$$ ---------------------------------
##NTUPLES= NMR SPECTRUM
##VAR_NAME=  FREQUENCY,     SPECTRUM/REAL,   SPECTRUM/IMAG
##SYMBOL=    X,             R,               I
##VAR_TYPE=  INDEPENDENT,   DEPENDENT,       DEPENDENT
##VAR_FORM=  AFFN,          ASDF,            ASDF
##VAR_DIM=   32768,         32768,           32768
##UNITS=     HZ,            ARBITRARY UNITS, ARBITRARY UNITS
##FACTOR=    0.250966925370066, 1,           1
##FIRST=     8223.43324360094, -2205,        -164225
##LAST=      0,             -96935,          -83851
##MIN=       0,             -715869,         0
##MAX=       8223.43324360094, 456096981,    0
$$ Real data points
##PAGE= N=1
##DATA TABLE= (X++(R..R)), XYDATA
$$ [...]
19532A09270b72907a8769I3332a17699F9925b32729g913l12296G8g7799j68657
$$ 109270 -272907 -18769 93332 -117699 69925 -232729 -7913 -320209 78 -77799 -246456
19521b46456A36404b307k28997P0029D816J60264d8836B7017h5083j65874O955
$$ -246456 136404 -2307 -231304 -161275 4816 165080 -48836 27017 -85083 -250957 -244002
19510b44002J9897A28573k3269l8347C511K5028f2592A08583J43624j07356a73752
$$ -244002 -224105 128573 105304 66957 3511 28539 -62592 108583 252207 144851 -173752
19498b17369C8453K31924j07466p6418K96706a25625M7798A96574b03377L3035
$$ -217369 38453 270377 162911 86493 383199 -125625 -77827 196574 -203377 -170342
19488a70342b1478B19512a19356k43185c2650A2569a11178e2292o6576A51739
$$ -170342 -21478 219512 -119356 -362541 -32650 12569 -111178 -52292 -118868 151739
19477a61057H2338d3940p6085k8221l1470A51022Q3666h2491j65802h802j13244
$$ -161057 82338 -43940 -120025 -148246 -179716 151022 234688 -82491 -248293 -8802 -122046
19466a22046l28505M9495J02383J42849L5547A57226b025p7209I6412a41847p375
$$ -122046 -450551 -401056 -298673 -155824 -120277 157226 -2025 -79234 96412 -141847 -149222
19455a49222A41225N7793b02084f2646A36394b29537h5992b3031m7410C4904c66561
$$ -149222 141225 199018 -202084 -62646 136394 -229537 -85992 -23031 -70441 34904 -366561
19443C00492O6123A47854a15097A951a16305I3557n790m2139a63776F0435b69265
$$ 300492 366615 147854 -115097 1951 -116305 93557 87767 45628 -163776 60435 -269265
19431G366a86450o3055a17383C07128A29660K17106A32593I827c96610A80132
$$ 7366 -186450 -249505 -117383 307128 129660 346766 132593 9827 -396610 180132
19420G0037a16791e7985o3193D3616b59835j77881K06539d740H0326a05986A34454
$$ 70037 -116791 -57985 -121178 43616 -259835 -437716 -231177 -4740 80326 -105986 134454
19408d54114b4048A24276a79535k49636J09148d892q7754j4106j6298b3061H7911
$$ -454114 -24048 124276 -179535 -429171 -320023 -4892 -92646 -106752 -123050 -23061 87911
19396c15623b1550h948k36657g1537B14845a18055j9651l64286g5423l499F2907
$$ -315623 -21550 -8948 -245605 -71537 214845 -118055 -137706 -501992 -75423 -78922 62907
19384b28569P3223m1243F7790R3957a06486A62437c9981B2109c3231A39224a54670
$$ -228569 -155346 -196589 67790 161747 -106486 162437 -39981 22109 -33231 139224 -154670
19372B65296A30685e396j7979A09847c41469E0350b19759g5310J5500n4323d5796
$$ 265296 130685 -5396 -23375 109847 -341469 50350 -219759 -75310 -59810 -114133 -45796
19360b43922a69k64j76558f4842k50024b4469l7491A57931f8900G4833g1180j20684
$$ -243922 -169 -433 -176991 -64842 -314866 -24469 -61960 157931 -68900 74833 -71180 -191864
19348a91864J85D891J37229h979k58275i8797B17277m3048n5181d34136a34820
$$ -191864 -191679 4891 142120 -8979 -267254 -98797 217277 174229 119048 -434136 -134820
19336g4064j04814j02488K4183G2877a47485B3932b05930H9431a12159k00486
$$ -74064 -178878 -281366 -257183 72877 -147485 23932 -205930 89431 -112159 -312645
19326c12645D5539a63930b5624j8980G8431a23304p3179b0836F4231a98218A09196
$$ -312645 45539 -163930 -25624 -44604 78431 -123304 -196483 -20836 64231 -198218 109196
19314A25337J07851O9742h8293A57948d9303B04170a78782Q513j5628A15004a36946
$$ 125337 233188 302930 -88293 157948 -49303 204170 -178782 -170269 -185897 115004 -136946
19302d5626E5845b46681J22476d5305j70223d1111j0587j4006F7700J23094n6776
$$ -45626 55845 -246681 -124205 -45305 -215528 -41111 -51698 -65704 67700 190794 134018
19291A34018a24209r5464I4885b20255A38487b0859B5968i048j02628b9714B09972
$$ 134018 -124209 -219673 94885 -220255 138487 -20859 25968 -9048 -111676 -29714 209972
19279I6914i2966b5853B8649a71738L0193c0101D0357J53084c1933k23562K6518
$$ 96914 -92966 -25853 28649 -171738 -141545 -30101 40357 193441 -31933 -255495 -228977
19268b28977e9026n5556k94487L1705a3195k05110b8999A7053J14168e8168C01604
$$ -228977 -59026 -114582 -409069 -377364 -13195 -218305 -28999 17053 131221 -58168 301604
19256g8895m19829A84908b83764b214A81024C1403N2993d00784J44059B20491
$$ -78895 -498724 184908 -283764 -2214 181024 31403 84396 -400784 -256725 220491
19245F1924N4779a36177Q200A32638E9741c4469r1477L034k86532d0782H2531
$$ 61924 116703 -136177 -127977 132638 59741 -34469 -125946 -122912 -409444 -40782 82531
19233a2084B4989c17030A07581a17496K2789j2293A4612a0066k04442A21956e5106
$$ -12084 24989 -317030 107581 -117496 -94707 -107000 14612 -10066 -214508 121956 -55106
19221I9448c16749B54618c30753p3166J6533a73520D1122R1497a95685j45748
$$ 99448 -316749 254618 -330753 -403919 -387386 -173520 41122 132619 -195685 -341433
19211c41433b6715p435B3382K1226a29640j47512B23326k5634b42772K333J00554
$$ -341433 -26715 -34150 23382 44608 -129640 -277152 223326 197692 -242772 -240439 -139885
19200a39885k6180O7216B66106b2783F0668b9985p8097k20366M3506H7626C1882
$$ -139885 -166065 -98849 266106 -22783 60668 -29985 -108082 -328448 -284942 87626 31882
19188A4859b47914J23009M2078C7830O2350a09523D5614A5987J01781l1789b90
$$ 14859 -247914 -124905 -82827 37830 100180 -109523 45614 15987 117768 85979 -290
19176a06686d7742o7319l5090j57977f9494B152a82926h7904I6450a6743I7738
$$ -106686 -47742 -115061 -150151 -308128 -69494 2152 -182926 -87904 96450 -16743 97738
19164C22010f67928e7120G3354f8043p0063A492a78981J9439r4719A1751a50069
$$ 322010 -667928 -57120 73354 -68043 -138106 1492 -178981 -159542 -254261 11751 -150069
19152a23923m68364A32258A3461O2772J40769f4044E518J27686R6111a14066p8530
$$ -123923 -592287 132258 13461 76233 217002 -64044 5518 133204 229315 -114066 -192596
19141a92596O1872h05j98665D8269b05858P218f0873n0891C3085c78655a03877
$$ -192596 -130724 -805 -199470 48269 -205858 -198640 -60873 -111764 33085 -378655 -103877
19129A67878i75H6555c15753M7759a28524A65734k5411a03921A0172d8992M495
$$ 167878 -975 86555 -315753 -267994 -128524 165734 140323 -103921 10172 -48992 -44497
19118d4497k80204C07807a19512d3938A59466a17979D6508K58867c8385k048J3181
$$ -44497 -324701 307807 -119512 -43938 159466 -117979 46508 305375 -38385 -40433 -27252
19107b7252I4685Q2517a92589l7757A5908J70061b34850B59850b23240A57532
$$ -27252 94685 177202 -192589 -230346 15908 185969 -234850 259850 -223240 157532
19096a48005n1819j33106g1476k3507b4767B87232d00988g3845j45439J00144
$$ -148005 -199824 -332930 -71476 -94983 -24767 287232 -400988 -73845 -219284 -119140
19086a19140j72668D6243a75521A23808a08454j64082B6572a10242j35331D90169
$$ -119140 -291808 46243 -175521 123808 -108454 -272536 26572 -110242 -245573 490169
19075C28836A3976b8901A55708a29208A68415D1816a62035d9400j78428l9920
$$ 328836 13976 -28901 155708 -129208 168415 41816 -162035 -49400 -227828 -267748
19065b67748C6551b38700A74847E9256a4944k00613q8186C4524c99253a32247
$$ -267748 36551 -238700 174847 59256 -14944 -215557 -303743 34524 -399253 -132247
19054f0237B19529e3018E1114b7572A33543h0544A29435J59589d0978j64201H9631
$$ -60237 219529 -53018 51114 -27572 133543 -80544 129435 289024 -40978 -205179 89631
19042A14627d55002d9660B84824b374A73975b05627K2776G3074i8136b6370B4154
$$ 114627 -455002 -49660 284824 -2374 173975 -205627 -182851 73074 -98136 -26370 24154
19030D8118K41158A4297O3173J03722H530J54069a58285g3781l23979B33230f0777
$$ 48118 289276 14297 77470 181192 8530 162599 -158285 -73781 -397760 233230 -60777
19018A79653a74839A4983J23670b48967a3179p7266b1087B6078J63165b12773
$$ 179653 -174839 14983 138653 -248967 -13179 -90445 -21087 26078 189243 -212773
19007d4871A09606a84070j19261R7132A85133b40989f8447k48215A38504i1375
$$ -44871 109606 -184070 -303331 -206199 185133 -240989 -68447 -316662 138504 -91375
18996A87822f9101F4110a83811f6822n2430p3804m4476K4284J01325A47971C189
$$ 187822 -69101 64110 -183811 -66822 -119252 -193056 -237532 -213248 -111923 147971 3189
18984h1674l89124d9867A78889H602f4794A82985M8604a22268J8940H2202B56
$$ -81674 -470798 -49867 178889 8602 -64794 182985 231589 -122268 -103328 82202 256
18972a92251j06949A44472C0533b85940B79335J44780i1048L4714A16551c37751
$$ -192251 -299200 144472 30533 -285940 279335 424115 -91048 -56334 116551 -337751
18961a65368A80333E8590L1639g9907E4298J04325b43755D5564g6499m4843A61148
$$ -165368 180333 58590 90229 -79907 54298 158623 -243755 45564 -76499 -121342 161148
18949E6535e1959A77954h2791i098r9943d4064B38743e3266j32447M5630A26656
$$ 56535 -51959 177954 -82791 -9098 -109041 -44064 238743 -53266 -185713 -140083 126656
18937I619a80641H504J22103b84404b5059l80902L1404A67880n853G4763R9555
$$ 9619 -180641 8504 130607 -284404 -25059 -405961 -374557 167880 162027 74763 174318
18926A74318a54493n0346F2860b73750A34391L6250B0217R5910a24698e999C5798
$$ 174318 -154493 -204839 62860 -273750 134391 170641 20217 116127 -124698 -5999 35798
18914B30956b8042k90330J23182A25324J550O4523B4405J00758a89707b730k47485
$$ 230956 -28042 -318372 -195190 125324 126874 191397 24405 125163 -189707 -2730 -250215
18903b50215B7146b98575A7018K610K08744J5417b1041A31328e5136k96668a5223
$$ -250215 27146 -298575 17018 19628 228372 243789 -21041 131328 -55136 -351804 -15223
18891c05730G401Q4485a79809D6623b58364E9334d8229j34741K3895g8512j74400
$$ -305730 7401 91886 -179809 46623 -258364 59334 -48229 -182970 -159075 -78512 -252912
18880b52912A11264a18170A7422J64060c76246F6483J81443a8493C3045Q2805
$$ -252912 111264 -118170 17422 181482 -376246 66483 247926 -18493 33045 115850
18870A15850a58157m6846q8852A67110d06026C7282d7815k539o7806j09083g1635
$$ 115850 -158157 -205003 -293855 167110 -406026 37282 -47815 -50354 -118160 -227243 -71635
18858i7881g005j38883j7581A56848b5846m25222A97574B7267d0659a5983F3746
$$ -97881 -7005 -145888 -163469 156848 -25846 -451068 197574 27267 -40659 -15983 63746
18846a34711k37565B15258k5039j7419b10146c2573k7975l40782B3891L9889b75353
$$ -134711 -372276 215258 190219 172800 -210146 -32573 -60548 -401330 23891 63780 -275353
18834a54552p8057k49624a45118K9991J9180A99593J8914b71404C472O0963i0470
$$ -154552 -232609 -482233 -145118 -115127 -95947 199593 218507 -271404 3472 64435 -90470
18822B4368N2270d13843A74482a15029C09269e9653B04902H7810n586b0231D5815
$$ 24368 76638 -413843 174482 -115029 309269 -59653 204902 87810 82224 -20231 45815
18810C39849A18521M1328G0671K4801b36348E4064a20867C4769O4826a25969D6311
$$ 339849 118521 159849 70671 95472 -236348 54064 -120867 34769 99595 -125969 46311
18798e2358j57270O7243j59544E297i6559c4658l06183Q883J30733Q8072b152
$$ -52358 -209628 -142385 -301929 5297 -96559 -34658 -340841 -331958 -201225 -113153 -2152
18786A67711F4799a99021k57261K14607p6035R2496k84256a49497j98462B7344
$$ 167711 64799 -199021 -456282 -241675 -317710 -225214 -509470 -149497 -347959 27344
18775G6720a78023l4650B2220J86215a85057O1053A48925C4637K34139h927j25454
$$ 76720 -178023 -212673 22220 208435 -185057 -124004 148925 34637 268776 -8927 -134381
18764a34381H7638b06859f1670B8013H228O215P6679e796l71214C3060J71703
$$ -134381 87638 -206859 -61670 28013 8228 14443 91122 -5796 -377010 33060 204763
18753B04763a45207k24284g9505k75816a16816j94171A42211b08093E0408L7863
$$ 204763 -145207 -369491 -79505 -355321 -116816 -310987 142211 -208093 50408 88271
18743H8271C7670c58305a5076j26431k41330C87461b85444J05613b3052p6379
$$ 88271 37670 -358305 -15076 -141507 -382837 387461 -285444 -179831 -23052 -99431
18733i9431J3200D23294b51294A6029c65684A76886B3587a57532M4718A07902
$$ -99431 -86231 423294 -251294 16029 -365684 176886 23587 -157532 -112814 107902
18722c77498J85202C25590j13390r5731b80092a9118k44396B00900n9210b28522
$$ -377498 -192296 325590 212200 116469 -280092 -19118 -263514 200900 141690 -228522
18711d33170a27900M9004H5407Q0690a57110B43658p3618i6327b6838p771j36975
$$ -433170 -127900 -78896 85407 166097 -157110 243658 170040 -96327 -26838 -34609 -171584
18700a71584g3583l7546n2898j01084a5316j73441P3789E3658e32860f8600A12583
$$ -171584 -73583 -111129 -164027 -265111 -15316 -188757 -114968 53658 -532860 -68600 112583
18688f3529j89669a04565k13675E9161a958k18350A04894L4126C7017b3477l54371
$$ -63529 -253198 -104565 -318240 59161 -1958 -220308 104894 139020 37017 -23477 -377848
18677c77848J28988I0973I966b48086B3621b10175i0904k0747K2481j29971e659
$$ -377848 -248860 90973 9966 -248086 23621 -210175 -90904 -111651 -89170 -219141 -5659
18665A09091b25788g7914c3790j30769H7956G975b10123f9992j88904D04453A32832
$$ 109091 -225788 -77914 -33790 -164559 87956 7975 -210123 -69992 -258896 404453 132832
18653b19737A41069n5936d62106c4037j62778A4227c6062j83390B16172b67628
$$ -219737 141069 85133 -462106 -34037 -196815 14227 -36062 -219452 216172 -267628
18642c31499D3257J01346a97512a7316j21852B3553b15354B06595c0068C11867
$$ -331499 43257 144603 -197512 -17316 -139168 23553 -215354 206595 -30068 311867
18631c4775o1114G916c4222A2200a77074n8473i5864A83968q2633A15K024J04460
$$ -34775 -95889 7916 -34222 12200 -177074 -235547 -95864 183968 101335 115 2139 106599
18619A06599a80321a5650B23282a89508j25695H2632b11534M8856I4180j6134
$$ 106599 -180321 -15650 223282 -189508 -315203 82632 -211534 -162678 94180 78046
18609G8046c8153E557c37670a66061A453K09360h9170j05899H3467B3235a72621
$$ 78046 -38153 5557 -337670 -166061 1453 210813 -89170 -195069 83467 23235 -172621
18597g6398k07303a3873k2358j02563b897A24023C5356b29152e8892j74383e7594
$$ -76398 -283701 -13873 -36231 -138794 -2897 124023 35356 -229152 -58892 -233275 -57594
18585a55905m1902P1000j30757A47049c386A54833o6097K15416I5304C6247a37158
$$ -155905 -197807 -126807 -257564 147049 -3386 154833 88736 304152 95304 36247 -137158
18573a45763A18649C9367a11981B20663d9258j06203a8733l3819j36324D162K30548
$$ -145763 118649 39367 -111981 220663 -49258 -155461 -18733 -52552 -188876 4162 234710
18562B34710F5845J44046c9662j97676c5800A7855c0418J3959F2813d01893a79815
$$ 234710 65845 209891 -39662 -237338 -35800 17855 -30418 -16459 62813 -401893 -179815
18550b42870A1688L4772c9786r431D5679a43793H316a27336d3301k9983j8746
$$ -242870 11688 46460 -39786 -49217 45679 -143793 8316 -127336 -43301 -73284 -92030
18539i2030C4274J72246E8624J4403Q6971J37206f9781A18012J19302a63411b6270
$$ -92030 34274 206520 58624 73027 159998 297204 -69781 118012 237314 -163411 -26270
18527A75324J01592b44117G5721a00194D8877N000c23526F3678f1863p2688M970
$$ 175324 276916 -244117 75721 -100194 48877 53877 -323526 63678 -61863 -134551 -129581
18516a29581j29219g2605G0561a1344n5207n9515B56866d1103l4586A82242c13681
$$ -129581 -258800 -72605 70561 -11344 -66551 -126066 256866 -41103 -75689 182242 -313681
18504a56846l4098c2138m9093A81562a38021B80855E9420a45180c0510A37036
$$ -156846 -190944 -32138 -81231 181562 -138021 280855 59420 -145180 -30510 137036
18493b01679B10241a01905m6195e2111l5147F4993c21981c3569k45509A03601
$$ -201679 210241 -101905 -148100 -52111 -87258 64993 -321981 -33569 -279078 103601
18482A0409J3219c90028c1356E6605J75942F1306a34225A76413k1657c23370g256
$$ 10409 23628 -390028 -31356 56605 232547 61306 -134225 176413 154756 -323370 -7256
18470B82575a85796L408f9263F1684J2532J13499b2908l2796j6741J4683F2875
$$ 282575 -185796 -182388 -69263 61684 74216 187715 -22908 -55704 -72445 -57762 62875
18458I5445O942c02748a12020o106K3714c1342C1698b35293j0389P4635a2644
$$ 95445 102387 -302748 -112020 -118126 -94412 -31342 31698 -235293 -245682 -171047 -12644
18446C8684a89270c5758j09483O4423j21374A22632B0754e2862A13757g0514D0484
$$ 38684 -189270 -35758 -145241 -80818 -202192 122632 20754 -52862 113757 -70514 40484
18434A06882J9020o1727a68408D7678K85453a63173j44831k5874J34082L1598
$$ 106882 125902 64175 -168408 47678 333131 -163173 -308004 -333878 -199796 -168198
18424a68198c5057A93057a20478a5911p115A79718a29765c490j02023B54577d7382
$$ -168198 -35057 193057 -120478 -15911 -23026 179718 -129765 -3490 -105513 254577 -47382
18412b13197h9508m4122A07951a19828o589B3273i8715A12132c1769I6313a38757
$$ -213197 -89508 -133630 107951 -119828 -126417 23273 -98715 112132 -31769 96313 -138757
18400a48906k06865J43023I2451B5854c09887J52749p5626M3138P2437J2335L6879
$$ -148906 -355771 -212748 92451 25854 -309887 -157138 -232764 -189626 -117189 -104854 -67975
18389f7975l1955l05403B6870c7493j55074D3248a32389q7233A16263i5998G0618
$$ -67975 -99930 -405333 26870 -37493 -192567 43248 -132389 -219622 116263 -95998 70618
18377a05168k69450g6014l03590B93812b67593A23896a90515A09706h718j47510
$$ -105168 -374618 -76014 -379604 293812 -267593 123896 -190515 109706 -8718 -156228
18367a56228d5005j00410M6142L3525b5175j4725C10787j54300J43441a61896
$$ -156228 -45005 -145415 -99273 -65748 -25175 -39900 310787 156487 299928 -161896
18356b78695D6577a52151C02335l6092B6699i4790j05001c9929j63201K5518J1783
$$ -278695 46577 -152151 302335 266243 26699 -94790 -199791 -39929 -203130 -177612 -165829
18345a65829B5453h1926o9544B18740c03281c3105B52300q8115C2196M2880d21889
$$ -165829 25453 -81926 -151470 218740 -303281 -33105 252300 164185 32196 75076 -421889
18333A76003b35630e8728A07898B0828J38387b939k29554B82659c72163J39884
$$ 176003 -235630 -58728 107898 20828 159215 -2939 -232493 282659 -372163 -232279
18323b32279L5897A45608g4474A14074b42545l459B04975B6521a07825k33761
$$ -232279 -196382 145608 -74474 114074 -242545 -246004 204975 26521 -107825 -341586
18313c41586B2321J9073a81331B33290a56330c3624j66923D8983a38432j51868
$$ -341586 22321 41394 -181331 233290 -156330 -33624 -200547 48983 -138432 -290300
18303b90300J11642N5229d3813C2989a58515N5991j57457b5490A1603a57818j00795
$$ -290300 -178658 -123429 -43813 32989 -158515 -102524 -259981 -25490 11603 -157818 -258613
18292b58613o9580a7166E7675A5549M030b5893l3986b7348K355q4466A04999e95
$$ -258613 -328193 -17166 57675 15549 19579 -25893 -59879 -27348 -24993 -109459 104999 -595
18279b3103j12368j6390O4811j06281J1550A82935a3362B71714a94399A81209
$$ -23103 -135471 -151861 -87050 -193331 -181781 182935 -13362 271714 -194399 181209
18268I156a6475A48252b17190q6547b2149j83473g6661j13847e3865G0370A7482
$$ 9156 -16475 148252 -217190 -303737 -22149 -205622 -76661 -190508 -53865 70370 17482
18256C70182A03496a17662b1182B91695a47936j33989A91902n379J64381a68657
$$ 370182 103496 -117662 -21182 291695 -147936 -281925 191902 186523 350904 -168657
18245A14388P2517e35211F1436J0502d83977B04391J5468a26118j32528G4995
$$ 114388 186905 -535211 61436 71938 -483977 204391 219859 -126118 -258646 74995
18234a29474k14572B07411H2001l5061b73593A5524K4175a76594p2616L0921G8887
$$ -129474 -344046 207411 82001 46940 -273593 15524 39699 -176594 -249210 -218289 78887
18222C9987a12701I8721i9957F5334J42583C273i9682K5454O209O040b1235D0483
$$ 39987 -112701 98721 -99957 65334 207917 3273 -99682 -74228 -68019 -61979 -21235 40483
18209b18166e7358H219b68300B34927C5550b60641k0231A9953f284g25k67313
$$ -218166 -57358 8219 -268300 234927 35550 -260641 -280872 19953 -6284 -725 -268038
18198b68038A68355A615J57533a0192k40328B98304i9289L2539D402c23964A8569
$$ -268038 168355 1615 159148 -10192 -250520 298304 -99289 -66750 4402 -323964 18569
18186a18455A95549o8004a04681q4514A99523a94614e0973F1485N8481F257M42110
$$ -118455 195549 127545 -104681 -189195 199523 -194614 -50973 61485 119966 6257 448367
18175D48367A52482j396a30216C6049K3059a09191r2608d9011K4396A03407d47505
$$ 448367 152482 151086 -130216 36049 59108 -109191 -201799 -49011 -24615 103407 -447505
18163a12199j60066e8051E8291a00910Q088E8426a46500A37706b23131B1618K08162
$$ -112199 -272265 -58051 58291 -100910 -92822 58426 -146500 137706 -223131 21618 229780
18152B29780A1J82186A096Q3816B7954a31923l64725K37725B7705K50317H5570
$$ 229780 11 182197 1096 84912 27954 -131923 -496648 -258923 27705 278022 85570
18140i5766B08480a15729B67304a97046B35464h2921F7878e6545o2846k15194
$$ -95766 208480 -115729 267304 -197046 235464 -82921 67878 -56545 -119391 -334585
18130c34585M8887a37909K8015d456j4061j12355I7989m2529A0752a18803A00012
$$ -334585 -285698 -137909 -109894 -4456 -18517 -130872 97989 55460 10752 -118803 100012
18118a81729B64115a18213G3109c6797j20220B82416d5069B26152b14928A31150
$$ -181729 264115 -118213 73109 -36797 -157017 282416 -45069 226152 -214928 131150
18107A15511K1174N6417a09029b287m4566n6876A59364A7703f7802A93650a80600
$$ 115511 136685 193102 -109029 -2287 -46853 -103729 159364 17703 -67802 193650 -180600
18095D3258J79110F9861c8945r1690L1634E7246a48840a0171r1322r4361A0211
$$ 43258 222368 69861 -38945 -130635 -99001 57246 -148840 -10171 -101493 -195854 10211
18083a97782B45911A05200i4974j4661B48151a87583D9060a42441A8949J12462
$$ -197782 245911 105200 -94974 -109635 248151 -187583 49060 -142441 18949 131411
18073A31411c51764d7118B43465M7870b79613a08799J4947k27943j85347A15519
$$ 131411 -351764 -47118 243465 291335 -279613 -108799 -93852 -321795 -507142 115519
18062a669l00240J10102l926p501a3682A53351o9829J37828f9928k0583j54007
$$ -1669 -301909 -191807 -195733 -203234 -13682 153351 83522 221350 -69928 -90511 -244518
18051b44518l0537a00358k96975A43129h4630E3562Q770J68256G0364R5276b81396
$$ -244518 -275055 -100358 -397333 143129 -84630 53562 62332 230588 70364 165640 -281396
18039C01575b43710A37051b22393A03492J54162i1796b7129m6954C0385J70402
$$ 301575 -243710 137051 -222393 103492 257654 -91796 -27129 -74083 30385 200787
18029B00787n5262K41583A12061B7461g172B31517D6312d5992A41910g7962k21694
$$ 200787 145525 387108 112061 27461 -7172 231517 46312 -45992 141910 -77962 -299656
18018b99656e7204j9870A36862g6572D2566f2761I6673a68109a2783A93098b0894
$$ -299656 -57204 -77074 136862 -76572 42566 -62761 96673 -168109 -12783 193098 -20894
18006a26502A7856e0692J746H9914K55663A30718a7902B85471b92259A64078n1343
$$ -126502 17856 -50692 -48946 89914 345577 130718 -17902 285471 -292259 164078 112735
17995A12735a41944I6408b09391A59146b24646b203G4384h1932n8364k2130n8612
$$ 112735 -141944 96408 -209391 159146 -224646 -2203 74384 -81932 -140296 -162426 -221038
17984b21038k4381O3426M4302j735j13885A83281l6150C1702h6641j66638J08336
$$ -221038 -245419 -181993 -137691 -139426 -253311 183281 147131 31702 -86641 -253279 -144943
17973a44943o9032e6595B57489g5411A18132A318c1565b004A10489J16759d023
$$ -144943 -213975 -56595 257489 -75411 118132 1318 -31565 -2004 110489 227248 -4023
17961g0405C1688c97095A1785K58303a94963k0093A32675a67788P4013B02835
$$ -70405 31688 -397095 11785 270088 -194963 -215056 132675 -167788 -93775 202835
17950A15865a96661C24451N4672A17858a91490B3113b07272A76335P198H7640
$$ 115865 -196661 324451 379123 117858 -191490 23113 -207272 176335 183533 87640
17939b24683Q9912Q752B08820a42867M6415A61573p1959a62768q5197A40219J09472
$$ -224683 -134771 -126019 208820 -142867 -96452 161573 89614 -162768 -247965 140219 249691
17928B49691D8137L4392b15609A65648D3303e4844E8322c11425e0573j82478J04345
$$ 249691 48137 82529 -215609 165648 43303 -54844 58322 -311425 -50573 -233051 -128706
17917a28706A49950a09813a9837A467a16940A92911a54754F5967f4365e12H9903
$$ -128706 149950 -109813 -19837 1467 -116940 192911 -154754 65967 -64365 -512 89903
17905a16512C370b42660B28159b35328P7001A72319i9824D338a34789a9346A41234
$$ -116512 3370 -242660 228159 -235328 -158327 172319 -99824 4338 -134789 -19346 141234
17893b60012m7378B33307a63403b9041B20429E886c05210g1395m19715D0067b28351
$$ -260012 -307390 233307 -163403 -29041 220429 5886 -305210 -71395 -491110 40067 -228351
17881d3130a6119A64404a60700C35434a57683m1461M9473b6540A23051L5108P9849
$$ -43130 -16119 164404 -160700 335434 -157683 -199144 -149671 -26540 123051 158159 238008
17870B38008d48745B63i5787B37655o9981L20769d6651l4841H4300e7533I0672
$$ 238008 -448745 263 -95787 237655 167674 488443 -46651 -81492 84300 -57533 90672
17858C14160j17382a54404n5133A16968l7438a94267A55497A3948J01183a74602
$$ 314160 196778 -154404 -209537 116968 79530 -194267 155497 13948 115131 -174602
17847A82668J60555a28983D86153a05219l0019K5902q8561j01808I7435L36198
$$ 182668 343223 -128983 486153 -105219 -135238 -109336 -197897 -299705 97435 433633
17837D33633E0698j2037a04935C659a85661j57547B21346j02270a23404E3232
$$ 433633 50698 38661 -104935 3659 -185661 -343208 221346 119076 -123404 53232
17826B02064a81830G7925f4833A5622b0732k09877J15171A78212a5719C2188i5652
$$ 202064 -181830 77925 -64833 15622 -20732 -230609 -115438 178212 -15719 32188 -95652
17814A11194j0611d646C4555a28052J0937d7300j9372m3895A96902a86815i80
$$ 111194 100583 -4646 34555 -128052 -117115 -47300 -66672 -110567 196902 -186815 -980
17802f019q7218L5931k43710f5606q3364B17380p887F6840C20L84589H5237J7396
$$ -6019 -93237 -57306 -301016 -65606 -148970 217380 209493 66840 320 384909 85237 102633
17790A02633l8516J60309d2034A22110d2539q4505A22913L4307P815b82689p1086
$$ 102633 64117 224426 -42034 122110 -42539 -127044 122913 157220 165035 -282689 -353775
17779c53775C4171J32975J84002A08323J27213E3262b02156F1127b00860B73266
$$ -353775 34171 167146 351148 108323 235536 53262 -202156 61127 -200860 273266
17768B28489a04284A29068E9613N1593a25746j13384B85182C5462N1249K5257
$$ 228489 -104284 129068 59613 111206 -125746 -239130 285182 35462 86711 111968
17758A11968b49377A155K10802I4842O3595c89279c8358B76a12165M3871H7890
$$ 111968 -249377 1155 211957 94842 158437 -389279 -38358 276 -112165 -68294 87890
17746i8154A19905a32742A39835K41761m4253e5701K7702A55918J41122m3364
$$ -98154 119905 -132742 139835 381596 337343 -55701 -27999 155918 297040 253676
17736B53676d5297q0914H2164L09712j21443g2855B78543p6141d2129A23069D2085
$$ 253676 -45297 -126211 82164 391876 270433 -72855 278543 202402 -42129 123069 42085
17724B77598q3325C4165J14476a7558j20967c911F1661J63762b71938A32115c33882
$$ 277598 194273 34165 148641 -17558 -138525 -3911 61661 225423 -271938 132115 -333882
17712I5104B4416K28237b30768O7116G2200J55677f8073o072A48150J69516D7066
$$ 95104 24416 252653 -230768 -163652 72200 227877 -68073 -74145 148150 317666 47066
17700c74271A64986b62332C1036K7630J04502M3166b92046B0120M6727g5602A91666
$$ -374271 164986 -262332 31036 58666 163168 206334 -292046 20120 66847 -75602 191666
17688C5967O7806K5671b73969a3961B00212a22080A09824g8704H5990c3924A66656
$$ 35967 103773 129444 -273969 -13961 200212 -122080 109824 -78704 85990 -33924 166656
17676b81407O8212A24489J34019L3018c47168C0381L4173O4958c15833a56858
$$ -281407 -213195 124489 258508 291526 -347168 30381 64554 129512 -315833 -156858
17665b52825D0743a07258A05108a07899g398D29559d8080j45580B60483E4441
$$ -252825 40743 -107258 105108 -107899 -7398 429559 -48080 -193660 260483 54441
17654A12278a20354A54537h2836m1095A70345a99017A4616i9580c6570o99q2799
$$ 112278 -120354 154537 -82836 -123931 170345 -199017 14616 -99580 -36570 -37269 -120068
17643a20068i625A56870a62548D4304b1804k6405B33248E8032c12950H6711a45634
$$ -120068 -9625 156870 -162548 44304 -21804 -48209 233248 58032 -312950 86711 -145634
17631i3858A39043J81566a95430B00526E017J86122k0913A0417K368M2052J80464
$$ -93858 139043 320609 -195430 200526 5017 191139 170226 10417 12785 54837 235301
17620B35301N8714j11303f5418J2516F8058L1926J0055h9352m9748p5878P8115
$$ 235301 294015 182712 -65418 -52902 68058 99984 110039 -89352 -139100 -214978 -136863
17609a36863H7359g7010B11001l7635b55A314L43736j30511d9454j10902A87854
$$ -136863 87359 -77010 211001 173366 -255 1314 345050 214539 -49454 -160356 187854
17597D9283b44623A52218a7356m8193B05174F1422c90412c0519j50167B21077
$$ 49283 -244623 152218 -17356 -65549 205174 61422 -390412 -30519 -180686 221077
17586i891A69099a88141K4996j7609G3803N2933e301G1867k8745c69707a6034
$$ -9891 169099 -188141 -163145 -180754 73803 126736 -5301 71867 43122 -369707 -16034
17574D000a21324D2982d3572B16199a48303H1535J30883J05924A094Q1580a2032
$$ 4000 -121324 42982 -43572 216199 -148303 81535 212418 318342 1094 82674 -12032
17562B96883a97924A45884J3413a42512b2631G185L21894Q8681d8806h398j29014
$$ 296883 -197924 145884 159297 -142512 -22631 7185 329079 417760 -48806 -8398 -137412
17551a37412B18264j04799J74446j39959a80617a3330G162a6337A01040R7314
$$ -137412 218264 113465 287911 147952 -180617 -13330 7162 -16337 101040 198354
17541A98354R6212c2424A74131a0186H3717i2935F3679d1805o1736j10084b492
$$ 198354 294566 -32424 174131 -10186 83717 -92935 63679 -41805 -103541 -213625 -2492
17529D33062A44976c1101D7211M8065O5047P6999K81009B50507a79509C07324
$$ 433062 144976 -31101 47211 95276 160323 237322 518331 250507 -179509 307324
17518A50387h1674G1154c5430M849B31010r6919M2737a11347N4004j2179D9704
$$ 150387 -81674 71154 -35430 -30581 231010 134091 176828 -111347 -57343 -69522 49704
17506F8951l2806a56935A2569h1867A11008M46K58970A78227R6355P9850D8021
$$ 68951 36145 -156935 12569 -81867 111008 111454 370424 178227 274582 354432 48021
17494A21124L7332M4691H8945a08035C2434a00784l7484D3903M5176J10253p9620
$$ 121124 158456 203147 88945 -108035 32434 -100784 -138268 43903 89079 199332 119712
17483A19712a25432Q867B16658a33039p1224A77266K30178j10508J43682L23080
$$ 119712 -125432 -116565 216658 -133039 -204263 177266 407444 296936 440618 763698
17473G63698a84085B46335J03253k2870j58984G4637N7381n0308d2538k71056
$$ 763698 -184085 246335 349588 326718 167734 74637 132018 81710 -42538 -313594
17463c13594d1608k7774G3539A7956K0196J73858J81163C4309J7860K89343o3152
$$ -313594 -41608 -69382 73539 17956 38152 212010 393173 34309 52169 341512 278360
17452B78360j21009M8173K88513R4454B85850K4361R1676n8711R5526P4232i4416
$$ 278360 157351 205524 494037 588491 285850 310211 401887 343176 438702 512934 -94416
17440B21193n7575K84071o6258r0117M8352O9814j82385A11159J83328K3557J85317
$$ 221193 163618 447689 381431 291314 339666 409480 227095 111159 294487 318044 503361
17429E03361j59496j21511J1255D8348K37740q6793J05854J47013k17095J17530
$$ 503361 343865 222354 233609 48348 286088 199295 305149 452162 235067 352597
17419C52597p0866o3393J60646m4120M8679m3971K0764j26673K55795B06318I6086
$$ 352597 281731 218338 378984 334864 383543 339572 360336 233663 489458 206318 96086
17407A97990K2486g7095B1826N9753J60683a38082A79735J96810N9542j80020
$$ 197990 220476 -77095 21826 81579 242262 -138082 179735 376545 436087 256067
17397B56067K0867p868j17265J90593K964j03595Q6087G1593J7278J75474J74553
$$ 256067 276934 269066 151801 342394 345358 241763 327850 71593 88871 264345 438898
17386D38898F4203L38871A75593J47729F4040M8122q700d6651N566C1719j4084
$$ 438898 64203 403074 175593 323322 64040 112162 103462 -46651 -41085 31719 17635
17375A7635K20570j04442K78763j63805F9449K16573n4779K26433k22015p7921
$$ 17635 238205 133763 412526 248721 69449 286022 231243 457676 235661 157740
17365A57740a6640A24853J17791r0084L63166A2320K46051R676H7316k9736L32918
$$ 157740 -16640 124853 242644 152560 515726 12320 258371 268047 87316 57580 390498
17354C90498n0576j37208I1114J97208F9074J05137m8951P882R4226q8093L2850
$$ 390498 339922 202714 91114 288322 69074 174211 125260 133142 227368 139275 172125
17343A72125l6793a0011A93682L0135n8500O5443i4219G4027N9769e8036A3449
$$ 172125 135332 -10011 193682 223817 165317 230760 -94219 74027 133796 -58036 13449
17331A98577J01212k066A10104A5931M49891G379d5420C61457b21914H0431J98914
$$ 198577 299789 297723 110104 15931 465822 7379 -45420 361457 -221914 80431 279345
17320B79345R9014A87007e8632A71305a85002E18092k42333c9419C7255a0091
$$ 279345 378359 187007 -58632 171305 -185002 518092 275759 -39419 37255 -10091
17309A92883O0185B0188Q6327J7922J5518K28185i1382C77963A87180K4616M1291
$$ 192883 253068 20188 106515 124437 139955 368140 -91382 377963 187180 211796 253087
17298B53087l1094j05437N3834b2797A84969C5963a05065c7978A98554K09429
$$ 253087 221993 116556 170390 -22797 184969 35963 -105065 -37978 198554 407983
17288D07983I6570J02117G1930b5010A10330L26297Q8366j34930A82390N08722
$$ 407983 96570 198687 71930 -25010 110330 436627 524993 390063 182390 691112
17278F91112C45336j35470c4108C4485K41134K73990A77711J0873R2233j30933
$$ 691112 345336 209866 -34108 34485 275619 549609 177711 188584 280817 149884
17268A49884K4697o9525b0508A36256J9988N7509k1307r4027L1158L10641c0015
$$ 149884 174581 105056 -20508 136256 156244 213753 192446 98419 129577 440218 -30015
17256A48894F6367b94966A20137O1226N0548J25189F3531j4235K07889J99397
$$ 148894 66367 -294966 120137 181363 231911 357100 63531 49296 257185 456582
17246D56582B26164R1088j30425C8782R7932o7623L6006Q3503m6994k2919b5715
$$ 456582 226164 317252 186827 38782 136714 69091 105097 188600 141606 118687 -25715
17234D69979A39070L11636B09519g4113A83638a333A92246m4236J31319J17771
$$ 469979 139070 450706 209519 -74113 183638 -1333 192246 148010 279329 397100
17224C97100D9706c3699A84100Q7002l0854n9700J51070O6007m3621j62562J53068
$$ 397100 49706 -33699 184100 271102 240248 180548 331618 397625 354004 191442 344510
17213C44510p4098L9229N3846j33415a3087C08408J07307j65713J4761M9638o379
$$ 344510 270412 309641 363487 230072 -13087 308408 415715 250002 264763 314401 308022
17202C08022P4094J66423k12283c5427E06684k3880A94211I4768N6784J03367
$$ 308022 382116 548539 336256 -35427 506684 482804 194211 94768 151552 254919
17192B54919M5944K62423A1921K75049J00998L0410H9172B9013N92138B76238
$$ 254919 300863 563286 11921 286970 387968 418378 89172 29013 621151 276238
17181F25837N92j58552N9088r3836F0650J47941J981O2052J95082l6806J10024
$$ 625837 626429 467877 526965 433129 60650 208591 210572 272624 467706 430900 540924
17170E40924k03972M9758Q1746o7971A50505J09443L3425m3602L69995A92345
$$ 540924 336952 386710 468456 400485 150505 259948 293373 249771 619766 192345
17159C63019J08665m1470j98140J40671o6187q3296r4142J29919B6735J88552
$$ 363019 471684 430214 232074 372745 306558 223262 129120 259039 26735 215287
17149B15287K61817p2618j59740L42189k14436j03693L86266B45223M4542J01016
$$ 215287 477104 404486 244746 586935 372499 268806 655072 245223 289765 390781
17139C90781A49833L27242j69209O9439A13873K47615J17606a29670D89269J87303
$$ 390781 149833 477075 307866 377305 113873 361488 479094 -129670 489269 676572
17129F76572k76284A94437K57020j13654F1600L05199M85762k41100n5081B61639
$$ 676572 400288 194437 451457 337803 61600 366799 852561 611461 556380 261639
17118D95568R716K60143B03065K15800R5479n6211o0405j48588J60179D1833J79455
$$ 495568 505284 765427 203065 418865 514344 458133 397728 249140 409319 41833 221288
17107B21288K96133B02910K91618n6430A71277L55660Q7361k25537l2345o9477
$$ 221288 517421 202910 494528 438098 171277 526937 614298 388761 356416 286939
17097B86939L82146k33543K97A78949K26463j60128L58961j77823E9549K28268
$$ 286939 669085 435542 435839 178949 405412 245284 604245 426422 59549 287817
17087B87817J97797K08086l36295K70180k37483J6755r6978L09580j43171j14003
$$ 287817 485614 693700 357405 627585 390102 406857 309879 619459 476288 362285
17077C62285J67713J03659j77552J30248L8932p8671J00258B86340L62693J5934
$$ 362285 529998 633657 456105 586353 625285 546614 646872 286340 649033 664967
17067F64967m3608j79936M2385Q2792j24335K13785J5911n974J10273J64674D47965
$$ 664967 621359 441423 483808 566600 442265 656050 671961 665987 776260 940934 447965
17055E52455j77932N23413j19131j50992K3909j00076m8281j86916K23965p1323
$$ 552455 374523 897936 778805 627813 651722 551646 503365 316449 540414 469091
17045D69091M14264l01606M45745A39432N35178k42051J88056M0675j33143j08027
$$ 469091 883355 581749 1027494 139432 674610 432559 620615 661290 528147 420120
17035D20120J67735o9487J53901K9015n8996q178J75728m89L2101m2616L93611
$$ 420120 587855 518368 672269 701284 642288 634110 809838 809349 841450 798834 1192445
17024A192445l80037j61354j74569L70695l08872N6802J81852o2151R5979k2968
$$ 1192445 812408 651054 476485 847180 538308 595110 776962 714811 810790 787822
17014G87822J27747k29859M9830j29947P2486q7590K5347J10204Q3245j68776
$$ 787822 915569 685710 735540 605593 678079 590489 615836 726040 809285 640509
17004F40509k11334J98421M90117n45449K46347R5469j17410j66443M53528l82656
$$ 640509 429175 627596 1117713 572264 818611 914080 796670 630227 1083755 701099
16994G01099K67553M1595J3105l69567L47664n09K07336E03185K43692M55486
$$ 701099 968652 1010247 1023352 653785 1001449 1000940 1208276 503185 746877 1202363
16984A202363m55426J72929R1161J48583m20895N0459p9661J21603J58431J31993
$$ 1202363 746937 919866 1011027 1159610 738715 789174 709513 831116 989547 1121540
16974A121540o7673j01562J388K23914k97290K4357N7561L39550m14424J13457
$$ 1121540 1053867 952305 953693 1177607 880317 904674 962235 1301785 887361 1000818
16964A000818k79814N75494m10670J46295J71844J16357J03880k80576P4388J67749
$$ 1000818 721004 1296498 885828 1032123 1203967 1320324 1424204 1143628 1218016 1385765
16954A385765l89732K34839j88218J31088N6089k29835L55224j67739K46170k16921
$$ 1385765 996033 1230872 1042654 1173742 1229831 999996 1355220 1187481 1433651 1216730
16944A216730q4042J76968m1611k9498J93623l89699K68557l7311O704j71889
$$ 1216730 1132688 1309656 1268045 1238547 1432170 1042471 1311028 1273717 1280421 1108532
16934A108532K56170M17885p18387J62887J59435O971J12827m47403O54001l53495
$$ 1108532 1364702 1782587 1064200 1227087 1386522 1393493 1506320 1058917 1712918 1359423
16924A359423K2093P4229K68021j6465K13787n00575L08464k89983N51579m40431
$$ 1359423 1381516 1455745 1723766 1707301 1921088 1420513 1728977 1438994 1990573 1550142
16914A550142q2536J97021j8876J07421j9804K59327j48764J17489l0467k11499
$$ 1550142 1467606 1664627 1645751 1753172 1733368 1992695 1843931 1961420 1930953 1719454
16904A719454p2893M67338j64079Q3777J18812j38205O9559j28178j7616K48685
$$ 1719454 1646561 2113899 1949820 2033597 2152409 2014204 2083763 1955585 1937969 2186654
16894B186654K24246o35440J49388k38794N21418k68567j01210J99484m2552Q4510
$$ 2186654 2410900 1775460 1924848 1686054 2207472 1938905 1837695 2037179 1994627 2079137
16884B079137m901J93643j6385L33407j8942M826k1657k62045J75288O5906K89506
$$ 2079137 2074236 2267879 2251494 2584901 2565959 2570785 2549128 2287083 2462371 2528277 2817783
16873B817783o1903j35674j33503p9795M38324j10828J36812Q7898k76593K11406
$$ 2817783 2755880 2620206 2486703 2406908 2845232 2734404 2871216 2959114 2682521 2893927
16863B893927p4623K43807R9466o8902j9313j3313J55868K56264L6560n02456
$$ 2893927 2819304 3063111 3162577 3093675 3074362 3061049 3216917 3473181 3509741 3007285
16853C007285O10827j67493k58223L66985j74239L83028Q977K18323j4997J58286
$$ 3007285 3618112 3450619 3192396 3559381 3385142 3768170 3777147 3995470 3980473 4138759
16843D138759j63028j5991O12016l52022o8948L51414j37964k34311O09976j74662
$$ 4138759 3975731 3959740 4571756 4219734 4150786 4502200 4364236 4129925 4739901 4565239
16833D565239L1419P8989Q5654R6531J92377M66269m85882K60462k3926L91620
$$ 4565239 4596658 4675647 4761301 4857832 5050209 5516478 5030596 5291058 5267132 5658752
16823E658752j66956r2306N55464k89754L52912J13928K33852J93898j95273L31315
$$ 5658752 5491796 5399490 5954954 5665200 6018112 6132040 6365892 6559790 6364517 6695832
16813F695832o8954K38240J93677M91377k06655J96971l7166J75790K2331N70148
$$ 6695832 6626878 6865118 7058795 7550172 7343517 7540488 7503322 7679112 7701443 8271591
16803H271591k60206L67862O2375M09734j17983J96390O32822m1343N46449L06057
$$ 8271591 8011385 8379247 8441622 8851356 8733373 8929763 9562585 9521242 10067691 10373748
16793A0373748k36L27747L88937r3990N87589M92120K37230K15814N78487P1930
$$ 10373748 10373512 10701259 11090196 10996206 11583795 12075915 12313145 12528959 13107446 13179376
16783A3179376N22464P20728M22911M6974N64138M70230K41433N79703P15808
$$ 13179376 13701840 14422568 14845479 14892453 15456591 15926821 16168254 16747957 17463765
16774A7463765N63777O51082Q36712J09985J031692O78771O28157R16453O76515
$$ 17463765 18027542 18678624 19515336 19625321 20657013 21335784 21963941 22880394 23556909
16765B3556909J196917P19391J172469P92391J373664J161921J248018J330190
$$ 23556909 24753826 25473217 26645686 27438077 28811741 29973662 31221680 32551870
16757C2551870J126003J661937J497359J747796J795331J943070J747038K356225
$$ 32551870 33677873 35339810 36837169 38584965 40380296 42323366 44070404 46426629
16749D6426629J941910K752107K650677K864958K846643L312411L203196L667667
$$ 46426629 48368539 51120646 53771323 56636281 59482924 62795335 65998531 69666198
16741F9666198L723682M300726M501367M295283N260118N080748N700430N992569
$$ 69666198 73389880 77690606 82191973 86487256 91747374 96828122 102528552 108521121
16733A08521121O297049O303958O961324O530797P133130P058005O795249O708778
$$ 108521121 114818170 121122128 128083452 134614249 141747379 148805384 155600633 162309411
16725A62309411O529733N985900M739256M942923K962779K269957J046253n03682
$$ 162309411 168839144 174825044 179564300 184507223 187470002 189739959 190786212 190282530
16717A90282530j002293k476428l347274m859700n672554o019216o714454o881051
$$ 190282530 189280237 186803809 183456535 178596835 172924281 166905065 160190611 153309560
16709A53309560p361291p248254p153797p705042o411170p122132o436737n833825
$$ 153309560 145948269 138700015 131546218 123841176 117430006 110307874 103871137 98037312
16701I8037312n762992n446987n194686m472100m865120m166960l736900l237282
$$ 98037312 92274320 86827333 81632647 77160547 72295427 68128467 64391567 61154285
16693F1154285l568531l229173l075856k381414k505630k490174k245570j923161
$$ 61154285 57585754 54356581 51280725 48899311 46393681 43903507 41657937 39734776
16685C9734776j993050j588620j999542j343643j474730j372992j388679j281209
$$ 39734776 37741726 36153106 34153564 32809921 31335191 29962199 28573520 27292311
16677B7292311r49221j192221j114498o86739j241497o28770r96749o80615l60974
$$ 27292311 26343090 25150869 24036371 23349632 22108135 21479365 20482616 19802001 19441027
16668A9441027j249220q66342k07433q51221o35412l64196n78878m47973m78572
$$ 19441027 18191807 17325465 17118032 16266811 15631399 15267203 14688325 14240352 13761780
16659A3761780n41401j54052k76209o38764n75288j56656o4619m06569j13380
$$ 13761780 13220379 13066327 12790118 12151354 11576066 11419410 11354791 10948222 10834842
16650A0834842l77502o16398l75290l63468J32124l40536o11593J06642l11615
$$ 10834842 10457340 9840942 9465652 9102184 9234308 8893772 8282179 8388821 8077206
16641H077206l00213l65757L40166o55771J42430k54743l76908J14128l52020
$$ 8077206 7776993 7411236 7751402 7095631 7238061 6983318 6606410 6720538 6368518
16632F368518n4911l01652o9693Q1941m64650o3950J14857k87238J23556l47685
$$ 6368518 6313607 6011955 5942262 6024203 5559553 5495603 5610460 5323222 5446778 5099093
16622E099093j22327k45325P0490J49381l34455r4528J87999l07334k35652k03637
$$ 5099093 4976766 4731441 4801931 4951312 4616857 4522329 4710328 4402994 4167342 3963705
16612C963705L40959o05777J77885k03352L35699l04707l0615M4178R2246m34303
$$ 3963705 4304664 3698887 3876772 3673420 4009119 3704412 3673797 3717975 3810221 3375918
16602C375918j91806Q6782k30291J31236K12619k59437r5859l21990J34199K26150
$$ 3375918 3184112 3270894 3040603 3171839 3384458 3125021 3029162 2707172 2841371 3067521
16592C067521l94683K57433j7110j9294q8393k64526J40801r606m9467k95289
$$ 3067521 2672838 2930271 2913161 2893867 2805474 2540948 2681749 2672143 2622676 2327387
16582B327387Q9792Q2080J2122l46611k14555M08664k36127J87082l65522K58423
$$ 2327387 2417179 2499259 2511381 2164770 1950215 2358879 2122752 2309834 1944312 2202735
16572B202735j18409j27374J46955K22103k88797j25201j51882R9195K48440n04232
$$ 2202735 2084326 1956952 2103907 2326010 2037213 1912012 1760130 1859325 2107765 1603533
16562A603533Q2999m6401Q7812K7367j19049j5608k2103J25117k26660J52513
$$ 1603533 1686532 1640131 1727943 1755310 1636261 1620653 1598550 1723667 1497007 1649520
16552A649520k52950k2832Q2315k84839J68214L17663j15904N994l86814L04K11693
$$ 1649520 1396570 1373738 1456053 1171214 1339428 1657091 1541187 1547181 1160367 1160671 1372364
16541A372364K82970m24380k186J5880k1941j18951J63296j8727O2262q175l9363
$$ 1372364 1655334 1230954 1228768 1244648 1222707 1103756 1267052 1248325 1310587 1302412 1263049
16530A263049j10950Q1631j11024J04195P3091m37872L44507r2099k8250o0904
$$ 1263049 1152099 1233730 1122706 1226901 1299992 862120 1206627 1114528 1086278 1025374
16520A025374j00126j40007K37317J9394k1321l34498K15640K8752p5159j90132
$$ 1025374 925248 785241 1022558 1041952 1020631 686133 901773 930525 855366 665234
16510F65234M38360L5712j51425M2529k49033K62956j25715J03963l13162J65548
$$ 665234 1103594 1139306 987881 1030410 781377 1044333 918618 1022581 709419 874967
16500H74967o1573J7711k99818L76017k9784k88187J72650N0813l22749J3307
$$ 874967 813394 831105 531287 907304 877520 589333 761983 812796 490047 503354
16490E03354K96097Q4045l91733N39002l09350L54457D68400q9668N1621M90348
$$ 503354 799451 883496 491763 1030765 721415 1075872 468400 378732 430353 920701
16480I20701k85508J24774j28805j15219K07798j34640j03974j247j18900K96990
$$ 920701 635193 759967 631162 515943 723741 589101 485127 483880 364980 661970
16470F61970k11738O21911m17662j29470q9564J52514j42089L37353k86071L8022
$$ 661970 450232 1072143 654481 525011 435447 587961 445872 783225 497154 535176
16460E35176k16688K49724o3842J148B15278Q6007M03420A23479O94894A02681
$$ 535176 318488 568212 504370 505518 215278 301285 704705 123479 818373 102681
16449H7883N01912H7666L30297D7408O60199r9019B32123M2142K57632O6499J1783
$$ 87883 589795 87666 417963 47408 707607 608588 232123 274265 531897 598396 610179
16438F10179F1093N32310Q7589l8104C04265J38064j41011l5842n9848N6602J15367
$$ 610179 61093 593403 680992 642888 304265 442329 301318 265476 205628 262230 377597
16427C77597J87346k52908L31143C02992N5420M6719O6474J03624B70662o5396
$$ 377597 564943 312035 643178 302992 358412 405131 471605 575229 270662 205266
16417B05266l3940L14028J3009q0446j00435n4032q2883L47843B55125J07994
$$ 205266 171326 485354 498363 417917 317482 263450 180567 528410 255125 363119
16407C63119N2684j32487C8152J68845K53544A94469j9483l7588L43766j41217
$$ 363119 415803 283316 38152 206997 460541 194469 174986 137398 481164 339947
16397C39947j9129r9609M42316a05308C3051J70894K67095B19421G8588a81030
$$ 339947 320818 221209 663525 -105308 33051 203945 471040 219421 78588 -181030
16386B97161J17770C2992M16720j15056m5551R481j27772J82988A07296d4208
$$ 297161 414931 32992 449712 334656 289105 298586 170814 353802 107296 -44208
16375E8479L55255g5982B77274l9938K21857k0878b3705n1288B37334K33978E7330
$$ 58479 413734 -75982 277274 237336 459193 438315 -23705 -74993 237334 471312 57330
16363A65533a64079B9131M78650G6330J94085j09198b9679C43957r4685A14967
$$ 165533 -164079 29131 507781 76330 270415 161217 -29679 343957 249272 114967
16352D7433J95071K54939j40288a11086B7310M32011A70330O5618j6402B1213
$$ 47433 242504 497443 357155 -111086 27310 459321 170330 235948 219546 21213
16341B40677K23676b948A76058C8255L78071q3284R0536D4065N7454f5133A19124
$$ 240677 464353 -2948 176058 38255 416326 333042 423578 44065 101519 -65133 119124
16329A54772K0837D7211K6693K89571a72200G6429L6801L22269A30652J07849
$$ 154772 175609 47211 73904 363475 -172200 76429 113230 435499 130652 238501
16319B38501E585L68992j77624l1668G6260O5170d1808j74307H8270R6229K1229
$$ 238501 5585 374577 196953 165285 76260 141430 -41808 -216115 88270 184499 205728
16308B05728A2085j919K25682J50143A13015g6835A88986P0279n0718j7693K1919
$$ 205728 12085 10166 235848 385991 113015 -76835 188986 259265 208547 190854 212773
16297B12773n6484a34834j46493B94227A7312J34169a83418K3929A27307n2681
$$ 212773 156289 -134834 -281327 294227 17312 151481 -183418 -159489 127307 74626
16287G4626K15182A12027M5916a05031G0860P6708E6455a58269C62639F189K4150
$$ 74626 289808 112027 157943 -105031 70860 147568 56455 -158269 362639 6189 30339
16276C0339a63091C28272j51740i1340D1895J24928a30684A59422F9818A4956
$$ 30339 -163091 328272 176532 -91340 41895 166823 -130684 159422 69818 14956
16265A06036h5915D47131a5698j16630B31330a25058A18300C3885a07026j613
$$ 106036 -85915 447131 -15698 -132328 231330 -125058 118300 33885 -107026 -108639
16255a08639K5522B7876g467E8382J7592J06808a1672c848B43806A5500L09063
$$ -108639 -83117 27876 -7467 58382 75974 182782 -11672 -3848 243806 15500 324563
16244C24563J66765a68542b260k44338D43746A9415Q094c3585B30746o5579j0201
$$ 324563 491328 -168542 -2260 -246598 443746 19415 27509 -33585 230746 165167 154966
16233A54966d501C9705L43831H8671d29724E4406K34244b7713A32699e425k3068
$$ 154966 -4501 39705 383536 88671 -429724 54406 288650 -27713 132699 -5425 -28493
16222b8493D17836c0933A24404J7065K075g9537l2058l3857B35496J55692i7840
$$ -28493 417836 -30933 124404 141469 143544 -79537 -111595 -145452 235496 391188 -97840
16210h3789C0964a9846A25443a36221A92307b01225B49993A10109M4298L32885
$$ -83789 30964 -19846 125443 -136221 192307 -201225 249993 110109 154407 487292
16200D87292A72191e6693B09799a37250I0069J25673b3614j8156k1933C69547
$$ 487292 172191 -56693 209799 -137250 90069 215742 -23614 -41770 -63703 369547
16189f1531A73441D8644A8892R1758N242P1910a19482j95326e2633H2621b6627
$$ -61531 173441 48644 18892 110650 115892 187802 -119482 -314808 -52633 82621 -26627
16177i0378L4267a9361C6043J53424m0028a56827A11446M2912b26469j30434J53223
$$ -90378 -56111 -19361 36043 189467 149439 -156827 111446 154358 -226469 -356903 -203680
16166b03680a00134n4658d7491B67198a57250E0929l056a27672B660J87452C1557
$$ -203680 -100134 -154792 -47491 267198 -157250 50929 47873 -127672 2660 190112 31557
16154e9250o0677A47359b43625K6836d8472k4837G5296g1390F5000a63529J7022
$$ -59250 -119927 147359 -243625 -216789 -48472 -73309 75296 -71390 65000 -163529 -146507
16143a46507c5739l3100C10301e3995j74789g2988j86729D3105k1532J59011P840
$$ -146507 -35739 -68839 310301 -53995 -228784 -72988 -259717 43105 21573 180584 188424
16132A88424c31961a12838m4841I2028e454I9012a8959o9681j40468A08711B0239
$$ 188424 -331961 -112838 -157679 92028 -5454 99012 -18959 -88640 -229108 108711 20239
16120g6577B15359r6852B0306c724p0432h16B58653r1430b56450b8090k12556
$$ -76577 215359 118507 20306 -3724 -74156 -816 258653 167223 -256450 -28090 -240646
16109b40646R863A87071p4734L3711a18894j9073B43294r9551L2756A7139M13180
$$ -240646 -230783 187071 112337 146048 -118894 -137967 243294 143743 176499 17139 430319
16098D30319A62717C9898J40391b32276H8079b30735c6542n9621l0746A32221
$$ 430319 162717 39898 180289 -232276 88079 -230735 -36542 -96163 -126909 132221
16087b42450i4139F3228a73805H7639L0926a25507m896p1758H1261g0826D1517
$$ -242450 -94139 63228 -173805 87639 118565 -125507 -130403 -202161 81261 -70826 41517
16075a87143L4751B39594b74899B03910a4913k3951A10974A8271J32285d0635
$$ -187143 -152392 239594 -274899 203910 -14913 -38864 110974 18271 150556 -40635
16064c66401a44071B07495I8673O0359l8420n5292b71778F7164a07201C79572
$$ -366401 -144071 207495 98673 159032 120612 65320 -271778 67164 -107201 379572
16053a52697c129j99781K7459G0524b8569C9892J04074F6390k6763K61478o4428
$$ -152697 -3129 -202910 -175451 70524 -28569 39892 143966 66390 39627 301105 236677
16042B36677a46105B24574a66853r061k16189d2678H3684b1848O082k89692e0019
$$ 236677 -146105 224574 -166853 -175914 -392103 -42678 83684 -21848 -15766 -305458 -50019
16030A85083a04222L3501I1002k9053a86925j9168L5540a9381r5726D3639a47647
$$ 185083 -104222 -70721 91002 61949 -186925 -206093 -170553 -19381 -115107 43639 -147647
16018A1666b24307O7388G3787B5049e4342F1655h5531k29603j17382B39015a38002
$$ 11666 -224307 -156919 73787 25049 -54342 61655 -85531 -315134 -432516 239015 -138002
16006A57849g2156k28916C17604A22625P7114a70034F968J8501e1451k73819d1845
$$ 157849 -72156 -301072 317604 122625 199739 -170034 6968 25469 -51451 -325270 -41845
15994b16333C4966b12620j40351H5105j0401C590Q0096K42714l3866A24049r309
$$ -216333 34966 -212620 -352971 85105 74704 3590 83686 326400 292534 124049 114740
15983A14740J71004J27112R5316j41533R253C6114c4984j76179j25035a59888
$$ 114740 285744 412856 508172 366639 375892 36114 -34984 -211163 -336198 -159888
15972B3055a99529A18531L2713f7125k07949A01705a56455c7571j65349n6346
$$ 23055 -199529 118531 151244 -67125 -275074 101705 -156455 -37571 -202920 -259266
15962b59266j29069h2012H2829l1233d767G4382r090J06109m7768K47990j30486
$$ -259266 -388335 -82012 82829 51596 -4767 74382 65292 171401 123633 371623 241137
15951B41137a01766n0938E8985K9549d38475k6536c4616n1457q4443A49995d21332
$$ 241137 -101766 -152704 58985 88534 -438475 -465011 -34616 -86073 -170516 149995 -421332
15939D3582c14230R5070N9778m0892a9426j29098I4101k1282a87440c2202D0849
$$ 43582 -314230 -219160 -159382 -200274 -19426 -148524 94101 72819 -187440 -32202 40849
15927A01735M86a06804j34043e134n68817B13012a94653b9837m8157E2654a89982
$$ 101735 102221 -106804 -240847 -5134 -573951 213012 -194653 -29837 -77994 52654 -189982
15915A88978k3486a52103j01342a0590k51515o3323a8881q1368a1581b42j26329
$$ 188978 165492 -152103 -253445 -10590 -262105 -325428 -18881 -100249 -11581 -242 -126571
15904a26571j83450A4501c00065a10451k08702R8339j1857A82059c11947B8378
$$ -126571 -310021 14501 -300065 -110451 -319153 -220814 -232671 182059 -311947 28378
15893a50302B00027a68100D323f7498c3466A18369a10302A75512h6190A06425
$$ -150302 200027 -168100 4323 -67498 -33466 118369 -110302 175512 -86190 106425
15882A8159Q6568m412a19736F2964L7160J0561j972k7201a16602A45453J07880
$$ 18159 104727 100315 -119736 62964 100124 110685 108713 81512 -116602 145453 253333
15871B53333c39698a19554A13824a51384k9980j15657J32911A3637c06469a36683
$$ 253333 -339698 -119554 113824 -151384 -181364 -297021 -164110 13637 -306469 -136683
15860C93662j45976b09465L3113O5197E8459a80757B73450b3775B9472J00764
$$ 393662 247686 -209465 -176352 -111155 58459 -180757 273450 -23775 29472 130236
15850A30236m2604O5999k1751B581J83505a76112B33373C3737i8714j37526O8355
$$ 130236 87632 153631 131880 2581 186086 -176112 233373 33737 -98714 -236240 -167885
15839a67885o4354A27418a06181A67517b53060R5670B33524d7234C21920d37035
$$ -167885 -232239 127418 -106181 167517 -253060 -157390 233524 -47234 321920 -437035
15828A86788b6563H7917c5094q2071A52586q249h6787j47185h9455h899m2015
$$ 186788 -26563 87917 -35094 -117165 152586 144337 -86787 -233972 -89455 -8899 -50914
15817e0914j9882l4695B03754A1987a7390A20490f8289G7552b11480L8818h679
$$ -50914 -70796 -105491 203754 11987 -17390 120490 -68289 77552 -211480 -172662 -8679
15805A05450k4854i149B4958J770L04810c7755k37686J01652B12425a20898L0130
$$ 105450 80596 -9149 24958 26728 331538 -37755 -275441 -173789 212425 -120898 -90768
15794i0768c449j6990E2135a10114j66441E6941M938J00151b52821f5622A23317
$$ -90768 -3449 -20439 52135 -110114 -276555 56941 61879 162030 -252821 -65622 123317
15782b8574l56704a37079f228p2567C2547a03725d6514I6310r331c9221j66091
$$ -28574 -385278 -137079 -6228 -78795 32547 -103725 -46514 96310 86979 -39221 -205312
15771b05312B56547p1544f6394B12404A00148c14280A75398a40052B30848f8601
$$ -205312 256547 185003 -66394 212404 100148 -314280 175398 -140052 230848 -68601
15760b17927G7132J23423q5502J00090i0588C30822G8792a26793A35210O7805
$$ -217927 77132 200555 115053 215143 -90588 330822 78792 -126793 135210 203015
15750B03015D7163c6782A64153L1321C2615J47428h0517k4216C1220a0239A53685
$$ 203015 47163 -36782 164153 195474 32615 180043 -80517 -104733 31220 -10239 153685
15738b55228k3082E5256R6672F0579J2608h0643A12676b26581E6335i0127m1925
$$ -255228 -278310 55256 151928 60579 73187 -80643 112676 -226581 56335 -90127 -132052
15727a32052A09614J10486A03416b09043B57618H8546b33669B128c4556B9769
$$ -132052 109614 220100 103416 -209043 257618 88546 -233669 2128 -34556 29769
15716A7863L7157a59068j42333k09708b09579A97072c35944b352C266b95217A1826
$$ 17863 55020 -159068 -301401 -511109 -209579 197072 -335944 -2352 3266 -295217 11826
15704b17945f65l42655B14781B7402b32003h536c725C3355c6685j44874L2817
$$ -217945 -665 -343320 214781 27402 -232003 -8536 -3725 33355 -36685 -181559 -148742
15693a48742K0831j52813h6297B6142e789B32J68101H1864C9651b03799j02471
$$ -148742 -127911 -280724 -86297 26142 -5789 232 168333 81864 39651 -203799 -306270
15682c06270I1167l8042a36025j0956A67883f1916A40462e6009C25590F1009a90105
$$ -306270 91167 53125 -136025 -146981 167883 -61916 140462 -56009 325590 61009 -190105
15670C78898I0192J83294c8188j19321P4268j15771b26k24451h0613k5865n5898
$$ 378898 90192 273486 -38188 -157509 -83241 -199012 -226 -224677 -80613 -106478 -162376
15659a62376A2918a40374j65405A74965e8094j0649A22715L9566b00020I8488
$$ -162376 12918 -140374 -305779 174965 -58094 -68743 122715 162281 -200020 98488
15648I97M32c67675I8506e9373D18765i8908A30445a73992o9701e7309k003A39171
$$ 997 1429 -367675 98506 -59373 418765 -98908 130445 -173992 -243693 -57309 -59312 139171
15635A35952m3018m72K50261a61613B9577P7872j1977c3775j00139n6609A40976
$$ 135952 92934 92462 342723 -161613 29577 107449 95472 -33775 -133914 -190523 140976
15623a331F7547B8673b34139A14512E6088c00889A34196e8446j5115i808o5612
$$ -1331 67547 28673 -234139 114512 56088 -300889 134196 -58446 -73561 -9808 -75420
15612g5420C57P1996J58029a26656A03474a98548j06413p3344I5003e1806j15014
$$ -75420 357 72353 230382 -126656 103474 -198548 -304961 -378305 95003 -51806 -166820
15601a66820C12902a36182n0829H7683K4030c93339D5375Q1050J07266H9144a46501
$$ -166820 312902 -136182 -187011 87683 111713 -393339 45375 126425 233691 89144 -146501
15589E4776b55334J9852A33883N0400d81840f999r4580b3590j96023k11473B10601
$$ 54776 -255334 -235482 133883 184283 -481840 -6999 -101579 -23590 -219613 -431086 210601
15577D6815c5436B57664o2920b70779l2978E6930M4464b25894g9429b5061A36595
$$ 46815 -35436 257664 194744 -270779 -303757 56930 101394 -225894 -79429 -25061 136595
15565A2458K54098r9639F1049O9347b21E3203O9400d3141D7517e9056l2173j10782
$$ 12458 266556 166917 61049 130396 -221 53203 122603 -43141 47517 -59056 -91229 -202011
15553b02011J00929J5421h985A30393J8120c7094j22716I2964b94027b912A72060
$$ -202011 -101082 -85661 -8985 130393 148513 -37094 -159810 92964 -294027 -2912 172060
15541C24147a49809G4981J14993G1121l4676k179b50905A45663J05714e8741B1443
$$ 324147 -149809 74981 189974 71121 36445 34266 -250905 145663 251377 -58741 21443
15529d3506A26377d5383a7144F1367B8716f426l04968A37973i6483A24243b06883
$$ -43506 126377 -45383 -17144 61367 28716 -6426 -311394 137973 -96483 124243 -206883
15517A3401b26544P0342L0191F3735K49981J33821D7073J1215B295K0735e3967
$$ 13401 -226544 -156202 -126011 63735 313716 447537 47073 58288 2295 23030 -53967
15505A94789q3390e0053B19245j02880a44048H0812J7886a03468d8659k1263L0455
$$ 194789 111399 -50053 219245 116365 -144048 80812 98698 -103468 -48659 -69922 -39467
15494c9467B09636a67404J1672q3667M8926D54128A02693j2843l6640k319P4658
$$ -39467 209636 -167404 -155732 -239399 -190473 454128 102693 89850 53210 50891 125549
15483A25549n0878K6592b065j08050B32046A8313r001L23370c1868G994a15564
$$ 125549 74671 101263 -2065 -110115 232046 18313 9312 332682 -31868 7994 -115564
15471C01546B5795c32787a3121A5930b59652c1024R386j69129h1845M0591A6913
$$ 301546 25795 -332787 -13121 15930 -259652 -31024 -21638 -190767 -81845 -41254 16913
15459F7258a1166l02353G4059J19488A5506J31590a73846A27495c24988D4243
$$ 67258 -11166 -313519 74059 193547 15506 147096 -173846 127495 -324988 44243
15448A15138A1170c01323d890l93895a17549L9381k76244J75674A48688h0540
$$ 115138 11170 -301323 -4890 -398785 -117549 -78168 -354412 -178738 148688 -80540
15437c5003k8437A0520J81780j5595c24797h2584j10903e2807k89628E2281J3267
$$ -35003 -63440 10520 192300 176705 -324797 -82584 -193487 -52807 -342435 52281 65548
15426F5548b6025A55584e3503A68708a5073D8124a72380I4970d4648m3051C73984
$$ 65548 -26025 155584 -53503 168708 -15073 48124 -172380 94970 -44648 -87699 373984
15414A55723Q1159E6920f4125B39067i5697j00788A66087C3851b1436n7675b7831
$$ 155723 236882 56920 -64125 239067 -95697 -196485 166087 33851 -21436 -79111 -27831
15402C6830R8027a3905G8732k0747A8601J07972a4342B9531J64017a53266j0244
$$ 36830 134857 -13905 78732 57985 18601 126573 -14342 29531 193548 -153266 -163510
15391a63510B4069h3406J9244k9738C07974m6729c12780C09202A0242J11300a37984
$$ -163510 24069 -83406 -64162 -93900 307974 261245 -312780 309202 10242 121542 -137984
15379c9965l5056A26688a88350B465a51047q2999C0037J5719k680b08783j17919
$$ -39965 -75021 126688 -188350 2465 -151047 -234046 30037 45756 43076 -208783 -326702
15368c26702A58609f8689E7605c5245j08012B17295J15811B8909a74651A60592
$$ -326702 158609 -68689 57605 -35245 -143257 217295 333106 28909 -174651 160592
15357C9203K23097a7942j43070Q0205j63425C119J80807K44453G3447k3788J51404
$$ 39203 262300 -17942 -161012 -80807 -244232 3119 183926 428379 73447 49659 201063
15346B01063P7569h5201A3305O3070L86813b9338j65558A61837a49236j56188
$$ 201063 278632 -85201 13305 76375 463188 -29338 -194896 161837 -149236 -305424
15336c05424b7869C22216A60498b04133D3508j5678J86342a55667A9707P9916
$$ -305424 -27869 322216 160498 -204133 43508 27830 214172 -155667 19707 99623
15326I9623j7385J1985D2139j2436a35771A30018H331J32206a08281j27217B04908
$$ 99623 82238 94223 42139 29703 -135771 130018 8331 140537 -108281 -235498 204908
15314B30456j01401b86951a17392k07564G676a1467I0892j9147L50547r798G8762
$$ 230456 129055 -286951 -117392 -324956 7676 -11467 90892 71745 422292 412494 78762
15302a38093B57003E7827b5203q4292A91366k2665J1538b17074A53636A1349b6346
$$ -138093 257003 57827 -25203 -109495 191366 168701 180239 -217074 153636 11349 -26346
15290a262k01997A31498g337G6723O1356g0773j75005e0961b2247A23557J03487
$$ -1262 -203259 131498 -7337 76723 138079 -70773 -245778 -50961 -22247 123557 227044
15279B27044J32244b943C8903j3441M3105d4501A38285b6372I5685J49641r5495
$$ 227044 359288 -2943 38903 25462 68567 -44501 138285 -26372 95685 245326 149831
15268A49831m4037C23K93017j30626R1372G2708d2846B46935n105b07298A99399
$$ 149831 105794 323 293340 162714 254086 72708 -42846 246935 241830 -207298 199399
15256A91743r3292J56413R2984I9084K4708k0830K39390A26464K55319L99909
$$ 191743 98451 254864 347848 99084 123792 102962 342352 126464 381783 781692
15246G81692P24156K08003p26758M76184o17490j75451k64205a04445H2595L82414
$$ 781692 1505848 1713851 987093 1463277 845787 670336 406131 -104445 82595 465009
15236D65009C0932J63130I0541j9532B4866c9653Q716H1125b998A10160Q8600
$$ 465009 30932 194062 90541 71009 24866 -39653 -30937 81125 -2998 110160 198760
15225A98760n456Q1931I6021b17937O8836M3730k56061i2031p1978A44880a48743
$$ 198760 193304 275235 96021 -217937 -149101 -105371 -361432 -92031 -164009 144880 -148743
15213f4775a3084n470A00513P9121D2511R704e9641D1460Q784b396l25626b2729
$$ -64775 -13084 -18554 100513 179634 42511 52215 -59641 41460 50244 -2396 -328022 -22729
15200a09881j2020A91623C8055J32848J05660l3954F3059m046M0766g2991D23902
$$ -109881 -121901 191623 38055 170903 276563 242609 63059 59013 99779 -72991 423902
15188I6016J46632a43871F8295J2751i2249n2439E71J9743b89843d5676j12663
$$ 96016 242648 -143871 68295 81046 -92249 -144688 571 20314 -289843 -45676 -158339
15177a58339o2417E6174R6232R5805H6879F664K3755J95858l9446b95433C08094
$$ -158339 -220756 56174 152406 248211 86879 6664 30419 226277 186831 -295433 308094
15165B18812a3754A58327L25236H655K88581j12176L25210e3691K3349A73233
$$ 218812 -13754 158327 483563 8655 297236 185060 510270 -53691 -30342 173233
15154B08109g569B16731G8353J6871A6623K0822K62837C4076b20940C5519M9214
$$ 208109 -7569 216731 78353 95224 16623 37445 300282 34076 -220940 35519 84733
15143H4733J10008g4021A5571J34948J33926B2803M19616a65779C45213j70621
$$ 84733 194741 -74021 15571 150519 284445 22803 442419 -165779 345213 174592
15133A74592e9415A36239i77D0360O5807M5600O8231K12506H7302d5690D60174
$$ 174592 -59415 136239 -977 40360 106167 151767 219998 432504 87302 -45690 460174
15121A4448J24120J16663F9579K11732r7477J16240j06782g043D4621K34742P8445
$$ 14448 138568 255231 69579 281311 183834 300074 193292 -7043 44621 279363 357808
15110C57808o5602j04255a55357C89572j60390n0175L63717B17964n5601O0348
$$ 357808 292206 187951 -155357 389572 229182 179007 542724 217964 162363 222711
15100B22711o369A2275L14205A07163D7941J04648a12941J5665A52763G66L12052
$$ 222711 216342 12275 326480 107163 47941 152589 -112941 -97276 152763 766 312818
15089C12818C0340J33225e5505m7893A87922A8763P9270J3257R4116K07182A48888
$$ 312818 30340 163565 -55505 -103398 187922 18763 98033 111290 205406 412588 148888
15077E15092A12919k8159J40034G7940a13603E1377K92422A69843L16598I3046
$$ 515092 112919 84760 224794 77940 -113603 51377 343799 169843 486441 93046
15066A35629O2886I1757J70907A23912b63974B14995o1665m1965A5636K78547
$$ 135629 198515 91757 262664 123912 -263974 214995 153330 111365 15636 294183
15056B94183k3244b9765D65985j65500b5607o58F8131c0602B58906j1416j7084
$$ 294183 270939 -29765 465985 300485 -25607 -26265 68131 -30602 258906 247490 230406
15045B30406H0517J44940R048J55004j33635I4742K07472j21755m2102J1267L40696
$$ 230406 80517 225457 234505 389509 255874 94742 302214 180459 138357 149624 490320
15034D90320A8755c6124B91444A16383M9547a29482m4955B80794p6627K73545
$$ 490320 18755 -36124 291444 116383 165930 -129482 -174437 280794 204167 477712
15024D77712R2027B33248k2654H4396L46010j20124j05780k712K04247A59116
$$ 477712 569739 233248 210594 84396 430406 310282 204502 201790 406037 159116
15013i8365k0121C00986b53439A80173N6499r699C4838K18953P4074m8758C6721
$$ -98365 -118486 300986 -253439 180173 236672 226973 34838 253791 327865 279107 36721
15001C6889L59901A36324k291L48159J9275A54657O0270P3554J06147A57594J00363
$$ 36889 396790 136324 134033 482192 501467 154657 214927 288481 394628 157594 257957
14990B57957j4364a12776B64298c4794A10777J83635l4334R718L9296a64891B07641
$$ 257957 243593 -112776 264298 -34794 110777 294412 260078 269796 309092 -164891 207641
14978B10588o9383R7309a54395J1502B4926M99517H8552K36874p6541J72978B03097
$$ 210588 141205 238514 -154395 -142893 24926 524443 88552 325426 248885 421863 203097
14966b0893A15416J74095K68370k67120P0690j17225L00614k07125a95798D06763
$$ -20893 115416 289511 557881 290761 361451 244226 544840 337715 -195798 406763
14955A6109K06453A10472M10589k12995o0620j23131R711K11060n3904A22848
$$ 16109 222562 110472 521061 308066 247446 124315 134026 345086 291182 122848
14944C74123K3754P5116J59979j14552B14911n3210P3381J65432k7403D4569N53185
$$ 374123 397877 472993 632972 518420 214911 161701 235082 400514 373111 44569 597754
14933E97754k47669E9825N04095c6321B26745M04412k45470K72548C05948F2023
$$ 597754 350085 59825 563920 -36321 226745 631157 385687 658235 305948 62023
14922C57784n2686A32321O9293G5286d5145F17116F4872N54050B97077A43959
$$ 357784 305098 132321 201614 75286 -45145 617116 64872 618922 297077 143959
14911E17846g2973C28398g4368A06434K19883k5302K18871B24227M03545l07582
$$ 517846 -72973 328398 -74368 106434 326317 301015 519886 224227 627772 320190
14901C20190L2975j33710M625M856O4239j07382L10278O9629k39282L8398j5683
$$ 320190 353165 219455 224080 228936 293175 185793 496071 565700 326418 364816 349133
14890C49133j45684J95651F0141J94749k1436M05245n8894B09860K96878j55845
$$ 349133 203449 399100 60141 254890 233454 638699 579805 209860 506738 350893
14880C50893j48608Q2930J99439B36311M15448A88145L92103k21103J63619k10380
$$ 350893 202285 285215 484654 236311 651759 188145 580248 359145 522764 312384
14870C12384L61023l30727J34222j69550j560r9072P6472K77797r3672k26211
$$ 312384 673407 342680 476902 307352 305792 206720 283192 560989 467317 241106
14860B41106K00597N0785M3873j12891j46984L04467k71325L19943C06386N6255
$$ 241106 441703 492488 536361 423470 276486 580953 309628 629571 306386 362641
14850C62641K79980k51287A35710J49742M2457j42594L52305r5648R293j67063
$$ 362641 642621 391334 135710 285452 327909 185315 537620 441972 451265 284202
14840B84202J6588J22818o9407J12694j95917J24333n3756Q0775A19560M52851
$$ 284202 300790 423608 354201 466895 270978 395311 341555 422330 119560 572411
14830E72411L43082D33720K04149j04104j69273J42006J1202B4297N82724q4899
$$ 572411 915493 433720 637869 533765 364492 506498 517700 24297 607021 522122
14820E22122k40769L76020k66327K51740A01810O48764j50039o9578P7467j17547
$$ 522122 281353 657373 391046 642786 101810 750574 600535 530957 608424 490877
14810D90877P095J30424k25468m9061L59277q0402J71305l66827K47799j55253
$$ 490877 497972 628396 402928 353867 713144 632742 804047 437220 685019 529766
14800E29766L59358j14058j85045J75570l47397L47019k23765l2799Q8990L1915
$$ 529766 889124 775066 590021 765591 418194 765213 541448 508649 597639 629554
14790F29554k92191J30039K34796B88448J00552J97958j48203J56385j85395O3649
$$ 629554 337363 467402 702198 288448 389000 586958 438755 595140 409745 473394
14780D73394L88731k0005k82554J24903r682j92519l0292J07554K87359k84q4293
$$ 473394 862125 842120 559566 684469 674787 482268 451976 559530 846889 846605 762312
14769G62312q7535A91463K97782M19415k08116k64530K9954j52667N56434k91196
$$ 762312 674777 191463 489245 908660 700544 436014 465968 313301 869735 578539
14759E78539K10253j09677j01554O4878N8792j26670o2742L91038l05849M215
$$ 578539 788792 679115 577561 642439 701231 574561 511819 902857 597008 601223
14749F01223J723K26781j25124p0770M8067j35306J47621m9872K42215k99135
$$ 601223 602946 829727 704603 633833 681900 546594 694215 644343 886558 587423
14739E87423O1646J32907j4455j87070P7825M32706k45467l2347J79640j02151
$$ 587423 649069 781976 767521 580451 658276 1090982 845515 813168 992808 890657
14729H90657k67965K18203J38680l43856L95408l88438L36262k08242K02642j92433
$$ 890657 622692 840895 979575 635719 1031127 642689 978951 770709 973351 780918
14719G80918j2252O5720J2273l45305p7972K51308J87195J17532J15701j47396
$$ 780918 768666 834386 846659 501354 423382 674690 861885 979417 1095118 947722
14709I47722n5135J3527K9948k26364K21895N8838j16424J85189m29783K98873
$$ 947722 892587 906114 936062 709698 931593 990431 874007 1059196 629413 928286
14699I28286P0130j68995R2015p9353k66206N15317k5504p4605j64562J99507
$$ 928286 998416 829421 921436 842083 575877 1091194 1065690 991085 826523 1026030
14689A026030N5809l49635K82608j04567R8851J67172j94070M9625k19452K53033
$$ 1026030 1081839 732204 1014812 910245 1009096 1176268 982198 1031823 812371 1065404
14679A065404k95425M90740q0164j55824p9062K45831R7882k95448l649K35220
$$ 1065404 769979 1260719 1180555 1024731 945669 1191500 1289382 993934 990285 1225505
14669A225505l28155Q3981j474K52258p3134k61295K33072j58698M26210j22107
$$ 1225505 897350 981331 979857 1232115 1158981 897686 1130758 972060 1398270 1276163
14659A276163O5515j45897j84342M28825j96809j69407j21483N64206r3287l41478
$$ 1276163 1341678 1195781 1011439 1440264 1243455 1074048 952565 1516771 1423484 1082006
14649A082006J85290m0783l0337o4789J90151k52091j17029L0688J87786N63L34168
$$ 1082006 1267296 1226513 1196176 1131387 1321538 1069447 952418 983106 1170892 1171455 1505623
14638A505623j27704J01411n58944M40344J43628J07726Q0171k99590K43305k42232
$$ 1505623 1377919 1479330 920386 1360730 1504358 1612084 1692255 1392665 1635970 1393738
14628A393738J4525r2368J08799P3874J68465k73227k61609o289K30228k8434
$$ 1393738 1408263 1315895 1424694 1498568 1667033 1393806 1132197 1125908 1356136 1327702
14618A327702L94461n26699o7974K20858N06512k70970R3173K6099o3629j97666
$$ 1327702 1722163 1195464 1127490 1348348 1854860 1583890 1677063 1703162 1639533 1441867
14608A441867L53514l29101J69294J04816n09726N85475l87379L63030m6073K26935
$$ 1441867 1795381 1466280 1635574 1740390 1230664 1816139 1428760 1791790 1745717 1972652
14598A972652l02666K08172o80588M54925L9926r8187K6502K50841l12723L4855
$$ 1972652 1669986 1878158 1197570 1652495 1692421 1594234 1620736 1871577 1558854 1593709
14588A593709K99827M3795k74191L69380k45070L04950O5617j78732o93K89902
$$ 1593709 1893536 1937331 1663140 2032520 1787450 2092400 2158017 1979285 1978592 2268494
14578B268494j41997K00637l7425j16293L2374k42762K97409j83348j08838K57183
$$ 2268494 2126497 2327134 2289709 2173416 2205790 1963028 2260437 2077089 1968251 2225434
14568B225434J07134j30078l4731M15761k48273J69068M34107k59947M1088J81529
$$ 2225434 2332568 2202490 2167759 2583520 2335247 2504315 2938422 2678475 2719563 2901092
14558B901092m7194M55487K28180n2492R2058J10450N97115M11004J072880K404359
$$ 2901092 2853898 3309385 3537565 3485073 3577131 3687581 4284696 4695700 5768580 8172939
14548H172939M480209J0676883J6580940N116520A8521909H165034k154144j013703
$$ 8172939 12653148 23330031 39910971 45027491 18521909 8165034 6010890 4997187
14540D997187j792742j124827J49876J6763j97989J27682j30116r8765J36767
$$ 4997187 3204445 2079618 2229494 2246257 2048268 2175950 2045834 1947069 2083836
14531B083836k8019R4715M06498m60939o2275J97349k35230L34848p6995K09264
$$ 2083836 2055817 2150532 2557030 2096091 2033816 2231165 1995935 2330783 2253788 2463052
14521B463052k5153Q4115k71129M42339k08134m3941L81418n5733J92566j15492
$$ 2463052 2437899 2522014 2250885 2693224 2485090 2441149 2822567 2766834 2959400 2843908
14511B843908k70085P01790o73837M03514J23788m6136K20456m04905J21627K14525
$$ 2843908 2573823 3275613 2601776 3005290 3129078 3082942 3303398 2898493 3020120 3234645
14501C234645R01R4316l27426K86216j44182K13098J14583j20126p3554N5327
$$ 3234645 3235546 3329862 3002436 3288652 3144470 3357568 3472151 3352025 3278471 3333798
14491C333798M65960j40831r6681J86918k48786K68082K1298j93766L22329j24762
$$ 3333798 3799758 3658927 3562246 3749164 3500378 3768460 3789758 3595992 3918321 3793559
14481C793559L75810m00235K7758M99485l7733l2532k86072M04209j76707O8097
$$ 3793559 4169369 3769134 3796892 4296377 4258644 4226112 3940040 4344249 4167542 4235639
14471D235639J40869O8460k74315K71651K74633J08230J91239l93835J91837n2432
$$ 4235639 4376508 4444968 4170653 4442304 4716937 4825167 5016406 4622571 4814408 4761976
14461D761976R5929J75703m9028p7803M76393k88937j14987L80544k00522K28054
$$ 4761976 4857905 5033608 4984580 4906777 5383170 5094233 4979246 5359790 5159268 5387322
14451E387322o7365O2702J32404K70124k44657L25473K6825N4310L47246L4448
$$ 5387322 5319957 5382659 5515063 5785187 5540530 5866003 5892828 5947138 6294384 6328832
14441F328832j73846Q9749k3782m5950J86507J77570J08213k26819J43572k59833
$$ 6328832 6154986 6244735 6220953 6175003 6361510 6539080 6647293 6420474 6564046 6304213
14431F304213O12061J82847L12386k67510M85957J60311k83074m6289K07459J89800
$$ 6304213 6916274 7099121 7411507 7143997 7629954 7790265 7507191 7460902 7668361 7858161
14421G858161j84495M88208N8432j23023J51116M45799L2673p7742K51328N0420
$$ 7858161 7673666 8161874 8220306 8097283 8248399 8694198 8726871 8649129 8900457 8950877
14411H950877J68760r2957J27840N86394J28601K60320m33754K75342K22645m946
$$ 8950877 9119637 9026680 9154520 9740914 9869515 10129835 9696081 9971423 10194068 10189122
14401A0189122K0302M43198J5793M08708K73529K72980k5J70348K40866Q2559
$$ 10189122 10209424 10652622 10668415 11077123 11350652 11623632 11623607 11793955 12034821 12117380
14391A2117380N87345o9287Q6645P11354p6737K32507M3146L91389Q7850M86575
$$ 12117380 12704725 12635438 12722083 13433437 13356700 13589207 13632353 14023742 14111592 14598167
14381A4598167J50870M04073J63181L36784L01198L46041J09725M98152M33494
$$ 14598167 14749037 15153110 15316291 15653075 15954273 16300314 16410039 16908191 17341685
14372A7341685N11328p8217O83569J91053N24828J50703O65984J81927L04691
$$ 17341685 17853013 17774796 18458365 18649418 19174246 19324949 19990933 20172860 20477551
14363B0477551N11901N28875M44131N92808L78548L35720O82630P61912M53563
$$ 20477551 20989452 21518327 21962458 22555266 22933814 23269534 23952164 24714076 25167639
14354B5167639L83942O75231M66324Q75810N38544O74775R81923P97909L75983
$$ 25167639 25551581 26226812 26693136 27568946 28107490 28782265 29764188 30562097 30938080
14345C0938080O69611J013923O48830J143097J097275Q29731J044372R90815N60822
$$ 30938080 31607691 32621614 33270444 34413541 35510816 36340547 37384919 38375734 38936556
14336C8936556J556764J339169J257525J212527J044234J365009J561302J577674
$$ 38936556 40493320 41832489 43090014 44302541 45346775 46711784 48273086 49850760
14328D9850760J603366J423339J728151J713270J956829K270914J476775K305178
$$ 49850760 51454126 52877465 54605616 56318886 58275715 60546629 62023404 64328582
14320F4328582K512822K531886K741873K475935K291055L229775L020527L154751
$$ 64328582 66841404 69373290 72115163 74591098 76882153 80111928 83132455 86287206
14312H6287206L332439L676766L891629M121262M101982M360865M700493N414737
$$ 86287206 89619645 93296411 97188040 101309302 105411284 109772149 114472642 119887379
14304A19887379N329200N723804O265703N966463O558200P121301P514856P970878
$$ 119887379 125216579 130940383 137206086 143172549 149730749 156852050 164366906 172337784
14296A72337784Q384800Q723038R328784R863305J0271645J0396056J1263951
$$ 172337784 180722584 189445622 198774406 208637711 218909356 229305412 240569363
14289B40569363J1936034J2314135J3069882J3134771J3637312J4171279J4393697
$$ 240569363 252505397 264819532 277889414 291024185 304661497 318832776 333226473
14282C33226473J4710539J4338517J4450855J4005491J3641106J2793046J1740872
$$ 333226473 347937012 362275529 376726384 390731875 404372981 417166027 428906899
14275D28906899J0649006Q654621M907578J561944k22220j954922L594075n633521
$$ 428906899 439555905 448210526 453118104 454680048 454457828 452502906 456096981 450463460
14267D50463460l031983m948548q888446j0000902j2000481j3231751j3977898
$$ 450463460 447431477 442482929 433594483 423593581 411593100 398361349 384383451
14260C84383451j4647310j5129027j5475803j5376874j4942200j5278366j3816044
$$ 384383451 369736141 354607114 339131311 323754437 308812237 293533871 279717827
14253B79717827j3915686j2003799j2420920j2253239j1375996j1098839j0038543
$$ 279717827 265802141 253798342 241377422 229124183 217748187 206649348 196610805
14246A96610805r820440q926254q305657p716770p895942p164573o651030o161717
$$ 196610805 186790365 177864111 169558454 161841684 153945742 146781169 140130139 133968422
14238A33968422n957659m966814n637886n155583m976040m148793m569803l304757
$$ 133968422 128010763 123043949 117406063 112250480 107274440 103125647 98555844 95251087
14230I5251087l572775l827419l289275l323006k858088l557143k233465k897024
$$ 95251087 91678312 87850893 84561618 81238612 78380524 74823381 72589916 69692892
14222F9692892k511504k014644k198706k487624j829044j876988k087349j479673
$$ 69692892 67181388 65166744 62968038 60480414 58651370 56774382 54687033 53207360
14214E3207360j111788j940462j664430j630558j462881r78558j714163l40017
$$ 53207360 52095572 50155110 48490680 46860122 45397241 44418683 42704520 42364503
14206D2364503j316552j418906j124261p23334j258526j197504p83681q00231
$$ 42364503 41047951 39629045 38504784 37781450 36522924 35325420 34541739 33741508
14198C3741508j076568o26837j119664m12553r01289r63575k33215p85797j091289
$$ 33741508 32664940 32038103 30918439 30505886 29604597 28641022 28407807 27622010 26530721
14189B6530721k94337o72914p24806j7586q20457n88510o56246k48383p00485
$$ 26530721 26236384 25563470 24838664 24821078 24000621 23412111 22755865 22507482 21806997
14180B1806997m70232n24042k20168o26676l34540m58297j95258n38276m02849
$$ 21806997 21336765 20812723 20592555 19965879 19631339 19173042 18977784 18439508 18036659
14171A8036659n89885k4508q8860m46219k00989l40059m41385k63119m02480n0663
$$ 18036659 17446774 17422266 17333406 16887187 16686198 16346139 15904754 15641635 15239155 15188492
14161A5188492k39205o96993j14622J44960m07340n49187K94140m25744k90124
$$ 15188492 14949287 14252294 14137672 14282632 13875292 13326105 13620245 13194501 12904377
14152A2904377k55m67519k07345N5007m11829m0387l17471j11866k17271l11828
$$ 12904377 12904122 12436603 12229258 12284265 11872436 11832049 11514578 11402712 11185441 10873613
14142A0873613r8548J42113n28825J67421o75770N560Q2241k65818m2752j90921
$$ 10873613 10775065 10917178 10388353 10555774 9880004 9885564 9967805 9701987 9659235 9468314
14132I468314m04927N64809m55397j22691n6782k80778P6203k70546j91173l41334
$$ 9468314 9063387 9628196 9172799 9050108 8993326 8712548 8788751 8518205 8327032 7985698
14122G985698J58384m78894M17882j71864j97824R8731o8755n56043P9968J76270
$$ 7985698 8144082 7665188 8083070 7911206 7713382 7812113 7743358 7187315 7267283 7443553
14112G443553l68222M7351k3138j42831j19261j47658q3255k39298J26024j56377
$$ 7443553 7075331 7122682 7099544 6956713 6837452 6689794 6606539 6367241 6493265 6336888
14102F336888K3907k71956l5288J99291l39491O9402l89J68565l55210k3493P8366
$$ 6336888 6360795 6088839 6053551 6252842 5913351 5982753 5982364 6150929 5795719 5772226 5850592
14091E850592l95571j06129N2483k2911M75073o07367k75875j27037P040M54435
$$ 5850592 5455021 5348892 5401375 5378464 5853537 5246170 4970295 4843258 4850298 5304733
14081E304733n4126k37291K3160m91405N34130l81823L767k5236L9746j75607
$$ 5304733 5250607 5013316 5036476 4545071 5079201 4697378 4701145 4675909 4715655 4540048
14071D540048j27642J71744m2224j88716k6931k79852J36254j05780J14404j32929
$$ 4540048 4412406 4584150 4541926 4353210 4326279 4046427 4182681 4076901 4191305 4058376
14061D058376J87385j27369P7973L2000q7603J53804k55415j94984l91353M25044
$$ 4058376 4245761 4118392 4196365 4228365 4140762 4294566 4039151 3844167 3452814 3877858
14051C877858L2912N2622l05643j40376q7548K9487J26742r9296K45061l31502
$$ 3877858 3910770 3963392 3657749 3517373 3429825 3459312 3586054 3486758 3731819 3400317
14041C400317q6389k48273K82743R8897j02754m48910p239J54300k21564L77921
$$ 3400317 3313928 3065655 3348398 3447295 3344541 2895631 2888392 3042692 2821128 3199049
14031C199049J22600k24917l1745J97003L77j19815l30130L67725k34666l6410
$$ 3199049 3321649 3096732 3064987 3261990 3262367 3142552 2812422 3180147 2945481 2909071
14021B909071M774p300k27432m680n4302p9864J20922k1785k466r6844K39876
$$ 2909071 2913845 2906545 2679113 2674433 2620131 2540267 2661189 2639404 2636938 2540094 2779970
14010B779970m89894M59089k27416q722k39331Q3194j14895r1699J68190m6079
$$ 2779970 2290076 2749165 2521749 2513027 2273696 2356890 2241995 2150296 2318486 2272407
14000B272407J4374k07629K31836J44761l00187j59501R6122j8640m8081J59026
$$ 2272407 2286781 2079152 2310988 2455749 2155562 1996061 2092183 2073543 2025462 2184488
13990B184488O4702J505200L047636Q681967J7641780J5767231k3169938j2712642
$$ 2184488 2249190 3754390 6802026 15483993 33125773 48893004 25723066 13010424
13982A3010424n169955k370452j069443k41341n56686n91220o5111J03692j05659
$$ 13010424 7840469 5470017 4400574 4159233 3602547 3011327 2946216 3049908 2944249
13973B944249j89969r8705j6208k49884J01814Q6108k97395N241j6991j14310
$$ 2944249 2754280 2655575 2639367 2389483 2491297 2577405 2280010 2285251 2268260 2153950
13963B153950k58173L00218m30488L40356m2855J8110n4758j83554K52204L9532
$$ 2153950 1895777 2195995 1765507 2105863 2063008 2081118 2026360 1842806 2095010 2134542
13953B134542J65824m50799r0312K28136m1525p5297K08668j77029j79123l86204
$$ 2134542 2300366 1849567 1759255 1987391 1945866 1870569 2079237 1902208 1723085 1336881
13943A336881J71878M04747l06248M54796l06525M6070j32891K54017j04387l34147
$$ 1336881 1508759 1913506 1607258 2062054 1755529 1801599 1668708 1922725 1818338 1484191
13933A484191K55390j55170k4245Q9113J1419p9675K41150k44762K03752j20086
$$ 1484191 1739581 1584411 1560166 1649279 1660698 1581023 1822173 1577411 1781163 1661077
13923A661077l51030K12783L2235L2401j72795J26851J40730m04351N25904l46925
$$ 1661077 1310047 1522830 1555065 1587466 1414671 1541522 1682252 1277901 1803805 1456880
13913A456880N6639L7718j87152k3186O3293j04831o0738M16251k29712j59518
$$ 1456880 1513519 1551237 1364085 1340899 1404192 1299361 1238623 1654874 1425162 1265644
13903A265644K56805j94892Q449J27884j46901l76088K58995k925k752j12251
$$ 1265644 1522449 1327557 1336006 1463890 1316989 940901 1199896 1196971 1194219 1081968
13893A081968M68795l91213j8293J35316J04657O1434j93745R9348J26596k32223
$$ 1081968 1550763 1159550 1141257 1276573 1381230 1442664 1248919 1348267 1474863 1242640
13883A242640K24192l47566k5873J91905N3057K802p524k96870K17796J27366
$$ 1242640 1466832 1119266 1093393 1285298 1338355 1341157 1333633 1036763 1254559 1381925
13873A381925j44192l3400L760J78039P7005G13628M84540l34924M95287m55448
$$ 1381925 1237733 1204333 1208093 1386132 1463137 713628 1198168 863244 1358531 903083
13863I03083L86364k73357m9487j0018J21035r4677L65137k87124m0171l4861
$$ 903083 1289447 1016090 966603 956585 1077620 982943 1348080 1060956 1020785 985924
13853I85924m7543l3471K53042m4976l20039K43278r670L8914k75519L87717K5435
$$ 985924 938381 904910 1157952 1112976 792937 1036215 1026545 1065459 789940 1177657 1203092
13842A203092k72813j6002N7165J46665l12253J66193P4221Q626n9702j79610
$$ 1203092 930279 914277 971442 1118107 805854 972047 1046268 1054894 995192 815582
13832H15582K50691j03364N5745K6739j74754j67277L89153j23270R3149k58102
$$ 815582 1066273 962909 1018654 1045393 870639 703362 1092515 969245 1062394 804292
13822H04292q1460K97504J98369l14527k33079L22284k8293p8707j03235P1208
$$ 804292 722832 1020336 1218705 904178 671099 993383 965090 886383 783148 854356
13812H54356j57517Q1446q6025J7802L03905k13730Q3624r1904L5531j04784o679
$$ 854356 696839 778285 692260 710062 1013967 800237 883861 791957 827488 722704 716025
13801G16025R4216K846J41333k42457o9907K03184k49689L44626k47692R4242
$$ 716025 810241 813087 954420 711963 642056 845240 595551 940177 692485 786727
13791G86727j2984K34022k42324J42872k06186k37759K82703J52562k96012m2069
$$ 786727 773743 1007765 765441 908313 702127 464368 747071 899633 603621 561552
13781E61552K00193k05793q3260M15063L457r1836N6884L801k51888N0774J3728
$$ 561552 761745 555952 472692 887755 891212 799376 856260 860061 608173 658947 672675
13770F72675j56410n6410K16461j24386j39381P3628Q6408J04804K4631J27368
$$ 672675 516265 459855 676316 551930 412549 486177 572585 677389 702020 829388
13760H29388l64544N5789l4173N92946k19589p6352j79266Q7751j28042m6284
$$ 829388 464844 520633 486460 1079406 859817 783465 604199 691950 563908 517624
13750E17624P3826j08217L782j01974K70105L6105l08687J29194J6256J82327
$$ 517624 591450 483233 487015 385041 655146 691251 382564 511758 528014 710341
13740G10341l00231M5706J39008K19182j5630k96152J10966m5049j61842N1514
$$ 710341 410110 455816 594824 814006 798376 502224 613190 568141 406299 457813
13730D57813R1709k29128j33567N52110k49589P6941j81003K09252j32438K62057
$$ 457813 549522 320394 186827 738937 489348 566289 385286 594538 462100 724157
13720G24157o8753j99709k08090P29200B52038M82075j96992o123K41814C46502
$$ 724157 655404 455695 247605 976805 252038 734113 537121 530998 772812 346502
13709F42043J02728k14303R5180j00035n9522K18898q5363j2659m3562q9081K73160
$$ 642043 744771 530468 625648 525613 466091 684989 599626 586967 543405 454324 727484
13698G27484j58496K92020B02164L43748k48797K2270J09143K8176j58415J70008
$$ 727484 568988 861008 202164 545912 297115 319385 428528 456704 298289 468297
13688D68297L3017k03173K36831j57296k3044P2472k06400l178L93065j10109
$$ 468297 501314 298141 534972 377676 354632 427104 220704 217526 610591 500482
13678E00482j11209J99752j07200M48051D55208J84153A55507J69990M7683k5172
$$ 500482 389273 589025 481825 929876 455208 639361 155507 325497 373180 348008
13668C48008K67468j28248K34389k61094A18544L45002P6402B59314J60965K95827
$$ 348008 615476 487228 721617 460523 118544 463546 539948 259314 420279 716106
13658G16106p2048l12028J12368A40738L64918J30608B96671o2375L12744J04413
$$ 716106 644058 332030 444398 140738 505656 636264 296671 234296 547040 651453
13648F51453j06690j02939k08560P0693M7251J46682j45161A14885L58254j89990
$$ 651453 544763 441824 233264 303957 351208 497890 352729 114885 473139 283149
13638B83149J81614o9807p8367o6013I4287L76293J72895B26647K14804B09242
$$ 283149 464763 394956 316589 250576 94287 470580 643475 226647 441451 209242
13627B37900Q2512M46132k92528B18860K79558k12884K41070I5379L34899j07509
$$ 237900 320412 766544 474016 218860 498418 285534 526604 95379 430278 322769
13617C22769K49746R2957l29861A55012L20507B05541J82867l1570J43241J8071
$$ 322769 572515 665472 335611 155012 475519 205541 388408 356838 500079 518150
13607E18150k0829R6054B31609P8793K32943A69772O8035H5020N19637A88738
$$ 518150 497321 593375 231609 310402 543345 169772 237807 85020 604657 188738
13596D87482M2017j71347K16938j35218J9331N5688B11526j1933M33637B67915
$$ 487482 529499 358152 575090 439872 459203 514891 211526 199593 633230 267915
13585B09791q82M57266j74533j42772K37547l3294A55857J10963K91330B29776
$$ 209791 208909 666175 491642 348870 586417 553123 155857 266820 558150 229776
13574F8756L07027C5078J91797K68052F1940O01433F1990M73332j10167p0896
$$ 68756 375783 35078 226875 494927 61940 663373 61990 535322 425155 354259
13564C54259m0221L908J01181J27945j07685A53542L38756B27997K30745B04186
$$ 354259 314038 317946 419127 547072 439387 153542 492298 227997 458742 204186
13553A14365P6187j3922L62503A88995O0281K74213c4458B92296a24601D59205
$$ 114365 190552 176630 539133 188995 249276 523489 -34458 292296 -124601 459205
13542C39324j59764h8201A07925N2626Q6133J12222j3558A51180J12452o9473
$$ 339324 179560 -88201 107925 160551 246684 358906 345348 151180 263632 194159
13532A94159K62890k7623K9122p7742m6144P569q1526O3557J28993q6820E2833
$$ 194159 457049 429426 458548 380806 334662 342231 260705 324262 453255 366435 52833
13520E71840I4781K04679O2170B9026Q9514J35617b7259E97483j03995q9738j90535
$$ 571840 94781 299460 361630 29026 118540 254157 -27259 597483 493488 403750 213215
13509B13215M5120d003B77308J41712K12057B39985J73809e3518C44153K7545
$$ 213215 258335 -4003 277308 419020 631077 239985 413794 -53518 344153 371698
13499C71698I7211J53173o5478Q2853L3874a80584D05242n7736m6756E964L99675
$$ 371698 97211 250384 184906 267759 301633 -180584 405242 347506 300750 5964 405639
13488D05639Q9872A78138J80074O2371K35747j87100k29013G6431K54743r2443
$$ 405639 495511 178138 358212 420583 656330 469230 240217 76431 331174 238731
13478B38731a36710C14210j33810J17006K10802B01151E5364l736L3816J73281
$$ 238731 -136710 314210 180400 297406 508208 201151 55364 51628 85444 258725
13468B58725J0530H6429J36317c1012D07196K63675C5899J9012a2964C99356j43934
$$ 258725 269255 86429 222746 -31012 407196 670871 35899 54911 -12964 399356 255422
13457B55422b5715C42740K275o7981J89342D0660k653j8426J54288J10630j11684
$$ 255422 -25715 342740 345015 277034 466376 40660 38007 19581 173869 284499 172815
13446A72815j1868h0259h282A73896K99828n6384A01905L60255A81235N43J34654
$$ 172815 160947 -80259 -8282 173896 473724 417340 101905 462160 181235 181778 316432
13435C16432A50325K40192H4849j187o435J00417J81802E6921J22038Q372l806
$$ 316432 150325 390517 84849 83662 77227 177644 359446 56921 178959 187331 183525
13424A83525L7529O5675A02763J69252R3609B6854b61349D76650A18881N4492
$$ 183525 221054 286729 102763 272015 365624 26854 -261349 476650 118881 173373
13414A73373E097R8682c2033j00516A6994J37651Q8627K1673O8000m5910p5343
$$ 173373 5097 103779 -32033 -132549 16994 154645 243272 264945 332945 287035 211692
13403B11692p099H4556K65781J9708C830J83430d2090B75316A34834K9626J9302
$$ 211692 204593 84556 350337 370045 3830 187260 -42090 275316 134834 164460 183762
13392A83762j2762a64054C68495J23354j29816a97194B29405A03816J45430l4740
$$ 183762 171000 -164054 368495 491849 362033 -197194 229405 103816 249246 214506
13382B14506l9661J33568A1763J12792D7123K852K69197P2867j93358K9569F9131
$$ 214506 174845 308413 11763 124555 47123 49975 319172 392039 198681 228250 69131
13370A83898R9532M5071l6386A11409N700b92608A82353N63392h6997C15408m4179
$$ 183898 283430 328501 292115 111409 117109 -292608 182353 745745 -86997 315408 271229
13359B71229C4108L0104a12933F81160B98375M7769j7867j46330J06986M04157
$$ 271229 34108 64212 -112933 681160 298375 346144 328277 181947 288933 693090
13349F93090I7379b1568B63966j28872J28122o6239L4966J12320r1871J59875
$$ 693090 97379 -21568 263966 135094 263216 196977 231943 344263 252392 412267
13339D12267Q0164k7028h699A90234L78884k43286j11109N2183J41976j93673
$$ 412267 492431 465403 -8699 190234 569118 325832 214723 266906 408882 215209
13329B15209E7326J72178J39213A78709P1160M72501B62269b58831B10413q524
$$ 215209 57326 229504 368717 178709 249869 722370 262269 -258831 210413 201889
13319B01889G3678J16256K8457N1468a35170C16513A18401L42546A26198B0435
$$ 201889 73678 189934 218391 269859 -135170 316513 118401 460947 126198 20435
13308i8125I2824J93373j34215J2758B3377a42471C90946A33584J88844D1381
$$ -98125 92824 286197 151982 164740 23377 -142471 390946 133584 322428 41381
13297A91502J12088n7321P662r0963D2991J98744p0181o8164Q3117j6440g0462
$$ 191502 303590 246269 253931 162968 42991 241735 171554 103390 186507 170067 -70462
13285A86676G8869C3229c7778j37412A65495J72457c4493A44885M76404e2049
$$ 186676 78869 33229 -37778 -175190 165495 337952 -34493 144885 621289 -52049
13274C82741j84890H5771A4273K61929j00008p2879J73440b235p5584B08901i1853
$$ 382741 197851 85771 14273 276202 176194 103315 276755 -2235 -77819 208901 -91853
13262a12665A05581J58669D792L3504i4630B1062J90842i5979A72734K5499J9153
$$ -112665 105581 264250 4792 38296 -94630 21062 211904 -95979 172734 198233 217386
13251B17386f1035n2188A58731a22567p4498B39309L52027k79290F3306J91414
$$ 217386 -61035 -113223 158731 -122567 -197065 239309 591336 312046 63306 254720
13241B54720r6067g2601B66124i8386G9852e5784B62312J79982c87166D5469J45481
$$ 254720 158653 -72601 266124 -98386 79852 -55784 262312 442294 -387166 45469 190950
13230A90950c082A93314l5444J9552h9852K8538D623g7765C03511A30250n2892
$$ 190950 -3082 193314 157870 177422 -89852 -61314 4623 -77765 303511 130250 77358
13219G7358C4480K41749E8720O8005l0067k6059M971J96511c4168A49326m1800
$$ 77358 34480 276229 58720 126725 96658 70599 75570 272081 -34168 149326 107526
13208A07526M1809M2349I1689M0879e0179A04349h1861E0664L11884k2905j66085
$$ 107526 149335 191684 91689 132568 -50179 104349 -81861 50664 362548 339643 173558
13197A73558i5978B72534J14698j74644A0043J67578a21304A17500n378L56791
$$ 173558 -95978 272534 387232 212588 10043 177621 -121304 117500 112122 468913
13187D68913G3270P8279J81619F7526M1716L52887j94523D3707J86730f2294m4660
$$ 468913 73270 151549 333168 67526 109242 462129 267606 43707 230437 -62294 -106954
13176a06954C32659A08700J8258C4907J57123C7311J21995a00127A60606Q0049
$$ -106954 332659 108700 126958 34907 192030 37311 159306 -100127 160606 240655
13166B40655j04860b3A29767M5703J08692d5582A58518E2853a93299D21861a45507
$$ 240655 135795 -23 129767 175470 284162 -45582 158518 52853 -193299 421861 -145507
13154b09099A12987l9251L0609M2597k0005a81145F0835K06267A02478L11524
$$ -209099 112987 73736 104345 146942 126937 -181145 60835 267102 102478 414002
13144D14002j97669c7159A05595J1810l042A9989J63421d0138j53898B90368I0071
$$ 414002 216333 -37159 105595 117405 114363 19989 183410 -40138 -194036 290368 90071
13132e9101C38216A27510D8806b5589l3734B79417D070i6145A33613Q9829r1493
$$ -59101 338216 127510 48806 -25589 -59323 279417 4070 -96145 133613 223442 131949
13121A31949E0154j8569P6462i8852I5679k7915A6228a31403B50155D5022J05293
$$ 131949 50154 31585 108047 -98852 95679 67764 16228 -131403 250155 45022 150315
13110A50315B7299J83532q8209K47896B9723N7513J60169j06980g3738A45843
$$ 150315 27299 210831 122622 370518 29723 87236 247405 140425 -73738 145843
13099A35493Q0669c4008C18513F9574M44297B3607c7935h883k02994G5402B2541
$$ 135493 216162 -34008 318513 69574 513871 23607 -37935 -8883 -211877 75402 22541
13087B50169C202N3843J35998M4047J22746d2835A60114a20013N7926B64591A6294
$$ 250169 3202 57045 193043 237090 359836 -42835 160114 -120013 -62087 264591 16294
13075B00584a00941a1236I1025R9553e0257j62848B71287l9709q6389b71285c4924
$$ 200584 -100941 -11236 91025 190578 -50257 -213105 271287 231578 145189 -271285 -34924
13063C75657c53743a58721B84814b238B70423f4328A03521j0244f4316j92195
$$ 375657 -353743 -158721 284814 -2238 270423 -64328 103521 93277 -64316 -256511
13053b56511a2432l2340m8782C86424j63456h3759P076B11716K7254K91044G9225
$$ -256511 -12432 -44772 -93554 386424 222968 -83759 -76683 211716 238970 530014 79225
13041B54012p468a98923l3543A56523a5421k38660C07577j44733F2715f4777k38161
$$ 254012 246544 -198923 -232466 156523 -15421 -254081 307577 162844 62715 -64777 -302938
13030c02938A72224q0630k8182J19145a80896j42660H3722J34767J2195j2199
$$ -302938 172224 91594 63412 182557 -180896 -323556 83722 218489 230684 218485
13020B18485B0977P4186a59899A31295C3906c8248A22901i2225F1439a78739d152
$$ 218485 20977 95163 -159899 131295 33906 -38248 122901 -92225 61439 -178739 -4152
13008G0762j6862J30K9493h2201o1773B40219H3689d6489j1066C2553K01807a57785
$$ 70762 53900 54030 83523 -82201 -143974 240219 83689 -46489 -57555 32553 234360 -157785
12995D10805i021A16809a13841A24501a83600J2742F487K321O4125J57775g8913
$$ 410805 -9021 116809 -113841 124501 -183600 -170858 6487 8808 72933 230708 -78913
12983G9481J59701q9073l4516J9236K8870n2213J72944F6022j5747a65831A58460
$$ 79481 239182 150109 115593 134829 163699 111486 284430 66022 50275 -165831 158460
12971C585K32031a22506M9837m1019D1500e2055A43578a55048a3130C09277A00225
$$ 3585 235616 -122506 -72669 -113688 41500 -52055 143578 -155048 -13130 309277 100225
12959c17326D5907b26994Q8149O8713B6666a30826B39245b19020F12Q1451g4075
$$ -317326 45907 -226994 -138845 -70132 26666 -130826 239245 -219020 612 82063 -74075
12947A42228K3345a69854B1853c08800B40990A10349A5487B631a0712I1695q714
$$ 142228 165573 -169854 21853 -308800 240990 110349 15487 2631 -10712 91695 82981
12936H2981a021A9832b7698l40213a64724e4606A61060p7911e9101B0710c7104
$$ 82981 -1021 19832 -27698 -367911 -164724 -54606 161060 83149 -59101 20710 -37104
12924A00243D6376b6721A09915K40529D8671J1019K76257G4093K35165d44491
$$ 100243 46376 -26721 109915 350444 48671 59690 335947 74093 309258 -444491
12913H1590C1017e8844F8267K16116e2086B52899a14749B5587c1917A54671D8163
$$ 81590 31017 -58844 68267 284383 -52086 252899 -114749 25587 -31917 154671 48163
12901D5161f9071I4968k7590L11270a19358E4008K474M5669g0435A3064J42465
$$ 45161 -69071 94968 67378 378648 -119358 54008 56482 102151 -70435 13064 155529
12890A55529o3405O6109F904a34849C12732F0375J22124m3376c03047A18441l0336
$$ 155529 92124 158233 6904 -134849 312732 60375 182499 139123 -303047 118441 88105
12879H8105e9872H3800b4751B30245a34580m3411B40541i4972C20555o4816F9424
$$ 88105 -59872 83800 -24751 230245 -134580 -177991 240541 -94972 320555 255739 69424
12867f542B38282E9737j7696b7388A62841a86164C5092h2362A097J37106j0790
$$ -6542 238282 59737 42041 -27388 162841 -186164 35092 -82362 1097 138203 127413
12856A27413n4311c5858A8871M693b35185d6150l00138A13207J4142d03586A91292
$$ 127413 73102 -35858 18871 23564 -235185 -46150 -346288 113207 127349 -403586 191292
12844G7272a97727A06729a1654F9468J10028J02A7916a62370G8935K30874b5359
$$ 77272 -197727 106729 -11654 69468 179496 179598 17916 -162370 78935 309809 -25359
12832a4283A29339a01687B96112A46018b72552A38114b13524C9157J75172C9696
$$ -14283 129339 -101687 296112 146018 -272552 138114 -213524 39157 214329 39696
12821c3825j60184D70534B5888b54966A55939c33322D82361A30771J8526e1976
$$ -33825 -194009 470534 25888 -254966 155939 -333322 482361 130771 149297 -51976
12810I9184L6269b91606I4012k8314M8680g2481C78584A11082a20867J0741e461
$$ 99184 135453 -291606 94012 65698 114378 -72481 378584 111082 -120867 -110126 -5461
12798C3953b31287E6090R4249b68317A55254a34399f0230p7470c274I0619g5548
$$ 33953 -231287 56090 150339 -268317 155254 -134399 -60230 -137700 -3274 90619 -75548
12786i0424E2418R8525g644A4079Q9967a81542G6368J41567e4241A82875G3255
$$ -90424 52418 150943 -7644 14079 104046 -181542 76368 217935 -54241 182875 73255
12774H8796e3417B34785j05794N2210a52379p8277e7119j06304r7894A69913a55354
$$ 88796 -53417 234785 128991 181201 -152379 -230656 -57119 -163423 -261317 169913 -155354
12762a37831B17975a47988A9598N00483a12496j29995L9377O3554N7049A6590
$$ -137831 217975 -147988 19598 520081 -112496 -242491 -203114 -139560 -82511 16590
12751C3084M5616c32204A35837c8930D7807b49528F7692h3492A15547J26752F9346
$$ 33084 78700 -332204 135837 -38930 47807 -249528 67692 -83492 115547 242299 69346
12739D9126a24497B40696D9091d0394D88627b2482k14942C80353L1579A16794
$$ 49126 -124497 240696 49091 -40394 488627 -22482 -237424 380353 411932 116794
12728b5685A44361G0574a48537m095A14937J44045a82010J8669E2852b53482O2670
$$ -25685 144361 70574 -148537 -152632 114937 258982 -182010 -163341 52852 -253482 -190812
12717a90812f3849B25062F9561J62527M099H4633J37032b00387D8533J34221R3820
$$ -190812 -63849 225062 69561 232088 236187 84633 221665 -200387 48533 182754 276574
12706B76574j22040m7502b4811I6158J46767i7099B02079I0282D3224a861q9358
$$ 276574 154534 107032 -24811 96158 242925 -97099 202079 90282 43224 -1861 -91219
12695i1219F8374a04257e1983k49124f525A64428O4953K67177d9902J2458J3775
$$ -91219 68374 -104257 -51983 -301107 -6525 164428 229381 496558 -49902 -37444 -23669
12684b3669A04467c3194E04766d3475D46803C2269M1300f1480m1733m8740A77134
$$ -23669 104467 -33194 504766 -43475 446803 32269 73569 -61480 -103213 -151953 177134
12672f0619i787n4236a9257G2685M7922a39340A65086a73104A47774J49460q6643
$$ -60619 -9787 -64023 -19257 72685 120607 -139340 165086 -173104 147774 297234 210591
12661B10591b06181g0634B89651o7962b41261C47209o6442l8863F3456K62486
$$ 210591 -206181 -70634 289651 221689 -241261 347209 280767 241904 63456 325942
12651C25942A24488g0150D8734K4681J31027f0227C05858b55830C27391H1505
$$ 325942 124488 -70150 48734 73415 204442 -60227 305858 -255830 327391 81505
12640a66316A72464C5732d09644B9793a49499A46356q83c52534B17082L8834M9922
$$ -166316 172464 35732 -409644 29793 -149499 146356 145473 -352534 217082 255916 305838
12629C05838j46226K34880A47796K15683E5648J00371e9916D28625C1696a0528
$$ 305838 159612 394492 147796 363479 55648 156019 -59916 428625 31696 -10528
12618a10863B49701d1890A9404K33346H5544l9806c40695g8101E3294i2244A78707
$$ -110863 249701 -41890 19404 252750 85544 45738 -340695 -78101 53294 -92244 178707
12606A59878J75848d02111a34587D0388J15417J44567a22070E2652K40869K6001
$$ 159878 335726 -402111 -134587 40388 155805 300372 -122070 52652 293521 319522
12596C19522r5144q9660a77808B16515A05585Q1966E6256b58850c6663A44516
$$ 319522 224378 134718 -177808 216515 105585 187551 56256 -258850 -36663 144516
12585A31669E2490L9733c0669D1273i5215n2267A32435M842b502G0337d11136
$$ 131669 52490 92223 -30669 41273 -95215 -147482 132435 137277 -2502 70337 -411136
12573i5523k74781B68339h688k0237B0433J56851g1520B97906a28611A50688B2700
$$ -95523 -370304 268339 -8688 -28925 20433 177284 -71520 297906 -128611 150688 22700
12561a11565D8548b79903B00255A9511d2961A80682m9367J248J5490C3142K27223
$$ -111565 48548 -279903 200255 19511 -42961 180682 131315 132563 148053 33142 260365
12550B60365b57471h1743A00921d2847d702A69635N0432c5460j40521L6136a4504
$$ 260365 -257471 -81743 100921 -42847 -4702 169635 220067 -35460 -175981 -139845 -14504
12538e1621k3043j57115e2004B0316a35581n983A42761A5297a88703j6324B68530
$$ -51621 -74664 -231779 -52004 20316 -135581 -141564 142761 15297 -188703 -205027 268530
12526i317D81075i4283A22038H866K47300h444k5612A67247m7676J06778j2155
$$ -9317 481075 -94283 122038 8866 256166 -8444 -34056 167247 119571 226349 214194
12515B14194a64560j9850C23145c55609B12784a18260A01588b48145o9098B74066
$$ 214194 -164560 -184410 323145 -355609 212784 -118260 101588 -248145 -317243 274066
12504b0771C82161d8724B02219b54245B28199b18795A1533a05603B65785j04010
$$ -20771 382161 -48724 202219 -254245 228199 -218795 11533 -105603 265785 161775
12494A61775a20442H1924f7992a0936I4011M4573c15290C6778Q3601K37579a03454
$$ 161775 -120442 81924 -67992 -10936 94011 138584 -315290 36778 120379 357958 -103454
12482I0325b94322A57957k3416M0621C9705h93p064H0422J65190f2735A6342O6136
$$ 90325 -294322 157957 134541 175162 39705 -893 -7957 80422 245612 -62735 16342 82478
12470H2478c14089J51502a2035E5753Q0593Q2665K8379C2799J27582D8135b3306
$$ 82478 -314089 -162587 -12035 55753 136346 219011 247390 32799 160381 48135 -23306
12458B37292a30152c7105A39015A6617M2829a12323L1296q7007c5101f022k42117
$$ 237292 -130152 -37105 139015 16617 59446 -112323 -81027 -168034 -35101 -6022 -248139
12447b48139h9287C09997n597j32061k5546a7982j7111B4665a3835k43752G236
$$ -248139 -89287 309997 304400 172339 146793 -17982 -35093 24665 -13835 -257587 7236
12435b9451A86529F771c6175k97951A47241h6739j91033A28885b8498r5155B6807
$$ -29451 186529 6771 -36175 -334126 147241 -86739 -277772 128885 -28498 -123653 26807
12423a23730G3957G858J5260a41923B44959d9154m864m46A47349J9475a00692
$$ -123730 73957 7858 23118 -141923 244959 -49154 -54018 -54464 147349 166824 -100692
12411A10178h6265A79643a84486A73532a37278m2771C17818l0270a40129o9552
$$ 110178 -86265 179643 -184486 173532 -137278 -180049 317818 287548 -140129 -209681
12401b09681A56504e9624A51605i420A62013b38088a05563A92814p3183Q9355
$$ -209681 156504 -59624 151605 -9420 162013 -238088 -105563 192814 119631 208986
12391B08986D1589G64L7854b02815B00668a71722G7712b16568f5891j53321A21398
$$ 208986 41589 764 38618 -202815 200668 -171722 77712 -216568 -65891 -219212 121398
12379d5999A77269i8408o4223L9056H6254b5423D670f7082l80110c0147n7086
$$ -45999 177269 -98408 -162631 -123575 86254 -25423 4670 -67082 -447192 -30147 -87233
12368h7233k86811A48923a03644B9466J34469J34545J9603r9948b13087i9699
$$ -87233 -374044 148923 -103644 29466 163935 298480 318083 218135 -213087 -99699
12357d2623B50173o1173C3002K4108a48161d9234l0072k09678B02053l270E6947
$$ -42623 250173 189000 33002 57110 -148161 -49234 -79306 -288984 202053 198783 56947
12345C0425N5308c82462E9999a83841I2871g4965F0401J26194A4544i1357B55667
$$ 30425 85733 -382462 59999 -183841 92871 -74965 60401 186595 14544 -91357 255667
12333C65792A14541f6360c372A4703N131J2450b81779B93821a1052A03108m4702
$$ 365792 114541 -66360 -3372 14703 19834 32284 -281779 293821 -11052 103108 58406
12322E8406e1304C16824o0894a11510k6969M7867A96261I2202h9205R683A39924
$$ 58406 -51304 316824 255930 -111510 -138479 -90612 196261 92202 -89205 -79522 139924
12310A16540n3583a51261O1684B45092a12407A24500F1020a0086C52539a31417
$$ 116540 62957 -151261 -89577 245092 -112407 124500 61020 -10086 352539 -131417
12299a64742A1709c9548j3277A11471J28179o1066n1804F636b4380j6569C68851
$$ -164742 11709 -39548 -52825 111471 239650 178584 126780 6636 -24380 -40949 368851
12287d21477I7100c338A93716a76803B18506j2815h6913D9679f8458D3849e3415
$$ -421477 97100 -3338 193716 -176803 218506 205691 -86913 49679 -68458 43849 -53415
12275D62045j17254R2329k18523j00654O642D2557g4693m2091k4633A33280a41690
$$ 462045 344791 437120 218597 117943 124585 42557 -74693 -116784 -141417 133280 -141690
12263i7635F8784J7776K88868A19901D0102L20644B4269J08008j910I475N253
$$ -97635 68784 86560 375428 119901 40102 360746 24269 132277 130367 9475 14728
12252A4728J35075P4004l8858K0117j5031G965b42925F6236g4938A47010p2248
$$ 14728 149803 223807 184949 205066 190035 7965 -242925 66236 -74938 147010 74762
12241G4762J50063j0086J5243a43489k10934B74363a46692p482j17064A77104
$$ 74762 224825 214739 229982 -143489 -354423 274363 -146692 -154174 -271238 177104
12230a05739D31908L8983E2625A2508g6031B93159C3904M42206a27974A06967
$$ -105739 431908 470891 52625 12508 -76031 293159 33904 476110 -127974 106967
12219B70084q6671m5808J8725L31611A37294C2002J26760p7594l0795K17315k2391
$$ 270084 183413 137605 156330 487941 137294 32002 158762 81168 50373 267688 245297
12208B45297J86806B8468K62675E7935P6031a31587C61577I4584L2938h8713A32153
$$ 245297 432103 28468 291143 57935 133966 -131587 361577 94584 127522 -88713 132153
12196i9370B57910J17672A33750K32114A11336Q1611H1619K8976D9580K09649
$$ -99370 257910 375582 133750 365864 111336 192947 81619 110595 49580 259229
12186B59229j20943o346M8198a02580D25810A10688M7960J54636c7313A58162
$$ 259229 138286 131940 180138 -102580 425810 110688 158648 313284 -37313 158162
12175B74647n3720i7060B93290E0294b46810B3018O0229a69165C56246J34413
$$ 274647 220927 -97060 293290 50294 -246810 23018 83247 -169165 356246 490659
12165D90659a62660B02359L1624P1325d1394a2867A81810B6537K41555j04937
$$ 490659 -162660 202359 233983 305308 -41394 -12867 181810 26537 268092 163155
12155A63155e0280A28231J63123J5440a90722i3278c9005A85537J02882A41587
$$ 163155 -50280 128231 291354 306794 -190722 -93278 -39005 185537 288419 141587
12144A52704p478c9920k7897A41741j296B6867K57028j12057d32250A66822N2276
$$ 152704 145226 -39920 -67817 141741 140445 26867 283895 171838 -432250 166822 219098
12133B19098F2139C01J02732L04523A8466J89993f0114j60738B3984h4027A42782
$$ 219098 62139 301 103033 407556 18466 208459 -60114 -220852 23984 -84027 142782
12121a49124A45694a49246K3553e7498k692j94956A06713b40887A91340H4274
$$ -149124 145694 -149246 -125693 -57498 -60190 -255146 106713 -240887 191340 84274
12110B02884e2165J595j64329J04947p717B0066a74182M8742e7295B50531j9542
$$ 202884 -52165 -50570 -214899 -109952 -117669 20066 -174182 -125440 -57295 250531 230989
12099B30989a95761N5474A99245b73823A48956d7818A43039b40555R9681C3447
$$ 230989 -195761 -140287 199245 -273823 148956 -47818 143039 -240555 -140874 33447
12088f1701l5646j48525j56338a39211C2316J29607D3808a0204D03956F3927L94111
$$ -61701 -97347 -245872 -402210 -139211 32316 161923 43808 -10204 403956 63927 458038
12077D58038M15861J458041p05380G98063B36030d952A59565e6022B55000a96811
$$ 458038 873899 2331940 1626560 798063 236030 -4952 159565 -56022 255000 -196811
12066E7598b06746O0585A74710a43607B65401r8550D5752K84297l7382a92514
$$ 57598 -206746 -146161 174710 -143607 265401 166851 45752 330049 292667 -192514
12055a90399B10156b07356e7858f840A36161a5332j23246D8278a64134A84536
$$ -190399 210156 -207356 -57858 -6840 136161 -15332 -138578 48278 -164134 184536
12044A15881b05837A50881J32770K9189a18408j54513M1278A9247R7410D6944
$$ 115881 -205837 150881 283651 312840 -118408 -272921 -231643 19247 116657 46944
12033A95144D3545J7508h743o1925I1398a97562B38992a30261A04198a30790c8681
$$ 195144 43545 61053 -8743 -70668 91398 -197562 238992 -130261 104198 -130790 -38681
12021D2767d7366r1902A77264E8548J55567J70730b30098L77l622F8504h9283
$$ 42767 -47366 -139268 177264 58548 214115 384845 -230098 -229721 -233343 68504 -89283
12009a79351A23727a30982N5428A48479a58066c5834j12963B58314L03991b46763
$$ -179351 123727 -130982 -75554 148479 -158066 -35834 -148797 258314 562305 -246763
11998d3487k7360G5572b09192j63119A0669K79623b40123H0338R5843g5033A18865
$$ -43487 -70847 75572 -209192 -372311 10669 290292 -240123 80338 176181 -75033 118865
11986g9377A23516b86844J41862A8859c2944j91507A4410a67575b340j26509A01838
$$ -79377 123516 -286844 -144982 18859 -32944 -224451 14410 -167575 -2340 -128849 101838
11974e6435B35663I634a64710Q1948A19598a92905O8339D8167g8139j9523b5304
$$ -56435 235663 9634 -164710 -82762 119598 -192905 -124566 48167 -78139 -97662 -25304
11962F4202e0072p6049j53598E6456O9942g0442A20225k736e6675J6253p2604
$$ 64202 -50072 -126121 -279719 56456 126398 -70442 120225 117489 -56675 -40422 -113026
11951a13026A94031a85020A59717J28372b0584A22528f2920A85702e4861j73800
$$ -113026 194031 -185020 159717 288089 -20584 122528 -62920 185702 -54861 -228661
11941b28661L2919q7665A2603a32724I2888Q2618J79480a9964m0138D8102i7063
$$ -228661 -195742 -283407 12603 -132724 92888 175506 354986 -19964 -60102 48102 -97063
11929a22408m0781b0842A24114l4842d1186j68965A37917i8560C65702I5876c1220
$$ -122408 -163189 -20842 124114 89272 -41186 -210151 137917 -98560 365702 95876 -31220
11917D0816J0394K34075j42378J18980a37119A68599C8419a52116K3321N5725
$$ 40816 51210 285285 142907 261887 -137119 168599 38419 -152116 -128795 -73070
11907g3070A3443J51758g5643F1072K19116a62578M5438D1896I21a02951j17749
$$ -73070 13443 165201 -75643 61072 280188 -162578 -117140 41896 921 -102951 -220700
11896b20700M8935A35528a37601F3768J74355r4085e7252A52881a58160B07262
$$ -220700 -171765 135528 -137601 63768 238123 144038 -57252 152881 -158160 207262
11885A17404b30414h4187a2680j49263l19441B445a11483B3948P5385a73648P79
$$ 117404 -230414 -84187 -12680 -161943 -481384 2445 -111483 23948 99333 -173648 -172869
11874a72869C5420O3386K3655b84165a32499p08A5983b44594a5682j83300m8927
$$ -172869 35420 98806 122461 -284165 -132499 -133207 15983 -244594 -15682 -198982 -247909
11863b47909C12213A51360N1392a68232j04130B97132J63971A30865b96610C7372
$$ -247909 312213 151360 202752 -168232 -272362 297132 461103 130865 -296610 37372
11852A45310P1259D5598J0768b35992B85473a99736B93637a06582b2680l4189
$$ 145310 216569 45598 56366 -235992 285473 -199736 293637 -106582 -22680 -56869
11842e6869j8868A09336b4399j04802k36480f78A85201c36923a41107F1336d0918
$$ -56869 -75737 109336 -24399 -129201 -365681 -678 185201 -336923 -141107 61336 -40918
11830B898Q9428b35727O7268j36246B57252b81216N1040G3731a65282D6116a82513
$$ 2898 92326 -235727 -168459 -304705 257252 -281216 -230176 73731 -165282 46116 -182513
11818a20785k0276B21766A09654b00585O5589N1893B70312c19449D0961K0756
$$ -120785 -141061 221766 109654 -200585 -134996 -83103 270312 -319449 40961 61717
11808F1717G180a30671N3683a1651B81134b04501K8241G0287J81119f7561a4002
$$ 61717 7180 -130671 -76988 -11651 281134 -204501 -176260 70287 251406 -67561 -14002
11796A25063n3190R180d57937g6409j26654k8511B41568a98137A34991b04585
$$ 125063 71873 81053 -457937 -76409 -203063 -231574 241568 -198137 134991 -204585
11785A72196b9974r650j45821M7309j4880j65940g0704B23108P4394a34888F8848
$$ 172196 -29974 -39624 -185445 -138136 -153016 -318956 -70704 223108 297502 -134888 68848
11773E0809b10715e2507b216j81016A10939b91725B69586d086C6991P9438b70278
$$ 50809 -210715 -52507 -2216 -183232 110939 -291725 269586 -4086 36991 116429 -270278
11761C4649K14611f4282m5629A14656a50334A89424a47350E1374b9522G9111a78490
$$ 34649 249260 -64282 -109911 114656 -150334 189424 -147350 51374 -29522 79111 -178490
11749g2019m58065D3308N4330j7485M7254K477l75k434e8091l9387B36171a59700
$$ -72019 -530084 43308 97638 80153 127407 129884 129509 127075 -58091 -97478 236171 -159700
11736a42318L4996E7100K1003J10801A8698M82775B11115b37096C74757A63269
$$ -142318 -107322 57100 78103 188904 18698 501473 211115 -237096 374757 163269
11725H6380L6533P4636J96559C1575L7510a41033B20332F956b24189r4429o9907
$$ 86380 122913 197549 394108 31575 69085 -141033 220332 6956 -224189 -318618 -388525
11714c88525d06B02023m3238a6528k31250a19127G6899K16777j24454a7634j27711
$$ -388525 -406 202023 158785 -16528 -247778 -119127 76899 293676 169222 -17634 -145345
11703a45345A32869i9380A6632a94218J7796D10144h3513Q215n1527e8637l362
$$ -145345 132869 -99380 16632 -194218 -176422 410144 -83513 -75298 -126825 -58637 -61999
11692f1999B83536C803J59295k4267c80998C43950D9106o571J38169f449C7261
$$ -61999 283536 3803 163098 138831 -380998 343950 49106 42535 180704 -6449 37261
11680A9761b74832B81580J11589A42280d9037A1526a58862I172f5342l4715D5799
$$ 19761 -274832 281580 393169 142280 -49037 11526 -158862 9172 -65342 -100057 45799
11668b7720k54321E4238J75926D0707K32210L2944K0388A22681m8492C965f7288
$$ -27720 -282041 54238 230164 40707 272917 305861 326249 122681 74189 3965 -67288
11656C3158J04917C6912b29987G1483M5142N198J60078A21425j6208Q043l9985
$$ 33158 138075 36912 -229987 71483 116625 121823 281901 121425 105217 113260 73275
11645G3275a31352j23336b9184G251a40833A0926K05509b41745G4361J57263H1041
$$ 73275 -131352 -254688 -29184 7251 -140833 10926 216435 -241745 74361 231624 81041
11633a22946c1932K774A58653A5990a02010d9046r6212E1751O7217N8141c44794
$$ -122946 -31932 -29158 158653 15990 -102010 -49046 -145258 51751 118968 177109 -344794
11621B0997K8550a83686A58222j35m1578l39i6304c9405p6716F5121e0154B51541
$$ 20997 49547 -183686 158222 158087 116509 116170 -96304 -39405 -116121 65121 -50154 251541
11608C33719H5396a29112Q995j44222c8881A14825a73048C56606b79937H540b14846
$$ 333719 85396 -129112 -120117 -264339 -38881 114825 -173048 356606 -279937 8540 -214846
11596d12020C0116J07431m9737J4431e5916q385n1133A77026i1971C00953a50877
$$ -412020 30116 137547 87810 102241 -55916 -64301 -115434 177026 -91971 300953 -150877
11584A12315K2728O0018a07939B43895h5288B38145a89863A93840D5519L04805
$$ 112315 135043 195061 -107939 243895 -85288 238145 -189863 193840 45519 350324
11574C50324A58585E5032a08390B27883J15356A16674J32492j18443R5033i4604
$$ 350324 158585 55032 -108390 227883 343239 116674 249166 130723 225756 -94604
11563c6704i223a003C02389j26224c8823B1747N52924G1350F529e7734A89517
$$ -36704 -9223 -1003 302389 176165 -38823 21747 574671 71350 6529 -57734 189517
11551i0693C21901j48113l5766b4938K663A75966K8883k900c33521A81458p1138
$$ -90693 321901 173788 138022 -24938 -22275 175966 204849 201949 -333521 181458 110320
11540A10320i4855M5580A2374K60834A04888b0475o7431A94251A0286a10240A61217
$$ 110320 -94855 -49275 12374 273208 104888 -20475 -87906 194251 10286 -110240 161217
11528f9890C13312G3628m373R126d01638A68549m525F5748O5167h0911E3324j2789
$$ -69890 313312 73628 69255 78381 -401638 168549 164024 65748 130915 -80911 53324 40535
11516D0535J93410j195F4417b39802a00760A95284k7085P9378B9154a9701I6561
$$ 40535 233945 232750 64417 -239802 -100760 195284 168199 247577 29154 -19701 96561
11504A47858a41107A37558C9271Q6441b8158D78955A24169L93662a80685B91792
$$ 147858 -141107 137558 39271 125712 -28158 478955 124169 517831 -180685 291792
11493A29210b51204A99930J11720j18998K31400a6524A01575o710F456a74026
$$ 129210 -251204 199930 311650 192652 424052 -16524 101575 94865 6456 -174026
11482H8009L04910A8229d7426C46207j00727R3133B8587L23942j02214j07603
$$ 88009 392919 18229 -47426 346207 245480 338613 28587 352529 250315 142712
11472A42712H587L3508J54940C4913M86573A69505A1032K33521b19708E7336L38328
$$ 142712 8587 42095 197035 34913 521486 169505 11032 244553 -219708 57336 395664
11461C95664B5353P7124M11358A87354G9499L40654H4522a63696F6057K9482k4968
$$ 395664 25353 102477 513835 187354 79499 420153 84522 -163696 66057 95539 70571
11450G0571k3825O5429J07531j00917O2340H3016g0809m4518c464j33330e7888
$$ 70571 46746 112175 219706 118789 181129 83016 -70809 -115327 -3464 -136794 -57888
11438a07686C3927F792J28698E8952j5168a47321j6208J0883C46178a23205M3809
$$ -107686 33927 6792 135490 58952 43784 -147321 -163529 -152646 346178 -123205 -79396
11427g9396j1011m9376L6269c6759B01761n8454A0071a0832A6627Q0441c04794
$$ -79396 -90407 -139783 -103514 -36759 201761 143307 10071 -10832 16627 97068 -304794
11415H1387b65869o4766J11716N0642M8170A2339b21394A85122J30476c5464C7005
$$ 81387 -265869 -330635 -218919 -168277 -120107 12339 -221394 185122 315598 -35464 37005
11403a27146A78061G6335Q2766a48989K0299a2812E0107a12568I812J65580a01409
$$ -127146 178061 76335 159101 -148989 -128690 -12812 50107 -112568 9812 175392 -101409
11391b72704k2015A53745B1743O4769F679O3692K90410a24051j0982k5245H4875
$$ -272704 -294719 153745 21743 86512 6679 70371 360781 -124051 -135033 -160278 84875
11379A41135d8361D24509A63035f0536G0003K21771A27299i2378J1907j996E804
$$ 141135 -48361 424509 163035 -60536 70003 291774 127299 -92378 -80471 -82467 5804
11367H173a01276A17068d5942o3460M245a8521A45866f6424A09357m8947a68794
$$ 8173 -101276 117068 -45942 -109402 -105157 -18521 145866 -66424 109357 60410 -168794
11355A14246a66650r874M4786c4353j14733J6719M2092D274d9951B06588i4383
$$ 114246 -166650 -176524 -131738 -34353 -149086 -132367 -90275 4274 -49951 206588 -94383
11343C7493b36640B2172c11599A52067b97375O7050r654g6739j94684A66136O1857
$$ 37493 -236640 22172 -311599 152067 -297375 -230325 -239979 -76739 -271423 166136 227993
11332B27993l0148c1655A15664a8419k90104B9289J42657m1522d4469A46455c11599
$$ 227993 197845 -31655 115664 -18419 -308523 29289 171946 130424 -44469 146455 -311599
11320B77511i5034D8638b50780j35725E19943e1485h603j0313j7065r435J1483
$$ 277511 -95034 48638 -250780 -386505 519943 -51485 -8603 -18916 -35981 -45416 -33933
11309c3933B30097l1408h592i76A27436J1180f4560B061b07718i6249B20582C8240
$$ -33933 230097 198689 -8592 -976 127436 138616 -64560 2061 -207718 -96249 220582 38240
11296I755K1388c68475e8360A84052B9933J69518A387h5297o4324A41214i2748
$$ 9755 31143 -368475 -58360 184052 29933 199451 1387 -85297 -149621 141214 -92748
11284b21169A10942Q2346R3152A28090a41374N3629j7256A35269k7238i4638M2565
$$ -221169 110942 193288 286440 128090 -141374 -87745 -105001 135269 108031 -94638 -52073
11273e2073C20214c3232n7687k65508D3175b06079R1677A15158O620b3736k18521
$$ -52073 320214 -33232 -90919 -356427 43175 -206079 -114402 115158 121778 -23736 -242257
11262b42257d633k80008a11623B49846d5155k29164a23796A52146a28897B37005
$$ -242257 -4633 -284641 -111623 249846 -45155 -274319 -123796 152146 -128897 237005
11251b4681k06621M9991r6028e4369q3365H5318a39190j07012g9569C42088c10384
$$ -24681 -231302 -181311 -277339 -54369 -137734 85318 -139190 -246202 -79569 342088 -310384
11239B59067C7968e1928B39760b60935F8025N0091c59726i1861A74583a59062
$$ 259067 37968 -51928 239760 -260935 68025 118116 -359726 -91861 174583 -159062
11228B40094a41278L8435D9871g3938B21215N1622I3131b60034D3444d8719B08678
$$ 240094 -141278 -102843 49871 -73938 221215 272837 93131 -260034 43444 -48719 208678
11216b19391m5638h4843l59405A11170A0117b9485A56933C3198i0625n6681l4904
$$ -219391 -265029 -84843 -444248 111170 10117 -29485 156933 33198 -90625 -147306 -182210
11205a82210N8546b6569A1640a34047j37316j33857a2719A06329D7933c56178
$$ -182210 -123664 -26569 11640 -134047 -271363 -405220 -12719 106329 47933 -356178
11194a6013A23194a12288D464a61348b1758E1145b24897B35790e3261K2757A36963
$$ -16013 123194 -112288 4464 -161348 -21758 51145 -224897 235790 -53261 -30504 136963
11182b33988H0417c89509D240J6575b32435E1321b75212A7881a1389A38287j7453
$$ -233988 80417 -389509 4240 20815 -232435 51321 -275212 17881 -11389 138287 120834
11171A20834b73528c4951j3366j34788m8191R0404G4721a36716j92722A52095
$$ 120834 -273528 -34951 -48317 -183105 -231296 -140892 74721 -136716 -329438 152095
11160b25033H9117J15169b87430A31032c06086H022L8608j6510e01298A74607
$$ -225033 89117 204286 -287430 131032 -306086 8022 46630 30120 -501298 174607
11149B48647d91280C0043J78415b13531b1011j16785f512q1754A27266D4482A1885
$$ 248647 -491280 30043 208458 -213531 -21011 -137796 -6512 -88266 127266 44482 11885
11137A23987e958k28143A8500M3389a6597B82244Q4012a79676H813L0394J76224
$$ 123987 -5958 -234101 18500 61889 -16597 282244 366256 -179676 8813 39207 215431
11126B15431b589D6691J98291e8228B97136E9553K49116a65593q1834B59951E9119
$$ 215431 -2589 46691 244982 -58228 297136 59553 308669 -165593 -247427 259951 59119
11114F0984A8891K83960m4916l7784k7051d971j40613I4277L3671c20060a33221
$$ 60984 18891 302851 257935 220151 193100 -4971 -145584 94277 127948 -320060 -133221
11102c5603C85842h1200A39252a57970B64000e9326G1385L29103j66997a39194
$$ -35603 385842 -81200 139252 -157970 264000 -59326 71385 400488 233491 -139194
11091B32776K38781o5417j89727a26866B96082f6377A2904K2691I279J10577J89055
$$ 232776 471557 406140 216413 -126866 296082 -66377 12904 35595 9279 119856 308911
11080C08911J04842A98734j0432m9646L3463i1980C62166J44582A23873L07646
$$ 308911 413753 198734 188302 138656 172119 -91980 362166 506748 123873 431519
11070D31519K8904j92190J08636F1484R0252L74085A18960K22906P8140M094n8579
$$ 431519 460423 268233 376869 61484 151736 525821 118960 341866 420006 424100 365521
11059C65521J56303k00746K54822J63920j27413J5255J53481k30448j84467M44080
$$ 365521 521824 321078 575900 739820 612407 627662 781143 550695 366228 810308
11049H10308n3345o2284J59063j97079k08375M82763j80606Q5825j64242J85135
$$ 810308 756963 694679 853742 656663 448288 931051 750445 836270 672028 857163
11039H57163k03522j80606K23828k63135J44429K97068l35165m0738M99869m01537
$$ 857163 653641 473035 696863 433728 578157 875225 540060 499322 999191 597654
11029E97654J69374n8734k04486K38762k52598J99206N6273j12299P56J73184
$$ 597654 767028 708294 503808 742570 489972 689178 745451 633152 633908 807092
11019H07092l76138O5038j6990N61931C82416J33527K6562K42831J84034B87673
$$ 807092 430954 495992 479002 1040933 382416 515943 542505 785336 969370 287673
11008E28816N2099j90573K33580k31461M10420j83432J25658k96904J88483R2909
$$ 528816 580915 390342 623922 392461 802881 619449 745107 448203 636686 729595
10998G29595B97703M33996j67162j5691L67642k42911A49710N58052L08060j09255
$$ 729595 297703 731699 564537 548846 916488 673577 149710 707762 1015822 906567
10988I06567J7496l00741J38681q8301M1705J67204K84210j08522K67213n55741
$$ 906567 924063 623322 762003 673702 715407 882611 1166821 1058299 1325512 769771
10978G69771P56412q4921K84209k28997M94371J89918J57281L26913j49738K19651
$$ 769771 1526183 1441262 1725471 1496474 1990845 2180763 2338044 2664957 2515219 2734870
10968B734870j80471M9326l61447m88993P5384m2465j92321m1026j21668M69747
$$ 2734870 2554399 2603725 2242278 1753285 1828669 1786204 1593883 1552857 1431189 1900936
10958A900936m41661P1573M17003J03932m18797P4642j70950j54334k24652m28555
$$ 1900936 1459275 1530848 1947851 2051783 1632986 1707628 1536678 1382344 1157692 729137
10948G29137J31349k05691L491j02071k37946K34133k59812R9326k2469A32418
$$ 729137 860486 654795 658286 556215 318269 552402 292590 391916 369447 132418
10937b59043A64789j2938K90716j74365I0372K43994m1902j19586J42027L4412
$$ -259043 164789 151851 442567 268202 90372 334366 292464 172878 314905 349317
10927C49317m6405e5649C10989f0633B6938J15942M4721R5477a2109A78041n5259
$$ 349317 302912 -55649 310989 -60633 26938 142880 187601 283078 -12109 178041 122782
10916A22782K1858H842c14957A62568F2190L7760d9019K1276j36346d7922L345
$$ 122782 144640 8842 -314957 162568 62190 99950 -49019 -27743 -164089 -47922 -44577
10905d4577G1737a84850i0459D53588A24665J52904h8020B0976a94956m54511
$$ -44577 71737 -184850 -90459 453588 124665 277569 -88020 20976 -194956 -649467
10895f49467h38A24411J05645A10277c10970a23806A55844a23944A48181a46560
$$ -649467 -838 124411 230056 110277 -310970 -123806 155844 -123944 148181 -146560
10884i4488j30898F8910k3309a23886j80148H5102g2983l7889j54921h506E35034
$$ -94488 -225386 68910 45601 -123886 -304034 85102 -72983 -110872 -265793 -8506 535034
10872b58344j35319a52838k06445A2186a31694b4370A18778a31252e4746j46384
$$ -258344 -393663 -152838 -359283 12186 -131694 -24370 118778 -131252 -54746 -201130
10862b01130c4269A08951a9532k27426i936r6722d9903o2111L9866j26986g7916
$$ -201130 -34269 108951 -19532 -246958 -9936 -106658 -49903 -112014 -72148 -199134 -77916
10850b16162b696C19726M64d7766C2238d7168B3034a62168j94123I7676O0917
$$ -216162 -2696 319726 320190 -47766 32238 -47168 23034 -162168 -356291 97676 158593
10839A58593D9647b8770n9089K4671q3327F6020J21553R876a35240A45917j3967
$$ 158593 49647 -28770 -87859 -63188 -146515 66020 187573 197449 -135240 145917 131950
10828A31950b8258A88301a29601H958J15402J36685H4501i2096K7737i484k12355
$$ 131950 -28258 188301 -129601 8958 124360 261045 84501 -92096 -64359 -9484 -221839
10817b21839C3311a00101B23957M943a7635k7138r1112d7107F1829K84850m954
$$ -221839 33311 -100101 223957 228900 -17635 -44773 -135885 -47107 61829 346679 341725
10806C41725c43219h0368J1420o1490j45273J25712j01737B03961g0788o0985
$$ 341725 -343219 -80368 -68948 -130438 -275711 -149999 -251736 203961 -70788 -131773
10796a31773B6607g221A50293d334A83086D0639P0893a47645J0947B8389K16271
$$ -131773 26607 -7221 150293 -4334 183086 40639 111532 -147645 -136698 28389 244660
10785B44660e9643a2235j08896c4894B105a47871m4795j11936i1228A25655J37842
$$ 244660 -59643 -12235 -121131 -34894 2105 -147871 -192666 -304602 -91228 125655 263497
10774B63497a47112F5334b7970A6823a09007q8543A08636c0808j12528f9970j13953
$$ 263497 -147112 65334 -27970 16823 -109007 -197550 108636 -30808 -143336 -69970 -183923
10763a83923k21715H6546P1889G5851b4120j47512P9549c0503I429a83314B96815
$$ -183923 -405638 86546 158435 75851 -24120 -171632 -92083 -30503 9429 -183314 296815
10751a4714F7328a70190E6321a5879B597K7268b72855a1289q3816A62487a6358
$$ -14714 67328 -170190 56321 -15879 2597 29865 -272855 -11289 -95105 162487 -16358
10739A34699a72551N1275I1587b27168P4351A52720a87475L4719J0926E4285P7600
$$ 134699 -172551 -121276 91587 -227168 -152817 152720 -187475 -152756 -141830 54285 131885
10728A31885a760B90349f7742B85610c8434E3474P6476K14703B8895a06446n7449
$$ 131885 -1760 290349 -67742 285610 -38434 53474 129950 344653 28895 -106446 -163895
10717a63895c8917G3518b54055M611B51636b19489A50523a46643A37989a89151
$$ -163895 -38917 73518 -254055 -249444 251636 -219489 150523 -146643 137989 -189151
10706C31525a61025q571j78563D35071b3795j32395k6440L0944P1652A17467m7769
$$ 331525 -161025 -169596 -348159 435071 -23795 -156190 -182630 -151686 -80034 117467 69698
10695F9698c39364J34796h2202m1459k87233H6686J3824k5808d3994j04152A66618
$$ 69698 -339364 -204568 -82202 -123661 -410894 86686 100510 74702 -43994 -148146 166618
10683H8792K60094b38665i5381j46045O164i5883L2037j29431n9714B25824A3842
$$ 88792 348886 -238665 -95381 -241426 -235262 -95883 -63846 -193277 -252991 225824 13842
10671F003e7220n6594n2628n4737b5015H5226b01185G3020P8192h5104F1739M233
$$ 6003 -57220 -113814 -166442 -221179 -25015 85226 -201185 73020 151212 -85104 61739 65972
10659F5972c01771c3849D33342H8344b66625J8225J6497O0448E1490j9621a88017
$$ 65972 -301771 -33849 433342 88344 -266625 -248400 -231903 -171455 51490 31869 -188017
10647a0963p1921j19813c3596B3187L01075a81392A54992a3014A41441J91694
$$ -10963 -82884 -202697 -33596 23187 324262 -181392 154992 -13014 141441 333135
10637C33135f7651J8166A14883C014f550C1058c01405M1845A13755c1794k31468
$$ 333135 -67651 -49485 114883 3014 -6550 31058 -301405 -259560 113755 -31794 -263262
10626b63262H4962J38697c63114r7111A09129m5289b79987A21785a33436A04333
$$ -263262 84962 223659 -363114 -460225 109129 63840 -279987 121785 -133436 104333
10615B53825q6657c45970d7945r7898b8752C9047J34980R949I1733c83199c8366
$$ 253825 167168 -345970 -47945 -145843 -28752 39047 174027 183976 91733 -383199 -38366
10603e59879d3462j29831L7129e6415A41477c22695P3857O5501j42548a54853
$$ -559879 -43462 -173293 -136164 -56415 141477 -322695 -248838 -183337 -325885 -154853
10592a08531F8504b62509B2490b53486h047j05283L2460E7836e3162A07758a20906
$$ -108531 68504 -262509 22490 -253486 -8047 -113330 -80870 57836 -53162 107758 -120906
10580f4784B40166a41949A15216b96770i62A39360d3390j06399m3685C25282b27221
$$ -64784 240166 -141949 115216 -296770 -962 139360 -43390 -149789 -193474 325282 -227221
10568a96146o4930a30212B9528a89576A74396e5282E9793a17501C5109O4442Q2722
$$ -196146 -261076 -130212 29528 -189576 174396 -55282 59793 -117501 35109 99551 182273
10557A82273q5857D5580i1081H9538a72085B26382D6312e0679o562l3877C8751
$$ 182273 96416 45580 -91081 89538 -172085 226382 46312 -50679 -57241 -91118 38751
10545b2755a0049q6851D1295G699b29691L9518m0838B772K06078i318k38103A31412
$$ -22755 -10049 -96900 41295 7699 -229691 -190173 -231011 2772 208850 -9318 -247421 131412
10532a46129a4338j94635I4260k3908B8462Q4909q76n5564a74807L1896A36154
$$ -146129 -14338 -208973 94260 70352 28462 113371 112495 56931 -174807 -142911 136154
10520I691d6958B51074b07495C6002h5463E8844i1273l69781b14341I1620J93339
$$ 9691 -46958 251074 -207495 36002 -85463 58844 -91273 -461054 -214341 91620 284959
10509B84959L3472E5297J26088k7634F1370R5269f9310H5773a5741m2655J3848
$$ 284959 318431 55297 181385 153751 61370 156639 -69310 85773 -15741 -58396 -44548
10498d4548A8500b47699D1769J16532J76594c55540G567N5543c69j91820i3095
$$ -44548 18500 -247699 41769 158301 334895 -355540 7567 63110 -369 -192189 -93095
10486h5996I9603a01468j93605A58086g0197A78878K57837j332K8598l5241k6547
$$ -85996 99603 -101468 -295073 158086 -70197 178878 436715 435383 463981 428740 402193
10475D02193k1979j32164J34053A65924k4595a19595j3224F888b06015B75306
$$ 402193 380214 248050 382103 165924 141329 -119595 -132819 6888 -206015 275306
10464C89583B0471J73913d4106j4946B30801a18228A50133e0896o287r6147E2272
$$ 389583 20471 194384 -44106 -59052 230801 -118228 150133 -50896 -57183 -153330 52272
10452e6882m7897K6941E6941h0284B41973J86195A22094K45484i8831a988j6407
$$ -56882 -104779 -77838 56941 -80284 241973 428168 122094 367578 -98831 -1988 -18395
10441a8395j35030D7689a28443A73895f3887j18509A29365L3816i3328A46469
$$ -18395 -153425 47689 -128443 173895 -63887 -182396 129365 163181 -93328 146469
10430h6388D8177P2867D8120b83956f3815n4561B5012a69542m8139A53967C5926
$$ -86388 48177 121044 48120 -283956 -63815 -118376 25012 -169542 -217681 153967 35926
10418C44122b464A96250g7675I5359J28038h0764m273j30041i2668m0948B31883
$$ 344122 -2464 196250 -77675 95359 223397 -80764 -85037 -215078 -92668 -133616 231883
10406E8105c7869j4592B37184b48092A83125i4186A4107a28821d9265j4782m2599
$$ 58105 -37869 -52461 237184 -248092 183125 -94186 14107 -128821 -49265 -64047 -106646
10395a06646N3137B04305l7275E2451a23749I7579J64568m1931m6789g3057j79949
$$ -106646 -53509 204305 167030 52451 -123749 97579 262147 220216 173427 -73057 -253006
10384b53006I0841L42259A71875o4391D526J16938r764k169K10627h6454A01013
$$ -253006 90841 433100 171875 107484 4526 121464 111700 109531 320158 -86454 101013
10372C10333J38889D5113J01831J08286l0665L9420J70537R4629B17577J16193
$$ 310333 449222 45113 146944 255230 224565 263985 434522 529151 217577 333770
10362C33770j5803g334A46057P1459C983J45836n7252J7408K29459j32894J05762
$$ 333770 317967 -7334 146057 217516 3983 149819 92567 109975 339434 206540 312302
10351C12302o6253j8252K33993J4457m1182A01289K18829J9390m3570N5442a8362
$$ 312302 246049 227797 461790 476247 435065 101289 320118 339508 295938 351380 -18362
10339B71132R240j1894q1266J02840j10109e2848j02260A30261f5297C51630o9018
$$ 271132 280372 268478 187212 290052 179943 -52848 -155108 130261 -65297 351630 282612
10328B82612j14929H2601c73647D2034K23109a51997B56563r4962O9533A4102
$$ 282612 167683 82601 -373647 42034 265143 -151997 256563 161601 231134 14102
10317D04776E8465M5900k9928J25389a2206A75755c6464m3759B13344A0109b5931
$$ 404776 58465 104365 74437 199826 -12206 175755 -36464 -80223 213344 10109 -25931
10305A67023a15787j19808b0606A83542f3622b0683o0367B66734b89631a13838
$$ 167023 -115787 -235595 -20606 183542 -63622 -20683 -81050 266734 -289631 -113838
10294B59220h9598k15240A79189a41467B27778l2684a3162j54879o066Q2382q3272
$$ 259220 -89598 -304838 179189 -141467 227778 195094 -13162 -168041 -174107 -91725 -174997
10283a74997F0792f3623H5441b44986A46207K08666j23125n5071B2867b14616
$$ -174997 60792 -63623 85441 -244986 146207 354873 231748 176677 22867 -214616
10272b1865j58602K4856A01429K10515c15311L8607d743q5570o8753O8454j01061
$$ -21865 -180467 -155611 101429 311944 -315311 -276704 -4743 -90313 -159066 -90612 -191673
10261a91673L1195G1729a63604B30506J88358F9342j2108K16264l9266N4067j30400
$$ -191673 -160478 71729 -163604 230506 418864 69342 57234 273498 234232 288299 157899
10250A57899i8838C3992b16420B32122b12650b6021A93569b02802f947j59238
$$ 157899 -98838 33992 -216420 232122 -212650 -26021 193569 -202802 -6947 -166185
10240a66185k8214B57634i0349i331j16019j87235g3702m3448l3370B39143E6978
$$ -166185 -194399 257634 -90349 -9331 -125350 -312585 -73702 -117150 -150520 239143 56978
10228F0771a91747f1734A48106k1228e08403A33112k6073d19532e4899j1713K2308
$$ 60771 -191747 -61734 148106 126878 -508403 133112 107039 -419532 -54899 -66612 -44304
10217d4304l11807R7089a5753j17352H2326g1009k42207A52051B4042K07221c8072
$$ -44304 -356111 -259022 -15753 -133105 82326 -71009 -313216 152051 24042 231263 -38072
10205c76044p0289a46681A4104i1978A95118d3236j92079A44714a00307b0125
$$ -376044 -446333 -146681 14104 -91978 195118 -43236 -235315 144714 -100307 -20125
10194b3870q8375b1807e376I5512b18623i2829a2289k30337A64051a42842l2441
$$ -23870 -112245 -21807 -5376 95512 -218623 -92829 -12289 -242626 164051 -142842 -175283
10183a75283C94080D3791M8423L92794B02294a70095k25819a30308n438d3105
$$ -175283 394080 43791 92214 485008 202294 -170095 -395914 -130308 -135746 -43105
10172c26908A48075a06973B04798b73830h9492l6814L2750p1403M0030k2357M9493
$$ -326908 148075 -106973 204798 -273830 -89492 -126306 -93556 -164959 -124929 -147286 -97793
10161i7793j1625G6167b37751Q1709d4477D4265R9360C1923J69063a95025Q8613
$$ -97793 -109418 76167 -237751 -156042 -44477 44265 143625 31923 200986 -195025 -106412
10150a06412L2776D7199a90307O2240H4074e5201b3212m7900J6068n5566j02507
$$ -106412 -73636 47199 -190307 -128067 84074 -55201 -23212 -71112 -55044 -110610 -213117
10139b13117D1646b883j29163I9720a04107H5355A8229J30071A6416O1114c59866
$$ -213117 41646 -2883 -132046 99720 -104107 85355 18229 148300 16416 77530 -359866
10127b1229j71607I168f7105b8977C45726C1197J8488a43706N6757j7881J8881
$$ -21229 -192836 9168 -67105 -28977 345726 31197 49685 -143706 -86949 -104830 -85949
10116h5949A34947c08899C6797b1018q661A18238G897b81758a26036e5193A54561
$$ -85949 134947 -308899 36797 -21018 -29679 118238 7897 -281758 -126036 -55193 154561
10104a04534B32961p9263a11183j671M9702A50355o3438Q0539G4587c3697H4289
$$ -104534 232961 153698 -111183 -112854 -63152 150355 86917 167456 74587 -33697 84289
10092a58453l62465D0928b60451A58576b88425B75252c78848J01093j39435f8016
$$ -158453 -520918 40928 -260451 158576 -288425 275252 -378848 -277755 -417190 -68016
10081a48976a7444D1659M4740K6158f2874m049j08388m7239C58821b62057a06755
$$ -148976 -17444 41659 86399 112557 -62874 -66923 -175311 -222550 358821 -262057 -106755
10069a35513A21551d9373l89772B2508c27597B15468b48028J13421H5664d675
$$ -135513 121551 -49373 -439145 22508 -327597 215468 -248028 -134607 85664 -4675
10058b78607e5311k9204C9112f0140k4044c3177j00989k06795H370R4209a37361
$$ -278607 -55311 -84515 39112 -60140 -84184 -33177 -134166 -340961 8370 102579 -137361
10046b5275k90556K0812e1547A22740b01726d9204B27861D7241b54628J22681
$$ -25275 -315831 -295019 -51547 122740 -201726 -49204 227861 47241 -254628 -131947
10036a31947p5941c4404j21513o9989N1580n7868b9264o8507A82687a62489o9035
$$ -131947 -207888 -34404 -155917 -225906 -174326 -232194 -29264 -97771 182687 -162489 -231524
10025b31524A87470b72039h1152m6091J793I6561j8097a75370g5997B3860c5767
$$ -231524 187470 -272039 -81152 -127243 -125450 96561 78464 -175370 -75997 23860 -35767
10013g230k0730k83838j05074b04925D1896e5310k16595N6384A67669h0455J3283
$$ -7230 -27960 -311798 -416872 -204925 41896 -55310 -271905 -215521 167669 -80455 -67172
10002f7172A46387E0625B0119R6999a60361j1980L2524A56505b20004A64424a08910
$$ -67172 146387 50625 20119 117118 -160361 -172341 -139817 156505 -220004 164424 -108910
9990a12141A8015a70926j75398A89974G971J45608G5295g51k72274L7980B1204
$$ -112141 18015 -170926 -346324 189974 7971 153579 75295 -751 -273025 -235045 21204
9978B59350h1769B47232I7053a95208A32155a5377C1758f2056j4336j06623m1733
$$ 259350 -81769 247232 97053 -195208 132155 -15377 31758 -62056 -76392 -183015 -224748
9967b24748Q9357o3594N0488k9556C3243a96199O8708m06432a29485E496a29700
$$ -224748 -135391 -198985 -148497 -178053 33243 -196199 -127491 -533923 -129485 5496 -129700
9955B85645I7513a74144n1018A3661h7650L6534a3849A61739e8877j56853K0012
$$ 285645 97513 -174144 -225162 13661 -87650 -51116 -13849 161739 -58877 -215730 -195718
9944a95718i3681K2865j55724a12050l10792l8893a43315c0462A15920a4181a068
$$ -195718 -93681 -70816 -226540 -112050 -422842 -461735 -143315 -30462 115920 -14181 -1068
9932g6682L6629a3283p8921M4787C8080M7706a19833j62551c4390G3447i4714
$$ -76682 -40053 -13283 -92204 -47417 38080 85786 -119833 -282384 -34390 73447 -94714
9920H4450l9153b02042A3012f7062A26576d61677d4269C315a60514b3500j99895
$$ 84450 45297 -202042 13012 -67062 126576 -461677 -44269 3315 -160514 -23500 -223395
9909b23395E93751B00597a66583j18177A16346f7947g432a880j11793j78316a06711
$$ -223395 593751 200597 -166583 -284760 116346 -67947 -7432 -1880 -113673 -291989 -106711
9897a23109r8601R7329j39399b4430n4833j911B0590a78115K501k28312D0629
$$ -123109 -221710 -124381 -263780 -24430 -79263 -81174 20590 -178115 -175614 -403926 40629
9885e9849A79409f2024o8080A78332b555A81367a20085A46846A5471e2316j52951
$$ -59849 179409 -62024 -130104 178332 -2555 181367 -120085 146846 15471 -52316 -205267
9874b05267e4762k21432a35798C234b96409Q3086Q5243A51332a48358j02202M1707
$$ -205267 -54762 -276194 -135798 3234 -296409 -213323 -128080 151332 -148358 -250560 -208853
9863b08853A73904a5602G0304b93449Q3658C01889b58835a09504c1419D999c72791
$$ -208853 173904 -15602 70304 -293449 -209791 301889 -258835 -109504 -31419 4999 -372791
9851A10235m1176e4348j32569D924h1380k20430D6323a76279K9974C7109a70285
$$ 110235 69059 -54348 -186917 4924 -81380 -301810 46323 -176279 -146305 37109 -170285
9839h36l2554J3570C39335j02438A2512Q8674J1721A0340a16272k6140A0597a64525
$$ -836 -33390 -19820 339335 236897 12512 101186 112907 10340 -116272 -142412 10597 -164525
9826I0309J30783k6395R8526J5772j53441c8032m95400a94091D3458N6134g7486
$$ 90309 221092 194697 293223 308995 155554 -38032 -533432 -194091 43458 99592 -77486
9814b59938J28402H5534a73157D2626b31450p2530C671a68729j16776B8975a394
$$ -259938 -131536 85534 -173157 42626 -231450 -303980 3671 -168729 -285505 28975 -1394
9802A66450c6731C3707a54818j00906c6044j09480c5579k19722a16256K5655B05859
$$ 166450 -36731 33707 -154818 -255724 -36044 -145524 -35579 -255301 -116256 -90601 205859
9790h2145B37239b82432J22152F0850a75992B91133A40795a46837D896c16684
$$ -82145 237239 -282432 -160280 60850 -175992 291133 140795 -146837 4896 -316684
9779a77667n4012B1048b81826k64429a4354F589c77197a09172I631J25034n4689
$$ -177667 -231679 21048 -281826 -546255 -14354 6589 -377197 -109172 9631 134665 79976
9768G9976O0042a13399N4460A2241N7616a56074I079O9819a04256B25095a99214
$$ 79976 140018 -113399 -58939 12241 69857 -156074 9079 78898 -104256 225095 -199214
9756b85370J27293M1143O608m89A05401a48406q4217h19H3560R8999g3556k7583
$$ -285370 -158077 -116934 -110326 -110815 105401 -148406 -232623 -819 83560 182559 -73556 -101139
9744a01139j41223D7917f4913A4305d36691a31971N0718E0604J85122a11027j80480
$$ -101139 -242362 47917 -64913 14305 -436691 -131971 -81253 50604 235726 -111027 -291507
9733b91507H7135c89573J18457d8418j83047J1363O3274k02443G2705c8473C2826
$$ -291507 87135 -389573 -271116 -48418 -231465 -220102 -156828 -359271 72705 -38473 32826
9721a62524F4387P7308a3966E1263f8092a189A0903e5606J9223B3020J7937c0699
$$ -162524 64387 141695 -13966 51263 -68092 -1189 10903 -55606 -36383 23020 40957 -30699
9708c01953b2499H5022q941d18278g455p9211k75145g6538A2962a67082B6469
$$ -301953 -22499 85022 76081 -418278 -7455 -86666 -361811 -76538 12962 -167082 26469
9696a58764I6747i3778A81910C5893d27809h1298L8530j28107A37882E6537g217
$$ -158764 96747 -93778 181910 35893 -427809 -81298 -42768 -170875 137882 56537 -7217
9684B72874a67945A35656D1157a10943a7157E3919b20249j660N1867r314k03510
$$ 272874 -167945 135656 41157 -110943 -17157 53919 -220249 -221909 -170042 -179356 -382866
9673c82866a22328K4339o1300r6383j5295j08201H4007b24865a02417A08715A4166
$$ -382866 -122328 -97989 -159289 -255672 -270967 -379168 84007 -224865 -102417 108715 14166
9661B37649D9353J55703F5962c27524a31402J7618L0497j06224j49179A30155
$$ 237649 49353 205056 65962 -327524 -131402 -113784 -83287 -189511 -338690 130155
9650A00988C9419J53737b10005k823k3666D2057d4179B91652d559j01680H8409
$$ 100988 39419 193156 -210005 -212828 -236494 42057 -44179 291652 -4559 -106239 88409
9638a35790F861L4846h5798b9902A41956f3649j23616j67964B59520I6858a65367
$$ -135790 6861 41707 -85798 -29902 141956 -63649 -187265 -355229 259520 96858 -165367
9626c26472A97779C594J44589c61896r1594a85589A95225N5346b5666D3131a78527
$$ -326472 197779 3594 148183 -361896 -453490 -185589 195225 250571 -25666 43131 -178527
9614c14594H2019j4683b27746A0885b58678A7423n658N1636j9380K9877e2157
$$ -314594 82019 67336 -227746 10885 -258678 17423 11765 63401 44021 73898 -52157
9602a60475g4327k9227o3290b4441k580C4840h426j00870B63497a12238j3429
$$ -160475 -74327 -103554 -166844 -24441 -27021 34840 -8426 -109296 263497 -112238 -125667
9591a25667d8585B5653J79278c73813a52834L5091j94364J37576f1223m85687
$$ -125667 -48585 25653 204931 -373813 -152834 -117743 -312107 -174531 -61223 -546910
9581e46910b66893N7255L5213Q0607G6214b48131A5003a45884g2329H2731a04999
$$ -546910 -266893 -209638 -174425 -93818 76214 -248131 15003 -145884 -72329 82731 -104999
9569c61617J20141f1274j42512j40684K5729e2982a781j83445C36118a35603o2341
$$ -361617 -241476 -61274 -203786 -344470 -318741 -52982 -1781 -185226 336118 -135603 -197944
9558a97944h0546o7145c2622q2495p3623d5375D2445a84075A24402a28761k2271
$$ -197944 -80546 -147691 -32622 -115117 -188740 -45375 42445 -184075 124402 -128761 -151032
9547a51032j11645j07979E0452M6692B3874P22b06933j08198C22652a81906q5560
$$ -151032 -262677 -370656 50452 97144 23874 24596 -206933 -315131 322652 -181906 -267466
9536b67466j02548D6622a28661N5141A2451h3284E4658A557a07627k68957H9534
$$ -267466 -370014 46622 -128661 -73520 12451 -83284 54658 1557 -107627 -376584 89534
9524a19643j63434C4062J2620l972b77394l9265a38174f5980n1181A71971B4763
$$ -119643 -283077 34062 46682 42710 -277394 -316659 -138174 -65980 -117161 171971 24763
9512b07602h3945B11468b37347P2210N8969j665b8490A74506f787B99621G6204
$$ -207602 -83945 211468 -237347 -165137 -106168 -107833 -28490 174506 -6787 299621 76204
9500e68813b6890o9216K7435p3206A51796J3158c21563N4951a32225k07931A04790
$$ -568813 -26890 -96106 -68671 -141877 151796 164954 -321563 -266612 -132225 -340156 104790
9488a09882H5834f0797l72400E0149J00578n3984b5310B94608h9452J5979k19036
$$ -109882 85834 -60797 -433197 50149 150727 96743 -25310 294608 -89452 -73473 -292509
9477b92509B2669J7842g4806j42377B2320P6214K1176g5683p1723e3173j6471
$$ -292509 22669 40511 -74806 -217183 22320 98534 119710 -75683 -147406 -53173 -69644
9466f9644F6621a09405A60218a01901M0683G7032K4219b03256J01083A48599k7888
$$ -69644 66621 -109405 160218 -101901 -61218 77032 101251 -203256 -102173 148599 120711
9455A20711Q6490a33200A55052C3345b41571K0201m7139D68204e3023A06214a41486
$$ 120711 207201 -133200 155052 33345 -241571 -221370 -268509 468204 -53023 106214 -141486
9443b11675A05926J5352a01716D06988A6764b42965d7307A09028J50544b14302
$$ -211675 105926 121278 -101716 406988 16764 -242965 -47307 109028 259572 -214302
9432D2160a18855N6910B01057E0120c59461E5043c3709I0212L0891P7352b1624
$$ 42160 -118855 -61945 201057 50120 -359461 55043 -33709 90212 121103 198455 -21624
9420F0105a90433A27649Q2423d2895B76835b58086k34219a96198A01545d62191
$$ 60105 -190433 127649 210072 -42895 276835 -258086 -492305 -196198 101545 -462191
9409A34003J09787a73297k54342B13662B7874b34740P1332D57000D0252a2997
$$ 134003 243790 -173297 -427639 213662 27874 -234740 -163408 457000 40252 -12997
9398i5361k7504j04940E7206N5890a35119j45216f9809A72143p5062b6078j05805
$$ -95361 -122865 -227805 57206 113096 -135119 -280335 -69809 172143 97081 -26078 -131883
9387a31883j68318P3965J0479N4867l3829j23019a06453F1279c38151b3604k90881
$$ -131883 -300201 -226236 -215757 -160890 -194719 -317738 -106453 61279 -338151 -23604 -314485
9376c14485J48717B80541A06519a49592D9354Q4405g4213A10611c95319I6983
$$ -314485 -165768 280541 106519 -149592 49354 133759 -74213 110611 -395319 96983
9365C06683e3983k14457J1882R1896j87504a07029C3941L4692a40447k03129N9253
$$ 306683 -53983 -268440 -256558 -164662 -352166 -107029 33941 68633 -140447 -343576 -284323
9354b84323l4082A8850b62132J01916P3762A79156b59171c510C52480h6952c6741
$$ -284323 -318405 18850 -262132 -160216 -86454 179156 -259171 -3510 352480 -86952 -36741
9342F0841k1281a48345F1567R732J19657g9698F8648a17113G0924b56504A21992
$$ 60841 39560 -148345 61567 71299 190956 -79698 68648 -117113 70924 -256504 121992
9330b17775f1056q8877A16533e01979C4999b9824k36802d6481q2775j87577a09307
$$ -217775 -61056 -149933 116533 -501979 34999 -29824 -266626 -46481 -129256 -316833 -109307
9318i7285k78086C1227K51640I1209L3217m8093b41352h4992A23870a72364O7837
$$ -97285 -375371 31227 282867 91209 124426 76333 -241352 -84992 123870 -172364 -104527
9307a04527B0387K59746c67286a35905r8904e619q0048k2449B98184b08625A23736
$$ -104527 20387 280133 -367286 -135905 -234809 -5619 -85667 -108116 298184 -208625 123736
9295A4206O4649a19575e7693q4235a3984A10757b3689A59517Q306h6213k57814
$$ 14206 78855 -119575 -57693 -141928 -13984 110757 -23689 159517 167823 -86213 -344027
9284c44027A15871a21472N6304p709l89193b2825B2720d987l67430b9111k3698
$$ -344027 115871 -121472 -65168 -72877 -462070 -22825 22720 -4987 -372417 -29111 -52809
9273e2809j48815Q3313E441a6487B19845b13459J05804B8234J60830b37735l8635
$$ -52809 -201624 -118311 5441 -16487 219845 -213459 -107655 28234 189064 -237735 -276370
9262b76370N4908A21127n4305c08711j74684b17417a243A10170b70809b4430k52499
$$ -276370 -221462 121127 66822 -308711 -483395 -217417 -1243 110170 -270809 -24430 -276929
9251b76929D1512J4662d23147E9925i6527b4165j086I4876J25665a42092b5059
$$ -276929 41512 56174 -423147 59925 -96527 -24165 -25251 94876 220541 -142092 -25059
9239d1883l3016p4731e4868i254A66486E0311a38512H0222b22769a03106n9582
$$ -41883 -74899 -149630 -54868 -9254 166486 50311 -138512 80222 -222769 -103106 -162688
9228a62688e396j8278E7347a84982k31356B03878G0632a15599m6490j35685H58
$$ -162688 -5396 -23674 57347 -184982 -416338 203878 70632 -115599 -162089 -297774 858
9216a68226P4596j77471f925j26056n7801g7568j73573N6426A18604l6094O3580
$$ -168226 -93630 -271101 -6925 -132981 -190782 -77568 -251141 -194715 118604 82510 146090
9205A46090a54705D4852c6800j79113k77345J69129J29020A06852b19861a6683
$$ 146090 -154705 44852 -36800 -215913 -493258 -324129 -195109 106852 -219861 -16683
9194a03680l4310E4177b79251a04328H3195a51488B3278K18426H2408a0355n2651
$$ -103680 -137990 54177 -279251 -104328 83195 -151488 23278 241704 82408 -10355 -63006
9183f3006G3581a95868A94944b78407n6054a00711d9377j9235B31683d10016D0893
$$ -63006 73581 -195868 194944 -278407 -334461 -100711 -49377 -68612 231683 -410016 40893
9171D02532F7244l2751a69627k20223a05178j01484R3110r0199f5516A43401D0104
$$ 402532 67244 34493 -169627 -389850 -105178 -206662 -113552 -203751 -65516 143401 40104
9159a08505C48757A0721K9546J2379b9833A82112l420a64180E9782J28246o3953
$$ -108505 348757 10721 40267 52646 -29833 182112 178692 -164180 59782 188028 124075
9148A24075C8849b53675a17612e1582j05233b0694B27884a2697C0871b13817B23969
$$ 124075 38849 -253675 -117612 -51582 -156815 -20694 227884 -12697 30871 -213817 223969
9136a42410f8995F3817J6078b26131O3605A57044e1483r4882N6073B29301c45606
$$ -142410 -68995 63817 79895 -226131 -162526 157044 -51483 -146365 -90292 229301 -345606
9124a14007p6295B4742J38022L845k9324C9228O6087c0534k65444N1266I6730
$$ -114007 -190302 24742 162764 166609 137285 39228 105315 -30534 -295978 -244712 96730
9112B86834D3995b8059b028A35079b93839F0909a27054I8680b3794j62683g3310
$$ 286834 43995 -28059 -2028 135079 -293839 60909 -127054 98680 -23794 -186477 -73310
9100g0870k33915J51216G9880a87345A6452b56011a23737b4368j75764D83190
$$ -70870 -304785 -153569 79880 -187345 16452 -256011 -123737 -24368 -200132 483190
9089a93464c7785k32696B9515J6779a08252o184l95631b13822j21509J66528j69698
$$ -193464 -37785 -270481 29515 46294 -108252 -114436 -510067 -213822 -335331 -168803 -338501
9078c38501a59393E5364a29445A20381A3297a93598a5504H4486c57132f5109A12240
$$ -338501 -159393 55364 -129445 120381 13297 -193598 -15504 84486 -357132 -65109 112240
9066b34965J06128j5776M7757a5042A15438b75109A1497a13432e6316b4516n0107
$$ -234965 -128837 -144613 -96856 -15042 115438 -275109 11497 -113432 -56316 -24516 -74623
9055g4623K0565K6411l7300A63963F9191h3170n4953k9256F759a9883B11147c78117
$$ -74623 -54058 -27647 -64947 163963 69191 -83170 -138123 -167379 6759 -19883 211147 -378117
9042c402j14117d7067A8142J52479D3334R3350e6608J3052H1658g7358K7651p3137
$$ -3402 -117519 -47067 18142 170621 43334 136684 -56608 -43556 81658 -77358 -49707 -122844
9030a22844A28968g5004k09121P7267k3313e4192k61113j82566c7681r693B28835
$$ -122844 128968 -75004 -284125 -206858 -230171 -54192 -315305 -497871 -37681 -47374 228835
9018c6400A00496b22784Q6039a9249j77229a7247E0231e9875A99809h109A9066
$$ -36400 100496 -222784 -136745 -19249 -196478 -17247 50231 -59875 199809 -8109 19066
9006b37835o1522J8207f7305I8136g1284E8186K8415c24282g7319a153r2916k9639
$$ -237835 -299357 -281150 -67305 98136 -71284 58186 86601 -324282 -77319 -1153 -94069 -123708
8994a23708f174A91751a18473B764P4918J59995b6986C9700c21077c9623l08727
$$ -123708 -6174 191751 -118473 2764 77682 237677 -26986 39700 -321077 -39623 -348350
8983c48350A3810b47399j38477b6038r1050L6992A46253L9283e4531j45539c0988
$$ -348350 13810 -247399 -385876 -26038 -117088 -80096 146253 185536 -54531 -200070 -30988
8971A59136b9930B8135a8012D27330i4727j26920A37167C6495K12377a98924B9451
$$ 159136 -29930 28135 -18012 427330 -94727 -221647 137167 36495 248872 -198924 29451
8959a16099F7579a0551j45403d9639g490F464a54280j10305K7890d0686G9100
$$ -116099 67579 -10551 -155954 -49639 -7490 6464 -154280 -264585 -236695 -40686 79100
8947d9023j224B43583j06502A1211a34235l0361A04489a87972r4820B4406h2016
$$ -49023 -50247 243583 137081 11211 -134235 -164596 104489 -187972 -282792 24406 -82016
8935b28256B25378B7783L44074b72340I3516P2363b7925m87486B66789b03152
$$ -228256 225378 27783 371857 -272340 93516 165879 -27925 -515411 266789 -203152
8924A23882K13865O01502J761052K727375j858700A231480C32183l7822a2987
$$ 123882 337747 939249 2700301 5427676 3568976 1231480 332183 294361 -12987
8914A39978A9720K03123r9809d06565a0813k57364B17503J5730Q3562K25596B16524
$$ 139978 19720 222843 123034 -406565 -10813 -268177 217503 233233 316795 542391 216524
8902f9464m5541H3106b83700a38913J3105B5106N649a17608F6757B2632P3574
$$ -69464 -115005 83106 -283700 -138913 -125808 25106 30755 -117608 66757 22632 96206
8891I6206a05632E78536d7929k26540A13175B4502b12811E7573a09198H1847a55128
$$ 96206 -105632 578536 -47929 -274469 113175 24502 -212811 57573 -109198 81847 -155128
8879B65548B8368j1021f0757A42271a11564A4060K3687L30346b2698k33770c0335
$$ 265548 28368 17347 -60757 142271 -111564 14060 37747 368093 -22698 -256468 -30335
8867C7084a20514j83785a16018b07C3904J45464B4425c32132J08737o6630g8329
$$ 37084 -120514 -304299 -116018 -207 33904 179368 24425 -332132 -223395 -290025 -78329
$$ [...]
##END NTUPLES=NMR SPECTRUM
##END=
