##TITLE=AC1646_HPIAH13379_8569811_LtuT1ecJIy
##JCAMPDX= 6.0         $$ Bruker NMR JCAMP-DX V2.0
##DATA TYPE= NMR SPECTRUM
##DATA CLASS= NTUPLES
##ORIGIN= BRUKER
##OWNER= Administrator
$$ 1.72 TOPSPIN		Version 2.1
$$ 2014-04-10 22:40:07.385 -0700  Administrator@X
$$ Compression mode = diff/dup
##.OBSERVE FREQUENCY= 400.02188249412
##.OBSERVE NUCLEUS= ^1H
##.ACQUISITION MODE= SIMULTANEOUS (DQD)
##.ACQUISITION SCHEME= undefined
##.AVERAGES= 8
##.DIGITISER RES= 22
##SPECTROMETER/DATA SYSTEM= spect
##.PULSE SEQUENCE= zg30
##.SOLVENT NAME= COFFEE_meoh
##.SHIFT REFERENCE= INTERNAL, COFFEE_meoh, 1, 14.98509
##AUDIT TRAIL= $$ (NUMBER, WHEN, WHO, WHERE, PROCESS, VERSION, WHAT)
$$ ##TITLE= Audit trail, TOPSPIN		Version 2.1
$$ ##JCAMPDX= 5.01
$$ ##ORIGIN= Bruker BioSpin GmbH
$$ ##OWNER= Administrator
$$ $$ E:\/data/COFFEE/nmr/AC1646_HPIAH13379_8569811_LtuT1ecJIy/10/pdata/1/auditp.txt
$$ ##AUDIT TRAIL=  $$ (NUMBER, WHEN, WHO, WHERE, PROCESS, VERSION, WHAT)
(   1,<2014-04-10 22:39:59.745 -0700>,<Administrator>,<X>,<go>,<TOPSPIN 2.1>,
      <created by zg
	started at 2014-04-10 22:38:53.997 -0700,
	POWCHK enabled, PULCHK disabled,
       configuration hash MD5:
       C8 4E 4E 5D D3 5C D8 9E 9F 52 82 E0 59 8A DE 15
       data hash MD5: 64K
       3E 9B C0 43 09 F7 26 9D 89 C9 93 DD 93 E8 5F ED>)
(   2,<2014-04-10 22:40:03.120 -0700>,<Administrator>,<X>,<proc1d>,<TOPSPIN 2.1>,
      <Start of raw data processing
       efp LB = 0 FT_mod = 6 PKNL = 1 PHC0 = 0 PHC1 = 0 SI = 32K 
       data hash MD5: 32K
       77 7B 98 1F 7B 7F 9F 95 E5 D7 80 17 34 62 98 68>)
(   3,<2014-04-10 22:40:03.557 -0700>,<Administrator>,<X>,<proc1d>,<TOPSPIN 2.1>,
      <pk PHC0 = 94.45496 PHC1 = 0 
       data hash MD5: 32K
       DF 86 82 8C 59 1D AF B3 28 15 0D AD F6 A0 53 42>)
(   4,<2014-04-10 22:40:03.870 -0700>,<Administrator>,<X>,<proc1d>,<TOPSPIN 2.1>,
      <abs ABSG = 1 
       data hash MD5: 32K
       E5 5D 8C F9 9F 9F 74 A7 67 34 8E 0E 35 E9 55 5D>)
(   5,<2014-04-10 22:40:04.010 -0700>,<Administrator>,<X>,<proc1d>,<TOPSPIN 2.1>,
      <abs ABSG = 2 
       data hash MD5: 32K
       BE CE 24 69 87 10 05 63 54 8C B3 72 7F 51 FC F2>)
(   6,<2014-04-10 22:40:04.073 -0700>,<Administrator>,<X>,<proc1d>,<TOPSPIN 2.1>,
      <abs ABSG = 3 
       data hash MD5: 32K
       1D 43 A1 95 8E EB F2 D4 FD 33 8B 51 BE 19 5E 45>)
(   7,<2014-04-10 22:40:04.135 -0700>,<Administrator>,<X>,<proc1d>,<TOPSPIN 2.1>,
      <abs ABSG = 4 
       data hash MD5: 32K
       63 6F 44 20 12 89 E1 A8 FE 19 B3 02 85 6F 13 02>)
(   8,<2014-04-10 22:40:04.198 -0700>,<Administrator>,<X>,<proc1d>,<TOPSPIN 2.1>,
      <abs ABSG = 5 
       data hash MD5: 32K
       A6 14 CB 96 D4 8F 31 0B 49 76 DA 0C 0F 58 9F 0B>)
$$ ##END=
$$ 
$$ $$ hash MD5
$$ $$ AA F1 55 E5 BE F3 59 A3 E1 9C EF 57 26 77 9A 60
##$RELAX= 
##$RELAX= 
##$RELAX= 
##$RELAX= 
##$RELAX= 
##$RELAX= 
##$RELAX= 
$$ Bruker specific parameters
$$ --------------------------
##$DU= <E:\>
##$EXPNO= 10
##$NAME= <AC1646_HPIAH13379_8569811_LtuT1ecJIy>
$$ [...]
150 150 150 150 150 150 150 150
##$TP07= 0
##$TPNAME0= <>
##$TPNAME1= <>
##$TPNAME2= <>
##$TPNAME3= <>
##$TPNAME4= <>
##$TPNAME5= <>
##$TPNAME6= <>
##$TPNAME7= <>
##$TPOAL= (0..7)
0.5 0.5 0.5 0.5 0.5 0.5 0.5 0.5
##$TPOFFS= (0..7)
0 0 0 0 0 0 0 0
##$TUNHIN= 0
##$TUNHOUT= 0
##$TUNXOUT= 0
##$USERA1= <user>
##$USERA2= <user>
##$USERA3= <user>
##$USERA4= <user>
##$USERA5= <user>
##$V9= 5
##$VALIST= <valist>
##$VCLIST= <CCCCCCCCCCCCCCC>
##$VD= 0
##$VDLIST= <DDDDDDDDDDDDDDD>
##$VPLIST= <PPPPPPPPPPPPPPP>
##$VTLIST= <TTTTTTTTTTTTTTT>
##$WBST= 1024
##$WBSW= 4
##$XGAIN= (0..3)
0 0 0 0
##$XL= 0
##$YL= 0
##$YMAX_a= 626095
##$YMIN_a= -530416
##$ZGOPTNS= <>
##$ZL1= 120
##$ZL2= 120
##$ZL3= 120
##$ZL4= 120
##$ABSF1= 14.98509
##$ABSF2= -5.573092
##$ABSG= 5
##$ABSL= 3
##$ALPHA= 0
##$AQORDER= 0
##$ASSFAC= 0
##$ASSFACI= 0
##$ASSFACX= 0
##$ASSWID= 0
##$AUNMP= <proc_prof1d_extract_pilot.lims>
##$AXLEFT= 0
##$AXNAME= <>
##$AXNUC= <1H>
##$AXRIGHT= 0
##$AXTYPE= 0
##$AXUNIT= <>
##$AZFE= 0.1
##$AZFW= 0.1
##$BCFW= 0
##$BC_mod= 0
##$BYTORDP= 0
##$COROFFS= 0
##$CY= 15
##$DATMOD= 1
##$DC= 0
##$DFILT= <>
##$DTYPP= 0
##$F1P= 0
##$F2P= 0
##$FCOR= 0.5
##$FTSIZE= 32768
##$FT_mod= 6
##$GAMMA= 0
##$GB= 0
##$INTBC= 1
##$INTSCL= 1
##$ISEN= 128
##$LB= 0
##$LEV0= 0
##$LPBIN= 0
##$MAXI= 10000
##$MC2= 0
##$MEAN= 0
##$ME_mod= 0
##$MI= 0
##$NCOEF= 0
##$NC_proc= -8
##$NLEV= 6
##$NOISF1= 0
##$NOISF2= 0
##$NSP= 0
##$NTH_PI= 0
##$NZP= 0
##$OFFSET= 14.98509
##$PC= 1
##$PHC0= 94.45496
##$PHC1= 0
##$PH_mod= 1
##$PKNL= yes
##$PPARMOD= 0
##$PPDIAG= 0
##$PPIPTYP= 0
##$PPMPNUM= 2147483647
##$PPRESOL= 1
##$PSCAL= 4
##$PSIGN= 0
##$PYNMP= <proc.py>
##$REVERSE= no
##$SF= 400.02
##$SI= 32768
##$SIGF1= 0
##$SIGF2= 0
##$SINO= 400
##$SIOLD= 32768
##$SPECTYP= <>
##$SREGLST= <1H.CDCl3>
##$SSB= 0
##$STSI= 32768
##$STSR= 0
##$SW_p= 8223.68421052631
##$SYMM= 0
##$S_DEV= 0
##$TDeff= 65536
##$TDoff= 0
##$TI= <>
##$TILT= no
##$TM1= 0
##$TM2= 0
##$TOPLEV= 0
##$USERP1= <user>
##$USERP2= <user>
##$USERP3= <user>
##$USERP4= <user>
##$USERP5= <user>
##$WDW= 1
##$XDIM= 32768
##$YMAX_p= 454224370
##$YMIN_p= -705067
##$CURPLOT= <Network HP LaserJet P1505>
##$CURPRIN= <$Network HP LaserJet P1505>
##$DFORMAT= <normdp>
##$LAYOUT= <+/1D_H.xwp>
##$LFORMAT= <normlp>
##$PFORMAT= <normpl>
##$SURQMSG= 1
$$ End of Bruker specific parameters
$$ ---------------------------------
##NTUPLES= NMR SPECTRUM
##VAR_NAME=  FREQUENCY,     SPECTRUM/REAL,   SPECTRUM/IMAG
##SYMBOL=    X,             R,               I
##VAR_TYPE=  INDEPENDENT,   DEPENDENT,       DEPENDENT
##VAR_FORM=  AFFN,          ASDF,            ASDF
##VAR_DIM=   32768,         32768,           32768
##UNITS=     HZ,            ARBITRARY UNITS, ARBITRARY UNITS
##FACTOR=    0.250966925370066, 1,           1
##FIRST=     8223.43324360094, 79849,        -189621
##LAST=      0,             -253252,         -240137
##MIN=       0,             -705067,         0
##MAX=       8223.43324360094, 454224370,    0
$$ Real data points
##PAGE= N=1
##DATA TABLE= (X++(R..R)), XYDATA
$$ [...]
$$ plain form
19556 -263921 -52300 -340729 149075 43218 -16102 211394 7201 175248 -140933 -63210 -154899
19545 -154899 -246953 -55448 -127457 -121992 249750 -122876 -173129 -49656 -9600 -2932 -42267 90979
19532 -147781 -386962 -11390 -206848 18595 -158175 -4250 -214577 -74604 69186 -250515 89122
19520 38822 89752 294709 -109374 -73349 112316 -323337 12569 -55577 311981 -3859 -293640
19509 -293640 25295 134376 183192 13946 -43965 186249 -454378 -233973 78569 114686 -80813
19497 40319 -34429 -278946 -156990 287936 -218909 66617 -205668 -155800 -134412 -195892 -49089
19485 81806 -50021 -240728 42180 -59343 63770 53921 -262318 -223071 -206000 -215634 94228 -57517
19472 89864 -334588 -61938 61127 -221058 238408 -47248 50256 -170097 -225312 -95215 29822
$$ packed form
19556b63921e2300k88429A49075D3218a6102B11394G201J68047a40933f3210r1689
19545a54899r2054e5448p2009N465B49750a22876n0253d9656i600b932l9335I0979
19532a47781k39181a1390j95458A8595a58175d250k10327g4604F9186b50515H9122
19520C8822N0930K04957a09374L6025A12316c23337A2569e5577C11981c859k89781
19509b93640B5295J09081M8816A3946d3965A86249d54378K20405G8569L6117h0813
19497D0319c4429k44517J21956B87936b18909F6617b05668M9868K1388o1480d9089
19485H1806e0021j90707D2180e9343F3770r849b62318L9247J7071r634I4228e7517
19472H9864c34588f1938F1127b21058B38408d7248E0256a70097n5215i5215B9822
$$ plain form
19460 -192481 -145985 -236396 -118176 254175 -19857 47919 157993 -43826 -169130 -152049 224252
19448 -158120 -315245 -4792 -259912 33680 -109565 160554 -275520 142406 -294221 -224099
19438 -224099 -72864 142511 -25753 66537 -154152 -100071 -132792 -205863 -371999 -98693 -269297
19427 -269297 28632 -70168 -213048 -485256 27207 -210736 -365961 -198767 -62846 53379
19416 -133438 -130423 310950 -43214 84690 38437 -163228 172288 -23372 -222544 -237827 -141369
19405 -141369 -45308 -250862 57847 107638 5429 1227 129346 -41317 -334069 7914 -622 284052
19392 161948 -90859 -65238 98910 -31046 60116 -351297 -28236 -103607 -181188 280675 -7911
19380 163226 -117396 -106613 -209916 -150230 -161250 -32144 -53794 -27310 217140 28188 -252397
$$ packed form
19460a92481M6496r0411a18176B54175a9857D7919J10074d3826j25304J7081B24252
19448a58120j57125d792k55120C3680a09565A60554b75520A42406b94221P0122
19438b24099g2864A42511b5753F6537a54152N4081l2721p3071j66136i8693j70604
19427b69297B8632g0168j42880k72208B7207b10736j55225J67194f2846E3379
19416a33438L015C10950d3214H4690C8437a63228A72288b3372j99172j5283R6458
19405a41369d5308k05554E7847M9791E429A227J28119d1317k92752G914f22B84052
19392A61948i0859K5621I8910c1046F0116c51297b8236p5371p7581B80675g911
19380A63226a17396J0783j03303N9686j1020c2144k1650K6484B17140B8188b52397
$$ plain form
19368 92169 -191089 141245 -75448 29691 -6965 -169472 -243172 -355471 20285 41807 -64673
19356 -228078 -15916 -344927 -174572 -241968 123567 -409829 149488 -12642 -29191 50842
19345 143993 -1545 -63934 -109681 -143642 305847 282622 -207718 -1376 -229975 -235486 -205936
19334 -205936 256199 -296130 -108535 -322612 -144411 74222 137177 24109 -272019 37388
19323 -111740 34202 -246878 117060 216353 -366803 67596 -79967 69402 -147058 17692 -196687
19311 -87432 -411748 -32765 81013 -22511 59533 39132 116824 211103 84841 98162 67647
19300 67647 -6432 -324321 273151 -78785 63651 21496 273125 364968 -78409 -116540 97888
19288 159207 -96734 -104656 -91803 -410869 40041 -400344 21820 -78215 56065 -115567 -172821
$$ packed form
19368I2169a91089A41245g5448B9691f965j62507p3700j12299B0285K1522f4673
19356b28078a5916l29011J70355o7396A23567d09829A49488a2642j6549E0842
19345A43993a545o2389m5747l3961C05847k3225b07718a376k28599n511K9550
19334b05936B56199b96130a08535k14077a44411G4222O2955B4109b72019C7388
19323a11740C4202b46878A17060R9293c66803F7596g9967F9402a47058A7692a96687
19311h7432l24316c2765H1013b2511E9533k0401P7692R4279H4841J3321l0515
19300F7647f432l17889B73151g8785F3651B1496K51629R1843g8409l8131I7888
19288A59207i6734p922J2853l19066D0041d00344B1820g8215E6065a15567n7254
$$ plain form
19277 -172821 -89901 145781 -334 82719 -104850 185290 -121585 -118818 -62044 26282 -228967
19265 65778 -270318 93635 -98859 -312990 -209517 108075 -174040 -174145 126376 -112014 -50463
19253 -34465 83275 -122294 183170 287635 25491 189324 -199879 -295400 -345793 363921
19242 -96065 -78654 90877 -171594 171802 -139717 -54240 -127861 -65918 -367698 37154 129910
19231 129910 -379081 43540 45783 13669 256724 -232297 -13123 50702 62027 -251734 100933
19219 -16835 190778 113540 231763 -296833 77943 -104745 -131642 -95562 537081 -137305
19208 27903 94482 50606 -51672 84601 -59889 -201321 171048 -467863 -314843 -211691 -59382
19196 -99158 -140164 41024 354990 -42119 -105215 -92193 4146 343455 -125481 -140563 -94986
$$ packed form
19277a72821Q2920A45781c34H2719a04850A85290a21585K767N6774B6282b28967
19265F5778b70318I3635i8859k14131J03473A08075a74040j05A26376a12014e0463
19253c4465H3275a22294A83170J04465B5491J63833a99879r5521n0393C63921
19242i6065J7411I0877a71594A71802a39717e4240p3621O1943l01780C7154R2756
19231A29910c79081D3540K243A3669K43055b32297a3123E0702J1325b51734A00933
19219a6835A90778p7238J18223b96833G7943a04745k6897L6080E37081a37305
19208B7903O6579m3876e1672H4601e9889j41432A71048d67863J53020J03152e9382
19196i9158m1006D1024L13966d2119o3096J3022D146L39309a25481j5082M5577
$$ plain form
19185 -94986 174988 -90378 -64021 -121769 -164529 -169003 -87430 67355 -199239 5904 240178
19174 240178 -15662 -142556 -142062 -23539 -6706 9768 -194848 -93363 -217349 -247549 -76419 9385
19161 91800 -204372 -264029 -477448 -38573 -298385 68736 -80231 -208616 161364 -216401
19150 -134553 640353 -192511 -319127 -178437 -40188 -210119 -197935 -89741 -111240 48578
19139 225970 -127561 -65230 184710 158067 128791 -272901 180586 -54287 -274481 -30384
19128 -28411 -146863 -622385 -12578 -136136 176989 1164 66060 -339784 -203648 -232962 135582
19116 -137560 -277777 -123186 70511 -310233 -290303 6915 -101104 202559 -217541 -22334
19105 333733 -42857 261618 -241282 -99309 416249 -338491 -60404 -83267 -305950 246827
$$ packed form
19185i4986A74988i0378K6357n7748m2760m474Q1573F7355a99239E904K34274
19174B40178a5662j26894M94b3539f706I768a94848i3363j23986l0200g6419I385
19161I1800b04372n9657k13419c8573k59812F8736h0231j28385A61364b16401
19150a34553F40353a92511j26616J40690d0188j69931J2184h9741k1499D8578
19139B25970a27561O2331A84710k6643k9276b72901A80586e4287k20194c0384
19128b8411j18452m75522a2578j23558A76989A164O4896c39784J36136k9314A35582
19116a37560j40217a23186G0511c10233J9930F915a01104B02559b17541b2334
19105C33733d2857B61618b41282i9309D16249c38491f0404k2863k22683B46827
$$ plain form
19094 241764 -9826 105794 54570 -122159 -53904 -454443 56949 21178 45401 -189659 115247
19082 -197482 -142294 107629 -106906 -178265 32200 -197251 16516 -23989 -191141 -38100 11578
19070 128282 -48381 -220109 -319472 -267668 -40314 243869 -74848 -76850 -64296 347838 134516
19058 28202 68188 218099 191113 184394 -148710 -93584 -75594 282927 -102471 -86713 -224996
19047 -224996 -102581 -66202 -57694 -260793 -65984 -353800 36915 131280 -314381 -139890 8210
19035 -41941 -209620 -65622 -193300 -33696 -4572 -131196 -116033 97837 96552 -31234 -125590
19024 -125590 207979 143228 29324 137225 -12854 239554 111065 96302 -181835 150301
19013 -44174 -167546 70717 -234830 -236255 -141139 175092 170984 -156387 133714 -145259 -81965
$$ packed form
19094B41764i826A05794n1224a22159e3904m00539E6949B1178K4223a89659A15247
19082a97482N5188A07629a06906p1359C2200a97251A6516b3989j67152c8100A1578
19070A28282d8381j71728r9363N1804d0314B43869g4848k002J2554C47838A34516
19058B8202L9986J49911k6986o719a48710N5126J7990B82927a02471J5758j38283
19047b24996a02581L6379Q508k03099f5984k87816C6915R4365c14381a39890H210
19035d1941j67679f5622j27678c3696d572j26624J5163I7837j285c1234r4356
19024a25590B07979o4751B9324J07901a2854B39554A11065j4763a81835A50301
19013d4174j23372G0717b34830j425R5116A75092m108a56387A33714a45259O3294
$$ plain form
19002 -81965 -83482 144571 -36746 -18868 -27320 -186380 -351820 211719 -48691 -120634 21215
18990 -33590 76034 -28048 -245372 -450954 16432 -151011 117953 42432 122598 162448 219754
18979 219754 -402353 -6367 -181043 127398 -78021 -248379 -31832 -121077 -318579 -272608 138125
18967 -50171 165847 259999 -161903 31564 73962 97712 -49147 159588 -44639 -132259 4689
18955 -34273 107672 308676 -44389 -209708 -99436 68477 96770 -70639 -215188 -29900 51037
18943 -30194 28802 -90508 -85526 -86970 -44668 83877 -164763 -75513 163846 -300314 -89873
18931 23088 61290 -178722 -74182 69564 -8680 176755 -257353 -116640 -130599 44821 -199555
18919 -11747 154182 -76721 174764 46981 -23640 33703 3051 -37710 -138316 -66290 -33047
$$ packed form
19002h1965j517A44571c6746J7878q452j59060j65440B11719d8691p1943B1215
18990c3590G6034b8048k17324k05582A6432a51011A17953D2432Q0166L9850N7306
18979B19754d02353f367j74676A27398g8021j70358c1832q9245j97502M5971A38125
18967e0171A65847R4152a61903C1564M2398K3750d9147A59588d4639q7620D689
18955c4273A07672K01004d4389j65319i9436F8477K8293g0639j44549b9900E1037
18943c0194B8802i0508M982j444M2302H3877a64763g5513A63846c00314h9873
18931B3088L8202a78722g4182F9564h680A76755b57353a16640j3959D4821a99555
18919a1747A54182g6721A74764D6981b3640C3703C051c7710j00606f6290c3047
$$ plain form
18907 -116814 -208097 159380 -248582 -348700 72424 4906 26676 -244047 -49384 -84922 -75053
18896 -75053 16003 -9147 31596 8708 35038 84301 -25094 -44919 -111543 -125917 67090 -314525
18883 -62892 -2035 225390 -211908 203290 332931 10488 102440 -141042 -130445 -128874 -118639
18872 -118639 90512 143715 -212618 -31053 78942 138692 218027 194756 -400280 -299221 -137337
18860 250498 -314996 -444801 29635 -180596 264116 -262322 -145706 71203 76839 273460
18850 273460 -76897 279280 121082 148327 -193312 4423 -53676 -161171 -28185 98482 -1054
18838 -201632 -60240 -554876 -113672 -186651 -77169 22893 -335187 -130252 -314209 14432
18827 -55413 166559 -55600 -72192 155393 97441 -63027 -282740 -93714 225908 64111 -160413
$$ packed form
18907a16814r1283A59380b48582j00118G2424D906K1770b44047d9384l5538R869
18896g5053A6003i147C1596H708K6330M9263b5094j9825o6624j4374F7090c14525
18883f2892b035B25390b11908B03290J29641A0488R1952a41042J0597J571J0235
18872a18639I0512N3203b12618c1053G8942N9750P9335k3271d00280J01059a37337
18860B50498c14996j29805B9635a80596B64116b62322J16616G1203N636J96621
18850B73460g6897B79280A21082K7245a93312D423e3676j07495b8185I8482a054
18838b01632f0240m94636a13672p2979g7169B2893c35187a30252j83957A4432
18827e5413A66559e5600j6592A55393n7952f3027k19713i3714B25908F4111a60413
$$ plain form
18815 39139 151655 53415 43500 135171 57933 -81455 172438 360602 94346 -183705 288834
18803 121986 77277 125948 41523 40678 -164590 79348 -305154 -8109 56413 -36580 -432888
18792 -432888 -45494 -6153 302136 146817 89631 56599 -171228 -403065 136970 74538 -68843
18780 114700 182195 -171708 96808 -94519 70360 -227829 -57396 -217296 -43455 -170635 -166342
18769 -166342 -152773 -201100 247032 -210150 -45748 -74026 -164128 73010 -85718 -215901 -153769
18758 -153769 -162386 181518 -263611 103512 -113399 -242500 35097 -109374 263101 -214964
18747 118693 -105518 -89691 -225054 -165212 -82664 62757 334728 -15349 336435 -18199 -125373
18736 -125373 89066 -6601 98841 -181973 -222640 -126957 16862 -353444 -357742 -306141 -283519
$$ packed form
18815C9139J12516E3415r915R1671E7933h1455A72438J88164I4346a83705B88834
18803A21986m4709M8671D1523q45a64590G9348c05154h109E6413c6580l96308
18792d32888d5494f153C02136A46817n7186l3032a71228k31837A36970o2432f8843
18780A14700O7495a71708I6808i4519G0360b27829e7396j59900d3455j27180M293
18769a66342J3569m8327B47032b10150d5748k8278r0102G3010h5718j30183O2132
18758a53769q617A81518b63611A03512a13399j29101C5097a09374B63101b14964
18747A18693a05518J5827j35363N9842Q2548F2757K71971a5349C36435a8199j07174
18736a25373H9066f601I8841a81973m0667R5683A6862c53444m298N1601K2622
$$ plain form
18725 -283519 -90864 -79658 -212107 -10400 60980 -313664 -57280 -143126 -141010 -169207 -308057
18714 -308057 -432932 64123 -146350 8380 54185 -26856 -231096 -45739 54567 -155118 -141190
18703 -141190 -112689 -125094 171039 35111 -13934 -418547 107000 -87476 167405 -244388
18692 -30374 -406241 -194968 -206046 -89032 -74404 -300928 -235003 -217806 113541 -226871 129367
18680 -240302 73353 -115592 37148 -106205 1946 82507 -85653 -108054 88494 62000 31463
18669 31463 142706 -141111 197114 113660 -62047 -82834 -205439 -20106 -181624 127505
18658 -147035 -71372 50457 -150691 -221303 1483 -51365 83336 157444 -57538 -19550 -119016
18647 -119016 -246251 67700 -161769 211319 -97567 69369 -279419 69848 -115898 22801
$$ packed form
18725b83519i0864J1206j32449a0400F0980c13664e7280q5846K116k8197j38850
18714c08057j24875F4123a46350H380M5805b6856k04240d5739E4567a55118J3928
18703a41190K8501j2405A71039C5111a3934m04613A07000h7476A67405b44388
18692c0374l75867a94968j1078h9032J4628k26524O5925J7197A13541b26871A29367
18680b40302G3353a15592C7148a06205A946Q0561h5653k2401H8494k6494l0537
18669C1463J11243a41111A97114q3454f2047k0787j22605b0106j61518A27505
18658a47035g1372E0457a50691p0612A483e1365H3336P4108e7538a9550r9466
18647a19016j27235F7700a61769B11319i7567F9369b79419F9848a15898B2801
$$ plain form
18636 93309 -89812 -128031 -34459 -16801 155543 135893 -139383 -47359 -13456 -30024 -281668
18625 -281668 167428 102033 93695 -446869 -229475 -478934 186261 -29925 -112580 35529 94918
18614 94918 -53841 -6394 125720 -252072 -139366 -124341 18953 -11057 93830 -220871 -158337
18603 -158337 -265467 -178001 -337686 418687 36076 -16480 -311040 -268244 198178 -56087
18592 -133132 68032 173387 80907 322181 -130814 71911 -163023 120891 -187339 -323302
18582 -323302 -111917 -253273 140259 -43815 202735 83671 -38634 195387 -333582 -278444
18572 -278444 -202369 -164789 86438 2632 -241901 -15942 57443 -158573 -45613 -31895 -323491
18561 -323491 -40819 15771 13497 -147953 -74987 261274 -54301 280553 -60804 -33813 -260837
$$ packed form
18636I3309h9812l8219c4459a6801A55543j9650a39383d7359a3456j6568k51644
18625b81668A67428o5395q338d46869K17394k49459A86261b9925q2655C5529N9389
18614I4918e3841f394A25720b52072J12706J5025A8953a1057I3830b20871O2534
18603a58337j07130Q7466j59685D18687C6076a6480k94560M2796A98178e6087
18592a33132F8032J05355H0907K41274a30814G1911a63023A20891a87339j35963
18582c23302a11917j41356A40259d3815B02735H3671c8634A95387c33582N5138
18572b78444P6075L7580H6438B632b41901a5942E7443a58573d5613J3718k91596
18561c23491d0819A5771k274a47953P2966B61274e4301B80553f0804K6991k27024
$$ plain form
18550 -260837 -308441 -154313 -85368 -366899 -136143 201089 -17237 -108687 55762 -171234
18539 -90941 -213132 -248298 87932 61938 93803 -95327 -278759 -257192 -119806 -135914 43833
18527 -30864 -28979 -63096 -233644 53074 -230359 369297 -16218 -478896 -4584 -28815 -247308
18516 -247308 -8138 -15046 -101184 88709 352192 -46001 143719 -152169 155785 31222 35629
18505 35629 -22401 44611 452152 105926 -3404 465905 96807 -277082 -170794 99904 -180070
18493 -178011 -73845 61148 90434 454006 -168433 -97771 -121445 102735 -89662 -461539 -119002
18481 133248 -280171 -200830 -201962 271590 -178790 -16417 231859 -322168 119231 -62537
18470 -170331 31802 12889 148572 -148381 -87614 -503 -80472 -36055 -323240 56653 -53701
$$ packed form
18550b60837m7604J54128O8945k81531a36143B01089a7237r1450E5762a71234
18539i0941j22191l5166H7932k5994L1865i5327j83432K1567a19806j6108D3833
18527c0864J885l4117j70548E3074b30359C69297a6218m62678d584k4231k18493
18516b47308h138o908q6138H8709K63483d6001A43719a52169A55785C1222M407
18505C5629b2401D4611M07541A05926c404D65905I6807b77082J06288I9904a80070
18493a78011g3845F1148K9286L63572a68433P0662k3674A02735h9662l71877a19002
18481A33248b80171P9341j132B71590a78790a6417B31859c22168A19231f2537
18470a70331C1802A2889J35683a48381O0767e03p9969c6055k87185E6653e3701
$$ plain form
18458 184815 97960 -395219 71061 -332526 22331 -46715 -535307 -165248 267112 -358313
18447 -175019 1502 -86679 81093 -60339 225599 -52683 -337616 -96821 186449 -134250 -40581
18435 -262759 -49069 -116939 -170464 -123459 221527 -6349 -83824 -120152 -54756 -101276 148692
18423 -429914 -2924 -280142 -44384 22161 -236382 -79118 179801 214534 -14915 64698 -97822
18411 -26197 185705 86881 -92918 -104717 103970 8617 19258 154049 131889 193557 -289682
18399 -23975 169418 132444 23665 -58948 326755 -18559 338117 21763 -43589 -81596 -129116
18388 -129116 -204087 2399 110175 4695 -323716 62233 -175605 -255733 207778 -229025 -83998
18376 -72625 180906 322760 -157910 446687 113628 -47355 -404438 348474 -58400 35978
$$ packed form
18458A84815q6855c95219G1061c32526B2331d6715m88592a65248B67112c58313
18447a75019A502h6679H1093f0339B25599e2683k84933i6821A86449a34250d0581
18435b62759d9069o7870n3525M7005B21527f349p7475l6328e4756m6520A48692
18423d29914b924k77218d4384B2161b36382g9118A79801L4733a4915F4698i7822
18411b6197A85705H6881i2918j1799A03970H617J0641J34791k2160O1668b89682
18399b3975A69418l6974B3665e8948C26755a8559C38117B1763d3589l8007m7520
18388a29116p4971B399J07776D695c23716F2233a75605q0128B07778b29025h3998
18376g2625A80906J41854a57910D46687A13628d7355l57083C48474e8400C5978
$$ plain form
18365 278506 287997 -20472 62939 108294 -85514 8401 -70264 -76855 -139265 128150 101630 -64167
18352 -36829 -354945 -27555 -32054 17329 -94340 -15656 67403 -76550 -167160 -203364 2372 -18815
18339 -120664 94462 -68970 -373454 -80512 -87879 256084 132061 229653 26166 -392828 -212582
18328 -212582 -111273 229721 -146314 79145 5855 -95960 93250 -207267 -147614 -147247 15649
18316 -392461 4036 64719 53166 -209529 50388 -93488 216804 -198644 -266759 212761 -102056
18304 -146251 -201179 -417045 -22059 70217 56870 -151938 171635 -277248 268462 -173870
18293 -37971 35811 -41456 182035 247507 -63839 80304 553513 107107 -64123 259008 50996
18281 -179796 -290674 74649 -136075 -109958 102365 -102559 94328 -97633 -26632 63333 -333541
$$ packed form
18365B78506R491b0472F2939M5355h5514H401g0264o591o2410A28150k6520f4167
18352c6829l18116b7555m499A7329i4340a5656F7403g6550r0610l6204B372a8815
18339a20664I4462f8970l04484h0512p367B56084j24023R7592B6166c92828J80246
18328b12582J01309B29721a46314G9145E855i5960I3250b07267N9653L67A5649
18316c92461D036O0683j1553b09529E0388i3488B16804a98644o8115B12761a02056
18304a46251n4928k15866b2059G0217j3347a51938A71635b77248B68462a73870
18293c7971C5811d1456A82035O5472f3839H0304M73209A07107f4123B59008E0996
18281a79796j10878G4649a36075K6117A02365a02559I4328i7633b6632F3333c33541
$$ plain form
18269 373640 89190 -57024 -113370 -276421 104316 -143380 -56487 170016 -185477 -139072
18259 -139072 -8567 -78748 159602 -133638 -106087 16319 -153385 -72138 -242037 -341878 -202959
18248 -202959 -214076 -127488 -111689 34197 -155820 -174195 -98211 318917 84302 -169026 146733
18236 16470 51222 -94992 17514 -49964 -49815 153420 -67023 123802 -152888 -125592 -161051
18225 -161051 45417 -110412 211906 -87362 95137 28368 113595 -32201 -229075 -255433 -132905
18214 -132905 -148560 -28716 96252 114202 -223409 -219104 -85920 102489 -110592 168363 -404270
18202 38167 15477 70054 -204654 55502 -57160 -254647 -86434 -129414 112421 8864 -58630
18190 -293092 47623 130856 -298467 -19557 23999 331406 291490 -84819 113447 -86351 -128493
$$ packed form
18269C73640H9190e7024n6346j63051A04316a43380e6487A70016a85477M6405
18259a39072h567p0181A59602a33638K7551A6319a53385g2138j69899r9841J38919
18248b02959j1117Q6588J5799C4197a55820j8375P5984C18917H4302a69026A46733
18236A6470L4752i4992A7514d9964J49A53420f7023A23802a52888K7296l5459
18225a61051D5417a10412B11906h7362I5137B8368Q5227c2201j96874k6358J22528
18214a32905j5655b8716I6252J7950b23409M305h5920A02489a10592A68363d04270
18202C8167A5477N4577b04654E5502e7160j97487h6434m2980A12421H864e8630
18190b93092D7623Q3233b98467a9557B3999L07407l9916h4819A13447h6351m2142
$$ plain form
18179 -128493 40612 -468671 173296 -132246 -188272 -82865 -333211 20075 -56090 291545
18168 214474 53077 -87345 38325 4068 197813 18007 -88423 -73760 -134985 -523401 23692
18156 22612 257987 162371 -47939 98266 -22024 -94406 75187 -220868 32740 219815 -99776
18144 391223 -253030 -132644 -202106 -166602 40793 -93560 -101774 -33710 132767 -52013 162344
18132 166329 229812 -281649 81889 72649 -278418 58916 -39027 -129632 -134913 49325 -165856
18120 72862 -112987 168895 17557 75572 -212162 -62989 -214226 175635 -136045 51554
18109 -260375 -83416 -120326 161539 -201602 142959 -173897 -302707 -26182 -403913 42644
18098 -66167 -61370 -58086 171644 -164297 455801 33946 -274928 -128537 309785 136984 -266634
$$ packed form
18179a28493D0612d68671A73296a32246n6026h2865k50346B0075e6090B91545
18168B14474E3077h7345C8325D068J93745A8007h8423J4663o1225l88416B3692
18156B2612K35375r5616d7939I8266b2024p2382G5187b20868C2740J87075i9776
18144C91223b53030J20386o9462L5504D0793i3560q214c3710A32767e2013A62344
18132A66329O3483b81649H1889r240b78418E8916c9027r0605n281D9325a65856
18120G2862a12987A68895A7557N8015b12162f2989j51237A75635a36045E1554
18109b60375h3416l6910A61539b01602A42959a73897j28810b6182l77731D2644
18098f6167M797L284A71644a64297D55801C3946b74928a28537C09785A36984b66634
$$ plain form
18086 -115479 3876 133986 -138675 50234 222028 -38671 -176427 -127284 -113937 -67404 200132
18074 -79788 -13098 -305078 -11479 -288671 96164 -19907 -114080 -111865 -57912 -212012 -129167
18063 -129167 -134690 309401 -134362 -39742 -89794 158585 -5499 -66646 131907 302603 -168324
18051 214833 -10512 -201460 -76042 -11663 168841 -153294 -90630 331140 -14918 -147511
18041 -147511 -162743 -148502 -192669 199894 -372149 -146292 99391 -190745 144737 -121182
18030 -298518 -6770 95549 -162515 -112520 148030 -159318 -23159 -335512 -2202 6666 189731
18019 189731 -44308 -163148 -55097 -83646 -171688 336029 174804 224550 -9412 -406972 -6463
18007 -128640 115197 -123484 -62392 -36552 -283494 -75895 208435 -187767 78619 -97110
$$ packed form
18086a15479C876J30110a38675E0234J71794c8671j37756M9143J3347M6533B00132
18074g9788a3098k91980a1479k77192I6164a9907r4173K215N3953j54100Q2845
18063a29167n523C09401a34362c9742n0052A58585e499o1147A31907J70696a68324
18051B14833a0512j90948g6042a1663A68841a53294O2664C31140a4918j32593
18041a47511j5232J4241m4167A99894c72149a46292I9391a90745A44737a21182
18030b98518f770I5549a62515M9995A48030a59318b3159l12353b202F666J83065
18019A89731d4308j18840e5097k8549q8042C36029j61225M9746i412l97560f463
18007a28640A15197a23484O1092K5840k46942g5895B08435a87767G8619i7110
$$ plain form
17996 -97699 10032 112943 187243 -445603 -23058 63278 563782 80219 99093 -9569 -107230
17985 -107230 -58058 -23385 -57839 169650 -91566 -32436 -180289 98272 -49378 -67560 239174
17973 147925 -402654 148150 3580 -132036 -329159 134790 275935 -482023 36112 181096
17963 181096 290288 7228 -34961 180788 82015 -20729 -52682 49659 -75035 100881 -48482
17951 -117576 267650 -100235 151450 80849 196612 -203188 115243 168787 -315122 133734
17940 -84703 135154 -160361 124651 -108406 -64155 -250720 -136531 123021 158688 -108528
17929 -151552 118051 -14351 -248189 14483 -139230 170756 151501 -118316 129187 -95396
17918 -223085 -142108 51797 123702 185889 85329 -163052 145753 248310 -101720 -29123 -89467
$$ packed form
17996i7699A0032J02911P4300d45603b3058F3278N00504H0219J8874i569r7661
17985a07230M9172b3385l4454A69650i1566c2436j47853I8272d9378j8182B39174
17973A47925d02654A48150C580a32036j97123A34790J41145d82023C6112J44984
17963A81096J09192G228c4961A80788H2015b0729l1953D9659g5035A00881d8482
17951a17576B67650a00235A51450p0601J15763b03188A15243N3544c15122A33734
17940h4703A35154a60361A24651a08406M4251j86565J14189A23021L5667a08528
17929a51552A18051a4351k33838A4483a39230A70756j9255a18316A29187i5396
17918b23085Q0977E1797P1905O2187H5329a63052A45753J02557a01720b9123o0344
$$ plain form
17907 -89467 11020 -23233 -188682 120649 -93075 -85968 39452 198842 -12380 -103174 6395
17895 -16195 -87085 -77005 119337 98214 3145 52598 -71796 -8748 49834 -152073 93529 -198263
17882 59618 -423551 172954 -368854 152758 -56423 55817 7206 152893 61239 -313797 113696
17870 -246153 -164193 -71983 -411410 105006 152068 -300761 240226 153422 -103296 -136877
17860 -136877 -322163 115297 -51989 -73265 -107913 81755 73967 -92788 -32490 142454 104778
17849 104778 -83728 -38692 -176766 -154730 13052 125538 37956 183912 -297127 101999
17838 36575 136384 389472 191590 -324806 96485 -59664 90779 356626 -144905 25796 -11647
17826 -162527 -92901 -98201 20243 -21454 1416 -142800 167514 138751 -61361 38290 90733
$$ packed form
17907h9467A1020b3233j65449A20649i3075P107C9452J59390a2380r0794F395
17895a6195p0890J0080A19337k1123C145M9453g1796h748D9834a52073I3529a98263
17882E9618d23551A72954c68854A52758e6423E5817G206J45687F1239c13797A13696
17870b46153Q1960g1983l39427A05006M7062c00761B40226q6804a03296l3581
17860a36877j85286A15297e1989k1276l4648H1755p788i2788c2490A42454l7676
17849A04778h3728c8692j38074K2036A3052J12486C7956J45956b97127A01999
17838C6575R9809K53088A91590c24806I6485e9664I0779K65847a44905B5796a1647
17826a62527O9626n300B0243b1454A416a42800A67514k8763f1361C8290N2443
$$ plain form
17815 90733 -122443 127231 6991 67381 -50190 -145732 41921 42741 197632 26126 146374
17804 146374 127242 223369 -121332 -36561 95259 -193973 267603 -110729 -58554 -235795
17794 -235795 23517 111601 139731 -102130 44706 -155343 108824 185816 -129380 -303682
17784 -303682 69490 -177193 34960 -66903 -3947 -115593 -152748 -68776 -79540 -217810 -154729
17773 -154729 -109788 74333 28430 -56183 -132843 -247950 33883 -257402 -43281 4997 -62169
17761 140920 31140 -34797 4159 -43247 71128 202628 -259984 -263899 13546 -59358 -245053
17750 -245053 -168165 157460 75769 358662 -88437 209594 -3749 -367516 -253864 186748
17739 -38184 45005 73851 310607 12737 -31325 -64795 19196 217569 -209189 -81992 -231606
$$ packed form
17815I0733a22443A27231F991O0390e0190r5542D1921Q20J54891B6126J20248
17804A46374j9132R6127a21332c6561I5259a93973B67603a10729N2175j77241
17794b35795B3517Q8084K8130a02130D4706a55343A08824P6992a29380j74302
17784c03682F9490a77193C4960f6903c947j11646l7155f8776j0764j38270O3081
17773a54729M4941G4333B8430e6183p6660j15107C3883b57402d3281D997f2169
17761A40920C1140c4797D159d3247G1128J31500b59984l915A3546e9358j85695
17750b45053P6888A57460G5769K82893h8437B09594c749l63767J13652A86748
17739c8184D5005K8846K36756A2737c1325l3470A9196J98373b09189h1992j49614
$$ plain form
17728 -231606 -21507 93037 184567 -118876 1748 18372 52478 64615 60841 145864 -41181 139854
17715 22265 195341 -3060 -23663 105061 210991 52641 20669 186703 -255014 -13452 -65018
17704 -65018 114382 186460 305226 -62770 76677 26512 -116758 -96094 -235767 256918 172888
17693 172888 -18889 155137 56690 113605 -119651 68089 8869 -110584 80187 235336 -172622
17681 -158799 -128310 -116882 6675 -122636 -271461 66756 118247 -94805 -342018 218839 -128877
17669 261772 7934 -60206 17176 -79366 -187826 305275 231401 137431 -92617 20713 260972
17658 260972 241175 6126 -132005 117750 4209 44128 -5288 40600 48848 106468 287266 115919
17645 64080 -318534 -132421 -245935 -44823 -135312 -62868 164053 176723 147830 -51756 -69794
$$ packed form
17728b31606b1507I3037R1530a18876A748J6624L4106J2137l774Q5023d1181A39854
17715B2265J73076c060k0603A05061J05930E2641B0669J66034b55014a3452n1566
17704f5018A14382P2078J18766f2770G6677B6512a16758K0664j39673B56918q4030
17693A72888a8889A55137E6690N6915a19651F8089H869a10584H0187J55149a72622
17681a58799L0489J1428F675a22636j48825F6756N1491i4805k47213B18839a28877
17669B61772G934f0206A7176g9366j08460C05275p3874r3970i2617B0713K40259
17658B60972j9797F126a32005A17750D209L9919e288D0600Q248N7620J80798A15919
17645F4080c18534a32421j13514d4823r0489f2868A64053J2670k8893e1756j8038
$$ plain form
17634 -69794 119433 -64206 426929 -98591 64596 -297544 -22233 59257 -151475 -107616 179598
17622 196394 235493 189503 20373 22929 -98883 64405 44330 -161628 17375 79085 -48208
17610 58746 64037 -10386 72676 -352940 -78886 38185 177288 -233438 46811 -252912 -215988
17599 -215988 -247436 195547 -114972 -170192 -259720 -65738 -148902 -108186 -6397 394587 164499
17587 81198 32162 -103312 -193352 -170676 73345 269736 -176872 131313 138022 -24846 -62386
17576 -62386 -44620 -340060 77271 -250057 -244 74528 -37986 -35916 -37791 -385732 165424 178551
17564 178551 -84937 139468 63315 57445 -161350 57381 284648 191694 -31468 94234 -145032
17552 78327 91326 139272 -17230 375863 178074 18738 143366 110725 -182384 364802 389216
$$ packed form
17634f9794A19433f4206D26929i8591F4596b97544b2233E9257a51475M3859A79598
17622A96394L9099m5990B0373K556i8883F4405k0075a61628A7375O1710d8208
17610E8746N291a0386G2676c52940g8886C8185J39103b33438D6811b52912L6924
17599b15988l1448A95547a14972n5220q9528f5738q3164M0716f397C94587A64499
17587H1198C2162a03312r0040K2676G3345J96391a76872A31313O709b4846l7540
17576f2386J7766k95440G7271b50057b44G4528c7986K070j875l47941A65424J3127
17564A78551h4937A39468F3315n870a61350E7381K27267r2954c1468I4234a45032
17552G8327J2999M7946a7230C75863A78074A8738J24628l2641a82384C64802K4414
$$ plain form
17541 389216 202878 -52820 -21192 138762 -14163 205184 -6827 144150 -101346 71851 270952
17530 270952 96247 -47595 154279 -212308 226224 64326 -73281 411149 301100 -18446
17519 100131 317280 -332331 -66756 249353 181743 -31898 401888 233065 226929 341406
17509 341406 -5443 330955 21793 325996 -75539 86768 -106521 -8881 -263628 120251 241982
17498 241982 298353 193007 27366 60051 14259 -82106 -49126 62197 -282683 83341 -319360
17486 -162057 211949 -46667 129087 274460 484086 317709 206186 -88513 198091 269084
17476 269084 309181 -316994 624814 -195131 718266 206576 -32381 181805 461526 36682
17465 53662 -26186 277807 365260 -131877 191960 262436 -171767 -132405 194414 67585 112614
$$ packed form
17541C89216j86338e2820b1192A38762a4163B05184f827A44150a01346G1851J99101
17530B70952I6247d7595A54279b12308B26224F4326g3281D11149j10049a8446
17519A00131K17149c32331f6756B49353o7610c1898D01888j68823o136J14477
17509C41406e443C30955B1793L04203g5539H6768a06521h881k54747A20251J21731
17498B41982N6371j05346B7366L2685A4259h2106L2980F2197b82683H3341c19360
17486a62057B11949d6667A29087J45373K09626j66377j11523h8513A98091P0993
17476B69084M0097c16994F24814a95131G18266B06576c2381A81805K79721C6682
17465E3662b6186B77807Q7453a31877A91960P0476a71767L9362A94414F7585M5029
$$ plain form
17454 112614 644338 169996 319364 93706 180735 286569 407901 235689 264692 318351
17444 318351 223983 352383 349066 335741 177552 537648 67355 391192 217473 319677
17434 319677 -135088 129609 319951 13074 194028 120126 57054 406484 19464 208224
17424 208224 273515 209791 313462 317936 275252 267423 181234 -67191 170226 84320 214104
17413 214104 360483 334993 783 151602 5526 195764 70985 194713 246239 529543 589106
17402 589106 114878 116479 -66089 116822 178295 271428 198741 -69206 168135 -4756 151850
17390 -18968 350201 -97436 77368 78525 254550 445166 -73294 355957 197664 -81252 1637
17378 266835 -91018 -44017 329263 178590 464977 227926 650582 535008 -7696 188652
$$ packed form
17454A12614N31724A69996J49368I3706Q7029J05834J21332j72212K9003N3659
17444C18351r4368J28400l317j3325j58189L60096F7355L23837j73719J02204
17434C19677a35088A29609J90342A3074J80954p3902E7054L49430A9464J88760
17424B08224O5291o3724J03671M474m2684p829q6189f7191A70226H4320J29784
17413B14104J46379k5490G83J50819E526J90238G0985J23728N1526K83304N9563
17402E89106A14878J601f6089A16822O1473R3133p2687f9206A68135d756A51850
17390a8968C50201i7436G7368J157J76025J90616g3294C55957j58293h1252A637
17378B66835i1018d4017C29263j50673K86387B27926M22656j15574g696A88652
$$ plain form
17367 312626 165843 -91339 -39908 317588 222653 -255432 -63112 368377 105231 104882 490950
17356 490950 106659 338656 281691 363486 80377 247516 73037 18350 218053 -23824 39068
17344 116392 -81727 321508 236599 -42534 283708 285661 -9707 332798 197632 158767 177866
17333 177866 -138744 18822 238631 108974 149337 275978 400426 54237 158326 344889
17323 344889 380451 70563 5393 227580 26930 259566 119170 -23804 -142775 508265 71404
17311 87538 73187 -17346 150620 355035 284295 403913 -82964 -12607 93269 203336 49083
17299 69383 -74015 398604 -33318 -84552 60412 503631 199807 112548 52955 472243 462140
17288 462140 355547 -54143 229742 -94693 57975 182833 93707 121007 321370 82909 299956
$$ packed form
17367C12626j46783i1339c9908C17588r4935b55432f3112C68377A05231l49L86068
17356D90950A06659K31997n6965Q1795H0377J67139G3037A8350J99703b3824C9068
17344A16392h1727C21508q4909d2534B83708J953i707C32798j35166l8865J9099
17333A77866a38744A8822K19809A08974M0363J26641J24448E4237J04089J86563
17323C44889L5562G0563E393K22187B6930K32636A19170b3804j18971E08265G1404
17311H7538j4351a7346A50620K04415p0740J19618h2964a2607I3269J10067D9083
17299F9383g4015C98604c3318n1234F0412M43219A99807q7259E2955M19288j0103
17288D62140j06593e4143B29742i4693E7975J24858q9126K7300K00363H2909K17047
$$ plain form
17277 299956 196646 272861 80074 466198 -123538 36951 -48501 254303 142529 148987 -18867
17265 538314 108498 178684 382646 436625 276902 426272 -59056 266453 457505 222113
17254 336140 122827 223078 -25393 121269 441150 -176050 50856 423966 71651 283537
17244 283537 23734 275692 455016 58528 430126 336600 130297 953 -16190 203654 30798
17232 136715 362227 -30802 110148 60683 394194 114267 221129 203729 328579 -19308
17221 30553 287425 204065 148403 73138 281888 170358 118531 277062 395048 386234 207836
17210 207836 67521 316874 557377 104782 -92599 202412 339191 372389 19093 179965
17200 179965 89428 260431 473413 143679 418329 286943 -16210 115505 198424 360491
$$ packed form
17277B99956j03310P6215H0074L86124a23538C6951d8501B54303j11774O458a8867
17265E38314A08498P0186K03962N3979j59723J49370e9056B66453J91052B22113
17254C36140A22827J00251b5393A21269L19881a76050E0856L73110G1651K11886
17244B83537B3734K51958J79324E8528L71598r3526A30297I53a6190B03654C0798
17232A36715K25512c0802A10148m9465L33511A14267J06862j7400J24850a9308
17221C0553K56872q3360n5662G3138K08750j11530n1827J58531J17986q814j78398
17210B07836F7521K49353K40503A04782i2599B02412J36779L3198A9093J60872
17200A79965H9428J71003K12982A43679K74650j31386a6210A15505Q2919J62067
$$ plain form
17190 360491 74948 456673 12048 336505 292720 71801 309628 155602 335387 167505
17179 608961 384990 234039 506799 484592 241975 267041 326921 206819 278647 370300
17169 370300 325328 207708 261799 445558 107330 365270 224010 457960 478329 59845
17158 238518 386538 629002 391826 462735 349102 459615 322011 395257 201127 66860
17147 522015 213672 108550 28874 54364 329844 333090 325793 605040 270335 195668 505300
17136 505300 286230 393518 452836 291765 333293 450922 391403 372745 326065 460872
17126 460872 338889 128527 266849 317301 368348 262038 155184 446521 529930 176540
17115 249835 423025 100190 253844 230515 498665 521619 269456 268177 354569 447867 207173
$$ packed form
17190C60491G4948L81725A2048L24457m3785G1801K37827j54026J79785A67505
17179F08961k23971j50951K72760k2207B41975K5066N9880j20102P1828R1653
17169C70300m4972j17620N4091J83759A07330K57940j41260K33950K0369E9845
17158B38518J48020K42464k37176P0909j13633J10513j37604P3246j94130F6860
17147E22015B13672j05122B8874K5490K75480L246p297K79247B70335p4667L09632
17136E05300k19070J07288N9318j61071M1528J17629n9519j8658m6680J34807
17126D60872j21983A28527J38322N0452N1047j06310j06854K91337Q3409A76540
17115B49835J73190A00190J53654k3329K68150K2954k52163j279Q6392R3298B07173
$$ plain form
17103 459591 449102 636666 498663 262494 393830 223120 215995 767899 204619 115760
17093 115760 374553 302728 87508 127948 527361 511350 466165 502244 511260 403101 455310
17082 455310 324557 844964 477794 529435 304047 490813 449716 491214 316139 438150
17072 438150 375482 507161 671866 563558 413239 727241 469777 201162 506200 505921
17062 505921 769171 356019 735493 523717 350841 457332 297877 392114 563960 580448
17052 580448 472363 770176 516378 769685 586719 540236 457741 393540 672788 597502
17042 597502 297199 444839 812009 557776 533564 704261 408181 840762 568468 330188
17032 330188 585399 642106 648726 504588 779561 779674 388743 742470 702700 1004893 643373
$$ packed form
17103D59591j0489J87564j38003k36169J31336j70710p125N51904B04619q8859
17093A15760K58793p1825H7508M0440L99413j6011m5185L6079R016j08159N2209
17082D55310j30753N20407l67170N1641k25388J86766m1097M1498j75075J22011
17072D38150o2668J31679J64705j08308j50319L14002k57464B01162L05038k79
17062E05921K63250C56019L79474k11776j72876J06491j59455R4237J71846J6488
17052E80448j08085K97813k53798K53307j82966m6483q2495o4201K79248p5286
17042E97502B97199J47640L67170k54233k4212J70697k96080M32581k72294k38280
17032C30188K55211N6707O620j44138K74973J13C88743L53727l9770L02193l61520
$$ plain form
17021 643373 604979 479612 550993 654430 644637 374570 647516 554484 651044 730477 770157
17010 770157 585339 313567 532354 391568 875231 935250 520511 1012365 942885 900503
17000 900503 822473 844117 1054368 857624 489982 767568 583105 812076 706390 355985
16990 355985 585462 817091 577988 904704 899683 730559 708719 1048853 725138 1051255
16980 1051255 954917 962083 940483 606613 1046002 1275085 650634 742188 883663 749353
16970 749353 1246906 1377749 819742 963346 980181 735172 618691 1245526 1053996 1072953
16960 1072953 1052233 967484 948843 1003691 1229525 1071804 969447 999776 939778 1184036
16950 1184036 1229970 1136499 1247868 861413 1157229 1329723 966545 1159989 1250198 1228440
$$ packed form
17021F43373l8394j25367P1381J03437r793k70067K72946r3032R6560P9433L9680
17010G70157j84818k71772K18787j40786M83663O0019m14739M91854o9480m2382
17000I00503p8030K1644K10251j96744l67642K77586j84463K28971j05686l50405
16990C55985K29477K31629k39103L26716n021j69124k1840L40134l23715L26117
16980A051255r6338P166k1600l33870M39389K29083o24451R1554J41475j34310
16970G49353M97553J30843n58007J43604J6835k45009j16481O26835j91530J8957
16960A072953k0720q4749j8641N4848K25834j57721j02357L0329n9998K44258
16950A184036M5934r3471J11369l86455K95816J72494l63178J93444R0209k1758
$$ plain form
16940 1228440 782363 1194581 889491 1277141 1166733 1406547 972293 1472792 1309807
16931 1309807 1217553 1212313 1168451 1396228 1513119 1479417 1428566 1253680 1339616 1394110 1474642
16920 1474642 1240327 1653547 1230132 1790118 1482946 1499495 1706266 1705990 1694546 1586955
16910 1586955 1239218 1912053 1341579 1939888 1585209 1663502 1611601 1289679 2121654 1669727
16900 1669727 2009329 1618061 1967041 1947715 1676266 1864836 1897898 1843268 1959042 1671353
16890 1671353 2075681 1967937 2110073 2032914 2271517 2537723 2214962 2008246 2085212 1975553
16880 1975553 2343584 2148812 2504968 2118932 2410316 2224100 2297570 2448543 2387194 2523334
16870 2523334 2632722 2403959 2656804 2688446 2548019 2606424 2618351 2950775 2536363 2828376
$$ packed form
16940A228440m46077M12218l05090L87650j10408K39814m34254N00499j62985
16931A309807r2254n240m3862K27777J16891l3702n0851j74886Q5936N4494Q0532
16920A474642k34315M13220m23415N59986l07172J6549K06771k76j1444j07591
16910A586955l47737O72835n70474N98309l54679P8293n1901l21922Q31975m51927
16900A669727L39602l91268L48980j9326k71449J88570L3062n4630J15774k87689
16890A671353M04328j07744J42136p7159K38603K66206l22761k06716P6966j09659
16880A975553L68031j94772L56156l86036K91384j86216P3470J50973o1349J36140
16870B523334J09388k28763K52845L1642j40427N8405J1927L32424m14412K92013
$$ plain form
16860 2828376 2740528 3037506 3016681 2880143 3067474 3059850 3172939 3288097 3361291 2991692
16850 2991692 3239943 3344727 3526389 3510970 3614759 3428172 3532710 3453124 3608721 3681169
16840 3681169 4098800 3890732 3892594 4022754 4244123 4166093 4100090 3980209 4177531 4472209
16830 4472209 4550326 4653096 4608641 4640068 4810747 4758641 4835420 5064730 5037840 5341045
16820 5341045 5391167 5542354 5523574 5622764 5935218 5725901 5933010 6086008 6291903 6540917
16810 6540917 6093211 6336386 6894249 6879028 7118739 7332520 7239616 7920744 7940017 7933052
16800 7933052 7631798 8331951 8414833 8605880 8905373 9086257 9475853 9573967 10175903 9966075
16790 9966075 10392364 10539177 10738704 10946660 11411090 11682120 11986517 12517337 12542509 12882804
$$ packed form
16860B828376q7848K96978k0825j36538J87331p624J13089J15158P3194l69599
16850B991692K48251J04784J81662j5419J03789j86587J04538p9586J55597P2448
16840C681169M17631k08068J862J30160K21369p8030o6003j19881J97322K94678
16830D472209P8117J02770m4455L1427J70679n2106P6779K29310k6890L03205
16820E341045N0122J51187j8780R9190L12454k09317K07109J52998K05895K49014
16810F540917m47706K43175N57863j5221K39711K13781r2904O81128J9273o965
16800G933052l01254P00153Q2882J91047K99493J80884L89596R8114O01936k09828
16790I966075M26289J46813J99527K07956M64430K71030L04397N30820K5172L40295
$$ plain form
16780 12882804 13493314 14097449 14486586 14681800 15061793 15554383 16137669 16334952 17653277
16771 17653277 17871839 18350907 18979306 19610322 20478320 21334634 21896931 22832066 23451080
16762 23451080 24618948 25879561 26419919 27853706 28678074 29757309 30987754 32556089
16754 32556089 33772952 35341113 36962521 38820040 40720584 42245044 44431160 46632401
16746 46632401 49171713 51814908 54098237 57373009 60052813 63552443 66723754 70629600
16738 70629600 74504600 78503444 83136966 87908421 93225524 98426532 104131645 110106854
16730 110106854 116111661 122646437 129581374 136252701 143108732 149902843 156252636 162741203
16722 162741203 168740414 173759559 178261038 181613461 183978260 185380647 185668342 184396600
$$ packed form
16780A2882804O10510O04135L89137J95214L79993M92590N83286J97283J318325
16771A7653277K18562M79068O28399O31016Q67998Q56314N62297R35135O19014
16762B3451080J167868J260613N40358J433787Q24368J079235J230445J568335
16754C2556089J216863J568161J621408J857519J900544J524460K186116K201241
16746D6632401K539312K643195K283329L274772K679804L499630L171311L905846
16738G0629600L875000L998844M633522M771455N317103N201008N705113N975209
16730A10106854O004807O534776O934937O671327O856031O794111O349793O488567
16722A62741203N999211N019145M501479L352423K364799J402387K87695j271742
$$ plain form
16714 184396600 182184267 178880299 174499860 169352133 163520831 157183503 150128772 143307398
16706 143307398 136117089 128846424 121810535 115075298 108546072 102085881 96358767 90450300
16698 90450300 85332838 80770740 75679413 71722279 67446343 63659668 59933069 56840990
16690 56840990 53763063 50927863 48345943 45663438 43306724 41267919 39152825 37315653
16682 37315653 35467348 33958084 32172787 30899013 29534596 28112044 26910213 25906396
16674 25906396 24691799 23440926 22903320 21926635 21128623 20264940 19661035 18632071 18037278
16665 18037278 17458360 16920296 16024154 15446980 15030781 14800088 13957755 13785217 13177177
16656 13177177 12983632 12242402 12169946 11563929 11123206 10831636 10670088 10290512 10000666
$$ packed form
16714A84396600k212333l303968m380439n147727n831302o337328p054731o821374
16706A43307398p190309p270665p035889o735237o529226o460191n727114n908467
16698I0450300n117462m562098n091327l957134m275936l786675l726599l092079
16690E6840990l077927k835200k581920k682505k356714k038805k115094j837172
16682C7315653j848305j509264j785297j273774j364417j422552j201831j003817
16674B5906396j214597j250873n37606r76685p98012q63683o03905j028964n94793
16665A8037278n78918n38064q96142n77174m16199k30693q42333j72538o08040
16656A3177177j93545p41230p2456o06017m40723k91570j61548l79576k89846
$$ plain form
16647 10000666 9904984 9299329 9518591 9055755 8578878 8714174 8264258 8091579 7900615
16638 7900615 7603455 7541479 7170308 6925053 7081125 6733993 6788149 6355752 6531060 6180487
16628 6180487 5743307 5896027 5718534 5460348 5521511 5259122 5148417 5019896 4949688 4775589
16618 4775589 4968925 4877015 4558063 4478540 4461754 3987373 4101959 4233929 3962799 3967026
16608 3967026 3808276 3864496 3432177 3799520 3585738 3819046 3530950 3528118 3371385 3158764
16598 3158764 3295161 2970007 3008605 3020256 3273941 3091859 2846794 2892923 2909309 2922521
16588 2922521 2852227 2540646 3029582 2566765 2502271 2518931 2043561 2360172 2526909 2461302
16578 2461302 2359893 2328993 2123569 2119683 2150884 2409200 1801391 2401598 2238867 2298088
$$ packed form
16647A0000666r5682o05655K19262m62836m76877J35296m49916j72679j90964
16638G900615k97160o1976l71171k45255J56072l47132N4156m32397J75308l50573
16628F180487m37180J52720j77493k58186O1163k62389j10705j28521p0208j74099
16618D775589J93336r1910l18952p9523j6786m74381J14586J31970k71130M227
16608C967026j58750N6220m32319L67343k13782K33308k88096k832j56733k12621
16598C158764J36397l25154L8598J1651K53685j82082k45065M6129J6386J3212
16588B922521p0294l11581M88936m62817o4494J6660m75370L16611J66737o5607
16578B461302j01409l0900k05424l886L1201K58316o07809O00207j62731N9221
$$ plain form
16568 2298088 2232680 2041482 2117950 2101794 1713685 1717581 1966293 1768965 1823857 1741767 1563036
16557 1563036 1654727 1631945 1914742 1510645 1665620 1325288 1275012 1615339 1465389 1359991
16547 1359991 1417665 1532441 1635619 1448296 1568892 1599135 1477629 1352429 1048435 1722728
16537 1722728 995870 1505128 1103131 1019836 1478531 1399980 960700 1083908 1369203 1151344
16527 1151344 1002235 1257533 1050379 1115501 1083685 983034 1228705 824388 1221167 833505
16517 833505 1126650 916390 1157110 1270492 550463 1209924 962357 1190261 924197 701986
16507 701986 725085 859720 1265316 988289 910665 747685 465730 1071758 721168 1192119
16497 1192119 744460 637414 720686 782311 944366 994934 949202 569585 889757 505597
$$ packed form
16568B298088o5408j91198P6468j6156l88109L896K48712j97328N4892q2090j78731
16557A563036R1691k2782K82797m04097J54975l40332n0276L40327j49950j05398
16547A359991N7674J14776J03178j87323J20596L0243j21506j25200l03994O74293
16537A722728p26858N09258m01997q3295M58695p8551m39280J23208K85295k17859
16527A151344j49109K55298k07154O5122l1816j00651K45671m04317L96779l87662
16517H33505K93145k10260K40720J13382E50463O59461k47567K27904k66064k22211
16507G01986K3099J34635M05596k77027p7624j62980k81955O06028l50590M70951
16497A192119m47659j07046Q3272O1625J62055N0568m5732l79617L20172l84160
$$ plain form
16487 505597 592363 560473 954576 1067722 708698 519666 531370 650126 737621 748087
16477 748087 611922 250107 1175635 525615 560007 718940 610999 387197 635103 228719
16466 539998 441368 762684 750330 408920 196150 540669 516043 711137 683577 818830
16456 818830 596707 382367 374980 629315 713922 609408 360401 736726 549981 752994
16446 752994 260019 505050 369889 334420 763557 673196 419578 713931 533783 70132
16435 396756 583870 265811 293907 625013 435995 166612 555369 364491 510922 279980
16425 279980 216170 479990 534175 474542 269432 364599 284785 257668 498590 441037 600028
16414 600028 377307 425665 452280 536043 209641 397947 199339 374286 526681 503846
$$ packed form
16487E05597Q6766l1890L94103J13146l59024j89032J1704J18756Q7495J0466
16477G48087j36165B50107R25528E25615L4392J58933j07941k23802K47906B28719
16466E39998r8630L21316j2354l41410A96150L44519k4626J95094k7560J35253
16456H18830k22123k14340p387K54335Q4607j04514k49007L76325j86745K03013
16446G52994B60019K45031j35161l5469M29137r0361k53618K94353j80148G0132
16435C96756J87114B65811K8096L31106j89018A66612L88757j90878J46431k30942
16425B79980o3810K63820N4185n9633k05110R5167p9814k7117K40922n7553J58991
16414F00028k22721M8358K6615Q3763B09641J88306j98608J74947J52395k2835
$$ plain form
16404 503846 307481 237434 94805 211131 454251 349055 314527 337571 62477 208059
16394 208059 312135 301264 103144 329887 174637 125566 503165 124552 325977 198547
16384 198547 93200 373318 254695 182960 304236 162945 439580 366456 722382 276038
16373 163026 78065 290473 528410 107688 566091 443093 176686 157690 113522 312092
16363 312092 74803 126834 438282 528828 -21591 9480 -6489 353734 160725 -7957 536565
16351 499521 266175 245976 236948 194579 113462 203060 464038 61720 331511 78382 227140
16340 227140 340488 421691 60995 -245810 206356 188311 73585 149019 158675 582264 -135216
16328 423586 -69149 -80690 53686 9184 45569 196388 -39760 -366357 193112 11444 -93729
$$ packed form
16404E03846j96365p0047I4805J16326K43120j05196l4528K3044F2477J45582
16394B08059J04076j0871A03144K26743j55250m9071L77599A24552K01425j27430
16384A98547I3200K80118j18623p1735J21276j41291K76635p3124L55926B76038
16373A63026G8065K12408K37937A07688M58403j22998A76686j8996m4168J98570
16363C12092G4803N2031L11448R0546b1591I480f489C53734A60725g957E36565
16351D99521k33346k0199r028m2369q1117Q9598K60978F1720K69791G8382J48758
16340B27140J13348Q1203F0995b45810B06356j8045G3585P5434R656M23589a35216
16328D23586f9149j1541E3686I184L6385J50819c9760l26597A93112A1444i3729
$$ plain form
16316 303300 248584 -220923 258050 291751 336995 -81723 448319 124595 242670 316926
16306 316926 387161 352810 -171785 -97740 102099 419195 -254809 111906 186378 377883
16296 377883 45757 88385 73297 37620 358902 91795 305700 230193 353974 -94873 -124990
16285 -124990 5758 300571 -85912 -50747 160885 65678 -63012 234055 65042 -76092 -148041
16274 -148041 -40215 134179 75602 -231103 -52580 12449 -116320 -271602 84854 -40597 255552
16262 37446 268238 -25040 178971 -378991 198942 216359 55930 -23054 -141161 -58852 14517
16250 137597 31559 -190411 -192032 -46291 -58660 -244356 167197 525468 176231 5333 232803
16239 232803 -181464 28361 239983 79829 237839 75087 232625 148430 116121 -212485
$$ packed form
16316C03300n4716b20923B58050L3701M5244h1723D48319A24595J18075P4256
16306C16926P0235l4351a71785P4045A02099L17096b54809A11906P4472J91505
16296C77883D5757M2628j5088l5677L21282I1795K13905p5507J23781i4873l0117
16285a24990E758K94813h5912L5165A60885F5678f3012B34055F5042g6092p1949
16274a48041d0215A34179n8577b31103e2580A2449a16320j55282H4854d0597B55552
16262C7446K30792b5040A78971c78991A98942J7417E5930b3054j18107e8852A4517
16250A37597C1559a90411j621d6291j2369j85696A67197L58271A76231E333K27470
16239B32803a81464B8361K11622G9829J58010G5087J57538q4195l2309b12485
$$ plain form
16228 -55517 -34283 -98024 191827 71502 -9347 -28182 -191390 9379 70960 124983 -27223 -52583
16216 -52583 81632 -128274 307560 168216 368417 249710 -1518 90226 -153039 -97871 41046
16204 242741 140626 330884 156366 189901 -88189 272500 80313 -128860 -114437 -155697
16194 -155697 -34346 112758 -21764 182332 -45783 208645 243182 120364 219360 40911 276763
16183 276763 183623 192125 190488 214979 86350 291640 212735 -74418 262866 -100088 -86313
16172 -86313 -183848 135047 -122254 13926 42471 -3941 -115132 67813 -244959 -85606 166934
16160 -202133 376502 52371 -66830 -23893 287799 -87049 177465 16609 -69654 -326899 -88734
16148 -33923 4007 159297 86945 -372325 312808 131968 3032 4421 -127601 19136 -179514
$$ packed form
16228e5517K1234o3741A91827G1502i347j8835j63208I379O1581N4023b7223k5360
16216e2583H1632a28274C07560j39344K00201j18707a518I0226a53039N5168D1046
16204B42741j02115J90258A56366L3535h8189B72500H0313a28860J4423m1260
16194a55697c4346A12758b1764A82332d5783B08645L4537A20364R8996D0911K35852
16183B76763r3140Q502j637K4491H6350K05290p8905g4418B62866a00088J3775
16172h6313r7535A35047a22254A3926K8545c941j11191F7813b44959h5606A66934
16160b02133C76502E2371f6830b3893B87799h7049A77465A6609f9654k57245h8734
16148c3923D007J55290p2352c72325C12808A31968C032J389a27601A9136a79514
$$ plain form
16136 -132963 423463 -117983 -129458 -24712 86590 -223995 -102933 151033 -71308 -5299 -42816
16125 -42816 -79738 133946 -239731 126921 413814 -14099 117793 429742 -68411 59829
16114 362861 -82184 -201618 100357 198566 -158637 52029 23422 -27499 -147193 31708 118924
16103 118924 -147596 -169881 219098 159505 486333 184984 299099 40424 -208759 -47870
16092 70373 -162364 -346846 108715 -264408 -166078 -46556 209499 -93251 300093 -73614
16081 -180777 -52286 -106206 -144957 99999 147780 283959 53559 -136806 -103048 -22419 120355
16069 158981 201201 130643 221429 158030 30733 135726 -165968 19629 -43061 150157 -94061
16057 -291690 -198220 -139127 -183186 -288097 4771 -226081 -157118 128116 -201075 -4386 82872
$$ packed form
16136a32963D23463a17983j1475b4712H6590b23995a02933A51033g1308e299l7517
16125d2816l6922A33946b39731A26921K86893a4099A17793L11949f8411E9829
16114C62861h2184j19434A00357R8209a58637E2029B3422b7499j19694C1708Q7216
16103A18924a47596k2285B19098n9593L26828A84984J14115D0424b08759d7870
16092G0373a62364j84482A08715b64408R8330d6556B09499i3251C00093g3614
16081a80777e2286n3920l8751I9999M7781J36179E3559a36806L3758b2419A20355
16069A58981M2220p0558R0786o3399C0733J04993a65968A9629d3061A50157i4061
16057b91690R3470N9093m4059j04911D771b26081O8963A28116b01075d386H2872
$$ plain form
16045 -152911 -87042 43948 45708 245061 40326 -114622 52789 -35277 -136604 241392 69029
16033 235088 -68417 -521655 173209 -72627 -29924 -16465 -222792 -14573 145775 63159 -147041
16021 -297005 153192 -113240 -120422 136840 244463 -129951 -322020 -22447 135099 120050
16011 120050 -202964 -141313 -165116 -81112 260123 148989 7475 140451 264282 -110139
16000 29657 -252458 -84744 110334 -38328 -120639 233127 -95250 -6547 37307 172049 83791
15988 -199564 -305368 -29122 32809 -132858 53755 232029 187239 264592 602885 94342 145582
15977 145582 281829 36993 -140524 126026 227611 -32672 91903 -6706 97732 22289 -273125
15965 283530 49045 -179831 349849 -192037 49868 -8055 -182246 84511 115777 -141950 262934
$$ packed form
16045a52911O5869D3948J760J99353D0326a14622E2789c5277j01327B41392F9029
16033B35088f8417m53238A73209g2627b9924J3459k06327a4573A45775F3159a47041
16021b97005A53192a13240p182A36840J07623a29951j92069b2447A35099j5049
16011A20050b02964O1651k3803h1112B60123j11134G475J32976J23831a10139
16000B9657b52458h4744A10334c8328q2311B33127i5250f547C7307J34742H3791
15988a99564j05804b9122C2809a32858E3755J78274m4790P7353L38293I4342N1240
15977A45582J36247C6993a40524A26026J01585c2672I1903f706I7732B2289b73125
15965B83530D9045a79831C49849a92037D9868h055j74191H4511L1266a41950B62934
$$ plain form
15953 -238863 103439 307132 112307 -198082 -145746 -187719 -337576 15559 -9239 -488490
15943 -488490 -23413 -76087 -68688 -78929 -175066 -27016 -276880 155231 137693 30390 -264264
15931 -19047 -147184 -20942 -56961 -153924 -39574 -2705 -136077 -94353 107442 -405343 -1209
15919 127220 -189815 -195014 23392 227818 -51706 -291707 -132333 34912 204591 160886 -94842
15907 282680 52482 -32400 -132473 -141719 -104956 -110935 -184731 163298 -71700 -19679 -8686 50648
15894 -78510 -127812 -499411 -221777 148024 -53267 -110391 -130575 51806 -284202 -317619 -49529
15882 -126254 -259143 -191939 63259 2037 -84997 -165613 -18285 224365 -34771 519702 -224766
15870 98138 -108291 363670 92296 43108 -11053 53107 -129132 -244189 199237 -238465
$$ packed form
15953b38863A03439K03693A12307a98082N2336m1973j49857A5559i239m79251
15943d88490b3413n2674P399j0241r6137b7016k49864A55231j7538C0390b64264
15931a9047j28137b0942l6019r6963c9574b705j33372M1724A07442d05343a209
15919A27220a89815n199B3392K04426e1706k40001a32333C4912J69679m3705i4842
15907B82680E2482c2400j00073r246L6763n979p3796A63298g1700a9679h686E0648
15894g8510m9302l71599b21777A48024e3267n7124k0184E1806b84202l3417d9529
15882a26254j32889O7204F3259B037h4997q0616a8285B24365c4771E19702b24766
15870I8138a08291C63670I2296D3108a1053E3107a29132j15057A99237b38465
$$ plain form
15859 761 148639 -10196 76521 125402 -247722 -102528 -360387 15492 -18723 -118763 -197751
15848 -197751 -127120 -16011 -145421 -264868 -165625 -280707 -284526 -320401 -140723 -247237 61870
15836 11599 260963 -171853 -45308 41766 107919 -71075 446373 -71599 -240948 91341 -486448
15824 -89497 -36961 37342 74736 68692 115690 -80705 179923 -53228 -45856 -56222 35400 -166300
15811 96131 -151404 -13558 -59894 74482 -374318 -7294 -167464 99972 25156 -184842 123041
15799 1009 74887 -183666 72648 -60830 8309 -9854 -33805 77448 -13067 -301288 -3320 31862
15786 -202541 -77038 -233440 -115906 224431 -14223 -80686 359042 30152 24388 -144102 263360
15774 47272 97950 179306 -158060 54800 -190533 60095 73827 -41148 -223802 44911 -1449
$$ packed form
15859G61J47878a0196G6521M8881b47722a02528k57859A5492a8723j00040p8988
15848a97751P0631a6011j29410j19447R9243j15082l819l5875a40723j06514F1870
15836A1599K49364a71853d5308D1766O6153g1075D46373g1599j69349I1341d86448
15824h9497c6961C7342L7394o044M6998h0705A79923e3228P372j0366C5400a66300
15811I6131a51404a3558m6336G4482c74318g294j60170I9972B5156a84842A23041
15799A009P3878a83666G2648f0830H309i854k3951G7448a3067k88221c320C1862
15786b02541g7038j56402a15906B24431a4223o6463C59042C0152n764a44102B63360
15774D7272N0678Q1356a58060E4800a90533F0095J3732d1148j82654D4911a449
$$ plain form
15762 133838 -51856 178171 -104130 241175 -90866 -214819 -3751 -160851 78839 38478 28044
15751 28044 27998 -42751 211435 277633 -536686 301600 116504 -117487 110922 -108363 260427
15739 -722 19787 127739 180202 -37913 44823 -134895 -357967 -382387 -152727 25373 -180470
15727 224799 -98729 -203603 127528 84184 -146383 -326069 19989 -52544 -141186 -104999 -201402
15716 -201402 115350 -104203 -11389 -7134 25079 23288 151194 74591 -340048 -82199 -11532
15704 167970 -107018 -491235 -35522 14887 142002 7157 1710 -74705 -245356 -261134 134645
15692 -5334 -127449 -88741 84220 -12433 -202696 -208467 107813 -176791 -56043 52234 117292
15681 117292 -912 -78867 -13591 187419 -121971 371683 148747 275380 75241 44370 -1308
$$ packed form
15762A33838e1856A78171a04130B41175i0866j23953c751j57100G8839C8478j0434
15751B8044m6d2751B11435O6198e36686C01600A16504a17487A10922a08363B60427
15739g22A9787J07952N2463c7913D4823a34895k23072k4420a52727B5373a80470
15727B24799i8729j04874A27528m3344a46383j79686A9989e2544q8642L6187r6403
15716b01402A15350a04203a1389M255B5079j791J27906G4591c40048h2199a1532
15704A67970a07018l84217c5522A4887J27115G157A710g4705j70651j5778A34645
15692e334j22115L8708H4220a2433j90263n771A07813a76791e6043E2234O5058
15681A17292i12p7955a3591A87419a21971C71683A48747J26633G5241l0871a308
$$ plain form
15669 41345 -334720 225501 -96021 -7208 108834 -122415 -263714 344849 -348162 -221998
15659 -221998 -148181 135416 -39527 233348 145668 101418 196525 -64973 112953 -2268 -319899
15648 -319899 -78475 89585 144209 229227 119808 -327414 -35316 -135436 -213359 -86195 -81861
15637 -81861 191062 -248572 59746 -34357 124451 -92881 -2094 4795 -248010 156616 239905
15626 239905 -260740 32987 -492462 -61982 -41191 -23027 -23904 60481 114513 27731 -85697
15614 11045 -53579 110908 -255702 87884 -97061 -242002 -62937 -155918 131191 -172102 73731
15602 -11716 301544 23302 11262 -95483 -33844 114127 -83356 -202017 -77871 113520 10777
15590 -85859 -48260 282049 -151150 -105342 163743 100526 -67796 173229 92136 -108926 -24873
$$ packed form
15669D1345c34720B25501i6021g208A08834a22415j41299C44849c48162J26164
15659b21998P3817A35416c9527B33348q7680m4250R5107f4973A12953b268l17631
15648c19899g8475H9585N4624Q5018j09419c27414c5316j00120p7923h6195M334
15637h1861A91062b48572E9746c4357A24451i2881b094D795b48010A56616Q3289
15626B39905b60740C2987d92462f1982K0791J8164q77F0481N4032B7731h5697
15614A1045e3579A10908b55702H7884i7061j44941f2937r2981A31191a72102G3731
15602a1716C01544B3302A1262i5483c3844A14127h3356j18661g7871A13520A0777
15590h5859L7599B82049a51150M5808A63743o3217f7796A73229q1093a08926b4873
$$ plain form
15578 -93382 -46845 -183560 121121 -406603 -58203 -416728 -76231 53783 38935 108934 -101791
15566 150845 71645 -99207 -301927 118620 277662 -42540 197650 -240714 128970 30161
15555 -55823 -118373 249159 -137065 97826 -252454 97268 79435 -196625 215249 -191006
15544 -149189 142937 234715 -239361 -172958 -224795 147509 51010 264594 224092 -94841 4479
15532 -288735 145197 116074 -216917 73734 -394241 -271503 -40735 189681 -349971 -177783
15522 -177783 -55754 38654 -42474 20501 -3819 -64121 35204 18874 350228 -68430 128694
15510 -14422 200421 464026 -104250 2241 277212 156898 -417856 -41373 16878 4026 6711
15499 6711 -209604 -176428 41366 -83396 -184111 -255036 29650 94503 251257 192881 -188326
$$ packed form
15578i3382M6537j36715A21121d06603e8203l58525g6231E3783j4848O9999a01791
15566A50845G1645i9207k02720A18620J59042d2540A97650b40714A28970C0161
15555e5823o2550B49159a37065I7826b52454I7268j7833a96625B15249a91006
15544a49189A42937R1778b39361O6403n1837A47509E1010K13584m0502i4841D479
15532b88735A45197k9123b16917G3734c94241J22738d0735A89681c49971J72188
15522a77783e5754C8654d2474B0501c819o0302C5204j6330L31354f8430A28694
15510a4422B00421K63605a04250B241K74971j20314d17856d1373A6878D026K685
15499F711b09604L3176D1366h3396j00715p0925B9650O4853J56754n8376a88326
$$ plain form
15487 208932 -184189 268754 -32074 -304225 -83563 105319 35861 -80373 21054 149524
15477 149524 -122690 -120697 16903 -118102 128073 232987 123346 -103851 45661 299146
15467 299146 -31816 59423 -475542 203731 -163314 134831 1452 84780 47942 147314 -21019
15455 -80244 -19033 -288315 -124508 -187058 126536 178709 -325125 181789 -338242 -87805
15444 394218 -186340 -246842 186650 -20883 -427510 222697 -128420 -7677 -15388 117749 -115486
15432 194606 -1284 90426 4662 -208438 198345 67591 -156239 33799 -54363 2393 -184744
15420 -152216 10475 272500 148147 36428 114716 150552 -270103 -210173 4450 -63030 8170
15408 -22606 -110254 -136544 -422510 -74120 -121479 -159824 -357614 -194075 -83147 -276707 41684
$$ packed form
15487B08932a84189B68754c2074k72151h3563A05319C5861h0373B1054J28470
15477A49524a22690J993A6903a18102A28073J04914j09641a03851D5661K53485
15467B99146c1816E9423d75542B03731a63314A34831A452Q3328l6838R9372b1019
15455h0244a9033k69282a24508o2550A26536N2173c25125A81789c38242h7805
15444C94218a86340o0502A86650b0883m06627B22697a28420g677p711A17749a15486
15432A94606a284I0426D662b08438A98345F7591a56239C3799e4363B393a84744
15420a52216A0475K62025j24353C6428P8288L5836b70103N9930D450f3030H170
15408b2606q7648k6290k85966g4120m7359l8345j97790J63539h3147j93560D1684
$$ plain form
15396 -55264 146853 -127619 -52576 -108082 70732 283019 -82432 518205 186684 -56377 -28596
15385 -28596 28675 107476 -281825 -126600 116530 -240713 320843 44403 -233334 -287149
15375 -287149 -194104 -16849 -200852 -132716 41233 32126 54717 260390 361409 78010 143993
15364 143993 40764 67572 183930 120199 41556 -148638 56504 -10347 -139059 119885 -17106
15352 58976 80298 -226912 -120340 202179 -185141 -26552 148891 -234912 -32492 142085
15341 281799 -128497 174749 312877 -244874 -34128 117425 -92233 142123 -4484 89914
15330 -195943 -59838 318318 -4532 -74351 155173 233655 78135 265881 -142549 187661 -64564
15318 -208609 191156 420817 -192380 354154 277611 -77792 -157330 -23887 289672 135515
$$ packed form
15396e5264A46853a27619e2576n5506G0732K12287h2432E18205A86684e6377K7781
15385b8596B8675P8801b81825a26600A16530b40713C20843D4403b33334n3815
15375b87149R3045a6849j84003O8136D1233r107K2591K05673J01019G8010O5983
15364A43993D0764K6808J16358o3731D1556a48638E6504a0347j28712A19885a7106
15352E8976K1322b26912J06572B02179a85141b6552A48891b34912c2492A42085
15341B81799a28497A74749J38128b44874c4128A17425i2233A42123d484H9914
15330a95943e9838C18318d532o9819A55173P8482G8135J87746a42549A87661f4564
15318b08609A91156K29661a92380C54154p6543g7792p9538b3887B89672A35515
$$ plain form
15307 4250 686229 141039 12598 85531 -17974 47646 109320 54467 157203 -154792 234087
15295 55767 315620 188918 -231322 -145827 36284 163455 142210 178764 -93412 58631 -78672
15283 288305 -293218 391428 309282 127371 -23520 126777 234738 21297 133319 -69526
15272 148026 41536 -84942 -227014 168625 -148331 307197 149014 17641 118871 180631
15262 180631 99601 269594 233008 -295612 122414 -86082 -65786 -106201 530298 272387
15252 272387 34275 18349 142077 116361 824465 1446911 1929998 1484590 1529277 1652083
15242 1652083 410251 574397 260414 215110 -9164 177245 -123810 -280431 -193415 -235625
15232 -235625 -69652 -39695 23916 -331393 108763 11138 28847 -198096 -75086 -74184 142455
$$ packed form
15307D250O81979A41039A2598P2933a7974D7646O1674E4467J02736a54792B34087
15295E5767K59853j26702b31322Q5495C6284J27171k1245L6554i3412E8631g8672
15283B88305b93218C91428q2146A27371b3520A26777J07961B1297J12022f9526
15272A48026D1536h4942j42072A68625a48331C07197A49014A7641J01230O1760
15262A80631q1030J69993l6586b95612A22414h6082K0296m0415E30298k57911
15252B72387C4275j5926J23728k5716P08104O22446M83087m45408M4687J22806
15242A652083D10251J64146B60414m5304i164A77245a23810j56621Q7016m2210
15232b35625f9652K9957B3916c31393A08763A1138J7709a98096g5086R02A42455
$$ plain form
15220 154732 56316 -174776 39829 -5591 174895 -152544 109899 -283604 86861 384665
15210 384665 -75057 245058 -27437 249054 194395 211576 28322 428839 121198 -38362 78930
15198 431093 39111 -394498 -346935 -140600 -107706 -45886 312571 183447 -179732 323551
15187 10977 270398 64809 163070 -112081 308460 -179402 -70426 115133 42798 356925
15177 356925 153306 145788 -19642 384882 109169 -32980 5203 46345 -107119 78787 143599
15166 143599 -39890 -13078 -108610 282676 60938 370355 93465 -11369 -191069 -155832 135255
15154 154779 240822 150095 244264 201281 207885 -174844 -237682 -15734 -73518 190839 144321
15143 144321 128431 -32965 151616 -110859 -30878 249500 250875 212658 197822 422451 181427
$$ packed form
15220A54732E6316a74776C9829e591A74895a52544A09899b83604H6861K97804
15210C84665g5057B45058b7437B49054n4659J7181B8322M00517A21198c8362G8930
15198D31093C9111c94498M7563a40600L2894d5886C12571j29124a79732C23551
15187A0977K59421F4809R8261a12081C08460a79402g0426A15133D2798L14127
15177C56925A53306p518a9642C84882A09169c2980E203M1142a07119G8787O4812
15166A43599c9890a3078r5532B82676F0938L09417I3465a1369j79700L5237A35255
15154A54779Q6043r0727R4169m2983O604a74844o2838a5734n7784A90839m6518
15143A44321j5890c2965A51616a10859c0878B49500J375l8217j4836K24629A81427
$$ plain form
15131 456863 126255 271706 -98971 216145 46645 224918 -49759 -251228 -50609 86893
15120 200671 52143 256947 257470 391740 199723 113857 14927 -71165 9259 413356 351844
15109 351844 169640 117565 219157 -66868 377826 122322 -113404 111123 -103561 20729
15098 -47190 406067 103058 107289 -176597 -48664 -99818 1157 138396 -3157 154455 78585
15087 78585 -84826 -38820 159307 -50510 152283 -82585 279295 77218 76640 229872 236793
15076 236793 10200 211304 131628 401003 84160 17661 117098 -14546 233476 356221 -108200
15064 502933 69287 -30129 30356 182078 144166 261673 210021 69092 252365 89279 271712
15053 271712 204119 -159137 286513 58788 365459 -1196 58006 412047 -169262 341139
$$ packed form
15131D56863A26255J45451i8971B16145D6645J78273d9759k01469e0609H6893
15120B00671E2143K04804N23J34270j92017q5866A4927g1165I259M04097o1512
15109C51844A69640n2075J01592f6868C77826A22322a13404A11123a03561B0729
15098d7190D06067A03058M231a76597d8664n1154A157J37239c157A54455p5870
15087G8585h4826c8820A59307e0510A52283h2585B79295G7218n78J53232O921
15076B36793A0200K01104p9676K69375H4160A7661R9437a4546B33476J22745a08200
15064E02933F9287c0129C0356J51722l7912J17507n1652F9092J83273H9279J82433
15053B71712o7593a59137B86513E8788L06671a196E8006L54041a69262C41139
$$ plain form
15042 -200203 157965 145216 159790 334451 89874 138108 83691 214321 208428 348794 -71180
15030 467342 29710 160173 92926 234824 103119 138639 392368 17946 -60887 164147
15019 175315 -53657 249974 155974 141509 158715 345178 308441 9447 245576 283653 269939
15008 269939 142715 -1860 22689 14439 391364 171761 395535 91650 270481 17697 93196
14997 93196 -23145 231180 299330 159925 132579 207117 439222 307110 81670 227415 385849
14986 385849 -190914 223570 69609 203469 86709 74248 78535 -27796 5276 338060 -103426
14974 400319 287427 -256260 158151 246050 285400 700108 142788 353849 245956 439442
14964 439442 512755 205297 162796 -100720 -247644 255963 181372 371013 494736 560564
$$ packed form
15042b00203A57965j2749J4574J74661H9874M8234n4417J30630n893J40366g1180
15030D67342B9710J30463o7247J41898A03119L5520K53729A7946f0887A64147
15019A75315e3657B49974r4000j4465J7206J86463l6737I447K36129L8077j3714
15008B69939j27224a860B2689q250L76925A71761K23774I1650J78831A7697P5499
14997I3196b3145B31180O8150j39405k7346P4538K32105j32112H1670J45745J58434
14986C85849a90914B23570F9609J33860H6709j2461M287b7796E276L32784a03426
14974D00319j12892b56260A58151Q7899L9350M14708A42788K11061j07893J93486
14964D39442P3313B05297m2501a00720j46924B55963p4591J89641J23723O5828
$$ plain form
14954 560564 325747 99527 495438 291237 357043 18049 628720 276741 281557 487122
14944 487122 240947 361461 553290 -39336 396237 121175 301092 368062 657870 -21516
14933 208279 440967 48277 235124 213699 -172686 -135565 520785 516882 357307 120294
14922 101408 295065 496565 184509 271553 124588 350245 -66802 162314 378727 171157
14911 492945 108019 -24429 225742 209803 555807 531658 130591 492616 515959 323350
14901 323350 453625 211910 139552 304318 193840 523985 180496 399381 235408 179932
14891 179932 481455 385763 463185 426288 224360 291745 289782 -35720 25217 505953 326247
14880 326247 595696 130248 174026 342803 350901 63230 345963 270879 584110 445057
$$ packed form
14954E60564k34817I9527L95911k04201O5806A8049O10671B76741M816K05565
14944D87122B40947J20514J91829c9336C96237A21175J79917O6970K89808b1516
14933B08279K32688D8277J86847k1425a72686L7121E20785l903j59575A20294
14922A01408J93657K01500A84509Q7044A24588K25657f6802A62314K16413A71157
14911D92945A08019b4429B25742j5939L46004k4149A30591L62025K3343j92609
14901C23350J30275B11910p2358J64766j10478L30145A80496K18885j63973n5476
14891A79932L01523r5692P7422l6897k01928O7385j963c5720B5217M80736j79706
14880C26247K69449A30248M3778J68777Q098F3230K82733p5084L13231j39053
$$ plain form
14870 445057 313127 244072 72625 200498 229468 241832 374659 116005 474073 250907
14860 250907 262109 468198 385246 121209 543662 589418 610225 218778 228478 420809 206470
14848 211407 502122 272076 536098 649972 296353 456819 408403 651032 608473 283498
14837 298753 148464 437609 655071 388773 387435 686965 648741 312100 218479 301205
14827 301205 833579 535007 715687 289286 309540 805803 514030 619283 676493 602809
14817 602809 469746 410757 406510 638118 504439 663797 478927 392621 547891 689926
14807 689926 648178 601191 643129 394425 360587 483538 287671 571591 599673 600596 480784
14796 480784 238515 476651 595872 371648 762537 547554 483120 445560 541279 97181
$$ packed form
14870D45057j31930o9055G2625J27873K8970J2364J32827A16005L58068k23166
14860B50907J1202K06089q2952A21209M22453M5756K0807B18778R700J92331B06470
14848B11407K90715k30046K64022J13874B96353J60466m8416K42629m2559B83498
14837B98753A48464K89145K17462k66298j338K99530l8224C12100r3621Q2726
14827C01205N32374k98572J80680B89286K0254M96263k91773J05253N7210p3684
14817F02809j33063n8989m247K31608j33679J59358j84870q6306J55270J42035
14807F89926m1748m6987M1938k48704l3838J22951j95867K83920K8082R23j19812
14796D80784B38515K38136J19221k24224L90889k14983o4434l7560R5719I7181
$$ plain form
14785 510134 549877 999517 802829 844179 536264 563291 748756 362735 807593 550303
14775 550303 484993 612298 447253 675877 614826 944324 855978 454373 591350 503827
14765 503827 411426 691462 597139 629353 692853 103636 407643 641449 405382 870787
14755 870787 678115 642880 596484 638684 578168 644995 859056 499460 331680 404580 834845
14744 834845 614431 746150 696701 677251 558334 744002 591448 980263 860362 401890
14733 799490 439320 899840 665342 871827 609366 683821 837980 788037 780574 813899
14723 813899 932529 804457 773067 770595 874535 708936 901580 563462 890039 855379
14713 855379 790866 849355 767904 799794 870057 489883 631060 863205 857754 671195 942031
$$ packed form
14785E10134L9743M49640j96688M1350l07915K7027J85465C62735M44858k57290
14775E50303o5310J27305j65045K28624o1051L29498q8346m01605J36977q7523
14765E03827r2401K80036r4323L2214O3500A03636L04007K33806k36067M65405
14755H70787j92672l5235m6396M2200o0516O6827K14061l59596j67780P2900M30265
14744H34845k20414J31719m9449j9450j18917J85668j52554L88815j19901D01890
14733G99490l60170M60520k34498K06485k62461P4455J54159m9943p463L3325
14723H13899J18630j28072l1390k472J03940j65599J92644l38118L26577l4660
14713H55379o4513N8489q1451L1890P0263l80174J41177K32145n451j86559K70836
$$ plain form
14702 942031 921342 797164 919874 466298 722547 945281 910839 1003031 976623 894462
14692 894462 1161221 1202191 666999 696182 513882 1157916 838402 746810 849221 1003522
14682 1003522 969451 1133217 968616 798446 1166774 1235599 960663 643802 898133 923757
14672 923757 725889 1062371 1180447 1407049 1073190 1058474 870627 859877 1071053 1021613
14662 1021613 825595 960970 729080 1045672 830168 1062629 1238142 842000 1222515
14653 1222515 1178694 686550 956519 1388351 1046187 1007749 1019188 1164574 986659 1438774
14643 1438774 1568701 1238903 1298467 1401797 1328947 1465793 931169 1199032 1198576 1437418
14633 1437418 1231335 1391107 1585770 1016886 1241971 1474846 983598 1105527 1313376
$$ packed form
14702I42031k0689j24178J22710m53576K56249K22734l4442R2192k6408q2161
14692H94462K66759M0970n35192K9183j82300O44034l19514r1592J02411J54301
14682A003522l4071J63766j64601j70170L68328O8825k74936l16861K54331K5624
14672I23757j97868L36482J18076K26602l33859j4716j87847j0750K11176m9440
14662A021613j96018J35375k31890L16592k15504K32461J75513l96142L80515
14653A222515m3821m92144K69969M31832l42164l8438J1439J45386j77915M52115
14643A438774J29927l29798N9564J03330p2850J36846n34624K67863m56K38842
14633A437418k06083J59772J94663n68884K25085K32875m91248J21929K07849
$$ plain form
14624 1313376 1048623 1536187 1292468 1224887 1340653 1580220 1477933 1005825 1431913 1411222
14614 1411222 1369460 1588099 1082782 1453996 1461393 1565149 1499474 1723383 1647631 1542143
14604 1542143 1639712 1292457 1570225 1480121 1537430 1745327 1960857 1808513 1458595 1240875
14594 1240875 1543353 1542203 1848370 1532416 1672761 1854637 1275140 1672595 1821874 1731550
14584 1731550 1614918 1907638 1786074 1834522 1932547 1863137 2145221 1749496 2053756 2160522
14574 2160522 2238945 1800600 2270868 2130745 1921624 1976710 2039424 2330426 2173006 2005223
14564 2005223 2585640 2409175 2526687 2560639 2566475 2782277 3035855 3163051 2730703 3264589
14554 3264589 3277896 3703344 4135225 4938632 6223997 9048722 13393817 21785518 38935122
$$ packed form
14624A313376k64753M87564k43719o7581J15766K39567j02287m72108M26088k0691
14614A411222m1762K18639n05317L71214P397J03756o5675K23909p5752j05488
14604A542143R7569l47255K77768r0104N7309K07897K15530j52344l49918k17720
14594A240875L02478j150L06167l15954J40345J81876n79497L97455J49279r0324
14584A731550j16632K92720j21564M8448R8025o9410K82084l95725L04260J06766
14574B160522P8423m38345M70268j40123k09121N5086O2714K91002j57420j67783
14564B005223N80417j76465J17512L3952N836K15802K53578J27196m32348N33886
14554C264589J3307M25448M31881Q03407J285365K824725M345095Q391701J7149604
$$ plain form
14545 38935122 40882328 17857490 8308508 6644664 3692633 1933472 1736163 1856316
14537 1856316 1861445 1982757 2040653 2108112 1960891 1934923 1949279 1891327 2063092 2284035 2446723
14526 2446723 2246105 2383943 2526127 2345465 2469983 2570376 2104225 2254867 2345742 2448672
14516 2448672 2423666 2624015 2665386 2487282 2815635 2271161 2689751 2765387 2373922 2369419
14506 2369419 2677359 2627113 3219942 2872943 3039230 3049891 3012242 3120459 2740314 3282828
14496 3282828 2882787 3130839 3153942 3355146 3333771 3304774 3226672 3305604 3286885 3456698
14486 3456698 3332535 3621446 3547477 3742698 3600374 3672848 3760165 3791751 3820045 3666272
14476 3666272 3641281 4074237 3594834 4210764 4243607 3736162 4036214 4107490 4191984 4498319
$$ packed form
14545C8935122J947206A7857490H308508j663844k952031j759161j97309J20153
14537A856316N129J21312N7896O7459j47221k5968J4356n7952J71765K20943J62688
14526B446723k00618J37838J42184j80662J24518J00393m66151J50642R0875J02930
14516B448672k5006K00349M1371j78104L28353n44474M18590P5636l91465m503
14506B369419L07940n0246N92829l46999J66287J0661l7649J08217l80145N42514
14496C282828m00041K48052K3103K01204k1375k8997p8102P8932j8719J69813
14486C456698j24163K88911p3969J95221j42324P2474Q7317L1586K8294j53773
14476C666272k4991M32956m79403O15930L2843n07445L00052P1276Q4494L06335
$$ plain form
14466 4498319 4119703 4429964 4103501 4491084 4545323 4501895 4609146 4712871 4607364 4800174
14456 4800174 4766922 4726775 5209243 5218810 4942763 4957899 5141807 5149247 5336462 5530893 5623265
14445 5623265 5384389 5687288 5502629 5734469 5832242 5672103 5800685 5745628 6252370 6315360
14435 6315360 6203364 6368199 6023100 6398631 6533401 6760676 6681137 6937254 6855134 6875007
14425 6875007 6594280 7424622 7439157 7673144 7403492 7633637 7682320 7656751 7872605 8141465
14415 8141465 8000430 8462868 8259964 8465711 8580705 8991384 8963956 8914948 9358007 9515364
14405 9515364 9615010 9510894 9556130 9957894 9861402 10361329 10378927 10325178 10869691 10753744
14395 10753744 11029027 11294045 11744755 11621686 11781250 11911254 12029940 12443265 12475486
$$ packed form
14466D498319l78616L10261l26463L87583N4239m3428J07251J03725j05507J92810
14456D800174l3252m0147M82468R567k76047J5136J83908P440J87215J94431R2372
14445E623265k38876L02899j84659K31840R7773j60139J28582n5057N06742O2990
14435F315360j11996J64835l45099L75531J34770K27275p9539K56117q2120J9873
14425F875007k80727Q30342J4535K33987k69652K30145M8683k5569K15854K68860
14415H141465j41035M62438k02904K05747J14994M10679k7428m9008M43059J57357
14405I515364R9646j04116M5236M01764r6492M99927J7598n3749N44513j15947
14395A0753744K75283K65018M50710j23069J59564J30004J18686M13325L2221
$$ plain form
14386 12475486 13086296 13266130 13545489 14086113 13940588 14263841 14639137 14590038 15138532
14377 15138532 15218897 15593502 15704259 15930264 16506371 16733870 17033749 17469752 17896575
14368 17896575 18150309 18643653 18899605 19317239 19636977 19706647 20735337 20934681 21414903
14359 21414903 22043141 22153592 22530039 23794939 23915496 24329028 25324593 25729073 26450889
14350 26450889 27062927 27753339 28274624 29011702 29817080 30744369 31141976 32087797 33245989
14341 33245989 33637041 34555680 36205163 37059485 38212064 38890700 39926452 41474303 42453899
14332 42453899 43864752 45331404 46314193 48147288 49967123 51061233 52740411 54650952
14324 54650952 56563313 58427248 60406955 62874731 64963033 67291432 69884711 72392829
$$ packed form
14386A2475486O10810J79834K79359N40624j45525L23253L75296m9099N48494
14377A5138532Q0365L74605J10757K26005N76107K27499K99879M36003M26823
14368A7896575K53734M93344K55952M17634L19738O9670J028690J99344M80222
14359B1414903O28238J10451L76447J264900J20557M13532R95565M04480P21816
14350B6450889O12038O90412N21285P37078Q05378R27289L97607R45821J158192
14341C3245989L91052R18639J649483Q54322J152579O78636J035752J547851R79596
14332D2453899J410853J466652R82789J833095J819835J094110J679178J910541
14324E4650952J912361J863935J979707K467776K088302K328399K593279K508118
$$ plain form
14316 72392829 75299238 78107223 81309351 84307263 88156623 91748674 95519722 99507683
14308 99507683 103772227 108274989 113204070 117877556 123000214 128535889 134698116 140600677
14300 140600677 147100041 154224429 161409088 169405888 177489544 185923142 195388072 205228702
14292 205228702 215659242 226306860 237688063 249546663 261865724 274722542 288198377
14285 288198377 301536713 315590118 330060842 344719559 359871069 374551999 388924124
14278 388924124 403031591 416117484 428488601 438963216 446219384 447945316 448640131
14271 448640131 449990432 451700519 454224370 450078033 446668781 440853539 431149083 419986031
14263 419986031 406322566 391831051 376452463 360695837 344438930 328632358 313104923
$$ packed form
14316G2392829K906409K807985L202128K997912L849360L592051L771048L987961
14308I9507683M264544M502762M929081M673486N122658N535675O162227N902561
14300A40600677O499364P124388P184659P996800Q083656Q433598R464930R840630
14292B05228702J0430540J0647618J1381203J1858600J2319061J2856818J3475835
14285B88198377J3338336J4053405J4470724J4658717J5151510J4680930J4372125
14278C88924124J4107467J3085893J2371117J0474615P256168J725932O94815
14271D48640131J350301J710087K523851m146337l409252n815242r704456j1163052
14263D19986031j3663465j4491515j5378588j5756626j6256907j5806572j5527435
$$ plain form
14256 313104923 297621043 282625401 268543955 255421085 243351905 230731844 219041861
14249 219041861 207751178 197281026 187236926 178199970 169309532 161451517 153725050
14242 153725050 146564169 139714743 133198286 127027294 121699383 116243052 111254230 106398959
14234 106398959 101430491 97714037 93819628 90148855 86552396 82995720 79733729 76852665
14226 76852665 73806781 71046917 68238178 65812674 63485359 61527881 59466062 57370674
14218 57370674 55375332 53871502 51640470 50356156 49209495 47715565 45981162 44603836
14210 44603836 43348975 41633735 40773526 40094184 39368751 37290131 36433936 35544138 34444203
14201 34444203 33953752 33234227 32233335 31065655 30416201 29661764 29226910 28247155 27308548
$$ packed form
14256C13104923j5483880j4995642j4081446j3122870j2069180j2620061j1689983
14249B19041861j1290683j0470152j0044100r036956q890438p858015p726467
14242A53725050p160881o849426o516457o170992n327911n456331m988822m855271
14234A06398959m968468l716454l894409l670773l596459l556676l261991k881064
14226G6852665l045884k759864k808739k425504k327315j957478k061819k095388
14218E7370674j995342j503830k231032j284314j146661j493930j734403j377326
14210D4603836j254861j715240q60209o79342p25433k078620q56195q89798j099935
14201C4444203m90451p19525j000892j167680o49454p54437m34854r79755r38607
$$ plain form
14192 27308548 26899189 25455981 25340164 24647310 24157416 23733370 22900372 22626657 21988395
14183 21988395 21856914 21232586 20708917 20235183 20082214 19370100 19195814 18629675 18156165
14174 18156165 17837133 17561764 17231085 16584168 16346873 16422021 15581609 15447596 15458700 15321053
14164 15321053 15080472 14719799 14202768 14198548 13652773 13459539 13194728 12995589 12618820 12674725
14154 12674725 12300346 11937301 11984952 11685692 11746115 11148083 11148196 10891904 10889127 10774012
14144 10774012 10656602 10244130 10535231 9853718 9709319 9645223 9867334 9397874 9393073 9277467
14134 9277467 8832059 8997152 8725138 8526581 8565632 8711192 8545466 8219884 8092555 7763725
14124 7763725 8091988 7877919 7788344 7920576 7563716 7157523 7173796 7078297 7006741 6892569
$$ packed form
14192B7308548m09359j443208j15817o92854m89894m24046q32998k73715o38262
14183B1988395j31481o24328n23669m73734j52969p12114j74286n66139m73510
14174A8156165l19032k75369l30679o46917k37295P5148q40412j34013J1104j37647
14164A5321053k40581l60673n17031m220n45775j93234k64811j99139l76769N5905
14154A2674725l74379l63045M7651k99260O0423n98032J13k56292k777j15115
14144A0774012j17410m12472K91101o81513j44399o4096K22111m69460m801j15606
14134I277467m45408J65093k72014j98557L9051J45560j65726l25582j27329l28830
14124G763725L28263k14069q9575J32232l56860m06193J6273r5499p1556j14172
$$ plain form
14114 6892569 6825280 6556467 6849048 6545704 6467190 6182771 6663733 6158331 6090353 5971982
14104 5971982 5900523 6107224 5823799 6228879 5828226 5934084 5816538 5268064 5590867 5477395
14094 5477395 5534190 5462647 5413514 5587329 5260009 4845286 5293313 5350107 4882106 4648340
14084 4648340 4915277 4650936 4933310 4572953 4490978 4466235 4595695 4326729 4244250 4288107
14074 4288107 4438276 4133226 4375737 4498153 4170020 4036524 4202294 4240848 4092045 4154080
14064 4154080 3794858 3936625 4209983 3857212 4020547 4220811 4011320 3829571 3950113
14055 3950113 3956459 4045277 3873115 3381097 3416297 3448576 3513990 3324480 3510191 3381349
14045 3381349 3070292 3035855 3166602 3080829 3188248 3048149 3379514 3187378 3249711 2991432
$$ packed form
14114F892569o7289k68813K92581l03344p8514k84419M80962n05402o7978j18371
14104E971982p1459K06701k83425M05080m00653J05858j17546n48474L22803j13472
14094E477395N6795p1543m9133J73815l27320m14723M48027N6794m68001k33766
14084D648340K66937k64341K82374l60357q1975k4743J29460k68966q2479M3857
14074D288107J50169l05050K42511J22416l28133j33496J65770L8554j48803O2035
14064D154080l59222J41767K73358l52771J63335K00264k09491j81749J20542
14055C950113O346Q8818j72162m92018L5200L2279O5414j89510J85711j28842
14045C381349l11057l4437J30747q5773J07419j40099L31365j92136O2333k58279
$$ plain form
14035 2991432 2952675 2991432 2990329 3064518 3110516 2978916 3215060 2853256 2890498 2952978 2576882
14024 2576882 2691829 2686814 2790299 2768857 2495712 2676180 2154910 2515507 2679989 2425638
14014 2425638 2509787 2357586 2348543 2170024 2176167 2508892 2253370 2165674 2421966 1999489
14004 1999489 1964719 1892313 2337137 2413081 2047105 2152616 1887162 1956112 2176663 2209023
13994 2209023 1793494 2209478 2573260 2766451 3197475 4950740 8276950 15241716 32171246
13985 32171246 43981738 23833338 11860813 6698367 5030844 4077978 3774504 3542873
13977 3542873 3141631 2984305 2992205 2877999 2320612 2135467 2546950 2304224 2463552 2236593
13967 2236593 2578083 2286442 2380088 2184517 2259122 2167435 2164911 2255382 1799665 2116494
$$ packed form
14035B991432l8757L8757j103P4189M5998j31600K36144l61804L7242O2480l76096
14024B576882J14947n015J03485k1442k73145J80468n21270L60597J64482k54351
14014B425638Q4149j52201r043j78519O143L32725k55522q7696K56292m22477
14004A999489l4770p2406M44824P5944l65976J05511k65454O8950K20551L2360
13994B209023m15529M15984L63782J93191M31024J753265L326210O964766J6929530
13985C2171246J1810492k0148400A1860813n162446j667523r52866l03474k31631
13977C542873m01242j57326P900j14206n57387j85145M11483k42726J59328k26959
13967B236593L41490k91641R3646j95571P4605r1687k524R0471m55717L16829
$$ plain form
13957 2116494 1905500 2077786 1710298 1887635 2087719 2164522 1826753 1985499 1562516 2022389
13947 2022389 1872405 1913538 1829287 1857491 1371524 1892769 1731076 1729528 1714888 1689774 1716117
13936 1716117 1409977 1522921 1752125 1635493 1384259 1387537 1846829 1397538 1738107 1604919
13926 1604919 1646024 1577071 1569002 1724552 1573490 1490094 1495125 1331054 1265921 1748026 1545890
13915 1545890 1664363 1409694 1704076 1292776 1505761 1290883 1402189 1181547 1208336 1148857
13905 1148857 1046164 1295589 1026169 1533780 1399945 1329653 1285792 1034649 1172683 1326456
13895 1326456 1340251 1207228 1236016 1071327 1100085 1189572 1142389 1323508 963992 1142277
13885 1142277 1042692 1137430 879674 1194911 1405630 1115264 970924 1127608 1144176 1144940
$$ packed form
13957B116494k10994J72286l67488J77337K00084P6803l37769J58746m22983M59873
13947B022389j49984M1133q4251K8204m85967N21245j61693j548j4640k5114K6343
13936A716117l06140J12944K29204j16632k51234L278M59292m49291L40569j33188
13926A604919M1105o8953q069J55550j51062q3396N031j64071o5133M82105k02136
13915A545890J18473k54669K94382m11300K12985k14878J11306k20642K6789n9479
13905A148857j02693K49425k69420N07611j33835p0292m3861k51143J38034J53773
13895A326456J3795j33023K8788j64689K8758Q9487m7183J81119l59516J78285
13885A142277r9585R4738k57756L15237K10719k90366j44340J56684J6568P64
$$ plain form
13875 1144940 1080718 1121644 1117842 1047444 1019877 1006438 1071622 1069816 1181251 1157125 931702
13864 931702 1045206 1087281 755729 1073294 1143470 1014812 1165392 968785 673702 1200913
13854 1200913 1056598 1089890 952425 1044648 1257394 880328 1031896 810577 979583 983748
13844 983748 790092 532167 671857 891048 1115577 889608 1041648 1018011 885944 1099461
13834 1099461 1288048 1068150 844394 1073237 1213670 948353 1094936 977839 1236512
13825 1236512 795068 1013651 738192 634386 831917 951592 1023403 709693 674682 720520
13815 720520 769340 768556 996196 797622 721293 646467 1123257 668341 924049 986095 500277
13804 500277 920560 655555 1113832 987559 974876 677382 861586 740735 693886 678031
$$ packed form
13875A144940o4222M0926l802p0398k7567j3439O5184j806J11435k4126k25423
13864I31702J13504M2075l31552L17565P0176j28658J50580j96607k95083N27211
13854A200913j44315L3292j37465R2223K12746l77066J51568k21319J69006M165
13844I83748j93656k57925J39690K19191K24529k25969J52040k3637j32067K13517
13834A099461J88587k19898k23756K28843J40433k65317J46583j17097K58673
13825A236512m41444K18583k75459j03806J97531J19675P1811l13710l5011M5838
13815G20520M8820p84K27640j98574p6329p4826M76790m54916K55708O2046m85818
13804E00277M20283k65005M58277j26273j2683k97494J84204j20851m6849j5855
$$ plain form
13794 678031 748859 714955 585754 530718 546163 1018307 651423 678496 804704 715200 667547
13783 667547 1007645 556341 533616 586396 583820 666189 744114 1182783 885732 834550 689092
13772 689092 724150 432364 637679 532268 721584 675678 865700 414076 600567 550094
13762 550094 699429 849070 765068 461239 501696 480112 492903 550525 786954 630092
13752 630092 805002 612478 619278 581757 565231 520050 779598 467602 541194 518760 353555
13741 353555 420386 279974 530865 740842 500164 638376 642702 495717 828603 822521
13731 822521 421979 575863 652977 729442 245822 395921 797925 403947 602627 736751
13721 736751 500598 486241 723050 624014 611962 639724 500434 364331 693853 711969
$$ packed form
13794F78031P0828l3904j29201n5036J5445M72144l66884K7073J26208q9504m7653
13783F67547L40098m51304k2725N2780k576Q2369P7925M38669k97051n1182j45458
13772F89092L5058k91786K05315j05411J89316m5906J90022D14076J86491n0473
13762E50094J49335J49641q4002l03829M0457k1584J2791N7622K36429j56862
13752F30092J74910j92524O800l7521j6526m5181K59548l11996P3592k2434j65205
13741C53555O6831j40412K50891K09977k40678J38212M326j46985L32886o082
13731H22521m00542J53884P7114P6465B45822J50099M02004l93978J98680J34124
13721G36751k36153j4357K36809r9036j2052K7762j39290j36103L29522J8116
$$ plain form
13711 711969 521101 615922 484468 706997 440373 504302 345211 416093 603335 410843
13701 410843 546725 238682 587033 589837 611327 545372 485488 298616 560457 573495 902333
13690 902333 158968 616514 681082 247036 360017 605164 630758 617886 682968 542222
13680 542222 310631 379639 420237 460231 297506 223308 793779 480373 688213 523497
13670 523497 45954 105202 435471 411097 375481 272357 360804 664775 276229 465045
13660 465045 515949 452718 339403 531551 509591 321650 343597 442473 377059 465636 598354
13649 598354 535715 230871 186790 278703 845084 364010 739258 522594 27891 423127
13639 423127 468418 333052 182927 722954 250982 456913 176549 571698 473063 579839
$$ packed form
13711G11969j90868R4821j31454K22529k66624O3929j59091P0882J87242j92492
13701D10843J35882B38682L48351K804K1490o5955n9884j86872K61841J3038L28838
13690I02333A58968M57546O4568B47036J12981K45147K5594j2872O5082j40746
13680E42222k31591O9008M0598L9994j62725p4198N70471l13406K07840j64716
13670E23497D5954N9248L30269k4374l5616j03124Q8447L03971B76229J88816
13660D65045N0904o3231j13315J92148k1960j87941K1947R8876o5414Q8577J32718
13649E98354o2639B30871m4081R1913N66381C64010L75248k16664B7891L95236
13639D23127M5291j35366j50125N40027B50982K05931A76549L95149r8635J06776
$$ plain form
13629 579839 446630 568841 335184 373949 641549 163987 276736 265120 548272 500499
13619 500499 319795 278439 112251 341412 520149 402522 556200 375008 590536 628710
13609 628710 532667 510488 242591 707862 672485 245217 649098 250795 172076 499231
13599 499231 359424 396535 443239 224463 391291 246561 464959 241971 365034 124167
13588 363259 463707 327714 667366 244474 338933 565725 342395 127746 495093 384119
13578 384119 432989 214336 572040 354216 338993 164586 525666 242343 266959 177709
13568 177709 237876 350680 456485 241127 324585 118081 531814 280682 375315 325159
13558 325159 222790 310591 212070 171410 342344 386630 81395 546193 177412 374439
$$ packed form
13629E79839j33209J22211k33657L8765K67600A63987J12749j1616K83152m7773
13619E00499j80704m1356A12251K29161J78737j17627J53678j81192K15528L8174
13609F28710r6043k2179B42591M65271l5377B45217M03881B50795p8719L27155
13599D99231j39807L7111M6704k18776J66828j44730K18398k22988J23063A24167
13588C63259J00448j35993L39652B44474R4459K26792k23330A27746L67347j10974
13578C84119M8870B14336L57704k17824j5223A64586L61080B42343K4616q9250
13568A77709O0167J12804J05805k15358Q3458A18081M13733k51132R4633n0156
13558C25159j02369Q7801r8521m0660J70934M4286H1395M64798A77412J97027
$$ plain form
13548 374439 258411 276229 445623 469246 -81020 467633 409575 211883 404890 302200
13538 302200 330010 479712 420423 -60399 494834 212487 121587 256793 375780 408225
13528 408225 201885 286420 398431 299840 127293 158097 244160 180938 364202 431307 357831
13517 357831 -143977 381521 273053 117323 372544 471780 289530 223015 449547 348805
13507 348805 226270 48497 233609 230114 159594 -42276 455245 346766 292456 384842 183537
13495 79058 234411 250441 315084 227166 182045 259728 402670 467280 141849 404470 617505
13484 617505 467065 409093 138444 223665 404032 -12475 89269 528476 371247 180994
13473 260354 413864 2817 208231 200513 538629 285529 228077 453844 127340 370433
$$ packed form
13548C74439j16028J7818J69394K3623h1020D67633n8058j97692J93007j02690
13538C02200K7810J49702n9289f0399D94834B12487r0900J35206J18987L2445
13528D08225B01885Q4535J12011r8591A27293L0804Q6063o3222J83264O7105p3476
13517C57831a43977C81521j08468A17323K55221R9236j82250o6515K26532j00742
13507C48805j22535D8497J85112l495p0520d2276D55245j08479n4310R2386A83537
13495G9058J55353J6030O4643q7918m5121P7683J42942O4610A41849K62621K13035
13484F17505j50440n7972A38444Q5221J80367a2475H9269M39207j57229A80994
13473B60354J53510B817K05414p718L38116k53100n7452K25767A27340K43093
$$ plain form
13463 370433 155182 -76424 183056 6532 156167 337218 316714 300425 271548 185306 -39175
13451 1582 318128 432553 47320 331934 115222 356985 196382 284617 135106 146526
13441 146526 244731 292262 253619 -86239 222960 231734 162849 56973 50309 143864 313928
13430 313928 -38842 210216 129125 -160123 340277 71722 375418 189974 77392 633622
13420 633622 309983 186271 357315 216643 202007 448608 33362 320936 315901 291275
13410 291275 267800 347409 156857 47051 99805 149704 234503 424434 347372 160824 51046
13398 163929 18825 -198922 -38688 150321 236246 208185 148766 639602 248701 188978 297036
13387 297036 418815 526059 194757 387554 194868 105790 76129 374197 238368 245919
$$ packed form
13463C70433A55182g6424A83056F532J49635J81051k0504j6289k8877q6242c9175
13451A582L16546J14425D7320K84614A15222K41763j60603Q8235A35106J1420
13441A46526R8205M7531l8643h6239B22960Q774o8885E6973o664R3555J70064
13430C13928c8842B10216q1091a60123C40277G1722L03696j85444G7392N56230
13420F33622C09983j23712J71044j40672j4636K46601C3362K87574n035k4626
13410B91275k3475P9609A56857D7051N2754M9899Q4799J89931p7062A60824E1046
13398A63929A8825a98922c8688A50321Q5925k8061n9419M90836B48701n9723J08058
13387B97036J21779J07244A94757J92797j92686q9078k9661K98068j35829P551
$$ plain form
13377 245919 183504 75130 196292 108569 -44646 313910 136411 109794 71213 377753 318418
13366 318418 320102 36879 165715 590802 186226 70054 445411 263603 143472 397892
13356 397892 332051 198316 269908 424386 169441 157235 14788 36591 204493 -99812 266380
13344 16492 26530 168743 -34883 12463 207589 92313 415356 81616 155240 -211494 4297
13332 43704 379337 313829 379177 313949 158517 317922 -120928 331047 117662 389476
13322 389476 109511 129961 653489 126994 226177 300251 308005 383311 88063 247280 206823
13311 206823 204014 240596 215400 509097 135834 114177 224565 -229422 106509 204359 267362
13300 267362 -133560 69533 334677 137407 -119939 -84915 -3378 142741 45269 66503 -249388
$$ packed form
13377B45919o2415G5130J21162q7723d4646C13910A36411k6617l8581L06540n9335
13366C18418J684C6879J28836M25087A86226G0054L75357j81808j20131K54420
13356C97892o5841j33735P1592J54478A69441j2206A4788K1803J67902i9812B66380
13344A6492J0038J42213c4883A2463J95126I2313L23043H1616P3624b11494D297
13332D3704L35633o5508O5348o5228j55432J59405a20928C31047A17662K71814
13322C89476A09511K0450N23528A26994R9183P4074P754P5306H8063J59217m0457
13311B06823k809L6582k5196K93697A35834k1657J10388b29422A06509R7850O3003
13300B67362a33560F9533K65144A37407a19939L5024c378A42741D5269K1234b49388
$$ plain form
13288 231270 -90338 195518 145473 124539 -807 415972 322492 222384 10779 96320 612639
13277 612639 261660 300863 -182680 -162280 320855 201709 197377 -49638 958 70713 -208100
13265 53104 -1242 39137 -53027 80026 -61081 -179820 -262801 134874 180877 200769 33852
13253 -176519 189195 35054 130063 480154 101336 -56740 173780 227618 -244560 150618
13242 143819 -109397 67035 -59851 58174 69833 264261 140748 23737 197610 -198815
13231 374880 160422 176049 96336 190906 -120872 220729 165204 25183 178771 215505 1129
13219 51588 -73871 -159427 -6598 289359 409289 65270 147850 -36610 259860 49572 161061
13208 161061 194109 350738 -329119 210867 161895 18084 232681 60959 -86137 402804
$$ packed form
13288B31270i0338A95518n0045k0934h07D15972r3480j00108A0779Q5541N16319
13277F12639B61660L9203a82680K0400C20855j19146m332d9638I58O9755b08100
13265E3104a242C9137e3027H0026f1081j18739q2981A34874M6003J9892C3852
13253a76519A89195C5054R5009L50091A01336e6740A73780N3838b44560A50618
13242A43819a09397F7035e9851E8174J1659J94428j23513B3737J73873a98815
13231C74880A60422J5627p9713R4570a20872B20729n5525B5183J53588L6734A129
13219E1588g3871q5556f598B89359J19930F5270Q2580c6610B59860D9572J11489
13208A61061L3048J56629c29119B10867m8972A8084K14597F0959h6137D02804
$$ plain form
13197 105862 485558 116515 -86813 135642 -246043 247704 141766 43687 60464 41393
13187 41393 17919 -31738 168563 173141 241807 -120139 236412 193234 75329 337462 -139885
13175 -80624 82699 114450 -365427 -74170 507092 -273981 337817 247568 275558 58068 227711
13164 227711 122188 -245332 70258 21742 -145482 75192 283510 326383 37990 546160
13154 546160 -13593 252048 -159083 -163686 398720 54345 -296420 -140770 -55060 108852
13143 154085 -136679 -18343 132486 -24155 370658 305331 -100219 -198160 288121 11144
13132 23085 162846 103661 31016 123672 -91485 9283 145696 247772 46026 -90931 396378
13120 352108 92562 380955 84235 118122 591467 392074 214938 214982 354414 209034 50554
$$ packed form
13197A05862L79696A16515h6813A35642b46043B47704j05938D3687J6777j9071
13187D1393A7919c1738A68563M578O8666a20139B36412m3178G5329K62133a39885
13175h0624H2699L1751c65427g4170E07092b73981C37817r0249K7990E8068J69643
13164B27711j05523b45332G0258B1742a45482G5192K08318M2873C7990N08170
13154E46160a3593B52048a59083m603C98720E4345b96420a40770e5060A08852
13143A54085a36679a8343A32486b4155C70658o5327a00219r7941B88121A1144
13132B3085J39761n9185C1016R2656i1485I283J36413J02076D6026i0931C96378
13120C52108I2562K88393H4235L3887M73345j99393j77136M4J39432j45380E0554
$$ plain form
13108 -410709 224282 -196126 294439 63856 -59090 -115554 -174272 245116 -145322 13777
13097 -32967 127476 380581 135130 165888 236866 -67490 217919 349562 -150892 90534
13086 151707 -48763 157697 -197705 349896 40054 -242456 -98773 129425 82178 191101
13076 191101 159852 -1822 -26269 273473 -115328 329092 115943 216836 33509 81918 56470
13065 56470 427291 376536 198588 398667 150380 -146195 83355 113632 41942 141697 -83984
13053 -115729 97724 240057 -11421 215764 -252050 3782 123693 202026 56547 145588 -188854
13041 -70605 110034 -76979 -266392 306066 41529 40496 -83244 -54109 457893 106372 -75956
13029 76664 103650 159695 -33095 514093 57981 -114778 13372 172951 448337 160221 -17709
$$ packed form
13108d10709B24282a96126B94439F3856e9090n6464n8718B45116a45322A3777
13097c2967A27476K53105A35130L0758P0978f7490B17919J31643a50892I0534
13086A51707d8763A57697a97705C49896D0054b42456i8773A29425m7247J08923
13076A91101l1249a822k4447B73473a15328C29092A15943J00893C3509M8409k5448
13065E6470L70821n0755j77948K00079A50380a46195H3355L0277D1942R9755h3984
13053a15729I7724J42333a1421B15764b52050C782J19911P8333E6547Q9041a88854
13041g0605A10034g6979j89413C06066D1529j033h3244K9135D57893A06372g5956
13029G6664K6986N6045c3095E14093E7981a14778A3372J59579K75386A60221a7709
$$ plain form
13017 243562 146561 219941 291344 -3566 386763 237051 214552 94627 201964 250053 196610
13006 196610 206728 147623 127744 25167 4401 148988 8392 -69246 205994 503700 -95283
12994 204485 343482 -235697 -229559 -237830 137646 224042 176245 -200384 379799 113424 255534
12983 255534 103554 18067 183873 47717 360631 334912 -89443 130494 -197704 -90131
12972 33721 328018 76104 -10130 121867 -429064 204222 94739 -276236 62823 43930 -290068
12960 165636 -56335 -260534 -61798 -71853 453189 143687 255161 292426 54476 387075
12950 387075 200042 174274 27050 -11858 147904 -58610 -35625 -221624 380014 -103440
12939 7722 -19590 -139477 -206795 -153692 385846 -22007 -187888 -232028 -143559 -125424 31772
$$ packed form
13017B43562r7001P3380P1403c566C86763j49712k2499I4627J07337M8089n3443
13006A96610J0118n9105j9879B5167D401J44587H392f9246B05994K97706i5283
12994B04485J38997b35697O138q271A37646Q6396m7797b00384C79799A13424J42110
12983B55534A03554A8067J65806D7717L12914k5719h9443A30494a97704i0131
12972C3721K94297G6104a0130A21867d29064B04222I4739b76236F2823j8893b90068
12960A65636e6335k04199f1798j0055D53189A43687J11474L7265E4476L32599
12950C87075j87033k5768B7050a1858A47904e8610K2985j85999C80014a03440
12939G722a9590j19887o7318N3103C85846b2007j65881m4140Q8469J8135C1772
$$ plain form
12927 88281 58909 28375 -94967 -172500 81793 59266 152934 230308 461528 297139 -60599
12915 168871 50170 -88994 -33591 -87584 100670 -86873 -3947 187295 -14218 102334 -423084
12903 258588 -192632 -56125 -2776 173649 366410 115262 121747 -121615 78591 273226 190137
12892 190137 -134150 9994 299460 -183116 358578 -163598 84714 -153631 -25343 -6534 51303
12880 128043 21809 78680 63389 116423 147976 8192 97282 -169152 -191446 138173 146793
12869 146793 -98036 2918 58981 -82337 85177 -127051 -82586 237022 141055 187434 146484
12858 146484 -292048 -5886 -175580 181790 -174178 45037 -79446 28224 -110657 10332 -77757
12846 161618 55865 182975 122653 -140814 135723 -37738 105944 30650 -59289 205862
$$ packed form
12927H8281k9372B8375i4967p7533H1793k2527R3668P7374K31220j64389f0599
12915A68871E0170h8994c3591n3993A00670h6873c947A87295a4218A02334d23084
12903B58588a92632e6125b776A73649J92761A15262O485a21615G8591J94635q3089
12892A90137a34150I994K89466a83116C58578a63598H4714a53631b5343f534E1303
12880A28043B1809N6871j5291N3034L1553H192Q9090a69152k2294A38173Q620
12869A46793i8036B918N6063h2337H5177a27051M4465B37022r5967M6379m0950
12858A46484b92048e886j69694A81790a74178D5037g9446B8224a10657A0332g7757
12846A61618E5865J27110o0322a40814A35723c7738A05944C0650e9289B05862
$$ plain form
12835 -327241 -253906 61159 25199 276782 -77058 -5354 129249 -52614 171490 -148816 52495
12823 -152534 -161190 208980 -162891 198697 -277161 -82606 -125154 87927 242292 238233 -14929
12811 245666 136071 -76604 -163713 61411 -19708 158695 218727 -94754 -102916 176785 89361
12800 89361 274814 -303659 -221078 350808 -15296 54324 154849 120797 -146374 -76541 -21565
12788 336282 211768 127158 -166001 28489 45761 -17217 50832 86638 -69914 -76026 -76615 -125332
12776 -125332 -283347 -204615 201447 117557 136958 -62387 -124682 16373 -5509 -102603 97333
12764 -154413 -72697 57895 371027 -1221 -20447 113152 59876 -66642 21597 -27892 -14617
12753 -14617 81819 174957 107391 430456 -183627 26064 -59523 275823 -83101 92583 5399
$$ packed form
12835c27241P3335F1159B5199K51583g7058e354A29249e2614A71490a48816E2495
12823a52534q656B08980a62891A98697b77161h2606m2548H7927J54365m059a4929
12811B45666j09595g6604q7109F1411a9708A58695O0032i4754q162A76785q7424
12800H9361J85453c03659Q2581C50808a5296E4324J00525l4052a46374O9833b1565
12788C36282j24514q4610a66001B8489J7272a7217E0832L5806f9914o112n89m8717
12776a25332j58015P8732B01447q3890J9401f2387o2295A6373e509r7094I7333
12764a54413g2697E7895L13132a221j9226A13152n3276f6642B1597b7892J3275
12753a4617H1819R3138o7566L23065a83627B6064e9523B75823h3101I2583E399
$$ plain form
12741 14518 -85763 205657 11125 271681 -51415 -113525 223111 -149355 -54809 102635 -146560
12729 142839 75933 51995 -156833 403855 -89115 -21569 160673 -319827 36584 17305 -136460
12717 -154305 -125601 253737 19154 -188610 -47665 201131 305894 134890 172852 -146708
12706 702255 340129 261753 355305 279440 185727 495466 245435 330079 57463 138731 155728
12695 155728 -156938 -88084 -124418 -113065 -288908 -71052 97126 176549 -236765 190817 134773
12684 134773 -125318 215024 -187992 -86856 94154 240444 159021 211893 5636 88870 269689
12673 269689 -60894 -18127 248113 -225376 -128283 -11624 -3804 -139700 -20763 -56500 323269
12661 83156 179220 -274039 282663 -73732 371649 -27755 280230 375595 202016 -125810
$$ packed form
12741A4518h5763B05657A1125K60556e1415o2110B23111a49355e4809A02635a46560
12729A42839o6906k3938a56833D03855h9115b1569A60673c19827C6584A7305a36460
12717a54305K8704B53737A9154a88610d7665B01131J04763A34890L7962a46708
12706G02255C40129p8376R3552p5865r3713L09739B45435Q4644E7463Q1268J6997
12695A55728a56938O8854l6334J1353j75843g1052I7126P9423b36765A90817n6044
12684A34773a25318B15024a87992h6856I4154J46290q1423N2872E636Q3234J80819
12673B69689f0894a8127B48113b25376R7093a1624c804j35896b0763l5737C23269
12661H3156R6064b74039B82663g3732C71649b7755B80230R5365j73579a25810
$$ plain form
12650 216846 315699 -95114 -81771 91741 67869 398750 303365 -72877 30701 70189 -189622
12638 147096 23010 94820 92890 -46019 -171380 -285336 388568 -74466 143217 404598 153404
12626 436707 -99451 191321 88217 315605 -18885 203719 153518 164376 112688 255535 12182
12614 -72878 194662 -39616 -21747 281340 33175 -114186 -25322 -358076 -181458 109457
12603 148548 104093 162692 346047 1781 35507 141190 25782 -139730 -25589 316637 153897
12591 69041 51568 40862 85802 -10164 -102593 124983 48351 325814 -380589 198517 129377
12580 129377 264834 259857 -268562 53872 -87054 -198644 -149385 10218 -162566 135660 338530
12569 338530 302014 -120654 -362953 -229753 -224089 5390 -53095 302613 -74803 -32547 -49561
$$ packed form
12650B16846R8853i5114J3343I1741k3872L30881r5385g2877C0701L9488a89622
12638A47096B3010P1810j930d6019j25361j13956C88568g4466A43217K61381A53404
12626D36707i9451A91321H8217K27388a8885B03719n0201J0858n1688J42847A2182
12614g2878A94662c9616J7869B81340C3175a14186b5322l32754J76618A09457
12603A48548m4455N8599J83355A781L3726J05683B5782a39730b5589C16637A53897
12591F9041j7473j0706M4940a0164r2429A24983D8351K77463c80589A98517o9140
12580A29377J35457m977b68562E3872h7054j11590M9259A0218a62566A35660K02870
12569C38530l6516a20654k42299J33200N664E390e3095C02613g4803c2547j7014
$$ plain form
12558 -49561 144023 230309 205166 62138 26881 -220778 25045 -26027 -178338 15145 282094
12547 282094 -143446 -214916 -552014 369101 16640 -15816 152344 92199 238876 293088
12537 293088 -71114 -85953 94131 -80780 -39406 41226 104510 10458 -155391 -47277 -194554
12526 -194554 89025 -91159 72102 -249058 35311 215844 -154552 -2438 -134957 208435 -7967
12514 -30318 202560 353607 -88755 66927 -343744 391542 229284 119004 116389 -65653 154775
12502 109769 33822 21884 -118847 -18201 95309 24924 84884 166829 39614 -250447 242487
12490 -77516 52228 12828 -7182 132831 47566 240983 -305700 285292 125120 47246 31590
12479 31590 40963 276482 168417 86508 299079 75597 86942 18011 -162025 336718 237757
$$ packed form
12558d9561A44023Q6286k5143F2138B6881b20778B5045b6027j52311A5145K66949
12547B82094a43446p1470l37098C69101A6640a5816A52344o0145J46677N4212
12537B93088g1114j4839I4131h0780c9406D1226O3284A0458a55391d7277j47277
12526a94554H9025i1159G2102b49058C5311J80533a54552b438j32519B08435g967
12514c0318B02560J51047h8755F6927c43744C91542j62258j10280k615f5653A54775
12502A09769C3822j1938a18847a8201I5309B4924N9960Q1945C9614b50447B42487
12490g7516E2228A2828g182A32831D7566J93417c05700B85292A25120D7246j5656
12479C1590R373K35519j08065q1909K12571G5597J1345A8011a62025C36718r8961
$$ plain form
12468 237757 187643 -428548 -84311 -170367 -268227 -64618 51418 132040 43492 -159714 -38351
12456 229162 137772 -237422 -253843 264645 16946 278697 -30158 159574 -50499 -235128
12446 -235128 -94441 225989 -302882 223015 -107902 177067 3809 -190544 -68637 -15707
12435 -45767 204658 -59619 -91188 -110356 -204091 29250 101097 252192 228773 -51048 -7008
12423 -273753 -150397 72538 -431478 67926 -330341 85073 -224350 -9161 -163711 201807
12412 -120956 -428893 -113005 -168036 8531 -122930 -90959 187048 25573 -22577 -65251 176744
12400 101108 -266471 -460922 117652 -301010 -109919 132740 -225184 34274 -64585 -136201
12390 -136201 -41618 276509 15446 -8287 -30718 -105510 255104 55505 -15328 66658 -169284
$$ packed form
12468B37757n0114d28548h4311q6056r7860f4618E1418Q0622D3492a59714c8351
12456B29162r1390b37422j6421B64645A6946K61751c0158A59574e0499j84629
12446b35128i4441B25989c02882B23015a07902A77067C809a90544f8637a5707
12435d5767B04658e9619l1569j9168r3735B9250P1847J51095k3419e1048g008
12423b73753J23356G2538d31478F7926c30341H5073b24350i161j54550B01807
12412a20956l07937a13005n5031H531a22930L1971A87048B5573b2577m2674A76744
12400A01108b66471j94451A17652c01010a09919A32740b25184C4274f4585p1616
12390a36201d1618B76509A5446h287k2431p4792B55104E5505a5328F6658a69284
$$ plain form
12378 73096 96103 261533 -36753 -177882 267784 -264642 -106126 -86109 380470 281844
12368 281844 -130158 371149 92225 -210941 92794 129353 -107234 278347 101031 -304652
12357 31778 24930 25295 62793 174080 -107 -59479 125091 181435 126526 -74233 -105711 -133754
12345 -133754 137033 91131 -57664 361380 229289 106704 -367676 -109137 178787 93978
12335 93978 -75046 -80839 159792 270188 315391 121377 -325839 -17340 429338 -322489 -77727
12323 6696 141178 -228744 105282 23945 173370 53786 147747 -46365 142300 -54635 -68075
12312 -68075 -174255 -78386 166552 3493 -237242 65338 -268345 -165619 122079 -173358
12301 -245160 391046 326692 -154919 52087 175983 -101866 85541 1717 117932 -64639 188110
$$ packed form
12378G3096K3007J65430c6753j41129B67784b64642a06126K0017C80470r8626
12368B81844a30158C71149I2225b10941I2794L6559a07234B78347A01031c04652
12357C1778o848L65L7498J11287a07n9372A25091N6344n4909g4233l1478k8043
12345a33754A37033m5902e7664C61380j32091A06704c67676a09137A78787q4809
12335I3978g5046n793A59792J10396M5203A21377c25839a7340D29338c22489g7727
12323F696J34482b28744A05282B3945J49425E3786R3961d6365A42300e4635j3440
12312f8075j06180g8386A66552C493b37242F5338b68345J02726A22079a73358
12301b45160C91046o4354a54919E2087J23896a01866H5541A717J16215f4639A88110
$$ plain form
12289 -1057 35953 117856 120822 -44393 124025 187685 213022 16144 208972 -366768 178465
12277 322968 398855 136644 13376 165369 -20660 495630 175453 107336 476613 -25611
12266 200094 77519 42028 166819 192618 172683 131782 99663 134774 -33387 250381 -201912
12254 -160647 204643 -13557 73924 152061 186754 134992 -62032 217211 422078 228458 62686
12242 164866 23679 74245 372732 143524 -139954 132912 13435 290278 253151 -369190
12231 39186 300224 183567 106451 -118072 -108372 270865 218795 116604 343584 108691
12220 57948 199614 -98390 110924 433699 259310 205419 374847 74706 45160 95370 143049
12209 143049 165231 401464 -14186 23194 271742 -214079 257248 64099 311939 322145
$$ packed form
12289a057C5953Q1903K966d4393A24025O3660K5337A6144J92828c66768A78465
12277C22968P5887A36644A3376J51993b0660D95630A75453o8117L69277b5611
12266B00094G7519l5491J24791K5799j9935m0901l2119L5111c3387B50381b01912
12254a60647B04643a3557G3924P8137L4693n1762f2032B17211K04867j93620F2686
12242A64866B3679N0566K98487A43524a39954A32912A3435K76843l7127c69190
12231C9186K61038j16657p7116a18072R700B70865n2070j02191K26980A08691
12220E7948J41666i8390A10924L22775j74389n3891J69428G4706k9546N0210M7679
12209A43049K2182K36233a4186B3194K48548b14079B57248F4099K47840J0206
$$ plain form
12199 322145 479551 230381 4371 23129 35776 278670 80575 148664 277699 401127 54413
12187 -185120 -205055 77322 -3079 172350 320361 238840 -129128 148775 50526 283078 92304
12175 215850 59576 138840 119383 47459 93964 365233 176546 136384 270681 101677 515541
12164 515541 -84231 -7189 143455 96023 73515 -4631 -115280 101123 -10109 -56055 160062
12152 253448 121915 -974 389375 460892 305286 140590 343261 198948 -264731 -119220
12141 53648 -45657 492652 38960 -45985 26145 104626 29820 -8332 89129 20109 -45074 34251
12128 -17355 252317 -80323 -364170 296997 319729 124876 -215213 -79652 -40579 -62324 162706
12116 -236615 198535 -74214 -158148 -69787 -144424 -134244 158503 225438 -9559 118622 -212536
$$ packed form
12199C22145J57406B30381D371J8758J2647K42894H0575O8089J29035J23428E4413
12187a85120j9935G7322c079A72350J48011q1521a29128A48775E0526K32552I2304
12175B15850E9576P9264j9457D7459M6505K71269A76546m0162J34297A01677M13864
12164E15541h4231g189A43455m7432k2508d631j10649A01123a0109m5946A60062
12152B53448A21915i74C89375P1517j55606A40590K02671j44313b64731a19220
12141E3648d5657D92652C8960d5985B6145P8481B9820h332H9129B0109d5074C4251
12128a7355B52317h0323k83847B96997K2732A24876b15213g9652L9073k1745A62706
12116b36615A98535g4214q3934f9787p4637J0180A58503O6935i559A18622b12536
$$ plain form
12104 206352 -242503 4177 302208 -40562 11428 55444 -137670 -129435 -208723 65167 244377
12093 244377 -256170 172835 76183 131541 118402 -138621 -126429 5318 231316 93979 -53082
12081 -104257 -199029 -163678 190413 301104 231437 803272 1678798 2376602 799836 468969
12071 468969 97313 400514 -30004 4584 -140193 -184491 62014 -59689 78601 -139956 -197880
12060 -197880 82256 -114142 224897 146668 144165 188075 -281617 -269489 -57633 -202259 6667
12048 -50012 97758 -31896 -21603 5814 65683 117437 252615 155804 92734 -126525 -396066
12037 -396066 9128 -162085 413985 -46705 -114673 63176 -211776 104099 -84986 45941 -213958
12025 49352 -34361 43428 55819 138127 659293 94354 -157950 -364613 41878 36691 9523
$$ packed form
12104B06352b42503D177K98031d0562A1428M4016a37670Q235p9288F5167J79210
12093B44377b56170A72835G6183N5358j3139a38621J2192E318K25998I3979e3082
12081a04257r4772L5351A90413J10691o9667N71835Q75526O97804G99836l30867
12071D68969I7313L03201c0004D584a40193m4298F2014e9689G8601a39956n7924
12060a97880H2256a14142B24897p8229k503M3910b81617J2128e7633j44626F667
12048e0012I7758c1896J0293E814N9869N1754J35178r6811o3070a26525k69541
12037c96066I128a62085D13985d6705o7968F3176b11776A04099h4986D5941b13958
12025D9352c4361D3428J2391Q2308N21166I4354a57950k06663D1878n187I523
$$ plain form
12013 24942 104727 -381457 118792 -41393 204311 -321999 -3064 168987 68270 10029 -19744
12001 38379 42751 67131 127458 1143 -203553 40255 190857 43142 106860 117379 -341458
11989 45394 28778 -258175 -181972 -101068 172000 -113015 -261183 -88921 298482 163110
11979 163110 -258761 -39234 -344039 119136 -171952 88168 -158431 103627 -233373 9896
11968 143467 -8665 204131 -93136 -235741 156290 117938 -2781 166050 -53681 -176611 -205463
11957 -205463 188028 21162 -216283 -11720 182450 183942 -274288 -24549 -167449 93897 133411
11946 133411 139595 -305691 114596 -2062 -112088 85980 -256774 -199871 34390 133545 7567
11934 68709 98448 -236197 -77412 -97668 -120362 -114147 -116964 175402 127451 119426 -12170 -380693
$$ packed form
12013B4942P9785c81457A18792d1393B04311c21999c064A68987F8270A0029a9744
12001C8379M372K4380O0327A143b03553D0255J50602D3142O3718J0519c41458
11989D5394j6616b58175P6203Q0904A72000a13015j48168h8921B98482j35372
11979A63110b58761c9234l04805A19136a71952H8168a58431A03627b33373I896
11968A43467h665B04131i3136j42605A56290l8352b781A66050e3681j22930k8852
11957b05463A88028B1162b16283a1720A82450J492b74288b4549j42900I3897L9514
11946A33411O184c05691A14596b062j10026H5980b56774N6903C4390R9155G567
11934F8709K9739b36197g7412k0256k2694O215k817A75402m7951q025a2170l68523
$$ plain form
11922 -380693 100650 -60251 187827 -43353 36624 74900 -186970 114873 -170332 -222414
11912 -222414 149681 51505 131760 -50852 -263369 -163294 -85244 45094 -69051 180222 98750
11901 98750 -21913 112541 215985 105965 52248 231605 67732 -266224 38665 162553
11891 162553 -471133 230350 -9411 47413 -58437 42918 -109681 248406 -154705 6825 -283723
11879 -248400 -100999 93388 215559 65563 -201356 -296202 -38682 55484 -232847 -299554 -57757
11867 246259 -3103 -189286 -45521 316418 -45622 60591 -87817 -225023 -308539 -331636 78915
11855 48888 -21985 -74471 -125556 135739 33351 456817 261539 -135104 163795 -5226 -128875
11844 -128875 7177 7246 -56113 17373 -2074 -38231 202859 69248 55896 -1976 108519 -208166
$$ packed form
11922c80693A00650f0251A87827d3353C6624L8276a86970A14873a70332n2082
11912b22414A49681E1505Q0255e0852k12517J00075P8050D5094f9051A80222q1472
11901I8750b1913A12541J03444A05965E2248J79357F7732b66224C8665J23888
11891A62553d71133B30350i411D7413e8437D2918a09681B48406a54705F825b83723
11879b48400a00999I3388J22171F5563b01356r4846c8682E5484b32847o6707e7757
11867B46259c103j86183d5521C16418d5622F0591h7817j37206q3516k3097G8915
11855D8888b1985n2486n1085A35739C3351M23466j95278a35104A63795e226j23649
11844a28875G177O9e6113A7373b074l6157B02859F9248j3352a976A08519b08166
$$ plain form
11831 -84866 -177478 122047 270897 -277399 -77479 -128459 142666 -13561 -83367 -312577 154418
11819 16081 -50705 -81838 431003 -156945 163300 64186 50753 -181002 76790 365255 52232
11807 151871 -101703 -289615 7787 -368424 -131623 59219 -221699 3616 -99722 -27512 -57789
11796 -57789 8721 50212 42860 -132333 87963 200677 103402 320455 -88295 -18245 123201
11784 242661 5307 -92931 219430 -63184 119823 239883 25096 -220521 -281464 -178589 355888
11772 -84369 -24820 -104021 98577 -195413 65768 -108175 -262875 64017 -219556 -40959 -166361
11761 -166361 194468 22887 -315994 135883 -260759 -16423 -128905 130628 -136233 -250547
11751 -250547 70701 -140003 -197509 153602 122968 35205 1684 -6943 79822 -226035 -118450
$$ packed form
11831h4866r2612A22047J48850b77399g7479n0980A42666a3561o9806k29210A54418
11819A6081e0705l1133D31003a56945A63300F4186j3433a81002G6790K88465E2232
11807A51871a01703j87912G787c68424a31623E9219b21699C616i9722b7512l0277
11796e7789H721M1491p352a32333H7963J12714r7275K17053h8295a8245A23201
11784B42661E307i2931B19430f3184A19823J20060B5096b20521o0943J02875C55888
11772h4369b4820p9201I8577a95413F5768a08175j54700F4017b19556d0959j25402
11761a66361A94468B2887c15994A35883b60759a6423j12482A30628a36233j14314
11751b50547G0701a40003n7506A53602l0634C5205A684f943G9822b26035J07585
$$ plain form
11740 -118450 -13249 139824 -102480 460643 -92446 -242260 19392 397711 265823 -15959
11729 -12196 -54229 -80790 48540 -60429 90152 71419 -24539 -105354 17795 -307262 83280
11717 359869 -163288 -125841 -55387 12050 -127436 134021 2057 364356 54881 37072 -70400
11705 -58137 84411 51426 21160 19324 53802 -80533 39948 406721 134224 -167400 288644
11693 -61757 33511 -12632 305001 55712 181398 74903 92654 -137487 156435 -257177 201267
11681 -37358 -176022 -159690 -42780 226709 247044 41371 123754 -29131 -1230 -19338 302122
11669 -269776 -28709 7302 48477 155083 139129 79201 10150 196338 -127595 31431 205571
11658 205571 -76326 29371 116669 82420 -38976 -129113 206517 -35282 -97911 -231432 -195553
$$ packed form
11740a18450a3249A39824a02480D60643i2446j49814A9392L78319j31888a5959
11729a2196m2033k6561D8540f0429I0152j8733b4539q0815A7795c07262H3280
11717C59869a63288L7447e5387A2050a27436A34021B057L62299E4881j7809g0400
11705e8137H4411l2985B1160j836L4478h0533C9948L66773A34224a67400B88644
11693f1757C3511a2632C05001E5712J25686G4903J7751a37487A56435b57177B01267
11681c7358j38664J6332d2780B26709K0335D1371Q2383b9131a230j8108C02122
11669b69776b8709G302M1175J06606j5954n9928A0150J86188a27595C1431J74140
11658B05571g6326B9371Q7298l4249c8976r0137B06517c5282o2629j33521L5879
$$ plain form
11647 -195553 24241 98019 -61444 -124499 51470 124930 -1746 -83272 233039 -92463 63975
11635 115723 196859 -31810 182552 -101729 -108608 -259947 -175217 301281 -339005 18735 240108
11624 240108 -5255 391539 -55394 106033 -119705 244395 156310 -90454 171527 175342 221383
11613 221383 -51557 -214971 -178126 148917 22802 4311 284764 -2404 -89661 205474 -83278
11601 73300 75556 122824 -98224 -267486 56788 91336 65802 101911 -16451 2431 -141996 -21436
11588 60532 -99354 197620 -74792 162902 162145 65031 283795 95185 -65296 -8985 230329
11576 -146981 242860 -192300 81324 32899 -126813 -19023 92384 105943 124184 -55813 215186
11564 10164 -56319 368646 161238 294503 512104 -219858 158538 -75577 -167043 -108290
$$ packed form
11647a95553B4241P3778f1444o3055E1470P3460a746q1526B33039i2463F3975
11635A15723Q1136c1810A82552a01729o879j51339Q4730C01281c39005A8735K21373
11624B40108e255C91539e5394A06033a19705B44395q8085i0454A71527L815M6041
11613B21383e1557j63414L6845A48917B2802D311K80453b404q7257B05474h3278
11601G3300K256M7268i8224j69262E6788L4548k5534L6109a6451B431a41996b1436
11588F0532i9354A97620g4792A62902p57F5031K18764I5185f5296h985B30329
11576a46981B42860a92300H1324C2899a26813a9023I2384J3559J8241e5813B15186
11564A0164e6319C68646A61238J33265K17601b19858A58538g5577r1466N8753
$$ plain form
11554 -108290 -42125 44010 -66630 43249 -225076 -24861 -72771 124490 249391 -54747 76557
11542 283413 -43221 98237 179353 54505 274703 20605 9232 -170260 -67648 -28284 137729
11530 7626 204748 109955 -282882 58326 321611 178633 -42778 -87677 411575 -105992 -8325
11518 223743 249701 -206997 -170648 -94034 314565 -221635 166853 156436 191523 228524 231226
11507 231226 97051 128261 553911 -18099 229078 366313 84979 -111871 -18816 4310 41795
11496 41795 -46425 143480 467483 33551 613739 178613 -87880 344278 207640 7315 -25634
11484 134837 124446 242521 175844 -17727 55354 61616 -155586 -37951 13456 -200935 132092
11472 238819 -44948 263798 345154 261378 31399 230949 189439 -21517 436038 -73320 66508
$$ packed form
11554a08290d2125D4010f6630D3249b25076b4861m7910A24490J24901e4747G6557
11542B83413d3221I8237Q1116E4505K20198B0605I232a70260f7648b8284A37729
11530G626J97122r4793b82882E8326K63285j42978d2778m4899D11575a05992h325
11518B23743K5958b06997L6349P6614C14565b21635A66853j0417L5087L7001K702
11507B31226I7051L1210M25650a8099B29078J37235H4979a11871a8816D310L7485
11496D1795d6425A43480L24003C3551N80188A78613h7880C44278j36638G315b5634
11484A34837j0391J18075o6677a7727E5354O262a55586c7951A3456b00935A32092
11472B38819d4948B63798Q1356q3776C1399J99550m1510b1517D36038g3320F6508
$$ plain form
11460 133725 51230 472395 -265727 239301 391207 12811 52028 179261 207633 409342
11450 409342 211678 -86744 292685 288927 -41107 110237 -118223 -31276 -4586 -387098 183483
11438 138451 185354 267142 -143277 238829 -89835 -11890 -122444 146735 6200 74904 -144938
11426 -61234 26074 17681 218328 30502 -17220 -107482 31575 -68068 103447 187137 -6308 -16830
11414 -16830 -17944 180544 -121865 -128766 144019 155180 17942 -25810 -129695 -27024 483072
11402 8779 35935 -129077 62930 -53645 -53711 428149 -64606 4681 148069 -199625 -96400 -190109
11390 -190109 -155484 137731 360853 166324 -138987 99442 -48250 -77654 146651 -70074
11379 -72260 20742 278433 -231449 48396 -245838 191697 20676 14628 -30519 -101736 130408
$$ packed form
11460A33725E1230M21165b65727B39301J51906A2811L9217J27233K8372K01709
11450D09342j97664h6744B92685l758d1107A10237a18223c1276d586l82512A83483
11438A38451M6903Q1788a43277B38829h9835a1890j10554A46735F200O8704a44938
11426f1234B6074q393K00647C0502a7220r0262C1575f8068A03447Q3690f308j0522
11414a6830j114A80544a21865o901A44019J1161A7942b5810j03885b7024D83072
11402H779K7156a29077F2930e3645o6D28149f4606D681J43388a99625i6400r3709
11390a90109L4625A37731K23122A66324a38987I9442d8250k9404A46651g0074
11379g2260B0742K57691b31449D8396b45838A91697B0676o048c0519p1217A30408
$$ plain form
11367 -68893 -98969 19966 -203010 95122 -98261 -152042 -135506 13327 -150492 -69343 -83457
11356 -83457 -245876 246840 -355497 47800 -244369 48832 -34174 -205256 -8897 -178041 -100360
11345 -100360 43935 -30698 -418213 -25927 32428 211412 119096 130385 119367 123891 -195120
11333 53445 220267 42261 -257153 95698 -361794 -64902 -100793 84216 -53162 -99126 -196851
11322 -196851 21167 52736 -100543 83870 -54118 43529 -75988 20576 -63461 -5565 -263978
11311 -263978 -216353 241461 -17433 -336569 -69109 148023 -228572 133909 -69301 -183111
11301 -183111 9284 34941 -171206 51780 354491 -225400 251331 133691 100381 -203771
11290 245846 86145 -113089 -229666 -171941 -398266 -41104 281782 69953 83093 -48465 46083
$$ packed form
11367f8893l0076A9966b03010I5122i8261n3781J6536A3327a50492f9343j4114
11356h3457j62419B46840c55497D7800b44369D8832c4174j71082h897j69144P7681
11345a00360D3935c0698l87515b5927C2428J78984r2316J1289j1018M524a95120
11333E3445J66822D2261b57153I5698c61794f4902l5891H4216e3162m5964r7725
11322a96851B1167L1569a00543H3870e4118D3529g5988B0576f3461e565k58413
11311b63978M7625B41461a7433l19136f9109A48023b28572A33909f9301j13810
11301a83111I284K5657a71206E1780L02711b25400B51331j17640l3310b03771
11290B45846H6145a13089j16577N7725k26325d1104B81782F9953J3140d8465D6083
$$ plain form
11278 15348 26838 44714 -349452 -157530 -238498 -61197 123324 -64390 -112282 35248 190351
11267 190351 221407 509 -82603 130965 -96436 -417055 39032 -126292 199253 174504 -214655
11255 -111891 153270 132364 -26520 -343631 -163598 -57752 -155417 399942 -180094 6363 -96335
11243 -419839 -248330 -15170 145370 9276 -250800 -3242 -129067 29107 139474 319248 -310064
11231 -63879 193580 -64825 71489 -35410 342075 175912 -151098 162300 -374139 105402
11220 -49038 30361 -152745 292927 -133120 -211038 85416 -2225 -323090 -163236 -141888 -77596
11209 -77596 -94597 175925 34915 -153663 -406965 -123874 12149 19749 362299 -80021 -55219
11198 -55219 41469 -28012 -68305 -171768 -40105 205516 83485 -15477 -1310 -384428 14384
$$ packed form
11278A5348J1490J7876c49452a57530q0968f1197A23324f4390m7892C5248J55103
11267A90351L1056E09h2603A30965i6436l20619C9032a26292A99253k4749b14655
11255a11891A53270k0906b6520l17111a63598e7752r7665C99942a80094F363i6335
11243d19839J71509a5170A45370I276b50800c242j25825B9107J10367J79774c10064
11231f3879A93580f4825G1489c5410C42075j66163a51098A62300c74139A05402
11220d9038C0361a52745B92927a33120p7918H5416b225l20865J59854K1348O4292
11209g7596j7001A75925C4915a53663k53302a23874A2149P600L42550h0021K4802
11198e5219D1469b8012m0293j03463d0105B05516H3485a5477a310l83118A4384
$$ plain form
11186 -4583 -165221 -247665 120477 5031 101454 73262 103889 -56184 -144655 -39021 22170 -230108
11173 -20482 38266 302103 64990 -101193 160447 -303081 -370503 51905 -186504 25897 -283908
11161 -91357 125228 1466 -239021 -8225 109088 -203427 -160368 62177 -151798 199038 -73485
11149 -23434 33864 257869 71793 -170669 189286 40314 -136463 151568 83757 -26448 -38959
11138 -38959 -80274 -115907 180525 -105614 -120590 124926 65346 344863 164820 327372
11128 327372 -100910 -25611 -75917 56798 -245703 -55118 383122 186518 550365 320797
11118 320797 249769 -183476 83777 -271826 -172247 132514 126354 -40119 247426 1694 143267
11107 143267 475540 122630 -73345 131198 346022 364690 135353 -19629 -21906 157361
$$ packed form
11186d583j60638q2444A20477E031R6423k8192L0627e6184q8471c9021B2170b30108
11173b0482C8266K63837F4990a01193A60447c03081o7422E1905a86504B5897b83908
11161i1357A25228A466b39021h225A09088b03427M3059F2177a51798A99038g3485
11149b3434C3864K24005G1793a70669A89286D0314a36463A51568o7811b6448j2511
11138c8959m1315l5633A80525a05614j4976A24926n9580K79517A64820J62552
11128C27372a00910b5611n0306E6798b45703e5118C83122A86518L63847k29568
11118C20797p1028a83476H3777b71826R9579A32514o160d0119B47426A694J41573
11107A43267L32273A22630g3345A31198K14824J8668A35353a9629k277A57361
$$ plain form
11096 119261 277290 139758 334311 -100195 134480 -121183 47192 184942 439156 179162
11085 90746 145000 -94341 -137706 -116030 20204 376296 302942 521636 233075 337655 196983
11074 196983 13923 220144 480371 458287 444241 198768 639787 382928 433059 287607
11064 287607 182151 507833 344452 487942 514641 273059 371227 149536 687989 423837
11054 423837 336900 593950 964013 737868 767622 532991 862475 847428 677701 915363
11044 915363 636419 684468 329723 570080 861313 683499 789810 618171 706029 363528
11034 363528 605169 468703 651415 307317 803131 673007 423756 733959 589432 724373
11024 724373 750203 830162 982906 334508 555239 560565 582940 433546 673808 481424
$$ packed form
11096A19261J58029j37532J94553a00195A34480a21183D7192J37750K54214A79162
11085I0746N4254i4341m3365K1676B0204L56092p3354K18694B33075J04580j40672
11074A96983A3923K06221K60227k2084j4046A98768M41019k56859N0131j45452
11064B87607j05456L25682j63381J43490K6699k41582R8168A49536N38453k64152
11054D23837q6937K57050L70063k26145K9754k34631L29484j5047j69727K37662
11044I15363k78944M8049C29723K40357K91233j77814J06311j71639Q7858l42501
11034C63528K41641j36466J82712C07317M95814j30124k49251L10203j44527J34941
11024G24373K5830P9959J52744C34508K20731N326K2375j49394K40262j92384
$$ plain form
11014 481424 732520 665422 629036 367767 757388 793747 426672 435750 926093 725463
11004 725463 313853 517935 658070 1048425 646147 1042019 848230 502058 596398 752550
10994 752550 952718 923275 439711 789611 589971 913027 983120 762474 1280238 907040
10984 907040 886056 1081750 972240 1018040 1313315 1255949 1383455 1483005 1889799 1755235
10974 1755235 1998897 2153499 2885347 2729293 2322732 2536914 2663253 2516144 2004179
10965 2004179 1725886 1998602 1584346 1764260 1803227 1198675 1584303 1608750 1713727 1979307
10955 1979307 1609972 1786348 1425441 1439640 1413789 993508 800599 496917 779546 474935
10945 474935 556563 141219 -17241 125154 275290 91553 338217 457519 463243 243289
$$ packed form
11014D81424K51096o7098l6386k61269L89621L6359l67075R078M90343k00630
11004G25463C13853K04082J40135L90355m02278L95872j93789l46172R4340J56152
10994G52550K00168k9443D39711L49900j99640L23056P0093k20646N17764l73198
10984I07040k0984J95694j09510M5800K95275n7366J27506R9550M06794j34564
10974A755235K43662J54602P31848j56054m06561K14182J26339j47109n11965
10965B004179k78293K72716m14256J79914L8967o04552L85628K4447J04977K65580
10955A979307l69335J76376l60907J4199k5851m20281j92909l03682K82629l04611
10945D74935Q1628A41219a7241A25154J50136I1553K46664J19302N724k19954
$$ plain form
10935 243289 350790 225509 261818 51218 -199681 -76907 349815 125920 189114 -22394
10924 78765 258803 -48430 -32580 -157481 160790 -306944 185683 204970 -43098 -62187 271835
10912 104616 173029 336959 -73745 -208928 -133521 217458 140057 -54320 -28957 86932 -172098
10900 -249794 -129388 440521 185194 42600 251863 -65516 -4580 -447814 -265275 160929
10889 -235041 -50035 165736 -19683 -100631 -88118 22467 55280 -54526 68428 110268 273509
10878 273509 -23812 -396101 90270 -66105 44914 269904 -410013 -212797 174161 51606
10867 123137 -58904 186132 -153427 -72422 263246 -183237 73412 -188227 180512 -28920
10856 -122857 139173 114202 -75070 123074 153645 23267 -63635 -245053 -360150 22769 -469519
$$ packed form
10935B43289J07501j25281L6309E1218a99681g6907C49815A25920O3194b2394
10924G8765J80038d8430J5850j24901A60790c06944A85683J9287d3098j9089B71835
10912A04616O8413J63930g3745j35183P5407B17458p7401e4320K5363H6932a72098
10900b49794J20406D40521A85194D2600K09263f5516d580m43234J82539A60929
10889b35041e0035A65736a9683q0948J2513B2467L2813e4526F8428M1840J63241
10878B73509b3812l72289I0270f6105D4914K24990d10013J97216A74161E1606
10867A23137e8904A86132a53427g2422B63246a83237G3412a88227A80512b8920
10856a22857A39173k4971g5070A23074L0571B3267f3635j81418j15097B2769d69519
$$ plain form
10844 -163285 -228306 -94568 101956 9332 78263 -34532 387036 -69804 -264372 -182949 252828
10832 116796 -310237 -308613 -53347 314882 -40877 -199320 -191088 -353623 -123746 -172029 77906
10820 -28201 102755 -5413 243122 -80163 -42961 58269 -2078 -16637 -103286 269496 45403
10808 -137706 244976 114250 -20020 -56521 -128932 28994 31122 23901 83262 -54977 82848
10796 122077 153305 -249520 -105651 -72025 -206251 81200 272372 -202253 173104 115247
10786 115247 -51991 89115 -266078 -64322 142529 64563 -285206 6467 -118700 30810 -117121
10774 -19151 213836 13816 -129966 -381182 -138595 469684 -98840 -95564 -90937 151528 250979
10763 250979 -106815 -393885 -472497 -84950 -206929 -17564 -91768 59160 283132 -87709 107881
$$ packed form
10844a63285o5021i4568A01956I332O8931c4532C87036f9804j94568Q1423B52828
10832A16796c10237J624e3347C14882d0877j58443Q232j62535a23746m8283G7906
10820b8201A02755e413B43122h0163L7202E8269b078j4559q6649B69496D5403
10808a37706B44976A14250b0020l6501p2411B8994K128p221N9361e4977H2848
10796A22077L1228b49520a05651L3626j34226H1200J91172b02253A73104n7857
10786A15247e1991H9115b66078f4322A42529F4563b85206F467a18700C0810a17121
10774a9151B13836A3816a29966k51216a38595D69684i8840L276M627A51528R9451
10763B50979a06815k87070p8612h4950j21979a7564p4204E9160K23972h7709A07881
$$ plain form
10751 -263474 187578 32150 58304 30230 155035 -172640 -155555 139105 -126352 106434
10740 98250 -100111 -35803 248292 -178203 -125735 46651 183763 278429 12282 135745 116835
10729 116835 -110074 -63300 56259 -180118 -143067 338588 -186083 127373 -101945 -99613
10719 -99613 144240 -185031 227046 -314466 176293 -129632 30621 -193248 95719 -174021
10708 -180585 110352 -324255 20602 -81589 -31462 -236848 -15037 -273294 -301339 -34338 -265944
10697 -265944 48024 -251211 104585 80293 -144855 98468 142018 277594 -432267 106712
10686 -244972 -108104 178762 113797 5446 -86758 133387 -37923 -289475 -9821 214927 8919
10674 -192019 -112939 45087 27402 317192 159451 -175432 210766 25086 71335 80073 53919
$$ packed form
10751b63474A87578C2150K6154k8074J24805a72640J7085A39105a26352A06434
10740I8250a00111c5803B48292a78203N2468D6651J37112R4666A2282J23463j8910
10729A16835a10074M6774E6259a80118L7051C38588a86083A27373a01945K332
10719i9613A44240a85031B27046c14466A76293a29632C0621a93248I5719a74021
10708a80585A10352c24255B0602h1589c1462k05386a5037k58257k8045c4338k31606
10697b65944D8024b51211A04585k4292a44855I8468M3550J35576d32267A06712
10686b44972a08104A78762o4965E446h6758A33387c7923k51552i821B14927H919
10674a92019P9080D5087j7685K89790j57741a75432B10766B5086M6249Q738k6154
$$ plain form
10663 53919 115058 -33123 176428 -269773 -143998 -64233 -200189 -25132 13598 -163582 -236204
10652 -236204 -267506 -296688 -273113 -198390 12487 83768 177317 130104 216681 -240385 -95928
10640 6091 -22929 -106379 126623 -111390 217284 -94416 99248 244806 152063 -92142 -4876
10628 -111423 -96473 -213741 -152293 -110648 80349 123526 105060 48828 -193147 -52987 -155805
10617 -155805 -201849 129458 261831 -169174 151824 -232194 254154 113931 -51892 80461
10606 76500 110899 -146158 22933 -68318 -45854 304070 -177340 -112844 -1468 -215838 42359
10594 -31816 -133621 -39758 -241132 -101294 -101329 -102200 47108 -55342 19048 81491 -66269 -288953
10582 -288953 -86191 80965 77558 -119894 103838 112676 247598 -50703 30582 -75860 -138224
$$ packed form
10663E3919O1139c3123A76428b69773J25775f4233j35956b5132A3598a63582p2622
10652b36204l1302k9182K3575P4723A2487P1281R3549m7213Q6577b40385i5928
10640F091b2929q3450A26623a11390B17284i4416I9248J45558r2743i2142d876
10628a11423J4950j17268O1448M1645H0349M3177j8466D8828a93147e2987j02818
10617a55805m6044A29458J32373a69174A51824b32194B54154A13931e1892H0461
10606G6500L4399a46158B2933f8318K2464C04070a77340O4496a468k14370D2359
10594c1816j01805c9758k01374a01294l5q71D7108e5342A9048O2443f6269k22684
10582b88953h6191H0965l407a19894A03838Q838J34922e0703C0582g5860o2364
$$ plain form
10571 -138224 -230283 -10569 -151141 13673 186846 269499 102009 -152546 97237 -211496
10560 -90048 83715 -134215 -96425 -93038 -197242 -86640 230543 -142876 -66053 -17038 13259
10548 -124691 18079 -441420 47142 81052 -7474 -158924 -27472 -159067 -59574 -21737 93480
10536 173970 -18417 -64538 -163246 -87370 -106221 -523158 121324 -32192 -171097 -154616 -261003
10525 -261003 267852 -233223 -16905 294249 -407341 91743 352610 38971 -40929 49393
10514 34690 53376 106448 -183155 30259 461739 16549 -14477 -74932 -181575 214937 336445
10503 336445 119055 85551 130179 -85953 438688 -97488 -151261 -139196 427625 -431596 31346
10491 -66757 -232884 -35095 -310731 -233062 229249 288059 103794 -76059 -86503 113844 376447
$$ packed form
10571a38224r2059a0569j40572A3673J73173Q2653A02009a52546I7237b11496
10560i0048H3715a34215L7790L387j04204h6640B30543a42876f6053a7038A3259
10548a24691A8079d41420D7142L3910g474j51450b7472j31595e9574b1737I3480
10536A73970a8417m6121r8708P5876j8851m16937A21324c2192j38905J6481j06387
10525b61003B67852b33223a6905B94249d07341I1743K60867C8971d0929D9393
10514C4690J8686N3072a83155C0259M31480A6549a4477o0455j06643B14937J21508
10503C36445A19055l3504M4628h5953D38688i7488n3773J2065D27625d31596C1346
10491f6757j66127c5095k75636P7669B29249N8810A03794g6059j0444A13844K62603
$$ plain form
10480 376447 514588 765479 89598 130662 302335 167724 123331 378584 -281223 19694
10469 316497 57403 -233967 -13221 -275904 34289 -183789 134395 10745 194252 30877
10458 205089 -21965 53469 285406 243977 93221 -194153 124092 -125279 98027 -214120
10447 -92126 -7620 -84345 -59710 -151878 32537 104459 -388657 -73105 -27114 137736 -164890
10435 -205125 22636 -302604 28719 271115 194637 -58017 -29801 161834 -59038 -1631 248008
10423 93682 -47290 -49352 176142 106372 -54385 -191333 -74881 -49664 150597 -131773 -255384
10412 -255384 40094 -62996 112953 -214135 34529 142736 23799 22401 -233911 35959 2752
10400 -162321 -185998 -107015 -205483 -262551 322360 61347 280824 198116 -51644 216283 -37352
$$ packed form
10480C76447J38141K50891H9598M1064J71673j34611m4393K55253b81223A9694
10469C16497E7403b33967a3221k62683C4289a83789A34395A0745J83507C0877
10458B05089b1965E3469K31937m1429I3221a94153A24092a25279I8027b14120
10447i2126g620p6725K4635r2168C2537P1922c88657g3105b7114A37736a64890
10435b05125B2636c02604B8719K42396p6478e8017K8216A61834e9038a631B48008
10423I3682d7290k062A76142o9770e4385j36948g4881K5217A50597a31773j23611
10412b55384D0094f2996A12953b14135C4529J08207B3799j398b33911C5959B752
10400a62321k3677P8983r8468n7068C22360F1347K19477q2708e1644B16283c7352
$$ plain form
10388 521351 135815 120779 185012 -168389 -166249 -158224 -1121 212562 -156069 569709 359316
10377 359316 167727 255653 265883 317427 160855 -48804 245933 449716 307479 248016
10367 248016 651362 634646 306478 329417 243223 272086 430020 394260 265573 167935 400895
10356 400895 301059 405402 364282 402600 66090 769611 623201 348106 364137 309644 369211
10345 369211 -26923 391405 195370 114262 274821 66766 205707 164882 60878 140128 227891
10334 227891 235209 59842 133877 256238 323680 83465 -6787 135462 74705 70282 -171494
10322 116924 60675 311990 317338 75809 -147791 230081 -62875 -16272 285473 -164314 272290
10310 7278 -131215 -27955 -144217 -63582 -122658 64733 84582 -53785 296035 189514 -229007
$$ packed form
10388E21351A35815j5036O4233a68389K140Q025a121B12562a56069E69709k10393
10377C59316A67727Q7926J0230N1544j56572d8804B45933K03783j42237n9463
10367B48016M03346j6716C06478K2939q6194K8863J57934l5760j28687r7638K32960
10356D00895r9836J04343m1120L8318F6090P03521j46410k75095J6031n4493N9567
10345C69211b6923C91405A95370q1108J60559F6766J38941m0825F0878P9250Q7763
10334B27891P318E9842P4035J22361O7442H3465f787A35462o0757m423a71494
10322A16924n6249K51315N348G5809a47791B30081f2875a6272B85473a64314B72290
10310G278a31215b7955j16262f3582n9076F4733J9849e3785B96035j06521b29007
$$ plain form
10298 -57702 266593 375900 -228169 246954 -41611 446110 -64380 -155380 -253074 -74550 -101592
10287 -101592 -18618 1556 76930 4374 -104962 90057 11283 -171703 28504 -125565 -107627
10276 -107627 -153529 -29678 2689 100336 9470 172524 -149468 -38413 133220 258021 184576
10265 184576 -45206 370043 -10657 153288 210707 199250 236681 100694 25867 304494 159729
10254 159729 156243 255125 124137 136233 234447 251604 -42395 12409 47522 -94226 141816
10242 108350 -10529 178055 28740 -109406 166072 -191869 -35263 205390 78057 -32495
10231 -191770 -142407 -62607 -39231 -74609 1802 -218150 -13886 73054 -179707 -520111 -120740
10219 96391 -153137 -186567 -66868 -75592 28939 -211064 -58694 21350 -143537 24576 40655
$$ packed form
10298e7702B66593J09307b28169B46954d1611D46110f4380r1000r7694g4550k7042
10287a01592a8618A556P5374D374a04962I0057A1283a71703B8504a25565J7938
10276a07627m5902b9678B689R7647I470J63054a49468c8413A33220J24801p3445
10265A84576d5206C70043a0657A53288N7419j1457L7431A00694B5867K78627j44765
10254A59729l486R8882A24137J2096R8214J7157d2395A2409L5113i4226A41816
10242A08350a0529A78055B8740a09406A66072a91869c5263B05390G8057c2495
10231a91770M9363f2607K3376l5378A802b18150a3886G3054a79707l40404a20740
10219I6391a53137l3430f6868q724B8939b11064e8694B1350a43537B4576J6079
$$ plain form
10208 40655 -281961 116764 -282346 -306196 -201964 -136253 76891 -296331 -111617 -49423
10197 -55635 40545 -38454 119888 53613 84067 73296 -219309 62984 128770 -155804 -450859
10186 -450859 -238267 272578 -220559 75415 -209402 -140349 -116479 -73887 256867 -57944
10175 -13536 71457 -106143 181059 39398 181082 99817 -130194 118917 -43435 -66605 35040
10163 249399 -423427 240802 -181266 -18164 -188150 -99062 -226039 -9594 -663954 -373647
10153 -373647 50875 -97657 -238831 247861 -50172 32704 -135728 9461 65894 -149423 196753
10141 -14552 109257 -207257 -33268 -43880 -1593 222500 108821 165864 67995 302722 -52596
10129 -241980 -228383 137836 -228762 -55579 -18936 166198 -15814 115194 -333764 -107270
$$ packed form
10208D0655b81961A16764b82346k3850J04232O5711G6891b96331a11617d9423
10197e5635D0545c8454A19888E3613L0454j0771b19309F2984O5786a55804k95055
10186d50859K12592B72578b20559G5415b09402O9053K3870M2592B56867e7944
10175a3536G1457a06143A81059C9398J41684q1265a30194A18917d3435k3170C5040
10163B49399d23427B40802a81266a8164j69986Q9088j26977i594o54360K90307
10153c73647E0875i7657j41174B47861e0172C2704a35728I461N6433a49423A96753
10141a4552A09257b07257c3268j0612a593B22500A08821N7043F7995K34727e2596
10129b41980J3597A37836b28762e5579a8936A66198a5814A15194c33764a07270
$$ plain form
10118 35969 -398595 -130293 -207417 -335984 -377530 -53077 181429 -14875 -238483 179435
10107 -85649 -309386 98273 -158681 123510 12542 -236292 314332 269476 -309272 -188093
10097 -188093 -91443 46200 -139679 -90427 68900 30519 -56965 -91588 -136161 -21507 -13841
10086 -13841 -38070 -97415 -90514 -157448 233777 -333854 -266922 -78177 -161423 -201100 -255487
10075 -255487 -345672 3995 -340495 -280762 29127 445284 -203413 108057 147846 -9286 -75915
10064 -75915 -152358 294173 -547869 35189 40360 115006 -140015 -52627 185872 -372733 -148395
10052 -310880 -34255 -174672 -318377 110103 -275882 -230134 -424379 -157034 217916 -235410
10041 42495 -143122 30553 -101508 37349 -200560 -303351 -138201 -183959 137485 112851
$$ packed form
10118C5969c98595a30293p7124j28567m1546e3077A81429a4875k23608A79435
10107h5649k23737I8273a58681A23510A2542b36292C14332m4856c09272J21179
10097a88093i1443D6200a39679M9252F8900C0519e6965l4623m4573b1507P666
10086a3841k4229n9345O901o6934B33777c33854O6932g8177q3246l9677n4387
10075b55487r0185C995c40495N9733B9127M16157b03413A08057L9789i286o6629
10064g5915p6443B94173e47869C5189N171P4646a40015e2627A85872c72733a48395
10052c10880c4255j40417j43705A10103b75882M5748j94245a57034B17916b35410
10041D2495a43122C0553a01508C7349b00560j02791a38201m5758A37485k4634
$$ plain form
10031 112851 23630 108406 363296 366997 -208060 -125708 -173907 -18379 27605 -216466 -63004
10019 112513 -347307 209801 -119889 -237677 254019 -138454 -49271 11997 -270286 19313
10008 -358068 62680 -136105 -235276 68482 176145 44754 -212718 154411 -188482 -47405
9997 -4123 70638 -112508 -67877 -119029 -4975 6518 37249 91095 -145562 85777 -252406 -160806
9985 -160806 -28632 65916 -311396 165790 -43470 124639 -200775 -330655 -213440 -378857
9975 -378857 9908 -350590 -16249 -88588 110280 13811 149715 -64269 -28504 -96926 -75040
9964 -75040 30618 -333187 146805 -154992 3965 -201396 -199692 117151 -244177 114914 -25467
9952 -649077 -94455 -375542 -34525 -169648 -219474 -108790 -65573 -705067 -162125 -146459 -127366
$$ packed form
10031A12851B3630Q4776K54890L701b08060Q2352m8199a8379B7605b16466f3004
10019A12513c47307B09801a19889j17788B54019a38454d9271A1997b70286A9313
10008c58068F2680a36105r9171F8482J07663D4754b12718A54411a88482d7405
9997d123G0638a12508M4631n1152d975F518L0731N3846a45562H5777b52406R1600
9985a60806b8632F5916c11396A65790d3470A24639b00775j29880J17215j65417
9975c78857I908c50590a6249p2339A10280A3811J35904f4269b8504o8422K1886
9964g5040C0618c33187A46805a54992C965b01396J704A17151b44177A14914b5467
9952f49077i4455k81087c4525j35123m9826a08790M3217o39494a62125J5666J9093
$$ plain form
9941 -127366 -62347 -42615 -14643 -519403 -37433 -211185 -304585 51930 -78629 18368 -206631
9929 113943 111629 -281539 150293 -103315 -106561 -102798 -5359 -49812 -58952 117865 -24727 -347207
9917 -347207 138426 251748 41622 -122979 -114569 -273150 -179816 -235367 -60398 104004 -28985
9905 -119612 -106810 184582 -209384 33052 -27241 -138818 -86115 -163522 -141428 -356654 34602
9893 -16358 -66809 22610 179383 -360854 -75416 -224456 311541 -321584 14004 -158502 224550
9881 32853 -244403 -263728 -345420 -36185 -43668 311608 -13910 -53561 42066 -339574 -118705
9869 7268 -41113 -35109 -20745 -33661 -233401 53969 71895 214674 -141981 -56108 -210769
9858 -210769 328225 -309209 72832 -142914 -58805 13903 -442049 -100383 -18032 -73263 -91460
$$ packed form
9941a27366f2347J9732a4643n04760c7433j73752r3400E1930g8629A8368b06631
9929A13943k314b81539A50293a03315l246L763e359m4453r140A17865b4727l22480
9917c47207A38426J13322D1622a22979Q410j58581R3334n5551f0398A04004b8985
9905a19612J2802A84582b09384C3052b7241j11577N2703p7407K2094k15226C4602
9893a6358n0451B2610J56773c60854g5416j49040C11541c21584A4004a58502B24550
9881C2853b44403j9325q1692c6185p483C11608a3910l9651D2066c39574a18705
9869G268d1113O004J4364j2916j99740E3969J7926J42779a41981e6108j54661
9858b10769C28225c09209G2832a42914e8805A3903d42049a00383a8032n5231j8197
$$ plain form
9847 -91460 -26535 80925 70806 -273489 163503 -2100 314884 -300270 -101428 160467 -38967
9835 -30506 217562 -21906 -292266 3497 -132650 -116936 84110 -284619 88370 -203501 -233905
9824 -233905 137958 87154 -89738 -275666 118224 291121 132407 -18941 -57533 128170
9813 -198429 99164 -207236 -61010 159237 -162071 215770 81568 310105 68580 -70117 -54912
9802 -54912 -211854 -326723 -91046 -21757 -337338 79531 -105982 -30337 -237424 -4997 -82734
9791 -82734 -60342 -270284 -150820 85718 117430 -5657 90718 -62372 -13611 224287 -54783
9779 -314598 -200108 49649 4666 216495 174064 186415 87236 -143037 -453254 28307 -9102
9767 87152 118801 155095 -35501 -64578 -349694 13504 -315804 -184465 44213 -195282 -70822
$$ packed form
9847i1460b6535H0925j0119b73489A63503b100C14884c00270a01428A60467c8967
9835c0506B17562b1906k70360C497a32650J5714H4110b84619H8370b03501l0404
9824b33905A37958n0804h9738j85928A18224J72897A32407a8941l8592A28170
9813a98429I9164b07236f1010A59237a62071B15770H1568K28537F8580g0117J5205
9802e4912j56942j14869i1046b1757l15581G9531a05982c0337k07087d997p7737
9791h2734K2392k09942J19464H5718L1712e657I0718f2372a3611B24287e4783
9779c14598J14490D9649D666K11829m2431J2351H7236a43037l10217B8307i102
9767H7152L1649L6294c5501k9077k85116A3504c15804J31339D4213a95282g0822
$$ plain form
9755 48657 34819 -76956 -233690 -62550 -150537 34633 50936 -312517 -83458 -123605 33437
9743 121376 -69420 -414621 103004 -131229 -359425 -14269 52513 -162566 54372 92387 -144372
9731 -297066 -140357 242280 66148 -118521 164482 -45663 -75262 129198 -356792 -152662
9720 -78076 -318401 -133962 -163417 -228495 -241644 -95247 75915 -4104 -143102 -18092 -53480
9709 -53480 -114385 62707 -366450 -253146 -183129 15251 -100056 91850 -140984 -97904 85378
9697 -154919 -35994 -51809 -140669 336719 -60814 -192378 -20126 167368 2612 55575 -125582
9685 14250 -154928 -187173 -202628 -107778 -218737 -464271 211486 -137834 -54327 -8762 -212274
9674 -212274 -260472 -75839 123084 3499 -126784 -127705 40461 -281305 -384062 -316305 142521
$$ packed form
9755D8657j3838g6956j56734f2550q7987C4633J6303c12517h3458m0147C3437
9743A21376f9420l45201A03004a31229k28196a4269E2513a62566E4372L8015a44372
9731b97066a40357B42280F6148a18521A64482d5663k9599A29198c56792a52662
9720g8076k40325a33962k9455o5078j3149i5247G5915d104j38998a8092l5388
9709e3480o0905F2707c66450J13304P0017A5251a00056I1850a40984M3080H5378
9697a54919c5994j5815q8860C36719f0814j31564b0126A67368B612N2963a25582
9685A4250a54928l2245j5455R4850j10959k45534B11486a37834e4327h762k03512
9674b12274m8198g5839A23084C499a26784r21D0461b81305j02757O7757A42521
$$ plain form
9662 -1926 177980 9358 -261787 28852 -55563 -81700 -11278 -212939 137913 -248098 -83202
9650 -233978 -72190 73400 108165 -223422 288021 -269675 -381819 81660 23595 -301311 149004
9638 -284737 -79627 -301049 -87765 -215211 -13971 -216797 44632 -222120 -90297 -157827 -341482
9627 -341482 -152089 225607 23540 246639 -140692 -58646 -224910 63779 -157217 -101761
9617 -101761 -207605 -132340 214184 -194507 -175772 240160 -202870 -4735 -51327 -269601 -111461
9605 -1908 -87025 66547 26893 -278467 25942 -91767 55956 -62903 18099 -80316 -76224 -412853
9593 -412853 -174772 91403 32848 -65352 -346765 140733 62893 13154 -111013 -178974 -73649
9581 -223116 -145942 -294078 -173208 -7765 147093 -195397 -164510 -184382 -134627 -298941 -74725
$$ packed form
9662a926A77980I358b61787B8852e5563k6137a1278k01661A37913b48098h3202
9650b33978g2190G3400L4765b23422B88021b69675j12144H1660B3595c01311A49004
9638b84737g9627k21422h7765j27446a3971k02826D4632b22120i0297o7530j83655
9627c41482a52089B25607B3540K23099a40692e8646j66264F3779a57217N5456
9617a01761j05844P5265B14184a94507J8735B40160b02870d735m6592k18274a11461
9605a908q5117F6547B6893b78467B5942i1767E5956f2903A8099h0316M092l36629
9593d12853a74772I1403C2848f5352k81413A40733F2893A3154a11013o7961g3649
9581b23116P7174j48136J20870g765A47093a95397L0887j9872M9755j64314g4725
$$ plain form
9569 -211781 -145778 120319 -72788 61993 -248925 -210187 256463 -4100 -53030 -20378 364306
9557 403553 387048 -299065 -121134 246299 -146445 -202223 36155 166904 -59108 -446493
9547 -446493 134028 -154462 5438 -194404 -330701 -267983 297996 -413992 -192437 -12024
9536 -42822 -80123 259411 -320191 -182519 -239625 84465 -65657 134940 308734 -301304 167081
9524 -26684 40874 -188422 -35572 -16106 -114661 -33002 -300265 -36910 -106046 -83847 -254305
9513 -254305 -18994 -93698 -130518 -58700 -139099 166632 -67902 14238 187269 15444 100283
9502 100283 -133052 148704 -390735 -76202 -122147 -88054 186774 123702 -424402 12883 -59763
9490 -89883 13817 -241478 -501688 -451286 100506 35921 -265739 316115 296607 -157000 49221
$$ packed form
9569b11781O6003A20319g2788F1993b48925L8738B56463d100m8930b0378C64306
9557D03553j6505b99065a21134B46299a46445n5778C6155J30749e9108l87385
9547d46493A34028a54462E438a94404j36297O2718B97996d13992a92437a2024
9536d2822l7301B59411c20191J37672n7106H4465f5657A34940J73794c01304A67081
9524b6684D0874a88422c5572a6106r8555c3002k67263c6910o9136K2199j70458
9513b54305a8994p4704l6820e8700q0399A66632f7902A4238J73031A5444Q4839
9502A00283a33052A48704c90735g6202m5945L4093A86774o3072d24402A2883e9763
9490h9883A3817b41478k60210N0402A00506C5921b65739C16115j9508a57000D9221
$$ plain form
9478 -159510 -62927 34840 114930 -24944 92452 351167 3444 -47121 -148613 -91452 -7419 52912
9465 -13976 -74432 268559 261485 132668 305955 12898 -88650 68853 339648 128802 -125132
9453 174373 -276568 -140592 89992 236987 -152487 99108 -306429 -486272 -34714 -154576
9443 -154576 -181028 -274892 -13902 209717 -417567 111332 -163112 276623 -132892 -178019
9433 -178019 -23687 149904 -341017 -81032 -197845 -90492 95286 -188834 -98125 -217197 21322
9421 2259 -314835 -388091 -59559 -15851 -247262 281647 452226 -12637 -33343 -337882 132823
9409 -87544 -32958 -284706 -74412 -99985 -42309 115357 220913 99045 -13252 -189061 -301947
9398 -301947 -223229 -180967 5363 32555 -63151 78850 -108269 -569230 46032 205043 -4125
$$ packed form
9478a59510f2927C4840Q0090b4944I2452K58715C444d7121j01492N7161g419E2912
9465a3976o0456B68559p074j28817J73287A2898h8650F8853K70795A28802a25132
9453A74373b76568J35976H9992J46995a52487I9108c06429j79843c4714j19862
9443a54576k6452r3864a3902B09717d17567A11332a63112B76623a32892m5127
9433a78019b3687A49904c41017h1032j16813i0492I5286a88834R0709j19072B1322
9421B259c14835p3256e9559a5851k31411B81647J70579a2637k0706l04539A32823
9409h7544c2958k51748g4412k5573d2309A15357J05556I9045a3252j75809j12886
9398c01947P8718M2262E363K7192f3151G8850a08269m60961D6032J59011d125
$$ plain form
9386 93044 -61081 288435 55775 -184151 -239711 -51576 28368 -22389 100561 -92604 116453
9374 69892 -228563 54518 -163837 -12324 21560 -83393 302724 145206 -35795 -186574 -99318
9363 -99318 -384021 -274611 -157783 -153608 28918 -142638 -111924 -13400 126369 -63118 -168995
9352 -168995 -202721 263730 -22587 -248740 -236527 -189292 61991 114300 -258944 -206199 -81071
9340 -129251 -291913 -21303 -98843 -56383 59557 91117 147770 -167778 208885 -180928 -57756
9328 189638 -311526 -14851 -276647 -120670 -191569 -23893 -362849 -112942 48362 -133727
9317 -243716 -431671 -15718 -79248 124280 -26620 -34724 -148993 -259943 -83054 -77536 -230299
9306 -230299 -122149 -67038 20475 -103711 -300508 -41835 -163819 76307 25008 -188017 -28989
$$ packed form
9386I3044f1081B88435E5775a84151n5560e1576B8368b2389A00561i2604A16453
9374F9892b28563E4518a63837a2324B1560h3393C02724A45206c5795j50779Q7256
9363i9318k84703J09410J16828M175B8918a42638L0714a3400A26369f3118j05877
9352a68995l3726B63730b2587k26153J2213M7235F1991N2309b58944N2745h1071
9340a29251j62662b1303p7540M2460E9557L1560N6653a67778B08885a80928e7756
9328A89638c11526a4851k61796a20670p0899b3893l38956a12942D8362a33727
9317b43716j87955a5718o3530A24280b6620q104j14269j10950h3054N518j52763
9306b30299J08150N5111B0475a03711j96797d1835j21984G6307B5008a88017b8989
$$ plain form
9294 19620 69610 -206872 -109472 112982 217881 -85143 297337 479202 27355 33253 -20983
9282 -175700 -79579 -154954 -33331 190746 -198803 -29238 -53291 -311402 136902 -192337 -46664
9270 -65663 -142986 223579 -210853 -279235 -41134 167601 -192710 -96867 11591 252954 -256594
9258 -112632 -244913 -358780 142736 135976 -170133 -90050 -226553 89138 -62091 -8646 121929
9246 -89915 -146988 -254762 -36491 159203 -324207 -195549 -165635 18632 279009 254336 -198632
9234 -63838 -183980 -180772 -276159 -617447 -115415 -241350 117880 -254561 -41661 355072 -72426
9222 -75695 -313076 66845 -7991 -170180 271235 -159879 96118 -139354 82851 -404482 -157078
9210 159087 10640 -262092 -54296 379211 124953 -26932 39545 23474 -110631 158065 210329
$$ packed form
9294A9620M9990b06872R7400A12982J04899h5143B97337J81865B7355N898b0983
9282a75700g9579p5375c3331A90746a98803b9238k4053k58111A36902a92337d6664
9270f5663p7323B23579b10853o8382d1134A67601a92710R5843A1591K41363b56594
9258a12632j32281j13867A42736o760a70133Q0083j36503H9138f2091h646A21929
9246h9915n7073j07774c6491A59203c24207J28658K9914A8632K60377k4673a98632
9234f3838j20142L208r5387l41288a15415j25935A17880b54561d1661C55072g2426
9222g5695k37381F6845g991j62189B71235a59879I6118a39354H2851d04482a57078
9210A59087A0640b62092e4296C79211A24953b6932C9545j6071a10631A58065N2264
$$ plain form
9199 210329 -210069 -261471 -251218 -159255 -153104 18953 32749 148407 127631 206706 73925
9187 272479 -292032 -114325 210036 -282393 22196 -185287 -116543 -339181 -165326 -218864
9177 -218864 179018 328828 -132840 287 -66234 -92869 -165066 -203347 -188965 -392264 260512
9165 60999 -59871 -104733 188186 103596 -360382 24955 29703 -91358 32026 85723 -186697
9153 116088 36443 -65708 34538 155455 249665 -303405 -23856 -42482 157498 -254231 249141
9141 81430 -115227 95508 -167262 -12204 -339724 -8028 -91114 -465502 93468 28512 30539
9130 30539 60479 204269 116223 -150943 -212786 -172202 9790 157842 -12237 -244317 18230
9118 -95116 -109264 93740 108228 -185826 31420 -350074 36740 -158837 -130228 -109013 -152607
$$ packed form
9199B10329b10069n1402J0253R1963O151A8953J3796J15658k0776P9075G3925
9187B72479b92032a14325B10036b82393B2196a85287O8744k22638a65326n3538
9177b18864A79018J49810a32840B87f6234k6635p2197l8281J4382k03299B60512
9165F0999e9871m4862A88186q4590c60382B4955M748i1358C2026N3697a86697
9153A16088C6443f5708C4538J20917R4210c03405b3856j8626A57498b54231B49141
9141H1430a15227I5508a67262a2204l27520h028q3086l74388I3468B8512K027
9130C0539K9940J43790q8046a50943o1843M0584I790J48052a2237k32080A8230
9118i5116j4148I3740J4488a85826C1420c50074C6740a58837K8609K1215m3594
$$ plain form
9107 -152607 -77716 67623 231158 -343068 -224823 314986 -260312 -317457 -346253 -333787 -151074
9095 -190900 29592 -199481 57309 -112760 -243554 -104096 -201037 65836 61903 200033 -209513
9083 -77379 61583 -257236 -206276 79051 257234 -231675 3999 -50640 -131002 115354 -440081
9071 86 -264700 -347579 15679 -146374 127550 298173 200635 -40087 -35397 255887 -174262
9059 -360095 -206134 4537 -258934 -24536 55328 -12628 65428 -317985 26936 -183119 75 66695
9047 66695 -119628 -259735 -123430 112837 -37115 -57889 -38744 125949 -230738 -116075
9037 -116075 244646 -299823 25013 -128504 13751 81659 -235747 -73952 101566 90747 -316884
9025 -55069 189159 -379567 -94113 -50152 9063 -18661 -235287 -439559 176813 -11305 -245187
$$ packed form
9107a52607P4891F7623J63535c43068J18245C14986b60312n7145k8796J2466a51074
9095a90900B9592a99481E7309a12760j30794a04096r6941F5836l933J38130b09513
9083g7379F1583b57236N0960G9051J78183b31675C999e0640q0362A15354d40081
9071H6b64700q2879A5679a46374A27550J70623r7538d0087M690B55887a74262
9059c60095J53961D537b58934b4536E5328a2628F5428c17985B6936a83119G5O6620
9047F6695a19628j40107a23430A12837c7115k0774J9145A25949b30738J14663
9037a16075B44646b99823B5013a28504A3751O7908b35747g3952A01566j0819c16884
9025e5069A89159c79567i4113M3961I063a8661k16626k04272A76813a1305k33882
$$ plain form
9014 -245187 40126 149021 -104011 -160497 -169329 -113534 -81891 -179142 41290 -163907 -12417
9002 104760 -313909 -80461 -246700 -152338 129285 -59890 -117232 -226812 -67286 203184 -169368
8990 11519 -311415 -10804 100950 150819 -163249 -47662 23761 -226415 34996 -119976 -281629
8979 -281629 -229448 -235253 110699 -180156 -322261 84069 11443 6547 -15285 -391916 -41688
8967 -104876 -23551 74365 -129334 -326908 103507 -203895 -110508 -340258 125945 124347 -13192
8955 369174 -155773 171408 -276437 57857 125194 -79772 -29064 47814 -441688 8253 -190693
8943 18114 26228 -116983 32533 -433964 -79367 -122344 -83404 46128 -153044 -436772 -69725
8931 -92419 -128430 -226821 231518 421447 58372 152856 346200 583357 1155860 3762016
$$ packed form
9014b45187D0126J08895a04011n6486q832N5795L1643r7251D1290a63907a2417
9002A04760c13909h0461j66239R4362A29285e9890n7342j09580f7286B03184a69368
8990A1519c11415a0804A00950M9869a63249d7662B3761b26415C4996a19976j61653
8979b81629N2181n805A10699a80156j42105H4069A1443m896a5285l76631d1688
8967a04876b3551G4365a29334j97574A03507b03895R3387k29750A25945j598a3192
8955C69174a55773A71408b76437E7857O7337g9772b9064D7814d41688H253a90693
8943A8114Q114a16983C2533d33964g9367m2977L8940D6128a53044k83728f9725
8931i2419l6011r8391B31518J89929E8372R4484J93344K37157N72503K606156
$$ plain form
8921 3762016 6552935 2394056 585232 418391 425090 69845 -241207 -20839 119340 30689
8910 179037 -232660 35668 382360 90679 6335 -135735 -176449 29337 35411 -425513 6004
8898 142927 149179 -200350 25669 251036 -154403 -85012 -34525 -282553 318743 31540 -97694
8886 -56798 -50152 -12226 176564 4047 -135402 -110332 139320 335891 232962 86354 -117048
8874 32225 25642 140271 -76185 -261188 -297017 -68877 -212749 196027 -101586 -78741 -4191
$$ packed form
8921C762016K790919B394056E85232j66841O699F9845b41207b0839A19340C0689
8910A79037b32660C5668L46692I0679F335a35735m0714B9337O074d25513F004
8898A42927O252b00350B5669K25367a54403O9391c4525k48028C18743C1540i7694
8886e6798O646a2226A76564D047a35402K5070A39320J96571j02929H6354a17048
8874C2225o583J14629g6185j85003l5829f8877j43872A96027a01586K2845d191
$$ [...]
##END NTUPLES=NMR SPECTRUM
##END=
