##TITLE=AC1649_NBEAH14350_8531133_033N9jJmXH
##JCAMPDX= 6.0         $$ Bruker NMR JCAMP-DX V2.0
##DATA TYPE= NMR SPECTRUM
##DATA CLASS= NTUPLES
##ORIGIN= BRUKER
##OWNER= Administrator
$$ 1.72 TOPSPIN		Version 2.1
$$ 2015-08-07 23:41:07.016 -0700  Administrator@X
$$ Compression mode = diff/dup
##.OBSERVE FREQUENCY= 400.02188249412
##.OBSERVE NUCLEUS= ^1H
##.ACQUISITION MODE= SIMULTANEOUS (DQD)
##.ACQUISITION SCHEME= undefined
##.AVERAGES= 64
##.DIGITISER RES= 22
##SPECTROMETER/DATA SYSTEM= spect
##.PULSE SEQUENCE= noesygpps1d.comp
##.SOLVENT NAME= COFFEE_meoh
##.SHIFT REFERENCE= INTERNAL, COFFEE_meoh, 1, 14.96154
##AUDIT TRAIL= $$ (NUMBER, WHEN, WHO, WHERE, PROCESS, VERSION, WHAT)
$$ ##TITLE= Audit trail, TOPSPIN		Version 2.1
$$ ##JCAMPDX= 5.01
$$ ##ORIGIN= Bruker BioSpin GmbH
$$ ##OWNER= Administrator
$$ $$ E:\/data/COFFEE/nmr/AC1649_NBEAH14350_8531133_033N9jJmXH/22/pdata/1/auditp.txt
$$ ##AUDIT TRAIL=  $$ (NUMBER, WHEN, WHO, WHERE, PROCESS, VERSION, WHAT)
(   1,<2015-08-07 23:41:01.641 -0700>,<Administrator>,<X>,<go>,<TOPSPIN 2.1>,
      <created by zg
	started at 2015-08-07 23:29:32.063 -0700,
	POWCHK enabled, PULCHK disabled,
       configuration hash MD5:
       21 0F 79 D6 B3 7B B4 F6 88 20 88 DB 03 48 BD 9F
       data hash MD5: 64K
       6E 87 69 77 57 8D D5 3D AE 6C CC 08 75 7D D7 3F>)
(   2,<2015-08-07 23:41:04.875 -0700>,<Administrator>,<X>,<proc1d>,<TOPSPIN 2.1>,
      <Start of raw data processing
       efp LB = 0.3 FT_mod = 6 PKNL = 1 PHC0 = 0 PHC1 = 0 SI = 128K 
       data hash MD5: 128K
       DF 95 93 26 1B 59 0A 9E 4A 3C 9D 50 5A A8 1C CF>)
(   3,<2015-08-07 23:41:05.797 -0700>,<Administrator>,<X>,<proc1d>,<TOPSPIN 2.1>,
      <pk PHC0 = -85.55054 PHC1 = 0 
       data hash MD5: 128K
       9D 4D A3 3A 8E 03 4C FA 39 B9 3C 93 C1 32 E8 E0>)
(   4,<2015-08-07 23:41:06.172 -0700>,<Administrator>,<X>,<proc1d>,<TOPSPIN 2.1>,
      <abs ABSG = 1 
       data hash MD5: 128K
       7A 50 47 9E 94 F7 6B 3A 39 9B 22 A4 EC FF 32 B1>)
(   5,<2015-08-07 23:41:06.266 -0700>,<Administrator>,<X>,<proc1d>,<TOPSPIN 2.1>,
      <abs ABSG = 2 
       data hash MD5: 128K
       30 40 4E 19 9A C7 87 5B 79 E7 37 43 FB B9 D3 EA>)
(   6,<2015-08-07 23:41:06.359 -0700>,<Administrator>,<X>,<proc1d>,<TOPSPIN 2.1>,
      <abs ABSG = 3 
       data hash MD5: 128K
       34 7D A5 38 F8 FF 01 D5 06 1C 3C 3D 08 B3 1B 30>)
(   7,<2015-08-07 23:41:06.438 -0700>,<Administrator>,<X>,<proc1d>,<TOPSPIN 2.1>,
      <abs ABSG = 4 
       data hash MD5: 128K
       DA FC 7E 7A 35 9C 66 BD 9C 42 B2 CD C0 59 0E 83>)
(   8,<2015-08-07 23:41:06.578 -0700>,<Administrator>,<X>,<proc1d>,<TOPSPIN 2.1>,
      <abs ABSG = 5 
       data hash MD5: 128K
       EC 1A CF C2 2C D8 C5 03 75 CE 89 8A EF 53 4A 37>)
$$ ##END=
$$ 
$$ $$ hash MD5
$$ $$ B0 38 33 D4 7A 24 B0 A1 9A 30 F1 2B EC 5C 76 FD
##$RELAX= 
##$RELAX= 
##$RELAX= 
##$RELAX= 
##$RELAX= 
##$RELAX= 
##$RELAX= 
##$RELAX= 
$$ Bruker specific parameters
$$ --------------------------
##$DU= <E:\>
##$EXPNO= 22
$$ [...]
##$TP07= 0
##$TPNAME0= <>
##$TPNAME1= <>
##$TPNAME2= <>
##$TPNAME3= <>
##$TPNAME4= <>
##$TPNAME5= <>
##$TPNAME6= <>
##$TPNAME7= <>
##$TPOAL= (0..7)
0.5 0.5 0.5 0.5 0.5 0.5 0.5 0.5
##$TPOFFS= (0..7)
0 0 0 0 0 0 0 0
##$TUNHIN= 0
##$TUNHOUT= 0
##$TUNXOUT= 0
##$USERA1= <user>
##$USERA2= <user>
##$USERA3= <user>
##$USERA4= <user>
##$USERA5= <user>
##$V9= 5
##$VALIST= <valist>
##$VCLIST= <CCCCCCCCCCCCCCC>
##$VD= 0
##$VDLIST= <DDDDDDDDDDDDDDD>
##$VPLIST= <PPPPPPPPPPPPPPP>
##$VTLIST= <TTTTTTTTTTTTTTT>
##$WBST= 2048
##$WBSW= 25
##$XGAIN= (0..3)
0 0 0 0
##$XL= 0
##$YL= 0
##$YMAX_a= 6090468
##$YMIN_a= -12176784
##$ZGOPTNS= <>
##$ZL1= 120
##$ZL2= 120
##$ZL3= 120
##$ZL4= 120
##$ABSF1= 14.96154
##$ABSF2= -5.596642
##$ABSG= 5
##$ABSL= 3
##$ALPHA= 0
##$AQORDER= 0
##$ASSFAC= 0
##$ASSFACI= 0
##$ASSFACX= 0
##$ASSWID= 0
##$AUNMP= <proc_prof1d_extract.lims>
##$AXLEFT= 0
##$AXNAME= <>
##$AXNUC= <1H>
##$AXRIGHT= 0
##$AXTYPE= 0
##$AXUNIT= <>
##$AZFE= 0.1
##$AZFW= 0.1
##$BCFW= 0
##$BC_mod= 0
##$BYTORDP= 0
##$COROFFS= 0
##$CY= 15
##$DATMOD= 1
##$DC= 0
##$DFILT= <>
##$DTYPP= 0
##$F1P= 0
##$F2P= 0
##$FCOR= 0.5
##$FTSIZE= 131072
##$FT_mod= 6
##$GAMMA= 0
##$GB= 0
##$INTBC= 1
##$INTSCL= 1
##$ISEN= 128
##$LB= 0.3
##$LEV0= 0
##$LPBIN= 0
##$MAXI= 10000
##$MC2= 0
##$MEAN= 0
##$ME_mod= 0
##$MI= 0
##$NCOEF= 0
##$NC_proc= -2
##$NLEV= 6
##$NOISF1= 0
##$NOISF2= 0
##$NSP= 0
##$NTH_PI= 0
##$NZP= 0
##$OFFSET= 14.96154
##$PC= 1
##$PHC0= -85.55054
##$PHC1= 0
##$PH_mod= 1
##$PKNL= yes
##$PPARMOD= 0
##$PPDIAG= 0
##$PPIPTYP= 0
##$PPMPNUM= 2147483647
##$PPRESOL= 1
##$PSCAL= 4
##$PSIGN= 0
##$PYNMP= <proc.py>
##$REVERSE= no
##$SF= 400.020009419589
##$SI= 131072
##$SIGF1= 0
##$SIGF2= 0
##$SINO= 400
##$SIOLD= 131072
##$SPECTYP= <>
##$SREGLST= <1H.CDCl3>
##$SSB= 0
##$STSI= 131072
##$STSR= 0
##$SW_p= 8223.68421052631
##$SYMM= 0
##$S_DEV= 0
##$TDeff= 65536
##$TDoff= 0
##$TI= <>
##$TILT= no
##$TM1= 0
##$TM2= 0
##$TOPLEV= 0
##$USERP1= <user>
##$USERP2= <user>
##$USERP3= <user>
##$USERP4= <user>
##$USERP5= <user>
##$WDW= 1
##$XDIM= 131072
##$YMAX_p= 443643915
##$YMIN_p= -11155
##$CURPLOT= <Network HP LaserJet P1505>
##$CURPRIN= <$Network HP LaserJet P1505>
##$DFORMAT= <normdp>
##$LAYOUT= <+/1D_H.xwp>
##$LFORMAT= <normlp>
##$PFORMAT= <normpl>
##$SURQMSG= 1
$$ End of Bruker specific parameters
$$ ---------------------------------
##NTUPLES= NMR SPECTRUM
##VAR_NAME=  FREQUENCY,     SPECTRUM/REAL,   SPECTRUM/IMAG
##SYMBOL=    X,             R,               I
##VAR_TYPE=  INDEPENDENT,   DEPENDENT,       DEPENDENT
##VAR_FORM=  AFFN,          ASDF,            ASDF
##VAR_DIM=   131072,        131072,          131072
##UNITS=     HZ,            ARBITRARY UNITS, ARBITRARY UNITS
##FACTOR=    0.0627417313425164, 1,          1
##FIRST=     8223.62146879497, 2229,         -49130
##LAST=      0,             3024,            -49508
##MIN=       0,             -11155,          0
##MAX=       8223.62146879497, 443643915,    0
$$ Real data points
##PAGE= N=1
##DATA TABLE= (X++(R..R)), XYDATA
$$ [...]
63925F550040l54896l70550l77687l78082l73137l63265l48813l30634l09509
63916C343467k85952k60898k35738k11363j87943j65811j45661j27724j11656
63907A610721r7444q5477p5523o6673n8574n1712m6217m1462l7153l3765l1461
63896I85260k9585k7758k6407k5686k4879k3478k1904k0501j8830j6575j4253
63885G35404j2192r802o730l897k251j204O59L712P195J0557J3832J6880J9304
63872G71467K1205K3167K5432K7629K9334L0425L0887L0743L0201K9396K8024
63861A077910K5604K2176J8434J5050J2105R140N680J667k540o620j0654j4852
63849A153100j9009k2594k5409k7850l0376l3059l5674l7927l9461l9959l9376
$$ plain form
63925 6550040 6195144 5824594 5446907 5068825 4695688 4332423 3983610 3652976 3343467
63916 3343467 3057515 2796617 2560879 2349516 2161573 1995762 1850101 1722377 1610721
63907 1610721 1513277 1427800 1352277 1285604 1227030 1175318 1129101 1087639 1050486 1016721 985260
63896 985260 955675 927917 901510 875824 850945 827467 805563 785062 766232 749657 735404
63885 735404 723212 713410 706680 702783 700532 699328 699987 703699 710894 721451 735283 752163 771467
63872 771467 792672 815839 841271 868900 898234 928659 959546 990289 1020490 1049886 1077910
63861 1077910 1103514 1125690 1144124 1159174 1171279 1180419 1186099 1187766 1185226 1178606 1167952 1153100
63849 1153100 1134091 1111497 1086088 1058238 1027862 994803 959129 921202 881741 841782 802406
63838H02406l7920l5813l3306l0824k8754k7116k5696k4328k2729k0436j7512
63827D97972j4961j3702j3302j2511j0991r538q641p867o887o095n786n627n346
63814C76718n177n191m982m480m300m756n259n285n163n305n325m715l840l407
63800C09533l428l421l324l449l712l662l115k263j302m70k04o67j362j702j757
63785B75695j870j826j135p4L93j37r55j219r09n28l12j79j96n77j178j426r85
63768B62582k39J04j76o48q41p25n52n23p09j033j164p18K18J066J487J749K149
63751B62027K513K649K801L092K997K023O70j15j49L1K35P16J299J302N87j12
63735B82566j05N84J591K621L338L464L220L146L373L599L727L916L945L274J932
$$ plain form
63838 802406 764486 728673 695367 664543 635789 608673 582977 558649 535920 515484 497972
63827 497972 483011 469309 456007 443496 432505 422967 414326 406459 399572 393477 387691 382064 376718
63814 376718 371541 366350 361368 356888 352588 347832 342573 337288 332125 326820 321495 316780 312940 309533
63800 309533 306105 302684 299360 295911 292199 288537 285422 283159 281857 281387 281183 280516 279154 277452 275695
63785 275695 273825 271999 270864 270790 271183 271046 270091 268872 267963 267435 267123 266944 266748 266171 264993 263567 262582
63768 262582 262343 262447 262271 261623 260782 260057 259505 258982 258273 257240 256076 255358 255576 256642 258129 259878 262027
63751 262027 264540 267189 269990 273082 276079 278102 278772 278657 278508 278539 278774 279490 280789 282091 282678 282566
63735 282566 282461 283045 284636 287257 290595 294059 297279 300425 303798 307397 311124 315040 318985 322259 324191
63720C24191O51p2m30o82p71p70j014j448j412n13P85J742K131K190K190K311
63704C29079K611K935L064K965K714K352K105K400L176L540K787J471O40L86k6
63689C62199q54j710k491l324l749l104j714o65l50l57o91j697k769k572r54P17
63673C35915J499J818K110J945J159M43J41l47j305k050k210k398k946l221k957
63658C27596k889l257l090j973j133j543k254j941r56m44l99j32K69M09P43J767
63642C10773K754K828K647L451M939N734N559N356N508N536N498O120P423Q585
63628C82711R399J0611J2544J4494J5755J6419J6919J7606J8800K0518K2110K2833
63616E80719K2747K2365K1637J9986J7109J3020P684J567l855p172q498q857q510
$$ plain form
63720 324191 324842 324770 324340 323658 322887 322117 321103 319655 318243 317730 318515 320257 322388 324578 326768 329079
63704 329079 331690 334625 337689 340654 343368 345720 347825 350225 353401 356941 359728 361199 361839 362225 362199
63689 362199 361345 359635 357144 353820 350071 346967 345253 344588 344238 343881 343190 341493 338724 336152 335198 335915
63673 335915 337414 339232 341342 343287 344446 344889 345030 344683 343378 341328 339118 336720 333774 330553 327596
63658 327596 324707 321450 318360 316387 315254 313711 311457 309516 308560 308116 307717 307585 307854 308263 309006 310773
63642 310773 313527 316355 319002 322453 327392 333126 338685 344041 349549 355085 360583 366703 374126 382711
63628 382711 392110 402721 415265 429759 445514 461933 478852 496458 515258 535776 557886 580719
63616 580719 603466 625831 647468 667454 684563 697583 705267 706834 702979 695807 687309 678452 669942
63603F69942p115n203m058m042m425n032o685r589j2599j4666j5959j6914j7158
63590E46497j6197j4431j2697j1238r760q154o623n312m173l103j947o23O80J641
63576D54560K232K723L346M163N143O036O367O074N843O330P214P840Q478R994
63562E36343J2314J4307J5527J6993J9666K3058K6029K8265L0035L0734K8671
63551G81942K2618J3164K427p249j4277j8013j8619j6899j4026j1014q335o069
63539G05650m378l609l992n415p576j0082j2433j4294j5752j6999j7784j7667
63527E75669j6849j6124j5830j5507j4868j4359j4299j4109j2997j1023q999p678
63515D13027p329p619p619o517m728l581l526l490k594j533j394j915k056j645
$$ plain form
63603 669942 662827 657624 653566 649524 645099 640067 633382 623793 611194 596528 580569 563655 546497
63590 546497 530300 515869 503172 491934 482174 474020 467397 462085 457912 454809 452862 452239 452919 454560
63576 454560 456792 459515 462861 467024 472167 478203 484570 490644 496487 502817 510031 517871 526349 536343
63562 536343 548657 562964 578491 595484 615150 638208 664237 692502 722537 753271 781942
63551 781942 804560 817724 820151 812902 798625 780612 761993 745094 731068 720054 711719 705650
63539 705650 701272 697663 693671 688256 680680 670598 658165 643871 628119 611120 593336 575669
63527 575669 558820 542696 526866 511359 496491 482132 467833 453724 440727 429704 420705 413027
63515 413027 405698 398079 390460 383943 379215 375634 372108 368618 366024 364491 363097 361182 359126 357481
63501C57481j329j326j353j500k062k726k885k558k022r38J029K991L559K836
63487C49197K302K709L284L328L308L726L999L303J900Q29O45J006J292J122M17
63472C82367o65j812k658k894k436j613r62o78m51k1N01J046J813K754L387L626
63456C81304M225N706P347P979P454O677O510P261Q889J0996J3002J5057J8196
63443E00603K2738K6960K8418K6377K2073J6949J1737P004L403J198L49J025L250
63430F72084O285R278J2366J6139K0248K3507K5227K5359K3540J9377J3666Q076
63418H75152L317j135n372q428r753j0091j0257j0056r111p970p651q581j0495
63405G79569j2974j5624j8113k0337k2241k3478k3637k2865k1756k0531j8913
$$ plain form
63501 357481 356152 354826 353473 351973 349911 347185 344300 341742 339720 338782 339811 342802 346361 349197
63487 349197 351499 354208 357492 360820 364128 367854 371853 375156 377056 377885 378530 379536 380828 381950 382367
63472 382367 381702 379890 377232 374338 371902 370289 369327 368649 368198 368177 368678 369724 371537 374291 377678 381304
63456 381304 385529 391235 398582 406561 414015 420692 427202 434463 443352 454348 467350 482407 500603
63443 500603 523341 550301 578719 605096 627169 644118 655855 662859 666262 667460 667809 668834 672084
63430 672084 678369 687647 700013 716152 736400 759907 785134 810493 834033 853410 867076 875152
63418 875152 878469 877334 871962 863534 853781 843690 833433 823377 814266 806296 798645 790064 779569
63405 779569 766595 750971 732858 712521 690280 666802 643165 620300 598544 578013 559100
63394E59100j6748j4285j1840r737q385p781p070n418l192j495o40Q3J268K817
63380D76677M493O139P382Q008Q611R983J1909J3531J4702J6038J7634J8935J9942
63367F33984K1344K3291K5054K6093K6353K5405K2505J7888J2866Q290L888n50
63355H46411m420p173q949r902r860q967p881p032o644p470j0326j4573j8239
63342G24975k0132k0779k0954k0579j9576j8515j7630j6232j3827j0926q120n209
63330E32496j879J525M257N373L583j709q755j4218j6334j6238j5658j4814j3402
63317D44227j1992j1096r998p950n620m114l391k842k636l111l597l180k138j370
63303C71192q85j56M96K54o62j110o40L3J63k61r26j518j713j422j027q85q35
$$ plain form
63394 559100 542352 528067 516227 506490 498105 490324 483254 477836 474644 473149 472509 472592 473860 476677
63380 476677 481170 487309 494691 502699 511310 521293 533202 546733 561435 577473 595107 614042 633984
63367 633984 655328 678619 703673 729766 756119 781524 804029 821917 834783 843073 846961 846411
63355 846411 841991 834818 825869 815967 806107 797140 789259 782227 775583 768113 757787 743214 724975
63342 724975 704843 684064 663110 642531 622955 604440 586810 570578 556751 545825 537705 532496
63330 532496 530617 532142 536399 541772 545355 543646 534891 520673 504339 488101 472443 457629 444227
63317 444227 432235 421139 411141 403191 397571 393457 390066 387224 384588 381477 377880 374700 372562 371192
63303 371192 370307 370151 370647 370901 370239 369129 368489 368522 368685 368424 367498 365980 364267 362845 361818 360933 360098
63286C60098o26m36m05j90L90P90N58K29N39J145J068J69p29r76o46q0M28O62
63268C61988P43J209K274L350L769L663L498L267K782K406K575K975K957K503
63254C99959K140K124K422L211M560N887O501O553O687O957O943O770P172Q459
63240D76345J0162J1752J3122J4331J5480J6852J8645K0500K1795K2386K2641
63229F64011K2827K2881K2735K2375K1643K0455J9203J8508J8554J9039J9692
63218H91923K0502K1404K2141K2433K2102K1066J9314J6839J3456Q975L644j865
63206A081934p105j2084j6787k0807k3795k5854k7204k7826k7704k7036k5882
63195H39850k3994k1304j8180j4981j1690q272m942j869R96L602N798P753R857
$$ plain form
63286 360098 359472 359036 358631 358441 358831 359621 360179 360408 360947 362092 363160 363329 362600 361624 360978 360898 361326 361988
63268 361988 362731 363940 366214 369564 373333 376996 380494 383761 386543 388949 391524 394499 397456 399959
63254 399959 402099 404223 406645 409856 414416 420303 426804 433357 440044 447001 453944 460714 467886 476345
63240 476345 486507 498259 511381 525712 541192 558044 576689 597189 618984 641370 664011
63229 664011 686838 709719 732454 754829 776472 796927 816130 834638 853192 872231 891923
63218 891923 912425 933829 955970 978403 1000505 1021571 1040885 1057724 1071180 1080155 1083799 1081934
63206 1081934 1074829 1062745 1045958 1025151 1001356 975502 948298 920472 892768 865732 839850
63195 839850 815856 794552 776372 761391 749701 741429 736487 734618 735614 739216 745014 752767 762624
63182G62624J2025J3751J5021J6393J7926J8900J8916J8484J8054J7383J6356
63171I45833J5583J5491J5587J5256J4546J3558J1862R234O168K966q69n614j0521
63158A049080j4862j8895k2823k5765k6894k6862k6876k6985k6488k5414k4253
63147G82963k2708k0154j7069j4637j3063j1613j0168r334q918p730n333k899
63135F39337j776j937k314k069j148n7O28P53O86Q08J066J264J410J447J104M72
63119F39674K22O67J178J154R82J209J435R76K04P5O16R58O88J38m94j291j886
63102F46505j682q38k01j04k7M10R43J201J116P55K71O2L73R41J452K060K814
63085F56051L066K352J513J831L201M209M071L466L314L668M136M572N041N629
$$ plain form
63182 762624 774649 788400 803421 819814 837740 856640 875556 894040 912094 929477 945833
63171 945833 961416 976907 992494 1007750 1022296 1035854 1047716 1056950 1063118 1066084 1065215 1059601 1049080
63158 1049080 1034218 1015323 992500 966735 939841 912979 886103 859118 832630 807216 782963
63147 782963 760255 740101 723032 708395 695332 683719 673551 664217 655299 647569 642236 639337
63135 639337 637561 635624 633310 631241 630093 630036 630664 631417 632103 632911 633977 635241 636651 638098 639202 639674
63119 639674 639896 640563 641741 642895 643877 645086 646521 647497 647701 647776 648392 649350 650038 650176 649682 648391 646505
63102 646505 644823 643985 643784 643680 643653 644063 645006 646207 647323 648078 648349 648411 648784 649725 651177 653237 656051
63085 656051 659117 661469 662982 664813 668014 672223 676294 679760 683074 686742 690878 695450 700491 706120
63071G06120O455P477Q272Q549Q803R875J1903J4217J6258J7974J9513K1059K2891
63058H79366K5050K7080K8699L0471L3132L6450L9415M1455M2881M4255M5933
63047A274187M7991N0000N1116N0876M9690M8055M5935M3566M2144M2541M3770
63036A789871M3976M2772M1524M1254M1321M0275L7227L2270K6183J9664J2412
63025B168749L334p738j9150k9116l7724m6091n4101o0280o3746o4876o4140o1567
63013A663554n7511n2769m7667m2021l6000l0141k4454j8483j2287o434j052M176
63001A338911R174J3564J7503K1389K4930K7465K9088L0410L1377L1497L1023
62990A606331L0657L0268K9237K7928K7347K7307K6338K3576J9415J4234P962
$$ plain form
63071 706120 712575 720052 728324 736873 745676 755551 767454 781671 797929 815903 835416 856475 879366
63058 879366 904416 931496 960195 990666 1023798 1060248 1099663 1141118 1183999 1228254 1274187
63047 1274187 1322178 1372178 1423294 1474170 1523860 1571915 1617850 1661416 1703560 1746101 1789871
63036 1789871 1833847 1876619 1918143 1959397 2000718 2040993 2078220 2110490 2136673 2156337 2168749
63025 2168749 2172083 2164345 2145195 2116079 2078355 2032264 1978163 1917883 1854137 1789261 1725121 1663554
63013 1663554 1606043 1553274 1505607 1463586 1427586 1397445 1372991 1354508 1342221 1335787 1334735 1338911
63001 1338911 1348085 1361649 1379152 1400541 1425471 1452936 1482024 1512434 1543811 1575308 1606331
62990 1606331 1636988 1667256 1696493 1724421 1751768 1779075 1805413 1828989 1848404 1862638 1870600
62979A870600J031n765j2623k0502k9180l7067m3312m8551n3171n6382n7722n7955
62967A449401n7722n6518n3943n0725m7727m4927m2128l9669l7662l5427l2442
62956I50511k9120k6122k3683k1944k0994k0211j8657j6489j4884j4182j3374
62945G30851j1869j0437r705r121q129p194o725o218n300m497m135l601k586j836
62931F39498j765j557p56m54j525k822k689j476q87j389j903j821j829k580l623
62916F12422m077l632k771k222k204k163j618j168j824l230l799k977k112k298
62902E76327k721k215j311j249j877k011j398q31n97j85N11R16P39K93j88p85
62886E63418j422j831j946j825j364n95MN2j74k27j70k28k01J47N22N30K99Q8
$$ plain form
62979 1870600 1871631 1865866 1853243 1832741 1803561 1766494 1723182 1674631 1621460 1565078 1507356 1449401
62967 1449401 1391679 1335161 1281218 1230493 1182766 1137839 1095711 1056042 1018380 982953 950511
62956 950511 921391 895269 871586 849642 828648 808437 789780 773291 758407 744225 730851
62945 730851 718982 708545 698840 689719 681590 674396 667671 661453 656153 651656 647521 643920 641334 639498
62931 639498 637733 636176 635420 634966 633441 630619 627930 626454 625567 624178 622275 620454 618625 616045 612422
62916 612422 608345 604713 601942 599720 597516 595353 593735 592567 590743 587513 583714 580737 578625 576327
62902 576327 573606 571391 570080 568831 566954 564943 563545 562714 562117 561932 562443 563359 564098 564391 564203 563418
62886 563418 561996 560165 558219 556394 555030 554435 554439 554491 554317 554090 553920 553692 553491 553638 554160 554690 554989 555077
62868E55077k08n81m45N49J724K152J922J813K023K143K103K300K699K660J763
62853E77694L75o95r19m48l2k66q29q65k25K78J08k86l80m34q38j297j355j175
62835E68411j090r35m80n7RR6P08J628K294K614K809K856K738K760L055L193K867
62818E93476K471K431K556K614K929L603L901L261K373K239K642K595J926J448
62804F30465J725K617L856N203O248O848P667R462J1963J4162J5626J6849J8442
62791G51133K0611K3287K6180K8830L1105L3571L6839M0835M5126M9680N4724
62780A141921O0096O5294O9957P3954P7208P9731Q1417Q1529P9013P3658O6267
62769A950045N7270M6100L2551J7841L355j0794k4957l8339m9501n8043o4693
$$ plain form
62868 555077 554869 554288 553843 554392 556116 558268 560190 562003 564026 566169 568272 570572 573271 575931 577694
62853 577694 578069 577374 576455 576007 575975 575709 574880 574015 573790 574068 574176 573890 573510 573076 572238 570941 569586 568411
62835 568411 567321 566386 565906 565849 565858 565954 566662 568290 570584 573198 576007 578863 581601 584361 587416 590609 593476
62818 593476 595947 598378 600934 603548 606477 610080 613981 617242 619615 621854 624496 627091 629017 630465
62804 630465 632190 634807 638663 643866 650114 656962 664629 674091 686054 700216 715842 732691 751133
62791 751133 771744 795031 821211 850041 881146 914717 951556 992391 1037517 1087197 1141921
62780 1141921 1202017 1267311 1337268 1411222 1488430 1568161 1649578 1731107 1810120 1883778 1950045
62769 1950045 2007315 2053415 2085966 2103807 2107162 2096368 2071411 2033072 1983571 1925528 1860835
62758A860835o9931p3567p5498p5978p5211p3409p1058o8459o5300o1346n7115
62747A093963n3204m9413m5301m1096l7195l3334k9217k5475k2906k1158j9238
62736G16426j7020j5140j3640j1910r862q102o928o010n106m251l357k300j210
62723F11590j42J238K904M052M230M302N236O588P359P902R508J2408J5498J7873
62709G10546J9446K0322K0851K2188K5341K9733L3954L7798M2148M6978N1157
62698A060462N4440N7933O2061O5560O7173O7057O5814O3198N8608N1968M3460
62687A717734L3091K1205Q739l488j5322k6761l7487m7089n5129o0936o4090o5231
62675A405236o5529o5185o3364n9811n5546n1632m8152m4825m1715l8745l5409
$$ plain form
62758 1860835 1790904 1717337 1641839 1565861 1490650 1417241 1346183 1277724 1212424 1151078 1093963
62747 1093963 1040759 991346 946045 904949 867754 834420 805203 779728 756822 735664 716426
62736 716426 699406 684266 670626 658716 648854 640752 633824 627814 622708 618457 615100 612800 611590
62723 611590 611448 612686 615590 619642 623872 628174 633410 639998 647357 655259 664767 677175 692673 710546
62709 710546 729992 750314 771165 793353 818694 848427 882381 920179 962327 1009305 1060462
62698 1060462 1114902 1172835 1234896 1300456 1367629 1434686 1500500 1563698 1622306 1674274 1717734
62687 1717734 1750825 1772030 1780769 1777281 1761959 1735198 1697711 1650622 1595493 1534557 1470467 1405236
62675 1405236 1339707 1274522 1211158 1151347 1095801 1044169 996017 951192 909477 870732 835323
62664H35323l1530k7740k4659k2189k0040j8359j7349j6680j5824j4590j3039
62653F13324j1230r352p835p041o926o987o482n014l264k667l734n198n579n044
62639E26971m688m518l610k066j192j416j623r83j69Mj50K9M00N45N56O32N54
62622E09276K79K75O68P78K46j48M62J816L121M235N418O414O762O720P021P876
62606E61219Q913R938J1117J2450J3742J5095J6920J9333K1986K4538K7035K9740
62594G72026L2744L5796L8385M0040M0606M0184L8832L6420L2727K7620K1197
62583A156577J3915O390j088q589j5901k2269k7107l0646l3369l5213l5942l5913
62571I30845l5676l5061l3490l1085k8614k6368k4018k1598j9661j8302j6907
$$ plain form
62664 835323 803793 776053 751394 729205 709165 690806 673457 656777 640953 626363 613324
62653 613324 602094 592742 584907 577866 570940 563953 557471 552457 549193 546526 542792 537594 532015 526971
62639 526971 522283 517765 514155 512089 510897 509481 507858 506875 506706 506710 506560 506589 506989 507534 508090 508722 509276
62622 509276 509555 509830 510498 511276 511522 511374 511836 513652 516773 521008 526426 532840 539602 546322 553343 561219
62606 561219 570132 580070 591187 603637 617379 632474 649394 668727 690713 715251 742286 772026
62594 772026 804770 840566 878951 918991 959597 999781 1038613 1075033 1107760 1135380 1156577
62583 1156577 1170492 1176882 1175794 1167205 1151304 1129035 1101928 1071282 1037913 1002700 966758 930845
62571 930845 895169 860108 826618 795533 766919 740551 716533 694935 675274 656972 640065
62560F40065j5128j3276j1537r657p779o676o625o757o163n042m210l860l436
62547E39919k582j644j252j573k100k243k099k235k549k025j77J843K536K073
62533E25892J914K713L788M572N261N871N986N891O694Q705J0819J2228J3719
62520F14053J6436K0119K3568K6250K8604L1160L4094L7319M0357M2376M2944
62509I57280M2513M1704M0423L8117L4633L0396K5862K1247J6629J2029P518L323
62497A271674k81l213n391o373n661l612j649j395l637p891j2534j5674j6691
62484A187672j7053j9042k3580k9618l5433l9684m1512m0769l8491l6255l4675
62473H31560l3105l0980k8573k6226k3722k0840j7845j5006j2300r942q446p765
$$ plain form
62560 640065 624937 611661 600124 590467 582688 576012 569387 562630 556467 551425 547215 543355 539919
62547 539919 537337 535693 534441 532868 530768 528525 526426 524191 521642 519617 519440 521283 523819 525892
62533 525892 527806 530519 534307 538879 544140 550011 555997 561888 568582 577287 588106 600334 614053
62520 614053 630489 650608 674176 700426 729030 760190 794284 831603 871960 914336 957280
62509 957280 999793 1041497 1081920 1120037 1154670 1185066 1210928 1232175 1248804 1260833 1268351 1271674
62497 1271674 1271393 1268180 1262789 1256416 1250755 1247143 1245494 1244099 1240462 1232571 1220037 1204363 1187672
62484 1187672 1170619 1151577 1127997 1098379 1062946 1023262 981750 940981 902490 866235 831560
62473 831560 798455 767475 738902 712676 688954 668114 650269 635263 622963 613021 604575 596810
62461E96810p007n541l783k456j633q86M8J183K452L618M367M723N037N459N887
62446F08278O388P186Q215R156R841R945Q679N678K098l81j647l072n338p615
62432F57411r178j0371j1385j1479j0233q497p320o770o499o471o429n667m160
62419E52952l062l125l472k886j537m35J25N35Q04O45L16M40J072J711K026K112
62403E48221K164K410K989L628L805L594L763M676N787O613P507Q852J0252J1184
62389F25445J1798J2425J2920J3156J3551J4359J5018J4914J4294J3660J2780
62378G74320J1170R107P366O266N662N600O185P045P681Q201R207J1045J3540
62365H82395J6345J9251K2277K5649K9350L2658L4652L5134L4543L2883K9647
$$ plain form
62461 596810 589803 584262 580479 578023 576390 575504 575552 576735 579187 582805 587172 591895 596932 602391 608278
62446 608278 614666 621852 630067 639223 649064 659009 667688 673366 675464 675083 673436 670364 665026 657411
62432 657411 648233 637862 626477 614998 604765 596268 588948 582178 575679 569208 562779 557112 552952
62419 552952 549890 546765 543293 540407 538870 538435 538560 539095 539899 540544 540860 541300 542372 544083 546109 548221
62403 548221 550385 552795 555784 559412 563217 566811 570574 575250 581037 587650 595157 604009 614261 625445
62389 625445 637243 649668 662588 675744 689295 703654 718672 733586 747880 761540 774320
62378 774320 785490 794597 801963 808229 813891 819491 825676 832721 840402 848603 857810 868855 882395
62365 882395 898740 917991 940268 965917 995267 1027925 1062577 1097711 1132254 1165137 1194784
62354A194784K4870J9374J3762Q170L187k65k445m859q247j1706j4505j7356k0816
62341A183948k3789k5052k5192k5603k6276k6129k5011k3843k3084k2333k1302
62330I16334k0167j9046j8004j7410j7506j7948j8383j8947j9554j9373j7966
62319G12030j6251j5325j4870j3780j1871r865q145o575n245m357l689k973k343
62306E96741j665k03K064L663L456K477K482L326L470K580J831J772J676J170
62292F24840P75N93L8p64p63K84J210J176Q51J139J783K002J811J915K755M154
62276F43799N584O525O944P464Q753J0710J2797J5036J7878K1154K4095K6506
62264H07245K9156L2599L6373L9691M2385M4689M6526M7281M6230M2999L7813
$$ plain form
62354 1194784 1219654 1239028 1252790 1260960 1264147 1263882 1261437 1256578 1248331 1236625 1222120 1204764 1183948
62341 1183948 1160159 1135107 1109915 1084312 1058036 1031907 1006896 983053 959969 937636 916334
62330 916334 896167 877121 859117 841707 824201 806253 787870 768923 749369 729996 712030
62319 712030 695779 680454 665584 651804 639933 630068 621923 615348 610103 605746 602057 599084 596741
62306 596741 595076 594873 596937 600600 604056 606533 609015 612341 615811 618391 620222 621994 623670 624840
62292 624840 625615 626208 626246 625482 624719 625003 626213 627389 628240 629379 631162 633164 634975 636890 639645 643799
62276 643799 649383 655908 662852 670316 679069 689779 702576 717612 735490 756644 780739 807245
62264 807245 836401 869000 905373 945064 987449 1032138 1078664 1125945 1172175 1215174 1252987
62253A252987L1343K4226J6902R947M082n93m904r708j5003k0327k5528l0426
62241A232998l4292l6462l7227l7354l6977l5705l3494l0715k7578k4243k1177
62230H77774j8716j6532j4328j2561j1657j0964r585p876o951o863o585n714m953
62217G44489m741m513l751k782k131j763j352p27J15J029J707K104K603L329L646
62202G37262L078K377K633L676M409M531M771N433N928O009O203O700O834O222
62188H06066N542N584O141O384N872M841L802L167K967K912K957L651N497Q158
62174H73541J0910J3648J6806K0396K3862K6781K9052L0358L0159K8263K4925
62163A128701K0516J5571J0837O675K708j289m595o553p948j0358j4228j8565
$$ plain form
62253 1252987 1284330 1308556 1325458 1335405 1339487 1338894 1333990 1324282 1309279 1288952 1263424 1232998
62241 1232998 1198706 1162244 1125017 1087663 1050686 1014981 981487 950772 923194 898951 877774
62230 877774 859058 842526 828198 815637 803980 793016 783431 775555 768604 761741 755156 749442 744489
62217 744489 739748 735235 731484 728702 726571 724808 723456 722729 722844 723873 725580 727684 730287 733616 737262
62202 737262 740340 742717 745350 749026 753435 757966 762737 768170 774098 780107 786310 793010 799844 806066
62188 806066 811608 817192 823333 829717 835589 840430 844232 847399 850366 853278 856235 859886 865383 873541
62174 873541 884451 898099 914905 935301 959163 985944 1014996 1045354 1075513 1103776 1128701
62163 1128701 1149217 1164788 1175625 1182300 1185008 1183719 1179124 1172571 1164623 1154265 1140037 1121472
62151A121472k2312k5012k6315k6027k4744k3357k1900j9763j7033j4606j2988
62140H87415j1943j1339j1244j1178j0416r201q654r288j0517j1645j2306j1955
62128G57729j0216p891o402n898n008k887k30K099M331O940R547J1337J1892J1053
62114G76396Q691N189J588j180k854l460l041j919o29M67R77N0k775o299q391
62099G62810q254o952n533l865j728K00J306J994K918L921M530M822N154N433
62085G66756N317M884M628N045O335Q182R838J0872J1813J3438J5527J7101J7850
62072H97586J8350J8899J9174J9229J9726K0701K1043J9623J6278J1431N629k30
62060A087439n135q867j1960j4530j6083j6756j7721j9746k2226k4134k5190k5546
$$ plain form
62151 1121472 1099160 1074148 1047833 1021806 997062 973705 951805 932042 915009 900403 887415
62140 887415 875472 864133 852889 841711 831295 822094 813440 804152 793635 781990 769684 757729
62128 757729 747513 739622 733220 727322 722314 719427 719197 721296 725627 732567 742114 753451 765343 776396
62114 776396 785087 790276 791864 790684 787830 784370 781329 779410 778781 779248 780225 780275 777500 771201 762810
62099 762810 754556 747604 742071 738206 736478 736678 737984 739978 742896 746817 751347 756169 761323 766756
62085 766756 772073 776957 781585 786630 792965 801147 810985 821857 833670 847108 862635 879736 897586
62072 897586 915936 934835 954009 973238 992964 1013665 1034708 1054331 1070609 1082040 1087669 1087439
62060 1087439 1082304 1073437 1061477 1046947 1030864 1014108 996387 976641 954415 930281 905091 879545
62048H79545k5218k4403k3648k3117k2279k0855j9434j8634j8234j7670j6808
62037F49245j5777j4527j3056j1663j0553r590q686q023p666p371o950o449n877
62024E23057n243m768m551m126k993j469l44J58L27J90k51l26O24K031K776K930
62008E08022L491M406M484L445K506K469K679K417J930J465O12p13j780k250k753
61993E30430l715m699n437o345p438p915p434o678o072n265m392m433n528o335
61979D48744n965n180m752m092k685j527j708k630k982k659k382k229j818j316
61965D06819j033n67N27J728K178J895J526J415J637K252K866K786K271K693M588
61950D33581O649P596Q005R056J0530J1487J2073J3108J4378J4858J4302J3452
$$ plain form
62048 879545 854327 829924 806276 783159 760880 740025 720591 701957 683723 666053 649245
62037 649245 633468 618941 605885 594222 583669 574079 565393 557370 549704 542333 535383 528934 523057
62024 523057 517814 513046 508495 504369 501376 499907 499563 499721 500048 500238 499987 499661 500285 502316 505092 508022
62008 508022 511513 515919 520403 523848 526354 528823 531502 533919 535849 537314 537926 537213 535433 533183 530430
61993 530430 526715 522016 516579 510234 502796 494881 487447 480769 474697 469432 465040 460607 455079 448744
61979 448744 442779 437599 432847 428755 426070 424543 422835 420205 417223 414564 412182 409953 408135 406819
61965 406819 405786 405219 405746 407474 409652 411547 413073 414488 416125 418377 421243 424029 426300 428993 433581
61950 433581 440230 447826 455831 464887 475417 486904 498977 512085 526463 541321 555623 569075
61938E69075J2838J2473J2345J2287J1680J0273Q810P942P071N334L111J431L04
61925F74974j072k765l952m231m047l816l444k669j207J262M598P890J0206J1429
61911F83156J1956J2068J1941J1686J0863Q696N387K309K84j458l770o081p395
61898G39642p886q347q790q704q129p402o532n763n902p035p803p292o733p745
61884F35579r703j0558r819q845q436p920o739n329m036k571r11L69R91J395J965
61869E65432K632L344M257N359O457P565Q795J0073J1415J3101J5085J6771J7952
61856F88238J9324K1348K3273K4207K4454K4787K5037K4500K3182K1533J9427
61845I39310J6464J2848Q937M554j86m063o067o822p387p341n679k922n18J517
$$ plain form
61938 569075 581913 594386 606731 619018 630698 640971 649781 657723 664794 670128 673239 674670 674974
61925 674974 673902 671137 667185 662954 658907 655091 651647 648978 647771 649033 653631 661521 671727 683156
61911 683156 695112 707180 719121 730807 741670 750366 755753 758062 758346 756888 753118 747037 739642
61898 739642 731756 723409 714619 705915 697786 690384 683852 678089 672187 665152 657349 650057 643324 635579
61884 635579 625876 615318 605499 596654 588218 580298 573559 568230 564194 561623 560712 561081 562072 563467 565432
61869 565432 568064 571408 575665 581024 587481 595046 603841 613914 625329 638430 653515 670286 688238
61856 688238 707562 728910 752183 776390 800844 825631 850668 875168 898350 919883 939310
61845 939310 955774 968622 977559 982113 981927 977864 971797 964975 957588 950247 944568 941646 941128 942645
61831I42645M380P961J0507J1052J0463R595P995N115J479k087n476q942j2383
61818I82304j5445j7740j8985j9421j9940k0995k1633k0609j8259j6170j5138
61807G77969j4488j3472j2082j0443q489o494n044m286l933l939m342m669m408
61794F81880l870l622l285k104n37P1o21j573j984k047k006j707j356j569k305
61779F53365k678k170j191k38P04J680K480K924K904K318J567J710L177M766N114
61764F76432M750N297O849P722O887N093L288J323j134l667n630o849p404p449
61750F85508p384p452p146n959m535m064m525m722m082l208k570j920j197p93
61736F25951o33j59N36O96K12j73k26n50j233j389n68M47P44L45k53p36r15q53
$$ plain form
61831 942645 947025 954986 965493 976545 987008 996603 1004598 1009713 1011192 1009105 1003629 994687 982304
61818 982304 966859 949119 930134 910713 890773 869778 848145 827536 809277 793107 777969
61807 777969 763481 750009 737927 727484 718995 712501 707457 703171 699238 695299 690957 686288 681880
61794 681880 678010 674388 671103 668999 668462 668533 667912 666339 664355 662308 660302 658595 657239 655670 653365
61779 653365 650687 648517 647326 647088 647792 649472 651952 654876 657780 660098 661665 663375 666552 671318 676432
61764 676432 681182 686479 693328 701050 707937 713030 716318 717641 716507 712840 707210 700361 692957 685508
61750 685508 678124 670672 663526 657567 653032 648968 644443 639721 635639 632431 629861 627941 626744 625951
61736 625951 625318 625159 625695 626391 626603 626430 626204 625654 624421 623032 622464 622911 623655 624000 623747 623011 622096 621243
61718F21243j130k178l281l290k367j901k586l706m496m953n099m703m081l987
61704E73485m377m397l840l424l389l126k529k397k994l512l483l497l973m347
61690E24200m125l665l382l165l060l414l911l554k190r28n54o01m99n10r27j363
61674D88352j441j309j081p08p09j769l324l823k874j816j629j738j489j329j598
61659D61715j583q20r7o9n2P60J885K486K744L202L606L518L330L556L721K966
61643D90868J298n40j945k623k547k314k801l847m178l246k121j935k397k703
61629D58969k881l231l337k754j950j600j571j402j140q69k73N62P21k27j295
61614D37722j442j059j157j808k437k924l369l394k775k185k309k744k761k540
$$ plain form
61718 621243 620113 617935 614654 611364 608997 607096 604510 600804 596308 591355 586256 581553 577472 573485
61704 573485 569108 564711 560871 557447 554058 550932 548403 546006 543012 539500 536017 532520 528547 524200
61690 524200 520075 516410 513028 509863 506803 503389 499478 495924 493734 492806 492252 491651 491152 490642 489715 488352
61674 488352 486911 485602 484521 483813 483104 481335 478011 474188 471314 469498 467869 466131 464642 463313 461715
61659 461715 460132 459312 459215 459146 459094 459854 461739 464225 466969 470171 473777 477295 480625 484181 487902 490868
61643 490868 492166 491626 489681 487058 484511 482197 479396 475549 471371 468125 466004 464069 461672 458969
61629 458969 456088 452857 449520 446766 444816 443216 441645 440243 439103 438234 437961 438523 439244 439017 437722
61614 437722 436280 435221 434064 432256 429819 426895 423526 420132 417357 415172 412863 410119 407358 404818
61600D04818k633k799k470j848j491j242p24l55p26j388j422r51q57j189j078
61585C83645k31N49N47n0o93j080j107p70k87P1K67K89r4r73j895k198j670n93
61567C73727N15J039O32k15m42L29J340J780J738J643J461J036O33N02M30K43
61551C86391K73O99J027Q25N03O75J206J543J618J772K113K481K782K974L004
61536D09886L026L273L477L082K231J772J912J750O16r21j967k421k563k306j614
61521D19233j009r53j236j480j676j733j293m73k2k40n22m89o05j136j559j643
61505D03164j938k399j826K20K152K356J500J373K235K865K727K474K534K560
61491D19997K319K036J785J341O39k29j193j892j765r45m25o32o99M9P85M72l57
$$ plain form
61600 404818 402185 399386 396916 395068 393577 392335 391611 391256 390530 389142 387720 386769 385912 384723 383645
61585 383645 383414 383963 384510 384460 383767 382687 381580 380810 380523 380594 380861 381150 381056 380083 378188 375990 374320 373727
61567 373727 374242 375281 375913 375698 375256 375585 376925 378705 380443 382086 383547 384583 385216 385718 386148 386391
61551 386391 386664 387363 388390 389215 389718 390393 391599 393142 394760 396532 398645 401126 403908 406882 409886
61536 409886 412912 416185 419662 422744 424975 426747 428659 430409 431025 430104 428137 425716 423153 420847 419233
61521 419233 418224 417271 416035 414555 412879 411146 409853 409380 409358 409118 408596 408107 407502 406366 404807 403164
61505 403164 401226 398827 397001 397221 399373 401729 403229 404602 406837 409702 412429 414903 417437 419997
61491 419997 422316 424352 426137 427478 428117 427888 426695 424803 423038 422093 421668 421036 420337 420386 421171 421643 421286
61474D21286l83N52J540K096K341K118J306O32R22J756K012J563J274J467J624
61459D42106J450J230J070Q02N68O80R27R01Q01J148J863K449K790L014K906K352
61443D67057J979K411L187L435L302L628M449M995N060N255N758N938N364M359
61429E26177L380K556J973J731J541Q95k52j383j980j908j399j008j313k230l022
61414E23758l279l441l917m339m257l935l760l472k745k027j923k202k169j664
61400D80628j047o34p08j505k583k886k081j118q03o85j37M48N28M77P10O87J9
61383D69310l21O59K159K637K102J857K422L221L967M796N277M801L893L761M573
61368E15114N321N356M932M389L909L961M854N976O493O570P018Q052R336J0757
$$ plain form
61474 421286 420903 421455 422995 425091 427432 429550 430856 431488 432410 434166 436178 437741 439015 440482 442106
61459 442106 443556 444786 445856 446658 447226 447906 448833 449734 450535 451683 453546 455995 458785 461799 464705 467057
61443 467057 469036 471447 474634 478069 481371 484999 489448 494443 499503 504758 510516 516454 521818 526177
61429 526177 529557 532113 534086 535817 537358 538253 538001 536618 534638 532730 531331 530323 529010 526780 523758
61414 523758 520479 517038 513121 508782 504525 500590 496830 493358 490613 488586 486663 484461 482292 480628
61400 480628 479581 478947 478239 476734 474151 471265 469184 468066 467263 466578 466441 466889 467417 467894 468604 469291 469310
61383 469310 468989 469648 471807 474444 476546 478403 480825 484046 488013 492809 498086 502887 506780 510541 515114
61368 515114 520435 525791 530723 535112 539021 542982 547836 553812 560305 566875 573893 581945 591281 602038
61354F02038J2029J2026R912O541L573J545j8j119j420j475k288l766m916n418
61340F27244n744n990n948n996o543o855n913m162k950k488j900j038n82m90J3
61325E70658Q42J164J058J529K704L625L950M324N031N726O652Q506J0956J2801
61311F39526J3823J4879J6040J6222J4967J2963J0570P443L954J383J38p58j937
61298G49213k940l533m252n133n394m983m983n888o813p033p006p159o984o084
61284F71028m964m111l244k070q37L24J566K566K650K054J875K435K911K889L014
61269F78086L679M509N635P961J1392J4075J4317J2301R199N731K312m38k350
61256G66409m122o251q154q911q419p314o235n461m739l505j769n33m63n57N67
$$ plain form
61354 602038 614067 626093 636005 642546 646119 647664 647646 646527 645107 643632 641344 637578 632662 627244
61340 627244 621500 615510 609562 603566 597023 590168 584255 580093 577143 574655 572755 571717 571135 570645 570658
61325 570658 571500 572664 573722 575251 577955 581580 585530 589854 594885 600611 607263 615769 626725 639526
61311 639526 653349 668228 684268 700490 715457 728420 738990 746433 750387 751770 751908 751150 749213
61298 749213 746273 742740 738488 733355 727961 722978 717995 712107 705294 698261 691255 684096 677112 671028
61284 671028 666064 661953 658709 656639 655802 656126 657692 660258 662908 664962 666837 669272 672183 675072 678086
61269 678086 681765 686274 691909 699870 711262 725337 739654 751955 761154 766885 769197 768759 766409
61256 766409 762287 756036 747882 738971 730552 723238 717003 711542 706803 703298 701529 700996 700533 699976 700543
61241G00543K364K915J780N47L49O16P64J356K769M152M728M901N241N431N004
61226G43460M276L860M051N017O671Q097Q276P671P876R269J0390J0075Q926P997
61212H45912P405O942O950P768R141J0698J2251J3393J3847J4298J5683J7588
61200I81876J8768J9245K0174K1384K0984J8047J3833R677N525J477j191j833
61188A127966j774k530l941n202o374p785r062r950j0982j2325j3079j2686j1925
61175A020351j1587j1260j0335r070p792o175m238k797j993o71J875M736O902
61162I67946Q666J0535J2123J3223J4723J7229J9923K1848K3189K4240K4283K2647
61150A180575J9798J6443J2760R397P720P948Q522Q493R000J0997J3179J3810
$$ plain form
61241 700543 702907 705822 707602 708149 708498 709114 709878 711234 714003 718155 722883 727784 733025 738456 743460
61226 743460 747736 751596 755647 760664 767335 775432 783708 791379 799255 808524 818914 828989 837915 845912
61212 845912 853317 860259 867209 874977 884118 894816 907067 920460 934307 948605 964288 981876
61200 981876 1000644 1019889 1040063 1061447 1082431 1100478 1114311 1123988 1129513 1130990 1129799 1127966
61188 1127966 1126192 1123662 1119721 1114519 1108145 1100360 1091298 1081348 1070366 1058041 1044962 1032276 1020351
61175 1020351 1008764 997504 987169 978099 970307 964132 959894 957097 955104 954433 956308 961044 967946
61162 967946 976612 987147 999270 1012493 1027216 1044445 1064368 1086216 1109405 1133645 1157928 1180575
61150 1180575 1200373 1216816 1229576 1238973 1246693 1254641 1263163 1271656 1280656 1291653 1304832 1318642
61138A318642J3237J2821J2627J2076J1681J2189J2821J2261J0759R514Q651P423
61126A454702N878M665L705K561J637J507J561O78j133k986m465n551n904n543
61112A451312n586o964q991j0457j1522j3171j5488j7863k0308k3179k5964k7678
61100A264141k8133k7750k6710k5279k4308k4192k3975k2568k0328j8372j7107
61089A005419j6400j6261j6259j5298j3172j1359j0903j0721r440p790p276p526
61077H63014o956n390m126l799l909m097m298m026k944j745j123n17P92K168K758
61062H25802L248M780O892Q311R066R972J0757J0698J0473J1290J2625J2933J2303
61049I49150J2315J3448J4563J4927J4878J4615J4059J3770J4319J4956J4595
$$ plain form
61138 1318642 1331879 1344700 1357327 1369403 1381084 1393273 1406094 1418355 1429114 1438628 1447279 1454702
61126 1454702 1460580 1465245 1468950 1471511 1473148 1474655 1476216 1476894 1475761 1472775 1468310 1462759 1456855 1451312
61112 1451312 1445726 1438762 1429771 1419314 1407792 1394621 1379133 1361270 1340962 1317783 1291819 1264141
61100 1264141 1236008 1208258 1181548 1156269 1131961 1107769 1083794 1061226 1040898 1022526 1005419
61089 1005419 989019 972758 956499 941201 928029 916670 905767 895046 885606 877816 870540 863014
61077 863014 856058 850668 846542 842743 838834 834737 830439 826413 823469 821724 820601 820084 820876 823044 825802
61062 825802 829050 833830 840722 849033 858099 868071 878828 889526 899999 911289 923914 936847 949150
61049 949150 961465 974913 989476 1004403 1019281 1033896 1047955 1061725 1076044 1091000 1105595
61038A105595J3801J4042J5302J6386J7134J8425K0285K2050K4159K7643L1965
61027A326787L5427L7613L9441M1050M1984M3226M6708N2725O0150O9020Q0284
61016A874415R3027J04826J15215J26183J39143J54536J74712K03690K43144K92080
61006C520971L51196M23385N08803O05013P15123Q50576J021965J233589J491500
60997A0722121J800837K126999K353453K311700J900316J195136M29231j54214
60989B2685579m37248m34866k15134J40448N00025O67408M74899q4217q28612
60980B2468282j507407j951395k129531k101090j944878j725062j487718j262144
60972H359057j061640q88967p43165o21849n21009m36483l65843l07956k61476
$$ plain form
61038 1105595 1119396 1133438 1148740 1165126 1182260 1200685 1220970 1243020 1267179 1294822 1326787
61027 1326787 1362214 1399827 1439268 1480318 1522302 1565528 1612236 1664961 1725111 1794131 1874415
61016 1874415 1967442 2072268 2187483 2313666 2452809 2607345 2782057 2985747 3228891 3520971
61006 3520971 3872167 4295552 4804355 5409368 6124491 6975067 7997032 9230621 10722121
60997 10722121 12522958 14649957 17003410 19315110 21215426 22410562 22839793 22685579
60989 22685579 22248331 21813465 21598331 21738779 22238804 22906212 23381111 23296894 22468282
60980 22468282 20960875 19009480 16879949 14778859 12833981 11108919 9621201 8359057
60972 8359057 7297417 6408450 5665285 5043436 4522427 4085944 3720101 3412145 3150669
60963C150669k24631j95607j72439j53127j36439j22105j09958r9387q9733q0709
60953A766534p2227o4313n7373n2140m9066m7922m7823m7587m6339m4087m1641
60942A196016l9678l8099l6341l4045l1181k7954k4807k2226k0353j8939j7774
60931H84619j6775j5750j4491j3150j2043j1042r765q374p537p440p446o933n990
60918G47883n118m690m778n051m882m055l215l059l359l518l764m748o163p021
60904F84462p231p676q513q733p834o634n972n685n466n569n932n655m231k466
60890E96865j354p62o3O24P82N82P32J432K298L084L793M132L554J997K04r15
60874F16985j206j390k161l198l419k333p55J85L00J43P2J50N87J414J993J651
$$ plain form
60963 3150669 2926038 2730431 2557992 2404865 2268426 2146321 2036363 1936976 1847243 1766534
60953 1766534 1694307 1629994 1572621 1520481 1471415 1423493 1375670 1328083 1281744 1237657 1196016
60942 1196016 1156338 1118239 1081898 1047853 1016672 988718 963911 941685 921332 902393 884619
60931 884619 867844 852094 837603 824453 812410 801368 791603 783229 775692 768252 760806 753873 747883
60918 747883 742765 738075 733297 728246 723364 719309 716094 713035 709676 706158 702394 697646 691483 684462
60904 684462 677231 669555 661042 652309 644475 637841 631869 626184 620718 615149 609217 603562 599331 596865
60890 596865 595511 594749 594686 595310 596092 596674 597406 598838 601136 604220 608013 612145 615699 617696 617900 616985
60874 616985 615779 614389 612228 609030 605611 603278 602523 602708 603008 603151 603223 603373 603960 605374 607367 609018
60858F09018O37l64j327k635l984m562m194l387k391j231m58p46j839k971m182
60843E75384o036q184r545r932j0127j0235r443p652n908m825l881k787k192k385
60829D82252k569k055j242p40m63j39J26K78M82N74J89l66l76l6k84j063j153
60812D73415j57P37O58L39P08J421J753J792J819J424L19p95j148j062j309j913
60796D78001k371k476k257j682j048j077j975l007l458l423l231k912k674l047
60782D43363l873m009k856j442j155j970k728k713k154j519j029o67k75K35N92
60767D17800M36k6j48L17J088K015L130L937L661K481J647J980L030L917M253
60752D49518L963L114K261K151K829L694M429M983M679K720k28k305k790k832
$$ plain form
60858 609018 609655 609291 607964 605329 601345 596783 592589 589202 586811 585580 585122 584376 582537 579566 575384
60843 575384 569348 561164 551619 541687 531560 521325 511882 504230 498322 493497 489616 486829 484637 482252
60829 482252 479683 477628 476386 475646 475183 475044 475170 475448 475930 476504 476693 476327 475951 475915 475631 474568 473415
60812 473415 473258 473995 474653 474992 475700 477121 478874 480666 482485 483909 484228 483433 482285 481223 479914 478001
60796 478001 475630 473154 470897 469215 468167 467090 465115 462108 458650 455227 451996 449084 446410 443363
60782 443363 439490 435481 432625 431183 430028 428058 425330 422617 420463 418944 417915 417248 416973 417208 417800
60767 417800 418236 418210 418062 418379 419467 421482 424612 428549 432210 434691 436338 438318 441348 445265 449518
60752 449518 453481 456595 458856 461007 463836 467530 471959 476942 481621 484341 484113 481808 479018 476186
60738D76186l420l933l416k119r22k06K9j81m30j70L06P0q09j103m39r3j081k644
60720D55625l500l460k948k067j126j061k209l518l873l483l143k959k669k434
60706D17175k442k401k167k142k450k467j769p59J66J048J570J025k87q72k9J151
60690D04350J555J600K082K744L021L079L128K793K192K413L737M688M182L385
60676D44949L856M949M779L061J163j47j317k560l381l563l491l390l140k779
60662D38989k428j966j343q81o93l27M53J159J430J668K170K560K685L117L874
60647D50467L700J719j062k940l498l333k793k088j876k433k839k186j033m80
60633D29325m95l63j60m81j075j038j92P95J354J360Q32J46M7O91J141O23l61
$$ plain form
60738 476186 472766 468833 465417 463298 462376 462170 462199 462018 461588 461418 461724 461794 460985 459882 459443 459350 458269 455625
60720 455625 452125 448665 445717 443650 442524 441463 439254 435736 431863 428380 425237 422278 419609 417175
60706 417175 414733 412332 410165 408023 405573 403106 401337 400578 400744 401792 403362 404387 404100 403228 403199 404350
60690 404350 405905 407505 409587 412331 415352 418431 421559 424352 426544 428957 432694 437382 441564 444949
60676 444949 448805 453754 458533 461594 462757 462610 461293 458733 455352 451789 448298 444908 441768 438989
60662 438989 436561 434595 433252 432371 431678 431351 431804 432963 434393 436061 438231 440791 443476 446593 450467
60647 450467 454167 455886 454824 451884 448386 445053 442260 440172 438296 435863 433024 430838 429805 429325
60633 429325 428830 428467 428307 427826 426751 425713 425521 426316 427670 429030 429862 430008 430055 430746 431887 432510 432149
60616D32149q80q23n23M8P61Q57mr16r27l71k5J92O41R15N49K4m7l3l83m38N81
60595D31347K056K753K561K256K160K230K845M124N069M622L225K103J550J032
60581D69933N03L76N79P60J010J480J824J912K369L403M058L732L540M757O824
60566E07060Q333R111R818J0201R558Q334P612P352O666N420M107K519J49k383
60552E93857l776l700k781j351M48J850K248K465L785O059Q120R716J1659J4356
60538F42955J7489K0853K4337K7473L0103L2742L5126L5344L1972K6100J9670
60527I44164J2761M541l957j0476j4545j7556j9957k0639j9314j7330j5744j4235
60515H07713j2344j0256q117n905m090l167k493q71J874N052Q473J2258J5850
$$ plain form
60616 432149 431269 430446 429923 429971 430732 431589 431585 430669 429742 429371 429346 429538 430179 431094 431643 431667 431620 431587 431204 430766 431347
60595 431347 433403 436156 438717 440973 443133 445363 448208 452332 457401 462023 465248 467351 468901 469933
60581 469933 470436 470812 471391 472151 473161 474641 476465 478377 480746 484149 488207 491939 495479 500236 507060
60566 507060 515393 524504 534322 544523 554081 562415 570027 577379 584045 589465 593572 596091 596240 593857
60552 593857 590081 586381 583600 582249 582697 584547 586795 589260 593045 599104 607224 616940 628599 642955
60538 642955 660444 681297 705634 733107 763210 795952 831078 866422 898394 924494 944164
60527 944164 956925 961466 957509 947033 932488 914932 894975 874336 855022 837692 821948 807713
60515 807713 795369 785113 776996 771091 767001 763834 761341 760470 762344 767396 775869 788127 803977
60502H03977J8759K1898K6578L2594L8888M5336N2070N7758O0864O2079O3099
60491A283900O3366O0692N5015M8718M2820L5500K5050J1952k701j8458l4300
60480A571554m8246n9254o7815p3964p6574p5395p1967o7642o2335n6019m9711
60469H62632m4089l8661l3222k8609k5228k2311j9403j7106j5640j4145j2213
60458E92005j0627r836r149q196p612p532o908n293l816l465l724l758l602l303
60444E05184k307p07K73N5l05P4M23k09j207j424j001q57j122j171p52r7N80R98
60426D96428Q33L54L97J092J462Q42k0oR18J880K232K001J661J760K258K240R95
60409E17327o75j265o06L9kJ1O76J471J792J788J661J250Q55J300K587L566L542
$$ plain form
60502 803977 822736 844634 871212 903806 942694 988030 1040100 1097858 1158722 1220801 1283900
60491 1283900 1347266 1407958 1462973 1511691 1554511 1590011 1615061 1627013 1624312 1605854 1571554
60480 1571554 1523308 1464054 1396239 1322275 1245701 1170306 1098339 1030697 968362 912343 862632
60469 862632 818543 779882 746660 718051 692823 670512 651109 634003 618363 604218 592005
60458 592005 581378 571542 562393 554197 546585 539053 532145 526852 523036 519571 515847 512089 508487 505184
60444 505184 502877 502170 502443 502498 502193 502267 502690 502481 501274 499850 498849 497992 496870 495699 494947 494850 495430 496428
60426 496428 497261 497615 498012 499104 500566 501408 501388 501382 502300 504180 506412 508413 510074 511834 514092 516332 517327
60409 517327 516652 515387 514781 514820 514818 514829 515505 516976 518768 520556 522217 523467 524322 525622 528209 531775 535317
60392E35317L216L466M123M535M542M324M001L807L937M055L672L086L087L682
60378E88850M146M213M136L699K560J497J724K788K834J295k41m09L03R08J427
60363F19730K195K909L252L521M066M934O376Q656J1118J2535J2606J1958J0718
60350G14574Q431N465K821L92k863o653r073r103p844o738o191o350p402q497
60336F60969q134o329m789m370m114l363k808k694k053p62l08j320k225j636k92
60321F15772P22J887L897N950P053P682Q616R358R145Q330P363N567K376j194
60307F92524l673m859n277m901l509j471P65L003M436L819J373q77j759k469m374
60292F72751o776q221q646q838q953q953r334j0092j0064q560o553n150m110l053
$$ plain form
60392 535317 538533 541999 546122 550657 555199 559523 563524 567331 571268 575323 578995 582081 585168 588850
60378 588850 592996 597209 601345 605044 607604 609101 610825 613613 616447 617742 617501 617092 617395 618303 619730
60363 619730 621925 624834 628086 631607 635673 640607 646983 655639 666757 679292 691898 703856 714574
60350 714574 723005 728470 731291 731683 728820 722167 713094 703991 696147 689409 683218 676868 669466 660969
60336 660969 652835 646506 641717 637347 633233 629870 627062 624368 622315 621553 621245 619925 617700 616064 615772
60321 615772 616494 618381 622278 628228 635281 642963 651579 660937 670082 678412 685775 691342 693718 692524
60307 692524 688851 683992 678715 673814 670305 668834 669599 672602 677038 680857 682230 681353 679594 677125 672751
60292 672751 665975 657754 649108 640270 631317 622364 613030 602938 592874 584314 577761 572611 568501 565448
60278E65448k687l373l841k925j422o92n05R6R02J119R50J046J261J303J727K824
60262E61231L569L079K177K036K240J759Q13K34j67r06j401r37l35q86k260l017
60246E67229k780k305j898j254n40k37j02M78J420K173K613K857K793K637L202
60231E76286M715O171O735O827P026O997O501O267O704O959O412N933O324O819
60217F66676O532O089O329O619O057N236N121N245M684L803L329K771J466J42
60203G30099l37p81k318m247n163n330n963o931p199o861o739o571n509l822k371
60188F59957j008O66J756J298K59K73J028J071N39P91J742K021J568J632K205
60173F75798J763p7j770k121j626j143q17o47p60q32m85j90n70j053n33Q52J981
$$ plain form
60278 565448 562761 559388 555547 552622 551200 550508 550003 550099 551001 552120 553070 554116 555377 556680 558407 561231
60262 561231 564800 567879 570056 572092 574332 576091 576904 577138 576971 576065 574664 573727 573392 572506 570246 567229
60246 567229 564449 562144 560246 558992 558452 558215 558113 558591 560011 562184 564797 567654 570447 573084 576286
60231 576286 581001 587172 593907 600734 607760 614757 621258 627525 634229 641188 647600 653533 659857 666676
60217 666676 673208 679297 685626 692245 698302 703538 708659 713904 718588 722391 725720 728491 729957 730099
60203 730099 729762 728981 726663 722416 717253 711923 705960 699029 691830 684969 678230 671659 666150 662328 659957
60188 659957 658949 659615 661371 662669 662928 663201 664229 665300 665839 666630 668372 670393 671961 673593 675798
60173 675798 677561 677484 675714 673593 671967 670824 670007 669360 668600 667768 667283 667093 666523 665470 664937 665789 667770
60156F67770K492K896L338L655M242N333N926N019L462K883L238L236K769K866
60142G19125L562L754L310L354M361N667O857P962Q283O881M333K310J260J13
60128G81132j642l182l905m186m341m183l794l521l199k571k265l001m075m164
60114G33103l407l145l733m225m106l783l394k675j910j549j056L46K002K497
60100G04965J869J495J909K423K746L228L539K878J571Q46R82J215J332J730K041
60085G34769J454L75o1Ro40k167l595m853o865r484j1239j1460j0925j0191r039
60070F56088p715o979o606n525l735k400j935j544q50l01J25R28J756J754J272
60055F24333J450K120K089J526J943L528M574M016K637J258l24k101l368l981
$$ plain form
60156 667770 670262 673158 676496 680151 684393 689726 695652 700671 704133 707016 710254 713490 716259 719125
60142 719125 722687 726441 729751 733105 737466 743133 749990 757952 766235 773116 777449 779759 781019 781132
60128 781132 779490 776308 772403 768217 763876 759693 755899 752378 749179 746608 744343 741342 737267 733103
60114 733103 729696 726551 722818 718593 714487 710704 707310 704635 702725 701176 700120 700466 702468 704965
60100 704965 706834 708329 710238 712661 715407 718635 722174 725052 726623 727469 728451 729666 730998 732728 734769
60085 734769 736223 736598 736537 736546 735906 733739 730144 725291 718426 708942 697703 686243 675318 665127 656088
60070 656088 648373 641394 634788 629263 625528 623128 621193 619649 618799 618498 618623 619551 621307 623061 624333
60055 624333 625783 627903 629992 631518 633461 636989 641563 645579 648216 649474 649150 647049 643681 639700
60041F39700m570n053m639l580l135l484l416k469j589j362j369j563k477l797
60027E97197m565n027o246p747p754o117m727m481m162k995k010j978k202k201
60013E34985k565l153k583n89J114J426J329J761J961J256N59P63J236J232J228
59998E39960J675J955J769K007L044L696L053J958J415J018J22p20q43p57j185
59983E58167j801k028k081k273k317k025j688j161J23J717K242J499J004J668
59969E51046K637L217M142N826P148P254P022P375P542O407M380K466O57j423
59955F15696l272m228m609n090n646n980o104n842m708k984j823j549j102J47
59941E62906J344J778K179L355M740N390N425N555N897O148O074N353L760J855
$$ plain form
60041 639700 635130 630077 625438 621858 618723 615239 611823 609354 607765 606403 605034 603471 600994 597197
60027 597197 592632 587605 581359 573612 565858 559741 555014 550533 546371 543376 541366 539388 537186 534985
60013 534985 532420 529267 526684 526095 527209 528635 529964 531725 533686 534942 535501 536264 537500 538732 539960
59998 539960 541635 543590 545359 547366 550410 554106 557159 559117 560532 561550 561672 560952 560109 559352 558167
59983 558167 556366 554338 552257 549984 547667 545642 543954 542793 542916 544633 546875 548374 549378 551046
59969 551046 553683 556900 561042 566868 574016 581270 588292 595667 603209 609616 613996 616462 617119 615696
59955 615696 612424 608196 603587 598497 592851 586871 580767 574925 570217 567233 565410 563861 562759 562906
59941 562906 564250 566028 568207 571562 576302 581692 587117 592672 598569 604717 610791 616144 619904 621759
59927F21759M56p33k603m631n024l376j384m45j61J79N46J284L348O412Q558Q820
59911F33005Q376Q321Q058O906N437M112K321k1j736k335k965m213m844m012k861
59896F53549k550k484j905j442j491r29R12K702L226L409M486N779O200O356P162
59881F82980P810P150N859N174M681L428K196K438L665L982K750R96l75j208j435
59866G30091j178j174j912k933l822n025o705p836p526o256m823l217j577p68
59852F75339p55J21K800N862P655Q649J0009J1186J0772Q711O013L280J093P41
59838G51476K900O398R659J2237J3717J2762R025M515J156j729n461r073j0640
59825G96942j0471j0430j0758j0036p935n809m676m374m558m958m958m348m055
$$ plain form
59927 621759 622215 621482 618879 614248 609224 605848 604464 604019 603858 604037 604583 605867 609215 615627 624185 633005
59911 633005 641381 649702 657760 664666 670103 674215 676536 676515 674779 672444 669479 665266 660422 656410 653549
59896 653549 650999 648515 646610 645168 643677 642748 643660 646362 649588 652997 657483 663262 669462 675818 682980
59881 682980 690790 697940 703799 708973 713654 717082 719278 721716 725381 729363 732113 733109 732734 731526 730091
59866 730091 728913 727739 725827 722894 719072 714047 707342 699506 691980 685724 680901 677684 676107 675339
59852 675339 674584 674705 677505 683367 691022 699671 709680 720866 731638 740349 746362 749642 750735 751476
59838 751476 754376 760774 770433 782670 796387 809149 818174 822689 823845 822116 816655 807582 796942
59825 796942 786471 776041 765283 755247 747312 741503 736827 732453 727895 722937 717979 713631 709576
59812G09576m784n568n071l671k770k723k891l089l473l602l075k466k448k699
59798F61246k807l236m170m543l608k333j777j372l45N95O54O49J384J811R19
59783F43067Q1J135L276M313M049L937M203L903L269L436M217M453M252M663N453
59768F97707N498N039N367O401O748O074N431N360N438N589O004O085N240M432
59754G76413N109O937Q311Q707Q798Q742Q285P928Q105P768N814L293J998J556
59740H67764K91j604k393k021k244l480m122l339k178j401m71P36J253P08kk54
59724H47243m25o93o16j64J38K35N16P78O31O42J636L034L516L020K599K591K549
59707H67230K643L317L936L489K358J667J327O22J69J135K777L107J890P57L51
$$ plain form
59812 709576 704792 699224 694153 690482 687712 684989 682098 679009 675536 671934 668859 666393 663945 661246
59798 661246 658439 655203 651033 646490 642882 640549 638772 637400 637055 637650 638304 638953 640337 642148 643067
59783 643067 643148 644283 647559 651872 655921 659858 664061 667964 671233 674669 678886 683339 687591 692254 697707
59768 697707 703205 708244 713611 720012 726760 732834 738265 743625 749063 754652 760656 766741 771981 776413
59754 776413 781522 788459 796770 805477 814275 823017 831302 839230 847335 855103 860917 864210 866208 867764
59740 867764 868055 866451 864058 862037 859793 856313 852191 848852 846674 845273 844802 845538 846791 847499 847497 847243
59724 847243 846818 846125 845509 845345 845483 845718 846234 847012 847643 848285 849921 852955 856471 859491 862090 864681 867230
59707 867230 869873 873190 877126 880615 882973 884640 885967 886589 886758 887893 890670 893777 895667 896424 896775
59692H96775l10j528k175j689q08n5O73P87p25l388n326n679n311n026m758m676
59676H56781n265o099o090n189m341l790k929j724p19K00J426K377K310J941K364
59661H31253K935K326J146J047J681J103r02k609l511m908p081q596r018r697
59647G95169j1110j1857j1148j0029r290q312o793n591n016m183k887k235k776
59634G03942l784m984o976r358j0479r932r311r586r650q410o527n064l980k972
59620F02929k409k514k779k877l021l034k408j492j110r00L52K419L570L125K303
59605E92154K084K044J788J758K004J821J137P67Q74P56M01N43J004P56j10l67
59589F09414J73M31K18N80J658K285K107K014K064J204m91j490j329j242j699
$$ plain form
59692 896775 896465 894937 892762 891073 890265 890210 890883 891670 890945 887557 882231 876552 871241 866215 861457 856781
59676 856781 851516 845417 839327 834138 829797 826007 823078 821354 820635 820835 822261 824638 826948 828889 831253
59661 831253 834188 836514 837660 838707 840388 841491 840589 837980 834469 829561 822480 813884 804866 795169
59647 795169 784059 772202 761054 751025 741735 733423 726630 721039 716023 711840 708953 706718 703942
59634 703942 700158 695174 688198 678840 668361 658429 649118 639532 629882 621472 614945 609881 605901 602929
59620 602929 600520 598006 595227 592350 589329 586295 583887 582395 581285 580385 580737 583156 586726 589851 592154
59605 592154 594238 596282 598070 599828 601832 603653 604790 605557 606431 607187 607588 608131 609135 609891 609781 609414
59589 609414 609587 610018 610236 610816 612474 614759 616866 618880 620944 622148 621657 620167 618838 617596 615897
59574F15897j645q36o57j629k388k005j317r73k91R94J791J530J067R06M47l05
59558F10586k86N08N76n40j357r61k64J15R80K567L693M026N010P293R593J1416
59542F52955J4526J9764K4293K4072J7966Q290j378p911r917q696o865n378l350
59529G18371q86L02j79m70M24J001L7j351k005k714m281n711o101o351p276p911
59513F74899p399o689o615o253m913l838l983l994k500o77k77o83j95R77J346
59498F29206P68L21K72J08p5J98O69Q53R50J190J123O13M65J039J438J048O37
59481F40823Q96J229J175J466K510L276K967K342K172J917J232J156K342L626
59467F69129L881L737M028M118L437L134M334O066O709O386O198O156N614M777
$$ plain form
59574 615897 614252 613416 612759 611130 608742 606737 605420 604447 604156 605150 606941 608471 609538 610444 610891 610586
59558 610586 610300 610808 611384 610844 609487 608526 608262 608377 609357 611924 615617 619643 624653 631946 641539 652955
59542 652955 667481 687245 711538 735610 753576 761866 760488 752577 742660 733964 727099 721721 718371
59529 718371 717485 717787 717608 717138 717562 718563 718600 717249 715244 712530 708249 702538 696437 690086 682810 674899
59513 674899 667500 660811 654196 647943 643030 639192 635209 631215 628715 628038 627761 627078 626883 627860 629206
59498 629206 629974 630295 630567 630675 630600 630798 631467 632320 633270 634460 635583 636196 636661 637700 639138 640186 640823
59481 640823 641719 642948 644123 645589 648099 651375 654342 656684 658856 660773 662005 663161 665503 669129
59467 669129 673010 676747 680775 684893 688330 691464 695798 701864 708573 714959 721157 727313 732927 737704
59453G37704M239L815L161K654K464J808K35j412k381l092l853l902k834j534
59439G37072o07N95K322L504L664L924M893N505N354O034Q468J0917J1704J1875
59425H15224J2989J4162J3812J2794J3051J4436J5515J6710J9748K4082K6169
59414I98692K2742J3624J642r076j5289j6456j4398j0821n989M0O432J2290J6529
59401I99962J6583R765k662j5017k2573k5494k6182k5273k2427j8771j5808j3265
59389H38838j0363p824o524n548l750j923j313j322p49k6j23m62n4N17L31O2P31
59372H00498J717J978K010K638L273L257L531M911O218O270O175P370Q952R328
59358H68126R141R976J1505J2367J2775J3684J4525J4212J3394J3235J2997J1264
$$ plain form
59453 737704 741943 745758 748919 751573 754037 755845 756080 754668 752287 749195 745342 741440 738606 737072
59439 737072 736465 737060 739382 742886 746550 750474 755367 760872 766226 772260 780728 791645 803349 815224
59425 815224 828213 842375 856187 868981 882032 896468 911983 928693 948441 972523 998692
59414 998692 1021434 1035058 1036700 1027624 1012335 995879 981481 970660 964671 964711 971143 983433 999962
59401 999962 1016545 1026310 1023648 1008631 986058 960564 934382 909109 886682 867911 852103 838838
59389 838838 828475 820651 814127 808579 804829 802906 801593 800271 799522 799496 799373 798911 798857 799374 799705 799767 800498
59372 800498 802215 804193 806203 808841 812114 815371 818902 823813 830031 836301 842476 849846 858798 868126
59358 868126 877267 887243 898748 911115 923890 937574 952099 966311 979705 992940 1005937 1017201
59346A017201Q561O358M456J693j723m908q207j2123j5381j6494j6195j6077j6016
59333I31145j5236j4600j5223j6054j5421j3860j2794j1705r428p018o378p031
59321G86397p165o859p301p847p013n535n260n666m755k772j802k026j588k5J267
59306G22050J893K882M344N415O493Q865J2258J5194J7388J9109J8767J4205O286
59293H55149j541p124j0587j1942j0789q245o227m746k465L32K123L190N285Q291
59279H10704J0228J0636J1119J2261J2914J2729J2690J2794J1829R778Q041P017
59267I42740N843M591M260M469L683J781L9j396l465n805p067p616r140j1467
59253I21450j2490j1580j0350r778r114p998p123o430n071l422k867l370l619
$$ plain form
59346 1017201 1025762 1032120 1036576 1038269 1036546 1031638 1023431 1011308 995927 979433 963238 947161 931145
59333 931145 915909 901309 886086 870032 854611 840751 827957 816252 806824 799806 793428 786397
59321 786397 779232 772373 765072 757225 750212 744677 739417 733751 728996 726224 724422 722396 720808 720783 722050
59306 722050 723943 726825 731169 736584 743077 751942 764200 779394 796782 815891 834658 848863 855149
59293 855149 853608 846484 835897 823955 813166 804921 798694 793948 791483 791815 793938 797128 802413 810704
59279 810704 820932 831568 842687 854948 867862 880591 893281 906075 917904 927682 935723 942740
59267 942740 948583 953174 957434 961903 965586 967367 967406 966010 962545 956740 949673 942057 932917 921450
59253 921450 908960 897380 887030 877252 868138 860140 853017 846587 841516 838094 835227 831857 828238
59240H28238l541m291n733o497o546p095p959p640o251n577o001o029n200m803
59226G45075n290n503m916m277l757k745j690j718k372k130j221j338k532l066
59212G02520k464k052k283k235j939k498l696m065l490l170l032j951m98n14j796
59197F66837k160j026K0L66J031J991K009J419J936L338L532K304J765K517K731
59182F88610J689R86J306J239J50o82p16r61j419p29R18J505O44K21R30J225M28
59165F95344k62o54k100m357n270m551m473n745o262n113m314n015n469m476l578
59150F33705m011m496l900l290l540l631k913k456k655k159o45J10o02r69J75
59135E98723J441J656J746K414K675K217K438L660M088L088K609L791N070N331
$$ plain form
59240 828238 824697 820406 814673 808176 801630 794535 786576 778936 772685 767108 761107 755078 749878 745075
59226 745075 739785 734282 729366 725089 721332 718587 716897 715179 712807 710677 709456 708118 705586 702520
59212 702520 700056 698004 695721 693486 691547 689049 685353 681288 677798 674628 671596 669645 669147 668633 666837
59197 666837 664677 663651 663671 664037 665068 667059 669068 670487 672423 675761 679293 681597 683362 685879 688610
59182 688610 690299 691285 692591 693830 693980 693298 692582 691621 690202 689473 690391 691896 692540 692761 693691 694916 695344
59165 695344 695082 694428 692328 687971 682701 678150 673677 667932 661670 656557 652243 647228 641759 637283 633705
59150 633705 629694 625198 621298 618008 614468 610837 607924 605468 602813 600654 600009 600119 599517 598548 598723
59135 598723 600164 601820 603566 605980 608655 610872 613310 616970 621058 624146 626755 630546 635616 640947
59121F40947N930P878R820J0809J2208J4877J7145J7610J7367J7561J7196J5425
59109H04773J3458J2228J0518P315L731Q15k212n770q414r240r482j0093j0137
59096G97490r100q212p890o597l948k145k513l360l190l164m374n471n201m648
59082G27677m858m831l954l723m879n531m383l111l268l474k249r45j287k391
59068F78793k813l188m260m612l088j393j552k679k763j888j287j002o27o48j026
59053F45967l57J647K906K098P57M83M76j58k82Q17J456M50m75L92J829K236K657
59036F62899M567O957Q263R131J0691J2190J2780J3532J5110J5679J3659J0448
59024G95906P925N532K290o80k403m333p594j0205r992q138o944o205m702l162
$$ plain form
59121 640947 646877 654755 664575 675384 687592 702469 719614 737224 754591 772152 789348 804773
59109 804773 818231 830459 840977 848292 852023 852838 850626 844856 836442 827202 817720 807627 797490
59096 797490 788390 780178 772288 765691 761743 759598 757085 753725 750535 747371 742997 737526 732325 727677
59082 727677 722819 717988 714034 710311 705432 699901 695518 692407 689139 685665 683416 682471 681184 678793
59068 678793 675980 672792 668532 663920 660832 659439 657887 655208 652445 650557 649270 648268 647641 646993 645967
59053 645967 645610 647257 650163 652261 653018 653501 653977 653819 653537 654354 655810 656260 655785 656177 658006 660242 662899
59036 662899 667466 674423 682686 691817 702508 714698 727478 741010 756120 771799 785458 795906
59024 795906 803831 809363 811653 810973 808570 804237 796643 786438 776446 768308 761364 755159 750457 747295
59010G47295k661k081j50J837K250K156L286M847N279N217N828O096M779L168
58996G87146K978L303K563J539J535J497P6j361q30Q79J954K859M786O729P228
58981H22881P368Q844J0727J1196J0904J1479J2404J2346J1940J2295J2460J1339
58969I56183J0281J0696J1060R494P354O915P302O200L829J762m99m184q069j0177
58955A008147j1267j3285j5717j6774j6757j6951j6741j5007j2867j1849j0912
58944H50020q499n766m526l853k105l29k03n54L89J329K76j478j689j430k865
58929H18717m816m857m017m781o127n315l168k690l643l270j517o69o14P44K912
58914G76889L392K441K783M828O477P383R160J1620J3006J3635J5245J7149J7080
$$ plain form
59010 747295 744634 742553 742403 744240 746490 748646 751932 756779 762058 767275 773103 779199 783978 787146
58996 787146 790124 793427 795990 797529 799064 800561 800637 799276 798446 799325 801279 804138 808924 815653 822881
58981 822881 830249 839093 849820 861016 871920 883399 895803 908149 920089 932384 944844 956183
58969 956183 966464 977160 988220 997714 1005068 1011983 1019285 1025485 1029314 1031076 1030577 1026393 1018324 1008147
58955 1008147 996880 983595 967878 951104 934347 917396 900655 885648 872781 860932 850020
58944 850020 841521 835755 831229 827376 825271 824942 824739 824185 824574 825903 826179 824701 823012 821582 818717
58929 818717 813901 809044 805027 800246 794119 788804 785636 782946 779303 776033 774516 773847 773233 773977 776889
58914 776889 780281 782722 785505 790333 796810 804193 813353 824973 837979 851614 866859 884008 901088
58901I01088J5484J4851J5348J5150J4590J5668J7893J8926J9026K0400K2564
58890A090988K2733K0697J8790J7165J3626Q331M105J681j152n217q834j1361
58878A171552j3864j5959j5887j4081j2878j2440j0734p693n530m812m028l176
58866A050470l853n667o467o260p082q848r374q582q625r675r667q571q781j0824
58852I38194j2645j3571j5066j7128j7857j7102j6767j7051j6126j3835j2008
58841G69038j0880q917o367n065m637k947m05L04r30j310P8J306J803L129N056
58826G39256N209L416K289K720K796J800J303J604J119j18k54N76J77j486k125
58811G58282j553k056l860m612l898l948n216n617m861n064o351o434n296n589
$$ plain form
58901 901088 916572 931423 946771 961921 976511 992179 1010072 1028998 1048024 1068424 1090988
58890 1090988 1113721 1134418 1153208 1170373 1183999 1192330 1196435 1198116 1196964 1191747 1182913 1171552
58878 1171552 1157688 1141729 1125842 1111761 1098883 1086443 1075709 1068016 1062486 1057674 1053646 1050470
58866 1050470 1046617 1040950 1034483 1028223 1021141 1012293 1002919 994337 985712 976037 966370 957799 949018 938194
58852 938194 925549 911978 896912 879784 861927 844825 828058 811007 794881 781046 769038
58841 769038 758158 749241 742874 737809 733172 730225 729820 730124 729194 727884 727962 729268 731071 734200 739256
58826 739256 744465 747881 750170 752890 755686 757486 758789 760393 761512 761394 761140 761716 761893 760407 758282
58811 758282 756729 754673 750813 746201 742303 738355 733139 727522 722661 717597 711246 704812 699516 693927
58797F93927p459p746n492l521l205k354J54K211K625L148M641N375M728M504
58783F91536N121M514K416J557L132M966N669O473P460O232K103k263n052p281
58769G26583r250r135o802n006n008m797l160j764j633j419o97j133k862l527
58755F70390k415j733k380k328o51Q15J184J989L662M500M437N667Q317R685R058
58740G10197R021J0603J1583J1041J1027J2165J2110J0069Q389Q017O857M312
58728H25391K784K901J983q26k592j758o30p36k97J565K738K322K351L322K689
58713H41207j72k335k780m485q716j2325j3327j4207j6862j9139j9253j8973j9460
58700F89173j8587j5379j2609j2033j1459r360p804q004p589n328l878m764n264
$$ plain form
58797 693927 686468 678722 673230 669709 666504 664150 664304 666515 669140 672288 676929 682304 687032 691536
58783 691536 696657 701171 703587 705144 708276 713242 718911 725384 732844 739076 741179 738916 733864 726583
58769 726583 717333 708198 701396 696390 691382 686585 683425 681661 680028 678609 677912 676779 673917 670390
58755 670390 667975 666242 663862 661534 660883 661698 662882 664871 668533 673033 677470 683137 691454 701139 710197
58740 710197 719218 729821 741404 752445 763472 775637 787747 797816 806205 814222 821079 825391
58728 825391 828175 831076 833059 832233 829641 827883 827253 826517 826220 827785 830523 832845 835196 838518 841207
58713 841207 841035 838700 835920 831435 822719 810394 797067 782860 765998 746859 727606 708633 689173
58700 689173 670586 655207 642598 630565 619106 609746 601942 593938 586349 581021 577143 572379 567115
58687E67115l501j983k771l641k454r80r31n55J522L250L245L689O029Q044Q313
58672E84391R143J1934J4106J3961J3865J5285J5390J2165Q222N842K894k428
58660G04770p480r716j0955j3132j4204j2347r925r234q461n836l490l292l055
58647E93643r77N26n92j844p72O24K4r38n69q45l119m619l436k478m092n401l535
58630E61600r06n67p98Q44K491J909J149K404L496K395J806M192O614N802M005
58615E96436M438N234L428R50Q86J667O06n44Q00K549J681r0J60R32l05j748p79
58598F16301P58L20N6K779O261P218P348R648J2339J2394J1621J3153J5265J4615
58584G30076J2461J1722J1155Q406N604N848P330O792N642O796Q859R502J1013
$$ plain form
58687 567115 563614 561631 558860 555219 552765 551785 550854 550299 551821 555071 558316 562005 568034 576078 584391
58672 584391 593534 605468 619574 633535 647400 662685 678075 690240 698462 704304 707198 704770
58660 704770 697290 687574 676619 663487 649283 636936 627011 617777 609316 603480 599990 596698 593643
58647 593643 592666 593192 592600 590756 589984 590608 590632 589694 589125 588280 585161 580542 577106 574628 570536 565135 561600
58630 561600 560694 560127 559329 560173 562664 564573 565722 568126 571622 574017 575823 580015 586629 592431 596436
58615 596436 600874 606108 609536 610486 611372 613039 613645 613101 613901 616450 618131 618041 618201 619133 618828 617080 616301
58598 616301 617059 617379 617435 620214 626475 633693 641041 650689 663028 675422 687043 700196 715461 730076
58584 730076 742537 754259 765414 773820 779424 785272 792602 799394 805036 811832 820691 830193 841206
58571H41206J6217K2279K5001K5984K8975L2284L1655K7671K3720J9328J2251
58560A106571M479m15l414p296j0522j0171q117p852q052n728k828l140n525o844
58546A031146q519j3363j8879k0758k0333k1565k3417k2308j9361j8077j7428
58535H27138j4441j0910j0351j0910q710n496n461p057n787k741k415m196l913
58522G34750j955k086l815l636k201k872m710m245k476k933m578l799j504j140
58508F92800j853o96Q15l14j774K20L140K229m75M02L767M439K918L796O556O984
58492G22954N974P854J1564J2444J1321J2943J6759J8148J7318J8061J9127J5982
58480H90449R814N761L443j535q082j0976j0508j1367j3126j1375p248o013p014
$$ plain form
58571 841206 857423 879702 904703 930687 959662 991946 1023601 1051272 1074992 1094320 1106571
58560 1106571 1111050 1110635 1107221 1099925 1089403 1079232 1071115 1063263 1055211 1049483 1046655 1043515 1037990 1031146
58546 1031146 1022627 1009264 990385 969627 949294 927729 904312 882004 862643 844566 827138
58535 827138 812697 801787 791436 780526 771816 766320 760859 753802 748015 745274 742859 738663 734750
58522 734750 732795 730709 726894 723258 721057 718185 713475 709230 706754 703821 699243 695444 693940 692800
58508 692800 690947 690251 691066 690752 688978 689198 692338 694567 694092 694494 698261 702700 705618 709414 715970 722954
58492 722954 728928 736782 748346 760790 772111 785054 801813 819961 837279 855340 874467 890449
58480 890449 900263 906024 909467 907932 899850 888874 878366 866999 853873 842498 835250 829237 822223
58467H22223m762N81L524L516N175Q771J0147R681J1660J5061J4561J0306P128
58454I17572M827r18q634j2346j2200j3599j6302j4933r999p604q207o432k180
58441H09045r68k887k184J594K886J139J651M783N240K926L512P234Q090N165
58427H47226L853M875L194j197k604q52j954o408q145o300o530r415r200n478
58413H01065m341o448n763j771q27l597l406R47K973J111J241M473M955K163K653
58398G95428P078Q212M637L504O754P706M509L844P585Q940N726M581P940R615
58384H86059P356O953R832R487M418J765L903M379J275J274O158Q693O499O555
58370I64606J1233J3502J0863J0282J4134J5043J0058O140O263M022k447n412
$$ plain form
58467 822223 817461 818042 821566 825082 830257 839028 849175 858856 870516 885577 900138 910444 917572
58454 917572 922399 921481 912847 900501 888301 874702 858400 843467 833468 825864 817657 811225 809045
58441 809045 808077 805190 803006 804600 807486 808625 810276 815059 820299 823225 826737 833971 842061 847226
58427 847226 851079 855954 859148 857951 855347 854495 852541 846133 837988 831688 825158 815743 806543 801065
58413 801065 796724 790276 784513 782742 781915 778318 774912 775859 778832 779943 781184 785657 790612 792775 795428
58398 795428 802506 810718 815355 818859 825613 833319 837828 841672 849257 858197 863923 868504 876444 886059
58384 886059 893415 900368 910200 919687 924105 925870 929773 934152 935427 936701 942859 951552 958051 964606
58370 964606 975839 989341 1000204 1010486 1024620 1039663 1049721 1055861 1062124 1066146 1063699 1058287
58358A058287k245r33m905o598k260J154K05J565P850J1368Q911Q308J3298J6320
58344A110325J3463J1911J5357J6633J2307R903J3041J4188R638O720Q699P919
58332A250104J683r13L813O249J276k229J407M299J222j54M967Q655O118N378
58318A291875J1107J4852J1463R132J2957J5024J0976R631J5572J9276J5277J2799
58306A449941J7411J9938J4974J2231J7604K1299J7037J4423J9561K2382J6460
58295A643261J2330J7371K1678J7989J6082K2849K7812K3554K0665K6872L1517
58284A881980K6795K3880L1208L7475L3494L0202L7058M3433L9898L6920M3559
58273B265902M8711M2992L7977M3912M9792M5618M2505M9946N5669M9323M3426
$$ plain form
58358 1058287 1056042 1055109 1050204 1043606 1041346 1042500 1042705 1044270 1052120 1063488 1072399 1080707 1094005 1110325
58344 1110325 1123788 1135699 1151056 1167689 1179996 1189899 1202940 1217128 1226766 1233486 1242185 1250104
58332 1250104 1251787 1250874 1254687 1260936 1262212 1259983 1261390 1265689 1266911 1266757 1271724 1280379 1286497 1291875
58318 1291875 1302982 1317834 1329297 1338429 1351386 1366410 1377386 1387017 1402589 1421865 1437142 1449941
58306 1449941 1467352 1487290 1502264 1514495 1532099 1553398 1570435 1584858 1604419 1626801 1643261
58295 1643261 1655591 1672962 1694640 1712629 1728711 1751560 1779372 1802926 1823591 1850463 1881980
58284 1881980 1908775 1932655 1963863 2001338 2034832 2065034 2102092 2145525 2185423 2222343 2265902
58273 2265902 2314613 2357605 2395582 2439494 2489286 2534904 2577409 2627355 2683024 2732347 2775773
58262B775773M8965N3549M6350M0683M8391N6161N1666M8276N8558O8634O5139
58251C362145O1892P2638Q3481Q0503P8006R0192J02140R9062R6505J10166J24301
58240D361031J22459J20313J34415J48706J46904J46816J65899J85195J85671
58231E717409J86853K09230K33095K37043K41315K68323K97321L05324L14564
58222H010477L49646L87568M02775M20174M67835N20601N49842N83617O54234
58213A2346769P33882P89830Q53341R61774J085783J191676J319055J512547J737994
58204B2532651J958078K225121K599928L053708L563294M221887N127551O248921
58196E1531139P540279R086775J0981091J3194045J5770008J8995577K3136403
$$ plain form
58262 2775773 2824738 2878287 2924637 2965320 3013711 3069872 3121538 3169814 3228372 3297006 3362145
58251 3362145 3424037 3496675 3580156 3660659 3738665 3828857 3930997 4030059 4126564 4236730 4361031
58240 4361031 4483490 4603803 4738218 4886924 5033828 5180644 5346543 5531738 5717409
58231 5717409 5904262 6113492 6346587 6583630 6824945 7093268 7390589 7695913 8010477
58222 8010477 8360123 8747691 9150466 9570640 10038475 10559076 11108918 11692535 12346769
58213 12346769 13080651 13870481 14723822 15685596 16771379 17963055 19282110 20794657 22532651
58204 22532651 24490729 26715850 29315778 32369486 35932780 40154667 45282218 51531139
58196 51531139 59071418 68158193 79139284 92333329 108103337 127098914 150235317
58189A50235317K8218777L4337673M1623320M8888881N2352713M7169659L1550203
58182D34376543R267372j2642244k8768200l7870440m1487528m1433115l8919288
58175B42523100l4956746l0485746k6084563k1980350j8338641j5300973j2827684
58168H2548397j0761088r030144p640315o525184n571712m752461m096491l566875
58160C0604127l087447k654391k310422k039849j788699j558075j384278j253356
58152A4527610j121039r92143r00429q33594p53230o66686o08029n68564n13630
58143G570266m49001m06233l79790l40119k93139k68173k61102k44589k21107
58134D707013k13271k14628k00713j77017j67752j68442j55908j34105j25216
$$ plain form
58189 150235317 178454094 212791767 254415087 303303968 355656681 402826340 434376543
58182 434376543 443643915 431001671 402233471 364363031 322875503 281442388 242523100
58175 242523100 207566354 177080608 150996045 129015695 110677054 95376081 82548397
58168 82548397 71787309 62757165 55116850 48591666 43019954 38267493 34171002 30604127
58160 30604127 27516680 24862289 22551867 20512018 18723319 17165244 15780966 14527610
58152 14527610 13406571 12414428 11513999 10680405 9927175 9260489 8652460 8083896 7570266
58143 7570266 7121265 6715032 6335242 5995123 5701984 5433811 5172709 4928120 4707013
58134 4707013 4493742 4279114 4078401 3901384 3733632 3565190 3409282 3275177 3149961
58125C149961j25774j15172r7631r3497r8242r1020p5246p1090p5977p1123n9288
58114B175901n8444o5193o1212m9351m7712n4173n1421m1374m0664m7400m5387
58103A613570l6391l5968m2061l9268k9930l0022l8032l8083l0352k8926l2808
58092A231729k8191j6726j3074j6779j4082n478m423j0714j1575p410j0503j9756
58080A073018k2096j7719j8981k5529k5173j8357j7503k2698k1835j4494j2282
58069H56351j5799j4198p551o896j1943j1103m090k463p117o929q19K92n142o804
58055G55789k979l246q939j0616o917o740j0895j0386m753l576p917q513m171
58042F66141l855q600r336m774l799p834q211l385j719m776m701n34m83n473o905
$$ plain form
58125 3149961 3024187 2909015 2811384 2717887 2619645 2528625 2453379 2382289 2306312 2235189 2175901
58114 2175901 2117457 2052264 1991052 1941701 1893989 1839816 1788395 1747021 1706357 1658957 1613570
58103 1613570 1577179 1541211 1499150 1459882 1429952 1399930 1361898 1323815 1293463 1264537 1231729
58092 1231729 1203538 1186812 1173738 1156959 1142877 1137399 1132976 1122262 1110687 1103277 1092774 1073018
58080 1073018 1050922 1033203 1014222 988693 963520 945163 927660 904962 883127 868633 856351
58069 856351 840552 826354 818803 811907 799964 788861 784771 782308 775191 768262 767443 767735 762593 755789
58055 755789 752810 749564 740625 730009 723092 716352 705457 695071 690318 686742 678825 670312 666141
58042 666141 662286 653686 644350 639576 635777 627943 619732 616347 614628 609852 605151 604617 604134 598661 591756
58027E91756l296k823o842p172k529j429n669o901k898j448m682n027m50J433
58013E42023j714k723O07J374k218k942J229K990j60j445J537K310j207k334J209
57998E38536K855J36q29K067K550j510l765j836j819o082q600o713n624p096n639
57983D96631j57K507l7j451R83J528k126l928j145M63k064l557j410o97l636m821
57967D77083j768K39j463k079M45R63k457m083j320L80j729k452Q02K603J3j589
57951D63588J249L704K244J112L517N462M089L452O388R023Q564Q323J0104J0058
57937E40877O895N609Q204R356O113L110L245K115k901o951o598n957q327j0070
57923E44720q487p513r880j1515r442p453q398q653n864m233o403p854n216k514
$$ plain form
58027 591756 588460 585637 578795 571623 569094 567665 561996 555095 552197 550749 546067 541040 540590 542023
58013 542023 540309 537586 538193 539567 537349 534407 535636 538626 538466 537021 538558 540868 539661 537327 538536
57998 538536 541391 541527 540698 542765 545315 543805 540040 538204 536385 530303 521703 514990 509366 502270 496631
57983 496631 496474 498981 498944 497493 498476 500004 497878 493950 492805 493268 491204 487647 486237 485540 481904 477083
57967 477083 475315 475554 474091 472012 472457 473420 470963 466880 465560 465940 464211 461759 462561 465164 465177 463588
57951 463588 464837 468541 470785 471897 475414 480876 484965 488417 494805 503828 512392 520715 530819 540877
57937 540877 547772 553381 561585 570941 577054 580164 583409 585524 582623 575672 569074 563117 554790 544720
57923 544720 536233 528720 518840 507325 497883 490430 482032 473379 467515 463282 456879 449025 443809 441295
57909D41295l279m047j746%j880l636j788M08k96r29J168K577O94m72K406N460
57893D35935M657K833L522M271K349P73K234L192M12k595k010n61j655k623m33
57878D50301J696P7k409j689K93J61k17J954M314M001L612O293R503R785R115
57863D96790J0549J2240J1708J1317J3479J5139J3093J0102R663R499O417K926
57851F22922K465K593m35m500n572m910n827p082n895m015m427n441m083k022
57837E73771k187k914j305R91J139P46K370L986K793R86J810L368K333L85Q58
57822E89130K246J286o50l69R18L26o71R83L739L992K256J161L8k810n216m387
57806E91972k382k694m031l232j524j985l393k675j041j701l720m009l154l556
$$ plain form
57909 441295 438016 433969 432223 432223 430343 426707 424919 425327 425031 424102 425270 427847 428541 428069 430475 435935
57893 435935 440592 443425 446947 451218 453567 454340 456574 459766 460178 457583 455573 455012 453357 450734 450301
57878 450301 451997 452074 449665 447976 448269 448430 448213 450167 454481 458482 462094 468387 477890 487675 496790
57863 496790 507339 519579 531287 542604 556083 571222 584315 594417 604080 613579 619996 622922
57851 622922 625387 627980 627545 623045 617473 612563 606736 599654 593759 589744 585317 579876 575793 573771
57837 573771 571584 568670 567365 568356 569495 570241 572611 576597 579390 580376 582186 585554 587887 588272 589130
57822 589130 591376 592662 592012 591643 592561 592887 592216 593199 596938 600930 603186 604347 604385 601575 596359 591972
57806 591972 589590 586896 582865 579633 578109 576124 572731 570056 569015 567314 563594 559585 556431 552875
57792E52875m061k279Q6O5p67P41K972K353L07R62L730M559L124K474K758J415
57776E71314j284k695k973m352o220o242n293o036p716p535n997n696o069m703
57762D98503k561k559l996l717j833j065j398n46J181J544J017J812L294L222
57748D92898K429L367N167N179M154M855O642O681N367N448O670O590N599N973
57734E67019O883N739L550L597N522O091N086N100O138N834M547M810O096N480
57720F41492L229K428L279K970J073j7J09m29j452j087j63j269l649m031k288
57705F40195j225j109L95K980L813K879K970M203L819J649M64N82n90l184m221
57690F53620k966j930j871p85J490K638K575L905O943R060R782J1686J5415J8600
$$ plain form
57792 552875 548814 546535 546621 546686 545919 546660 549632 551985 552292 553254 556984 561543 564667 567141 569899 571314
57776 571314 570030 567335 564362 560010 553790 547548 542255 536219 528503 520968 514971 509275 503206 498503
57762 498503 495942 493383 489387 485670 483837 482772 481374 480828 482009 483553 484570 486382 489676 492898
57748 492898 495327 498694 503861 509040 513194 518049 524691 531372 536739 542187 548857 555447 561046 567019
57734 567019 573902 579641 583191 586788 592310 598401 603487 608587 614725 620559 625106 629916 636012 641492
57720 641492 644721 647149 650428 653398 654471 654454 654563 654134 652682 651595 651432 650163 646514 642483 640195
57705 640195 638970 637861 638256 641236 645049 647928 650898 655101 658920 660569 661033 661615 661025 657841 653620
57690 653620 650654 648724 646853 646068 647558 650196 652771 656676 663619 672679 682461 694147 709562 728162
57676G28162K0675K4000K9237L4274L8845M5552N5256O5984P7252R0266J01930
57665A311433J03388Q7298N4087J0620l3650o8964q8965r4659r2058q5288p4996
57654A028246o2801n2230m4382l7243l0350k5765k3611k1146j7486j4807j3776
57643F84649j2163r300p433p236o318l737j790j706j628m64K21k44j11J211J837
57628F35788J133R07J603J212o11j371k14M68m93r95K09J273R62P52J428J424
57612F43475L41L27K037K968J801P11J368K278K098K028K809K911J802J540L000
57597F71494L951K984J999K540L070K127R67P57L01j159j949j025j07m88p00M57
57581F85219J474R80J96L66M78k26k64J344K891K760J983K023K402K363K481K924
$$ plain form
57676 728162 748837 772837 802074 836348 875193 920745 976001 1041985 1119237 1209503 1311433
57665 1311433 1414821 1502119 1556206 1566826 1533176 1464212 1375247 1280588 1188530 1103242 1028246
57654 1028246 965445 913215 868833 831590 801240 775475 751864 730718 713232 698425 684649
57643 684649 672486 663186 655753 648517 642199 638462 636672 634966 633338 632874 633095 632851 632740 633951 635788
57628 635788 636921 637828 639431 640643 640032 638661 638447 638915 638422 637427 637636 638909 639871 640623 642051 643475
57612 643475 643816 644143 646180 649148 650949 651660 653028 655306 657404 659432 662241 665152 666954 668494 671494
57597 671494 675445 678429 680428 682968 686038 688165 689132 689889 690190 689031 687082 686057 685950 685462 684762 685219
57581 685219 686693 687673 687869 688235 688713 688487 688223 689567 692458 695218 697201 699224 701626 703989 706470 709394
57565G09394K614J615J755L406M444L832L255L740L928L271L460M907N299L776
57551G58696K954M414N799M988L765M398N702N730N473O697Q487R001Q489P805
57537H42398O155L148Q67J167K740L421L414L891M408M215M163N006N628N168
57523H95789M849N668O450O250O391P820Q839P889O406O352P108P221P185P919
57509I92136Q520P984P314P551P703O817O091O616P048N973M582M588N357N428
57495A083708N088N036M506K960J878K520L707L917L758M310N009N197N636O562
57481A143792O552N358N250P254Q806P739N908N993P244P575P426Q209R060Q519
57467A244685P682Q348R628R590Q716Q681R181Q969Q577R109R724R227Q619R321
$$ plain form
57565 709394 712008 713623 715378 718784 723228 727060 730315 734055 737983 741254 744714 749621 754920 758696
57551 758696 761650 766064 771863 776851 780616 785014 790716 796446 801919 808616 817103 826104 834593 842398
57537 842398 848553 851701 852568 853735 856475 859896 863310 867201 871609 875824 879987 884993 890621 895789
57523 895789 900638 906306 912756 919006 925397 933217 942056 949945 956351 962703 969811 977032 984217 992136
57509 992136 1000656 1008640 1015954 1023505 1031208 1038025 1044116 1050732 1057780 1063753 1068335 1072923 1078280 1083708
57495 1083708 1088796 1093832 1098338 1101298 1103176 1105696 1109403 1113320 1117078 1121388 1126397 1131594 1137230 1143792
57481 1143792 1150344 1155702 1160952 1168206 1177012 1184751 1190659 1196652 1203896 1211471 1218897 1227106 1236166 1244685
57467 1244685 1252367 1260715 1270343 1279933 1288649 1297330 1306511 1315480 1324057 1333166 1342890 1352117 1360736 1370057
57453A370057J0360J0159R572J0225J1376J1408J0880J1242J1990J1969J1967
57442A491205J3033J3884J2978J1572J1525J1806J0526Q838R150J0733J0944R782
57430A625976R531J0606J1325J1337J1824J2647J2483J1587J1471J2144J2368
57419A753299J2214J2682J3377J3200J2741J3346J4489J4716J4340J4576J4908
57408A903888J4108J2991J3266J4376J4498J3918J4404J5865J6614J6515J6854
57397B067297J7521J7221J6177J5845J6312J6543J6783J8014J9481J9490J8308
57386B258992J7745J8226J8714J8965J9448J9673J9051J8658J9665K0964K0868
57375B470969K0084K0237K0698J9980J9132K0239K2428K2945K1626K0780K1012
$$ plain form
57453 1370057 1380417 1390576 1400148 1410373 1421749 1433157 1444037 1455279 1467269 1479238 1491205
57442 1491205 1504238 1518122 1531100 1542672 1554197 1566003 1576529 1585367 1594517 1605250 1616194 1625976
57430 1625976 1635507 1646113 1657438 1668775 1680599 1693246 1705729 1717316 1728787 1740931 1753299
57419 1753299 1765513 1778195 1791572 1804772 1817513 1830859 1845348 1860064 1874404 1888980 1903888
57408 1903888 1917996 1930987 1944253 1958629 1973127 1987045 2001449 2017314 2033928 2050443 2067297
57397 2067297 2084818 2102039 2118216 2134061 2150373 2166916 2183699 2201713 2221194 2240684 2258992
57386 2258992 2276737 2294963 2313677 2332642 2352090 2371763 2390814 2409472 2429137 2450101 2470969
57375 2470969 2491053 2511290 2531988 2551968 2571100 2591339 2613767 2636712 2658338 2679118 2700130
57364B700130K0856K0261K0838K2535K3456K3255K3454K4256K4175K3132K2882
57353B949230K3991K5132K5658K6220K6734K6352K5489K5379K5783K5671K5666
57342C231305K6966K8416K7808K5724K4823K5519K5763K4976K4711K5372K5719
57331C517102K5854K7202K9293K9942K9073K8958L0200L0839L0085K9498K9813
57320C837859K9863K9451L0055L1800L2842L2607L2625L3437L3708L3242L3622
57309D191111L5031L5491L4329L3368L3672L4122L4190L5027L6732L7516L6889
57298D577478L6670L7631L8085L7179L6586L7408L8171L7621L6897L7191L7694
57287D988611L7483L7295L7786L8114L7709L7548L8324L9198L9463L9583L9594
$$ plain form
57364 2700130 2720986 2741247 2762085 2784620 2808076 2831331 2854785 2879041 2903216 2926348 2949230
57353 2949230 2973221 2998353 3024011 3050231 3076965 3103317 3128806 3154185 3179968 3205639 3231305
57342 3231305 3258271 3286687 3314495 3340219 3365042 3390561 3416324 3441300 3466011 3491383 3517102
57331 3517102 3542956 3570158 3599451 3629393 3658466 3687424 3717624 3748463 3778548 3808046 3837859
57320 3837859 3867722 3897173 3927228 3959028 3991870 4024477 4057102 4090539 4124247 4157489 4191111
57309 4191111 4226142 4261633 4295962 4329330 4363002 4397124 4431314 4466341 4503073 4540589 4577478
57298 4577478 4614148 4651779 4689864 4727043 4763629 4801037 4839208 4876829 4913726 4950917 4988611
57287 4988611 5026094 5063389 5101175 5139289 5176998 5214546 5252870 5292068 5331531 5371114 5410708
57276E410708L8656L7099L6690L7849L8765L8327L7783L8407L9688M0848M2000
57265E836820M2872M2611M1774M2239M4145M5319M4621M3469M3068M2672M1761
57254F311371M1306M1569M1108L9396L8017L7888L7706L6635L6044L6959L8088
57243F736087L8122L7817L8138L8411L8059L8164L9552M1119M1678M1791M2256
57232G171194M2510M1982M1284M0720L9375L6909L4553L3033L1400K9082K7059
57221G569101K5810K4088K1185J8382J6775J5654J4373J3768J4245J4571J4148
57210G762100J4421J6390J8719K0006K1038K3002K5211K6443K6918K7267K7148
57199H008663K6454K6289K7145K7652K6677K5092K3984K2797K0752J8580J7228
$$ plain form
57276 5410708 5449364 5486463 5523153 5561002 5599767 5638094 5675877 5714284 5753972 5794820 5836820
57265 5836820 5879692 5922303 5964077 6006316 6050461 6095780 6140401 6183870 6226938 6269610 6311371
57254 6311371 6352677 6394246 6435354 6474750 6512767 6550655 6588361 6624996 6661040 6697999 6736087
57243 6736087 6774209 6812026 6850164 6888575 6926634 6964798 7004350 7045469 7087147 7128938 7171194
57232 7171194 7213704 7255686 7296970 7337690 7377065 7413974 7448527 7481560 7512960 7542042 7569101
57221 7569101 7594911 7618999 7640184 7658566 7675341 7690995 7705368 7719136 7733381 7747952 7762100
57210 7762100 7776521 7792911 7811630 7831636 7852674 7875676 7900887 7927330 7954248 7981515 8008663
57199 8008663 8035117 8061406 8088551 8116203 8142880 8167972 8191956 8214753 8235505 8254085 8271313
57188H271313J6227J4705J2693J0277P058L460Q46p55l145p118j1191j4324j7623
57175H282423k1985k6302k9711l3333l8038m2565m5787m8756n2620n6494n9365
57164G827467o2144o5759o9143p1153p2693p4768p6222p5654p3923p2522p1008
57153G042478o8261o4821o1687n8177n3231m7680m3043l9129l4862l0500k7127
57142F513960k4976k3920k4531k6960l0034l3120l7488m4057n1214n6790o0827
57131F100043o4309o6498o5773o2166n6960n0518m2515l3577k4930j7039j0127
57120E605631n178k846k173j864j914k389j615K676J1073K2832L7747N6013P6842
57107E794835R8865J21952J47620J77964K15146K61894L21637L98054M94682O15128
$$ plain form
57188 8271313 8287540 8302245 8314938 8325215 8332273 8335733 8336579 8335824 8332679 8325561 8314370 8300046 8282423
57175 8282423 8260438 8234136 8204425 8171092 8133054 8090489 8044702 7995946 7943326 7886832 7827467
57164 7827467 7765323 7699564 7630421 7559268 7486575 7411807 7335585 7259931 7186008 7113486 7042478
57153 7042478 6974217 6909396 6847709 6789532 6736301 6688621 6645578 6606449 6571587 6541087 6513960
57142 6513960 6488984 6465064 6440533 6413573 6383539 6350419 6312931 6268874 6217660 6160870 6100043
57131 6100043 6035734 5969236 5903463 5841297 5784337 5733819 5691304 5657727 5632797 5615758 5605631
57120 5605631 5600453 5597607 5595434 5593570 5591656 5589267 5587652 5590328 5601401 5624233 5661980 5717993 5794835
57107 5794835 5893700 6015652 6163272 6341236 6556382 6818276 7139913 7537967 8032649 8647777
57097H647777P63790R46094J166981J428410J728693K063321K423998K796627
57089B1965691L163600L508710L815260M057329M197732M195789M008633L584136
57081E2496880K876676J901097P75505l12381j201531j828169k217787k436793
57073E0053497k560753k659923k777625k912563l031548l100946l102142l027104
57065B6880893k877155k668197k424825k165205j898418j636202j396863j194045
57057A0619983j028580q93938p83429o90005o05994n27596m56573l95689l45607
57048D892572l06588k78957k61129k51212k50484k60232k74231k79397k66018
57039B464324k34745j93785j53208j21316j00722q6035o9311m8793k9039j3003
$$ plain form
57097 8647777 9411567 10357661 11524642 12953052 14681745 16745066 19169064 21965691
57089 21965691 25129291 28638001 32453261 36510590 40708322 44904111 48912744 52496880
57081 52496880 55373556 57274653 58050158 57737777 56536246 54708077 52490290 50053497
57073 50053497 47492744 44832821 42055196 39142633 36111085 33010139 29907997 26880893
57065 26880893 24003738 21335541 18910716 16745511 14847093 13210891 11814028 10619983
57057 10619983 9591403 8697465 7914036 7224031 6618037 6090441 5633868 5238179 4892572
57048 4892572 4585984 4307027 4045898 3794686 3544202 3283970 3009739 2730342 2464324
57039 2464324 2229579 2035794 1882586 1761270 1660548 1574513 1505202 1456409 1427370 1414367
57029A414367R72J4105K4963L3642M2529N0239M9398L3797N190k8619n9373q0938
57017A500272r0430q9722q3882p6493o8142n9314n1644m5629m0279l5713l3121
57006H25903l1728k9213k5625k3498k3454k3293k2070k1361k1663k1289j9810
56995E62899j8957j8975j7766j4756j1993j0181p293k534J973M960Q055J2466
56983D87898J6727J9106J9096J5563P030m701j4692k0186k2709k3891k2985k0039
56971D36217j7591j7010j6433j4311j1801r844p194l309N9K181N089J0056J5527
56958C71636K0546K6633L3596L6648L0981J7240K09j5720k7708l3834l4238l1537
56946C94452k8050k3983j9311j5209j2143q805m506m19K767O067R952J3370J6340
$$ plain form
57029 1414367 1415339 1429444 1454407 1488049 1530578 1580817 1630215 1664012 1669202 1640583 1581210 1500272
57017 1500272 1409842 1320120 1236238 1159745 1091603 1032289 980645 935016 894737 859024 825903
57006 825903 794175 764962 739337 715839 692385 669092 647022 625661 603998 582709 562899
56995 562899 543942 524967 507201 492445 480452 470271 462978 460444 462417 467377 475432 487898
56983 487898 504625 523731 542827 558390 565420 560719 546027 525841 503132 479241 456256 436217
56971 436217 418626 401616 385183 370872 359071 349227 342033 338724 338783 340964 346053 356109 371636
56958 371636 392182 418815 452411 489059 520040 537280 537489 521769 494061 460227 425989 394452
56946 394452 366402 342419 323108 307899 295756 286951 282445 282026 284793 290860 300812 314182 330522
56933C30522K0865K8016L6336M3742M7979M4891L0727Q127j4015k8935l7109m1509
56921D69637m2280l8946l3918k9954k6691k2820j9175j6832j4606j1384q644p844
56909A96543p597o145m453m110m317l596k474j926j237J62R73M97N29K355M242
56894A69446M518M681O699R561J1434J3014J5780J9082K1857K4945K8422K8749
56882C58188K2296J0507j591j0749j6657j9412j9159j7289j5142j2223p896l534
56870B67339o65J661N184R522J3376J7221K2283K8150L4045M1323N1805O3957
56858E55201P2501P1564N7680L1916Q82k6140m3379n1240n2563m8936m1844l4056
56846D91586k7191k0196j2377n278M90P233J6377K5745L3571M2162N4331O9331
$$ plain form
56933 330522 351387 379403 415739 459481 507460 552351 583078 591205 577190 548255 511146 469637
56921 469637 427357 388411 354493 324539 297848 275028 255853 239021 224415 213031 204387 196543
56909 196543 188946 182801 178348 174238 169921 166325 163851 161925 160688 160850 161823 162320 162849 165204 169446
56894 169446 173964 178645 185344 194905 206339 219353 235133 254215 276072 301017 329439 358188
56882 358188 380484 390991 389400 378651 361994 342582 323423 306134 290992 278769 270873 267339
56870 267339 266674 268335 273519 283041 296417 313638 335921 364071 398116 439439 491244 555201
56858 555201 627702 699266 756946 788862 789744 763604 720225 668985 616422 567486 525642 491586
56846 491586 464395 444199 431822 426544 427034 434267 450644 476389 509960 552122 606453 675784
56834F75784Q5633J03662J20516J25023J05125O0805N626m4340p9826r8601j02626
56823I56781r6695q6262p4484o2221n0305l9712l0177k0896j2187m506L219J2324
56811D94879K2409L2625M3872N7651P3290Q7153R3013Q3047N2749P890l6395o6985
56799I45198q1747q5681q2452p3664o2684n3244m5363l6967k8345k1199j4894
56788C58958p871j248L207P197J3729K2184K9947L7359M5821N1798M8247L2682
56776F42010R852j3551l3000m5501m9822m8293m4853m0847l5462k9656k5794k3672
56764B61411k0806j6762j3548j1715r772p535o481o577o160n148n050n801n792
56751A40264m968m632m425k891q19m80j673k046j267j265k333k618j690j116j254
$$ plain form
56834 675784 761417 865079 985595 1110618 1215743 1276548 1282174 1237834 1158008 1059407 956781
56823 956781 860086 773824 699340 637119 586814 547102 516925 496029 483842 479336 482555 494879
56811 494879 517288 549913 593785 651436 724726 811879 904892 987939 1040688 1048578 1012183 945198
56799 945198 863451 777770 695318 621654 558970 505726 460363 423396 395051 373852 358958
56788 358958 351087 349839 353046 360243 373972 396156 426103 463462 509283 561081 609328 642010
56776 642010 651862 638311 605311 559810 509988 461695 416842 375995 340533 310877 285083 261411
56764 261411 240605 223843 210295 198580 188808 181273 174792 168215 162055 156907 151857 146056 140264
56751 140264 135296 130664 126239 123348 122529 122049 120376 118330 117063 115798 113465 110847 109157 108041 106787
56736A06787p73M09Q40L51J21J25m98r22L47K329K801K062K074K576J820M91P96
56719A21736K172K097Q57J078K719L066J812J536K732K955J463M03O03M74k70
56704A45433j5R80N01j216j278P51J880Q09k38J37N04J70N84J854J939N36o0P71
56686A54042Q57m56r36J96O87n17j380o88Oj52K22J295R49j140k242j079J51j2
56668A49803L4J231J738N76k87L99Q53k21j266j033p81j324j140N20J800J542
56652A52444J259J981K306J483J151K086K467J273K88O95R45m5p15J2N05o14k196
56635A65325l051l753m297l223q40L9j464k525j312K7p00k118k119j264r13p29
56619A37083l05n25j386j134N35J379M49k27M66O17q62j773m07J503K025K027
$$ plain form
56736 106787 106014 106423 107263 107614 107735 107860 107362 106440 106787 109116 111917 113979 116053 118629 120449 120940 121736
56719 121736 123908 126005 126862 127940 130659 133725 135537 137073 139805 142760 144223 144626 145229 145703 145433
56704 145433 145418 146398 146899 145683 144405 145156 147036 147845 147607 147744 148248 148418 149002 150856 152795 153331 153271 154042
56686 154042 154899 154443 153507 153703 154390 153873 152493 151805 151811 151659 151881 153176 154125 152985 150743 149664 149815 149803
56668 149803 149837 151068 152806 153382 153095 153494 154347 154126 152860 151827 151046 149722 148582 149102 150902 152444
56652 152444 153703 155684 157990 159473 160624 162710 165177 166450 166738 167433 168378 168333 167618 167630 168135 167521 165325
56635 165325 162274 158521 154224 151001 150161 150200 148736 146211 144899 144926 144226 142108 139989 138725 137812 137083
56619 137083 136778 136253 134867 133733 134268 135647 136096 135869 136335 136952 136090 134317 133910 135413 137438 139465
56603A39465K577K518J109K7L57N59l07m93J013K217J675J084J814K199R01l00
56587A56415J95Q65J88l79O44J802J534R76J284J112m53j478n27N33j18j044n02
56570A61047M36M96R69K915M532M275L716M452N163M584M268N393N908M093J927
56555B14174J631J893Q05m26j06N44J0k79J128K382J438k12l54Or92k348k360
56538B16934k020k808l612l056k380k757k564n86R45M2j269n36P15L5j336r74
56522A94773J95n4j026q20p0j94l09N48O82j122k426j016Q98L41j342j291k63
56505A87504n21j209m12N78l14j510l79J805K142J229J496K387J826O31R31J869
56489A98053J329J52L13Q66j2r86kJ346M79j245j056k7q42k337j572M05K85j457
$$ plain form
56603 139465 142042 144560 145669 145696 146053 146612 146305 145812 146825 149042 150717 151801 153615 155814 156715 156415
56587 156415 156610 157475 157663 157284 157928 159730 161264 162240 163524 164636 164183 162705 162178 162711 162593 161549 161047
56570 161047 161483 161979 162948 165863 170395 174670 178386 182838 188001 192585 196853 202246 208154 212247 214174
56555 214174 215805 217698 218503 218077 217971 218515 218525 218246 219374 221756 223194 222982 222628 222634 221642 219294 216934
56538 216934 214914 212106 208494 205438 203058 200301 197737 197151 198096 198138 196869 196333 197048 197083 195747 194773
56522 194773 194968 194914 193888 193068 192998 192804 192495 193043 193725 192603 190177 189161 190059 190400 189058 187767 187504
56505 187504 186983 185774 185362 185940 185626 184116 183737 185542 187684 188913 190409 192796 194622 195253 196184 198053
56489 198053 199382 199534 199847 200713 200701 199715 199713 201059 201538 200293 199237 199210 198368 196031 194459 194864 195149 193692
56471A93692j648k89q0j025p25O77R12J81N96J662J058o81r06L66Q32L50P03J659
56453A97334J503P32J064J751R61l33n9P57j62j683j072Q73J195Q3M2Q74L22j211
56435B02971j325j85J34j60N19J245J70j237l33J685J651P5j40P51K18j283j191
56418B03565K3j38j039n1K109K394J025P63J567J197K73J266L241L074J173O40
56402B21082J539J379M31R91K215J416l49K01K266K171K14Q1J930K339R31P28
56386B39565K020J978N14L83J445Q15j151j165O63R39m22l3K273K927J279N40
56370B52570J447J195o16j054L62Q48K4N18K363K671J406J532K963K527L33m1
56354B69048J687K040O06P67K864L294J440Q25K250K444P67O25K665L255J357
$$ plain form
56471 193692 192044 191755 191675 190650 189925 190602 191514 191695 192291 193953 195011 194330 193424 193790 194622 194972 195675 197334
56453 197334 198837 199569 200633 202384 203345 203012 202953 203710 203548 201865 200793 201666 202861 202944 202986 203860 204182 202971
56435 202971 201646 201461 201595 201435 201954 203199 203369 202132 201799 203484 205135 205210 205070 205821 206039 204756 203565
56418 203565 203588 203450 202411 202360 204469 206863 207888 208651 210218 211415 211688 212954 216195 219269 220442 221082
56402 221082 222621 224000 224431 225422 227637 229053 228704 228905 231171 233342 233556 233637 235567 237906 238837 239565
56386 239565 241585 243563 244077 244460 245905 246720 245569 244404 245067 246006 245584 245551 247824 250751 252030 252570
56370 252570 254017 255212 254596 253542 253904 254752 254776 255294 257657 260328 261734 263266 266229 268756 269089 269048
56354 269048 270735 272775 273381 274148 277012 280306 281746 282571 284821 287265 288032 288657 291322 294577 295934
56339B95934M19J696K119N78K3J389J708J70p4J954L078K016J479K514K682J501
56323C19186J729L571L676J521P02K291L079K032K161M247N087L867L816N647
56309C62612N770L139J596L142N000N326N830O913O254M091L783N566N943M533
56295D29498M929P453Q099O193N846Q162R375Q509R234J2072J2614R805Q233R690
56281E49712J0315Q723Q925J2171J3971J2543J2299J5477J8132J8098J9114K3260
56269G22740K6886K8015L0228L5350L9793M2000M6019N3677O0817O5408P1730
56258A222663Q2236R2881J00943J09955J22345J34572J44136J54049J65805J75129
56248B504714J79279J81315J82769J79553J69506J56450J42256J22741R6132O7632
$$ plain form
56339 295934 296353 298049 300168 300746 300769 302158 303866 304036 303962 305916 308994 311010 312489 315003 317685 319186
56323 319186 320915 324486 328162 329683 330385 332676 335755 337787 339948 344195 349282 353149 356965 362612
56309 362612 368382 371521 373117 376259 381259 386585 392415 399328 405582 409673 413456 419022 424965 429498
56295 429498 434427 441880 449979 456172 462018 470180 479555 488064 497298 509370 521984 531789 540022 549712
56281 549712 560027 568750 577675 589846 603817 616360 628659 644136 662268 680366 699480 722740
56269 722740 749626 777641 807869 843219 883012 925012 971031 1024708 1085525 1150933 1222663
56258 1222663 1304899 1397780 1498723 1608678 1731023 1865595 2009731 2163780 2329585 2504714
56248 2504714 2683993 2865308 3048077 3227630 3397136 3553586 3695842 3818583 3914715 3982347
56238C982347M0718J2030j9944m9345p1777r0849j10170j26534j36825j44051
56228C285600j50773j53913j51869j49204j48562j45562j37482j29118j24110
56219A995007j18443j08844r9612r4504q9665q1403p3370o9114o5098n8018n1625
56208A085311m9369m7489m2269l6925l4558l1793k6111k1844k2054k2090j8155
56197G32654j4413j4585j4668j1203q511j0052j0992p267l692m861o333l450n96
56184F22031k660n424l618q17j989l732j389J558N66p94J894M760L139R80L247
56169F17752O229M993L256O072R847R418Q022J0397J3169J1910J0523J3681J7247
56156G42516J6290J5148J9244K4474K5268K5543L0858L7364L9627M1887N0238
$$ plain form
56238 3982347 4023065 4035095 4015151 3965806 3894029 3803180 3693010 3566476 3429651 3285600
56228 3285600 3134827 2980914 2829045 2679841 2531279 2385717 2248235 2119117 1995007
56219 1995007 1876564 1767720 1668108 1573604 1483939 1402536 1329166 1260052 1194954 1136936 1085311
56208 1085311 1035942 988453 946184 909259 874701 842908 816797 794953 772899 750809 732654
56197 732654 718241 703656 688988 677785 669274 659222 648230 640963 637271 632410 626077 622627 622031
56184 622031 619371 613947 610329 609512 607523 603791 602402 603960 604526 603732 605626 610386 613525 614505 617752
56169 617752 623981 628974 632230 638302 648149 657567 665589 675986 689155 701065 711588 725269 742516
56156 742516 758806 773954 793198 817672 842940 868483 899341 936705 976332 1018219 1068457
56145A068457O1111O8921P7478R2056J07732J17621J24979J34661J40211J32747
56135B125974J15885R9034Q2903O4679N0330M7365N1016N0868M5702L9429K9218
56124B802403J1353p305j7454k1606k7681l5030l9896m7681o5460q8157j05833
56113B357653j18530j30644j37669j33030j21525j11689j01358q5005o8060n8849
56103A291294n3327m3126l1771k7287k5936j9445j1410j0004j1384p185j405k592
56091A046422o178k466M567M646Q00L063Q890Q853N800R112J5560J5295J1372
56078A125736J3774J9490J8325J3173J4402J9268J7303J1016J0704J3742J0031
56067A286964L004L921J0028R826N332P346J3442J2789Q120J0530J7125J6525
$$ plain form
56145 1068457 1129568 1198489 1275967 1368023 1475755 1593376 1718355 1853016 1993227 2125974
56135 2125974 2241859 2340893 2423796 2488475 2538805 2586170 2637186 2688054 2733756 2773185 2802403
56124 2802403 2813756 2806451 2788997 2767391 2739710 2704680 2664784 2617103 2551643 2463486 2357653
56113 2357653 2239123 2108479 1970810 1837780 1716255 1604566 1503208 1418203 1350143 1291294
56103 1291294 1237967 1194841 1163070 1135783 1109847 1090402 1078992 1068988 1057604 1050419 1049014 1046422
56091 1046422 1040244 1037778 1042345 1046991 1047791 1050854 1059744 1068597 1074397 1083509 1099069 1114364 1125736
56078 1125736 1139510 1159000 1177325 1190498 1204900 1224168 1241471 1252487 1263191 1276933 1286964
56067 1286964 1289968 1293889 1303917 1313743 1319075 1326421 1339863 1352652 1360772 1371302 1388427 1404952
56055A404952J1699J4233K0917J9647J3660J5557K2418K1597J6195J9206K7349
56044A607430K6970K1075K3585L1649L1208K5392K8872L8520L8824L2170L3842
56033A939537M1143L8397K8824K9686L9037L9678L2988L5692M5871M6242L8846
56022B355941M1651N2825N3991M7022N0965O4005O6153N8523O1393P4031P6088
56011C002588O8429P1889Q5493Q7763P9905Q4707J01761J07817J02678J09302
56001C902332J27010J31647J24052J29758J48338J53241J44665J50476J71420
55992E182939J79423J74094J84757K12011K25467K24417K40174K72940K89873
55983G186095K91624L14060L57306L83246L91078M21427M76893N16583N39279
$$ plain form
56055 1404952 1416651 1430884 1451801 1471448 1485108 1500665 1523083 1544680 1560875 1580081 1607430
56044 1607430 1634400 1655475 1679060 1710709 1741917 1767309 1796181 1834701 1873525 1905695 1939537
56033 1939537 1980680 2019077 2047901 2077587 2116624 2156302 2189290 2224982 2270853 2317095 2355941
56022 2355941 2397592 2450417 2504408 2551430 2602395 2666400 2732553 2791076 2852469 2926500 3002588
56011 3002588 3071017 3142906 3228399 3316162 3396067 3480774 3582535 3690352 3793030 3902332
56001 3902332 4029342 4160989 4285041 4414799 4563137 4716378 4861043 5011519 5182939
55992 5182939 5362362 5536456 5721213 5933224 6158691 6383108 6623282 6896222 7186095
55983 7186095 7477719 7791779 8149085 8532331 8923409 9344836 9821729 10338312 10877591
55974A0877591N89417O69391P33511P81357Q64148R85203J094009J193756J346877
55965A9135260J557871J768655J989021K303458K728717L208713L775637M555163
55957D1022495N580209O775995Q161089R860261J1893061J4210623J6990625K0589210
55949A35083568K5159224L0723037L7561734M5505640N2068882N2145100M1324931
55942D19572116K0290497m639472k5825915l9075280m4571021m4567603m1257597
55935B39925725l6308290l0996688k6067011k1713505j7948860j4842460j2381844
55928G9667067j0391574q724543p369357o304287n415616m629398l977342l470079
55920B9384871l033184k620839k273186k010760j779907j548389j354672j218682
$$ plain form
55974 10877591 11467008 12136399 12869910 13651267 14515415 15500618 16594627 17788383 19135260
55965 19135260 20693131 22461786 24450807 26754265 29482982 32691695 36467332 41022495
55957 41022495 46602704 53378699 61539788 71400049 83293110 97503733 114494358 135083568
55949 135083568 160242792 190965829 228527563 274033203 326102085 378247185 419572116
55942 419572116 439862613 435223141 409397226 370321946 325750925 281183322 239925725
55935 239925725 203617435 172620747 146553736 124840231 106891371 92048911 79667067
55928 79667067 69275493 60550950 53181593 46877306 41461690 36832292 32854950 29384871
55920 29384871 26351687 23730848 21457662 19446902 17666995 16118606 14763934 13545252
55912A3545252j095824r60213q47700p77606p11901o28625n60468n25301m89223
55903F948391m32341l84464l63163l39641k97286k63913k55417k44382k14034
55894D153750j89224j85430j78868j54920j36678j38290j37033j18073j01930
55885B813304j02130r8979q0159o5684o8406o9856n8611n3621o6266p6974p2137
55874B000481o7991p5842p9111o6985n6571n9779o1155m9820m1252m6228m9393
55863A346354l9692l1862l6915m0666l2230k5574l2100l8886l4314k9170l2697
55852I72248l3274k2356j3009j5598j8848j3292r833j6885k2434j7022j2008j6988
55840G60701k1287j5680j0700j5433j9345j3146p171j1117j5409j0363m642p214
$$ plain form
55912 13545252 12449428 11489215 10641515 9863909 9152008 8523383 7962915 7437614 6948391
55903 6948391 6516050 6131586 5768423 5428782 5131496 4867583 4612166 4367784 4153750
55894 4153750 3964526 3779096 3600228 3445308 3308630 3170340 3033307 2915234 2813304
55885 2813304 2711174 2612195 2532036 2466352 2397946 2328090 2269479 2215858 2149592 2072618 2000481
55874 2000481 1932490 1856648 1777537 1710552 1653981 1594202 1533047 1483227 1441975 1395747 1346354
55863 1346354 1306662 1274800 1237885 1197219 1164989 1139415 1107315 1068429 1034115 1004945 972248
55852 972248 938974 916618 903609 888011 869163 855871 846038 829153 806719 789697 777689 760701
55840 760701 739414 723734 713034 697601 678256 665110 657939 646822 631413 621050 616408 609194
55828F09194r686l801J694j412m258J470O811K917j971Q27L731j000n044k25N175
55813F04422K372j322K205N501N14n174l128n15n843j2315j1280q622j2098j5588
55799E39129j1597o653q946j2903j0905q131j1120j3724q960k980l035l538J708
55786D38345N597O38o041n284k053m380p589m408o2k163n759l287L17k820q313
55771C92738q333o567r967j4375j2528q186q448j0089o939k894m256o912m223
55758B89021J8q22l398j828J7l704q503p642m987p210j0807r384o339p639r446
55743B07347n656n98j370m399k434J809J621o42Q91L385J239j917K56M262L116
55728B06910o13m15J367j152m923l435N27j8l220k666Q4p00l160j784J246K91
$$ plain form
55828 609194 599508 595707 597401 595989 591731 593201 600012 602929 600958 601785 605516 604516 599472 599247 604422
55813 604422 606794 605472 607677 613178 613692 608518 605390 604875 599032 586717 575437 566815 554717 539129
55799 539129 527532 520879 511933 499030 488125 479994 468874 455150 446190 443210 440175 436637 438345
55786 438345 443942 444580 438539 433255 431202 426822 419233 414825 414763 412600 406841 403554 403871 401051 392738
55771 392738 384405 377838 367871 353496 340968 332782 324334 314245 307306 304412 300156 293244 289021
55758 289021 289039 288217 284819 282991 283008 279304 270801 263159 258172 250962 240155 230771 224432 216793 207347
55743 207347 201691 201093 199723 195324 192890 194699 196320 195678 196569 199954 201193 199276 199532 203794 206910
55728 206910 206297 205882 207249 206097 201174 197739 198266 198248 195028 192362 192446 191746 188586 186802 188048 188339
55712A88339k443j310J504M05k238o00L099K908P46K298N532M614J322J224K522
55697B07922N2l590k398J319J090j473r4L881M321K260L469O835O622L809L952
55682B37977O053M633P56O4J936J260j055n3K859K113j266j537Q64O76j704j360
55666B52216J080O86j915j838L37j47k759l059j958l896p487p639n328n555p312
55651B05426n564j616j369m488n350l624l923n903m845j372o89k668k388k5m45
55636A61157l353l530p45R9j474j180R16M15k290k240N09P82j916k643m70K15
55620A44252j481j629L34N76j257j427J04n61l237l529j177m43j820j500N14J09
55604A27828k593k825Q6J604L64k02O87j6k146j870Q08J670J17o4J641J644l19
$$ plain form
55712 188339 185896 184586 186090 186495 184257 183657 186756 189664 190410 192708 198240 202854 204176 205400 207922
55697 207922 207974 204384 201986 203305 204395 202922 202828 206709 211030 213290 216759 223594 230216 234025 237977
55682 237977 244030 248663 249419 249483 251419 252679 251624 251571 254430 256543 255277 253740 254604 255280 253576 252216
55666 252216 253296 253982 252067 250229 250566 250419 247660 244601 242643 238747 231260 223621 218293 212738 205426
55651 205426 199862 198246 196877 192389 187039 183415 179492 173589 168744 167372 166683 164015 161627 161602 161157
55636 161157 157804 154274 153529 153628 152154 150974 151890 152305 150015 147775 148284 149066 147150 144507 144037 144252
55620 144252 142771 141142 141476 142052 140795 139368 139472 138911 135674 132145 130968 130525 128705 127205 127719 127828
55604 127828 125235 122410 122496 124100 124464 124262 124949 124933 122787 120917 121725 123395 123512 123448 125089 126733 126414
55587A26414n48J214J323k92J83K734L232J515J856M690N741M369M781P855R584
55572A74651Q959R565J1918J1999Q956O783O650M998R03k011k652m236p311q207
55558B20965o208n204o448o604m669l858m918m517k097j377l162l595j359P7o81
55543A66345o66J047J249r64k242j425j540l546m425l272k975m153l896k074k254
55528A35209m715n309l003j772l075l432j528o87k016j961O27J819k75k193j656
55513A06033j105k022j978r9O74n65n91J604K456M73r05J74P22j019k244j228
55497A00380m61j240r48J310K193J68j494o87J22o93p86R81J749J29r92L7O36
55480A00404o65j355j93J47j453k009k50O94p02j260P50K107N98r55j59Q12M3
$$ plain form
55587 126414 125866 127080 128403 128111 128294 131028 134260 135775 137631 142321 148062 152431 157212 165067 174651
55572 174651 183610 193175 205093 217092 226048 232831 239481 244479 245382 243371 240719 236483 229172 220965
55558 220965 214757 209553 203105 196501 191832 187974 183056 178539 176442 175065 171903 168308 166949 167026 166345
55543 166345 165679 166726 167975 167011 164769 163344 161804 158258 153833 150561 147586 143433 139537 137463 135209
55528 135209 130494 125185 122182 120410 117335 113903 112375 111688 109672 107711 108338 110157 109882 107689 106033
55513 106033 104928 102906 100928 100829 101503 100938 100347 101951 104407 104880 103975 104149 104871 103852 101608 100380
55497 100380 99919 98679 97731 99041 101234 101402 99908 99221 99343 98650 97864 98845 100594 100723 99731 99768 100404
55480 100404 99739 98384 98191 98338 96885 94876 94626 95320 94618 93358 94108 96215 96813 95858 95699 96511 96554
55463I6554l80R95J630j03j537o27M91N2m9J273J505m94j681l04P28o41j759m07
55445I5246J110O17K2J031J620L54l86R13J680J77r84J63J160j0r61L63J625O42
55427A04382m48M93J518P33J72J661K926J902P40J656K814K199J616K874L943
55412A29181K780J149R02L69j891l647l043k164k934l507k278j343k195k362k17
55397A08800J277k35j877o20J320P46p89l70R24P73K98J312K141P93q55m46M22
55380A13614m84j573o94L93o71k157j484j13n70j564p01O17k66k273k651j745
55364I7678j470j366k28O78Ln24P68J887O26j106n25J136J174K73M89Q80m83k345
55346I7545k320j097o70n64M34J079N4q43L15J815J355K51P26J562O05q86o23
$$ plain form
55463 96554 96174 97169 98799 98696 97159 96532 97023 97075 97026 98299 99804 99310 97629 97325 98053 97412 95653 95246
55445 95246 96356 96973 96995 98026 99646 100000 99614 100527 102207 102384 101400 101563 102723 102713 101752 102115 103740 104382
55427 104382 103934 104427 105945 106678 106850 108511 111437 113339 114079 115735 118549 120748 122364 125238 129181
55412 129181 131961 133110 134012 134381 132490 128843 125800 123636 120702 117195 114917 113574 111379 109017 108800
55397 108800 110077 109842 107965 107345 108665 109411 108622 108252 109176 109949 110247 111559 113700 114493 113638 113192 113614
55380 113614 113130 111557 110863 111256 110585 108428 106944 106831 106261 104697 103996 104613 104347 102074 99423 97678
55364 97678 96208 94842 94614 95292 95295 94771 95539 97426 98052 96946 96421 97557 98731 99004 99493 100373 99890 97545
55346 97545 95225 94128 93458 92894 93328 94407 94461 93618 93933 95748 97103 97354 98080 99642 100247 99361 98738
55329I8738L94N4n95M64J984J576O6l00L0n53j263p08o7p94j385j77J105L66q23
55310I8112j33J118N34r35j176r76j770j978N1K056J292n76m37Q37N85n29k73
55293I5802N33q4r23O4J401P14n20K59J549M71j563j264M95M89q12n03R89R51
55275I8048j31L59J755J230o55q66M37M82o60m15R96Q84o77r36M11R68L22L74
55257A01926J172R43l4J30R99N39p72p96k2o39k026j677K6M54l84j84R99J016
55239A01670Q6L54J384P48j201j711n87k27r17o46N20M25q32r72Q9L10k02O29
55221I8920K448K724J389Q52J370Q45p04r68K16N72k64m01K32j90j349j027M92
55204A05157O90l83j43J477J655j86j421j014q09j356r01O49J094P8k21P19R52
$$ plain form
55329 98738 99132 99186 98591 99055 101039 102615 102681 102381 102411 101858 100595 99887 99820 99026 97641 97464 98569 98935 98112
55310 98112 97979 99097 99631 98696 97520 96544 94774 92796 92847 94903 96195 95619 95182 96019 96604 96075 95802
55293 95802 96335 96251 95328 95392 96793 97507 96987 97246 98795 99266 97703 96439 96934 97423 96611 96108 97097 98048
55275 98048 97917 98276 100031 101261 100606 99740 100177 100659 99999 99584 100580 101464 100787 99851 100262 101230 101552 101926
55257 101926 103098 104041 104007 104137 105136 105675 104903 104107 104085 103446 101420 99743 99769 100223 99839 99655 100654 101670
55239 101670 101756 102110 103494 104242 103041 101330 100743 100516 99599 98953 99473 99898 99066 98094 98183 98493 98291 98920
55221 98920 101368 104092 105481 106333 107703 108548 107844 106876 107092 107664 107400 106999 107231 107041 105692 104665 105157
55204 105157 105847 105464 105321 106798 108453 108267 106846 105832 105023 103667 102766 103415 104509 104587 104366 105085 106037
55187A06037R1L8R87R18k63k79R98R60q88j825p60N4n73q08K56P35l17r90o0R26
55167A05237P17L89Q20J095O26K35R4o24j456q77O73R96k25j093r85j082j234
55150A03306JJ933K078M45l27M76P82m1j24R67J259K41k45J75l69j920k001j15
55132A06521J061K95l66K48M75m62o98N87J427P80L60J070J170j50r01Q3R30J15
55114A12545j032j094q84j164r30K49R12L84R4Q33J320Q70O73J198J117L4n11
55097A14614R1M90J99M40J237R35l98m77J109J838N85n33j21K76l61m79P22J313
55079A21480J55p91K29J911K433K142J803Q92n84j113k60L39j24k93M24N80l53
55062A28870p18J80P12R0k25K92k6j557k083p15K83n28j363q39m91j442j855k82
$$ plain form
55187 106037 106128 106166 107153 108071 107808 107529 108527 109487 108599 106774 106014 106068 105495 104687 104943 105678 105361 104371 104311 105237
55167 105237 105954 106343 107163 108258 108884 109119 109213 108589 107133 106256 106929 107925 107700 106607 105622 104540 103306
55150 103306 103307 105240 107318 107763 107436 107912 108694 108653 108529 109496 110755 110996 110751 110926 110557 108637 106636 106521
55132 106521 107582 107877 107511 107759 108234 107772 107074 107661 109088 109868 110228 111298 112468 112318 111417 111500 112430 112545
55114 112545 111513 110419 109535 108371 107441 107690 108602 108986 109080 109913 111233 112103 112776 113974 115091 115125 114614
55097 114614 114705 115195 115394 115834 117071 118006 117608 117131 118240 120078 120663 120130 120009 120285 119924 119445 120167 121480
55079 121480 121635 120844 121073 122984 125417 127559 129362 130254 129670 128557 128297 128636 128512 128219 128643 129223 128870
55062 128870 128152 128332 129044 129134 128909 129201 129175 127618 125535 124820 125103 124575 123212 122373 121882 120440 118585 118303
55044A18303J523J647J072J194J160J11n71K02R57K90o45m96j42o35j092p18m50
55027A21710p62m22P21O14j362k672j728n41r61j389j2J729J881J417J935K404
55011A22562J327j32k38K05k76q81k68O82O06K81Q39J293M62m66j2P96L57n48
54993A26589l26M94M79j05k79l80r02r35Q6Q22K66l21K06O06l24j248o16N21N67
54974A25200K53Q53J437O31n67m59M47P33P25J385K051J761J273J538J662O83
54958A39606k79L4O42K21l73R0P09K46l15L64J281R54L06J002K337K610K236K780
54940A54451M017M585M592N119O123O974Q005R381R799Q331O268N051L859J336
54926B37891j808m119n762p450q539q332p789p779p357n777m432m534m815l815
$$ plain form
55044 118303 119826 121473 122545 123739 124899 125010 124439 124641 125598 125888 125243 124747 124605 123970 122878 122160 121710
55027 121710 120948 120526 121247 121861 120499 117827 116099 115558 114597 113208 113196 114925 116806 118223 120158 122562
55011 122562 123889 123757 123519 123724 123448 122567 122299 122981 123587 123868 124707 126000 126462 125996 125984 126780 127137 126589
54993 126589 126263 126757 127236 127131 126852 126472 125570 124635 124721 125543 125809 125488 125694 126300 125976 124728 124112 124633 125200
54974 125200 125453 126306 127743 128374 127807 127348 127795 128528 129253 130638 132689 134450 135723 137261 138923 139606
54958 139606 139327 139361 140003 140224 139851 139941 140650 140896 140581 140945 142226 143180 143486 144488 146825 149435 151671 154451
54940 154451 158468 163053 167645 172764 178887 185861 193866 203247 213046 221377 227645 232696 236555 237891
54926 237891 236083 231964 226202 218752 210213 201881 194092 186313 178956 173179 168747 164213 159398 155583
54912A55583k471k086j766m57N56m8q71k10Q20N37L2J039K387K056J125K076M519
54895A62821O102O541P283Q188P968P100P127P671P149N622M131K194j091m434
54881B34372n841n847o346p300p462p273p813q035o335l980l539m651m771l513
54867A51666k768k925k467j256q25j308j153m1O75N92O74J031P41r1m60m93j139
54850A40453k097k283j912j928j903q15O62R71J72n28r88j617j569J0J801J937
54834A30366R52O28R05N83O4N16J246Q27m7K42J096P93j98j74M21r4j216j080
54816A35830j02j95r31j18K002K848J788P91P42M80k65k91M21N28J1J47P55M82
54798A44923k29M23K181K946K395K209K656K313J359J675L340M373M343M890O311
$$ plain form
54912 155583 153112 151026 149260 148803 149359 149311 148440 148230 149050 149587 149619 150658 153045 155101 156226 158302 162821
54895 162821 168923 175464 182747 190935 198903 206003 213130 220801 227950 233572 237703 239897 238806 234372
54881 234372 228531 222684 216338 209038 201576 194303 186490 178455 172120 168140 164601 159950 155179 151666
54867 151666 148898 145973 143506 142250 141425 140117 138964 138923 139598 140190 140864 141895 142636 142545 142085 141592 140453
54850 140453 138356 136073 134161 132233 130330 129515 130177 131148 131320 130792 129804 128187 126618 126628 128429 130366
54834 130366 131318 131946 132851 133434 133498 134014 135260 136087 136040 136282 137378 138171 137973 137799 138220 138126 136910 135830
54816 135830 135728 135533 134602 134484 136486 139334 141122 141913 142655 143135 142870 142579 143000 143528 143539 143686 144441 144923
54798 144923 144694 145117 147298 150244 152639 154848 157504 159817 161176 162851 166191 170564 174907 179797 186108
54783A86108P004O880P814R999J1270J0919J0874J1969J2376J0935R031P959P219
54770C10357O588O936P743O611K691j713m203m685l872k029l55j063m608q821
54756C09577j1816j3776j5083j5099j3731j2139j0872r280p350o084n408m054
54744A84885j974n78P8J690M562O783P366P637Q448Q599P361N983N310M135J455
54729B51740j676l945n715p778r720j0700j0517r202o980n026m559m928m422l118
54715A63454k682l266l139j905j240j739j804o71J29l67q65l13K41j66o11j87
54699A44869K88p6o58p74r57j527j598o94J95K28p2k05n19r34n73M80Q67J74l31
54680A38183kJ51m17o41J62J028J087P93N41j57j215j520q35l19m51l06M51Q59
$$ plain form
54783 186108 193112 199992 207806 217805 229075 239994 250868 262837 275213 286148 295179 303138 310357
54770 310357 316945 323881 331624 338235 340926 339213 335010 330325 326453 324424 324069 323006 318398 309577
54756 309577 297761 283985 268902 253803 240072 227933 217061 207781 200431 194347 188939 184885
54744 184885 182911 182333 182411 184101 188663 195446 202812 210449 218897 227496 234857 240840 246150 250285 251740
54729 251740 250064 246119 240404 232626 222906 212206 201689 192487 185507 180481 175922 170994 166572 163454
54715 163454 160772 157506 154367 152462 151222 149483 147679 147008 147137 146770 145905 145592 145833 145667 145056 144869
54699 144869 145157 145081 144423 143649 142692 141165 139567 138873 139068 139296 139224 139019 138500 137566 136993 137473 138340 138514 138183
54680 138183 138181 138332 137915 137274 137436 138464 139551 140344 140885 140728 139513 137993 137158 136839 136388 136082 136533 137392
54662A37392O99R79J672J234o27j978j591o43l88l29J43M29K97O20J376J051o99
54645A39637j957j491o11o96j020o01r0j39J08J216J939J217%n56r53j793k109
54628A32101j059K68N50L82J005K076K387J766Q50o5p82p75p2M56M62N49Q17M98
54610A41414l08l91L50L97p45j439o01N38O53L79O61R27M08l11m92n35p96o34
54592A39475J15L40m67j177r74o33p92p31n7L21O9K80J251J524N08j62N19J060
54574A40469K21o19P2J200J034J91K58R58R58L41O3O5j39r3O44J299J267J361
54556A49550K107K299J107O4Q65K474K680J407L71K61L31J78L5k15p49j093r23
54539A60749q76j388j743j349r22j132j328q46k75k12j06L85L42o97j467r27J3
$$ plain form
54662 137392 138091 139070 140742 141976 141349 139371 137780 137137 136749 136420 136563 136992 137289 137909 139285 140336 139637
54645 139637 137680 136189 135578 134882 133862 133261 133171 133032 133140 134356 136295 137512 137512 136956 136003 134210 132101
54628 132101 131042 131310 131860 132242 133247 135323 137710 139476 140326 140261 139479 138704 138632 139088 139550 140099 140916 141414
54610 141414 141106 140715 141065 141462 140717 139278 138677 139215 139868 140247 140908 141835 142243 141932 141440 140905 140109 139475
54592 139475 139590 139930 139463 138286 137312 136679 135887 135156 135099 135420 135489 135769 137020 138544 139052 138890 139409 140469
54574 140469 140690 140071 140143 141343 142377 142568 142826 143784 144742 145083 145146 145211 145072 144979 145623 146922 148189 149550
54556 149550 151657 153956 155063 155127 155992 158466 161146 162553 162924 163185 163516 163694 163729 163514 162765 161672 160749
54539 160749 159873 158485 156742 155393 154471 153339 152011 151165 150890 150678 150572 150957 151299 150602 149135 148208 148221
54522A48221K03J61O45Q96J12p63n30K21M06M00R36J317O67k78m09j55l80o22
54504A51048j89J85k90p17K5J173J317P07M33M32J20n6M54Q22J45p77p25q5J14
54485A54136O3L49N08J03O6J066J895J375N66R71J812J438K71k5N95Q94P60J007
54467A67850J358Q16l47r82r62r39q29k88l3r00k238k870k846k773k359j288m45
54450A49925m83l46Q96J990J356j62o43j18j2m88o38n64r79j454j157o04o50o17
54432A45252M26J524J211J68Q5P84R34P54J391K308J996Q65O59J361J322L38j8
54415A61360Q11J634J689J397R08l7q40o09J35K24k8N37J512J388K09m84k75k84
54397A69247q51r72k17O47J151J505J451L96j241k250k147j238K70J935K559J674
$$ plain form
54522 148221 148424 148585 149230 150126 150238 149475 148945 149166 149572 149972 150908 152225 152892 152614 152205 152050 151670 151048
54504 151048 150859 151044 150754 150037 150062 151235 152552 153259 153692 154124 154244 154188 154642 155464 155609 154832 154107 154022 154136
54485 154136 154199 154548 155056 155159 155225 156291 158186 159561 160127 161098 162910 164348 164619 164594 165189 166083 166843 167850
54467 167850 169208 170024 169677 168695 167733 166794 165965 165677 165644 164744 162506 159636 156790 154017 151658 150370 149925
54450 149925 149442 149096 149992 151982 153338 153176 152533 152415 152403 151915 151277 150713 149734 148280 147123 146519 145869 145252
54432 145252 145678 147202 148413 148581 148666 149450 150384 151138 152529 154837 156833 157698 158357 159718 161040 161378 161360
54415 161360 162171 163805 165494 166891 167799 167762 166922 166313 166448 166672 166644 167181 168693 170081 170290 169806 169531 169247
54397 169247 168396 167424 167207 167854 169005 170510 171961 172357 171116 168866 166719 165481 165751 167686 170245 171919
54381A71919P33J169K177K239J761K083K857K830K417K969M102M308L606L121
54367B08291K555P40j679k816k582k501k789k281j144r26j810k398k317k529l029
54352A82785k724j735j337j547j169k88j77p07m42N96R22M66P03J635J501l3j122
54335A77327q72m98p35n94L80J052P93M86N93L25n27r97q30r81j634j771j161
54318A70356p52o54J00J247J175l23j467j315r63j091p65M48J350J189R02J244
54302A70681J517J109N93L96J02l04j93J62l61j568j848p93Q5p6k94J73N69L88
54284A70338L66Q44J018O33N98J121J155M81L61J308K067J824J425J503J318N13
54268A86873J17O94J207Q90N40Q61J138O70O3m8j32o68j163j138q86n71J26R49
$$ plain form
54381 171919 172652 173821 175998 178237 179998 182081 184938 187768 190185 193154 197256 201564 205170 208291
54367 208291 210846 211586 209907 207091 204509 202008 199219 196938 195794 194868 193058 190660 188343 185814 182785
54352 182785 180061 178326 176989 175442 174273 173985 173808 173101 172659 173255 174177 174643 175346 176981 178482 178449 177327
54335 177327 176455 175957 175222 174628 175008 176060 176853 177339 177932 178257 177730 176733 175903 174922 173288 171517 170356
54318 170356 169604 168950 169050 170297 171472 171149 169682 168367 167404 166313 165548 165996 167346 168535 169437 170681
54302 170681 172198 173307 173900 174296 174398 174094 173901 174063 173702 172134 170286 169493 169578 169502 169208 169381 169950 170338
54284 170338 170704 171548 172566 173199 173797 174918 176073 176554 176915 178223 180290 182114 183539 185042 186360 186873
54268 186873 186990 187684 188891 189781 190321 191182 192320 192990 193053 193005 192873 192205 191042 189904 189018 188447 188573 189522
54250A89522J014L07j79j81m51j056j151p22p46j209r24K50R54O27K36K77R1l30
54232A86329j15M87J44r54j022J48N69m93j211m91J69m36j053m00N11L69k32k89
54214A82030k71p63j048o13l63q52r83o1O97J90p31r97j124j730j958j082n4J60
54196A70447K53J013J643J284O95Q27J183J059R82J349J186j43j416j328m15J52
54180A78771K99K06n76j787j892m75O12P8o46L9J100Q09j46N4J228J776J467J328
54162A82245J463J177O45N99P57L71j75J25J228K282L064L801M161L658K590J507
54146B09498M09p16j469j862k546l392l246j975j122j413j295N50K878L732L251
54131B01282K922L274L965N007O274O833O193N178M357K949N98j413k205k910
$$ plain form
54250 189522 190536 190843 190664 190483 190032 188976 187825 187103 186357 185148 184224 184474 185428 186055 186291 186568 186659 186329
54232 186329 186214 186701 186845 185891 184869 185017 185586 185093 183882 183391 183560 183124 182071 181671 182182 182551 182319 182030
54214 182030 181759 180996 179948 179335 178972 178120 177137 177076 177773 177963 177232 176235 175111 173381 171423 170341 170287 170447
54196 170447 170700 171713 173356 174640 175335 176162 177345 178404 179386 180735 181921 181778 180362 179034 178619 178771
54180 178771 179070 179276 178700 176913 175021 174546 175158 175236 174590 174629 175729 176538 176392 176446 177674 179450 180917 182245
54162 182245 183708 184885 185530 186129 186886 187257 187082 187207 188435 190717 193781 197582 201743 205401 207991 209498
54146 209498 209907 209191 207722 205860 203314 199922 196676 194701 193579 192166 190871 191421 194299 198031 201282
54131 201282 204204 207478 211443 216450 222724 229557 235750 240928 245285 248234 248832 247419 245214 242304
54117B42304m552n977n810m869m591m557l785l004l263l634k670j133p58j271
54103A92430j097k70j28o67o61%K95J33K93O54M27j48k31r0n01q70j3J555K065
54084A93176J107k1l95j70N02J606K420K198J453J215J324R01K3n57q75j342j472
54067B01093o43L37J27j058j803j586r82k42P30J416J276R13J262K039K406K505
54051B07790K896L160K693K147K482L238L431L313L548L529K508J615K484M522
54037B49356N711N693N721O031N652M741M637N400N528M462L367L048K977K712
54023C15036K584K557K014R75J75k47p70j277j256j122j853l239m105m177m258
54008C01037m555m451l916l617l557l145k647k962l817l814k482r49k44k09k32
$$ plain form
54117 242304 237752 231775 225965 221096 216505 211948 208163 205159 201896 198262 195592 194459 193701 192430
54103 192430 191333 191063 190935 190268 189607 189607 189902 190035 190328 190982 191409 191261 191030 190940 190439 189569 189556 191111 193176
54084 193176 194283 194262 193867 193697 194199 195805 198225 200423 201876 203091 204415 205316 205339 204782 203907 202565 201093
54067 201093 200450 200787 200914 199856 198053 196467 195485 195243 195973 197389 198665 199578 200840 202879 205285 207790
54051 207790 210686 213846 216539 218686 221168 224406 227837 231150 234698 238227 240735 242350 244834 249356
54037 249356 255067 260760 266481 272512 278164 282905 287542 292942 298470 302932 306299 309347 312324 315036
54023 315036 317620 320177 322191 323166 323341 323094 322324 321047 319791 318669 316816 313577 309472 305295 301037
54008 301037 296482 292031 288115 284498 280941 277796 275149 272187 268370 264556 262074 261125 260881 260672 260440
53993B60440L5Q16K018K999L422M053N682P805R503J0817J1798J0991O913O17
53979C37909n062q624j0513j1123j0249q467p028o139n106m078l862m059l373
53966B50226j887j052j218j150l70K8n26j017n92J56M14L82N47Q87J249J618J685
53949B49380J195P60J252K401L145L332L756M561N026M936M835M886M826N011
53935B99302O035P362P800P393P391Q271R346J0401J2074J4315J5923J5980J4491
53922D36084J1519P194K799L47N53K394M872P927J1227J3322J2684R062L624j628
53908E21980m906n956o138o628p162p239p428q117q183o625m573l810m136m230
53894D36849m264n335o935p503p154p322p995p829o984p087q223q627p759p130
$$ plain form
53993 260440 260475 261291 263309 266308 269730 273783 279465 287270 296773 307590 319388 330379 337292 337909
53979 337909 332847 324223 313710 302587 292338 283871 276843 270704 265598 261520 257658 253599 250226
53966 250226 248339 247287 246069 244919 244549 244577 244051 243034 242442 242598 243012 243394 243941 244828 246077 247695 249380
53949 249380 250575 251335 252587 254988 258133 261465 265221 269782 274808 279744 284579 289465 294291 299302
53935 299302 305337 312699 320499 327892 335283 343554 352900 363301 375375 389690 405613 421593 436084
53922 436084 447603 454797 457596 457943 458496 460890 465762 473689 484916 498238 510922 519984 523608 521980
53908 521980 517074 511118 504980 498352 491190 483951 476523 468406 460223 453598 449025 445215 441079 436849
53894 436849 432585 427250 420315 412812 405658 398336 390341 382512 375528 368441 360218 351591 343832 336702
53880C36702p406p297o064m799m338m011l361l092l447l521l006k820l305l565
53866B76670l267l227l591l264j981j033j255j959k511l182l807l496k345j585
53852B40167j522j176n33r09k355k953j727j30M45N60R72J046L13k29K09P99O84
53835B33661M55P84J128R25O65O49J87q85j510j258j248k008k191q06R06J359
53819B30813R86J125J772K041J875J882K181K595L176L713L625L126L357M586
53805B66853N562N463N175N696O578O947O778O293N341M268L957M202L549J677
53791C38339K85M83J089P64J60L77Q23L82n28q26p12j123k025k693l093l707m560
53774C23435n319n815n768m922l931l903m593m481l263k516l069l629l141k533
$$ plain form
53880 336702 329296 321999 315935 311136 306798 302787 299426 296334 292887 289366 286360 283540 280235 276670
53866 276670 273403 270176 266585 263321 261340 260307 259052 257093 254582 251400 247593 244097 241752 240167
53852 240167 238645 237469 236936 236027 233672 230719 228992 228862 229307 229867 230839 231885 232198 231969 232178 232977 233661
53835 233661 234116 234900 236028 236953 237618 238267 238454 237569 236059 234801 233553 231545 229354 228548 229454 230813
53819 230813 231799 232924 234696 236737 238612 240494 242675 245270 248446 252159 255784 258910 262267 266853
53805 266853 272415 277878 283053 288749 295327 302274 309052 315345 320686 324954 328911 333113 336662 338339
53791 338339 338624 339107 340196 340960 341120 341497 342320 342702 342174 341348 340636 339513 337488 334795 331702 327995 323435
53774 323435 318116 312301 306533 301611 297680 293777 289184 284703 281440 278924 275855 272226 269085 266552
53760B66552k708k716j618m21l35o47k90p5j219k829l021j735m69R2L88O13O72
53743B50234Q71J214Q06o52j704j080K56O58L36M98R13M52o19r90n24k52l51j4
53725B50052Q68J580J961K362K479J758Q46J041K305L273L214K726K436K222J882
53710B81005J508J164R22J131J917K734K981K716K158J190P0k26O65J640J612
53695C03187J096J208J909K346K290J999J347L33k37K55J165J607J819K323K573
53680C25220J850Q13N99R42O60l27r40o20J51P88J022P05J89L55J306J751P66
53663C35230n82p28O7L47j63m08J11Q15J234J372J154O16L70P80J104N77j43O8
53645C41821R11J178P93Q57J760K614K633K003J303R37J061J434J578J597K202
$$ plain form
53760 266552 263844 261128 259510 259089 258754 258107 257817 257742 256523 253694 250673 248938 248469 248561 248949 249562 250234
53743 250234 251105 252319 253125 252473 250769 249689 249945 250603 250939 251437 252350 252802 252183 251193 250669 250417 250066 250052
53725 250052 250920 252500 254461 256823 259302 261060 261906 262947 265252 268525 271739 274465 276901 279123 281005
53710 281005 282513 283677 284599 285730 287647 290381 293362 296078 298236 299426 299496 299270 299935 301575 303187
53695 303187 304283 305491 307400 309746 312036 314035 315382 315715 315478 315733 316898 318505 320324 322647 325220
53680 325220 327070 327883 328482 329424 330084 329757 328817 328197 328348 329136 330158 330863 331052 331407 332713 334464 335230
53663 335230 334648 333920 333987 334334 334171 333763 333874 334689 335923 337295 338449 339065 339435 340215 341319 341896 341753 341821
53645 341821 342732 343910 344703 345560 347320 349934 352567 354570 355873 356810 357871 359305 360883 362480 364682
53630C64682L344L767K776J444R80R06K09p42r82p81j013j361q41K95Q73O97N69
53613C74822P37P86Q13J284J972K324K582L215L707L261K323J931J990J666J098
53598D04511J145J707J901J692J847K374K525K182J903J677J006M7n89r75j539
53583D21414j939j594r45q17r59o18j06k11n87l83Ml84j063q12k2k49j424j811
53565D07494r27k93q45j566j461j094j284j790k051k032j738r55NM26L42M60P91
53548C93482N85j81n67k09K22M07R17J879K459K198J810K049K756L422L856L981
53532D19066L720L349L270L371L393L662M545N512N885O226P578R560J0654J0443
53518E00234J0044J0247J0662J0892J1039J0848R859Q699Q794J0353J1957J2631
$$ plain form
53630 364682 368026 371793 374569 376013 376993 377899 378108 377366 376384 375603 374590 373229 372388 372683 373556 374253 374822
53613 374822 375559 376345 377158 378442 380414 382738 385320 388535 392242 395503 397826 399757 401747 403413 404511
53598 404511 405656 407363 409264 410956 412803 415177 417702 419884 421787 423464 424470 424517 423928 422953 421414
53583 421414 419475 417881 416936 416119 415160 414542 414436 414225 413638 413255 413259 412875 411812 411000 410978 410729 409305 407494
53565 407494 406567 406274 405429 403863 402402 401308 400024 398234 396183 394151 392413 391458 391463 391889 392231 392691 393482
53548 393482 394067 393886 393319 393110 393332 393739 394656 396535 398994 401192 403002 405051 407807 411229 415085 419066
53532 419066 422786 426135 429405 432776 436169 439831 444376 449888 455773 461999 469577 479137 489791 500234
53518 500234 510278 520525 531187 542079 553118 563966 573825 582524 591318 601671 613628 626259
53506F26259J2979J3823J4961J5863J6501J6928J6986J6892J7184J7815J8168
53495H04359J8204J8516J9147J9381J8954J8369J7851J7067J6118J5683J5896
53484I99545J6104J5915J5515J4860J3697J2529J2314J3020J3634J3805J4253
53473A155191J5261J6021J5858J5009J3790J2083J0005Q125O628N123L400J572
53461A278066n63l264n957p671q416r029r738j0047r996j0214j0714j0914j0902
53448A170641j1351j2202j2793j3292j4496j6093j6755j6198j5573j5510j5308
53437A011070j4458j3436j2511j1206r348p443n629l571j580m08K08J235K503
53424I35426K856K317K252K976L264K743K740L938N149N433N622O589P776Q576
$$ plain form
53506 626259 639238 653061 668022 683885 700386 717314 734300 751192 768376 786191 804359
53495 804359 822563 841079 860226 879607 898561 916930 934781 951848 967966 983649 999545
53484 999545 1015649 1031564 1047079 1061939 1075636 1088165 1100479 1113499 1127133 1140938 1155191
53473 1155191 1170452 1186473 1202331 1217340 1231130 1243213 1253218 1261343 1267971 1273094 1276494 1278066
53461 1278066 1277503 1274239 1268282 1260611 1252195 1243166 1233428 1223381 1213385 1203171 1192457 1181543 1170641
53448 1170641 1159290 1147088 1134295 1121003 1106507 1090414 1073659 1057461 1041888 1026378 1011070
53437 1011070 996612 983176 970665 959459 950111 942668 937039 933468 931888 931480 931688 932923 935426
53424 935426 938282 940599 942851 945827 949091 951834 954574 958512 963661 969094 974716 981305 989081 997657
53410I97657R643J1532J3443J4581J5476J6786J8035J8776J9777K1784K4118K5766
53398A207374K6908K8276K9868L1290L2612L3928L4905L5580L6677L8414L9929
53387A575761M0687M1324M2353M3165M3220M3084M3273M3141M1963M0159L8438
53376B036568L6739L4912L3465L2525L1063K8306K4974K2052J9262J5981J2725
53365B328572J0354Q383N391P87m842j0754j6453k1499k5708k9347l2569l5127
53353B177188l6994l8524l9581l9467l8310l7469l7801l8468l8289l7327l6158
53342A758800l4591l2252k9833k8560k8751k9691l0602l1042l0830l0123k9196
53331A423329k7847k5689k3177k1337k0196j8646j6380j4505j3622j2686j0931
$$ plain form
53410 997657 1007300 1018832 1032275 1046856 1062332 1079118 1097153 1115929 1135706 1157490 1181608 1207374
53398 1207374 1234282 1262558 1292426 1323716 1356328 1390256 1425161 1460741 1497418 1535832 1575761
53387 1575761 1616448 1657772 1700125 1743290 1786510 1829594 1872867 1916008 1957971 1998130 2036568
53376 2036568 2073307 2108219 2141684 2174209 2205272 2233578 2258552 2280604 2299866 2315847 2328572
53365 2328572 2338926 2347309 2352700 2353487 2348645 2337891 2321438 2299939 2274231 2244884 2212315 2177188
53353 2177188 2140194 2101670 2062089 2022622 1984312 1946843 1909042 1870574 1832285 1794958 1758800
53342 1758800 1724209 1691957 1662124 1633564 1604813 1575122 1544520 1513478 1482648 1452525 1423329
53331 1423329 1395482 1369793 1346616 1325279 1305083 1286437 1270057 1255552 1241930 1229244 1218313
53320A218313r465r699j1237j2680j3609j4342j4548j3616j1989j0771j0249r837
53308A076271r203q473p623o538n448m547l547k212r03J0P43J577K377L163M483
53293A040130O492Q371R423J0075J1119J2559J3943J5177J6308J7150J7691J8282
53281A196720J8870J8764J7697J6381J5432J4659J3838J3234J2679J1263Q670
53270A358207N833L473J123j586l811m812n326o476q190r793j1391j3425j5596
53257A288230j7355j8906k0615k2026k2465k2116k1678k1465k1513k1899k2295
53246A055897k1978k0948k0078j9614j8686j7111j6303j7187j8571j8848j8239
53235H48334j7872j7733j7093j6162j5635j5277j4423j3433j3146j3283j2793
$$ plain form
53320 1218313 1208848 1199149 1187912 1175232 1161623 1147281 1132733 1119117 1107128 1096357 1086108 1076271
53308 1076271 1067068 1058595 1050972 1044434 1038986 1034439 1030892 1028680 1027777 1027787 1028530 1030107 1032484 1035647 1040130
53293 1040130 1046622 1054993 1064416 1074491 1085610 1098169 1112112 1127289 1143597 1160747 1178438 1196720
53281 1196720 1215590 1234354 1252051 1268432 1283864 1298523 1312361 1325595 1338274 1349537 1358207
53270 1358207 1364040 1367513 1368636 1367050 1363239 1358427 1353101 1346625 1338435 1328642 1317251 1303826 1288230
53257 1288230 1270875 1251969 1231354 1209328 1186863 1164747 1143069 1121604 1100091 1078192 1055897
53246 1055897 1033919 1012971 992893 973279 954593 937482 921179 903992 885421 866573 848334
53235 848334 830462 812729 795636 779474 763839 748562 734139 720706 707560 694277 681484
53224F81484j1414r803q405p346o878o941o749n912n332n960p318q380r176j0309
53210E71561j1549j2207j2357j2486j2459j2002j1559j1437j0846r074p026o159
53198D42400o472o845o884o966p047o800o613p048p669p732p561p959q627q513
53184C39664p411n977m557l224k518k797l258k922k219k247k916l151k665k105
53170B91697j743j367j179j555k120k278k344k911l501l181k109j142l13Q44J879
53155B68677J783O26n70j353j898j972j230l60l93j079j256o90j21K20P32J254
53139B62370J170N91J95M4j95k09M41J153J093P52J152J978K137J798K026K646
53123B79142K464J604J549K662L552L243K287J371M68k01l1O95Q43J43n06p26
$$ plain form
53224 681484 670070 660267 651862 644516 637638 630697 623948 618036 612704 606744 599426 591046 581870 571561
53210 571561 560012 547805 535448 522962 510503 498501 486942 475505 464659 455585 448559 442400
53198 442400 435928 429083 422199 415233 408186 401386 394773 387725 380056 372324 364763 356804 348177 339664
53184 339664 332253 326276 321719 318495 315977 313180 309922 307000 304781 302534 299618 296467 293802 291697
53170 291697 289954 288587 287408 285853 283733 281455 279111 276200 272699 269518 267409 266267 265954 266798 268677
53155 268677 270460 271086 270516 269163 267265 265293 264063 263703 263310 262231 260975 260285 260164 260384 261116 262370
53139 262370 263540 264131 264326 264370 264175 263966 264407 265560 266653 267405 268557 270535 272672 274470 276496 279142
53123 279142 281606 283210 284759 287421 290973 294216 296503 297874 298342 298141 298110 298805 299648 299791 299285 298559
53107B98559j198k095k492j915j173j091j494j864j973j606p07l0n13j853k749
53092B75806k624j973j092J42J219J200J84p27j048j199j211o97j19m39j242r83
53076B65197N31J600J069k59j177j489j359p51j99o20j739k018q71M25O63J61
53060B59164l27p47r88m23Q93J679J099r1o48k72P18J955K703K111N32n15l16
53043B66527J21j70o60m46K46O14N07K27q7k95j20K30J84p5L86J578K102J033
53025B71902p07j654j577j145p03j92L20P59J198J514J419J118J102J164N98l62
53009B74754o01P2M57j01o68l66L02O16Q92J499J778J092O5m13n84j097j631j421
52991B74645o01J21P30J686K790L241K768J857J010M33K38L84N80O98J066J892
$$ plain form
53107 298559 297361 295266 292774 290859 289686 288595 287101 285237 283264 281658 280951 280921 280408 278555 275806
53092 275806 273182 271209 270117 270259 271478 272678 272862 272135 271087 269888 268677 267980 267861 267422 266180 265197
53076 265197 265728 267328 268397 268138 266961 265472 264113 263362 263163 262543 260804 258786 257915 258340 259003 259164
53060 259164 258837 258090 257102 256679 257572 259251 260350 260259 259611 259339 260057 262012 264715 266826 267358 266843 266527
53043 266527 266648 266478 265818 265372 265618 266232 266739 266966 266879 266584 266464 266694 266878 266803 267189 268767 270869 271902
53025 271902 271195 269541 267964 266819 266116 265924 266244 267003 268201 269715 271134 272252 273354 274518 275116 274754
53009 274754 274153 274225 274682 274581 273913 273547 273849 274465 275357 276856 278634 279726 279791 279378 278794 277697 276066 274645
52991 274645 274044 274165 274895 276581 279371 282612 285380 287237 288247 288680 288918 289302 289882 290580 291646 293538
52975B93538K683K710J869P55N6Q9O22R57N54k72p06n61m89r45j546j689j357
52958B96268r87r59j276j458q60M75J514J338L26m87q06r54p86M8J014J135N22
52941B94067J88L47K57k55n05l48m12p44o56j93k08o70m80N08R62K60m56k26K50
52922B91686P0l44l25k84p45j134p01J76O11M51J7n82j147j196p92p00j114j159
52904B82788l41N66Q01P57J044J436J531J551J678J532J035P97R62P37j74r00
52888B95800r23j035j805k367j784n65L95J188K066K351J513M47L11P94Q78M88
52872B97752K19N9k95m79j8P13J097J265J478J260K56p58r68q95j509k611l267
52855B93299l261l007k599k105k122k843l219k357j111r22j620j825j132l76R
$$ plain form
52975 293538 296221 298931 300800 301555 301611 301700 302322 303279 303833 303561 302855 302294 301805 300860 299314 297625 296268
52958 296268 295281 294322 293046 291588 290728 291203 292717 294055 294381 293894 293088 292134 291348 291396 292410 293545 294067
52941 294067 294255 294602 294859 294604 294099 293751 293339 292595 291939 291746 291538 290868 290388 290896 291858 292118 291662 291436 291686
52922 291686 291756 291412 291087 290803 290058 288924 288223 288399 289010 289461 289478 288896 287749 286553 285761 285061 283947 282788
52904 282788 282447 283013 283814 284571 285615 287051 288582 290133 291811 293343 294378 295175 296137 296874 296700 295800
52888 295800 294877 293842 292037 289670 287886 287321 287716 288904 290970 293321 294834 295281 295592 296386 297264 297752
52872 297752 297971 298030 297735 297256 297238 297951 299048 300313 301791 303051 303307 302549 301581 300686 299177 296566 293299
52855 293299 290038 287031 284432 282327 280205 277362 274143 271786 270675 269753 268133 266308 265176 264800 264809
52840B64809L49N86K02m91l49R93K446K765J858N85k03k78q7j44k39L19J553K593
52822B77267L020L492M402M819L762J688k82j913l511m636m499l329k252j913
52808B76115k092k446k780k849k594k316k060j371k50L77n2p25o49j12O4k6J88
52791B56422N20M63L43P62J318J145L93p1j47m20q61q73n53o06r85p65L81J506
52773B57972J575N93n79j061n88K90P13M74K10M10P47P80O09M52K46J57O81J627
52755B65308K038J690J657K528L246K767J769J433J534J218O71N39M07l99j179
52740B85227p07O74J454J204Q77J041J299J386J437J209L05q71j518j637j709
52725B89671j553p11L15N16j42q56j278j492j206k73M07L2n13K17J802K433J577
$$ plain form
52840 264809 265158 265744 265946 265455 265106 266099 268545 271310 273168 273753 273550 273272 273185 273041 272802 273121 274674 277267
52822 277267 280287 283779 288181 293000 296762 298450 298168 296255 292744 288108 283609 280280 278028 276115
52808 276115 274023 271577 268797 265948 263354 261038 258978 257607 257357 257734 257682 256957 256308 256196 256260 256234 256422
52791 256422 256942 257405 257748 258510 259828 260973 261366 261295 261148 260728 259867 258994 258441 257835 256850 256085 256466 257972
52773 257972 259547 260140 259561 258500 257912 258202 258915 259389 259599 260009 260756 261536 262145 262597 262843 263000 263681 265308
52755 265308 267346 269036 270693 273221 276467 279234 281003 282436 283970 285188 285859 286398 286805 286406 285227
52740 285227 284520 285194 286648 287852 288729 289770 291069 292455 293892 295101 295406 294535 293017 291380 289671
52725 289671 288118 287407 287722 288238 288096 287240 285962 284470 283264 282991 283398 283430 282917 283134 284936 287369 288946
52708B88946M70l4k84m36nP85R74N06L86P93O28n14j482j372p84n84n57j55M06
52689B87687O11M35P9m10q31p92l95k29m77o90o84q10j146j141m76M15R83J178
52671B83307J240J369J616J699J092j69j103q92m5M20N24R94J745J951J499J158
52655B96405J232J209Q13L69L4l69o46l86J71L32Ll38n84q86q72j45O55N62l7
52636B97522J01J002J357O13l30q34j365k138k356j550n14j52l04l29m3M06R16
52619B92002J229J027N22K55K56R8j36J31Q71J257Q21j4o84r94p90K0J000J510
52601B98381J481J210O53j75n07K90J372J291J33o01k07N06P98Q72R68Q20L76
52584C07661o8n79j356j856j429o87p94j448j232J1R20R09Q83J202R00l61j291
$$ plain form
52708 288946 289416 289382 289098 288662 288657 289442 290416 290922 291308 292101 292729 292215 290733 289361 288577 287993 287436 287281 287687
52689 287687 288298 288733 288812 288402 287571 286779 286384 286155 285678 284988 284304 283494 282348 281207 280731 281146 282129 283307
52671 283307 284547 285916 287532 289231 290323 290154 289051 288159 288114 288534 289058 290052 291797 293748 295247 296405
52655 296405 297637 298846 299659 300028 300062 299693 299047 298661 298832 299164 299167 298829 298245 297359 296487 296342 296997 297559 297522
52636 297522 297623 298625 299982 300595 300265 299431 298066 295928 293572 292022 291508 291356 291052 290723 290680 291086 292002
52619 292002 293231 294258 294780 295035 295291 295389 295253 295384 296255 297512 298333 298319 297635 296641 295851 295871 296871 298381
52601 298381 299862 301072 301725 301550 301043 301333 302705 303996 304129 303528 303321 303827 304625 305497 306465 307285 307661
52584 307661 307593 307014 305658 303802 302373 301686 300892 299444 298212 298223 299143 300052 300935 302137 303037 302676 301385
52567C01385r14K0M34L76K58n3m53l01L33L20p37j672j560j075j097j192o70K4
52549B93426J26j31j24j5k58n94n27k20r4j08r0j84l40k6R30J865K137J839J264
52530B98876M85r8K35J444K464K553K098J690J390J294J744K408K272J219N21
52515C20595J040J979K218J865J607J449J035L88m06j581l014l913l845l352l004
52500C13061k613j987j563j589j573j141o92n89n12j60J79L33N70Q53P08K86M35
52483C04006J251J749J506J359J820K198K056K096K662K779J819Q66J138K151
52469C29456K693K625K424J916Q18k21m68l47p33j590k357k945l362l123k163
52454C22623j534k050k901k807j910j329j353j278p30m8L79M32J23k15p1M46N76
$$ plain form
52567 301385 300471 300491 300925 301301 301559 301506 301053 300752 301085 301405 300668 298996 297436 296361 295264 294072 293402 293426
52549 293426 293552 293421 293297 293282 293024 292430 291903 291683 291589 291481 291391 291207 290867 290841 291771 293636 295773 297612 298876
52530 298876 299361 299263 299498 300942 303406 305959 308057 309747 311137 312431 314175 316583 318855 320074 320595
52515 320595 321635 323614 325832 327697 329304 330753 331788 332176 331770 330189 327175 323262 319417 316065 313061
52500 313061 310448 308461 306898 305309 303736 302595 301903 301314 300802 300642 300821 301154 301724 302577 303285 303571 304006
52483 304006 305257 307006 308512 309871 311691 313889 315945 318041 320703 323482 325301 326167 327305 329456
52469 329456 332149 334774 337198 339114 339932 339711 339243 338896 338163 336573 334216 331271 327909 324786 322623
52454 322623 321089 319039 316138 313331 311421 310092 308739 307461 306731 306683 307062 307494 307617 307402 307331 307777 308353
52437C08353J11k38j27j68o04o33J21O78K80l20k30L8l10p86m96K88Q10J150J613
52418C09530J713J159R53K047L666M451M502M869N740O666P805R321J0056Q505
52404C80983M826N52l220o092p554p480o917o767o284m391j947q30j184j437q51
52389C31407k28p9Q1M48N44L44M01O98P47P93J561K724L124K696K646L438L980
52372C55325L267J681J88p16r10m49J68L31J32J35L69L90K50M69R96J192Q92N79
52354C64289N18N73Q08J378J870J736J246J077J130Q34M48Q12J863K619K774L080
52338C87055L889M466M213L535L144L226L634M295N070N821O624P491Q019P836
52324D58318P173O398N403M207L627M303N499O119O474P733R748J1070J1219J1458
$$ plain form
52437 308353 308464 308226 308099 307931 307327 306694 306815 307493 307773 307453 307223 307261 306951 306165 305669 305957 306767 307917 309530
52418 309530 311243 312402 313355 315402 319068 323519 328021 332890 338630 345296 353101 362422 372478 380983
52404 380983 385809 386361 383141 377049 369495 362015 355098 348331 342047 337656 335709 334879 333695 332258 331407
52389 331407 331179 331100 331181 331629 332173 332517 332918 333616 334363 335156 336717 339441 342565 345261 347907 351345 355325
52372 355325 358592 360273 360461 359745 358835 358386 358554 358885 359017 359152 359521 359911 360161 360630 361626 362818 363710 364289
52354 364289 364807 365380 366188 367566 369436 371172 372418 373495 374625 375459 375907 376719 378582 381201 383975 387055
52338 387055 390944 395410 399623 403158 406302 409528 413162 417457 422527 428348 434972 442463 450482 458318
52324 458318 465491 471889 477292 481499 485126 489429 494928 501047 507521 515254 525002 536072 547291 558749
52310E58749J2847J4815J6239J6916J7375J7938J8553J8990J8968J8429J7749
52299G47568J7207J6443J5070J3560J2682J2289J1649J0747J0272J0329J0202
52288H88018R531Q677P821O668N283M371M383M907N110M461L012J511Q54J000
52274I55607P44q31l172n147o414p058o709n243l685l061k800j651K95K020L501
52259I16396N577Q159J0203J1422J2358J2890J2391J1299J0762J0638R730Q183
52247A040008P648Q600R531R423R087R186Q840P419O030N755N758M603K588J184
52233A135660Q57O99j40j645l348m676n186n052n085n853p021p893q203q099p798
52218A067217p490p205o643n614m575m169m254m119l507k708j743m39Q16J434
$$ plain form
52310 558749 571596 586411 602650 619566 636941 654879 673432 692422 711390 729819 747568
52299 747568 764775 781218 796288 809848 822530 834819 846468 857215 867487 877816 888018
52288 888018 897549 906226 914047 920715 925998 930369 934752 939659 944769 949230 952242 953753 954607 955607
52274 955607 956351 955520 952348 947201 940787 933729 927020 921777 918092 915031 912231 910580 910875 912895 916396
52259 916396 921973 930132 940335 951757 964115 977005 989396 1000695 1011457 1022095 1031825 1040008
52247 1040008 1047656 1056256 1065787 1075210 1084297 1093483 1102323 1109742 1115772 1121527 1127285 1131888 1134476 1135660
52233 1135660 1136517 1137216 1137076 1135431 1132083 1127407 1122221 1117169 1112084 1106231 1099210 1091317 1083114 1075015 1067217
52218 1067217 1059727 1052522 1045879 1040265 1035690 1031521 1027267 1023148 1019641 1016933 1015190 1014751 1015567 1017001
52204A017001J680K240K858K613J581Q15N17k37j640k564k361j833j727j603j060
52189A016280p54j259k003k273k340k619k648j889q39l66m99o86p93j058j512
52174I94742k072k765l390l396k582j457n19K62R60J324J242J002P79M31M4l7
$$ plain form
52204 1017001 1018681 1020921 1023779 1026392 1027973 1028788 1029305 1029068 1027428 1024864 1022503 1020670 1018943 1017340 1016280
52189 1016280 1015526 1014267 1012264 1009991 1007651 1005032 1002384 1000495 999656 999290 998791 998105 997312 996254 994742
52174 994742 992670 989905 986515 983119 980537 979080 978561 978823 979783 981107 982349 983351 984130 984561 984605 984568
$$ [...]
##END NTUPLES=NMR SPECTRUM
##END=
