##TITLE=AC1649_NBEAH14350_8531133_033N9jJmXH
##JCAMPDX= 6.0         $$ Bruker NMR JCAMP-DX V2.0
##DATA TYPE= NMR SPECTRUM
##DATA CLASS= NTUPLES
##ORIGIN= BRUKER
##OWNER= Administrator
$$ 1.72 TOPSPIN		Version 2.1
$$ 2015-08-11 17:41:25.398 -0700  Administrator@X
$$ Compression mode = diff/dup
##.OBSERVE FREQUENCY= 400.02188249412
##.OBSERVE NUCLEUS= ^1H
##.ACQUISITION MODE= SIMULTANEOUS (DQD)
##.ACQUISITION SCHEME= undefined
##.AVERAGES= 64
##.DIGITISER RES= 22
##SPECTROMETER/DATA SYSTEM= spect
##.PULSE SEQUENCE= noesygpps1d.comp
##.SOLVENT NAME= COFFEE_meoh
##.SHIFT REFERENCE= INTERNAL, COFFEE_meoh, 1, 14.96154
##AUDIT TRAIL= $$ (NUMBER, WHEN, WHO, WHERE, PROCESS, VERSION, WHAT)
$$ ##TITLE= Audit trail, TOPSPIN		Version 2.1
$$ ##JCAMPDX= 5.01
$$ ##ORIGIN= Bruker BioSpin GmbH
$$ ##OWNER= Administrator
$$ $$ E:\/data/COFFEE/nmr/AC1649_NBEAH14350_8531133_033N9jJmXH/32/pdata/1/auditp.txt
$$ ##AUDIT TRAIL=  $$ (NUMBER, WHEN, WHO, WHERE, PROCESS, VERSION, WHAT)
(   1,<2015-08-11 17:41:19.976 -0700>,<Administrator>,<X>,<go>,<TOPSPIN 2.1>,
      <created by zg
	started at 2015-08-11 17:29:49.992 -0700,
	POWCHK enabled, PULCHK disabled,
       configuration hash MD5:
       21 0F 79 D6 B3 7B B4 F6 88 20 88 DB 03 48 BD 9F
       data hash MD5: 64K
       58 29 62 E6 3E D0 BD 93 81 78 CA BB FC DB D4 8F>)
(   2,<2015-08-11 17:41:23.257 -0700>,<Administrator>,<X>,<proc1d>,<TOPSPIN 2.1>,
      <Start of raw data processing
       efp LB = 0.3 FT_mod = 6 PKNL = 1 PHC0 = 0 PHC1 = 0 SI = 128K 
       data hash MD5: 128K
       36 48 0A 05 6D 62 35 68 39 66 6A AB FF AB 60 E5>)
(   3,<2015-08-11 17:41:24.210 -0700>,<Administrator>,<X>,<proc1d>,<TOPSPIN 2.1>,
      <pk PHC0 = 268.6102 PHC1 = 0 
       data hash MD5: 128K
       F4 47 3A 73 68 77 35 A8 91 17 FE 90 0F CB 2D 08>)
(   4,<2015-08-11 17:41:24.601 -0700>,<Administrator>,<X>,<proc1d>,<TOPSPIN 2.1>,
      <abs ABSG = 1 
       data hash MD5: 128K
       F9 DA B5 C7 2D AC 02 1A CF CD 1E 2E 7F 5F 4B 49>)
(   5,<2015-08-11 17:41:24.695 -0700>,<Administrator>,<X>,<proc1d>,<TOPSPIN 2.1>,
      <abs ABSG = 2 
       data hash MD5: 128K
       5B 83 C6 03 EA BF 75 D3 C4 07 76 05 60 7C 09 1F>)
(   6,<2015-08-11 17:41:24.789 -0700>,<Administrator>,<X>,<proc1d>,<TOPSPIN 2.1>,
      <abs ABSG = 3 
       data hash MD5: 128K
       FB 02 65 C3 B7 66 21 7A E5 43 98 AA 7A A0 E2 AE>)
(   7,<2015-08-11 17:41:24.867 -0700>,<Administrator>,<X>,<proc1d>,<TOPSPIN 2.1>,
      <abs ABSG = 4 
       data hash MD5: 128K
       B0 EF 59 50 5E 66 A0 E7 4D 83 B2 3D 5A 91 5C 0D>)
(   8,<2015-08-11 17:41:24.960 -0700>,<Administrator>,<X>,<proc1d>,<TOPSPIN 2.1>,
      <abs ABSG = 5 
       data hash MD5: 128K
       93 D4 90 91 4A F2 3E 91 09 2F 8C 99 6E 5F 49 CD>)
$$ ##END=
$$ 
$$ $$ hash MD5
$$ $$ B4 BF EB 2E 98 7D 9D 4E 96 92 2E 2E BF 8A 97 57
##$RELAX= 
##$RELAX= 
##$RELAX= 
##$RELAX= 
##$RELAX= 
##$RELAX= 
##$RELAX= 
##$RELAX= 
$$ Bruker specific parameters
$$ --------------------------
##$DU= <E:\>
##$EXPNO= 32
$$ [...]
##$TP07= 0
##$TPNAME0= <>
##$TPNAME1= <>
##$TPNAME2= <>
##$TPNAME3= <>
##$TPNAME4= <>
##$TPNAME5= <>
##$TPNAME6= <>
##$TPNAME7= <>
##$TPOAL= (0..7)
0.5 0.5 0.5 0.5 0.5 0.5 0.5 0.5
##$TPOFFS= (0..7)
0 0 0 0 0 0 0 0
##$TUNHIN= 0
##$TUNHOUT= 0
##$TUNXOUT= 0
##$USERA1= <user>
##$USERA2= <user>
##$USERA3= <user>
##$USERA4= <user>
##$USERA5= <user>
##$V9= 5
##$VALIST= <valist>
##$VCLIST= <CCCCCCCCCCCCCCC>
##$VD= 0
##$VDLIST= <DDDDDDDDDDDDDDD>
##$VPLIST= <PPPPPPPPPPPPPPP>
##$VTLIST= <TTTTTTTTTTTTTTT>
##$WBST= 2048
##$WBSW= 25
##$XGAIN= (0..3)
0 0 0 0
##$XL= 0
##$YL= 0
##$YMAX_a= 6186995
##$YMIN_a= -11768568
##$ZGOPTNS= <>
##$ZL1= 120
##$ZL2= 120
##$ZL3= 120
##$ZL4= 120
##$ABSF1= 14.96154
##$ABSF2= -5.596642
##$ABSG= 5
##$ABSL= 3
##$ALPHA= 0
##$AQORDER= 0
##$ASSFAC= 0
##$ASSFACI= 0
##$ASSFACX= 0
##$ASSWID= 0
##$AUNMP= <proc_prof1d_extract.lims>
##$AXLEFT= 0
##$AXNAME= <>
##$AXNUC= <1H>
##$AXRIGHT= 0
##$AXTYPE= 0
##$AXUNIT= <>
##$AZFE= 0.1
##$AZFW= 0.1
##$BCFW= 0
##$BC_mod= 0
##$BYTORDP= 0
##$COROFFS= 0
##$CY= 15
##$DATMOD= 1
##$DC= 0
##$DFILT= <>
##$DTYPP= 0
##$F1P= 0
##$F2P= 0
##$FCOR= 0.5
##$FTSIZE= 131072
##$FT_mod= 6
##$GAMMA= 0
##$GB= 0
##$INTBC= 1
##$INTSCL= 1
##$ISEN= 128
##$LB= 0.3
##$LEV0= 0
##$LPBIN= 0
##$MAXI= 10000
##$MC2= 0
##$MEAN= 0
##$ME_mod= 0
##$MI= 0
##$NCOEF= 0
##$NC_proc= -2
##$NLEV= 6
##$NOISF1= 0
##$NOISF2= 0
##$NSP= 0
##$NTH_PI= 0
##$NZP= 0
##$OFFSET= 14.96154
##$PC= 1
##$PHC0= 268.6102
##$PHC1= 0
##$PH_mod= 1
##$PKNL= yes
##$PPARMOD= 0
##$PPDIAG= 0
##$PPIPTYP= 0
##$PPMPNUM= 2147483647
##$PPRESOL= 1
##$PSCAL= 4
##$PSIGN= 0
##$PYNMP= <proc.py>
##$REVERSE= no
##$SF= 400.020009420569
##$SI= 131072
##$SIGF1= 0
##$SIGF2= 0
##$SINO= 400
##$SIOLD= 131072
##$SPECTYP= <>
##$SREGLST= <1H.CDCl3>
##$SSB= 0
##$STSI= 131072
##$STSR= 0
##$SW_p= 8223.68421052631
##$SYMM= 0
##$S_DEV= 0
##$TDeff= 65536
##$TDoff= 0
##$TI= <>
##$TILT= no
##$TM1= 0
##$TM2= 0
##$TOPLEV= 0
##$USERP1= <user>
##$USERP2= <user>
##$USERP3= <user>
##$USERP4= <user>
##$USERP5= <user>
##$WDW= 1
##$XDIM= 131072
##$YMAX_p= 460424597
##$YMIN_p= -15004
##$CURPLOT= <Network HP LaserJet P1505>
##$CURPRIN= <$Network HP LaserJet P1505>
##$DFORMAT= <normdp>
##$LAYOUT= <+/1D_H.xwp>
##$LFORMAT= <normlp>
##$PFORMAT= <normpl>
##$SURQMSG= 1
$$ End of Bruker specific parameters
$$ ---------------------------------
##NTUPLES= NMR SPECTRUM
##VAR_NAME=  FREQUENCY,     SPECTRUM/REAL,   SPECTRUM/IMAG
##SYMBOL=    X,             R,               I
##VAR_TYPE=  INDEPENDENT,   DEPENDENT,       DEPENDENT
##VAR_FORM=  AFFN,          ASDF,            ASDF
##VAR_DIM=   131072,        131072,          131072
##UNITS=     HZ,            ARBITRARY UNITS, ARBITRARY UNITS
##FACTOR=    0.0627417313425164, 1,          1
##FIRST=     8223.62146879497, -172,         -52395
##LAST=      0,             208,             -52901
##MIN=       0,             -15004,          0
##MAX=       8223.62146879497, 460424597,    0
$$ Real data points
##PAGE= N=1
##DATA TABLE= (X++(R..R)), XYDATA
$$ [...]
$$ plain form
61593 376362 376248 375819 374629 373313 372710 372580 372074 371041 369938 368851 367575 366351 365589 365073 364360 363671
61577 363671 363463 363379 362661 361430 360523 360172 359814 359196 358673 358407 358276 358628 360141 362614 364771 365606 365345 364883
61559 364883 364793 365113 365621 366135 366822 368139 370184 372373 374156 375739 377527 379280 380519 381413 382476 383675
61543 383675 384692 385771 387383 389214 390515 391487 393318 396683 400991 405264 408936 411625 412948 412921 412021
61528 412021 410634 408882 407042 405519 404269 402770 400741 398475 396387 394633 393243 392263 391695 391563 391930
61513 391930 392594 392944 392491 391372 390048 388807 387787 387053 386277 384872 382958 381625 381677 382662 383818 385259
61497 385259 387437 390044 392522 395174 398647 402635 406196 409053 411511 413334 413878 413307 412537 411969 411278
61482 411278 410425 409834 409529 409123 408742 409027 410136 411634 413392 415592 417836 419275 419839 420375 421385 422479
$$ packed form
61593C76362j14m29j190j316o03j30n06j033j103j087j276j224p62n16p13o89
61577C63671k08q4p18j231r07l51l58o18n23k66j31L52J513K473K157Q35k61m62
61559C64883r0L20N08N14O87J317K045K189J783J583J788J753J239Q94J063J199
61543C83675J017J079J612J831J301R72J831L365M308M273L672K689J323k7r00
61528D12021j387j752j840j523j250j499k029k266k088j754j390r80n68j32L67
61513C91930O64L50m53j119j324j241j020p34p76j405j914j333N2R85J156J441
61497C85259K178K607K478K652L473L988L561K857K458J823N44n71p70n68o91
61482D11278q53n91l05m06l81K85J109J498J758K200K244J439N64N36J010J094
$$ plain form
61466 422479 423202 423551 423492 422882 422121 422033 422797 423686 424061 423985 423800 423863 424757 426904 429760 432139 433550 434603
61448 434603 436016 437891 440052 442371 444678 446990 449825 453668 458195 462805 467720 473670 480520 487130
61434 487130 492627 496942 500212 502648 504995 507990 511197 513329 513883 513479 512518 510653 507884 505046 502757
61419 502757 500783 498811 496980 495270 493245 490800 488373 486134 483702 480947 478199 475412 472012 467931
61405 467931 463976 460785 458183 455875 453980 452501 451032 449410 447977 446915 445921 444757 443496 442117
61391 442117 440661 439815 440396 442087 443642 444529 445379 446596 447712 448580 450046 452808 456486 460385 464346
61376 464346 468292 471797 474748 477702 481024 484365 487449 490654 494271 497974 501542 505464 510295 516024
61362 516024 522524 529920 538063 546333 554425 562688 571307 579843 587967 595846 603358 609665 614067 616582
$$ packed form
61466D22479P23L49n9o10p61q8P64Q89L75p6j85O3Q94K147K856K379J411J053
61448D34603J413J875K161K319K307K312K835L843M527M610M915N950O850O610
61434D87130N497M315L270K436K347K995L207K132N54m04r61j865k769k838k289
61419E02757j974j972j831j710k025k445k427k239k432k755k748k787l400m081
61405D67931l955l191k602k308j895j479j469j622j433j062r94j164j261j379
61391D42117j456q46N81J691J555Q87Q50J217J116Q68J466K762L678L899L961
61376D64346L946L505K951K954L322L341L084L205L617L703L568L922M831N729
61362E16024O500P396Q143Q270Q092Q263Q619Q536Q124P879P512O307M402K515
$$ plain form
61348 616582 617311 616057 613078 609396 605731 601810 597222 592214 587096 581633 575646 569589 563951 558688
61334 558688 553707 549283 545598 542542 540343 539508 539728 539834 539398 539362 540413 541837 542929 544485 547713 552400
61318 552400 557402 562507 568645 576592 586453 598105 611193 624920 638698 652782 667377 681357
61306 681357 692835 700984 706505 710369 712927 714318 714936 715082 714564 712932 709960 705834 701029 695999 690857
61291 690857 685402 679481 673150 666499 659624 652835 646642 641448 637447 634689 632908 631476 630064 629268
61277 629268 629952 632059 634738 637510 640528 643802 647184 651202 656832 664186 672434 681316 691560 703275
61263 703275 715001 725014 732703 737978 740248 738920 734359 727545 719201 709854 700298 691353 683430 676662
61249 676662 671035 666195 661711 657884 655664 655455 656568 658064 659416 660205 660161 659950 660971 663844 667881
$$ packed form
61348F16582P29j254k979l682l665l921m588n008n118n463n987o057n638n263
61334E58688m981m424l685l056k199q35K20J06m36l6J051J424J092J556L228M687
61318E52400N002N105O138P947R861J1652J3088J3727J3778J4084J4595J3980
61306F81357J1478Q149N521L864K558J391O18J46n18j632k972m126m805n030n142
61291F90857n455n921o331o651o875o789o193n194m001k758j781j432j412p96
61277F29268O84K107K679K772L018L274L382M018N630P354Q248Q882J0244J1715
61263G03275J1726J0013P689N275K270j328m561o814q344r347r556q945p923o768
61249F76662n627m840m484l827k220k09J113J496J352P89m4k11J021K873M037
$$ plain form
61234 667881 672402 677542 683213 688408 692390 695746 699437 703522 707590 711713 716207 721090 726561 733385
61220 733385 742090 752293 763328 774836 786232 796504 805304 813482 821835 830096 837906 845923 855096
61207 855096 865569 877127 889945 904029 918710 933718 950082 968870 989503 1010232 1029747
61196 1029747 1047443 1062643 1074618 1083141 1088330 1090372 1089959 1088329 1086107 1082719 1077643 1071481 1064948
61183 1064948 1057654 1048880 1038805 1027914 1015988 1002902 989768 977948 967412 957293 947609 939082
61171 939082 931669 924736 918595 914467 912846 913096 914806 918460 924513 932722 942711 954536 968548 985168
61157 985168 1004732 1026979 1050773 1074853 1098668 1121932 1143674 1162495 1177724 1189751 1199363 1207294
61145 1207294 1214294 1221105 1228388 1236819 1246840 1258044 1269370 1280340 1291536 1303355 1315049 1325678
$$ packed form
61234F67881M521N140N671N195L982L356L691M085M068M123M494M883N471O824
61220G33385Q705J0203J1035J1508J1396J0272Q800Q178Q353Q261P810Q017R173
61207H55096J0473J1558J2818J4084J4681J5008J6364J8788K0633K0729J9515
61196A029747J7696J5200J1975Q523N189K042m13j630k222l388n076o162o533
61183A064948p294q774j0075j0891j1926j3086j3134j1820j0536j0119r684q527
61171I39082p413o933o141m128j621K50J710L654O053Q209R989J1825J4012J6620
61157I85168J9564K2247K3794K4080K3815K3264K1742J8821J5229J2027R612P931
61145A207294P000O811P283Q431J0021J1204J1326J0970J1196J1819J1694J0629
$$ plain form
61133 1325678 1335370 1344822 1354050 1362443 1369636 1375599 1380277 1383856 1386948 1389819 1391800 1392070 1390599 1387831
61119 1387831 1384036 1379558 1375027 1370619 1365747 1360107 1354303 1348758 1342811 1335660 1327312 1317737 1306015 1291326
61105 1291326 1273939 1254142 1231177 1204664 1176356 1148962 1123530 1099224 1075235 1051598 1028458
61094 1028458 1005893 984327 964096 944759 925784 907576 890902 875719 861651 849083 838612
61083 838612 829774 821463 813378 805939 799122 792561 786539 781742 778048 774600 770973 767494 764591 762523
61069 762523 761394 760734 759640 758128 757662 759485 763087 767298 772049 777862 784431 791100 798214 806626 816337
61054 816337 826791 837981 850056 862429 874531 886804 899647 912118 923183 933635 945205
61043 945205 958265 971846 985378 998895 1012137 1025060 1038767 1054354 1071338 1088773 1107207
$$ packed form
61133A325678R692R452R228Q393P193N963M678L579L092K871J981K70j471k768
61119A387831l795m478m531m408m872n640n804n545n947p151q348r575j1722j4689
61105A291326j7387j9797k2965k6513k8308k7394k5432k4306k3989k3637k3140
61094A028458k2565k1566k0231j9337j8975j8208j6674j5183j4068j2568j0471
61083H38612q838q311q085p439o817o561o022m797l694l448l627l479k903k068
61069G62523j129o60j094j512m66J823L602M211M751N813O569O669P114Q412R711
61054H16337J0454J1190J2075J2373J2102J2273J2843J2471J1065J0452J1570
61043I45205J3060J3581J3532J3517J3242J2923J3707J5587J6984J7435J8434
$$ plain form
61032 1107207 1127848 1150571 1174751 1201447 1232550 1267999 1305822 1344741 1384934 1426769 1470988
61021 1470988 1519944 1576525 1641919 1716223 1800691 1897120 2005511 2124988 2257102 2406350
61011 2406350 2578353 2780597 3024404 3322523 3684353 4116665 4629278 5237244 5959186
61002 5959186 6820285 7858882 9123024 10652576 12459595 14513225 16717507 18884245
60994 18884245 20742627 22026446 22608379 22581308 22212957 21808914 21591471 21658568 21991274
60985 21991274 22453056 22791254 22701607 21962939 20552917 18648544 16517009 14393639 12426351
60976 12426351 10683959 9183215 7910007 6836668 5935745 5184476 4562192 4049178 3628269
60967 3628269 3284451 3002928 2769809 2574246 2408018 2263908 2136497 2023512 1923978 1835502
$$ packed form
61032A107207K0641K2723K4180K6696L1103L5449L7823L8919M0193M1835M4219
61021A470988M8956N6581O5394P4304Q4468R6429J08391J19477J32114J49248
61011B406350J72003K02244K43807K98119L61830M32312N12613O07966P21942
61002E959186Q61099J038597J264142J529552J807019K053630K204282K166738
60994A8884245J858382J283819N81933k7071l68351m04043k17443O7097L32706
60985B1991274M61782L38198q9647p38668j410022j904373k131535k123370j967288
60976A2426351j742392j500744j273208j073339r00923p51269o22284n13014m20909
60967C628269l43818k81523k33119j95563j66228j44110j27411j12985r9534q8476
$$ plain form
60957 1835502 1755218 1682413 1617906 1561213 1510386 1464192 1422319 1383555 1345660 1307131 1267735
60946 1267735 1227567 1187084 1147773 1111146 1077153 1044838 1014288 986510 961659 938885 917864
60935 917864 899014 882123 866053 850046 834368 819556 805928 793797 783309 773971 765005 756131
60923 756131 747442 738823 730124 721704 714158 707728 702405 698159 694594 690949 687036 683597 681121 679000
60909 679000 676445 673468 670150 665766 659675 652500 645418 638715 631920 624916 618030 611436 605239 599760
60895 599760 595075 590790 586887 584108 582810 582200 581505 581112 581620 582610 583433 584491 586588 589570 592745 596068
60879 596068 599693 602809 604232 603886 602619 600768 597998 594420 590852 587991 586088 585214 585171 585397 585658 586439
60863 586439 587977 589450 590055 590312 591296 592879 593818 593331 591655 589233 586341 583440 581030 579094 577290
$$ packed form
60957A835502q0284p2805o4507n6693n0827m6194m1873l8764l7895l8529l9396
60946A267735m0168m0483l9311l6627l3993l2315l0550k7778k4851k2774k1021
60935I17864j8850j6891j6070j6007j5678j4812j3628j2131j0488r338q966q874
60923G56131q689q619q699q420p546o430n323m246l565l645l913l439k476k121
60909F79000k555k977l318m384o091p175p082o703o795p004o886o594o197n479
60895E99760m685m285l903k779j298o10o95l93N08R90Q23J058K097K982L175L323
60879E96068L625L116J423l46j267j851k770l578l568k861j903q74m3K26K61P81
60863E86439J538J473O05K57R84J583R39m87j676k422k892k901k410j936j804
$$ plain form
60848 577290 575506 573683 571324 567811 562950 556720 548900 539557 529463 519417 509584 500038 491342 483865
60834 483865 477143 470764 465395 461994 460396 459563 458883 458449 458423 458894 459983 461373 462136 461837 461298 461555 462526
60817 462526 463540 464601 466117 467781 468776 468825 468242 467247 466099 465499 465954 466974 467731 468199 468781 469184 468639
60800 468639 467103 465366 464052 463136 462306 461158 459279 456623 453590 450355 446665 442690 439258 436597 433734
60785 433734 429986 426215 423556 421685 419564 417201 415353 413933 412166 410123 408760 408451 408585 408570 408255
60770 408255 407486 406285 405433 405875 407486 409233 410531 411665 412941 414266 415562 416911 418342 420036 422566
60755 422566 426246 430454 434274 437614 441089 445015 449140 453169 456942 460241 462844 464556 465003 463957
60741 463957 462135 460802 460105 458726 455882 452682 450629 449727 449059 448336 447693 446759 445245 443836 443301 443265
$$ packed form
60848E77290j784j823k359l513m861o230p820r343j0094j0046r833r546q696p477
60834D83865o722o379n369l401j598q33o80m34k6M71J089J390P63k99n39K57R71
60817D62526J014J061J516J664R95M9n83r95j148o00M55J020P57M68N82M03n45
60800D68639j536j737j314r16q30j148j879k656l033l235l690l975l432k661k863
60785D33734l748l771k659j871k121k363j848j420j767k043j363l09J34j5l15
60770D08255p69j201q52M42J611J747J298J134J276J325J296J349J431J694K530
60755D22566L680M208L820L340L475L926M125M029L773L299K603J712M47j046
60741D63957j822j333o97j379k844l200k053r02o68p23o43r34j514j409n35l6
$$ plain form
60725 443265 442976 442614 442568 442165 440539 438253 436514 435172 432946 429408 425337 421363 417662 414738 413062
60710 413062 411974 410269 407839 405538 403537 401139 398231 395692 394188 393531 393197 392650 391389 389616 388548
60695 388548 389030 390259 390948 391267 392348 394286 396164 397776 399781 402207 404345 406179 408557 411809 415452
60680 415452 419308 423681 428380 432765 436839 441117 445391 448751 450776 451577 450816 447979 443559 438755 434086
60665 434086 429531 425693 423370 422076 420580 418916 418293 418943 419726 420088 420821 422504 424662 426872 429305
60650 429305 431740 433429 434327 435154 435855 435337 433196 430415 427858 425391 422992 421414 421005 420966 420498 419734
60634 419734 419007 418157 417132 416385 416114 415885 415434 415128 415256 415591 415911 416227 416381 416212 416155 416837 418104 419318
60616 419318 420462 421823 422804 422464 421261 420732 421192 421242 419996 418333 417342 416828 416102 415210 414649 414683 415442 416927
$$ packed form
60725D43265k89l62m6m03j626k286j739j342k226l538m071l974l701k924j676
60710D13062j088j705k430k301k001k398k908k539j504o57l34n47j261j773j068
60695C88548M82J229O89L19J081J938J878J612K005K426K138J834K378L252L643
60680D15452L856M373M699M385M074M278M274L360K025Q01p61k837m420m804m669
60665D34086m555l838k323j294j496j664o23O50P83L62P33J683K158K210K433
60650D29305K435J689Q98Q27P01n18k141k781k557k467k399j578m09l9m68p64
60634D19734p27q50j025p47k71k29m51l06J28L35L20L16J54j69n7O82J267J214
60616D19318J144J361R81l40j203n29M60N0j246j663r91n14p26q92n61L4P59J485
$$ plain form
60598 416927 418596 419753 420578 421938 424086 426542 429257 432680 436542 439830 442176 444081 445611 446297 446575
60583 446575 447835 450492 453335 455337 456826 458379 459869 461223 462916 465061 467178 469420 472868 478031
60569 478031 484112 490273 496544 503019 509441 516130 524113 533647 543646 553038 561501 568475 572862 574432
60555 574432 574317 573435 571617 568870 566144 564113 562477 561239 561364 563376 566664 571038 577613 587098 598538
60540 598538 610989 625328 643187 664951 689959 717786 748146 780165 812708 844765 874711
60529 874711 900025 918643 929945 933835 929970 918845 902646 883916 864005 843680 824274 807088
60517 807088 792245 779101 767285 756665 747086 738937 733262 730532 730084 731471 735400 742519 752299
60504 752299 764237 779338 799273 824759 855781 892722 936114 985680 1040514 1099775 1162359
$$ packed form
60598D16927J669J157Q25J360K148K456K715L423L862L288K346J905J530O86K78
60583D46575J260K657K843K002J489J553J490J354J693K145K117K242L448N163
60569D78031O081O161O271O475O422O689P983R534R999R392Q463O974M387J570
60555E74432j15q82j818k747k726k031j636j238J25K012L288M374O575R485J1440
60540E98538J2451J4339J7859K1764K5008K7827L0360L2019L2543L2057K9946
60529H74711K5314J8618J1302L890l865j1125j6199j8730j9911k0325j9406j7186
60517H07088j4843j3144j1816j0620r579q149n675k730m48J387L929P119R780
60504G52299J1938J5101J9935K5486L1022L6941M3392M9566N4834N9261O2584
$$ plain form
60493 1162359 1226469 1290336 1352883 1412934 1468413 1517090 1557524 1588378 1607429 1612240 1601579
60482 1601579 1575629 1535321 1482116 1418032 1345403 1267112 1187170 1109963 1038177 972157 911704
60471 911704 857405 809625 767461 729806 696583 668086 644007 623992 608135 595884 585360
60460 585360 574920 564630 555242 546581 538083 530056 523166 517274 511882 507127 503177 499342 494919 490430
60446 490430 486875 484287 482043 480110 478868 478173 477633 477391 477722 478260 478534 478716 478980 478747 477545 476017
60430 476017 475062 474592 474157 474192 475388 477360 479136 480630 482484 484767 486987 489121 491536 494068 496116
60415 496116 497504 498384 498561 497820 496698 496083 496201 496680 497304 498046 498706 499220 499999 501389 503188 505205 507642
60398 507642 510367 512593 514015 515534 517987 520954 523662 526248 529100 531733 533524 534984 537140 540107
$$ packed form
60493A162359O4110O3867O2547O0051N5479M8677M0434L0854J9051M811j0661
60482A601579k5950m0308n3205o4084p2629p8291p9942p7207p1786o6020o0453
60471I11704n4299m7780m2164l7655l3223k8497k4079k0015j5857j2251j0524
60460E85360j0440j0290r388q661q498q027o890n892n392m755l950l835m423m489
60446D90430l555k588k244j933j242o95n40k42L31N38K74J82K64k33j202j528
60430D76017r55m70m35L5J196J972J776J494J854K283K220K134K415K532K048
60415D96116J388Q80J77p41j122o15J18M79O24P42O60N14P79J390J799K017K437
60398E07642K725K226J422J519K453K967K708K586K852K633J791J460K156K967
$$ plain form
60384 540107 543299 546570 550114 553744 557268 561068 565369 569500 572799 575671 578714 581567 583685 585542
60370 585542 587837 590202 591988 593663 596046 598729 600753 602432 604987 608675 612759 617216 623114 631290
60356 631290 641773 654247 667871 680808 691225 698826 704420 708252 709785 708786 705445 699696 691657
60343 691657 682505 673660 665275 656681 648050 640329 633654 627213 620697 614698 609630 605357 601885 599290
60329 599290 596992 594185 591072 588735 587877 588551 590829 594580 598825 602564 606277 611457 618628 626907 635426
60314 635426 644041 652517 660077 665945 669522 670139 667536 662602 656848 651320 646698 643858 643220 643951 645017
60299 645017 646581 649109 651595 652264 650735 647817 643324 635931 625491 613697 602019 590475 579034
60286 579034 568670 560209 553243 547018 541534 537134 533797 531388 529824 528560 526626 523757 520903 519221
$$ packed form
60384E40107L192L271L544L630L524L800M301M131L299K872L043K853K118J857
60370E85542K295K365J786J675K383K683K024J679K555L688M084M457N898Q176
60356F31290J0483J2474J3624J2937J0417P601N594L832J533r99l341n749q039
60343F91657r152q845q385q594q631p721o675o441o516n999n068m273l472k595
60329E99290k298k807l113k337q58O74K278L751M245L739L713N180P171Q279Q519
60314F35426Q615Q476P560N868L577O17k603m934n754n528m622k840o38P31J066
60299F45017J564K528K486O69j529k918m493p393j0440j1794j1678j1544j1441
60286E79034j0364q461o966o225n484m400l337k409j564j264j934k869k854j682
$$ plain form
60272 519221 518965 519607 520523 521370 522279 523814 526375 529642 532974 536123 539062 541504 543299 545007 547263
60257 547263 549859 552208 554273 556107 556869 555510 552285 548516 545036 541912 539420 538005 537280 536316 535031
60242 535031 534230 534261 534711 535441 536763 538541 540284 542255 545366 549773 554703 559851 565790 572707 579769
60227 579769 586187 592061 597872 603903 610401 617582 625234 632907 640493 647985 654946 661048 666896 673244
60213 673244 679571 684585 688090 691151 694331 696973 698419 698837 698555 697551 695825 693429 689995 685116 679280
60198 679280 673531 668175 662730 657134 651967 647481 643445 640000 637597 636054 634758 633809 633874 634827 635705
60183 635705 636145 636679 637470 638006 638315 639272 641190 643144 644159 644242 643970 643829 644189 645096 645840 645533 644220 642708
60165 642708 641392 640103 639021 638651 638916 639345 640176 642222 645533 649231 652724 656110 659483 662844 666629
$$ packed form
60272E19221k56O42R16Q47R09J535K561L267L332L149K939K442J795J708K256
60257E47263K596K349K065J834P62j359l225l769l480l124k492j415p25r64j285
60242E35031q01L1M50P30J322J778J743J971L111M407M930N148N939O917P062
60227E79769O418N874N811O031O498P181P652P673P586P492O961O102N848O348
60213F73244O327N014L505L061L180K642J446M18k82j004j726k396l434m879n836
60198F79280n749n356n445n596n167m486m036l445k403j543j296r49O5R53Q78
60183F35705M40N34P91N36L09R57J918J954J015Q3k72j41L60R07P44l07j313j512
60165F42708j316j289j082l70K65M29Q31K046L311L698L493L386L373L361L785
$$ plain form
60150 666629 671185 675846 679671 682975 686841 691288 695330 698743 702293 706200 709989 713932 718980 725024
60136 725024 730819 735946 741141 746246 749576 750122 748882 747235 745270 742504 739021 735071 730495 725291
60122 725291 719982 714991 710430 706662 704023 701830 698883 695167 691836 689337 686981 684514 682546 681008
60108 681008 678859 675953 673709 673131 673544 674027 674736 676036 677585 679149 681174 683804 686409 688776 691593
60093 691593 695055 698156 700133 701548 703240 705237 707320 709528 711451 712142 711394 710002 708221 705106 699981
60078 699981 693310 685517 676291 665856 655561 646257 637296 628040 619234 611947 606237 601829 599011 597862
60064 597862 597493 597079 596867 597417 598648 600331 602594 605241 607552 609449 611932 615609 619730 623317 626272
60049 626272 628735 630385 631021 630821 629452 626084 620885 615320 610328 605457 600380 595818 592147 588589 584776
$$ packed form
60150F66629M556M661L825L304L866M447M042L413L550L907L789L943N048O044
60136G25024N795N127N195N105L330N46j240j647j965k766l483l950m576n204
60122G25291n309m991m561l768k639k193k947l716l331k499k356k467j968j538
60108F81008k149k906k244n78M13M83P09J300J549J564K025K630K605K367K817
60093F91593L462L101J977J415J692J997K083K208J923O91p48j392j781l115n125
60078F99981o671p793r226j0435j0295r304q961r256q806p287n710m408k818j149
60064E97862l69m14k12N50J231J683K263K647K311J897K483L677M121L587K955
60049F26272K463J650O36k00j369l368n199n565m992m871n077m562l671l558l813
$$ plain form
60034 584776 581645 579672 577632 574421 570795 567901 565147 561057 555410 549138 542819 536545 530785 526187
60020 526187 522886 520712 519491 518607 517183 515414 514729 515856 517647 518604 518553 518065 517358 516617 516320 516369 516010
60003 516010 515400 515928 518066 520340 521542 522485 524234 526095 527015 527688 529422 531812 533403 534005 534626 535513
59987 535513 535870 535251 533901 531985 529612 527366 525795 524708 523803 523407 523799 524432 524754 525101 525944 527083
59971 527083 528478 530985 535240 540622 546377 552856 560473 568341 575203 581007 586300 590696 593212 593626
59957 593626 592452 590026 586494 582089 576742 570194 563186 557466 553708 550562 546763 542959 540286 538464
59943 538464 536763 535742 536380 538414 541037 544459 549231 554860 560574 566699 573725 580781 586569 591132
59929 591132 595125 598008 598613 596958 593984 590039 585167 580318 576692 574283 572568 572151 574177 578507 583999
$$ packed form
60034E84776l131j973k040l211l626k894k754m090n647o272o319o274n760m598
60020E26187l301k174j221q84j424j769o85J127J791R57n1m88p07p41k97M9l59
60003E16010o10N28K138K274J202R43J749J861R20O73J734K390J591O02O21Q87
59987E35513L57o19j350j916k373k246j571j087r05l96L92O33L22L47Q43J139
59971E27083J395K507M255N382N755O479P617P868O862N804N293M396K516M14
59957E93626j174k426l532m405n347o548p008n720l758l146l799l804k673j822
59943E38464j701j021O38K034K623L422M772N629N714O125P026P056N788M563
59929E91132L993K883O05j655k974l945m872m849l626k409j715m17K026M330N492
$$ plain form
59914 583999 590274 597756 606257 614889 623116 630621 636539 640136 641923 642879 642943 641495 638800 635688 632253
59899 632253 628191 624018 620647 618139 616064 614689 614567 615389 616398 617529 619096 621006 623359 627084 632744
59884 632744 639415 645940 652354 658837 664315 667792 670175 673054 676385 679101 681266 683821 686784 689494
59870 689494 692079 694917 697218 697892 697277 696206 694080 689895 684625 680333 677170 673470 668682 664081 660481
59855 660481 657325 654377 652560 652710 654930 659344 666104 674552 683548 692528 701080 708049 712472 715045
59841 715045 717222 719479 722008 726341 734214 745131 756868 767857 777182 782971 783361 778996 772359 764679
59827 764679 755616 745720 736693 728989 721521 714031 707592 702463 697660 693063 689690 687465 684857 681326
59813 681326 677988 675317 672280 668479 665040 662575 660245 657646 655673 654512 652606 648787 643911 639381
$$ packed form
59914E83999O275P482Q501Q632Q227P505N918L597J787R56O4j448k695l112l435
59899F32253m062m173l371k508k075j375j22Q22J009J131J567J910K353L725N660
59884F32744O671O525O414O483N478L477K383K879L331K716K165K555K963K710
59870F89494K585K838K301O74o15j071k126m185n270m292l163l700m788m601l600
59855F60481l156k948j817J50K220M414O760Q448Q996Q980Q552O969M423K573
59841G15045K177K257K529M333P873J0917J1737J0989R325N789L90m365o637p680
59827G64679r063r896r027p704p468p490o439n129m803m597l373k225k608l531
59813F81326l338k671l037l801l439k465k330k599j973j161j906l819m876m530
$$ plain form
59799 639381 635442 631797 628509 625351 621619 617394 613815 611393 609338 607194 605787 605775 606582 607496 608611
59784 608611 609978 611056 611814 613256 616102 619892 623943 628196 632589 636687 640455 644446 648821 653151
59770 653151 657479 662490 668349 674434 680433 686575 692667 698168 703338 708913 714543 719030 722376 726032
59756 726032 730819 736154 741703 748126 755646 763464 771299 780006 789987 800303 809985 818905 826769 832621
59742 832621 836082 837836 838329 837183 834439 831133 828027 824941 821835 819292 817436 815600 813560 811902
59728 811902 810811 809785 808897 808979 810105 811220 811735 812101 812481 812352 811891 812207 813620 815188 816511 818507
59712 818507 821770 825619 829382 833168 836788 839478 841340 843572 846520 849032 850426 851569 853226 854883
59698 854883 856072 857308 858792 859606 859195 858317 857610 856587 854960 853626 853258 853125 852285 850787 848865 846063
$$ packed form
59799F39381l939l645l288l158l732m225l579k422k055k144j407j2Q07R14J115
59784F08611J367J078P58J442K846L790M051M253M393M098L768L991M375M330
59770F53151M328N011N859O085N999O142O092N501N170N575N630M487L346L656
59756G26032M787N335N549O423P520P818P835Q707R981J0316R682Q920P864N852
59742H32621L461J754M93j146k744l306l106l086l106k543j856j836k040j658
59728H11902j091j026q88Q2J126J115N15L66L80j29m61L16J413J568J323J996
59712H18507L263L849L763L786L620K690J862K232K948K512J394J143J657J657
59698H54883J189J236J484Q14m11q78p07j023j627j334l68j33q40j498j922k802
$$ plain form
59682 846063 842015 836939 830703 822721 813581 805330 799229 794536 790411 787504 786494 786434 785954 785146 784984
59667 784984 785766 787220 789381 792344 795762 799385 803368 807495 810916 813157 814384 814273 811918 807432 802258
59652 802258 797095 790849 782547 772974 763378 753746 743466 732714 722149 712068 702803 695132 689463
59639 689463 685315 682164 679901 677907 674735 669436 662346 654060 644654 634422 624344 615201 607062 599909
59625 599909 593764 588100 582402 577378 574121 571965 568951 564706 560938 558662 556996 555394 554877 555987
59611 555987 557495 558388 559449 561624 564385 566880 569250 571751 574018 576097 578611 581053 581738 580506 579582
59596 579582 580555 582374 583611 584704 586416 587966 588544 589119 590875 593192 594874 596147 597767 599298 599909
59581 599909 599841 599669 599146 598071 597144 596687 595774 593844 591874 590707 589639 587989 586537 585975 585423 584025
$$ packed form
59682H46063m048n076o236p982r140q251o101m693m125k907j010o0m80q08j62
59667G84984P82J454K161K963L418L623L983M127L421K241J227j11k355m486n174
59652H02258n163o246q302r573r596r632j0280j0752j0565j0081r265p671n669
59639F89463m148l151k263j994l172n299p090q286r406j0232j0078r143q139p153
59625E99909o145n664n698n024l257k156l014m245l768k276j666j602n17J110
59611E55987J508Q93J061K175K761K495K370K501K267K079K514K442O85j232r24
59596E79582R73J819J237J093J712J550N78N75J756K317J682J273J620J531O11
59581E99909o8j72n23j075r27m57r13j930j970j167j068j650j452n62n52j398
$$ plain form
59565 584025 582609 582220 582434 582592 583217 584599 585511 585033 584185 584012 583589 581829 579806 579336 580548 582801 586561
59548 586561 592294 598840 605140 612470 622855 636385 652175 670610 691794 712483 727255 732865
59536 732865 729963 721316 710322 700501 694024 690563 688859 688775 690459 692643 693775 694003 694175 693707 691474
59521 691474 688041 684771 681298 676015 668754 660911 653211 645283 637307 630245 624394 619236 614618 610870
59507 610870 608035 606038 605064 604757 603937 602297 601273 601904 603061 603316 603195 603739 604208 603432 602271 602381 603369
59490 603369 603525 602681 602078 602022 601946 602258 603787 605768 606616 606439 606775 608126 609709 611290 613257 615254 616650
59473 616650 618000 620214 622813 624905 627170 630829 635317 639290 643300 648981 656031 662515 667955 673608
59459 673608 679769 685300 689947 694765 699969 704548 708254 711910 715499 717949 719040 719645 719931 719130 717207
$$ packed form
59565E84025j416l89K14J58O25J382R12m78q48j73m23j760k023m70J212K253L760
59548E86561N733O546O300P330J0385J3530J5790J8435K1184K0689J4772N610
59536G32865k902q647j0994r821o477l461j704q4J684K184J132K28J72m68k233
59521F91474l433l270l473n283p261p843p700p928p976p062n851n158m618l748
59507F10870k835j997r74l07q20j640j024O31J157K55j21N44M69p76j161J10R88
59490F03369J56q44o03n6p6L12J529J981Q48j77L36J351J583J581J967J997J396
59473F16650J350K214K599K092K265L659M488L973M010N681P050O484N440N653
59459F73608O161N531M647M818N204M579L706L656L589K450J091O05K86q01j923
$$ plain form
59444 717207 714953 712445 709285 706289 704972 705290 705891 706613 708717 712540 716952 721397 726615 733106 740685
59429 740685 749637 760483 772477 784221 795882 808963 823783 839117 854431 870512 887736 905726
59417 905726 924974 946534 969199 988574 999766 1000276 990677 974344 956591 942109 932476 927070
59405 927070 926043 930656 940782 953729 965528 971940 968934 954778 932177 906575 881959 859508
59393 859508 839670 823172 809874 798834 789946 783734 779494 775637 772019 769955 769721 770046 770239 770739
59379 770739 771296 770744 769025 767522 766941 766723 766889 768439 771498 774963 778441 782672 787628 792119 795779
59364 795779 799567 803857 807968 812158 818133 826769 836935 847220 857321 867282 877056 887379 899550
59351 899550 913694 928456 942688 956076 968050 977689 984890 990060 992541 991007 985528 977520 967566
$$ packed form
59444G17207k254k508l160k996j317L18O01P22K104L823M412M445N218O491P579
59429G40685Q952J0846J1994J1744J1661J3081J4820J5334J5314J6081J7224J7990
59417I05726J9248K1560K2665J9375J1192N10r599j6333j7753j4482r633n406
59405I27070j027M613J0126J2947J1799O412l006j4156k2601k5602k4616k2451
59393H59508j9838j6498j3298j1040q888o212m240l857l618k064k34L25J93N00
59379G70739N57n52j719j503n81k18J66J550L059L465L478M231M956M491L660
59364G95779L788M290M111M190N975Q636J0166J0285J0101R961R774J0323J2171
59351H99550J4144J4762J4232J3388J1974R639P201N170K481j534n479q008r954
$$ plain form
59338 967566 955077 940196 924187 907754 890751 873688 857656 842686 828009 813937 801526
59327 801526 790448 779407 768666 759861 753108 746669 739788 733474 728073 722518 716612 711672 708203
59314 708203 705058 701620 698757 697008 695893 695579 697135 700547 704560 709049 715459 724453 735249 747716
59300 747716 762722 779766 796467 810884 822033 827872 825824 816409 803768 791483 780183 770004
59288 770004 762480 758453 756612 755780 756685 760114 765317 771596 779545 789472 800444 811935 824469 837592
59274 837592 849393 859202 868621 878698 888266 896322 903773 911388 918146 923135 927044 930214 931245 929220
59260 929220 925482 921512 916763 910150 902063 893328 883723 873090 862515 853014 844359 836359 829776 824812
59246 824812 820184 814896 809479 804614 800068 795860 792621 789901 786023 780588 775121 770284 764684 757565
$$ packed form
59338I67566j2489j4881j6009j6433j7003j7063j6032j4970j4677j4072j2411
59327H01526j1078j1041j0741q805o753o439o881o314n401n555n906m940l469
59314G08203l145l438k863j749j115l14J556L412M013M489O410Q994J0796J2467
59300G47716J5006J7044J6701J4417J1149N839k048r415j2641j2285j1300j0179
59288G70004p524m027j841q32R05L429N203O279P949R927J0972J1491J2534J3123
59274H37592J1801R809R419J0077R568Q056P451P615O758M989L909L170J031k025
59260I29220l738l970m749o613q087q735r605j0633j0575r501q655q000o583m964
59246H24812m628n288n417m865m546m208l239k720l878n435n467m837n600p119
$$ plain form
59232 757565 750412 744468 738864 732664 726638 721462 716290 710739 706226 703645 701682 699080 696582 694889
59218 694889 692759 689070 684930 681761 678973 675464 671781 668865 666127 662634 658842 655480 652135 648483
59204 648483 645446 643591 641993 640104 639026 639396 639851 639328 639041 640353 642443 643959 645299 647255 649063
59189 649063 649838 650501 652249 654481 656102 657529 659538 661514 662673 663730 665517 667242 667842 667803 668053 668394
59173 668394 668537 669211 670655 671647 671650 672204 674422 676764 677146 675641 673310 670106 665891 661830 658671 655160
59157 655160 650133 644662 640201 636269 631951 627943 624895 621416 616127 610245 605812 602691 599549 596386
59143 596386 593774 590932 586973 582966 580535 579457 578682 578511 579644 581309 582447 583584 585596 587977 590254
59128 590254 593588 598781 604255 608315 611973 617242 624063 631367 639721 650321 662612 675418 689292
$$ packed form
59232G57565p153n944n604o200o026n176n172n551m513k581j963k602k498j693
59218F94889k130l689m140l169k788l509l683k916k738l493l792l362l345l652
59204F48483l037j855j598j889j078L70M55n23k87J312K090J516J340J956J808
59189F49063P75O63J748K232J621J427K009J976J159J057J787J725O00l9K50L41
59173F68394J43O74J444R92LN54K218K342L82j505k331l204m215m061l159l511
59157F55160n027n471m461l932m318m008l048l479n289n882m433l121l142l163
59143E96386k612k842l959m007k431j078p75j71J133J665J138J137K012K381K277
59128E90254L334N193N474M060L658N269O821P304Q354J0600J2291J2806J3874
$$ plain form
59115 689292 705245 722356 739076 755712 773155 790355 805622 819203 831918 842427 848589 850577
59103 850577 849989 846867 840287 831026 820933 810421 799114 788117 779055 771602 764487 758155 753946
59090 753946 751434 749104 746833 745146 742875 738233 731617 724910 718709 712615 707360 704001 701651 698522
59076 698522 694564 690733 686547 680948 674780 669819 666035 662247 658647 656158 654197 651655 649225 648136
59062 648136 647583 646088 644401 644158 644610 643726 641704 640351 639718 638549 637359 637809 639408 640100 639844 640504
59046 640504 642369 643883 644685 645944 647749 649092 650365 653079 657186 661410 666002 672414 680512 689016
59032 689016 698481 710816 725886 741447 756363 771042 784777 795653 803169 808181 810293 808194
59020 808194 802556 795703 788301 779277 769026 759710 752144 745256 738925 734559 732531 731716 731914 734180
$$ packed form
59115F89292J5953J7111J6720J6636J7443J7200J5267J3581J2715J0509O162J988
59103H50577n88l122o580r261j0093j0512j1307j0997r062p453p115o332m209
59090G53946k512k330k271j687k271m642o616o707o201o094n255l359k350l129
59076F98522l958l831m186n599o168m961l784l788l600k489j961k542k430j089
59062F48136n53j495j687k43M52q84k022j353o33j169j190M50J599O92k56O60
59046F40504J865J514Q02J259J805J343J273K714M107M224M592O412Q098Q504
59032F89016R465J2335J5070J5561J4916J4679J3735J0876P516N012K112k099
59020H08194n638o853p402r024j0251r316p566o888o331m366k028q15J98K266
$$ plain form
59006 734180 738536 743862 750092 757912 766276 772932 777509 781474 785085 787195 788046 789305 791147 792110 792066
58991 792066 792394 792995 792090 789535 787591 787865 789995 793637 799195 806231 813699 822018 832478 844532 856233
58976 856233 867359 879384 892320 904404 915074 925505 936029 945792 955067 965062 975257 983692
58964 983692 990038 995618 1000477 1003306 1004210 1004354 1002912 997653 988754 978695 968165 955526 940716 926116
58950 926116 912838 899552 885771 873038 862045 851762 842319 835567 831884 829363 827017 825819 825823
58937 825823 825327 823780 822640 822547 822490 822386 823431 825204 825511 823811 821743 819714 816230 811337 807313 805012
58921 805012 802793 800101 798821 800046 802649 806002 810918 816968 822272 826979 833641 843036 853008 862530
58907 862530 873372 886421 899856 912483 925428 939037 951471 962048 972706 984490 995823
$$ packed form
59006G34180M356N326O230P820Q364O656M577L965L611K110Q51J259J842R63m4
58991G92066L28O01r05k555j944K74K130L642N558P036P468Q319J0460J2054J1701
58976H56233J1126J2025J2936J2084J0670J0431J0524R763R275R995J0195Q435
58964I83692O346N580M859K829R04J44j442n259q899j0059j0530j2639j4810j4600
58950I26116j3278j3286j3781j2733j0993j0283r443o752l683k521k346j198M
58937H25823m96j547j140r3n7j04J045J773L07j700k068k029l484m893m024k301
58921H05012k219k692j280J225K603L353M916O050N304M707O662R395R972R522
58907H62530J0842J3049J3435J2627J2945J3609J2434J0577J0658J1784J1333
$$ plain form
58896 995823 1006010 1017241 1031314 1047303 1064129 1082433 1102201 1121440 1138839 1154813 1168539
58885 1168539 1177214 1179914 1178998 1176090 1169965 1160131 1148983 1138286 1126856 1113998 1102078 1093228 1086358
58872 1086358 1079746 1073836 1069278 1064912 1059904 1055288 1051335 1046056 1038283 1029596 1021231 1011888 1000587 988848
58858 988848 977935 966828 954995 944174 935099 925339 912858 898909 885033 870085 852870 835030
58846 835030 818572 802967 787296 772810 760759 750011 739486 730674 725174 721908 719301 718046
58834 718046 719135 721270 722830 724520 727624 731429 734612 737393 740257 742502 743999 746347 750253 753859
58820 753859 755560 756293 757180 757337 756018 754469 753562 751998 748962 746017 744170 741612 736676 730619 725159
58805 725159 719741 713518 707518 702456 696859 689754 682796 677422 672425 666638 661351 657679 654323 650533
$$ packed form
58896I95823J0187J1231J4073J5989J6826J8304J9768J9239J7399J5974J3726
58885A168539Q675K700r16k908o125r834j1148j0697j1430j2858j1920q850o870
58872A086358o612n910m558m366n008m616l953n279p773q687q365r343j1301j1739
58858I88848j0913j1107j1833j0821r075r760j2481j3949j3876j4948j7215j7840
58846H35030j6458j5605j5671j4486j2051j0748j0525q812n500l266k607j255
58834G18046J089K135J560J690L104L805L183K781K864K245J497K348L906L606
58820G53859J701P33Q87J57j319j549r07j564l036k945j847k558m936o057n460
58805G25159n418o223o000n062n597p105o958n374m997n787n287l672l356l790
$$ plain form
58791 650533 648452 649721 652445 654443 656814 661222 666233 669606 671952 674968 678192 680625 683535 688591
58777 688591 694994 701168 707232 713220 717089 717275 715071 711957 707087 700103 693670 690030 687586 684051
58763 684051 680414 678437 676860 673749 670261 668328 666666 662891 657756 653591 650284 646410 642728 640978
58749 640978 640732 640865 642582 647584 654735 661872 669392 678793 689218 698904 708585 720103 732940 745273
58735 745273 757119 769298 780696 789684 796908 803759 809488 812724 814255 815459 815660 813925 811630 810350
58721 810350 809153 807009 805772 807464 810555 812272 812679 813171 812945 810478 806532 802102 795275 783790 769010
58706 769010 753756 738046 720550 702400 685661 669675 652721 635723 620677 607131 593923
58695 593923 582553 574872 569108 562247 554844 549502 546163 542881 539801 538234 537130 534504 531206 529424
$$ packed form
58791F50533k081J269K724J998K371M408N011L373K346L016L224K433K910N056
58777F88591O403O174O064N988L869J86k204l114m870o984o433l640k444l535
58763F84051l637j977j577l111l488j933j662l775n135m165l307l874l682j750
58749F40978k46J33J717N002P151P137P520R401J0425R686R681J1518J2837J2333
58735G45273J1846J2179J1398Q988P224O851N729L236J531J204K01j735k295j280
58721H10350j197k144j237J692L091J717M07M92k26k467l946m430o827j1485j4780
58706G69010j5254j5710j7496j8150j6739j5986j6954j6998j5046j3546j3208
58695E93923j1370p681n764o861p403n342l339l282l080j567j104k626l298j782
$$ plain form
58681 529424 528790 527682 526895 528134 530429 532094 534722 541081 550510 560506 571360 584972 600492 615546
58667 615546 630417 646545 662001 672912 678442 680280 678436 671872 662088 651686 640445 627058
58655 627058 613444 602851 594866 586889 579324 574655 572476 570288 568301 568603 570393 570854 570097 570481 571639
58640 571639 570977 568571 566843 565820 563352 559667 557126 555855 554026 551914 551277 551355 550049 548391 549186
58625 549186 551895 553552 554149 556296 560107 563320 566016 570285 575552 579099 580926 583378 586381 587868
58611 587868 588439 590593 593728 594933 594447 595230 597313 597723 595899 594176 592995 590639 587663 586568 587193
58596 587193 587319 587619 590995 597370 604326 612502 624869 640845 656619 671192 686520 701853 713832
58583 713832 722405 730785 739260 744936 748030 752365 758953 765050 770442 778776 791561 806552 823168
$$ packed form
58681E29424o34j108p87J239K295J665K628O359R429R996J0854J3612J5520J5054
58667F15546J4871J6128J5456J0911N530J838j844o564r784j0402j1241j3387
58655F27058j3614j0593p985p977p565m669k179k188j987L02J790M61p57L84J158
58640E71639o62k406j728j023k468l685k541j271j829k112o37P8j306j658P95
58625E49186K709J657N97K147L811L213K696M269N267L547J827K452L003J487
58611E87868N71K154L135J205m86P83K083M10j824j723j181k356k976j095O25
58596E87193J26L00L376O375O956Q176J2367J5976J5774J4573J5328J5333J1979
58583G13832Q573Q380Q475N676L094M335O588O097N392Q334J2785J4991J6616
$$ plain form
58570 823168 843868 868951 895450 922419 951908 983503 1013134 1038414 1060038 1077129 1086719 1088888
58558 1088888 1087055 1082299 1072877 1060163 1049101 1041513 1034612 1027293 1021929 1018460 1012654 1002172 988990
58545 988990 974273 956383 935600 915253 896347 876397 855117 835837 819681 803897 787655
58534 787655 773937 763794 754303 744136 735793 730324 725160 719107 714375 711856 709490 706898 706359 707584
58520 707584 706973 703620 700630 698990 695814 690257 685331 682032 677485 670826 665181 661922 658659 654754
58506 654754 652914 653447 652929 650543 649659 651191 651709 650319 651012 655681 661084 665314 671030 679589 688194
58491 688194 695663 705007 717504 730226 742107 756310 773903 791415 807385 824845 844312 860780
58479 860780 870913 877011 880726 879367 871950 862609 854361 845345 834563 825218 818972 813022 806255 802176
$$ packed form
58570H23168K0700K5083K6499K6969K9489L1595K9631K5280K1624J7091R590K169
58558A088888j833m756r422j2714j1062p588o901p319n364l469n806j0482j3182
58545I88990j4717j7890k0783k0347j8906j9950k1280j9280j6156j5784j6242
58534G87655j3718j0143r491j0167q343n469n164o053m732k519k366k592n39J225
58520G07584o11l353k990j640l176n557m926l299m547o659n645l259l263l905
58506F54754j840N33n18k386q84J532N18j390O93M669N403M230N716Q559Q605
58491F88194P469R344J2497J2722J1881J4203J7593J7512J5970J7460J9467J6468
58479H60780J0133O098L715j359p417r341q248r016j0782r345o246n950o767m079
$$ plain form
58465 802176 802373 803392 803458 805940 812680 820361 827029 835573 846924 856422 860829 862400 862254 856697 844441
58450 844441 830625 819152 807581 793947 781766 773539 766016 756937 750033 748311 748664 748040 748640 752078
58436 752078 754849 754833 756052 761753 768794 773939 779483 787492 794661 798130 800376 803288 803599 799279 794149
58421 794149 790968 786329 777574 768225 761244 753608 743103 733735 728629 724206 717292 711377 709834 709675
58407 709675 708074 708316 712953 717767 719043 720271 725115 730355 732434 734424 739678 745093 747510 750286
58393 750286 756604 762812 765420 768158 774909 782224 786211 790331 798861 809012 817013 825578 837667 849273
58379 849273 856233 862018 871016 880328 885983 890964 899184 907751 913129 918678 928133 937957 944104 949870
58365 949870 958981 967512 970861 972005 974547 974576 968099 959645 954645 950221 942482 935766 935174 936972 936077
$$ packed form
58465H02176J97J019O6K482O740P681O668Q544J1351R498M407J571j46n557j2256
58450H44441j3816j1473j1571j3634j2181q227p523r079o904j722L53o24O00L438
58436G52078K771j6J219N701P041N145N544Q009P169L469K246K912L11m320n130
58421G94149l181m639q755r349o981p636j0505r368n106m423o914n915j543j59
58407G09675j601K42M637M814J276J228M844N240K079J990N254N415K417K776
58393G50286O318O208K608K738O751P315L987M120Q530J0151Q001Q565J2089J1606
58379H49273O960N785Q998R312N655M981Q220Q567N378N549R455R824O147N766
58365I49870R111Q531L349J144K542K9o477q454n000m424p739o716n92J798q95
$$ plain form
58350 936077 936172 942555 951836 958778 966543 979900 994921 1005852 1015663 1029398 1043593 1052814 1060152
58337 1060152 1070695 1081171 1086706 1091085 1099441 1107604 1109730 1109590 1113025 1116340 1113816 1109692 1110709 1113689
58323 1113689 1112703 1111578 1116836 1125069 1129924 1134809 1145852 1159063 1167500 1174413 1186262 1199688 1208691
58310 1208691 1217499 1232573 1249106 1259566 1268308 1283224 1300282 1311363 1320113 1334549 1351036 1361534
58298 1361534 1369805 1384243 1401378 1412939 1422587 1438935 1458560 1472976 1485884 1506147 1530110 1548584
58286 1548584 1565030 1588876 1617091 1640504 1662049 1690267 1721244 1745975 1769314 1802375 1842508
58275 1842508 1880145 1918636 1967102 2020447 2067336 2111287 2162647 2216627 2261287 2300361 2345427
58264 2345427 2392256 2428448 2457867 2493444 2532233 2562383 2588439 2624271 2667160 2704790 2741629
$$ packed form
58350I36077R5O383R281O942P765J3357J5021J0931R811J3735J4195R221P338
58337A060152J0543J0476N535M379Q356Q163K126j40L435L315k524m124J017K980
58323A113689r86j125N258Q233M855M885J1043J3211Q437O913J1849J3426R003
58310A208691Q808J5074J6533J0460Q742J4916J7058J1081Q750J4436J6487J0498
58298A361534Q271J4438J7135J1561R648J6348J9625J4416J2908K0263K3963J8474
58286A548584J6446K3846K8215K3413K1545K8218L0977K4731K3339L3061M0133
58275A842508L7637L8491M8466N3345M6889M3951N1360N3980M4660L9074M5066
58264B345427M6829L6192K9419L5577L8789L0150K6056L5832M2889L7630L6839
$$ plain form
58253 2741629 2791641 2851109 2906191 2961149 3030742 3110924 3186321 3260511 3348704 3446754 3538806
58242 3538806 3629430 3735747 3853859 3966691 4078839 4208585 4351561 4488979 4626073 4784302
58232 4784302 4961060 5136733 5316311 5522576 5752972 5986150 6226632 6498382 6798777
58223 6798777 7105575 7425028 7784329 8180953 8590911 9022731 9509001 10049009 10617525
58214 10617525 11226185 11914824 12686301 13515986 14422381 15457943 16633540 17928947 19376653
58205 19376653 21053692 22993800 25200690 27752728 30803107 34483939 38923145 44351918
58197 44351918 51059902 59233751 68988390 80583667 94474194 111179235 131358434
58190 131358434 156054813 186516332 223482601 266602138 314226854 362929464 406741843
$$ packed form
58253B741629N0012N9468N5082N4958O9593Q0182P5397P4190Q8193R8050R2052
58242C538806R0624J06317J18112J12832J12148J29746J42976J37418J37094J58229
58232D784302J76758J75673J79578K06265K30396K33178K40482K71750L00395
58223F798777L06798L19453L59301L96624M09958M31820M86270N40008N68516
58214A0617525O08660O88639P71477Q29685R06395J035562J175597J295407J447706
58205A9376653J677039J940108K206890K552038L050379L680832M439206N428773
58197D4351918O707984Q173849R754639J1595277J3890527J6705041K0179199
58190A31358434K4696379L0461519L6966269M3119537M7624716M8702610M3812379
$$ plain form
58183 406741843 437718797 448961365 438314619 409424461 369242277 324510901 279986262
58176 279986262 238542764 201700029 169896480 142852495 120083897 101141294 85523639
58169 85523639 72660907 62068540 53393615 46297518 40427410 35523660 31439772 28034632
58161 28034632 25140456 22646200 20514319 18694466 17099714 15679016 14433715 13346391
58153 13346391 12362558 11455183 10641051 9919782 9257120 8640118 8090678 7611654 7172984
58144 7172984 6762546 6399630 6086683 5796289 5517264 5267485 5049665 4838287 4621998
58135 4621998 4417866 4232798 4050248 3865661 3697061 3549686 3405988 3260700 3131048
58126 3131048 3022405 2917558 2809886 2714515 2636655 2560365 2478796 2405300 2344504 2281633 2210639
$$ packed form
58183D06741843L0976954J1242568j0646746k8890158m0182184m4731376m4524639
58176B79986262m1443498l6842735l1803549k7043985k2768598j8942603j5617655
58169H5523639j2862732j0592367q674925p096097n870108m903750m083888l405140
58161B8034632k894176k494256k131881j819853j594752j420698j245301j087324
58153A3346391r83833r07375q14132p21269o62662o17002n49440m79024m38670
58144G172984m10438l62916l12947k90394k79025k49779k17820k11378k16289
58135D621998k04132j85068j82550j84587j68600j47375j43698j45288j29652
58126C131048j08643j04847j07672r5371p7860p6290q1569p3496o0796o2871p0994
$$ plain form
58115 2210639 2144883 2089964 2033021 1968774 1909963 1862121 1813288 1758357 1709022 1670024 1629487
58104 1629487 1582493 1541119 1511363 1482402 1448266 1418620 1398532 1378344 1352856 1330496 1314525
58093 1314525 1294892 1267606 1242919 1225699 1206581 1181115 1158921 1145008 1130230 1109102 1089451
58082 1089451 1075607 1059201 1035566 1012698 995325 976185 951596 929755 915156 900213 880635
58071 880635 863889 854236 844348 830000 818364 813497 807980 797127 787455 783027 777326 766759 758487
58058 758487 756660 754202 746289 738813 735482 729780 717952 707065 701800 695804 684570 674467 670388
58045 670388 666438 657639 649262 645787 641845 632961 624556 621566 619455 613999 609907 611291 613319 611459
58031 611459 609560 610855 610447 604533 597835 594256 589509 580601 573163 571517 570570 565405 559941 558309 556545
$$ packed form
58115B210639o5756n4919n6943o4247n8811m7842m8833n4931m9335l8998m0537
58104A629487m6994m1374k9756k8961l4136k9646k0088k0188k5488k2360j5971
58093A314525j9633k7286k4687j7220j9118k5466k2194j3913j4778k1128j9651
58082A089451j3844j6406k3635k2868j7373j9140k4589k1841j4599j4943j9578
58071H80635j6746r653r888j4348j1636m867n517j0853r672m428n701j0567q272
58058G58487j827k458p913p476l331n702j1828j0887n265n996j1234j0103m079
58045F70388l950q799q377l475l942q884q405k990k111n456m092J384K028j860
58031F11459j899J295m08n914o698l579m747q908p438j646r47n165n464j632j764
$$ plain form
58016 556545 550862 545573 544826 544716 541340 538481 539573 540234 536614 533154 534164 535517 532641 529138 529484
58001 529484 530511 528191 525863 527745 530882 531226 531242 534046 536460 535278 534115 536830 540445 541526 543044
57986 543044 547720 551127 548893 544571 542979 541807 537161 531471 528414 525643 519919 513965 511127 508633
57972 508633 503221 497956 496411 495493 491091 485582 482716 480331 475302 470438 469329 469289 466550 463487 463598
57957 463598 464234 461612 458375 458843 461127 461083 459873 460650 461988 461565 462247 467601 475309 481670 488504 498921
57941 498921 510441 519188 526848 536579 546073 551674 555452 561088 566435 567317 565179 563849 561980 555777
57927 555777 546142 536245 525107 510447 494990 483078 473724 463553 453793 447751 444148 439593 435009
57914 435009 433121 432283 429341 426009 425832 427314 426630 424701 425034 426821 426698 425212 425124 425388 423133 419673
$$ packed form
58016E56545n683n289p47j10l376k859J092O61l620l460J010J353k876l503L46
58001E29484J027k320k328J882L137L44J6K804K414j182j163K715L615J081J518
57986E43044M676L407k234m322j592j172m646n690l057k771n724n954k838k494
57972E08633n412n265j545r18m402n509k866k385n029m864j109m0k739l063J11
57957D63598O36k622l237M68K284m4j210P77J338m23O82N354P708O361O834J0417
57941D98921J1520Q747P660R731R494N601L778N636N347Q82k138j330j869o203
57927E55777r635r897j1138j4660j5457j1912r354j0171r760o042l603m555m584
57914D35009j888q38k942l332j77J482o84j929L33J787j23j486q8K64k255l460
$$ plain form
57898 419673 418374 418575 417636 416791 418814 422051 423082 423195 425876 429841 431044 429794 429540 430187 428985 426472
57882 426472 425273 424470 421354 417347 416014 416565 415455 413035 412493 413478 413086 412052 413789 418252 422814
57867 422814 428170 437180 448688 458640 466734 476068 486992 497261 507580 520756 535713 548250
57855 548250 557536 566114 573850 577827 578187 578230 578534 576436 571575 566567 562001 555912 548397 541707 535694
57840 535694 528196 520021 514540 512148 509980 507230 505968 506608 507273 507798 509791 512722 514427 515347 517701
57825 517701 520767 521634 520364 519668 519799 518681 516908 517551 520901 524275 527053 530959 535243 536620 534438
57810 534438 531272 528054 523300 517444 513149 510847 508416 505615 504337 504209 502552 499061 496058 493812
57796 493812 490227 485448 482108 480600 478708 476286 475568 476382 475897 473807 473019 474370 475336 474904 475112 476707
$$ packed form
57898D19673j299K01r39q45K023L237J031J13K681L965J203j250k54O47j202k513
57882D26472j199q03l116m007j333N51j110k420n42R85l92j034J737M463M562
57867D22814N356R010J1508R952Q094R334J0924J0269J0319J3176J4957J2537
57855E48250R286Q578P736L977L60M3L04k098m861n008m566o089p515o690o013
57840E35694p498q175n481k392k168k750j262O40O65N25J993K931J705R20K354
57825E17701L066Q67j270o96J31j118j773O43L350L374K778L906M284J377k182
57810E34438l166l218m754n856m295k302k431k801j278j28j657l491l003k246
57796D93812l585m779l340j508j892k422p18Q14m85k090p88J351R66m32K08J595
$$ plain form
57780 476707 477724 477464 477577 478087 476594 472563 468326 464792 460106 453565 446822 440320 432501 423484 415583
57765 415583 409362 403155 397165 393802 393077 391913 389067 386583 385386 383714 381103 379715 380384 381380 382279
57750 382279 384984 389664 393813 396676 400519 406088 410979 414126 417836 423564 429520 434273 439017 444442
57736 444442 448885 451439 453560 456018 457595 458315 460407 464488 468280 470752 474078 479733 486017 491157
57722 491157 495639 499794 502360 503156 504070 505771 506502 505518 504476 503938 501924 497582 492983 489600 486231
57707 486231 482066 478568 476609 474977 473412 473835 476764 479776 481370 483116 486000 487885 486805 483822
57693 483822 480557 476675 471860 467545 464692 462452 460736 461394 465098 469838 474222 479510 486767 494987
57679 494987 503817 515171 530258 547886 567518 591130 620202 653993 692867 740323 799379 869526
$$ packed form
57780D76707J017k60J13N10j493m031m237l534m686o541o743o502p819r017p901
57765D15583o221o207n990l363p25j164k846k484j197j672k611j388O69R96Q99
57750C82279K705M680M149K863L843N569M891L147L710N728N956M753M744N425
57736D44442M443K554K121K458J577P20K092M081L792K472L326N655O284N140
57722D91157M482M155K566P96R14J701P31r84j042n38k014m342m599l383l369
57707D86231m165l498j959j632j565M23K929L012J594J746K884J885j080k983
57693D83822l265l882m815m315k853k240j716O58L704M740M384N288P257Q220
57679D94987Q830J1354J5087J7628J9632K3612K9072L3791L8874M7456N9056P0147
$$ plain form
57667 869526 949009 1036636 1128108 1212643 1276023 1306388 1297303 1249460 1172135 1080193 986430 897368
57655 897368 816229 745975 687406 638013 595650 560912 533845 511367 490552 471767 456131
57644 456131 442555 429829 418968 410811 403799 396668 390829 387459 384744 380786 376825 374745 373666
57631 373666 371983 370601 371125 372602 372983 372289 371710 371106 369834 368450 367357 365453 362253 359468 358351
57616 358351 357565 355851 354538 354885 355216 353544 351027 349924 349896 349218 348009 347419 347056 345951 344790 344659
57600 344659 344984 345008 345712 347852 349818 349990 349567 350410 351703 351455 349765 347847 345291 341170 336558 333085
57584 333085 330169 326337 322180 319267 317258 314745 311914 309815 307974 305326 302567 301078 300471 299565 298745
57569 298745 298931 299231 298128 296112 294764 294151 293378 292725 292953 293485 293553 294053 296074 298669 300341 301501 303156
$$ packed form
57667H69526P9483Q7627R1472Q4535O3380L0365r085m7843p7325r1942r3763q9062
57655H97368q1139p0254n8569m9393m2363l4738k7067k2478k0815j8785j5636
57644D56131j3576j2726j0861q157p012p131n839l370k715l958l961k080j079
57631C73666j683j382N24J477L81o94n79o04j272j384j093j904l200k785j117
57616C58351p86j714j313L47L31j672k517j103k8o78j209n90l63j105j161j31
57600C44659L25K4P04K140J966J72m23Q43J293k48j690j918k556m121m612l473
57584C33085k916l832m157k913k009k513k831k099j841k648k759j489o07r06q20
57569B98745J86L00j103k016j348o13p73o53K28N32O8N00K021K595J672J160J655
$$ plain form
57552 303156 304524 304519 304314 305667 307762 308447 307702 307307 307927 309143 311388 315151 319017 321142 321951 322930 323670
57535 323670 322804 321012 320256 320598 320551 320110 320710 322482 324122 325196 326250 327019 326863 326604 327686 329865 331806
57518 331806 333388 335377 337556 339394 341730 345523 349746 352864 355449 358851 362318 364235 365358 367769
57504 367769 371209 373457 373972 374155 374269 373161 371008 369456 368825 367836 366267 365315 365129 364478 363063 361837
57488 361837 360877 359187 356754 354649 353069 351410 350164 350493 352002 353173 353908 355380 357530 359151 360348
57473 360348 362443 365359 367548 368683 370107 372393 374723 376865 379528 382548 384846 386387 388146 390134
57459 390134 391503 392489 394016 395534 395684 395043 395694 397864 399589 400048 400732 402730 405198 407211 409086 411196
57443 411196 413302 415558 418523 421930 425045 428135 431786 435061 436518 436829 438012 440209 441750 442405 443845
$$ packed form
57552C03156J368nk05J353K095O85p45l95O20J216K245L763L866K125Q09R79P40
57535C23670q66j792p56L42m7m41O00J772J640J074J054P69j56k59J082K179J941
57518C31806J582J989K179J838K336L793M223L118K585L402L467J917J123K411
57504C67769L440K248N15J83J14j108k153j552o31r89j569r52j86o51j415j226
57488C61837r60j690k433k105j580j659j246L29J509J171P35J472K150J621J197
57473C60348K095K916K189J135J424K286K330K142K663L020K298J541J759J988
57459C90134J369R86J527J518J50o41O51K170J725M59O84J998K468K013J875K110
57443D11196K106K256K965L407L115L090L651L275J457L11J183K197J541O55J440
$$ plain form
57428 443845 446595 449255 451294 453909 457406 460236 461564 462537 464112 465767 467176 469075 471625 473919
57414 473919 475926 478906 483098 486907 489280 491069 493230 495404 497148 498952 501196 503498 505624 507729
57400 507729 509472 510469 511725 514761 519178 523057 525968 529391 533836 537863 540630 543233 546645 550307
57386 550307 553579 556758 559853 562170 563872 566299 570020 574173 578146 582222 586102 588795 590542 593035
57372 593035 597042 601585 606004 610988 616981 623395 630019 637408 645355 652780 659603 666807 674241 680404
57358 680404 684933 689217 693982 698439 702495 707495 713833 719886 724342 727770 731033 734090 737149 741044
57344 741044 745562 749317 752122 755542 760281 765047 768954 773034 778367 784631 791481 799423 808264 816605
57330 816605 823960 831561 840111 848531 855921 862867 869881 876469 882752 890051 898696 907133 914309 921200
$$ packed form
57428D43845K750K660K039K615L497K830J328R73J575J655J409J899K550K294
57414D73919K007K980M192L809K373J789K161K174J744J804K244K302K126K105
57400E07729J743R97J256L036M417L879K911L423M445M027K767K603L412L662
57386E50307L272L179L095K317J702K427L721M153L973M076L880K693J747K493
57372E93035M007M543M419M984N993O414O624P389P947P425O823P204P434O163
57358F80404M529M284M765M457M056N000O338O053M456L428L263L057L059L895
57344G41044M518L755K805L420M739M766L907M080N333O264O850P942Q841Q341
57330H16605P355P601Q550Q420P390O946P014O588O283P299Q645Q437P176O891
$$ plain form
57316 921200 928878 936850 944437 952106 960439 969304 978842 989545 1000797 1011261 1021316 1032848 1046002
57303 1046002 1058618 1069693 1080788 1092913 1104845 1115908 1127673 1141137 1154815 1167549 1180776
57292 1180776 1195881 1211563 1226035 1239961 1254974 1271005 1287092 1303259 1319679 1335598 1350897
57281 1350897 1367110 1385086 1403290 1420187 1436561 1453616 1470600 1486374 1501742 1518183 1535650
57270 1535650 1553540 1572309 1592193 1611802 1630003 1647874 1666930 1686787 1706371 1725979 1746320
57259 1746320 1767010 1787797 1809627 1832568 1854466 1873909 1892904 1914202 1937384 1960046 1981662
57248 1981662 2003762 2027197 2051650 2077153 2103892 2131019 2157497 2183574 2209925 2236245 2262196
57237 2262196 2288629 2316314 2344571 2372705 2401446 2431438 2461752 2491629 2522129 2554192 2586593
$$ packed form
57316I21200P678P972P587P669Q333Q865R538J0703J1252J0464J0055J1532J3154
57303A046002J2616J1075J1095J2125J1932J1063J1765J3464J3678J2734J3227
57292A180776J5105J5682J4472J3926J5013J6031J6087J6167J6420J5919J5299
57281A350897J6213J7976J8204J6897J6374J7055J6984J5774J5368J6441J7467
57270A535650J7890J8769J9884J9609J8201J7871J9056J9857J9584J9608K0341
57259A746320K0690K0787K1830K2941K1898J9443J8995K1298K3182K2662K1616
57248A981662K2100K3435K4453K5503K6739K7127K6478K6077K6351K6320K5951
57237B262196K6433K7685K8257K8134K8741K9992L0314K9877L0500L2063L2401
$$ plain form
57226 2586593 2617795 2648261 2678957 2709262 2738693 2769027 2802164 2837193 2872156 2907407 2944624
57215 2944624 2983681 3023272 3063752 3106709 3152301 3199329 3247247 3295922 3344320 3391658 3438952
57204 3438952 3487245 3535323 3581444 3626107 3670616 3714089 3754626 3792502 3829441 3865535 3899619
57193 3899619 3932037 3964332 3996770 4028808 4061416 4096291 4133319 4171353 4210912 4253469 4298686
57182 4298686 4345119 4393163 4444555 4499365 4556213 4615139 4677517 4743370 4811434 4881616 4954597
57171 4954597 5029148 5102616 5174139 5244778 5314410 5380992 5443097 5500793 5553908 5601636 5643972
57160 5643972 5681456 5713633 5739743 5760657 5777984 5791713 5800922 5806343 5809944 5812556 5814396 5817299
57148 5817299 5823754 5834081 5847114 5863167 5883622 5908079 5934809 5963590 5994920 6026428 6053201
$$ packed form
57226B586593L1202L0466L0696L0305K9431L0334L3137L5029L4963L5251L7217
57215B944624L9057L9591M0480M2957M5592M7028M7918M8675M8398M7338M7294
57204C438952M8293M8078M6121M4663M4509M3473M0537L7876L6939L6094L4084
57193C899619L2418L2295L2438L2038L2608L4875L7028L8034L9559M2557M5217
57182D298686M6433M8044N1392N4810N6848N8926O2378O5853O8064P0182P2981
57171D954597P4551P3468P1523P0639O9632O6582O2105N7696N3115M7728M2336
57160E643972L7484L2177K6110K0914J7327J3729R209N421L601K612J840K903
57148E817299O455J0327J3033J6053K0455K4457K6730K8781L1330L1508K6773
$$ plain form
57137 6053201 6072165 6083981 6091112 6096798 6105558 6121312 6144403 6172543 6204338 6239497 6276620 6314358
57125 6314358 6354595 6401209 6455765 6517588 6587748 6669249 6763015 6867060 6979885 7101441 7230662
57114 7230662 7365705 7507418 7659846 7827408 8014787 8229327 8479694 8771792 9109504
57105 9109504 9499760 9954051 10486203 11113980 11864319 12774359 13888773 15261811 16963036
57096 16963036 19076612 21693005 24901774 28786292 33414428 38830261 45057556 52107608
57088 52107608 59972505 68606049 77913610 87751759 97914083 108101087 117909559 126865400
57080 126865400 134480147 140306071 143996085 145371977 144461713 141464037 136662904 130360923
57072 130360923 122864630 114490333 105552331 96336630 87084858 77996350 69238116 60952670
$$ packed form
57137F053201J8964J1816P131N686Q760J5754K3091K8140L1795L5159L7123L7738
57125F314358M0237M6614N4556O1823P0160Q1501R3766J04045J12825J21556J29221
57114G230662J35043J41713J52428J67562J87379K14540K50367K92098L37712
57105I109504L90256M54291N32152O27777P50339R10040J114414J373038J701225
57096A6963036K113576K616393L208769L884518M628136N415833O227295P050052
57088E2107608P864897Q633544R307561R838149J0162324J0187004R808472Q955841
57080A26865400P614747N825924L690014J375892r10264k997676m801133o301981
57072A30360923p496293q374297q938002r215701r251772r088508q758234q285446
$$ plain form
57064 60952670 53259134 46246721 39966135 34428070 29610323 25466532 21932940 18936355
57056 18936355 16403593 14267131 12465644 10944250 9656326 8563227 7631414 6831369
57048 6831369 6139306 5537347 5010913 4547274 4136707 3772771 3450376 3164570 2911212
57039 2911212 2687075 2488749 2312626 2156113 2017712 1895966 1789481 1697885 1621660 1561351
57029 1561351 1517819 1492434 1485580 1495432 1518688 1550202 1579573 1590178 1566288 1503022 1408490 1296835
57017 1296835 1180782 1069144 966854 875095 792765 718949 653516 595816 544617 499382 460078
57006 460078 425690 394560 366231 341400 320049 301176 284359 269897 257333 245549 234540
56995 234540 225525 218984 214099 210407 208556 209041 211525 215943 223175 234216 249528 269317 293356
$$ packed form
57064F0952670p693536p012413o280586n538065m817747m143791l533592k996585
57056A8936355k532762k136462j801487j521394j287924j093099r31813q00045
57048F831369o92063o01959n26434m63639m10567l63936l22395k85806k53358
57039B911212k24137j98326j76123j56513j38401j21746j06485r1596p6225o0309
57029A561351m3532k5385o854R852K3256L1514K9371J0605k3890o3266r4532j11655
57017A296835j16053j11638j02290r1759q2330p3816o5433n7700n1199m5235l9304
57006D60078l4388l1130k8329k4831k1351j8873j6817j4462j2564j1784j1009
56995B34540r015o541m885l692j851M85K484M418P232J1041J5312J9789K4039
$$ plain form
56982 293356 319960 345538 365244 374060 368486 348766 319442 286551 254119 223651 196015 172257
56970 172257 152866 137584 126118 118244 113559 111975 114117 120515 131038 145920 166438 193434
56958 193434 226034 262902 303384 345280 382134 405231 409032 393969 364621 326872 286418 247631
56946 247631 212637 181891 155732 134747 119114 108633 103285 103003 107280 115846 129335 148632
56934 148632 174159 206490 246671 294787 348581 403655 453525 488975 500287 483332 443315
56923 443315 390894 335120 280920 231058 187221 149355 116465 88403 65544 47241 32331
56912 32331 20596 11997 5142 -1519 -7501 -11270 -12964 -14096 -15004 -14788 -13545 -12486 -11887 -10888 -9264
56897 -9264 -7471 -4870 136 8068 18024 29435 42651 58093 76431 99302 128087 162049 198982
$$ packed form
56982B93356K6604K5578J9706Q816n574j9720k9324l2891l2432l0468k7636k3758
56970A72257j9391j5282j1466p874m685j584K142O398J0523J4882K0518K6996
56958A93434L2600L6868M0482M1896L6854K3097L801j5063k9348l7749m0454l8787
56946B47631l4994l0746k6159k0985j5633j0481n348k82M277Q566J3489J9297
56934A48632K5527L2331M0181M8116N3794N5074M9870L5450J1312j6955m0017
56923D43315n2421n5774n4200m9862m3837l7866l2890k8062k2859j8303j4910
56912C2331j1735q599E142a519n982l769j694j132r08K16J243J059N99R99J624
56897i264J793K601A36P932R956J1411J3216J5442J8338K2871K8785L3962L6933
$$ plain form
56884 198982 236810 272615 300972 316138 316351 304363 284170 259274 233457 210222 190734 174258
56872 174258 160953 152401 149394 151391 158339 171028 189407 212658 241375 277869 323985 380241
56860 380241 446846 522942 603744 679735 739304 772013 771396 738221 681674 614902 548058 486055
56848 486055 431527 386789 352732 328730 314615 310910 317016 331537 354791 388886 435155 493981
56836 493981 567340 658616 768753 894177 1027798 1158150 1266848 1331832 1338104 1286176 1190159
56825 1190159 1069437 941997 821159 713966 621942 544391 480830 430636 392611 366259
56815 366259 352306 351074 361585 383071 416212 462221 521850 595536 682672 779293 876623 961750
56803 961750 1019506 1036318 1006802 938360 847504 750411 657354 574164 504378 448308 403105
$$ packed form
56884A98982L7828L5805K8357J5166K13j1988k0193k4896k5817k3235j9488j6476
56872A74258j3305q552l007J997O948J2689J8379K3251K8717L6494M6116N6256
56860C80241O6605P6096Q0802P5991N9569L2709o17l3175n6547o6772o6844o2003
56848D86055n4528m4738l4057k4002j4115l705O106J4521K3254L4095M6269N8826
56836D93981P3359R1276J10137J25424J33621J30352J08698O4984O272n1928r6017
56825A190159j20722j27440j20838j07193r2024p7551o3561n0194l8025k6352
56815C66259j3953j232J0511K1486L3141M6009N9629P3686Q7136R6621R7330Q5127
56803I61750N7756J6812k9516o8442r0856r7093r3057q3190o9786n6070m5203
$$ plain form
56792 403105 366188 337433 317195 304346 297595 296987 302919 315363 335079 363776 401884 447517
56780 447517 497979 549914 596813 628894 637818 621200 582482 528476 467655 407935 353636 305209
56768 305209 262458 226394 197297 173319 152476 134453 119351 106454 95347 86544 79902 74123
56756 74123 68740 64684 61918 58608 53834 49077 45771 43438 41507 40760 41423 41845 40797 39239 38289
56741 38289 37332 35773 34696 34969 35437 34849 33995 34160 34990 35593 36251 37364 38142 38009 37826 38220 38240 37271
56723 37271 36660 37771 39954 42064 44394 47374 49962 51245 52184 53938 55850 56880 57678 59360 61558
56708 61558 63469 65593 68600 71699 73851 75460 77206 78469 78601 78506 79299 80589 81681 83140 85490
56693 85490 87647 88408 88290 88264 87901 86412 84382 82878 81953 81377 81492 81991 81388 79199 77087 76442 76503 76346
$$ packed form
56792D03105l6917k8755k0238j2849o751o08N932J2444J9716K8697L8108M5633
56780D47517N0462N1935M6899L2081Q924j6618l8718n4006o0821n9720n4299m8427
56768C05209m2751l6064k9097k3978k0843j8023j5102j2897j1107q803o642n779
56756G4123n383m056k766l310m774m757l306k333j931p47O63M22j048j558r50
56741C8289r57j559j077K73M68n88q54J65Q30O03O58J113P78j33j83L94K0r69
56723C7271o11J111K183K110K330K980K588J283R39J754J912J030P98J682K198
56708F1558J911K124L007L099K152J609J746J263J32r5P93J290J092J459K350
56693H5490K157P61j18k6l63j489k030j504r25n76J15M99o03k189k112o45O1j57
$$ plain form
56675 76346 76776 78420 79877 79814 79135 79047 78742 77195 75497 75063 75090 74122 72674 72009 71751 71052 70712 71822
56657 71822 73651 75114 76882 79680 82081 82574 82392 83622 85794 87065 87620 89046 91304 93100 94489
56642 94489 96490 98767 100061 100226 99666 97717 93937 90016 87981 87400 86583 85464 84873 84142 82078 79370
56626 79370 77431 75854 73569 71458 71024 71389 70478 68475 67322 67485 67890 68372 69453 70381 70081 69432 69961
56609 69961 71034 71029 70435 70904 71982 71887 70955 71228 72943 74470 75408 76833 78636 79561 79792 80686 82027 82254
56591 82254 81354 80892 81297 81674 82132 83652 85761 86867 86825 86779 86791 86080 85162 85236 85872 85965 86368 88703 92063
56572 92063 93945 94172 94815 96517 98012 99266 101838 105949 110155 114180 119221 125290 131011 136166 141640
56557 141640 146777 149667 150265 150484 151118 151456 151916 153984 157273 159525 159924 159691 159262 157742 155395 153701
$$ packed form
56675G6346M30J644J457o3o79q8l05j547j698m34K7r68j448o65k58o99l40J110
56657G1822J829J463J768K798K401M93j82J230K172J271N55J426K258J796J389
56642I4489K001K277J294J65n60j949l780l921k035n81q17j119n91p31k064k708
56626G9370j939j577k285k111m34L65r11k003j153J63M05M82J081R28l00o49N29
56609F9961J073nn94M69J078r5r32K73J715J527R38J425J803R25K31Q94J341K27
56591H2254r00m62M05L77M58J520K109J106m2m6J2p11r18P4O36R3M03K335L360
56572I2063J882K27O43J702J495J254K572M111M206M025N041O069N721N155N474
56557A41640N137K890N98K19O34L38M60K068L289K252L99k33m29j520k347j694
$$ plain form
56541 153701 152595 150461 147228 144696 143470 142314 140824 139961 139574 138221 135801 133716 132223 130403 128873
56526 128873 129543 132340 135051 136702 138272 139831 140056 139013 138381 138431 137648 135741 134156 133249 131890 130140
56510 130140 129292 128943 127180 124069 121828 121071 120082 118264 117063 116959 116762 116460 117456 119389 120106 119448 119683
56493 119683 121459 122790 122901 123544 125456 126944 127098 127180 127730 127542 126587 126681 128187 129255 129334 130115 131954
56476 131954 132814 131920 131065 131101 130574 129049 128260 128593 127980 125758 124155 124393 124815 124494 125161 127639 129778
56459 129778 129900 129223 129087 128943 128825 130464 133961 136506 136452 135672 135985 136369 135681 135048 135434 135707 135171 135177 136313
56440 136313 136856 135885 135036 135320 135251 133961 133100 133641 133980 133276 133479 135748 137986 138315 138071 138924 139948 140009
56422 140009 140245 141658 142837 142567 142173 142971 143917 144003 144413 146020 147335 147240 147189 148475 149870 150194 150651 152342
$$ packed form
56541A53701j106k134l233k532j226j156j490q63l87j353k420k085j493j820j530
56526A28873O70K797K711J651J570J559K25j043o32N0p83j907j585r07j359j750
56510A30140q48l49j763l111k241p57r89j818j201j04j97l02R96J933P17o58K35
56493A19683J776J331J11O43J912J488J54Q2N50j88r55R4J506J068P9P81J839
56476A31954Q60q94q55L6n27j525p89L33o13k222j603K38M22l21O67K478K139
56459A29778J22o77j36j44j18J639L497K545n4p80L13L84o88o33L86K73n36OJ136
56440A36313N43r71q49K84o9j290q61N41L39p04K03K269K238L29k44Q53J024O1
56422A40009K36J413J179k70l94P98R46Q6M10J607J315r5n1J286J395L24M57J691
$$ plain form
56404 152342 153990 154435 154868 156394 157807 157964 157964 158956 160197 161163 162947 165735 167681 168150 169212 172036
56388 172036 174781 175947 176692 177874 178157 177128 176896 178349 179353 178920 179443 182167 184248 183336 181477 181283
56372 181283 181715 181029 180538 181891 183619 183946 184214 186152 188462 189393 190044 191845 193494 193592 193630 195192 196925
56355 196925 197417 198237 200952 203999 205731 207613 211115 214431 215683 216358 218087 219118 217719 216050 216731
56340 216731 218370 218463 218015 219283 221460 222599 223488 225757 228459 230188 232203 235835 239343 240989 242601
56325 242601 246276 250282 252132 253090 255551 258477 259599 259751 261009 262788 263735 265109 268366 271797 273426
56310 273426 274806 278152 282372 285828 290171 297299 305313 311760 318041 326239 334440 339853 343865 349393
56296 349393 355868 361501 367731 376523 385902 393145 399905 409151 419597 428276 436141 445858 456415 465298
$$ packed form
56404A52342J648M45M33J526J413J57%R92J241R66J784K788J946M69J062K824
56388A72036K745J166P45J182K83j029k32J453J004m33N23K724K081r12j859j94
56372A81283M32o86m91J353J728L27K68J938K310R31O51J801J649R8L8J562J733
56355A96925M92Q20K715L047J732J882L502L316J252O75J729J031j399j669O81
56340B16731J639R3m48J268K177J139Q89K269K702J729K015L632L508J646J612
56325B42601L675M006J850R58K461K926J122J52J258J779R47J374L257L431J629
56310B73426J380L346M220L456M343P128Q014O447O281Q198Q201N413M012N528
56296C49393O475N633O230Q792R379P243O760R246J0446Q679P865R717J0557Q883
$$ plain form
56282 465298 473771 484600 496629 507009 516812 529133 543610 558089 573696 592850 614233 635190
56270 635190 657206 683586 713686 744956 778763 818537 864001 912931 966828 1029135 1099649
56259 1099649 1176524 1262098 1360732 1472313 1593674 1724948 1868682 2024154 2188416 2361490
56249 2361490 2544617 2734707 2926174 3116681 3305218 3486292 3652189 3799407 3926716
56240 3926716 4028684 4097914 4132595 4135659 4107949 4048866 3962374 3855388 3730992 3589620 3435690
56229 3435690 3276172 3113478 2946545 2778118 2614110 2456455 2303394 2156129 2018363
56220 2018363 1889923 1767780 1652875 1548998 1455394 1367480 1284518 1209601 1142410 1079104
56210 1079104 1019271 966015 919235 875676 835466 801669 773460 746647 720826 699120 681056
$$ packed form
56282D65298Q473J0829J2029J0380R803J2321J4477J4479J5607J9154K1383K0957
56270F35190K2016K6380L0100L1270L3807L9774M5464M8930N3897O2307P0514
56259A099649P6875Q5574R8634J11581J21361J31274J43734J55472J64262J73074
56249B361490J83127J90090J91467J90507J88537J81074J65897J47218J27309
56240C926716J01968O9230L4681L064k7710n9083q6492j06986j24396j41372j53930
56229C435690j59518j62694j66933j68427j64008j57655j53061j47265j37766
56220B018363j28440j22143j14905j03877r3604q7914q2962p4917o7191o3306
56210A079104n9833n3256m6780m3559m0210l3797k8209k6813k5821k1706j8064
$$ plain form
56199 681056 662748 644019 628224 615167 601309 586859 575453 566970 557902 548614 542786 539760
56187 539760 535041 528391 523804 521550 518016 513449 511851 512964 512379 509866 509585 511738 512233 511032 512464
56172 512464 516664 519171 519784 523266 530319 536372 540465 546858 556580 565799 573846 584451 597685 609166
56158 609166 618728 631533 649128 667682 686373 709085 736433 764666 793950 829230 871650 917812
56146 917812 968769 1030827 1106172 1191768 1288606 1402163 1531712 1668567 1806619 1944929
56136 1944929 2078179 2195228 2290513 2368108 2432440 2484527 2529115 2574595 2621977 2662891 2691244
56125 2691244 2707972 2712832 2702322 2678622 2650093 2619377 2580302 2528729 2466046 2389694 2291931
56114 2291931 2172018 2039410 1901813 1760802 1621881 1496491 1389366 1294790 1209523 1138317
$$ packed form
56199F81056j8308j8729j5795j3057j3858j4450j1406q483r068r288n828l026
56187E39760m719o650m587k254l534m567j598J113n85k513k81K153M95j201J432
56172E12464M200K507O13L482P053O053M093O393R722R219Q047J0605J3234J1481
56158F09166R562J2805J7595J8554J8691K2712K7348K8233K9284L5280M2420M6162
56146I17812N0957O2058P5345Q5596R6838J13557J29549J36855J38052J38310
56136A944929J33250J17049R5285P7595O4332N2087M4588M5480M7382M0914K8353
56125B691244J6728M860j0510k3700k8529l0716l9075n1573o2683p6352r7763
56114B291931j19913j32608j37597j41011j38921j25390j07125r4576q5267p1206
$$ plain form
56104 1138317 1082620 1035566 993156 959363 935387 915052 895679 882356 876541 871544 864176 859620
56092 859620 859976 859547 856366 856611 862436 867345 868825 873472 884209 894813 902653 914188 931882 948479
56078 948479 960468 974366 993256 1010134 1021293 1033108 1048555 1060370 1064923 1069532 1078467 1085071
56066 1085071 1085512 1086858 1093472 1098978 1099872 1103436 1113815 1124006 1130109 1139407 1155673 1170807 1180080
56053 1180080 1191194 1208996 1226024 1237741 1252011 1273434 1293546 1307043 1322413 1345682 1369043
56042 1369043 1386628 1405908 1432050 1456875 1475242 1496483 1527445 1560147 1588470 1620654 1662542
56031 1662542 1705029 1741166 1778912 1823779 1866167 1899567 1933726 1975770 2016366 2049009 2084308
56020 2084308 2130083 2176391 2215891 2259400 2314942 2371505 2420692 2473994 2540776 2610100 2672916
$$ packed form
56104A138317n5697m7054m2410l3793k3976k0335j9373j3323n815m997p368m556
56092H59620L56m29l181K45N825M909J480M647J0737J0604P840J1535J7694J6597
56078I48479J1989J3898J8890J6878J1159J1815J5447J1815M553M609Q935O604
56066A085071M41J346O614N506Q94L564J0379J0191O103R298J6266J5134R273
56053A180080J1114J7802J7028J1717J4270K1423K0112J3497J5370K3269K3361
56042A369043J7585J9280K6142K4825J8367K1241L0962L2702K8323L2184M1888
56031A662542M2487L6137L7746M4867M2388L3400L4159M2044M0596L2643L5299
56020B084308M5775M6308L9500M3509N5542N6563M9187N3302O6782O9324O2816
$$ plain form
56009 2672916 2740897 2823841 2910145 2989859 3074922 3175680 3280108 3378005 3482318 3603873
55999 3603873 3729139 3846717 3970897 4114163 4262174 4402283 4550385 4721866 4903106
55990 4903106 5080767 5271363 5491159 5725418 5959517 6210989 6497206 6802159 7110795
55981 7110795 7444258 7823492 8231280 8650189 9103377 9615742 10171453 10755262 11397414
55972 11397414 12129362 12935800 13802655 14769544 15878935 17120384 18487533 20042278 21857152
55963 21857152 23949786 26352165 29192827 32635810 36807478 41874971 48116623 55797374
55955 55797374 65052376 76030830 89089637 104734842 123533131 146319847 174353714
55948 174353714 208855908 250205630 297489726 348219512 397565782 437876150 460424597
$$ packed form
56009B672916O7981Q2944Q6304P9714Q5063J00758J04428R7897J04313J21555
55999C603873J25266J17578J24180J43266J48011J40109J48102J71481J81240
55990D903106J77661J90596K19796K34259K34099K51472K86217L04953L08636
55981G110795L33463L79234M07788M18909M53188N12365N55711N83809O42152
55972A1397414P31948Q06438Q66855R66889J109391J241449J367149J554745J814874
55963B1857152K092634K402379K840662L442983M171668N067493O241652P680751
55955E5797374R255002J0978454J3058807J5645205J8798289K2786716K8033867
55948A74353714L4502194M1349722M7284096N0729786M9346270M0310368K2548447
$$ plain form
55941 460424597 459509810 435814268 395877685 348258014 299868938 254798256 214927463
55934 214927463 180739120 151856227 127582130 107315191 90565130 76797833 65472181
55927 65472181 56171848 48570118 42323536 37114139 32745531 29095818 26016576 23360312
55919 23360312 21058773 19086737 17381177 15866780 14523621 13357685 12333850 11401181
55911 11401181 10554879 9812239 9153443 8542542 7981964 7491873 7057679 6648687 6267675
55902 6267675 5933652 5635040 5346054 5071311 4830207 4613940 4399971 4193063 4011617
55893 4011617 3848262 3682812 3520445 3379756 3255878 3131034 3009327 2906738 2818285 2728153
55883 2728153 2641197 2572300 2514907 2450808 2380953 2317052 2253150 2175169 2089253 2011988 1941426
$$ packed form
55941D60424597r14787k3695542l9936583m7619671m8389076m5070682l9870793
55934B14927463l4188343k8882893k4274097k0266939j6750061j3767297j1325652
55927F5472181r300333p601730o246582n209397m368608l649713l079242k656264
55919B3360312k301539j972036j705560j514397j343159j165936j023835r32669
55911A1401181q46302p42640o58796o10901n60578m90091m34194m08992l81012
55902F267675l34023k98612k88986k74743k41104k16267k13969k06908j81446
55893D011617j63355j65450j62367j40689j23878j24844j21707j02589q8453r0132
55883B728153q6956o8897n7393o4099o9855o3901o3902p7981q5916p7265p0562
$$ plain form
55872 1941426 1865219 1788274 1724577 1669878 1609596 1546338 1493456 1448575 1399230 1348036 1307138
55861 1307138 1273893 1236425 1197454 1168885 1148268 1123616 1096164 1075929 1060209 1038656 1014384
55850 1014384 998035 985853 965336 938009 915262 896149 870611 840759 817814 801170 780874
55839 780874 757878 741908 731951 718233 701196 689697 682848 672059 658707 651639 649453 643096
55827 643096 633810 630832 633405 632554 628663 629921 635061 634900 629654 627936 629865 627811 622714 623173 629008
55812 629008 631725 630557 632386 636468 634935 627996 623316 620642 612215 598220 586881 579279 568740
55799 568740 555284 546055 541170 533414 522324 514621 510354 502582 491375 484470 483263 481347 477359
55786 477359 476009 475928 469989 458728 450418 446829 441590 433587 429024 428876 426772 420842 415669 411250 402066
$$ packed form
55872A941426p6207p6945o3697n4699o0282o3258n2882m4881m9345n1194m0898
55861A307138l3245l7468l8971k8569k0617k4652k7452k0235j5720k1553k4272
55850A014384j6349j2182k0517k7327k2747j9113k5538k9852k2945j6644k0296
55839G80874k2996j5970r957j3718j7037j1499o849j0789j3352p068k186o357
55827F43096r286k978K573q51l891J258N140j61n246j718J929k054n097M59N835
55812F29008K717j168J829M082j533o939m680k674q427j3995j1339p602j0539
55799E68740j3456r229m885p756j1090p703m267p772j1207o905j207j916l988
55786D77359j350q1n939j1261q310l589n239q003m563j48k104n930n173m419r184
$$ plain form
55771 402066 388432 377054 369013 358716 345777 336214 330678 323174 312813 305318 301567 296217 289045
55758 289045 286095 287946 288261 285550 284970 286799 284813 278282 274194 275048 275375 272812 271680 272903 271190
55743 271190 265199 260264 258155 254140 246916 241546 239723 236894 231801 229193 230355 230473 228170 228137 231523
55728 231523 233117 230969 229533 230418 229278 224825 221802 221890 220616 216327 213421 213674 213091 210320 209428 211248
55712 211248 210763 206333 202946 203090 202858 200392 199669 202448 204734 204783 206504 211388 214986 214942 214713 215947
55696 215947 215081 211067 208673 210382 212506 212834 214588 219209 222828 223666 225656 230948 235994 238677 242162
55681 242162 247956 252294 253204 254257 257612 260160 260196 260979 264025 265756 264524 264109 266468 267896 266300
55666 266300 265468 268057 270869 271092 270731 270796 267675 259589 250486 243339 235678 225757 216944 211681 207058
$$ packed form
55771D02066j3634j1378q041j0297j2939r563n536p504j0361p495l751n350p172
55758B89045k950J851L15k711n80J829j986o531m088Q54L27k563j132J223j713
55743B71190n991m935k109m015p224n370j823k829n093k608J162J18k303l3L386
55728B31523J594k148j436Q85j140m453l023Q8j274m289k906K53n83k771q92J820
55712B11248m85m430l387J44k32k466p23K779K286M9J721M884L598m4k29J234
55696B15947q66m014k394J709K124L28J754M621L619Q38J990N292N046K683L485
55681B42162N794M338R10J053L355K548L6P83L046J731j232m15K359J428j596
55666B66300q32K589K812K23l61O5l121q086r103p147p661r921q813n263m623
$$ plain form
55651 207058 200675 195130 192465 189917 185350 181291 179444 176750 171081 165394 162137 158904 153753 149439
55637 149439 148232 147647 145426 143728 144460 145447 144953 145001 146586 146809 144356 142510 143073 142803 139602 136662
55621 136662 136447 136145 133296 130492 130144 129813 127194 124636 124319 123979 121826 120706 122850 125321 125113 124089
55605 124089 124458 124156 121261 118328 117742 117246 114583 112117 112317 113079 112020 111111 112526 114209 114123 114606 117894
55588 117894 121382 121933 121010 121187 121631 121275 122298 125991 129361 130284 131813 136868 142955 146943 150802 157569
55572 157569 165642 172288 179035 188356 198425 206185 212280 218090 221293 219421 214611 209991 204534 196309
55558 196309 187548 181406 176721 170968 165514 162954 161971 159742 156911 155505 154508 152105 149784 149678 150420
55543 150420 149932 149598 151241 152777 151418 148504 146678 145008 141513 137706 135852 134333 130548 125989 123701
$$ packed form
55651B07058o383n545k665k548m567m059j847k694n669n687l257l233n151m314
55637A49439j207n85k221j698P32R87m94M8J585K23k453j846N63k70l201k940
55621A36662k15l02k849k804l48l31k619k558l17l40k153j120K144K471k08j024
55605A24089L69l02k895k933n86m96k663k466K00P62j059r09J415J683q6M83L288
55588A17894L488N51r23J77M44l56J023L693L370R23J529N055O087L988L859O767
55572A57569Q073O646O747R321J0069P760O095N810L203j872m810m620n457q225
55558A96309q761o142m685n753n454k560r83k229k831j406r97k403k321j06P42
55543A50420m88l34J643J536j359k914j826j670l495l807j854j519l785m559k288
$$ plain form
55528 123701 122971 121180 118652 117076 115458 112246 109277 109001 109847 108768 106305 104834 104031 102453 101302
55513 101302 102170 103266 102297 100791 101177 102010 100710 98610 98427 99038 97665 95174 94238 94234 92958 91494 92324
55496 92324 94255 94277 92955 93069 94304 94225 93231 93679 95155 95271 94171 93801 93776 92310 90090 89004 88305
55479 88305 86236 84092 84234 85500 85059 83523 83695 85408 86169 85849 86235 86889 85865 83724 82657 82596 82221
55462 82221 82569 85364 88970 90393 90202 91130 92953 93258 92228 92119 92855 92612 91923 92774 94434 94567 93662
55445 93662 93940 94789 93837 91719 91150 91914 91502 90169 90605 92889 94357 94404 94978 96346 96668 95786 95447 95858
55427 95858 95811 95859 97446 99450 99630 98906 99982 102306 102874 101643 101631 103746 105862 106927 107755 107839 105768
55410 105768 102796 101770 102508 102327 100962 100620 101315 100713 98736 97780 98057 97149 94668 92942 92580 91646 89911
$$ packed form
55528A23701p30j791k528j576j618l212k969k76Q46j079k463j471q03j578j151
55513A01302Q68J096r69j506L86Q33j300k100j83O11j373k491r36mj276j464Q30
55496I2324J931K2j322J14J235p9r94M48J476J16j100l70k5j466k220j086o99
55479H8305k069k144J42J266m41j536J72J713P61l20L86O54j024k141j067o1l75
55462H2221L48K795L606J423j91R28J823L05j030j09P36k43o89Q51J660J33r05
55445I3662K78Q49r52k118n69P64m12j333M36K284J468M7N74J368L22q82l39M11
55427I5858m7M8J587K004J80p24J076K324N68j231j2K115K116J065Q28Q4k071
55410A05768k972j026P38j81j365l42O95o02j977r56K77r08k481j726l62r34j735
$$ plain form
55393 89911 89649 91414 92990 93372 93905 94858 94664 93276 92514 92522 91597 90017 90088 91802 92426 91171 90320 90852
55375 90852 90852 89332 87945 87725 87542 86863 86762 87249 86824 85471 84936 85382 85056 83821 83638 84820 85272 84232
55357 84232 83393 83592 83715 83615 84696 86823 87986 87833 88227 89571 90004 89038 88546 89220 89420 88480 87867 88069
55339 88069 87632 86233 85494 85781 85461 84324 84448 86596 88880 90100 91240 92585 92552 90708 88967 88519
55323 88519 88268 87341 86451 85838 84639 83102 82692 83307 83221 82391 82750 84596 85872 85805 86022 87253 88132 88210
55305 88210 88870 90299 90780 90003 89898 91119 91883 91401 91186 91884 92049 91224 90936 91413 90661 88218 86517 86994
55287 86994 88000 88123 88434 89788 90919 90990 91222 92306 92906 92313 91923 92517 92713 91632 90521 90244 89739
55270 89739 88370 87287 87079 86612 85477 85066 85984 86920 87173 87645 88370 87967 86596 86428 87942 88883 88188
$$ packed form
55393H9911k62J765J576L82N33R53j94j388p62Qr25j580P1J714O24j255q51N32
55375I0852%j520j387k20j83o79j01M87m25j353n35M46l26j235j83J182M52j040
55357H4232q39J99J23j00J081K127J163j53L94J344M33r66m92O74K00r40o13K02
55339H8069m37j399p39K87l20j137J24K148K284J220J140J345l3j844j741m48
55323H8519k51r27q90o13j199j537m10O15q6q30L59J846J276o7K17J231Q79P8
55305H8210O60J429M81p77j05J221P64m82k15O98J65q25k88M77p52k443j701M77
55287H6994J006J23L11J354J131P1K32J084O00n93l90N94J96j081j111k77n05
55270H9739j369j083k08m67j135m11R18R36K53M72P25m03j371j68J514R41o95
$$ plain form
55253 88188 87739 88756 89710 89476 89357 90109 90125 88560 87295 87712 88326 87710 86978 87258 87374 86270 85272 85715
55235 85715 86601 86656 86560 87206 87919 88142 88707 89814 90080 89152 88780 89722 90189 89074 88006 88304 88619 87627 86505
55216 86505 86588 87082 87216 88123 90356 91908 91082 89215 88384 88485 88650 89390 91207 93066 94223 95625 97712
55199 97712 99049 98868 98575 98944 98419 96217 94406 94550 94923 93561 91643 91131 91382 90950 90678 92018 94044
55182 94044 94923 94896 95241 95731 95571 95394 95964 96310 95401 94261 94325 95116 95566 96058 97146 97902 97620 97493 98563
55163 98563 99682 99575 99155 99680 100384 100050 99236 98784 97955 96241 95158 95907 97036 96736 95688 95279 94853
55146 94853 93314 91701 91516 92049 91978 92110 93835 96254 97545 97928 98705 99571 99451 98874 98942 99050 98117 97081
55128 97081 97696 99692 101439 102549 103648 104539 104696 104685 105160 105468 105068 105037 106254 107508 107459 106925 107114 107107 105515
$$ packed form
55253H8188m49J017R54k34j19P52J6j565j265M17O14o16p32K80J16j104r98M43
55235H5715Q86N5r6O46P13K23N65J107K66r28l72R42M67j115j068K98L15r92j122
55216H6505Q3M94J34R07K233J552q26j867q31J01J65P40J817J859J157J402K087
55199I7712J337j81k93L69n25k202j811J44L73j362j918n12K51m32k72J340K026
55182I4044Q79k7L45M90j60j77N70L46r09j140O4P91M50M92J088P56k82j27J070
55163I8563J119j07m20N25P04l34q14m52q29j714j083P49J129l00j048m09m26
55146I4853j539j613j85N33p1J32J725K419J291L83P77Q66j20n77O8J08r33j036
55128I7081O15J996J747J110J099Q91J57j1M75L08m00l1J217J254m9n34J89pj592
$$ plain form
55109 105515 103209 101945 101574 101031 100836 102117 104259 105799 106644 107346 107446 106729 106606 108020 109471 109484 109297
55092 109297 110510 111795 110981 108921 108143 108872 109533 110115 111718 113558 113694 112291 111170 110569 109237 107342
55076 107342 106453 106919 107835 109162 111390 113559 114259 114092 114648 115624 115625 115173 115958 117531 117719 116237 115001
55059 115001 114800 114411 113242 112298 112138 112129 112018 112249 112638 112605 112635 113559 114661 114516 113381 112689 112465 111504 109871
55040 109871 108925 108903 108686 108016 107856 108447 108892 108765 108439 107888 106844 105891 105803 106138 106071 106052 106943 108191 108756
55021 108756 109109 110283 111583 111461 110120 109073 108612 107886 107057 107138 107966 108474 108656 109274 109991 109829 109113 108943
55003 108943 109230 109199 109246 110234 111589 112215 112561 113575 114472 113987 113054 113542 114986 115348 114518 114212 114765 114933
54985 114933 114646 115065 115957 115941 115351 115961 117698 118538 117990 117903 119294 121033 122220 123340 124488 124884 124760
$$ packed form
55109A05515k306j264l71n43j95J281K142J540Q45P02J00p17j23J414J451J3j87
55092A09297J213J285q14k060p78P29O61N82J603J840J36j403j121o01j332j895
55076A07342q89M66R16J327K228K169P00j67N56R76Jm52P85J573J88j482j236
55059A15001k01l89j169r44j60rj11K31L89l3L0R24J102j45j135o92k24r61j633
55040A09871r46k2k17o70j60N91M45j27l26n51j044r53q8L35o7j9Q91J248N65
55021A08756L53J174J300j22j341j047m61p26q29Q1Q28N08J82O18P17j62p16j70
55003A08943K87l1M7R88J355O26L46J014Q97m85r33M88J444L62q30l06N53J68
54985A14933k87M19Q92j6n90O10J737Q40n48q7J391J739J187J120J148L96j24
$$ plain form
54968 124760 125480 127222 128660 129376 130394 131874 132505 131732 130559 129667 128658 127571 127175 127459 127691 128140
54952 128140 129761 132114 133680 134353 135451 137147 138176 138324 138964 140808 143294 146371 150686 155797 160470
54937 160470 165052 171298 179596 188608 197751 207567 217344 224959 229572 232016 232121 228294 220497 211098
54923 211098 201999 193166 184616 177317 171261 165079 158570 153381 150215 147627 144545 141825 140244 139108
54909 139108 137913 137358 137633 137661 137120 137323 138994 141005 142396 143882 146262 148984 151475 154451 158906 165003
54893 165003 172578 181404 190481 198646 206256 214610 223328 230154 233734 234672 233464 229553 223082 215417
54879 215417 207181 197829 187866 179272 172784 166916 160640 154991 150907 147596 144267 141551 139909 138436
54865 138436 136525 135079 134793 134790 134178 133472 133307 133170 132537 131945 131883 131848 131370 130729 129988 128688 127057 126056
$$ packed form
54968A24760P20J742J438P16J018J480O31p73j173q92j009j087l96K84K32M49
54952A28140J621K353J566O73J098J696J029J48O40J844K486L077M315N111M673
54937A60470M582O246Q298R012R143R816R777P615M613K444J05l827p797r399
54923B11098r099q833q550p299o056o182o509n189l166k588l082k720j581j136
54909A39108j195n55K75K8n41K03J671K011J391J486K380K722K491K976M455O097
54893A65003P575Q826R077Q165P610Q354Q718O826L580R38j208l911o471p665
54879B15417q236r352r963q594o488n868o276n649m084l311l329k716j642j473
54865A38436j911j446k86lo12p06j65j37o33n92o2l5m78o41p41j300j631j001
$$ plain form
54847 126056 125636 124520 122286 120022 118369 116738 115031 114216 114422 114420 113796 113745 114854 116083 116837 117972 119775
54830 119775 121020 121180 121541 122877 124026 124114 124156 124990 125467 124357 122408 120977 120113 119454 119499 120472 121375 121642
54812 121642 122390 124521 126919 127976 127770 127357 127084 126916 127280 128257 128979 128955 129022 129984 131453 132888 134512
54795 134512 136307 137545 138287 139891 142972 146306 148874 151522 155424 160331 165623 171732 179276 187978
54781 187978 197588 208596 220914 233182 244532 255752 267571 279092 289116 297762 305713 312998
54769 312998 319463 325114 329048 329555 326338 321331 316440 311899 307526 303592 299236 291932 280147 265185
54755 265185 249364 233983 220103 209204 201401 194730 187855 181875 177976 175191 172321 170281 170407
54742 170407 171922 173297 174945 178480 184221 191326 199445 208393 217023 224112 229629 233704 235330 233649
$$ packed form
54847A26056m20j116k234k264j653j631j707q15K06ko24n1J109J229P54J135J803
54830A19775J245J60L61J336J149Q8M2Q34M77j110j949j431q64o59M5R73R03K67
54812A21642P48K131K398J057k06m13k73j68L64R77P22k4O7R62J469J435J624
54795A34512J795J238P42J604L081L334K568K648L902M907N292O109P544Q702
54781A87978R610J1008J2318J2268J1350J1220J1819J1521J0024Q646P951P285
54769C12998O465N651L934N07l217n007m891m541m373l934m356p304j1785j4962
54755B65185j5821j5381j3880j0899p803o671o875n980l899k785k870k040J26
54742A70407J515J375J648L535N741P105Q119Q948Q630P089N517M075J626j681
$$ plain form
54728 233649 229533 224369 218263 210897 203044 195650 188412 180829 173638 167671 162362 156978 152261 149163
54714 149163 146971 144405 141676 139779 138582 137242 135716 134352 132843 131079 130107 130721 131919 132214 131602
54699 131602 130871 130070 129104 128741 129377 129890 129321 128624 129070 130035 130203 129886 130175 130660 130040 128362 126844 126049
54681 126049 125844 126444 127810 128699 128044 126637 125819 125314 124051 122372 121571 121834 122367 123029 124212 125632 126770
54664 126770 127878 129136 129604 128577 127150 126748 126993 126707 126112 126191 126706 126862 127188 128676 130592 131222 130393
54647 130393 129367 128614 127598 126420 125821 125718 125386 124815 124387 123680 122183 120665 120201 120382 120110 119540 119509
54630 119509 119767 119674 119945 121590 123661 124275 123608 123649 125142 126893 128077 129134 130182 130526 130093 129725 129744
54613 129744 129650 129294 128996 128533 127437 126230 125983 126754 127722 128605 129525 129886 128986 127529 126964 127490 128131 128471
$$ packed form
54728B33649m116n164o106p366p853p394p238p583p191n967n309n384m717l098
54714A49163k192k566k729j897j197j340j526j364j509j764r72O14J198K95o12
54699A31602p31q01r66l63O36N13n69o97M46R65J68l17K89M85o20j678j518p95
54681A26049k05O00J366Q89o55j407q18n05j263j679q01K63N33O62J183J420J138
54664A26770J108J258M68j027j427m02K45k86n95P9N15J56L26J488J916O30q29
54647A30393j026p53j016j178n99j03l32n71m28p07j497j518m64J81k72n70l1
54630A19509K58r3K71J645K071O14o67M1J493J751J184J057J048L44m33l68J9
54613A29744r4l56k98m63j096j207k47P71R68Q83R20L61r00j457n65N26O41L40
$$ plain form
54595 128471 128850 129158 129049 129030 129800 130782 130871 130306 130244 130826 131265 131464 131860 132104 131666 131364 132398 134096 134580
54576 134580 133496 132199 131407 130622 129876 130043 131130 132032 132275 132484 133007 133526 134080 134996 135889 136161 136369 137573
54558 137573 139525 141091 142238 143926 146258 148426 150323 152443 154367 155132 154997 155128 155693 155976 156074 156554
54542 156554 156696 155189 152442 150118 148440 146194 143388 141556 141109 140704 139735 139241 139711 140040 139436 138536
54526 138536 137899 137055 135798 134886 134840 135384 136415 138055 139555 139727 138754 137986 137799 137379 136687 136690 137349 137428 136764
54507 136764 136727 137866 139095 139855 141123 143408 145574 146558 146641 146271 145278 144048 143762 144571 145068 144419 143522
54490 143522 143238 143041 142374 141882 142249 143007 143498 143925 144699 145701 146827 148229 149570 150221 150567 151806 154042
54473 154042 155961 156854 157461 158299 158664 158012 156897 155805 154353 152362 150513 149313 148550 148187 148507 149037
$$ packed form
54595A28471L79L08j09j9P70R82Q9n65o2N82M39J99L96K44m38l02J034J698M84
54576A34580j084j297p92p85p46J67J087R02K43K09N23N19N54R16Q93K72K08J204
54558A37573J952J566J147J688K332K168J897K120J924P65j35J31N65K83R8M80
54542A56554J42j507k747k324j678k246k806j832m47m05r69m94M70L29o04r00
54526A38536o37q44j257r12m6N44J031J640J500J72r73p68j87m20o92LO59P9o64
54507A36764l7J139J229P60J268K285K166R84Q3l70r93j230k86Q09M97o49q97
54490A43522k84j97o67m92L67P58M91M27P74J002J126J402J341O51L46J239K236
54473A54042J919Q93O07Q38L65o52j115j092j452j991j849j200p63l63L20N30
$$ plain form
54457 149037 148757 147783 147341 147677 147682 147059 146953 147658 147611 145753 143239 141626 140866 140284 140161 141009 142321 143242
54439 143242 143629 143629 143174 142646 142941 144077 144810 144357 143424 142837 142445 142101 142417 143538 144386 144148 143563 143817 145095
54420 145095 147018 149451 152029 153852 154539 154798 155295 155837 156210 156727 157356 157382 156636 156030 156256 157004 157970 159429
54402 159429 161111 161797 160844 159086 157545 156355 155524 155480 156049 156083 154974 153556 152831 152831 153401 154869 157196
54385 157196 159524 161324 162958 164509 165299 165241 165475 166900 169149 171659 174597 178152 182057 186333 191200
54370 191200 195882 199041 200868 203009 205736 207140 206067 203937 202322 200596 197487 193367 189350 185483
54356 185483 181495 178115 175968 174155 171570 168749 166943 166163 165588 165100 165029 165085 164881 164834 165320 165716 165454
54339 165454 165229 165862 166718 166606 165684 165152 165560 166580 167969 169507 170380 169749 167826 165659 164132 163667 164234
$$ packed form
54457A49037k80r74m42L36No23j06P05m7j858k514j613p60n82j23Q48J312R21
54439A43242L87%m55n28K95J136P33m53r33n87l92l44L16J121Q48k38n85K54J278
54420A45095J923K433K578J823O87K59M97N42L73N17O29K6p46o06K26P48R66J459
54402A59429J682O86r53j758j541j190q31m4N69L4j109j418p25%N70J468K327
54385A57196K328J800J634J551P90n8K34J425K249K510K938L555L905M276M867
54370A91200M682L159J827K141K727J404j073k130j615j726l109m120m017l867
54356A85483l988l380k147j813k585k821j806p80n75m88p1N6k04m7M86L96k62
54339A65454k25O33Q56j12r22n32M08J020J389J538Q73o31j923k167j527m65N67
$$ plain form
54322 164234 165062 164992 163789 162442 161710 161200 160372 159404 158480 157332 156186 156017 157055 158196 158656 159045 159986
54305 159986 160982 161579 162268 163146 163039 161255 158983 157653 157078 156539 156500 157698 159482 160606 160955 161142 161172
54288 161172 160838 160689 161283 162152 162685 163221 164166 164924 164953 164982 165832 166836 166802 165849 165011 164777 165214 166704 169201
54269 169201 171529 172740 173475 174741 176173 176818 176807 176852 176840 176349 175825 175787 175597 174480 173103 172634 172837 172579
54251 172579 171714 171021 170756 170666 170938 171717 172175 171450 170111 169368 169326 169279 169278 170006 171472 173065 174510 175646 175849
54232 175849 174895 173839 173786 174348 174499 174245 174183 174138 173661 173186 173207 172964 171529 169582 168524 168313 167791 166698
54214 166698 165765 165107 164155 162950 162032 161281 160243 159308 159160 159393 159087 158448 158399 158863 158950 158625 158779 159820
54196 159820 161478 163721 166515 169006 170352 171082 172265 173707 174385 174310 174388 174682 174380 173363 172309 171326
$$ packed form
54322A64234Q28p0j203j347p32n10q28r68r24j148j146j69J038J141M60L89R41
54305A59986R96N97O89Q78j07j784k272j330n75n39l9J198J784J124L49J87L0
54288A61172l34j49N94Q69N33N36R45P58K9K9Q50J004l4r53q38k34M37J490K497
54269A69201K328J211P35J266J432O45j1M5j2m91n24l8j90j117j377m69K03k58
54251A72579q65o93k65r0K72P79M58p25j339p43m2m7jP28J466J593J445J136K03
54232A75849r54j056n3N62J51k54o2m5m77m75K1k43j435j947j058k11n22j093
54214A66698r33o58r52j205r18p51j038r35j48K33l06o39m9M64Q7l25J54J041
54196A59820J658K243K794K491J346P30J183J442O78p5P8K94l02j017j054r83
$$ plain form
54180 171326 169905 168160 166798 165968 165363 165219 165864 166564 166252 165241 164848 165458 166273 166786 167147 167304 167116
54163 167116 167149 168122 169812 171688 174118 177554 181182 184017 186792 190881 195648 198878 199765 199583 199295 198399
54147 198399 196433 193957 191693 189979 189159 189128 188598 186370 183332 181617 181794 182511 182891 183541 184988 186929
54131 186929 189346 192763 197012 201267 205588 210925 217206 222840 226459 227858 227053 223963 219305 214347
54117 214347 209440 204077 198527 193891 190327 186882 183401 180944 179838 178956 177597 176593 176770 177593 178071
54102 178071 178006 177710 177444 177510 177995 178186 177319 176022 175805 176967 178268 178838 179038 179182 178936 178428 178558 179601
54084 179601 180675 181127 181355 181843 182454 183054 183786 184468 184720 184813 185331 185907 185585 184460 183612 183371 183136 182960
54066 182960 183645 184993 185673 185274 184860 185001 185010 184722 185335 187558 190376 192540 194017 195255 196273 197294 199045
$$ packed form
54180A71326j421j745j362q30o05j44O45P00l12j011l93O10Q15N13L61J57j88
54163A67116L3R73J690J876K430L436L628K835K775M089M767L230Q87j82k88q96
54147A98399j966k476k264j714q20l1n30k228l038j715J77P17L80O50J447J941
54131A86929K417L417M249M255M321N337O281N634L619J399q05l090m658m958
54117B14347m907n363n550m636l564l445l481k457j106q82j359j004J77Q23M78
54102A78071o5k96k66O6M85J91q67j297k17J162J301N70K00J44k46n08J30J043
54084A79601J074M52K28M88O11O00P32O82K52R3N18N76l22j125q48k41k35j76
54066A82960O85J348O80l99m14J41Rk88O13K223K818K164J477J238J018J021J751
$$ plain form
54049 199045 201648 204285 206606 209313 212765 216247 219301 222600 226751 231373 236033 240984 246320 251477
54035 251477 256232 261156 266546 271964 277272 282901 288623 293387 296952 300324 303969 306984 308796 310259
54021 310259 312174 314003 314966 315234 315124 314281 312582 310707 308924 306402 302649 298511 294825 291145 286786
54006 286786 282140 277907 273965 269987 266305 263231 260303 257110 254119 251930 250523 249886 250465 252241 254351
53991 254351 256451 259585 264880 272240 281056 291103 301736 311031 316740 317623 313455 304778 293388 281938
53977 281938 272013 263252 254983 247620 241729 236911 232711 229604 227976 227063 226024 225207 225195 225452 225192 224903
53961 224903 225678 227468 229179 230175 230670 230956 231159 231526 232180 232882 233646 235086 237543 240338 242642 244606
53945 244606 247008 250201 253989 258082 262136 265924 269961 275376 282617 290847 299056 307097 315194 323218
$$ packed form
54049A99045K603K637K321K707L452L482L054L299M151M622M660M951N336N157
54035B51477M755M924N390N418N308N629N722M764L565L372L645L015J812J463
54021C10259J915J829R63K68j10q43j699j875j783k522l753m138l686l680m359
54006B86786m646m233l942l978l682l074k928l193k991k189j407o37N79J776K110
53991B54351K100L134N295P360Q816J0047J0633R295N709Q83m168q677j1390j1450
53977B81938r925q761q269p363n891m818m200l107j628r13j039q17j2K57k60k89
53961B24903P75J790J711R96M95K86K03L67O54P02P64J440K457K795K304J964
53945B44606K402L193L788M093M054L788M037N415P241Q230Q209Q041Q097Q024
$$ plain form
53931 323218 331066 339170 348170 358732 371818 387991 405894 422421 435116 443648 448655 450580 450516
53918 450516 450879 453921 460156 468973 479778 491524 502012 508955 511433 509666 504154 495894 486611 477710
53904 477710 469360 461255 453597 446658 440160 433898 428290 423593 419260 414792 410389 406003 400622 393453
53890 393453 385096 376719 368690 360764 352836 344708 335901 326583 317996 311197 306031 301919 298727 296147
53876 296147 293185 289211 284723 280283 275644 270683 266201 262770 259711 256206 252571 249542 247152 245170
53862 245170 243655 242212 239853 236573 233883 232671 231787 230017 228128 227412 227378 226698 225546 225149 225599 225870
53846 225870 225601 225245 224825 224064 223453 223737 224563 224903 224558 224101 223806 223748 224382 225724 226569 225951 224829 224837 225846
53827 225846 226406 226193 226262 226953 227312 226781 226066 225976 226616 227953 230128 232968 235969 238876 241633 244008 245990
$$ packed form
53931C23218P848Q104R000J0562J3086J6173J7903J6527J2695Q532N007J925o4
53918D50516L63L042O235Q817J0805J1746J0488O943K478j767n512q260r283q901
53904D77710q350q105p658o939o498o262n608m697m333m468m403m386n381p169
53890C93453q357q377q029p926p928q128q807r318q587o799n166m112l192k580
53876B96147k962l974m488m440m639m961m482l431l059l505l635l029k390j982
53862B45170j515j443k359l280k690j212q84j770j889p16l4o80j152l97M50K71
53846B25870k69l56m20p61o11K84Q26L40l45m57k95n8O34J342Q45o18j122QJ009
53827B25846N60k13O9O91L59n31p15r0O40J337K175K840L001K907K757K375J982
$$ plain form
53810 245990 248307 251726 256151 261066 266355 271863 276845 280912 285002 290319 296791 303536 310157 316443
53796 316443 321486 324487 325988 327032 327652 327479 327177 327773 329005 329857 330285 330868 331206 330408 328853 327673
53780 327673 326626 324281 320342 316023 311964 307484 302192 296717 291431 285951 280379 275661 272142 268950
53766 268950 265373 261875 259252 257565 256293 254900 253111 251166 249672 248610 246979 244284 241738 240702
53752 240702 240537 239567 237780 236747 236904 236867 235733 234373 233852 234084 234601 235395 236307 236673 236111 234912 233449
53735 233449 232184 232142 234053 236877 238623 238908 239290 240717 242272 243069 243782 245263 246932 247695 247606 247602 248184
53718 248184 249285 250898 253113 255838 258992 262525 265981 268593 270147 271229 272389 273700 275266 277346
53704 277346 279652 281360 282162 282578 282944 282969 282777 283507 286086 289994 293887 297093 299858 302405 304374 305315
$$ packed form
53810B45990K317L419M425M915N289N508M982M067M090N317O472O745O621O286
53796C16443N043L001J501J044O20j73l02N96J232Q52M28N83L38p98j555j180
53780C27673j047k345l939m319m059m480n292n475n286n480n572m718l519l192
53766B68950l577l498k623j687j272j393j789j945j494j062j631k695k546j036
53752B40702j65r70j787j033J57l7j134j360n21K32N17P94R12L66n62j199j463
53735B33449j265m2J911K824J746K85L82J427J555P97P13J481J669P63q9mN82
53718B48184J101J613K215K725L154L533L456K612J554J082J160J311J566K080
53704B77346K306J708Q02M16L66K5j92P30K579L908L893L206K765K547J969R41
$$ plain form
53688 305315 305426 305624 306716 308546 310265 311541 312947 314838 316548 317387 317799 318649 319836 320599 320853 321111
53672 321111 321344 321058 320416 320210 320701 321438 322184 323058 323873 324332 324744 325542 326226 325937 324958 324406 324470 324267 323531
53653 323531 323072 323333 323823 324353 325556 327665 329854 331309 332069 332442 332568 332912 334223 336511 338864 340581
53637 340581 341776 342689 343358 344197 345921 348579 351477 354262 357190 360126 362320 363450 363969 364207 364042 363654
53621 363654 363596 363870 363949 363890 364373 365472 366505 367338 368623 370447 372021 373072 374306 376064 377815 379453
53605 379453 381765 384962 388075 390563 393218 396628 399963 402380 404542 407548 411108 413945 415461 416073
53591 416073 416387 416918 418115 419795 420914 420649 419426 418303 417731 417432 417061 416428 415408 414129 412953 411949
53575 411949 410736 409100 407272 405408 403341 401062 398838 396684 394355 392055 390367 389269 388044 386467
$$ packed form
53688C05315J11J98J092J830J719J276J406J891J710Q39M12Q50J187P63K54K58
53672C21111K33k86o42k06M91P37P46Q74Q15M59M12P98O84k89r79n52O4k03p36
53653C23531m59K61M90N30J203K109K189J455P60L73J26L44J311K288K353J717
53637C40581J195R13O69Q39J724K658K898K785K928K936K194J130N19K38j65l88
53621C63654n8K74P9n9M83J099J033Q33J285J824J574J051J234J758J751J638
53605C79453K312L197L113K488K655L410L335K417K162L006L560K837J516O12
53591D16073L14N31J197J680J119k65j223j123n72k99l71o33j020j279j176j004
53575D11949j213j636j828j864k067k279k224k154k329k300j688j098j225j577
$$ plain form
53561 386467 385261 384987 385256 385490 385666 385917 386146 386410 386966 387612 387754 387427 387376 387818 388081 387866 387811 388265 388552
53542 388552 388220 388035 388888 390468 391906 393122 394647 396592 398649 400830 403588 407414 412645 419282 426690
53527 426690 433904 440540 447015 453797 461123 469482 479392 490355 500970 510588 520016 530106 540544
53514 540544 550624 560392 570299 580468 590992 602376 614982 628546 642771 657883 674120 691206
53502 691206 708808 726934 745480 764004 782426 801383 821368 841989 862432 882186 901026
53491 901026 918920 936230 953471 970648 987408 1003910 1020701 1037708 1054273 1070368 1086693
53480 1086693 1103398 1119853 1135991 1152587 1169697 1186125 1201119 1215492 1230220 1245017 1259017
53469 1259017 1271862 1283321 1292827 1300243 1306187 1310794 1313086 1312396 1309455 1305213 1299479 1291662 1282002 1271075
$$ packed form
53561C86467j206k74K69K34J76K51K29K64N56O46J42l27n1M42K63k15n5M54K87
53542C88552l32j85Q53J580J438J216J525J945K057K181K758L826N231O637P408
53527D26690P214O636O475O782P326Q359R910J0963J0615R618R428J0090J0438
53514E40544J0080R768R907J0169J0524J1384J2606J3564J4225J5112J6237J7086
53502F91206J7602J8126J8546J8524J8422J8957J9985K0621K0443J9754J8840
53491I01026J7894J7310J7241J7177J6760J6502J6791J7007J6565J6095J6325
53480A086693J6705J6455J6138J6596J7110J6428J4994J4373J4728J4797J4000
53469A259017J2845J1459R506P416N944M607K292o90k941m242n734p817r660j0927
$$ plain form
53455 1271075 1258862 1245334 1231335 1217906 1205234 1192959 1180840 1168426 1154836 1139757 1124062
53444 1124062 1108690 1093585 1078363 1063205 1048313 1033385 1018479 1004566 992331 981208 970537
53433 970537 960900 953405 948387 945678 945295 946791 948699 949684 949770 949648 949553 949692 950817 953267 956233 959102
53417 959102 962728 968227 975329 983212 992173 1003050 1015627 1029061 1043443 1059422 1076631 1093942
53405 1093942 1111205 1129466 1149549 1171558 1195590 1221811 1249797 1278845 1308936 1340605 1374088
53394 1374088 1409345 1446591 1485899 1526547 1567695 1609439 1652378 1696493 1741346 1786955 1833547
53383 1833547 1880728 1927750 1974206 2019669 2063245 2104498 2144253 2183342 2221066 2256134 2288666
53372 2288666 2319845 2349784 2377113 2400622 2420122 2435746 2447617 2456263 2462151 2464584 2462000 2453473
$$ packed form
53455A271075j2213j3528j3999j3429j2672j2275j2119j2414j3590j5079j5695
53444A124062j5372j5105j5222j5158j4892j4928j4906j3913j2235j1123j0671
53433I70537r637p495n018k709l83J496J908R85Q6j22r5J39J125K450K966K869
53417I59102L626N499P102P883Q961J0877J2577J3434J4382J5979J7209J7311
53405A093942J7263J8261K0083K2009K4032K6221K7986K9048L0091L1669L3483
53394A374088L5257L7246L9308M0648M1148M1744M2939M4115M4853M5609M6592
53383A833547M7181M7022M6456M5463M3576M1253L9755L9089L7724L5068L2532
53372B288666L1179K9939K7329K3509J9500J5624J1871Q646N888K433k584q527
$$ plain form
53360 2453473 2439140 2419217 2393591 2362457 2326588 2286936 2244668 2201362 2158250 2115330 2072002
53349 2072002 2028461 1985609 1943792 1902647 1862147 1822898 1785422 1749906 1716541 1685206 1654872
53338 1654872 1624204 1592783 1561026 1529100 1496904 1465037 1434724 1406583 1380277 1355509 1332613
53327 1332613 1311906 1293156 1275999 1260488 1246965 1235600 1226000 1217181 1208174 1198788 1189321 1179428
53315 1179428 1168100 1155093 1141489 1128223 1115040 1101712 1089249 1078809 1070169 1062531 1056151 1051891
53303 1051891 1049698 1048804 1049001 1050426 1052509 1054461 1056562 1059762 1064290 1069883 1076920 1085960 1096451 1107419
53289 1107419 1119298 1133591 1150658 1169230 1188159 1207343 1226831 1246290 1265583 1284749 1303296
53278 1303296 1320598 1336935 1352971 1368271 1381668 1393067 1403409 1412649 1419270 1422231 1422108 1419836
$$ packed form
53360B453473j4333j9923k5626l1134l5869l9652m2268m3306m3112m2920m3328
53349B072002m3541m2852m1817m1145m0500l9249l7476l5516l3365l1335l0334
53338A654872l0668l1421l1757l1926l2196l1867l0313k8141k6306k4768k2896
53327A332613k0707j8750j7157j5511j3523j1365r600q819r007r386r467r893
53315A179428j1328j3007j3604j3266j3183j3328j2463j0440q640p638o380m260
53303A051891k193q94J97J425K083J952K101L200M528N593P037R040J0491J0968
53289A107419J1879J4293J7067J8572J8929J9184J9488J9459J9293J9166J8547
53278A303296J7302J6337J6036J5300J3397J1399J0342R240O621K961j23k272
$$ plain form
53266 1419836 1415603 1409523 1402191 1393788 1383494 1370470 1354798 1337048 1317614 1296862 1275315 1253247
53254 1253247 1230638 1207646 1184567 1161253 1137274 1112700 1088041 1063466 1038910 1014985 992854
53243 992854 972997 954864 937792 921442 905275 888556 871118 853379 835506 817343 799260
53232 799260 782158 766365 751292 736361 721607 707269 693465 680465 668676 658284 649321 641868
53220 641868 635645 629762 623627 617657 612189 606199 598301 588719 578895 569264 558840 547042 534578
53207 534578 522237 510100 498243 487096 476736 466803 457374 448994 441619 434497 427263 420204 413328
53194 413328 406124 398381 390277 381638 372226 362800 354693 348085 341792 334943 327818 320955 314613 309289
53180 309289 305502 302763 299962 296992 294772 293456 292023 290000 288150 286864 285236 282485 279149 276155
$$ packed form
53266A419836m233o080p332q403j0294j3024j5672j7750j9434k0752k1547k2068
53254A253247k2609k2992k3079k3314k3979k4574k4659k4575k4556k3925k2131
53243I92854j9857j8133j7072j6350j6167j6719j7438j7739j7873j8163j8083
53232G99260j7102j5793j5073j4931j4754j4338j3804j3000j1789j0392q963p453
53220F41868o223n883o135n970n468n990p898r582r824r631j0424j1798j2464
53207E34578j2341j2137j1857j1147j0360r933r429q380p375p122p234p059o876
53194D13328p204p743q104q639r412r426q107o608o293o849p125o863o342n324
53180C09289l787k739k801k970k220j316j433k023j850j286j628k751l336k994
$$ plain form
53166 276155 273680 271608 270146 269246 268290 266963 265697 264777 263823 262650 261755 261426 261202 260691 260122 259663 258975
53149 258975 257887 256749 255737 254606 253435 252821 253041 253806 254977 256559 257889 257995 257093 256585 257241 258444
53133 258444 259559 260749 262019 262704 262581 262406 262748 263341 264175 266102 269642 274115 278567 282654 286131 288543
53117 288543 290010 291290 292523 292865 291958 290663 289769 288979 287790 286332 284755 282786 280494 278446 276618
53102 276618 274260 271396 269221 268444 268468 268776 269675 270903 271057 269543 267699 266835 266360 265138 263482 262346
53086 262346 261538 260266 258803 258142 258405 258788 258775 258542 258490 259043 260329 261502 261187 259233 257086 255776 254638
53069 254638 252816 250792 249315 248027 246449 245301 245439 246292 246730 246763 247012 247274 246990 246562 246783 247446 247869
53052 247869 248294 249423 250974 252067 252714 253594 254652 255205 255233 255358 255688 255822 255891 256478 257586 258613 259222
$$ packed form
53166B76155k475k072j462r00r56j327j266r20r54j173q95l29k24n11n69m59o88
53149B58975j088j138j012j131j171o14K20P65J171J582J330J06r02n08O56J203
53133B58444J115J190J270O85j23j75L42N93Q34J927L540M473M452M087L477K412
53117B88543J467J280J233L42r07j295q94p90j189j458j577j969k292k048j828
53102B76618k358k864k175p77K4L08Q99J228J54j514j844q64m75j222j656j136
53086B62346q08j272j463o61K63L83j3k33n2N53J286J173l15j954k147j310j138
53069B54638j822k024j477j288j578j148J38Q53M38L3K49K62k84m28K21O63M23
53052B47869M25J129J551J093O47Q80J058N53K8J25L30J34O9N87J108J027O09
$$ plain form
53035 259222 259380 258833 257480 256048 255429 255565 255824 256166 256957 257931 258390 258342 258486 259104 259719 259839 259375 258540
53017 258540 257839 257869 258574 259176 259329 259682 260610 261255 260823 260083 260385 261711 262965 263743 264508 265294 265556 265332
52999 265332 265442 266397 267930 269527 270712 271023 270504 270016 270287 271010 271584 272248 273547 275144 276238 276806 277376
52982 277376 277941 278242 278794 280386 282658 284356 284983 285173 285452 285716 285931 286348 286936 287521 288470 290355 292864
52965 292864 294910 295858 295910 295319 294101 292545 291182 290153 289222 288367 287722 287058 286032 284899 284271 284304 284657
52948 284657 285046 285154 284381 282516 280435 279354 279465 279993 280312 280258 279682 278539 277292 276483 276079 275786 275654
52931 275654 275738 275694 275469 275797 277102 278499 278896 278581 278574 278928 278899 278403 278060 278027 278003 278089 278468 278530 277579 276188 275549
52910 275549 275665 275499 274748 274087 273752 273261 272595 272295 272373 272406 272705 274040 276150 277940 279209 280736 282488
$$ packed form
53035B59222J58n47j353j432o19J36K59L42P91R74M59m8J44O18O15J20m64q35
53017B58540p01L0P05O02J53L53R28O45m32p40L02J326J254P78P65P86K62k24
52999B65332J10R55J533J597J185L11n19m88K71P23N74O64J299J597J094N68N70
52982B77376N65L01N52J592K272J698O27J90K79K64K15M17N88N85R49J885K509
52965B92864K046R48N2n91j218j556j363j029r31q55o45o64j026j133o28L3L53
52948B84657L89J08p73j865k081j081J11N28L19n4n76j143j247q09m04k93j32
52931B75654Q4m4k25L28J305J397L97l15pL54k9m96l43l3k4Q6L79O2r51j391o39
52910B75549J16j66p51o61l35m91o66l00P8L3K99J335K110J790J269J527J752
$$ plain form
52893 282488 283310 282754 281750 281011 280157 278923 277902 277455 277103 276610 276543 277163 277878 278366 279144 280371 281171 280903
52875 280903 280182 279894 280061 280376 281043 282324 283936 285580 287490 289924 292648 295332 297773 299343 299025 296564
52859 296564 292909 289014 284903 280384 275886 271921 268374 265035 262307 260653 259702 258514 256579 254203
52845 254203 252115 250927 250667 250706 250535 250522 251349 252740 253645 253788 254098 255167 256199 256135 255093 253972 253226
52828 253226 252785 252834 253901 256162 259170 262350 265557 269063 272953 276560 278756 279063 278129 276715 274641
52813 274641 271433 267585 264215 261625 259161 256487 253976 251761 249465 247102 245320 244407 243933 243642 243829
52798 243829 244502 245056 245182 245258 245496 245544 245378 245629 246483 247079 246720 245998 245961 246727 247615 248211 248655 249136 249698 250398
52778 250398 251224 251920 252076 251304 249389 246670 244200 243003 243084 243669 244342 245329 246692 248087 249445 251050
$$ packed form
52893B82488Q22n56j004p39q54j234j021m47l52m93o7O20P15M88P78J227Q00k68
52875B80903p21k88J67L15O67J281J612J644J910K434K724K684K441J570l18k461
52859B96564l655l895m111m519m498l965l547l339k728j654r51j188j935k376
52845B54203k088j188k60L9j71j3Q27J391R05J43L10J069J032o4j042j121p46
52828B53226m41M9J067K261L008L180L207L506L890L607K196L07r34j414k074
52813B74641l208l848l370k590k464k674k511k215k296k363j782r13m74k91J87
52798B43829O73N54J26P6K38M8j66K51Q54N96l59p22l7P66Q88N96M44M81N62P00
52778B50398Q26O96J56p72j915k719k470j197Q1N85O73R87J363J395J358J605
$$ plain form
52762 251050 252725 253759 253976 254145 254972 256358 257941 259652 261418 263009 264542 266433 268506 269842 269917
52747 269917 269284 268799 268777 269192 270016 270965 271611 272081 273009 274515 275956 277048 278301 279888 280914 280568 279337
52730 279337 278350 278000 277877 277620 277162 276381 275089 273230 270924 268589 267118 267308 268894 270664 271818 272629
52714 272629 273568 274531 275287 275975 276680 277159 277478 278246 279679 281033 281557 281510 281633 282068 282340 282054 281126 279703
52696 279703 278304 277633 277826 278166 277893 276932 275593 274089 272700 271903 271795 271752 271033 269477 267436 265452 264145
52679 264145 263842 264045 263788 262838 261959 261787 262086 262473 263100 264097 264961 265184 265122 265634 267094 269159 271299 273257
52661 273257 275182 277381 279727 281400 281738 281193 280795 280734 280390 279741 279690 280652 281848 282418 282406 282185 281826 281490
52643 281490 281539 281788 281501 280659 280337 281250 282832 284392 286153 288312 289997 290144 288787 286596 283845 280766
$$ packed form
52762B51050J675J034K17J69Q27J386J583J711J766J591J533J891K073J336P5
52747B69917o33m85k2M15Q24R49O46M70R28J506J441J092J253J587J026l46j231
52730B79337r87l50j23k57m58p81j292j859k306k335j471J90J586J770J154Q11
52714B72629R39R63P56O88P05M79L19P68J433J354N24m7J23M35K72k86r28j423
52696B79703j399o71J93L40k73r61j339j504j389p97j08m3p19j556k041j984j307
52679B64145l03K03k57r50q79j72K99L87O27R97Q64K23o2N12J460K065K140J958
52661B73257J925K199K346J673L38n45l98o1l44o49n1R62J196N70j2k21l59l36
52643B81490M9K49k87q42l22R13J582J560J761K159J685J47j357k191k751l079
$$ plain form
52627 280766 278275 277236 277338 277614 277722 277920 278182 278251 278311 278763 279516 280147 280613 281159 281757 282216 282561 282804 282622
52608 282622 281882 281209 281475 282828 284626 286108 286872 287083 287495 288782 290557 291621 291510 291103 291240 291553 291264
52591 291264 290430 289630 289008 288417 288027 288020 288081 287890 287700 287768 287698 287049 286162 285683 285673 285818 286095 286502 286591 286101 285634
52570 285634 285938 286802 287385 287344 286927 286292 285497 284892 284777 284820 284481 283850 283482 283558 283752 283741 283377 282573 281473 280517
52550 280517 279927 279442 278870 278507 278631 279010 279317 279575 279808 279821 279722 280066 281015 282004 282700 283592 285090 286758 288048
52531 288048 289059 289952 290399 290301 290267 290629 290828 290596 290823 292251 294141 295386 296165 297326 298878 300466 302688
52514 302688 306421 311110 315192 318059 320295 322091 322712 321655 319219 315894 312104 308540 305769 303508
52500 303508 301069 298393 295866 293429 290840 288559 287333 287059 287013 286989 287218 287424 287144 286839 287499 289146 290835
$$ packed form
52627B80766k491j039J02K76J08J98K62O9O0M52P53O31M66N46N98M59L45K43j82
52608B82622p40o73K66J353J798J482P64K11M12J287J775J064j11m07J37L13k89
52591B91264q34q00o22n91l90pO1j91j90O8p0o49q87m79j0J45K77M07Q9m90m67
52570B85634L04Q64N83m1m17o35p95o05j15M3l39o31l68P6J94j1l64q04j100r56
52550B80517n90m85n72l63J24L79L07K58K33J3r9L44R49R89O96Q92J498J668J290
52531B88048J011Q93M47r8l4L62J99k32K27J428J890J245P79J161J552J588K222
52514C02688L733M689M082K867K236J796O21j057k436l325l790l564k771k261
52500C03508k439k676k527k437k589k281j226k74m6k4K29K06k80l05O60J647J689
$$ plain form
52483 290835 292123 293370 294602 295358 295858 297096 299383 301835 303675 305141 306706 308313 309832 311563 313835
52468 313835 316631 319835 323242 326128 327456 326807 324725 322025 319189 316373 313437 310002 306074 302601
52454 302601 300775 300731 301471 301977 301870 301122 299864 298450 297090 295474 293322 291181 290035 290190 291091 292094
52438 292094 292811 293022 292931 293239 294229 295061 294811 293891 293566 294307 295495 296509 297100 296987 296169 295510 295890 296860
52420 296860 297252 297072 297649 299884 303480 308006 313464 319589 325751 331978 339072 347309 355798 363351 369146
52405 369146 372366 372245 368858 363164 356071 348225 340694 334719 330449 326900 323473 320631 318770 317497
52391 317497 316486 316092 316488 317008 316993 316663 316659 317243 318374 319958 321593 322571 322640 322438 322917 324650 327758 331990
52373 331990 336627 340778 343965 346188 347568 348279 348563 348252 346663 343741 340901 339746 340196 340937 341420 342166
$$ packed form
52483B90835J288J247J232P56N00J238K287K452J840J466J565J607J519J731K272
52468C13835K796L204L407K886J328o49k082k700k836k816k936l435l928l473
52454C02601j826m4P40N06j07p48j258j414j360j616k152k141j146J55R01J003
52438B92094P17K11r1L08R90Q32k50r20l25P41J188J014N91j13q18o59L80R70
52420B96860L92j80N77K235L596M526N458O125O162O227P094Q237Q489P553N795
52405C69146L220j21l387n694p093p846p531n975m270l549l427k842j861j273
52391C17497j011l94L96N20j5l30mN84J131J584J635R78O9k02M79J733L108M232
52373C31990M637M151L187K223J380P11K84l11j589k922k840j155M50P41M83P46
$$ plain form
52357 342166 343234 343927 344231 345095 346814 348441 349377 350363 352204 354509 356398 357634 358480 359239 360442 362684
52341 362684 365780 368829 371537 374615 378498 382613 386401 390122 394086 398071 402189 407389 414210 421755
52327 421755 428718 434873 440869 447129 453641 460291 466799 472809 478597 485146 492992 501590 510349 519654
52313 519654 530225 542020 554532 567767 582200 598020 614921 632491 650483 668994 688540
52302 688540 709428 730837 751142 769446 786217 802137 817085 830689 843156 854968 866304
52291 866304 877304 888342 899462 909994 919222 927083 933888 939872 945294 950419 955043 958657 961352
52278 961352 963789 965948 966772 965557 962878 959474 955115 949402 942971 936928 931582 926641 922317 919335
52264 919335 918022 918116 919421 922078 926336 932427 940471 950145 960781 972118 984512 997971 1011488
$$ packed form
52357C42166J068O93L04Q64J719J627R36R86J841K305J889J236Q46P59J203K242
52341C62684L096L049K708L078L883M115L788L721L964L985M118N200O821P545
52327D21755O963O155N996O260O512O650O508O010N788O549P846Q598Q759R305
52313E19654J0571J1795J2512J3235J4433J5820J6901J7570J7992J8511J9546
52302F88540K0888K1409K0305J8304J6771J5920J4948J3604J2467J1812J1336
52291H66304J1000J1038J1120J0532R228P861O805N984N422N125M624L614K695
52278I61352K437K159Q24j215k679l404m359n713o431o043n346m941m324k982
52264I19335j313R4J305K657M258O091Q044R674J0636J1337J2394J3459J3517
$$ plain form
52251 1011488 1023920 1035135 1045741 1056063 1066101 1076150 1086611 1097192 1106940 1115256 1122471 1129267
52239 1129267 1135720 1141172 1144985 1147301 1148835 1149959 1150395 1150039 1149431 1148760 1146938 1142698 1136430 1129802 1123592
52224 1123592 1117029 1109456 1101433 1093656 1085877 1077597 1069061 1060938 1053551 1046895 1040833 1034953 1028854 1022939
52210 1022939 1018281 1015458 1014252 1014611 1016890 1020755 1024915 1028451 1031492 1034156 1035935 1036755 1037487 1038509 1038742
52195 1038742 1037085 1033991 1030652 1027394 1023895 1020398 1017630 1015849 1014690 1013618 1012005 1009443 1006540 1004662
52181 1004662 1004179 1003803 1002338 1000185 998198 996097 993256 990260 988200 986869 985075 982553 980363 979383 979464
52166 979464 980055 980854 981832 983249 985398 987759 988859 987816 985664 984290 984354 985071 985675 986064 986241 986089 985677
52149 985677 985036 983747 981494 978800 976410 974195 971604 969014 967583 967640 968130 967948 967214 967030 968404 971516
$$ packed form
52251A011488J2432J1215J0606J0322J0038J0049J0461J0581R748Q316P215O796
52239A129267O453N452L813K316J534J124M36l56o08o71j822m240o268o628o210
52224A123592o563p573q023p777p779q280q536q123p387o656o062n880o099n915
52210A022939m658k823j206L59K279L865M160L536L041K664J779Q20P32J022K33
52195A038742j657l094l339l258l499l497k768j781j159j072j613k562k903j878
52181A004662m83l76j465k153j987k101k841k996k060j331j794k522k190r80Q1
52166I79464N91P99R78J417K149K361J100j043k152j374O4P17O04L89J77j52m12
52149I85677o41j289k253k694k390k215k591k590j431N7M90j82p34j84J374L112
$$ plain form
52133 971516 975598 979519 982786 985985 990003 995034 1000605 1006252 1011839 1017499 1023655 1030875 1039386 1049021
52119 1049021 1059716 1071576 1084317 1097373 1110757 1124984 1139740 1153645 1165930 1177405 1189025
52108 1189025 1200498 1211223 1221603 1232294 1242951 1253045 1263336 1275151 1288569 1302497 1316291
52097 1316291 1330122 1343986 1357518 1370675 1383489 1395215 1404730 1411845 1417368 1421886 1425231 1427024
52085 1427024 1427042 1425162 1421584 1416843 1411033 1403464 1393766 1382803 1371722 1360726 1349762 1339677 1331477
52072 1331477 1324855 1318767 1313161 1308928 1306365 1304944 1304389 1304713 1305288 1305192 1304587 1304666 1306138 1308720 1311975 1315680
52056 1315680 1319485 1323303 1327959 1334374 1342216 1350428 1358906 1368404 1378867 1389218 1398933 1408541 1418353
52043 1418353 1427789 1436185 1443237 1448527 1451628 1452731 1452181 1449421 1443530 1434761 1424324 1412693 1399506
$$ packed form
52133I71516M082L921L267L199M018N031N571N647N587N660O156P220Q511R635
52119A049021J0695J1860J2741J3056J3384J4227J4756J3905J2285J1475J1620
52108A189025J1473J0725J0380J0691J0657J0094J0291J1815J3418J3928J3794
52097A316291J3831J3864J3532J3157J2814J1726R515P115N523M518L345J793
52085A427024J8j880l578m741n810p569r698j0963j1081j0996j0964j0085q200
52072A331477o622o088n606m233k563j421n55L24N75r6o05P9J472K582L255L705
52056A315680L805L818M656O415P842Q212Q478R498J0463J0351R715R608R812
52043A418353R436Q396P052N290L101J103n50k760n891q769j0437j1631j3187
$$ plain form
52030 1399506 1385232 1371390 1358709 1346444 1333950 1321629 1309783 1297859 1285426 1272805 1260092
52019 1260092 1246664 1232332 1217915 1204024 1190218 1175994 1161744 1148049 1134913 1122346 1110836
52008 1110836 1100572 1090922 1081308 1071917 1062988 1054120 1044755 1034535 1022717 1008127 990466 970922
51996 970922 950773 930007 907972 884711 860825 836568 811904 787170 763060 740158 718910
51985 718910 699762 682883 668115 655461 645220 637365 631274 626431 622940 621009 620337 620300 620276 619605
51971 619605 617752 614757 611126 607119 602754 598597 595821 595188 596654 600216 606440 615797 628229 643772
51957 643772 662973 686299 713778 745458 781345 820169 858704 892772 918622 933362 935231 924393
51945 924393 903157 874956 843290 811485 782250 756653 734047 713583 695331 679588 665839
$$ packed form
52030A399506j4274j3842j2681j2265j2494j2321j1846j1924j2433j2621j2713
52019A260092j3428j4332j4417j3891j3806j4224j4250j3695j3136j2567j1510
52008A110836j0264r650r614r391q929q868r365j0220j1818j4590j7661j9544
51996I70922k0149k0766k2035k3261k3886k4257k4664k4734k4110k2902k1248
51985G18910j9148j6879j4768j2654j0241p855o091m843l491j931o72l7k4o71
51971F19605j853k995l631m007m365m157k776o33J466L562O224R357J2432J5543
51957F43772J9201K3326K7479L1680L5887L8824L8535L4068K5850J4740J869j0838
51945I24393k1236k8201l1666l1805k9235k5597k2606k0464j8252j5743j3749
$$ plain form
51934 665839 653076 640674 628381 615954 603383 591094 579412 568187 557364 547528 539469 533544
51922 533544 529713 527712 526891 526426 526034 526001 526212 525837 524295 521793 518427 513495 506354 497406 487661 477849
51906 477849 468392 459645 451528 443505 435554 428590 423318 419296 415825 413212 412256 412946 414563 416858 420270
51891 420270 425117 431335 438962 448167 458704 469776 480464 489966 497567 502858 505959 507296 507276 506414
51877 506414 505429 504828 504550 504345 504266 504477 504786 504758 504176 503199 502183 501477 501119 500581 499034 495918 490980 483853
51859 483853 474204 462468 449927 437856 426994 417789 410369 404055 397735 391179 385423 381477 379303
51846 379303 378424 378729 380113 381947 383620 385170 386840 388550 390351 392845 396409 400369 403580 405541 406518
51831 406518 406995 407555 408769 410525 411843 411984 411380 410849 410213 408507 405370 401578 398251 396003 394821 394296
$$ packed form
51934F65839j2763j2402j2293j2427j2571j2289j1682j1225j0823r836q059n925
51922E33544l831k001q21m65l92l3K11l75j542k502l366m932p141q948r745r812
51906D77849r457q747q117q023p951o964n272m022l471k613r56O90J617K295L412
51891D20270M847O218P627R205J0537J1072J0688R502P601N291L101J337k0q62
51877E06414r85o01k78k05p9K11L09k8n82r77j016p06l58n38j547l116m938p127
51859D83853r649j1736j2541j2071j0862r205p420o314o320o556n756l946k174
51846C79303q79L05J384J834J673J550J670J710J801K494L564L960L211J961R77
51831D06518M77N60J214J756J318J41o04n31o36j706l137l792l327k248j182n25
$$ plain form
51815 394296 393944 393591 393385 393457 393898 395152 397781 401534 405266 408210 410797 413782 417130 420301 423077 425424
51799 425424 427073 427920 428482 429262 430015 430277 430242 430417 430709 430619 430118 429663 429506 429639 430307 431944 434681 438404
51781 438404 443105 448642 454298 459068 462293 463663 462886 459923 455347 449981 444288 438480 432917 427905
51767 427905 423334 418961 414841 411096 407602 404342 401695 399858 398343 396628 394880 393461 392123 390450
51753 390450 388799 387929 387803 387579 386767 385724 384896 384215 383409 382459 381637 381372 382044 383588 385375 386756 387575
51736 387575 387884 387538 386514 385380 384937 385533 387074 389471 392643 396272 399963 403392 406044 407277 407172
51721 407172 406892 407614 409440 411872 414862 418583 422581 426059 428922 431696 434422 436347 436798 435740 433503
51706 433503 430578 427755 425918 425566 426764 429321 432554 435137 435870 434578 431911 428559 425197 422788 422031
$$ packed form
51815C94296l52l53k06P2M41J254K629L753L732K944K587K985L348L171K776K347
51799D25424J649Q47N62P80P53K62l5J75K92r0n01m55j57J33O68J637K737L723
51781D38404M701N537N656M770L225J370p77k963m576n366n693n808n563n012
51767D27905m571m373m120l745l494l260k647j837j515j715j748j419j338j673
51753C90450j651q70j26k24q12j043q28o81q06r50q22k65O72J544J787J381Q19
51736C87575L09l46j024j134m43N96J541K397L172L629L691L429K652J233j05
51721D07172k80P22J826K432K990L721L998L478K863K774K726J925M51j058k237
51706D33503k925k823j837l52J198K557L233K583P33j292k667l352l362k409p57
$$ plain form
51691 422031 422467 422823 422215 420472 417535 413429 408905 405235 403024 401720 400400 398514 395827 392381 388820
51676 388820 386206 385112 385164 385737 386853 389175 393286 399023 405392 411224 416148 420831 426099 432012 438071
51661 438071 443985 449799 455502 461073 466784 472889 479055 484617 489263 492932 494995 494113 489136 479872
51647 479872 467104 452313 437353 423809 412344 402721 394446 387250 381169 376505 373580 372274 371962
51634 371962 372166 372971 374480 376221 377575 378459 379031 378988 377780 375380 372247 368681 364833 361273 358796 357566
51618 357566 357032 356759 356814 357218 357589 357636 357712 358636 361063 365066 370196 375964 382360 389815 398708 409188 421480
51601 421480 435762 451394 466673 479616 488610 492296 489877 482345 472693 463941 457125 451758 447601
51588 447601 445128 444805 446987 452179 460313 469892 478927 486736 493990 501162 507913 513796 518397 520688
$$ packed form
51691D22031M36L56o08j743k937m106m524l670k211j304j320j886k687l446l561
51676C88820k614j094N2N73J116K322M111N737O369N832M924M683N268N913O059
51661D38071N914N814N703N571N711O105O166N562M646L669K063q82m977r264
51647D79872j2768j4791j4960j3544j1465r623q275p196o081m664k925j306l12
51634C71962K04Q05J509J741J354Q84N72m3j208k400l133l566l848l560k477j230
51618C57566n34k73N5M04L71M7P6R24K427M003N130N768O396P455Q893J0480J2292
51601D21480J4282J5632J5279J2943Q994L686k419p532r652q752o816n367m157
51588D47601k473l23K182N192Q134R579R035P809P254P172O751N883M601K291
$$ plain form
51574 520688 519532 515314 510235 506594 505466 507254 512628 522350 536690 555359 577545 601837 626672
51561 626672 651179 675325 699287 723191 747225 771033 792755 809442 818856 820392 814314 800969
51549 800969 781131 756332 728308 698513 668427 639632 613109 588890 566822 547203 530205
51538 530205 515155 500981 487322 474821 464364 456214 449759 443959 438098 432196 426733 422153 418756
51525 418756 416739 415947 415810 415892 416343 417367 418525 419147 419221 419270 419486 419586 419385 418779 417289 414488 410997 408279
51507 408279 407178 407258 407757 408534 409757 411175 412109 411944 410511 408248 405969 404199 402809 401523 400396 399279
51491 399279 397308 393841 389679 386380 384280 382129 378861 374861 371233 368580 366858 365833 365270 365064 365325
51476 365325 366043 366752 367082 367431 368411 369706 370331 369993 369379 369040 368975 369417 371043 374088 378103 382891 388832
$$ packed form
51574E20688j156m218n079l641j128J788N374R722J4340J8669K2186K4292K4835
51561F26672K4507K4146K3962K3904K4034K3808K1722J6687R414J536o078j3345
51549H00969j9838k4799k8024k9795l0086k8795k6523k4219k2068j9619j6998
51538E30205j5050j4174j3659j2501j0457q150o455n800n861n902n463m580l397
51525D18756k017p92j37Q2M51J024J158O22P4M9K16J00k01o06j490k801l491k718
51507D08279j101Q0M99P77J223J418R34j65j433k263k279j770j390j286j127j117
51491C99279j971l467m162l299k100k151l268m000l628k653j722j025n63k06K61
51476C65325P18P09L30L49R80J295O25l38o14l39o5M42J626L045M015M788N941
$$ plain form
51459 388832 395962 403652 411543 419905 428625 436745 443629 449840 456122 462034 466209 467568 465966 462283
51445 462283 458323 455992 455912 457089 458155 458384 457306 454259 449009 442235 434755 426758 418277 409876 402155
51430 402155 395038 388229 382037 377112 373573 371057 369444 368935 369397 370160 370607 370777 371297 372787 375304 378402
51414 378402 381763 385500 389554 393113 395292 396316 397361 399184 401532 403960 406535 409546 413133 417373
51400 417373 422112 426582 429911 432232 434617 437662 440787 443218 444998 446804 449419 453732 460570 470145
51386 470145 482148 496563 513801 533922 556522 581560 609282 638930 668395 695720 720209
51375 720209 741670 759475 772972 782002 786359 785456 779208 768550 754406 736745 715368 691010
51363 691010 665017 638511 612541 588318 566434 546268 526946 508450 491210 475178 460076
$$ packed form
51459C88832P130P690P891Q362Q720Q120O884O211O282N912M175J359j602l683
51445D62283l960k331q0J177J066K29j078l047n250o774p480p997q481q401p721
51430D02155p117o809o192m925l539k516j613n09M62P63M47J70N20J490K517L098
51414C78402L361L737M054L559K179J024J045J823K348K428K575L011L587M240
51400D17373M739M470L329K321K385L045L125K431J780J806K615M313O838R575
51386D70145J2003J4415J7238K0121K2600K5038K7722K9648K9465K7325K4489
51375G20209K1461J7805J3497R030M357r03o248j0658j4144j7661k1377k4358
51363F91010k5993k6506k5970k4223k1884k0166j9322j8496j7240j6032j5102
$$ plain form
51352 460076 446064 433334 421488 410194 400070 392079 386225 381611 377566 373997 370878 368174 366185
51339 366185 365237 364995 364609 363590 362184 361024 360711 361452 362755 363715 363944 363942 364321 365142 366411 368615 372134
51322 372134 376512 380897 384952 388838 392682 396546 400577 404600 407825 409387 408939 406486 402239 397065
51308 397065 392432 389201 386893 384703 382717 381496 381050 381029 381442 382302 382936 382610 381637 380971 380809 380396 379251
51291 379251 377895 377314 378164 380473 383719 387321 391318 396145 401389 405401 406911 406577 406068 405945 405381 403822
51275 403822 401911 400661 400497 401310 402878 404971 407409 410098 412792 414995 416398 417222 417811 418148 418132 417941
51259 417941 417680 417069 415946 414623 413189 410973 407469 403349 399694 396559 393219 389591 386410 384038 382113
51244 382113 380476 379480 379111 378683 377818 377084 377197 378046 378981 379834 381137 383297 385849 387760 388596 389126 390475
$$ packed form
51352D60076j4012j2730j1846j1294j0124p991n854m614m045l569l119k704j989
51339C66185r48k42l86j019j406j160l13P41J303R60K29kL79Q21J269K204L519
51322C72134M378M385M055L886L844L864M031M023L225J562m48k453m247n174
51308C97065m633l231k308k190j986j221m46k1M13Q60O34l26r73o66j62m13j145
51291C79251j356n81Q50K309L246L602L997M827N244M012J510l34n09j23n64j559
51275D03822j911j250j64Q13J568K093K438K689K694K203J403Q24N89L37j6j91
51259D17941k61o11j123j323j434k216l504m120l655l135l340l628l181k372j925
51244C82113j637r96l69m28q65p34J13Q49R35Q53J303K160K552J911Q36N30J349
$$ plain form
51227 390475 392794 395244 397238 399031 400955 402867 404753 407095 410041 412827 414679 415727 416425 416709 416542
51212 416542 416722 418162 420670 423246 425300 426828 427773 428152 428583 429775 431568 433212 434379 435093 434866 432901
51196 432901 429226 424905 421079 418315 416691 415783 414647 412581 409922 407578 405949 404881 404358 404437 404713
51181 404713 404636 404245 403864 403283 402088 400656 399894 400014 400415 400795 401524 402870 404599 406463 408372 410021 411008
51164 411008 411344 411279 410730 409588 408367 407724 407391 406456 404745 403052 401950 401204 400473 399751 398954 397798 396303
51147 396303 394805 393425 392178 391561 392206 393866 395536 396697 397652 398573 399118 399233 399480 400201 401070 401825 402904
51130 402904 404948 408094 411891 415552 418280 419863 420900 421928 422480 421786 420285 419477 420144 421602 422903
51115 422903 423890 424732 425286 425449 425520 425761 426037 426212 426482 427036 427801 428717 429845 431055 432000 432518 432771 432972
$$ packed form
51227C90475K319K450J994J793J924J912J886K342K946K786J852J048O98K84j67
51212D16542J80J440K508K576K054J528R45L79M31J192J793J644J167P14k27j965
51196D32901l675m321l826k764j624r08j136k066k659k344j629j068n23P9K76
51181D04713p7l91l81n81j195j432p62J20M01L80P29J346J729J864J909J649R87
51164D11008L36o5n49j142j221o43l33r35j711j693j102p46p31p22p97j156j495
51147C96303j498j380j247o17O45J660J670J161R55R21N45J15K47P21Q69P55J079
51130D02904K044L146L797L661K728J583J037J028N52o94j501q08O67J458J301
51115D22903R87Q42N54J63P1K41K76J75K70N54P65R16J128J210R45N18K53K01
$$ plain form
51097 432972 433316 434052 435209 436414 437499 438979 441339 444055 446096 447227 448096 449251 450866 453169 456209
51082 456209 459339 461903 464344 467709 472204 477306 483119 490373 499065 508480 518657 530456 543827
51069 543827 557406 570311 583007 595672 606917 614959 619274 620440 619248 616554 613051 608428 601476
51056 601476 591700 580254 568914 558903 551053 545967 543262 541550 539932 538766 538395 538087 537100 535882
51042 535882 535267 535227 535466 536639 539880 545439 552638 560823 569532 578063 585782 592755 599475 606132 612623
51027 612623 618942 624986 630309 634576 637949 640548 641981 641918 640711 638932 636716 634031 631122 628127 624727
51012 624727 620840 617126 614142 611434 608283 604995 602614 601519 601097 600750 600592 601168 603040 606657 612125
50997 612125 618967 626380 633725 640758 647731 655478 665036 676785 690230 704885 721012 739125 759027
$$ packed form
51097D32972L44P36J157J205J085J480K360K716K041J131Q69J155J615K303L040
51082D56209L130K564K441L365M495N102N813P254Q692R415J0177J1799J3371
51069E43827J3579J2905J2696J2665J1245Q042M315J166j192k694l503m623o952
51056F01476r776j1446j1340j0011p850n086k705j712j618j166l71l08r87j218
51042E35882o15m0K39J173L241N559P199Q185Q709Q531P719O973O720O657O491
51027F12623O319O044N323M267L373K599J433o3j207j779k216k685k909k995l400
51012F24727l887l714k984k708l151l288k381j095m22l47j58N76J872L617N468
50997F12125O842P413P345P033O973P747R558J1749J3445J4655J6127J8113J9902
$$ plain form
50984 759027 779653 799636 817892 834176 849511 865767 884551 906687 932747 963326 998496
50973 998496 1037670 1080519 1127480 1178864 1234024 1291902 1351906 1413719 1476720 1540159 1603378
50962 1603378 1665224 1723700 1776921 1824134 1865204 1899558 1926514 1946511 1961124 1971704 1978494
50951 1978494 1981250 1980370 1977238 1973619 1970793 1969222 1968834 1969124 1968629 1964877 1955904 1941921 1924764 1905644
50937 1905644 1884354 1860604 1834820 1807047 1776212 1741282 1702271 1659438 1612500 1561665 1508647
50926 1508647 1455585 1403464 1352531 1303611 1257766 1214979 1174328 1135389 1098606 1064395 1032776
50915 1032776 1003861 977915 954919 934620 916939 901791 888691 877060 866689 857456 848990 841214
50903 841214 834801 830300 827135 824243 821458 819455 818509 818153 818014 818271 819275 821306 824676 829469 835220
$$ packed form
50984G59027K0626J9983J8256J6284J5335J6256J8784K2136K6060L0579L5170
50973I98496L9174M2849M6961N1384N5160N7878O0004O1813O3001O3439O3219
50962A603378O1846N8476N3221M7213M1070L4354K6956J9997J4613J0580O790
50951A978494K756q80l132l619k826j571l88K90m95l752q973j3983j7157j9120
50937A905644k1290k3750k5784k7773l0835l4930l9011m2833m6938n0835n3018
50926A508647n3062n2121n0933m8920m5845m2787m0651l8939l6783l4211l1619
50915A032776k8915k5946k2996k0299j7681j5148j3100j1631j0371r233q466p776
50903H41214o413m501l165k892k785k003r46l56j39K57J004K031L370M793N751
$$ plain form
50888 835220 841332 847706 854560 861846 869354 877213 885805 895357 905987 917779 930369 942929 955224
50875 955224 968217 982950 999260 1016398 1034495 1054404 1076376 1099956 1125156 1152764 1183449
50864 1183449 1217464 1255469 1298805 1348675 1405617 1470018 1542631 1624297 1715476 1816139 1925850
50853 1925850 2043940 2169770 2302745 2441875 2585650 2732506 2880886 3028348 3171093
50844 3171093 3304908 3426234 3531904 3618748 3684537 3729180 3754228 3761512 3752967 3731257 3699545
50833 3699545 3660772 3617987 3574967 3535393 3501464 3474158 3454477 3443155 3439153 3439580 3441172 3440778
50821 3440778 3434496 3417972 3388298 3344824 3287754 3216985 3132782 3036569 2930202 2815088 2692715
50810 2692715 2565564 2436811 2309398 2185766 2068066 1958195 1857714 1767885 1689330 1621487
$$ packed form
50888H35220O112O374O854P286P508P859Q592R552J0630J1792J2590J2560J2295
50875I55224J2993J4733J6310J7138J8097J9909K1972K3580K5200K7608L0685
50864A183449L4015L8005M3336M9870N6942O4401P2613Q1666R1179J00663J09711
50853A925850J18090J25830J32975J39130J43775J46856J48380J47462J42745
50844C171093J33815J21326J05670Q6844O5789M4643K5048P284q545k1710l1712
50833C699545l8773m2785m3020l9574l3929k7306j9681j1322m002M27J592l94
50821C440778o282j6524k9674m3474n7070p0769q4203r6213j06367j15114j22373
50810B692715j27151j28753j27413j23632j17700j09871j00481q9829p8555o7843
$$ plain form
50800 1621487 1562877 1512300 1469488 1434366 1406165 1383665 1366055 1353128 1344601 1339484 1336197 1333416
50788 1333416 1330882 1329173 1328515 1328058 1326597 1323699 1319742 1315206 1310426 1305711 1300967 1295391 1288226 1279728
50774 1279728 1270714 1261237 1250512 1238083 1224300 1209566 1193982 1177959 1162385 1147912 1134695 1123150
50762 1123150 1114244 1108590 1105779 1105022 1106125 1109517 1115671 1124732 1136380 1149821 1164230 1179424 1195830
50749 1195830 1213751 1233050 1253675 1276113 1301168 1329652 1362450 1400488 1444382 1494221 1549816
50738 1549816 1610950 1677365 1748668 1824211 1902879 1983164 2063646 2143221 2220590 2293908 2361429
50727 2361429 2422173 2475305 2519050 2550838 2568612 2571659 2560511 2536735 2502737 2461195 2414752
50716 2414752 2366569 2320568 2280070 2246286 2218980 2198413 2185562 2180363 2180861 2184417 2188872 2192238
$$ packed form
50800A621487n8610n0577m2812l5122k8201k2500j7610j2927q527n117l287k781
50788A333416k534j709o58m57j461k898l957m536m780m715m744n576p165q498
50774A279728r014r477j0725j2429j3783j4734j5584j6023j5574j4473j3217j1545
50762A123150q906n654k811p57J103L392O154R061J1648J3441J4409J5194J6406
50749A195830J7921J9299K0625K2438K5055K8484L2798L8038M3894M9839N5595
50738A549816O1134O6415P1303P5543P8668Q0285Q0482P9575P7369P3318O7521
50727B361429O0744N3132M3745L1788J7774L047j1148k3776l3998m1542m6443
50716B414752m8183m6001m0498l3784k7306k0567j2851n199M98L556M455L366
$$ plain form
50704 2192238 2192149 2186246 2172640 2149782 2116576 2072962 2019875 1958529 1890372 1817861 1744328 1672528
50692 1672528 1603855 1539237 1480029 1427481 1381919 1343019 1310504 1284142 1263475 1248078 1237917
50681 1237917 1233145 1233773 1239662 1250542 1265873 1284972 1307315 1332294 1358729 1385171 1410785 1435441
50669 1435441 1458825 1480085 1498540 1514208 1527536 1539196 1550294 1561960 1574320 1586368 1597129
50658 1597129 1606466 1614566 1621392 1627056 1632166 1637289 1642550 1648200 1655263 1665094 1678501 1695559 1716103
50645 1716103 1740154 1768082 1800430 1837315 1877916 1920810 1964772 2008979 2052655 2095083 2135967
50634 2135967 2175280 2212887 2248875 2284046 2319279 2354222 2386938 2414275 2431772 2434047 2417472
50623 2417472 2383391 2337840 2287733 2238021 2192087 2152609 2120678 2095352 2075407 2060938 2052422
$$ packed form
50704B192238q9n903j3606k2858l3206m3614n3087o1346o8157p2511p3533p1800
50692A672528o8673o4618n9208n2548m5562l8900l2515k6362k0667j5397j0161
50681A237917m772O28N889J0880J5331J9099K2343K4979K6435K6442K5614K4656
50669A435441K3384K1260J8455J5668J3328J1660J1098J1666J2360J2048J0761
50658A597129R337Q100O826N664N110N123N261N650P063R831J3407J7058K0544
50645A716103K4051K7928L2348L6885M0601M2894M3962M4207M3676M2428M0884
50634B135967L9313L7607L5988L5171L5233L4943L2716K7337J7497K275j6575
50623B417472l4081m5551n0107m9712m5934l9478l1931k5326j9945j4469q516
$$ plain form
50612 2052422 2049211 2050095 2054639 2062615 2072500 2081637 2087674 2088863 2083222 2068520 2043257 2007084 1960400
50599 1960400 1904272 1840713 1772362 1701707 1630853 1561746 1496007 1434536 1377608 1325305 1277633
50588 1277633 1234522 1196028 1162276 1132987 1107501 1085601 1067801 1054424 1044878 1038365 1034835 1034618
50576 1034618 1037541 1043122 1051355 1062630 1076978 1093843 1112447 1131977 1151682 1171316 1191251 1211799
50564 1211799 1232794 1254254 1277002 1301904 1328778 1356678 1385017 1413702 1442358 1470202 1496695
50553 1496695 1521714 1545004 1566018 1584451 1600557 1614841 1627859 1640399 1653600 1668739 1686910
50542 1686910 1708747 1734268 1763154 1795338 1831187 1871047 1915070 1963767 2018315 2079861 2148740
50531 2148740 2224705 2307593 2397272 2493042 2593506 2696919 2801478 2905408 3006987 3104223
$$ packed form
50612B052422l211Q84M544P976R885R137O037J189n641j4702k5263l6173m6684
50599A960400n6128o3559o8351p0655p0854o9107o5739o1471n6928n2303m7672
50588A277633m3111l8494l3752k9289k5486k1900j7800j3377r546o513l530k17
50576A034618K923N581Q233J1275J4348J6865J8604J9530J9705J9634J9935K0548
50564A211799K0995K1460K2748K4902K6874K7900K8339K8685K8656K7844K6493
50553A496695K5019K3290K1014J8433J6106J4284J3018J2540J3201J5139J8171
50542A686910K1837K5521K8886L2184L5849L9860M4023M8697N4548O1546O8879
50531B148740P5965Q2888Q9679R5770J00464J03413J04559J03930J01579R7236
$$ plain form
50521 3104223 3194384 3274213 3340874 3392402 3427188 3443803 3441775 3421990 3385682 3333552 3266531
50510 3266531 3187019 3098620 3004951 2909404 2815683 2727501 2647485 2576942 2516796 2468169 2431912
50499 2431912 2408002 2395629 2393620 2400828 2416549 2440659 2472987 2512351 2556228 2601119 2642824 2676373
50487 2676373 2696231 2697222 2675874 2631459 2566067 2483510 2387900 2283162 2173472 2063331 1956657
50476 1956657 1855881 1762013 1675243 1595375 1522227 1456061 1397421 1346388 1302372 1264848 1233812
50465 1233812 1209207 1190364 1176409 1166778 1160942 1158151 1158013 1160875 1166936 1175245 1184208 1193010 1202069
50452 1202069 1212184 1223684 1236334 1249691 1263601 1278599 1295618 1315003 1335863 1356413 1374629
50441 1374629 1388580 1396903 1399556 1397808 1393195 1386778 1379511 1372474 1366118 1359970 1353763 1348364 1344848 1343153
$$ packed form
50521C104223R0161P9829O6661N1528L4786J6615k028j9785l6308n2130o7021
50510C266531p9512q8399r3669r5547r3721q8182q0016p0543o0146m8627l6257
50499B431912k3910j2373k009P208J5721K4110L2328L9364M3877M4891M1705L3549
50487B676373J9858R91k1348m4415o5392q2557r5610j04738j09690j10141j06674
50476A956657j00776r3868q6770p9868p3148o6166n8640n1033m4016l7524l1036
50465A233812k4605j8843j3955r631n836k791j38K862O061Q309Q963Q802R059
50452A202069J0115J1500J2650J3357J3910J4998J7019J9385K0860K0550J8216
50441A374629J3951Q323K653j748m613o417p267p037o356o148o207n399l516j695
$$ plain form
50427 1343153 1342509 1342889 1345153 1349986 1357575 1368281 1382793 1401461 1424114 1450718 1481762 1517860 1559228
50414 1559228 1605498 1655772 1708955 1764269 1821234 1879039 1936332 1991919 2045058 2094642 2138639
50403 2138639 2175012 2202760 2221404 2229859 2226602 2210688 2181963 2140636 2087519 2024567 1954498 1879933
50391 1879933 1803380 1727612 1655188 1587679 1525980 1471213 1424682 1387157 1358863 1339967 1330348
50380 1330348 1329159 1335456 1349110 1370294 1398167 1430779 1466112 1502366 1537412 1569026 1595761 1616812
50368 1616812 1631040 1636981 1633893 1621786 1600182 1567827 1524161 1470652 1410510 1347555 1285266 1225918
50356 1225918 1170090 1117367 1067765 1022175 981491 945998 915627 890089 868548 849929 833919
50345 833919 821121 811852 805275 800054 795530 791971 789961 789829 791481 794589 799015 804933 812392 820943
$$ packed form
50427A343153o44L80K264M833P589J0706J4512J8668K2653K6604L1044L6098M1368
50414A559228M6270N0274N3183N5314N6965N7805N7293N5587N3139M9584M3997
50403B138639L6373K7748J8644Q455l257j5914k8725m1327n3117o2952p0069p4565
50391A879933p6553p5768p2424o7509o1699n4767m6531l7525k8294j8896r619
50380A330348j189O297J3654K1184K7873L2612L5333L6254L5046L1614K6735K1051
50368A616812J4228N941l088j2107k1604l2355m3666n3509o0142o2955o2289n9348
50356A225918n5828n2723m9602m5590m0684l5493l0371k5538k1541j8619j6010
50345H33919j2798r269o577n221m524l559k010j32J652L108M426N918P459Q551
$$ plain form
50331 820943 829983 839253 848620 857742 866476 875389 885224 896002 907212 918675 930498 942298 953216
50318 953216 962725 970845 977698 983506 988941 994692 1000761 1006806 1012995 1019705 1026532 1032584 1037727 1042535
50304 1042535 1046960 1050083 1051280 1050509 1047238 1040423 1030183 1018462 1007235 996810 986514 976183 966015
50291 966015 955558 943923 930948 917547 905015 894393 886318 880954 878083 877529 879453 884175 891912
50278 891912 902755 916616 933180 952160 973580 997419 1023105 1049844 1077405 1105998 1135426
50267 1135426 1165012 1194285 1223028 1250625 1276250 1299844 1321998 1342560 1360159 1373481 1382141
50256 1382141 1385899 1383879 1375351 1360819 1341905 1320693 1299503 1280519 1264840 1252191 1241779 1232720
50244 1232720 1223110 1209679 1189530 1162220 1129706 1094697 1059641 1026676 997438 972669 952323
$$ packed form
50331H20943R040R270R367R122Q734Q913R835J0778J1210J1463J1823J1800J0918
50318I53216R509Q120O853N808N435N751O069O045O189O710O827O052N143M808
50304A042535M425L123J197p71l271o815j0240j1721j1227j0425j0296j0331j0168
50291I66015j0457j1635j2975j3401j2532j0622q075n364k871n54J924M722P737
50278H91912J0843J3861J6564J8980K1420K3839K5686K6739K7561K8593K9428
50267A135426K9586K9273K8743K7597K5625K3594K2154K0562J7599J3322Q660
50256A382141L758k020q528j4532j8914k1212k1190j8984j5679j2649j0412r059
50244A232720r610j3431k0149k7310l2514l5009l5056l2965k9238k4769k0346
$$ plain form
50233 952323 935977 922895 912194 903471 897031 893036 890805 889466 888898 889362 890472 891244 891076 890035
50219 890035 888250 885649 882345 878662 874575 869523 863029 855336 847282 839608 832350 824856 816448 807162
50205 807162 797712 788717 780254 772227 764731 757803 751193 744766 738881 733958 729816 725841 721818 718284
50191 718284 716026 715328 715688 716249 716650 717459 719511 722735 726001 728272 729614 730823 732386 734155 735863
50176 735863 737612 739802 742703 746001 748832 750591 751824 753996 758082 763604 769302 774614 780313 787861
50162 787861 798439 812575 830406 851974 877106 905144 935202 966895 1000486 1036003 1072483
50151 1072483 1108416 1142712 1174906 1204930 1233386 1261675 1290916 1320635 1349191 1375319 1398324
50140 1398324 1416748 1427996 1429790 1421391 1403211 1376114 1341581 1301750 1258623 1213614 1168136 1123890
$$ packed form
50233I52323j6346j3082j0701q723o440l995k231j339n68M64J110P72j68j041
50219H90035j785k601l304l683m087n052o494p693q054p674p258p494q408r286
50205H07162r450q995q463q027p496o928o610o427n885m923m142l975m023l534
50191G18284k258o98L60N61M01Q09K052L224L266K271J342J209J563J769J708
50176G35863J749K190K901L298K831J759J233K172M086N522N698N312N699P548
50162G87861J0578J4136J7831K1568K5132K8038L0058L1693L3591L5517L6480
50151A072483L5933L4296L2194L0024K8456K8289K9241K9719K8556K6128K3005
50140A398324J8424J1248J794q399j8180k7097l4533l9831m3127m5009m5478m4246
$$ plain form
50128 1123890 1082087 1043028 1006903 974374 945762 920231 896434 873520 851066 828712 806714
50117 806714 786402 769215 755438 744428 735735 729224 724323 720046 715879 712088 709070 706919 705664
50104 705664 705499 706514 708460 710869 713314 715528 717368 718698 719376 719533 719685 720183 720599 720131 718630 716609
50088 716609 714203 710916 706743 702789 700206 699062 698759 699117 700425 702875 706604 711960 719045 727188 735507
50073 735507 743944 753246 763933 775625 787368 798435 808928 819722 831543 843950 855544 865386
50061 865386 873756 881371 888429 894789 900482 905491 909470 912223 914170 915890 917575 919333 921606 924758
50047 924758 928666 933204 938727 945548 953399 962077 972234 984824 1000038 1017441 1036878 1058517 1082158
50034 1082158 1107237 1133429 1160563 1187990 1214681 1240001 1263916 1286501 1307721 1327643 1346373
$$ packed form
50128A123890m1803l9059l6125l2529k8612k5531k3797k2914k2454k2354k1998
50117H06714k0312j7187j3777j1010q693o511m901m277m167l791l018k151j255
50104G05664j65J015J946K409K445K214J840J330O78J57J52M98M16m68j501k021
50088G16609k406l287m173l954k583j144l03L58J308K450L729N356P085Q143Q319
50073G35507Q437R302J0687J1692J1743J1067J0493J0794J1821J2407J1594R842
50061H65386Q370P615P058O360N693N009L979K753J947J720J685J758K273L152
50047I24758L908M538N523O821P851Q678J0157J2590J5214J7403J9437K1639K3641
50034A082158K5079K6192K7134K7427K6691K5320K3915K2585K1220J9922J8730
$$ plain form
50023 1346373 1363655 1378843 1391097 1399289 1401974 1397986 1387058 1369579 1345993 1316857 1283172 1246178
50011 1246178 1207050 1167192 1128406 1092065 1058327 1026789 997690 971681 948592 927302 906971
50000 906971 887718 869908 853416 837874 823122 809168 796000 783644 772142 761371 751095
49989 751095 741246 731954 723324 715413 708325 702145 696869 692586 689460 687308 685501 683668 682179 681566
49975 681566 681712 682101 682578 683296 684175 685091 686472 689038 692911 697480 702233 707177 712353 717359 721471 724023
49959 724023 724728 723929 722395 720485 717630 713087 707072 700653 694543 688504 682009 675126 668581 663200 659313
49944 659313 656530 654039 651168 647492 642547 636073 628827 622489 618203 615554 613521 611913 611166 611187 611386
49929 611386 611779 613144 615955 619808 624038 628333 632679 637206 642223 647978 654320 660906 667621 674387
$$ packed form
50023A346373J7282J5188J2254Q192K685l988j0928j7479k3586k9136l3685l6994
50011A246178l9128l9858l8786l6341l3738l1538k9099k6009k3089k1290k0331
50000I06971j9253j7810j6492j5542j4752j3954j3168j2356j1502j0771j0276
49989G51095r849r292q630p911p088o180n276m283l126k152j807j833j489o13
49975F81566J46L89M77P18Q79R16J381K566L873M569M753M944N176N006M112K552
49959G24023P05p99j534j910k855m543o015o419o110o039o495o883o545n381l887
49944F59313k783k491k871l676m945o474p246o338m286k649k033j608p47K1J99
49929F11386L93J365K811L853M230M295M346M527N017N755O342O586O715O766
$$ plain form
49915 674387 680687 685826 689613 692395 694530 696237 697708 698808 698874 697478 695226 693056 690801 687193 681357
49900 681357 673630 664847 655587 646372 637981 631089 625869 622062 619203 616801 614645 612916 611664 610406
49886 610406 608670 606734 605212 604077 602831 601517 600796 601008 601940 603664 606695 611074 616003 620825 625743
49871 625743 631210 637172 643304 649485 655599 661191 665765 669152 671298 672037 671443 670205 669210 668703 668040
49856 668040 666270 662935 658405 653468 648663 644130 640112 637159 635551 634810 634193 633419 632561 631552 630413
49841 630413 629793 630625 633149 636727 640544 644089 647082 649529 651904 654834 658497 662585 666675 670317 673060
49826 673060 674944 676734 679086 681648 683556 684579 685079 685074 684171 682282 679569 675712 670234 663675 657556
49811 657556 652901 649507 646824 644684 642878 640855 638430 636228 634901 634240 633410 631788 629429 627028 625474
$$ packed form
49915F74387O300N139L787K782K135J707J471J100O6j396k252k170k255l608n836
49900F81357p727q783r260r215q391o892n220l807k859k402k156j729j252j258
49886F10406j736j936j522j135j246j314p21K12R32J724L031M379M929M822M918
49871F25743N467N962O132O181O114N592M574L387K146P39n94j238r95n07o63
49856F68040j770l335m530m937m805m533m018k953j608p41o17p74q58j009j139
49841F30413o20Q32K524L578L817L545K993K447K375K930L663M088M090L642K743
49826F73060J884J790K352K562J908J023N00nr03j889k713l857n478o559o119
49811F57556m655l394k683k140j806k023k425k202j327o61q30j622k359k401j554
$$ plain form
49796 625474 625022 624977 624689 624753 626496 630290 635216 640479 646224 652597 658911 664356 668895 672915 676456 679336
49780 679336 681640 683616 685338 686809 688121 689166 689450 688420 685771 681342 675096 667443 659276 651524
$$ packed form
49796F25474m52m5k88O4J743L794M926N263N745O373O314N445M539M020L541K880
49780F79336K304J976J722J471J312J045K84j030k649m429o246p653q167p752
$$ [...]
##END NTUPLES=NMR SPECTRUM
##END=
