##TITLE=AC1651_NBUAH14352_8531779_ft6pKpcJBK
##JCAMPDX= 6.0         $$ Bruker NMR JCAMP-DX V2.0
##DATA TYPE= NMR SPECTRUM
##DATA CLASS= NTUPLES
##ORIGIN= BRUKER
##OWNER= Administrator
$$ 1.72 TOPSPIN		Version 2.1
$$ 2014-03-14 16:55:43.357 -0800  Administrator@X
$$ Compression mode = diff/dup
##.OBSERVE FREQUENCY= 400.02188249412
##.OBSERVE NUCLEUS= ^1H
##.ACQUISITION MODE= SIMULTANEOUS (DQD)
##.ACQUISITION SCHEME= undefined
##.AVERAGES= 8
##.DIGITISER RES= 22
##SPECTROMETER/DATA SYSTEM= spect
##.PULSE SEQUENCE= zg30
##.SOLVENT NAME= COFFEE_meoh
##.SHIFT REFERENCE= INTERNAL, COFFEE_meoh, 1, 14.98509
##AUDIT TRAIL= $$ (NUMBER, WHEN, WHO, WHERE, PROCESS, VERSION, WHAT)
$$ ##TITLE= Audit trail, TOPSPIN		Version 2.1
$$ ##JCAMPDX= 5.01
$$ ##ORIGIN= Bruker BioSpin GmbH
$$ ##OWNER= Administrator
$$ $$ E:\/data/COFFEE/nmr/AC1651_NBUAH14352_8531779_ft6pKpcJBK/10/pdata/1/auditp.txt
$$ ##AUDIT TRAIL=  $$ (NUMBER, WHEN, WHO, WHERE, PROCESS, VERSION, WHAT)
(   1,<2014-03-14 16:55:36.638 -0800>,<Administrator>,<X>,<go>,<TOPSPIN 2.1>,
      <created by zg
	started at 2014-03-14 16:54:30.467 -0800,
	POWCHK enabled, PULCHK disabled,
       configuration hash MD5:
       C8 4E 4E 5D D3 5C D8 9E 9F 52 82 E0 59 8A DE 15
       data hash MD5: 64K
       9D 54 8E 3A 7D F3 F5 E7 F9 6F E6 5F 05 FB 08 7F>)
(   2,<2014-03-14 16:55:39.592 -0800>,<Administrator>,<X>,<proc1d>,<TOPSPIN 2.1>,
      <Start of raw data processing
       efp LB = 0 FT_mod = 6 PKNL = 1 PHC0 = 0 PHC1 = 0 SI = 32K 
       data hash MD5: 32K
       12 D5 3C A4 8F 08 0F 83 0C 2C 13 D7 55 23 42 A9>)
(   3,<2014-03-14 16:55:39.904 -0800>,<Administrator>,<X>,<proc1d>,<TOPSPIN 2.1>,
      <pk PHC0 = 94.73511 PHC1 = 0 
       data hash MD5: 32K
       C7 8F 68 F8 F3 FD 8A DA 81 35 7E 49 B4 D8 AA 06>)
(   4,<2014-03-14 16:55:39.998 -0800>,<Administrator>,<X>,<proc1d>,<TOPSPIN 2.1>,
      <abs ABSG = 1 
       data hash MD5: 32K
       D3 A7 FA F0 38 97 57 D5 08 E0 D4 DD E8 E0 4C 1C>)
(   5,<2014-03-14 16:55:40.060 -0800>,<Administrator>,<X>,<proc1d>,<TOPSPIN 2.1>,
      <abs ABSG = 2 
       data hash MD5: 32K
       68 4A DC 9A D2 84 7B 15 BA A9 72 E1 2D 0E C0 D5>)
(   6,<2014-03-14 16:55:40.123 -0800>,<Administrator>,<X>,<proc1d>,<TOPSPIN 2.1>,
      <abs ABSG = 3 
       data hash MD5: 32K
       29 3A CD 73 7D E0 FF 8C 7B 18 DB 46 12 B6 90 55>)
(   7,<2014-03-14 16:55:40.232 -0800>,<Administrator>,<X>,<proc1d>,<TOPSPIN 2.1>,
      <abs ABSG = 4 
       data hash MD5: 32K
       EB 13 C5 6C 78 94 75 8D CE B8 11 F8 6B 48 C6 52>)
(   8,<2014-03-14 16:55:40.295 -0800>,<Administrator>,<X>,<proc1d>,<TOPSPIN 2.1>,
      <abs ABSG = 5 
       data hash MD5: 32K
       EA 26 C9 DD 94 A1 63 0C 59 80 43 79 31 D7 EA EC>)
$$ ##END=
$$ 
$$ $$ hash MD5
$$ $$ 22 9A 2A 1A 22 9E 6B 1C CA 5E 7F C5 25 62 51 D6
##$RELAX= 
##$RELAX= 
##$RELAX= 
##$RELAX= 
##$RELAX= 
##$RELAX= 
##$RELAX= 
$$ Bruker specific parameters
$$ --------------------------
##$DU= <E:\>
##$EXPNO= 10
##$NAME= <AC1651_NBUAH14352_8531779_ft6pKpcJBK>
$$ [...]
150 150 150 150 150 150 150 150
##$TP07= 0
##$TPNAME0= <>
##$TPNAME1= <>
##$TPNAME2= <>
##$TPNAME3= <>
##$TPNAME4= <>
##$TPNAME5= <>
##$TPNAME6= <>
##$TPNAME7= <>
##$TPOAL= (0..7)
0.5 0.5 0.5 0.5 0.5 0.5 0.5 0.5
##$TPOFFS= (0..7)
0 0 0 0 0 0 0 0
##$TUNHIN= 0
##$TUNHOUT= 0
##$TUNXOUT= 0
##$USERA1= <user>
##$USERA2= <user>
##$USERA3= <user>
##$USERA4= <user>
##$USERA5= <user>
##$V9= 5
##$VALIST= <valist>
##$VCLIST= <CCCCCCCCCCCCCCC>
##$VD= 0
##$VDLIST= <DDDDDDDDDDDDDDD>
##$VPLIST= <PPPPPPPPPPPPPPP>
##$VTLIST= <TTTTTTTTTTTTTTT>
##$WBST= 1024
##$WBSW= 4
##$XGAIN= (0..3)
0 0 0 0
##$XL= 0
##$YL= 0
##$YMAX_a= 609057
##$YMIN_a= -516915
##$ZGOPTNS= <>
##$ZL1= 120
##$ZL2= 120
##$ZL3= 120
##$ZL4= 120
##$ABSF1= 14.98509
##$ABSF2= -5.573092
##$ABSG= 5
##$ABSL= 3
##$ALPHA= 0
##$AQORDER= 0
##$ASSFAC= 0
##$ASSFACI= 0
##$ASSFACX= 0
##$ASSWID= 0
##$AUNMP= <proc_prof1d_extract_pilot.lims>
##$AXLEFT= 0
##$AXNAME= <>
##$AXNUC= <1H>
##$AXRIGHT= 0
##$AXTYPE= 0
##$AXUNIT= <>
##$AZFE= 0.1
##$AZFW= 0.1
##$BCFW= 0
##$BC_mod= 0
##$BYTORDP= 0
##$COROFFS= 0
##$CY= 15
##$DATMOD= 1
##$DC= 0
##$DFILT= <>
##$DTYPP= 0
##$F1P= 0
##$F2P= 0
##$FCOR= 0.5
##$FTSIZE= 32768
##$FT_mod= 6
##$GAMMA= 0
##$GB= 0
##$INTBC= 1
##$INTSCL= 1
##$ISEN= 128
##$LB= 0
##$LEV0= 0
##$LPBIN= 0
##$MAXI= 10000
##$MC2= 0
##$MEAN= 0
##$ME_mod= 0
##$MI= 0
##$NCOEF= 0
##$NC_proc= -8
##$NLEV= 6
##$NOISF1= 0
##$NOISF2= 0
##$NSP= 0
##$NTH_PI= 0
##$NZP= 0
##$OFFSET= 14.98509
##$PC= 1
##$PHC0= 94.73511
##$PHC1= 0
##$PH_mod= 1
##$PKNL= yes
##$PPARMOD= 0
##$PPDIAG= 0
##$PPIPTYP= 0
##$PPMPNUM= 2147483647
##$PPRESOL= 1
##$PSCAL= 4
##$PSIGN= 0
##$PYNMP= <proc.py>
##$REVERSE= no
##$SF= 400.02
##$SI= 32768
##$SIGF1= 0
##$SIGF2= 0
##$SINO= 400
##$SIOLD= 32768
##$SPECTYP= <>
##$SREGLST= <1H.CDCl3>
##$SSB= 0
##$STSI= 32768
##$STSR= 0
##$SW_p= 8223.68421052631
##$SYMM= 0
##$S_DEV= 0
##$TDeff= 65536
##$TDoff= 0
##$TI= <>
##$TILT= no
##$TM1= 0
##$TM2= 0
##$TOPLEV= 0
##$USERP1= <user>
##$USERP2= <user>
##$USERP3= <user>
##$USERP4= <user>
##$USERP5= <user>
##$WDW= 1
##$XDIM= 32768
##$YMAX_p= 448113524
##$YMIN_p= -767092
##$CURPLOT= <Network HP LaserJet P1505>
##$CURPRIN= <$Network HP LaserJet P1505>
##$DFORMAT= <normdp>
##$LAYOUT= <+/1D_H.xwp>
##$LFORMAT= <normlp>
##$PFORMAT= <normpl>
##$SURQMSG= 1
$$ End of Bruker specific parameters
$$ ---------------------------------
##NTUPLES= NMR SPECTRUM
##VAR_NAME=  FREQUENCY,     SPECTRUM/REAL,   SPECTRUM/IMAG
##SYMBOL=    X,             R,               I
##VAR_TYPE=  INDEPENDENT,   DEPENDENT,       DEPENDENT
##VAR_FORM=  AFFN,          ASDF,            ASDF
##VAR_DIM=   32768,         32768,           32768
##UNITS=     HZ,            ARBITRARY UNITS, ARBITRARY UNITS
##FACTOR=    0.250966925370066, 1,           1
##FIRST=     8223.43324360094, -324025,      -156327
##LAST=      0,             127349,          -197578
##MIN=       0,             -767092,         0
##MAX=       8223.43324360094, 448113524,    0
$$ Real data points
##PAGE= N=1
##DATA TABLE= (X++(R..R)), XYDATA
$$ [...]
23836 -202751 -47792 11356 136220 -60417 -170611 -37374 74559 174173 -386876 190885 107887
23825 107887 46965 -183701 -35986 -309614 -97145 68641 -278129 -173098 27956 -104430
23814 -227183 82756 -229703 193903 70926 93667 -84467 80208 196437 248313 4236 -190705
23802 78408 -175372 21358 -16930 376104 80493 -14958 -81421 -156232 146960 -43108 -297961
23791 -297961 148472 38535 -149573 -64146 -214714 -99775 -10457 -115093 -31703 104938
23780 268077 184288 -5151 78956 -55814 -195034 105136 -74009 113181 -196008 -91225 76520
23768 50377 122454 1978 -33271 124097 64137 63283 -90290 119469 -49831 -216331 34235 39250
23756 39250 62329 97251 68202 418614 -222422 -122068 -107407 -174764 -20827 -331719 -108202
23744 -160619 -80145 39422 -94448 225060 -27828 -166711 -93005 101329 24281 -44723 -11447
23732 -102170 17532 170871 193025 -202205 144358 333177 132816 168844 -47741 664 -177204
23720 14301 -114755 119011 -76487 -198622 -137171 -111707 34514 107322 -317615 -158606 117556
23708 -246195 5721 225336 -93929 -268934 -220523 -56553 170456 48031 -251878 -158874 83469
23696 -266729 -521 18899 -93744 -35461 56287 170345 267350 -165108 -168732 -347181 -112540
23684 -96873 32522 100964 33983 62846 129808 258655 140580 43668 -31892 -23588 -101880
23673 -101880 -61146 -174257 72288 219681 24175 274109 134203 454708 -223178 15398
23662 -39035 -141217 226017 58082 -77051 9025 27731 -74354 129273 78429 183660 -308041
23650 247982 -75564 -42662 248404 -12329 -96895 -143963 -11673 -66592 101663 27861 -26028
23638 -33037 159711 172680 -275870 -161606 82608 -110158 77832 -111700 -299067 199111
23627 -28975 -40518 -154873 -95873 -144241 44330 33813 -203629 -73043 160039 25151 33350
23616 33350 -213533 113267 185610 -151818 279424 -14544 -361901 238821 -104599 -88714
23606 -88714 -154375 -296184 22476 -274182 -254273 22794 205061 -23890 -165622 -137955 -66875
23594 -1978 150867 171915 -95195 -45155 -176886 -106163 146009 75438 39777 -39158 128413
23582 202801 102205 -80015 205769 -302220 -74523 29683 -77966 -71554 -338889 217771 -191502
23570 280337 79608 247404 -99549 -93843 -206333 -68738 -360491 15235 -104182 260233 -97545
23558 -191230 248065 -58248 -153731 8880 8674 203565 239247 -473691 61150 82352 12831
23546 -52462 -20850 -253265 202977 -159287 -109389 -146275 -253560 26081 -123500 -240199
23536 -240199 176307 -88739 58425 107594 210171 -173509 -234258 247262 -64451 -169995
23526 -169995 -88289 -57807 -56465 -125895 -87054 -123905 -32832 127928 -340388 129746 -89178
23514 122703 -246222 -58239 -207388 -109228 -61388 -118302 -204297 198847 -59685 -52986 -248602
23503 -248602 -159495 -149662 2240 22191 -206290 260700 -281252 -62844 -132761 90284 154067
23492 154067 -126893 -182023 -249445 -4569 52740 -231442 9139 -185037 -500523 300682 -154587
23480 142974 45116 -19664 -34471 -368264 107915 -291210 14830 -140394 216558 29352
23469 12834 393835 133213 -625019 187974 -339249 -13954 -43496 75120 9450 160500 107863
23458 107863 144781 34581 -53588 -165909 58308 2922 332510 26107 -55264 -79841 -155960
23447 -155960 -61813 186050 252465 80345 -258867 -219655 281448 196102 -50749 191785 43276
23435 41984 -241544 294639 -29589 287309 48725 -151070 -177978 -104049 -227285 45913 21542
23423 157400 169641 69501 -514111 139308 195409 184838 14146 410198 -137329 -96752 -209327
23412 -209327 21360 3215 154162 67317 -138126 68469 -415995 -321840 -163529 -149386 -9899
23400 2450 -289476 1709 -29063 -93870 -83507 -42284 172778 64547 -79569 -141261 -13059 -31443
23388 -31443 156311 168087 -47689 211141 137129 -119767 71186 -202456 -53452 -182028 -109132
23377 -109132 -297841 243702 23227 -54403 288631 -2736 46833 160970 142045 -218086 -145785
23366 -145785 -106146 -33794 7270 -30378 -78993 133982 44032 -83357 177080 -128589 7244
23354 -200016 -5396 -8741 -246690 86793 -272092 -125978 -177508 219367 -160708 20676 -116666
23342 217044 60561 42825 27688 -266318 278144 -103666 -138752 280989 13356 33628 -103755
23330 -246174 309186 -26067 -244510 -143216 -100002 937 101645 -170222 -124413 -62145 -152089
23319 -152089 79930 166109 52108 191187 -222568 162107 -210015 -7941 193332 -110564
23308 -29720 -253238 103783 167619 55724 10861 89527 -163876 105503 -17753 -234466 -286045
23297 -286045 157880 -116964 -452706 129631 310798 173122 -3096 -120836 101981 8259
23286 -115872 90541 193366 -276656 71025 -178568 -40797 -246956 -107323 21412 -295539
23275 126074 44836 24989 389869 -77178 162398 139254 8784 140502 -29226 -143159 288431
23263 101827 -58812 -11604 -98611 -262799 -292676 -48646 1187 114364 29353 -29195 36914
23251 141186 72566 14225 8325 -102324 -205863 -273849 169846 -48998 -205154 -86589 -185498
23240 -185498 36313 130006 -93703 -156321 -169975 -126909 225041 193235 -161894 262260 -128496
23228 -47362 -394705 171277 178609 -208501 -17547 170424 237390 -328405 68911 83125 -47245
23216 -151347 -118049 105557 -162689 19812 -87667 85473 -36371 -128149 97664 -294827 -48864
23204 52370 271012 81964 -58573 255705 146429 -163384 -145353 252890 18109 -268314
23193 -110948 -37328 45862 -110807 15170 76074 142425 162367 92275 -218100 -289841 -191849
23182 -191849 105605 -256447 24528 -338472 -157912 361431 38759 -199673 -132245 31175
23171 -186307 -259428 -36490 -151382 -108402 -191394 146839 -160084 -25724 -38962 50986 -366509
23159 162439 183878 124022 -15724 -437619 -71237 -41472 -53653 307755 332125 -157336 -152472
23148 -152472 120416 -157682 -228690 19884 239901 -93196 62485 -93355 -47584 159775 417560
23137 417560 -164502 26735 6590 145635 215726 200634 106010 133771 68029 27926 91314
23126 91314 -111235 -4730 511277 -155575 237696 -86139 25270 114171 -43532 -79145 -101185
23115 -101185 -108593 -151967 -136948 215073 -111445 264701 -181400 -12225 -103606 -214640 68598
23103 -1855 -220359 33119 160811 114662 31267 -342629 -53944 110617 304993 -179446 239130
23091 -145478 224247 195356 125795 -2558 216045 -200807 -149186 -112942 -316698 201458 -2877
23079 121794 44712 -158036 -20917 -130123 18228 -168653 -75616 -2984 -6339 254860 3242
23067 179685 -25039 45842 -37156 175791 25628 275129 374007 -75066 -202413 -176601 -182169
23056 -182169 -128809 16481 -151094 125387 -10911 -37963 228621 165012 174126 29935 15287
23045 15287 -386693 56188 -238794 -65728 93659 -291951 193781 -147567 -8918 -44076 219849
23033 162642 227437 -395526 108669 -246066 -43763 -39122 62938 -46458 -402806 91503 -127935
23021 -79866 65371 32272 -107950 249146 9028 370951 12366 21927 103932 -31565 87389
23009 -129790 224712 -30569 -22785 -199409 -90750 -11483 9968 -8194 58435 112884 -132846
22997 202720 24546 -63466 -208497 54863 330265 -11044 -114965 158851 -290308 -90147
22986 -438625 -122085 -80409 -68607 -36717 -28758 171157 -56458 20568 369703 -155536 -68733
22974 -248254 -119498 -75111 294762 172017 -183409 183480 224453 -238216 18196 25825
22964 25825 225459 -129238 171390 -39992 -137576 132859 -64556 -686 115183 -179504 -183384
22953 -183384 -127716 -19133 -85264 -64544 170259 -192985 -171059 83404 64602 51235 20223
22941 43415 -312285 -81836 43355 18083 129112 57357 -158120 -91412 289118 -322105 -236630
22930 -236630 -62767 -250716 -66701 -106521 54148 -257424 240970 378006 -123881 81846
22919 -46110 -20911 125517 226291 -12567 -77278 388495 -271826 -160611 415 -465528 -260196
22908 -260196 177413 48831 106164 -100853 -237337 -107848 -182474 84837 298665 21278
22897 28956 -242181 -64793 219736 -21198 -22026 109601 -237557 -173840 -322015 -365218 -311364
22886 -311364 7009 271941 546 -21276 31249 84637 -133285 245414 -290413 14770 76563
22875 76563 -47095 -24161 -347093 -153289 -355055 -163338 -132430 -115921 7072 220206 226333
22864 226333 104578 103136 -65905 -190066 169847 -191910 -110542 -21030 58129 -5365 130335
22852 -88717 -52345 118711 172543 40866 -354219 -177644 -187766 82171 152571 67189 202724
22841 202724 341723 -23279 127829 -432225 -197460 -191000 -194568 240049 -85657 -46451 256914
22829 -287324 130302 111878 215394 221948 105540 24231 30479 -156897 -322176 199848 77311
22817 159404 -13301 -32489 244082 -52761 -197298 407947 315001 -207001 -98937 -12283 -26302
22806 -26302 110927 266116 -80727 -76388 566030 -18178 -1506 -152405 66481 -190095 -28033
22794 -71826 -23964 174958 -97016 100327 215586 -191710 96 -1876 425694 -30556 170020
22782 60056 -109688 220047 -172515 95838 225636 11536 -311544 -233286 -230346 -224535 -120438
22771 -120438 -76742 -175471 -121845 8357 -128648 146327 413302 308116 91546 -337840 -218181
22760 -218181 -98651 -31978 195915 -28056 38726 -332395 -88462 9568 -47518 33896 10116
22748 -217963 -220429 -10466 -226275 35634 -58166 -54992 -174460 -14493 -33525 168299 -116222
22736 -60807 182157 -99900 -132597 101238 184050 20956 16282 -304262 355297 15403 -227477
22724 -201915 -65766 97874 53726 -59808 -115782 45349 122645 -234271 3564 -167891 121889
22712 -191265 -237655 -253932 -276803 304360 117610 -176139 163916 -148574 -170254 168265
22701 -77351 -385018 -187267 136922 -59297 281382 140176 -16058 44139 31362 -21311 4448
22689 56355 -50834 -267905 263421 57161 -48593 51644 13304 55404 361955 -141386 -186195
22678 -186195 -135982 -81641 76546 -23115 49543 88382 26141 60001 -107192 110544 -39963
22666 282698 -326507 -128300 -13696 -231774 200944 -22474 3339 182938 62050 -16166 63072
22654 164378 -9792 -201265 73 156519 48022 -560 275879 105465 109021 -158507 -174713 -53513
22641 -209687 160866 -37358 -155749 -39900 11817 -245373 -142538 184192 -24472 193131
22630 -65354 -46285 -1616 133393 -103586 -108470 101115 -40844 212537 1104 10077 151779
22619 151779 -92665 445363 -27556 248514 -26568 -34963 -134369 -5731 -67375 73944 317385
22608 317385 -422343 -254111 -102215 -16836 89717 44894 -357903 -58359 -76648 -78949 138475
22596 -289057 13881 -131767 239811 46941 52530 -143378 275875 -382383 163292 -115160
22585 -65996 149337 81304 1282 144757 -32737 254249 -381389 -143462 14849 -167253 -21795
22573 -151188 157962 134385 243780 -751 -153718 -49527 -22063 -132391 24771 -382409 46362
22561 65884 11744 -185686 -103684 -309261 339236 -66969 90029 38820 -194580 161612 -287427
22549 110002 28971 169086 -167913 41153 131185 -21541 -368618 213172 122038 -197224
22538 257940 -237084 82860 7298 -256686 48794 -184166 136736 155302 -177008 163973
22527 -173202 62231 169922 -152320 -277553 95370 -32112 175277 -256416 -240276 138660
22516 -209511 -208078 -120566 -90530 -95621 18610 49681 -94652 -217142 -41244 -236077 -328805
22505 -328805 9507 -383248 105312 336884 -105021 -467236 -52770 -6767 -136544 422438
22494 148354 -1171 208252 233346 247233 -300027 236455 78564 22909 -25953 -37636 -170398
22483 -170398 1528 -153282 52355 42125 20430 143817 20138 -124651 -128559 115408 -26886
22471 -118130 111460 -499497 245139 -31572 -193432 143405 78209 65875 10007 34256
22461 34256 -23057 -50415 86597 -37187 -81486 -142052 -384305 -195259 243383 93288 -182355
22449 -570122 -154360 238679 95313 2348 65912 -53848 -143840 153814 161330 -132446 385973
22437 -274190 -161907 53340 203580 -150569 18865 66469 -104837 218347 -77104 -191725
22427 -191725 222122 63456 -115408 62334 223014 420999 -100053 -318043 -97840 173593
22416 142988 -136138 -203184 -275151 -199340 201340 -135489 -110432 -156423 -21492 -228386 -128869
22405 -128869 -127991 -22387 -206199 346381 -196015 85910 -13667 -81314 -216055 194413 26702
22393 -302191 -138022 -50074 -25675 -88474 -143702 -142463 -61967 -46159 -22478 88023 -268907
22381 276295 -253622 -60297 104047 -163763 19066 -23924 10757 -39346 -114249 106045 56461
22370 56461 55955 139572 -76153 15152 106331 127901 66669 -13876 -28224 -47351 -313525 -359086
22358 -359086 222508 -208021 20302 71740 345354 -70700 -90404 -47330 -49871 324133 -223299
22346 -91756 -114210 3812 170127 441927 -91164 -312892 223819 -62960 -94774 144792 223264
22335 223264 36054 -241643 82112 2026 208453 -96645 -215656 -161044 -173206 168129 -249708
22323 -100523 -85888 -179475 76935 -135986 -119876 -150308 -84794 -11773 -194378 -1125 -156009
22312 -156009 -263625 103387 192337 204495 46941 -203184 -249237 88503 157329 250869 -56305
22300 216167 44645 -323021 179064 -59425 105824 113804 -166105 -84841 -293625 -44978 280994
22288 140086 116790 344900 167373 47886 -71301 114163 126216 261015 -7739 -91297 -35230
22276 129869 -305757 -93995 65524 -186532 -205604 -133972 -92068 -99600 -99441 126002 -98281
22264 45464 -9435 -116875 4367 -96266 -251694 -156877 -135743 77906 -129347 -199524 -385723
22253 -385723 210708 38951 2937 290618 67615 102411 48802 137645 -87725 -78317 -74804 -277905
22241 -277905 -188399 385796 -178330 116039 170028 53873 497119 133344 -59803 160258
22230 468 -159060 -257850 146661 -328174 -131567 -227300 -220621 76437 -75536 -73286 -100712 12518
22217 -47581 166044 67561 -67769 -60695 -7057 4839 153394 247065 155907 -153473 69353 -120993
22204 77250 -42701 162575 44964 69129 -204276 -91202 -147073 -52949 150459 -36122 -129213
22193 -129213 154295 -126818 316667 -213697 -46121 -96900 -168974 -173786 -56898 -52268 27342
22181 -131443 16286 51629 -63450 63109 -147950 164437 257523 -218633 -87089 -36462 -101197
22170 -101197 -10982 -24456 -26007 -63805 105875 -130752 26790 -2878 166373 81529 -85751
22158 -26739 -339927 -63779 -331494 -124366 -287370 -26465 -151717 -41651 -25881 52889 117643
22147 117643 -112314 246977 486839 46414 -12777 -73890 -8812 -139474 -2725 -65464 93358
22135 -167189 -49076 89078 123704 27430 -279487 -64162 155253 -176571 -282808 -427752
22125 -427752 -22898 -315554 -54021 -157543 26732 259355 -130713 -372175 55192 -35813
22114 52380 -19220 248605 -6647 170566 -44806 -44351 -94570 -50623 -70382 107804 -297462
22102 -16741 -245802 -107838 264078 -285326 -330958 -142221 -187481 24350 51829 -24807 175385
22090 -82741 -33565 -318622 -167416 -184108 -27568 147461 150341 16134 -92300 -82463 -41800
22079 -41800 -20282 -229274 41858 13339 -17480 -302525 333847 -35954 -302248 -334460 278609
22067 -155189 -255241 -262613 -116894 13646 -5579 -160023 75389 44875 -82766 -114016 -83242
22056 -83242 -79985 68610 -149584 -154169 84921 97957 91669 -131615 142831 23749 -263521
22044 -12825 35244 -332449 -83799 -13187 34043 -155804 -103265 9468 -133238 210115 -37664
22032 6553 67296 34546 -48034 -26958 -153862 52828 -104550 -25568 -163568 92709 -85094
22020 40758 -42595 121850 -182672 56946 38692 -63967 -259620 10053 -19481 -57847 -63299
22009 -63299 -192538 -146536 75537 3661 122063 9390 102063 337175 -80016 -148703 -165157
21998 -165157 -85269 -5586 91878 66656 -72777 109171 -101926 -135365 216461 109604 -51259
21986 54942 61273 8466 52180 -198690 -101812 -5463 -98295 -268921 250552 146161 91872
21975 91872 124953 -133074 309129 -970 -32157 211442 194395 -265132 138976 -29152 144877
21963 117956 57413 39265 -107415 18294 167632 -80213 -301454 -340260 -152088 -450989
21953 -450989 -107493 167036 -228217 232771 -234291 -127510 -135073 -169329 73273 -95549
21942 -118349 -87487 -35775 -59774 -121572 -121280 -164413 24261 -271565 -145857 -311363 -193750
21931 -193750 -151450 88693 -22354 55955 5972 277876 211633 167664 -70062 19672 1498 -68533
21918 45155 -209608 88701 155052 -160923 175669 -256544 134558 61853 -64000 -6172 -147750
21907 -147750 40487 100053 237630 -175073 -191238 -117469 210707 -316811 149800 -178946
21896 -107431 -43849 -127843 227117 -285469 118410 103181 5640 -82004 -38060 -280278 -88544
21884 -279636 -178982 76816 -68491 -134288 -395013 -98699 27671 -1057 876 -1181 -234318 -230126
21872 -230126 -110901 -230722 119407 337344 -200606 -47507 23917 -30635 146282 178209
21862 178209 107826 116105 45006 -154739 -174059 171510 233382 -169081 91 315534 -221227
21850 -332471 -200590 126312 -236272 -179269 -165303 33741 50679 -409218 -77068 -356566
21840 -356566 -155567 -113005 -57710 -56211 58515 -248229 -10869 163990 -485594 138065 108115
21829 108115 166344 43487 53875 400371 -32261 -203867 33588 180226 -172358 -25932 -89382
21818 -89382 17196 -37206 -240646 185449 212088 -198537 -230210 -81449 -146482 -238632 -154746
21807 -154746 -113676 131097 96760 -36024 170155 73328 77213 -132296 163738 73420 -245903
21795 -55091 -18136 -162772 -71202 82816 264258 66472 314508 -40147 80290 -84945 -187815
21784 -187815 212488 256926 113984 -67910 -102038 113955 -258785 -24948 -148134 -98267
21774 -98267 61769 325117 -143466 305452 -65537 -86505 127403 -255971 302495 26811
21763 203929 -141690 38624 -193842 -58812 -364093 -27994 127420 51857 106647 -69219 -138248
21752 -138248 -106514 -61682 -161756 -327679 116110 -68017 -15185 -209107 11330 119466
21742 119466 -96780 -147513 -163904 11954 85655 -105544 109694 -33358 -63899 -34212 10240
21730 88858 5615 -357645 -53311 193066 76065 26880 71538 -111983 -463574 196025 120478
21719 120478 45514 -183620 -189878 -305274 -30678 -406852 -726 -25224 -270801 132743 -69162
21707 -123836 -187566 129387 -140824 -179217 215178 38147 -51913 -326878 86116 -257430
21696 -256757 -153118 -274126 29845 -169782 -83266 -249428 -64533 67241 -356486 -432455
21686 -432455 -97302 6659 61769 18600 -3681 328450 -13241 -60848 248332 -315101 -39267
21674 245344 55912 -110188 -144864 68273 -47208 90474 -62324 -315848 -229379 -166285 -183178
21663 -183178 139967 -97387 229615 139647 -98539 76215 -105002 -5999 -29971 -143175 85933
21651 -217555 -266167 -40235 13965 243754 -271854 36109 -163474 -155637 100970 80060 -168407
21639 -232259 -147054 7392 39642 -287302 285607 -251300 94179 -61181 -67606 -152432 -237140
21628 -237140 -299390 -87504 276734 112276 -282754 -123763 45230 -307186 63738 -73870
21617 -42245 -118855 12575 -291976 -10519 33594 112002 -225362 278524 73305 -158081 -22047
21605 -139251 -163111 -10591 50579 -183060 42270 66665 160035 60181 -20586 36314 57601
21594 57601 -123419 -105505 -60103 -270014 125652 -115310 228398 113772 26748 263561
21584 263561 -45654 133967 -84523 -82722 -330009 91387 -248417 -149000 65330 83797 -21379
21572 -78789 292295 24779 123810 148237 -136204 -22578 68105 -290563 141491 -131733 146722
21560 -24035 236122 226937 -108327 -88818 -86572 63764 210416 166708 -168925 -86121 -22469
21548 -16575 -37759 -209782 -180658 148325 -83230 -172087 150239 112596 181293 -81250 -191355
21537 -191355 -165533 -11525 -25277 -363804 182760 20489 -112141 124092 -1805 -157628 100125
21525 -138223 111370 125214 159443 -99734 83602 251259 -303918 85183 -268759 -233939 35804
21513 82896 -152756 -297899 -225684 265605 -292463 -191450 -64489 33174 160459 103506
21503 103506 -179125 -294271 182588 -193693 -52148 -157904 -271746 -284511 17016 -450322
21492 198740 -4958 218223 163046 -30825 132019 82673 95884 -115736 12649 -124723 -207140
21481 -207140 201134 -136739 -394001 -60185 -113200 -194411 125161 294285 119781 -63368
21470 -246928 41794 -111919 13298 -130141 -114531 -289984 -142529 -224885 107921 -194704
21459 -93828 99794 -171548 248636 111344 78150 -48305 -44237 159944 -27474 -220480 58931
21447 -100370 -48101 71424 -159932 -135500 -95 -84239 154889 321593 200954 137824 126069
21436 126069 246917 -85349 77175 240817 -79024 -282174 49073 -231563 60 161187 19360
21424 7415 -136743 -12912 -312518 72625 -254857 -143417 247475 -60233 37912 -59889 -251857
21413 -251857 -36441 -134206 62708 -133706 -57530 -244184 -275872 41096 -108187 114999 103604
21402 103604 302478 -230546 1968 -43429 -112400 -352501 -262567 195143 -124901 9930 31978
21391 31978 6782 50399 -52521 80205 -10390 134677 -59148 -313609 107601 -47026 -257710
21380 -257710 19217 -282825 -200174 263398 -80809 -274503 313710 -112825 -85528 -93174 -51029
21369 -51029 106025 123050 177486 -122457 -259247 -184905 -143169 102466 -174669 186520
21358 -55481 56119 -88475 -202272 -72392 -116300 263921 -193542 192966 252088 -26811 165080
21346 -241730 114075 -216876 -197013 -15761 190251 -166830 -34066 -240302 -235150 15040 -338514
21334 14231 -312472 8565 -114720 -83348 -56570 199622 -86131 252924 45446 -232539 -170145
21323 -170145 -337992 -14780 18189 78039 271412 -320212 183184 125605 81111 -140821
21312 -227247 110482 180214 166069 57829 400304 -311654 -13112 -208280 -38302 126393
21301 33713 -525125 -25431 -1554 -28079 -109034 -59717 -313522 -352747 200901 -250091 59977
21289 -173511 85322 12395 119531 -571551 -50527 -76926 -201918 36414 -17122 -181714 -8680
21277 89843 -71784 -94750 98342 -35495 -116527 -254432 127795 -62008 -78198 -242657 205285
21265 40490 229392 -291592 -7734 55190 -20697 -203317 3820 162005 -106855 -62821 117631
21253 -12375 -120895 267005 -37533 -347039 -85947 -160961 2356 81923 92057 -25557 318191
21241 108375 -48316 24279 -103729 -176034 11268 -168173 80087 -177930 -184752 180142 227451
21230 227451 -358769 161468 -199646 -31795 -282358 202273 -110429 -193255 -167057 314287
21219 143666 355430 -89519 -28733 -294837 -318229 -221437 48005 -115238 -289562 123801
21208 -246384 185757 -100001 -103373 -15569 -411178 -98278 96179 36854 -221502 159561 26854
21196 126330 65378 72714 -239887 2400 130319 -182410 -190548 -236207 91066 -230109 -37054
21184 93283 -281407 -48795 -299481 63142 -29181 13498 -31295 116817 -43081 -32513 -104997
21173 -104997 -162855 106696 147958 -120382 201433 -164818 -320613 -3963 6401 -34928 -46482
21162 -46482 -95962 -160617 -29506 -106085 35337 -105054 351995 130530 59495 52058 28137
21151 28137 99353 -146224 -92563 324850 -38036 9201 32135 -467269 -10649 -242356 -149465
21140 -149465 -252526 -36830 -99306 -115105 -206454 132010 -21777 -88669 -44764 -122894 -198709
21129 -198709 220141 -142646 36550 -115450 38639 -159343 115973 87821 30787 113867
21119 113867 -362220 -277018 -53907 -196037 109794 -77020 -608 -80689 50008 96068 213041
21108 213041 -36043 -347028 -11075 -237174 -116846 -14747 63747 9863 -5909 5538 39938
21097 39938 -55332 31601 118281 112278 35293 179509 -291156 -23635 -205719 -209302 -278096
21086 -278096 -2986 -356887 226297 171491 3573 -85061 -46938 -282382 -28605 -64443 54063
21074 381116 111750 -323915 -331096 24126 -178786 -295012 115394 130159 27315 -115915
21063 121256 -9381 127524 158733 -239777 150137 -204466 9297 -159851 -421501 165291
21052 -67352 -20172 54296 -92897 -60762 148731 -211177 71306 -216612 -14332 82033 117941
21041 117941 50914 -131104 377708 115629 137466 -105952 -401088 -211434 107621 -74603
21030 256297 -255408 34580 -83960 -182 59619 6868 -146132 65902 -54261 -329793 157029
21018 -164383 -164658 11311 -35734 33092 -169283 -127653 -443923 -193321 -306762 -92037 -89732
21007 -89732 -97790 78345 -156191 208440 172794 -76079 -107819 -81317 -135268 358361 381000
20996 381000 100071 -63059 -13318 -215879 -135183 -174700 -42101 -434581 -25333 69323 -11892
20984 113125 -87342 -212528 117805 -301089 -101021 -207474 7581 -41299 215916 120921
20974 120921 -341247 -178181 194239 -293213 -207375 -277837 118531 -77368 -146165 -34866
20963 -487675 -113220 237082 -57634 220344 -202434 -133459 -188742 73607 -191761 -45083
20952 -6255 53054 28921 -200162 220931 -253389 -293336 53475 160030 -118395 -63941 -339156
20941 -339156 -113853 -6263 -130667 50109 -391112 47548 -235557 32646 -277028 -160333
20931 -160333 182577 -284450 -192173 6385 -16180 279733 -159512 -150619 299973 221397 95038
20919 185165 30371 -83193 -207406 -36911 -224552 -65802 -137737 -115868 -73690 293548 -116161
20907 -312060 -67590 46795 -169136 -215765 160364 -195699 -373146 386457 -219138 -160859
20897 -160859 -114447 -47181 -317173 -195339 -56218 130723 -104469 120543 -36794 -174490
20887 -174490 -98322 -217051 96944 -255663 38404 66655 -341524 -96768 -69137 -88420 -74332
20876 -74332 -43526 -261731 -28568 -84415 -99871 85041 5926 29798 -169253 -46339 -53034 -65588
20864 -65588 -68419 -112337 -45616 18334 -39525 94936 35719 -118618 38811 48159 348376 -72855
20851 72010 -21046 -53604 -1864 -136871 -221088 500882 -330968 146643 -251177 -43420 201895
20839 137374 -234827 -12895 214334 -550044 -162742 135198 -76926 54333 -78288 27420
20828 -136920 19463 112817 -279581 -274202 -312527 -415707 -434783 -144955 -153474 -318047 235413
20816 118066 -175098 -375500 54630 -107595 -57680 -213900 51795 -180362 -242101 -211662
20806 -211662 132705 63641 -123586 -40873 -82700 -75774 369203 -234771 174000 -138531
20795 -346885 216361 114642 -72132 -400758 42692 -373062 291578 -126528 -75868 -332242
20785 -332242 -144974 -255578 -63603 -11760 -134150 -81114 58023 238223 -2976 -102672 -274867
20774 -274867 299762 -147539 37453 -207215 -4344 46857 331743 73526 -153824 91631 -211794
20762 238808 -13524 -359150 -71925 -55564 -103883 229153 -310299 -249676 59046 -312627 -111292
20750 149324 -80181 30554 -273963 -56830 304174 89521 -125378 -373733 129598 -49960
20739 -88083 -62814 -250329 -91773 -93329 -34299 -104676 93551 17484 -28303 55795 -42235 -162926
20727 -162926 8201 68983 121906 121451 -91913 60060 1550 -41149 77579 224962 -202899 13654
20714 -217672 356717 -13152 -205645 -142488 -311246 -68526 -213914 -265124 -152600 47097
20703 -206480 36121 509709 81060 -105053 45821 -247252 -165119 -270245 -5830 112248 -276977
20691 -21037 132934 1065 -140726 -99737 22752 -164166 -272373 123104 -3804 -58329 102079
20679 164023 -205366 -31461 -350610 -107399 156035 -219144 302011 -312690 -9892 -7412
20669 -7412 80422 -364900 -274626 -219823 67922 -249746 27140 -28453 -82656 -70928 -61275 -203560
20657 -203560 -10097 12031 84193 -259462 -270235 -147029 -127341 135551 -266409 179423
20646 -226184 134945 -47415 -72329 -439796 62669 -109031 -193447 -412170 -98199 -52672 291697
20634 -138897 -62089 -388040 14700 -205022 -407006 -43502 80476 221616 -36529 -193754
20624 -193754 140927 -103083 277151 -86117 57935 -167502 142391 95490 288474 -47637
20613 -137440 -148586 389121 82582 143942 -123090 -179153 160940 61422 -299719 -82245 -44578
20602 -44578 -26018 -217570 289086 -249685 85268 469369 43010 -37814 -55004 -7623 125133
20590 178449 149771 -38771 9439 333204 43839 235768 197083 -22398 128761 -212138 47650
20578 273621 247112 107587 131003 -126245 133854 196271 -99482 -309699 208719 -136254
20567 240086 -243903 -425346 136803 302954 236687 -206219 -80082 75430 115972 -236644
20556 -56613 -106165 -9754 -14478 -196056 -67970 -248022 -247251 137801 -160462 88742 229138
20545 229138 48256 59039 -57404 2260 15004 -293209 37661 -246370 236822 29383 -232234
20533 129583 -55420 -151445 49319 -31225 226609 25247 -56517 -178784 -180015 -99436 -174559
20522 -174559 -85938 -289950 232047 -102794 -86788 -25244 -178352 -140679 -111160 -62814 77578
20510 122725 170143 -50298 13725 36856 186691 -270603 -353656 -140383 -145648 -94902 364093
20498 -101347 -164188 -193791 -82055 -121552 -161688 -137683 -289272 85186 -114932 -161329 -115693
20487 -115693 46178 -201448 120259 -100384 -131466 -128887 -114184 -357284 21141 375546 -78474
20475 -16087 -243901 -345174 192534 -182709 -318071 -412679 -231040 129071 -68478 -114041
20465 -114041 -105928 -56412 -145074 -174333 112443 349161 43519 190269 37733 -37205 119519
20453 -12873 283851 215964 -64977 87823 228101 -16856 -85455 -234469 -300590 -247003 112362
20441 -553660 -322390 178490 -16207 -14828 33693 283946 41774 383041 15530 43220 -57786
20429 -173554 -343244 112736 -68813 -94011 -171759 -70636 -19741 -37827 -32414 -118373 -264397
20418 -264397 -145608 -219683 81577 -60963 48151 -75991 -354186 172271 -20943 -177773 90327
20406 -251027 -44505 -44065 125228 131136 181188 -240214 -287905 25062 -80560 36983 -35049 160534
20393 27224 252381 -34550 -163393 -258653 -145882 -13419 -87685 227801 -442345 202683
20382 585803 117322 -121064 -419105 78711 -411820 -54181 -83778 -176112 39310 -267326
20371 44304 -102901 -17876 -220849 -29303 -115819 -50100 -64850 193780 -12129 -55059 -90759
20360 -90759 82341 -21499 11152 -181249 -184541 87105 -283353 -290138 -301186 -46126 -370845
20349 -370845 72162 -31593 -61672 -11746 71985 -80422 -185077 -209209 -239260 19333 4937
20337 -102486 -61613 -349370 -105252 80536 72442 -111181 -38421 52833 -228460 -140494 218618
20325 -6560 -102213 65997 -171677 207594 -169921 101935 -110282 -234989 -112747 19580
20314 266757 232498 -10780 219345 -280560 138264 141301 -154663 -84009 -233512 71215 -41969
20302 187998 -35357 -150195 -123552 75541 -379200 142117 52628 -130739 -31125 71212 -181089
20290 187691 173597 317914 -165608 -38293 228933 59248 -229610 -133239 -8568 -206377 -304077
20279 -304077 -186801 -47730 16683 -141005 -179519 9443 -44325 183861 -109120 -144745 -325841
20268 -325841 -196592 -82753 -19439 -85142 -219276 -77524 -14802 2444 -335050 -412315 -11341
20256 60006 -100534 -219850 -244136 11797 -51555 -104790 -50227 -210849 -113103 -4775 -18031
20245 -18031 190739 -47888 -41679 -69888 94462 929 112921 168618 -68897 31930 70629 -242284
20232 -241303 -124648 245257 -51252 -241280 23190 -151968 90130 296437 -226570 -109249
20221 -121735 -12879 162265 -177345 35680 91367 -294537 -183522 63136 -361573 -28451
20210 -153649 -137131 -39624 -222419 -5283 29368 189247 -293694 -117701 -231164 -126527
20200 -126527 313172 -132470 244360 71179 -117392 118957 -50970 -232935 8439 -24937
20189 -149113 86954 116798 2914 -175770 -375413 -94935 80484 -170485 -116140 -230515 29326
20177 -169280 -225902 -371926 -288876 138428 -134745 8538 46984 -239960 -74363 -128929 -238063
20166 -238063 266125 -118384 13334 90870 -164531 232829 -166793 -91185 282670 63253
20155 -43127 -388489 -36267 -55517 177861 -67014 -112994 -155865 53712 -58842 -252362 -25023
20143 -26603 230220 197002 -183665 -29732 -31675 137107 -140794 -132751 106893 -33925 50706
20131 316531 -2517 -517406 -187354 13275 237966 209555 43745 -306584 197313 1293 -76992
20119 -121188 -144810 -374591 -304346 -83054 -97531 127231 -266880 -218661 23752 -180561 -234722
20108 -234722 -32295 117856 -100173 -220304 47009 60283 101187 -112439 90613 352598
20098 352598 59768 -257275 -92652 -134669 -11216 -95382 97646 -33703 -167207 -155010 -361006
20087 -361006 179056 167831 -218915 -64379 5446 -494514 -129576 251174 -79247 191030
20076 -50194 137993 -307126 -42092 128314 198141 -430147 -4655 -92967 -239761 -9286 -88131
20065 -88131 10153 174274 -287513 -588725 -121684 129160 42578 -562 -167952 -203202 -313244
20054 -313244 6941 -212699 -122971 233256 -97593 -138601 -119675 -8042 -100113 -52417 242711
20042 -1253 238482 -119715 -105795 -110523 -26746 -195399 52592 -171726 -128041 -133693 -201718
20031 -201718 61899 -151146 -323878 111043 -55659 106543 -61626 -60271 -183655 -384694
20021 -384694 -390130 202726 -78157 -196965 -76347 138757 21765 -90997 -27991 348060 -270128
20009 -31855 -41236 -251192 -27239 -389089 -493613 -185387 190254 -115003 -175518 7268 -196857
19997 312030 -19222 -140643 161461 26602 152281 -199968 109017 -41516 -198357 26293
19986 15563 50411 -110690 -129235 -13592 99731 -117821 -188960 -83047 207742 -9840 -66982
19975 -66982 175985 72611 88680 -564 -140330 166843 -212550 -163693 -135480 -120910 23886
19963 -171872 -56077 126517 16128 -22697 -150362 184415 -51596 168628 -93303 201262
19952 -255977 -130108 -471831 225152 -133937 -52284 -52069 -197952 -178876 -23315 -47796 -17087
19940 -236742 59854 1226 -44607 -492789 -16325 -29604 206647 -393000 -159348 -47977 194201
19928 -139092 229572 -13058 -142943 106761 -284292 170897 -410364 -62590 -124077 221585
19917 -320558 142760 -55186 62217 -83062 -207180 -6299 -153852 25138 -13998 -39215 -72753
19906 -72753 -59520 75705 -223942 141422 -99422 45793 -82007 -5887 136945 53467 -213427
19894 699 -227904 -408765 -80967 107250 -407998 -6947 -372791 65654 127561 -125264 -5341
19882 -413 -88180 -283098 -54718 -284629 40503 -243365 -260360 -323129 120493 -37327 -72823
19871 -72823 -218117 -235621 -140247 46174 -32848 -278046 -130064 -148804 290759 -191837 63516
19859 18805 -91351 -24981 36880 35860 132762 -124964 12737 254814 -32085 3794 -249578
19847 54689 -35609 -42888 -30772 80518 -38678 117968 -364602 -160044 -113661 102354 194975
19836 194975 -191970 -21880 -62732 -184477 196946 -17224 -240206 53517 101696 -228195
19825 -106736 21625 -83795 183649 10654 -183168 -6404 -158935 -113410 -146538 -378540 162345
19813 32722 -54628 -45644 -83193 -229114 85478 3250 134862 178942 -314262 210416 236562
19802 236562 -67241 195165 15329 -218250 365385 -125810 -295190 -59073 89358 -70768
19791 85341 -191840 202643 59454 -199227 -396653 -224778 128978 -2965 -49591 25642 20828
19780 20828 -184023 -100875 131447 33340 -10473 -235007 23240 -49323 -252315 -263882 -375527
19769 -375527 37303 -35596 -201961 117256 66778 -164643 -206769 -18928 12064 -230502 8280
19757 -233179 -97048 -204886 25182 45243 -20534 274411 76820 -218833 -103956 -367823
19747 -367823 -56262 -86935 111479 -133047 -209520 -53086 -239432 -18793 -162234 81299 -42515
19735 297030 460186 -70056 170652 -393175 -58803 -139715 -2594 16133 134502 -37457 23444
19723 -40295 -135116 42387 129650 -24963 92363 203337 -11968 -46174 -69199 -76674 215077
19711 -22023 253070 -368761 -206359 -134071 -166596 -188909 -38147 244925 -72296 -146990 218307
19699 -195562 -66784 170116 -129259 -401279 77155 192747 75472 115159 108132 801 -327931
19687 57452 -215504 -151557 -103042 33559 58807 125547 -149885 -83583 74288 91913 -90178
19675 -180791 23775 -253115 -17346 -283186 157839 44566 -62292 -76406 -292347 -102355
19664 -122450 -59780 -74958 59315 -59758 60557 -196846 54611 -24634 357570 -196137 -263044
19653 -263044 113808 -127358 -139982 -47861 -20665 2626 -139789 -380291 -58963 -154718 35149
19641 -160942 12103 -146002 -67955 -88226 19430 -378329 -79426 -205790 263148 -290089
19630 -271570 -101057 -232395 107489 53269 16021 146802 43523 153597 12195 -160560
19619 -79936 -69309 268520 5032 -32169 131995 -179012 -151337 -13062 45303 182523 -156422
19607 -172163 129248 -78805 8479 -34672 -150937 -13564 -40059 76019 102319 -385340 -216196
19596 -216196 -286569 -63794 -45677 253503 65549 22385 -211959 -367999 -122935 53363 -169433
19584 85677 243797 8275 -23017 152680 -169867 -39749 -190305 -202744 -7935 96941 -110433
19572 -106776 -60109 -159065 -137368 -390591 10133 -261247 -406835 -121728 -193007 -142195 -280087
19561 -280087 -82679 281307 28924 -176872 44629 -321657 -99255 31336 -21867 -88008 78388
19549 76383 -302876 48103 -238028 56325 -92774 -100561 -89025 -228643 -86653 -363809 -48917
19537 -75092 -214338 49201 -121313 -113404 67974 110877 118185 16772 42703 -121955 -118178 33187
19524 -53816 -185965 1597 -72494 -217678 -30786 -233898 -54935 6267 168215 -258851 -96393
19512 69747 -20219 -243712 117763 68277 50499 -53459 -199338 -235797 -235634 212684 -51888
19500 -151124 -236275 229123 -71674 21092 95128 42735 -36731 206569 -271136 -43131 428270
19488 -82729 68211 -8796 7426 -51956 -483613 -154739 64949 -348092 -64577 175906 116239
19477 116239 -112450 -100013 -15346 87795 -217962 161625 75486 -54150 -21944 94986 -157261
19465 -59279 26458 -299923 -222606 -209948 -146001 -241962 -123423 -54436 -168420 15353 -185374
19453 60129 -84115 -155053 -11910 -216473 -146336 53251 192069 -73784 -184315 -20819 -180892
19442 -180892 -288979 291079 72185 -37284 -315872 76518 55749 71628 -232056 98524 -224506
19430 -223791 -323001 185137 7942 175818 -198499 -60578 6580 -378286 -163543 132512 -21500
19418 -299278 -237141 171429 39358 175414 91180 -114919 98382 31871 55802 -292474 -86289
19406 -27566 60674 -284540 78075 73805 -107313 -145 -44496 -37588 178938 -18811 181028 116805
19394 116805 -242589 -27943 109135 149042 7310 147439 45269 238534 -50511 210188 239244
19383 239244 -144083 -165742 -37316 75100 40402 130998 -73905 242215 9867 -202627 -365806
19372 -365806 -87892 -30249 -201099 369 -145857 -220212 -267368 -4410 349922 -264059 -179263
19361 -179263 -98980 -336541 118976 -64879 -233431 -208009 -88892 -86269 40208 131845 159874
19350 159874 -141747 85333 -44861 211706 -266947 -48064 -142261 -364739 -39308 -104586 -13277
19338 25501 96292 76805 -200577 -212050 -82357 -180676 114404 202278 -38622 -26704 -84070
19327 -84070 -138948 -250466 -233854 -134916 49242 100107 111425 93891 -43652 156924 -376548
19315 -78136 -184981 -18478 -73386 -172895 218151 -114457 255279 89960 -249270 -141679
19305 -141679 -9320 -101045 95244 18029 39202 71686 59833 -342657 -6919 148545 -49725
19293 -77728 -130095 91197 1162 -241644 306267 -608170 -81554 -262534 4410 -115003 167838
19281 -92924 -768 135536 -567690 69558 -273856 119791 21302 -330233 -114292 91009 180470
19270 180470 267326 -220005 9217 50019 78029 -319593 166458 -61034 52120 -178991 -184478
19259 -184478 141852 -2582 113173 -55578 -146735 184932 -506517 -12591 5108 77135 -200214
19247 -320632 -101751 -296164 -129263 -23260 145228 136634 -82416 -136252 -88103 -34370 -168405
19236 -168405 -43622 -140132 83316 -85969 -7649 -133258 -260552 37931 -62653 -277909 -128858
19224 -18850 -146080 56565 -314159 63256 -192849 243605 -277789 74861 -201451 -153269
19214 -153269 58022 110519 26077 39587 -4354 117818 18626 -64235 -142338 -203424 -112084
19203 -112084 -152662 -66159 -99555 -164969 -34173 186606 -225332 142738 293553 -101186
19192 123743 120909 58401 -13156 -50509 -321347 143681 -47150 -222927 -12772 -21489 115149
19180 -51190 127807 -5673 -17145 -336158 111465 -171993 -74578 41163 -189479 -48161 -106269
19169 -106269 -15069 -341953 5234 6388 -383365 -7717 178876 -42632 -56339 66948 -182782
19157 -245867 190232 -57742 -86802 -150731 66393 -373339 -107581 -281979 -178776 -49180
19146 -55810 -292306 -263241 -17496 208402 -175271 -53802 -303909 58083 -276140 342744
19135 185279 -217849 -225004 -120802 -261993 -299352 304627 -22470 -147691 10661 -19941 31190
19123 150394 -41510 -55866 47789 -122743 145539 46385 -195398 76205 -370579 -547082
19113 -547082 -328694 182901 -120328 -241087 -194737 -214619 310571 -264032 -19320 -339684
19103 -339684 -287853 175214 -95741 -235332 -92530 -158716 -242935 -204961 56556 -171410 -74871
19091 -67980 -54527 -216499 114319 -216208 128311 361689 12476 61913 60207 -158136 267329
19079 -415095 -95391 171141 203815 -243345 -215282 30389 -160842 -15561 -40155 87093 -199952
19067 -241857 151861 -200336 171601 201320 -182327 303936 -438415 -126556 41435 -168418
19056 58736 -11319 67385 -57496 -200116 240381 -133328 -5988 -269222 377168 -188295 -394129
19045 -394129 -70033 24760 -90877 -99105 -141086 -127248 137752 143616 -16449 6813 -66935 -251807
19033 -251807 269086 -35310 -65154 38576 260768 154993 -310342 -48533 214965 -175558
19022 165565 13810 316725 97199 -18441 -79530 18179 247618 -28004 -194269 -85596 148133
19010 258781 75390 266534 24381 113024 262920 -35996 -123756 -150113 28650 215445 56672
18998 -86641 13439 -70756 -26086 -175385 8704 -126356 168287 -392983 12417 -172961 -76216
18986 -380058 -112855 309765 -36034 -125877 146300 181817 -228468 -168269 -11634 282297
18975 -151119 -257708 79788 -28834 63129 29075 -142718 -9407 330769 173942 -149055 -265062
18964 -265062 -76789 354001 -50431 -5372 110635 -46166 43748 182114 -365862 -31288 -287555
18953 -287555 -237811 -471893 309312 -73537 -19794 -231221 -189322 -127218 -198211 154129 -294156
18941 -56831 1872 -100675 -148951 -191023 173188 230446 5729 124348 -84789 37669 65336
18930 65336 191980 91963 -67729 33746 -123027 86390 -31911 75904 -157762 -37210 -171543
18919 -171543 -129930 22510 -248063 -49886 -44245 -223027 35234 -224726 287072 -185448 71329
18907 170400 -169765 57337 -79448 -356264 -407055 5171 2482 185340 176651 -110129 -87480
18896 -87480 -122021 343553 -148719 92777 -191688 -274888 67644 -86977 -185567 342674 195316
18885 195316 -50459 -230183 199200 -274589 18022 -226649 -290919 -74257 145683 -167376
18874 -46644 -54184 -100854 188330 248880 -172295 -309810 6912 72533 -47749 -33712 -74166
18863 -74166 -62401 -1803 144922 -13348 -208453 -81233 179372 -44341 -65790 52685 -262341
18851 -110822 225741 41395 73409 79199 -91414 67274 -193326 58534 128153 -187648 -83181
18839 -72469 -145679 70174 565458 60585 -93296 -113791 -438468 194930 68325 -58486 -221261
18828 -221261 -62298 -69980 -28406 204490 114147 125185 -375395 122159 -120577 -328389 196574
18816 340205 216401 -419503 96501 -739 495109 314722 11205 79258 -149793 -162336 -95912
18805 -95912 85414 202277 -819 14615 -267245 87590 171650 -263055 -117120 -741 -52511 -156847
18793 -156847 304592 -437014 26769 15595 -255769 -106146 -126185 116682 135760 -209545
18782 -243399 -302419 -59243 -203237 -75775 -70535 -250402 104 -354215 -230305 208651 -275817
18770 204607 -224059 109250 449830 116320 -219075 69389 -152531 -275750 23006 -43123
18759 47765 106185 -76577 -70113 -157608 -19649 -164105 -353142 23929 -2569 -85720 37647 62282
18747 62282 -74377 280562 164744 -15639 235719 275486 -221085 -74948 131036 170498 295368
18736 295368 -69756 -69393 45838 420185 74619 -98324 -90560 107213 23192 -97536 -17094 -61281
18724 -61281 -47316 -218802 188078 -139010 42198 186992 -110033 43803 -286146 37291
18713 -129030 50301 83196 3776 -149511 -15396 18652 -123554 171666 -110216 98108 -24041
18701 -127923 -29304 -215960 24536 -411168 -349202 -101416 49216 -145848 93505 -164978
18690 184558 -137900 -83859 98605 -11440 -13200 27460 -184473 -69525 -73354 -66072 -74542 -514179
18678 -514179 -246962 29812 191809 327026 -179586 -256611 124919 -123277 -82979 -310990
18668 -310990 -108176 -212302 -75889 62970 -70498 -24686 -229031 43810 238051 112862
18657 -22985 27866 209748 12456 -11876 -11890 -206598 -72623 248290 -12277 -278431 -12097
18645 269790 -139668 -127142 251462 -100173 -286839 -370861 -210982 66902 -108032 42532
18634 90348 -104980 77583 -273120 148574 -61504 183868 137343 -282437 -147975 -156183 -118798
18623 -118798 22718 -91152 -39914 -95041 21690 -340017 -216727 -62538 53746 -182251 -69630
18611 -290262 167096 -17188 -89390 117548 -28686 -367060 43827 122789 -105218 85972 114245
18600 114245 319813 2248 62292 174232 -41831 132199 125856 227464 96040 -282825 -68992
18588 -251072 -136815 -226972 -172910 -288287 102970 -247234 96315 63621 132948 24905 29896
18577 29896 369300 101129 -165098 -193354 120600 122989 165554 159611 -118456 40149 -104019
18565 332453 85038 10199 -301761 -146734 -4968 18766 101208 -32267 -148848 -336951 140200
18553 -87720 -631280 -312639 -67675 -221447 -141466 -20850 20375 -496784 -160307 -113286 -35474
18541 -22800 -76106 65157 42058 -59551 -80829 -96438 -43096 121776 -454968 29761 150864
18530 150864 -150883 -327217 -128751 -299891 -115062 -12216 -44101 -201467 1121 -380273
18519 -245241 204662 -151872 -358639 -250760 78713 -172838 -202258 -17368 -341407 -172054
18509 -172054 -115997 357700 149289 -156564 -170927 78873 67519 262605 -98593 -43699 -457536
18498 -457536 37327 33583 44789 -461 157738 -180253 -126663 -355285 -17693 59885 -31134
18486 150889 -32684 146078 220206 -123241 -174539 33991 73558 149393 -46901 -176657 -247582
18475 -247582 -187555 26041 -1515 -8832 -148382 8481 -99483 -92144 -70366 -153952 -136279 -324159
18463 -324159 15120 142622 364671 -173940 68269 227752 -108976 -18496 17050 146236
18453 146236 -80305 364117 6907 -192572 -64897 -157305 -77702 -165256 177688 -236732 -235166
18442 -235166 -196878 -254581 63258 39391 -47632 23456 54223 226259 -306241 -244262 143003
18430 113044 43328 -182529 -118042 254195 -44150 141887 188261 -218763 -21173 -240429
18420 -240429 139369 -193382 182112 -331254 -445804 -85312 -51365 47788 152381 -97864
18409 195950 360515 326513 -107035 -42269 318812 117950 427111 34004 237853 143551
18399 143551 108522 136204 213092 152077 -274977 -156514 155502 -301112 -30584 168700
18388 199579 -220688 -84585 -207233 -89633 -277889 72807 -72208 357909 -53817 179486
18377 -230399 114727 174134 -29153 15872 42217 -126834 14608 114140 -110077 3741 -6514
18365 4157 85144 -2613 -368924 164306 -254267 21660 -35315 33281 157249 284639 16365
18353 -129813 28112 -206827 -180702 -133989 132996 -309843 -194724 -236757 49729 54870 -175780
18341 -219294 -26084 10093 20840 -219052 -66931 188811 11744 245592 -187943 -194781 -162792
18330 -162792 -111987 -228526 -121161 -119452 197085 125683 90179 -163020 -100947 13949 -299809
18318 5078 -237201 -1879 -95890 -130212 157538 163052 -412410 -26881 -297315 23476 77544
18307 77544 154030 35723 -254594 63796 -176708 -123911 -268829 -44884 -243750 -111358 59436
18295 -168026 25925 -56680 -2501 31523 -98513 -210203 96990 -216340 -38494 -33514 -40400 209087
18282 -320408 -45922 168518 -9773 583770 -212197 -291575 -6854 -95623 -122205 98590 -70574
18270 -224461 140038 -252874 73141 -283305 53732 -128982 64204 -133649 -123240 192929
18259 -54847 -178704 -113236 99524 -111475 2681 -515477 108428 364415 110539 -22436 -21061
18248 -21061 -139930 -213299 31353 -107345 -240588 -152006 236982 -82080 -192504 10134 -130158
18236 -353480 -223480 -122514 -408899 -136317 119561 -59146 -71372 -156664 -34263 805 -113279
18224 10003 146696 -246294 8327 -60924 174154 -154406 -79003 -197712 -143655 323789 -9412
18212 -240704 -337699 25274 -281197 -240311 120967 -12635 12305 150339 56406 262380 -43427
18200 90200 -127874 42819 -376426 222224 83669 -139516 -82930 132636 160897 406281
18190 406281 -78203 -108533 -59264 107228 208877 44420 151593 -190078 -49211 150611
18179 -12864 72606 -63731 -51673 -136240 131073 67317 -150458 -167029 130711 10534 -13674
18167 -308492 -210570 -150667 262184 -246129 -15520 106406 146310 -585487 140097 65529
18156 333310 59073 158473 -116398 82553 133983 102878 250964 -372347 14605 -72210 54513
18144 -34754 -118660 -67879 -495209 217962 -82125 -15689 312680 344384 41770 26208 81432
18133 81432 -34317 243051 -23582 48003 -43545 70673 -30876 320811 29057 -317085 -5977
18121 -215884 63843 39969 -32416 95858 30743 -160126 -19880 70411 21889 144061 -70866
18109 267639 17189 -127382 -214639 109304 -208507 169116 -141662 222 -248602 -145653
18099 -145653 -210548 -111366 407648 56222 32525 236353 19826 -263170 -20084 337649 24684
18087 -24607 -161905 -116038 -220609 106455 -135488 49187 119648 170748 263344 275426 -10913
18075 243474 2564 -101222 -494386 35949 -86975 -13011 -251099 448291 -178007 -109292 -179180
18064 -179180 110166 -5862 -105705 -15785 -137086 -36724 184692 2295 -170748 -31558 -194043
18053 -194043 74467 -168733 -228257 -143690 -349118 251500 387664 35579 275609 158155
18043 158155 -114403 194003 -116009 -23403 328729 82812 -466342 -4764 24658 -222764
18032 -160222 66885 145132 -134466 -287850 13998 -365120 -21759 1853 -182699 -186760 -123227
18021 -123227 -206080 -176405 341674 99195 -53040 -49314 -262998 -268298 21536 152759 -205010
18009 -3415 -252273 6177 -62226 38412 -117474 169936 -107055 70585 203806 149516 -259551
17997 -286356 33592 -161449 272985 -100919 29441 164845 186722 -128496 -95265 62778
17986 62951 -113234 71464 124317 -90791 -334635 58539 104252 -17674 -79813 52911 -186816
17974 -218978 77804 -146160 -140265 -74561 26716 -105066 -185476 98507 -94233 182383 185231
17963 185231 -65532 291442 101978 -1468 -99604 -2854 -122662 344717 11025 381117 -229302
17951 -39997 171835 11125 -201369 -81710 84697 -326155 -384721 17183 69215 -78902 71036
17939 181749 -149727 -81278 346737 -36208 -147177 272632 -140546 -128723 10116 -258333
17928 46409 393288 34527 11450 251483 164310 172563 18778 -89070 -131746 117953 -121592
17916 -160836 120506 -306916 -85430 64229 -169143 -100417 -115313 -253836 -54434 55546 -170906
17904 389597 -61110 -181059 -310734 22541 61591 14522 -309532 145646 270717 180078
17894 180078 -92103 111255 11199 43135 -116592 205790 196338 -172062 207199 -304893
17883 94008 -43890 -27463 -207311 -165503 80115 -62595 -116959 -224510 5271 -65330 212228
17871 67801 -68826 404837 -41247 129691 42130 326575 201679 -456064 -155957 -213725
17861 -213725 222383 -159518 68892 43807 100177 -293052 93734 -296394 -74217 -62775 96793
17849 -297035 83044 297971 -67592 -101106 -34056 -27039 -11713 -29466 338875 192784 -75960
17837 -18009 -31449 120404 210514 173108 150784 79120 -311789 -78190 46811 18990 -487610
17825 111986 127365 128215 -185993 278106 -134097 -34065 -68267 -183466 47971 -71289 70209
17813 -267385 -66836 148733 -174119 -187742 142939 -8717 24883 -288674 31450 -183787 98105
17801 163299 -57448 110116 -55544 40789 -103731 284825 -262358 -74976 178680 222015
17791 222015 68180 302344 405310 -400003 59022 109602 -179813 64003 -54972 171901
17780 -92838 141076 68284 18894 -134769 304033 215530 -6680 93329 -74331 15444 -235836
17768 -31765 30749 -286063 18441 133914 -47110 6871 -233766 -4097 71799 -75800 -202670
17757 -202670 -273285 -4102 83528 301526 14118 288434 -168110 -223256 -46909 -68107 -15212
17745 -120044 182357 -103496 154777 -67934 -144963 303997 120196 -118827 372362 143358
17734 147227 -297593 1025 72965 65642 -89707 -248996 -113643 -192885 101858 -39752 -45205
17723 -45205 46138 62702 -33559 -126936 -71493 -153626 136782 -1302 -7280 -30847 -63519 71199
17710 9253 149273 110638 100142 58806 97047 111939 -156241 -24707 211645 -11475 308357
17698 61819 -126923 -11809 45678 -199084 315285 21878 -13682 180465 -323038 -137354
17687 -136856 -26040 185534 416241 303004 2025 115403 -104885 -85797 25983 293453
17677 293453 3254 -66134 146073 -44512 -84948 -167483 231402 -30437 -169409 -33609 -70221
17666 -70221 111691 63953 270733 -249521 35253 111719 97786 -48741 10240 188937 64820
17654 -14395 -170366 233067 230406 -120196 449311 -115002 152215 -51759 -62274 -11388 155144
17642 -95674 111518 49274 210598 71109 34201 98904 -25103 55866 35306 4137 441318
17631 441318 -7267 126171 232927 -67016 -43179 62624 3950 26782 280531 -111894 266488
17619 -442666 -69904 85527 -247621 -156854 -164417 22960 -316139 -14991 405639 -171003 131494
17607 -97549 -103673 -88665 47386 123690 341671 -186252 85805 -195254 -76451 -53871 -115891
17596 -115891 337489 -249811 214561 182442 61984 219053 -206398 -18578 -273801 -272398
17586 -272398 150591 173033 5757 92171 133608 89806 -20925 -121900 181220 121686 16182
17574 119300 384991 227825 88560 -121845 6403 -111486 206764 -124309 -40597 268320
17563 65512 222950 126867 347499 65517 165223 -83301 74313 67363 -25400 295317 160525
17552 160525 108082 -178569 123971 19620 64846 326601 -138677 -119785 -291 253618 55453
17540 225514 -155687 -261944 127337 38375 -137402 359888 61437 80012 -148134 217439
17529 207414 -79398 -269503 -250006 67895 -244120 -118092 -183108 65802 -128563 208163
17518 7771 20055 46977 152050 186232 179859 -16160 100569 -217864 -119769 445260 220297
17506 28661 -226099 248782 123805 -87121 183860 163023 175239 223922 -158118 283097
17495 126163 120824 173804 -55328 142344 112296 155349 233929 244361 -106525 300875 56696
17483 -8827 240650 107605 68248 288834 -96183 237067 413995 142875 -19126 206368
17472 328756 269233 551173 178064 -44998 -40611 213797 6270 206856 232400 -13504 184556
17460 83099 35880 -30007 202526 270083 224599 27118 363971 167868 -12931 168132 307133
17449 307133 350296 246965 333072 227449 124534 52406 334637 -148913 12779 -80775
17438 -5948 94319 374758 549411 285262 229608 189961 379304 -27840 164527 -204239 24782
17426 244158 307358 147489 258177 284011 81520 -16087 75118 404092 177975 323920
17416 323920 340167 -6760 519110 180135 317564 176944 78457 261959 420306 54554
17405 301598 -179840 122095 88402 187136 406681 143333 333528 421125 83766 222435
17395 222435 161752 201575 -21040 168641 129527 8273 38301 155305 -61645 23385 195598
17384 195598 200434 216800 402840 296967 307354 73806 107056 -240599 26990 193568 490615
17373 490615 126838 469636 284362 422012 -25173 -8352 248628 330346 95669 450204
17363 450204 38542 59497 118182 27417 -65378 112115 -95662 135646 183114 358660 -68389
17351 195903 124271 212530 -219314 40246 136016 451258 63704 -3819 -76997 418070 98193
17339 107140 281324 200580 143704 178806 374685 184242 -145752 402963 244078 159290
17329 159290 299650 115464 51222 -225864 100465 -65293 212683 134845 136092 40846 332106
17318 332106 195535 -140843 199602 13956 234970 215735 364892 95232 236921 223383
17308 223383 239282 236025 182938 119827 4992 324544 276344 349820 10028 -9919 149467 120544
17296 120544 283096 115509 525091 -50367 235126 204591 111236 210813 398970 328583
17286 328583 102737 -31962 80105 451370 116185 144484 217822 287873 41922 376998 -6915
17274 14445 303487 -24994 10569 331360 140072 144133 192715 295891 -64625 218407 499531
17263 499531 -13979 155386 223229 43726 84142 277917 105623 241565 185337 186827 360956
17252 360956 149433 200888 50285 -46246 282749 232034 191174 378903 420738 180278 -53254
17240 57057 331040 316072 181772 576625 43107 322417 164866 301669 185729 88181
17229 264237 278411 161826 16566 357951 338935 415576 60234 71053 111877 2805 262209
17218 262209 291376 53404 211217 103733 43808 18990 166180 103751 182676 33046 588655
17207 588655 60259 299628 326468 154951 565463 140041 373612 137971 34862 260543
17197 260543 174160 297575 115931 404758 195582 177894 212866 198103 386760 192360
17186 299630 257999 319033 -262681 -60739 141241 421463 136402 79915 -8771 206940 243883
17175 243883 225587 493727 422370 407358 -35849 426181 -31333 249780 275238 439598 173600
17163 429993 469623 54758 243359 169189 289448 237385 287028 301559 384949 585812 275517
17151 28225 311055 4387 688466 282178 250632 568323 400568 538153 137529 708503
17141 708503 380852 269442 345911 433088 307466 256090 376750 305085 185743 410350
17131 410350 396033 451217 216128 406636 320071 387836 -25090 306421 256647 254830 416409
17120 416409 367597 328180 466140 357586 183913 84055 508031 305518 449422 348190
17110 348190 115679 165181 414120 204286 479004 397663 144062 367184 519048 412978
17100 412978 624478 347207 128512 379700 175632 235585 212897 348257 298530 515911
17090 515911 283408 521835 203620 428275 259702 345714 487674 412760 287037 540602
17080 540602 467574 327716 801956 390987 161432 808983 683514 437930 494346 470745
17070 470745 647913 388139 546799 242787 431646 395007 673010 421048 360000 532710
17060 532710 649930 482620 812697 304623 340323 585484 399334 659229 566645 238654
17049 405855 422912 461799 456571 721925 552076 618985 312931 681503 453581 668276
17039 668276 642129 524967 591717 444904 515507 528911 305659 778162 528886 592001
17029 592001 444383 558808 522140 473397 669693 655639 705607 557558 622524 387435
17019 387435 746493 450895 633048 771687 696654 700486 814209 623102 872866 873628 1123373
17008 1123373 646041 1034652 602183 949696 735209 688816 876097 695671 892882 495228
16998 495228 298612 1068983 708101 640868 899243 806505 991182 912075 770834 718983
16988 718983 975965 877874 662845 795378 889718 790773 959253 859021 757166 955120
16978 955120 736914 1190086 982759 730239 1060646 830878 749809 895327 1060072 610983
16968 610983 825376 953382 909228 1216959 1030815 992637 1014121 1169497 1316266 653370
16957 1055536 1326424 983601 1232545 1211017 782174 1106925 1030703 1167329 936432 1008735
16947 1008735 958510 1115829 1204050 958985 1131469 1162162 974904 875659 1345858 1018196
16937 1018196 1133295 1203509 1115319 1300084 1349373 1256847 1450746 1246516 1307219 1183968
16927 1183968 1196289 1181027 1382608 1048099 1302783 1488339 1799108 1427579 1694794 1549716
16917 1549716 1279835 1612906 1538718 1586616 1329642 1234343 1115085 1602401 1685710 1537552
16907 1537552 1646901 1888846 1661633 1496671 1623538 1607624 1601605 1499423 1710404 1556724
16897 1556724 1965383 1902708 1585256 1577379 1693839 2231703 1949962 1920291 1763728 1833229
16887 1833229 2119121 1771804 2112028 2169017 2347707 2124334 2136860 2084057 2142774 2038842
16877 2038842 2413162 2281624 2195506 2081228 2614475 2249020 2402158 2728726 2821052 2304812
16867 2304812 2294376 2662348 2432627 2303135 2680998 2812633 2827139 2858241 2498801 2695193
16857 2695193 2951831 2924025 2865652 3046998 2815330 2910508 3248006 3391375 3247547 3163039
16847 3163039 3252217 3106334 3352389 3510239 3279065 3269636 3676172 3777586 3651258 3849347
16837 3849347 3944764 3802532 3846427 3294497 4238850 4133917 4088789 4436606 4397310 4233501
16827 4233501 4417066 4605866 4708570 4552984 5023986 4749813 5022501 5164876 5227022 5262436
16817 5262436 5477485 5835885 5458705 5752794 6154805 6045309 6026210 6369553 6329221 6734344
16807 6734344 6447723 6781026 6766944 7238083 7290651 7531912 7449127 7500647 8043841 8050566
16797 8050566 8302082 8401041 8569041 8692150 8824858 9478627 9361013 9869021 10005658 10085460
16787 10085460 10245877 11119251 11430454 11797238 11542821 11777774 12576202 12771761 13136014
16778 13136014 13570903 13836088 14374871 15084126 15209499 15703411 16270764 16546242 17453987
16769 17453987 18039042 18440030 19155894 19715427 20582020 21251974 21821049 23101939 23958120
16760 23958120 24551160 25527553 26887676 27753113 29085625 30172345 31439550 32711462
16752 32711462 33955753 35681536 37612076 38985266 40843100 42877788 45163964 47425298
16744 47425298 49773198 52568878 55201915 58281578 61576761 65309217 68631810 72864211
16736 72864211 77052642 81451758 86157269 91367642 96583931 102586009 108521932 114695262
16728 114695262 121223780 127958919 135285480 142316913 149182592 156253183 162828262 168882543
16720 168882543 174102483 178778441 182542363 185060893 186144598 186012255 184479688 181727552
16712 181727552 178126546 173069196 167856211 161002284 154177143 147178460 139543542 131786274
16704 131786274 124662084 117370531 110483567 103626861 97591523 91721596 86215634 80871014
16696 80871014 76500818 71342445 67192577 63546982 59548969 56551783 53364919 50477421
16688 50477421 47389757 44862934 42724665 40117877 38284696 36477934 34443063 33114746
16680 33114746 31475173 30252084 28453600 27477985 26145804 25064587 23835301 22996570
16672 22996570 21840181 21087088 20302673 19388053 18768641 17972411 17263227 16928886 15957083
16663 15957083 15724066 15178835 14533736 13594364 13411483 13058833 12228340 12119804 11489952
16654 11489952 11485645 10698179 10815837 10242738 10056977 9992929 9327902 9145362 9215256 8707780
16644 8707780 8483659 8363087 8184981 7755509 7454042 6998994 7144244 7251772 6759591
16635 6759591 6509803 6453528 6537813 6090838 6199301 5820268 5810933 5693268 5645472 5182433
16625 5182433 5131194 4856662 4849087 5130662 4737526 4151757 5023492 4491384 4338068 4475869
16615 4475869 4514853 3965325 3957394 4028327 3843448 3675398 3446978 3747887 3643933 3694293
16605 3694293 3763197 3364711 3030785 3272700 3292934 3195221 3304775 2955443 3029751 2507005
16595 2507005 2746734 3060365 2691651 2774429 2804697 2762250 2833134 2443510 2412042 2773242
16585 2773242 2502300 2360263 2227961 2091791 2063034 2306767 2317776 2098482 2012785 1935073
16575 1935073 1914830 2105319 2110955 1957264 1707186 1936515 1846469 1615885 1840565 1824081
16565 1824081 1625450 2062977 1488187 1977961 1584423 1700710 1541990 1603718 1374930 1548491
16555 1548491 1298448 1500795 1514767 1244965 1434649 1403258 1474631 1328197 1357724 1405228
16545 1405228 1445355 1404786 1331676 1185719 1027510 1180784 1000425 1071591 1070332 1441674
16535 1441674 1273612 1208729 986880 1182491 1109963 1053580 903866 1268075 975450 1042662
16525 1042662 887621 979794 854227 1133840 815395 827891 1021747 923316 730958 1002028
16515 1002028 772484 741114 924523 701983 829442 1112971 696391 694805 724156 909773
16505 909773 566679 667754 618642 657224 638301 736338 604422 902850 919610 698111
16495 698111 410929 795830 770347 669629 584648 886904 682517 858578 469322 847726
16485 847726 749005 405570 425717 298776 363369 672895 877114 518874 596529 726570
16475 726570 900687 1011478 694208 579233 415403 594747 424843 531425 656071 708553
16465 708553 317915 804160 342195 340242 374307 521000 437461 477305 288977 573257
16455 573257 394741 234008 589704 651810 58043 578148 443142 191577 378015 641466
16445 641466 402320 551131 410255 767774 -17354 197642 348785 306682 612984 224177
16434 437599 286845 41921 312260 338208 -31369 -77260 434865 -16188 248787 583870
16424 583870 373013 363237 455647 510963 406916 193655 416336 56274 337763 571128
16414 571128 231557 293470 111757 186169 604428 452680 411682 382689 302055 197055
16404 197055 400450 405784 328645 83092 351676 451759 430685 442830 214038 426028 335506
16393 335506 230402 289859 318263 535777 281322 421875 -72165 224216 -312890 396585
16382 360202 -46504 124295 359616 259638 -6536 279309 182212 -181170 173316 289925
16372 289925 275584 110658 3151 188019 413399 81107 95412 491815 48595 259457 522480
16361 522480 315637 -35099 227660 144118 65376 341181 282491 39867 181548 61041 -19724
16349 71459 124896 73542 98182 155848 -167172 168066 -169745 170460 215371 -165142 320296
16337 437660 -103930 -102463 206553 77781 321043 375122 433459 230729 38345 267551 126740
16325 -26641 76793 131865 -120927 -94388 148563 -227194 370651 -77767 70462 56670 101195
16314 101195 420 170700 -4142 -264809 294448 98598 349656 212032 -129565 138185 390099
16303 390099 37976 -107115 151720 96837 105817 -48797 193802 -265799 132832 287854
16293 287854 163212 113728 -75897 149552 127870 240320 48566 109249 384200 137203
16282 139305 57347 397715 243046 106630 27091 195368 217347 46315 -107493 -92216
16272 -92216 -22299 219466 260095 -133768 -135760 10475 -95091 207362 274366 75246 -15815
16260 -59175 47693 290766 405807 -72707 383873 116577 120583 -63449 -22665 -44493 504363
16248 180603 129466 5508 7400 -331361 226767 -17824 -451279 -91284 -25755 -276129 300645
16236 -256782 -143390 54705 -35131 -7692 188009 340184 -201439 201651 144935 61584 35162
16225 35162 -186601 -14192 -115971 26703 -49549 -122460 -47485 262108 -155043 182192 82610
16213 306240 73813 -31240 -160255 208344 -22442 177881 30388 33113 180049 8233 26213
16202 26213 -11852 159983 -191173 -191909 147661 75005 39444 -165099 -154577 47235 118877
16191 118877 -369057 -134250 188503 -402174 114384 81556 408877 -52080 157393 99189
16181 99189 -120114 207462 -176609 228149 -276114 -227507 130811 305518 -14924 30812
16170 -108637 300515 23627 -55608 -354118 -322058 -45436 19244 136174 174641 -101919 -123770
16159 -123770 -119794 230106 -29428 82156 182667 -164219 -192421 179530 -83327 -266185 190605
16147 29785 214669 -91845 -212046 24725 88493 -112395 308969 -32722 -406730 39704 -189859
16135 29591 101215 -8606 56194 -131381 -125326 -300713 -21998 47219 -61850 310452 136195
16123 138888 57459 136602 56106 68163 -151426 -173595 -17864 -335096 -39854 44857 -164370
16111 -130871 -73085 -6391 -595671 -220288 -65829 -53184 -185140 130098 395726 -47685 24949
16099 -91948 196585 251399 -162512 173892 190846 66674 61072 23891 -223880 -193703 -101375
16088 -101375 109908 -76161 -4847 267949 -111791 101770 -27530 -74480 50487 -171578 31669
16076 -159602 -144106 419517 -70641 -141305 160200 -56280 28590 -30191 -221125 -13051 156710
16064 43363 190977 -214688 -145780 57615 -76140 -165482 68933 -135684 55990 -248460 -126363
16053 -126363 -72680 17283 54636 -119159 198961 -178921 -444573 -91837 -75993 73806 108270
16042 108270 -22444 53828 -162855 -6369 41268 217381 355256 -243741 -208599 -5186 -101397
16031 -101397 -15250 128395 57738 -5425 -163951 -162 -77338 -51970 337770 -73919 -50568
16020 -50568 91851 -23985 114612 61314 -65297 -304990 -288450 110169 17364 193221 170804
16009 170804 -87163 284695 36484 -121519 -99123 -246804 254069 -257988 -156667 16470
15998 -53691 314829 -47354 -123036 279429 -223671 -7915 -197018 -50545 -290113 -208880 -56311
15986 -290450 -64374 -193316 607485 245122 427972 391617 162186 111026 212738 130183
15976 130183 -20740 278958 30382 84 -82877 253808 343480 56546 -179007 -63593 -180539
15965 -180539 -247171 -178418 36654 -99026 168460 117702 86489 -217599 -105179 11068 20134
15954 20134 -14057 -94743 -207992 -190639 -45622 71966 175591 33629 -357030 -173185 3217
15942 -202813 -9737 52016 -154503 -63847 -73360 -32766 -248365 -270998 146334 -161884 136726
15930 -116849 -193926 79638 379329 -55673 -540167 -38845 64704 -20767 -208724 -133069 -27125
15918 -227112 -290846 82037 -244434 198427 -28931 -59953 93229 -3251 72835 -96909 245291
15906 -283325 -253165 -54068 282763 -120587 58420 -68503 -119671 -19012 -294495 4072 -11166
15894 235661 -49897 -177516 10206 -354006 -148528 428757 -62520 25569 -118940 41976
15883 169289 -334076 -80754 -11880 -61863 -195528 70112 -369378 -178017 32431 -51506 133484
15871 39285 18092 310134 67776 -67039 -205672 24771 -138702 21 -241146 213965 -93826
15859 -46138 3502 -102001 123540 158137 -191566 -92339 -67908 87363 34535 -7720 290197
15847 168317 83306 98339 -21835 35477 -89881 -44288 -140997 51048 -171250 -81307 132452
15835 295313 -487250 -87081 42230 60847 -242727 -308828 -310010 -422264 -206022 70969 200462
15824 200462 -37187 -92384 180153 104349 -218284 -31632 231537 -279263 -130258 252304
15813 -250571 -93036 -90533 -137943 -133686 -126416 -164189 -77622 -76893 45831 51699 -67102 -146075 19406
15799 -167351 140827 -85983 24518 -187600 -215670 78755 -195668 12924 -129738 210768
15788 63856 253347 2746 -306500 198507 6683 -148192 101506 166743 172118 -87443 85871
15776 203190 -38085 -140051 121640 -306086 -1121 97837 103411 -90122 -440794 176107 63000
15764 -164275 -224329 -201437 131967 49708 30393 100966 -232228 -2474 241707 131063 -182754
15752 169571 -71533 76408 -89352 -25885 -5847 -45135 22744 144828 -238596 37919 -85970
15740 -135335 225510 71324 -42078 -31420 139630 80890 -110214 -268675 -210438 -307886 -65395
15728 -155908 13753 -258815 30737 -19592 -34271 201919 162367 58180 188857 -210018 67325
15716 -129542 -125986 -138 -171776 -841 146815 -46579 9705 -287995 90012 57060 40130 -74423
15703 -170058 -168878 103272 -147732 -71997 -82428 -55885 -156262 59860 75540 129739 322004
15692 322004 -82513 290585 134489 34403 129001 16085 -32874 217819 293441 -369602 -3738
15680 53404 176497 -88979 -154609 38000 -205610 -98121 19608 -122130 139292 70376 -217729
15668 64347 57386 178797 -107571 -93104 233632 -38443 123369 -195008 -174579 -43981 -177417
15657 -177417 -164140 -76750 189313 -120444 316282 -34169 11402 67560 54986 -803 -40578
15646 -40578 -136648 -293034 -198696 126686 181396 118344 14795 133881 55341 -198485 -193705
15635 -193705 206425 208441 80408 -182170 20248 -129523 15777 -191090 18030 -25714 367432
15623 -71089 -256559 -99412 -259637 43675 -71239 95011 213561 141830 -271850 -11831 -417319
15612 -417319 -49106 -13072 -67557 71616 130175 -104687 -9181 -30148 -111787 -17120 -72062
15601 -72062 -300214 -210396 42266 -110152 -119359 54719 60756 190520 87742 -71230 184599
15589 -231445 -257057 -157507 21417 137730 174277 239483 13936 -95744 38609 104683 112401
15578 112401 123672 -91909 -326273 -123184 220075 19171 -157212 33907 -236880 -381457
15568 -381457 143803 -217087 -70177 -3414 -126090 60573 90191 -293322 4776 123077 72766
15557 72766 -60165 18479 -91685 -158405 94478 -275872 3321 276264 65608 191352 253462
15546 253462 -8496 -131060 -137602 23945 184357 220714 144086 -9475 84668 -96659 77581 -35573
15533 -232672 49283 -121287 252161 73892 7428 -209910 34400 65499 -353227 -55421 21137
15521 41070 288957 -173129 104053 376053 -86996 -116674 -192237 -80900 -154551 -221427 107988
15509 -241806 87116 240740 56329 -183809 -270505 -153641 121915 38642 -115852 47717
15498 -86006 -169399 -30382 -87471 -197636 -179224 -222163 40262 -129864 284092 57917 -923
15486 24658 -191053 193300 52410 119316 131410 129261 -177347 107503 -28560 -379279 30619
15474 -50810 -4965 195470 -154497 -155783 70906 -4373 -9487 -136979 323300 -57733 -110359 321898
15461 149491 -2202 -154767 115290 174161 -156682 165823 -24890 112961 -214355 -30574
15450 9685 93682 -159479 345176 -262304 -197782 -96123 -52546 5584 -160364 141064 -260229
15438 -13953 28917 -22344 118082 -20837 -168284 84593 -443239 289800 60605 -31088 -233881
15427 -233881 -196853 97644 -250970 -77721 -19022 -151209 -21234 30900 93813 -301292 200870
15415 -182773 86329 10749 -102031 -50807 -146100 -257454 -256325 -32073 -36347 67120 -387487
15403 88609 108556 -122282 85652 25244 -179515 6615 -154602 190775 55436 -48010 -125260
15392 -125260 76364 -169848 321041 -99803 -195992 -193280 -41087 109972 90572 -187184 -69574
15380 -19610 280680 4611 146212 124544 15035 128790 -54463 51571 -136355 128864 286909
15369 286909 206483 -84947 382653 -317989 -42417 56927 296515 118841 199886 -61767 10142
15357 19751 -27138 -122511 -50516 215607 -22106 96083 75387 -215989 224160 -355366 121560
15345 -115786 -83121 -202290 -215418 51024 317147 114249 204819 -120087 -197221 -12313 63182
15333 -71893 162598 128157 74477 -112187 59637 103101 -70475 239453 227020 -75243 53057
15321 201691 40046 134187 138687 150431 222266 216705 -106376 -112192 277703 110353 56141
15310 56141 -97664 -13558 186196 -72277 200515 69733 -195293 -188186 -42755 -18537 172306
15298 -126181 -8138 128254 183573 -100538 18382 283963 -69784 -77535 -229759 -167923 -136372
15287 -136372 45562 212821 -47668 -83619 -101188 -119735 -184805 150510 147605 -120540 89036
15275 309346 5347 -171564 80561 122257 -331143 -68148 233555 99117 154127 34721 134428
15264 134428 -10365 -12452 116444 326990 42095 358307 200506 267052 152415 -12531 230030
15252 168482 -91433 -79532 -80067 20174 267034 499423 1039914 1514371 1072026 1754780 849706
15240 292300 191108 154420 -130606 5973 251368 291365 271102 -264810 347719 -23182 258920
15228 84599 -32651 -25196 72202 205988 -80732 -398199 374643 229694 -114667 260936 70440
15216 -165807 -4498 281659 -149252 182887 124491 31899 -67291 164336 53388 254781 -343314
15204 134203 106301 84104 -172960 93921 -64200 129701 92111 -124182 -146959 82987 154380
15193 154380 -104405 91486 -131284 -72456 65043 -95631 126135 50606 -27378 235954 125709
15182 125709 227108 302662 145034 -126214 237117 225738 395649 31370 -95401 259556
15171 41783 177529 99420 -292466 -32632 64205 123566 173392 328431 -168660 -79364 -150912
15160 -150912 23902 -147825 -4457 -219181 11077 290695 280165 436695 261702 46145 -222313
15148 25356 -54814 309752 170934 78752 -28364 -35056 209656 -188924 22728 116681 271329
15137 271329 226566 55633 -82650 349699 -161411 243145 -129311 11926 261673 126828
15126 40720 115315 -258481 122936 74638 357825 -94156 112022 253316 295830 61042 215140
15115 215140 87773 243941 -80824 15156 -44569 321338 -90769 -257037 -81927 203740 40732
15103 143670 76570 252382 509734 35314 140093 65828 -198491 4119 88665 -226214 343715
15091 451557 15550 -125415 191647 150258 348650 39946 277209 192225 -140324 -40504
15080 247645 246267 157021 250523 203828 357519 -57945 107047 -17702 -82673 212400 44890
15068 166666 533515 183265 170047 334701 271510 47496 370100 104228 180397 158553
15058 158553 229028 220700 75951 118834 297178 124603 -95540 96691 25829 117642 309689
15047 309689 6960 270887 178381 120556 239869 261161 251470 175208 198668 259054 340842
15036 340842 216102 303342 -43991 368034 60215 265036 17225 172780 118587 289144
15026 289144 93522 185473 116916 31752 41129 10763 183070 367718 210522 -130027 90411
15014 25898 -77095 81693 297668 404338 330369 127147 350991 438452 231113 82230 727435
15003 727435 -56636 351634 76289 99180 -189832 38743 152235 71640 299812 161558
14993 161558 -29556 31929 130821 273720 100210 156916 338574 211298 264495 569365
14983 569365 161485 181033 400297 -93535 452215 323722 272525 -30801 460183 386404
14973 386404 312210 86882 45056 162746 432819 103935 277217 219206 423731 -14800
14962 223170 218779 468936 269904 375767 -49865 64370 284890 350269 283321 149701 183258
14951 183258 169210 339673 451233 -25047 177223 199593 379479 86011 275143 442609
14941 442609 219856 288964 401217 256197 270859 344553 377703 197590 492680 44573
14930 379363 472072 491707 210421 304447 277732 410866 118027 45263 307216 153869
14920 153869 33185 379539 54486 117826 591691 218973 368139 519017 541970 597012
14910 597012 204928 558627 121016 184281 242521 293858 476694 249139 294280 167943
14900 167943 53561 289235 245412 391412 87956 261028 245997 200835 324880 366476 10739
14888 29647 274191 381613 102075 155314 215784 43111 312255 220060 537206 481606 216732
14876 343797 376432 490112 571682 345926 171432 194285 176998 160283 342147 270053 199444
14865 199444 130667 167034 330256 527029 374440 588847 518279 620993 112345 406367
14855 406367 304662 302251 647519 482028 363639 70450 127081 588051 456675 569651
14845 569651 876121 451762 466928 204057 581678 880650 486913 709099 721670 695879
14835 695879 332668 229008 324505 284299 288168 415654 569674 408261 569860 711768
14825 711768 356832 422534 473990 355869 577755 464004 520414 298153 346634 362367
14815 362367 240456 518232 572320 543341 386185 341363 261402 523880 398439 505326
14805 505326 538277 299382 863572 321682 345684 611974 636717 568841 817417 605353
14795 605353 279431 334256 646014 391127 336110 366321 626679 514226 596923 802175
14785 802175 573096 471673 458414 540795 346320 781569 711156 517018 821466 425461
14775 425461 638089 615174 475237 247989 396948 443285 518438 811938 590873 598989
14765 598989 517961 556834 515149 374691 568415 659070 509613 613691 437904 656434
14755 656434 520763 543417 584821 474537 525183 687053 600852 409857 492326 710417
14745 710417 559637 683431 816667 640530 571872 842929 404716 514218 643877 668474
14735 668474 1152911 529127 553909 503677 827200 703930 839611 680918 608273 683980
14725 683980 886154 657175 379176 1014829 678394 596133 588061 821583 797309 616738
14715 616738 672046 694573 762027 881712 711474 918714 899163 589665 824689 852974
14705 852974 690849 719697 902315 738894 640867 575379 932842 982342 739736 715136
14695 715136 664599 850003 1028848 635081 938644 972344 713801 749134 983775 1001891
14685 1001891 1121786 789589 1017484 759558 1207932 957519 1183781 755468 897432
14676 897432 998029 699089 857032 883923 1147623 1317205 1051618 571510 821751 628488
14666 628488 1075946 997954 1167433 985389 1153288 983646 865635 890095 1274247 920077
14656 920077 795713 1374468 872217 957805 1133772 1335641 1439795 1157413 1109005 1149351
14646 1149351 1028493 987281 1027172 952745 1018383 1172527 1231332 1170648 1228538 1359756 1290750
14635 1290750 1278274 1358915 1184445 1326954 1232711 1276179 1248703 1476143 1425848 1340897 1122807
14624 1122807 1312224 1337304 1146879 1453442 1354815 1399469 1269952 1457465 1434955 1529331
14614 1529331 1194070 1490051 1369873 1536532 1564266 1481622 1380102 1006697 1207335 1465149
14604 1465149 1468246 1729208 1372787 1498989 1427591 1254210 1772651 1261273 1557220 1957156
14594 1957156 1649947 1375161 1971018 1456630 1574388 1924714 1737739 2039281 1972982 1966914
14584 1966914 1887423 1573643 1664415 1891030 1936014 2063133 2095706 2182365 1984654 2105405
14574 2105405 2153234 2119118 2184797 1762476 1985461 2075417 2239999 2404488 2349332 2499962
14564 2499962 2206015 2184617 2573411 2601323 2704140 2692782 2838797 2921900 3154581 3022277
14554 3022277 3466389 3635046 4147812 4347466 5665064 8004441 12035886 20836541 41552663
14545 41552663 38509984 15358982 6901498 5219139 5094755 2817945 2538950 1955232
14537 1955232 1905248 1776455 1882554 1847139 2065403 1968055 1996236 1835666 1752641 2026105
14527 2026105 1950499 2052847 2000834 2168434 2319055 2185044 2494292 2437411 2377330 2364185
14517 2364185 2371835 2425925 2494632 2627688 2517027 2765025 2621286 2376621 2697847 2737043
14507 2737043 2731808 2441390 3172148 2745080 3018307 2791242 2599308 2745663 2951395 2877570
14497 2877570 3102040 2743146 2937400 3022844 3278066 3206981 2954518 3513529 3161660 3464153
14487 3464153 3450493 3653364 3469024 3639752 3905317 3697607 3401794 3637946 3717299 3586849
14477 3586849 3789453 3548746 3804062 3826647 4182058 3889149 4115314 3961237 4198938 4149169
14467 4149169 4307964 4200140 3945830 4406376 4071273 4023721 4437879 4368193 4619437 4467180
14457 4467180 4712566 4801956 5072159 4866786 4711389 4997354 5042743 4878238 5098873 5180327
14447 5180327 5050668 5446146 5174132 5568045 5501186 5779440 5787603 5953082 5760413 5856726
14437 5856726 6162955 5733827 6132535 6505144 6199580 6747118 6738455 6609238 6743707 6820974
14427 6820974 6855188 7052323 7093140 7260429 7023841 7360325 7605735 7243784 7333241 7707128
14417 7707128 7709489 7969845 8136206 8284967 8235806 8198295 8466018 8867831 8515441 8492979
14407 8492979 9142396 9170849 9226859 9151261 9440144 9623718 9655873 9903009 10179402 10302092
14397 10302092 10497170 10837851 10903127 10998451 11138072 11299389 11579197 11727477 11824038 11981225
14387 11981225 12646666 12698157 12892133 13212290 12978592 13727731 13642561 13871718 14230533 14711263
14377 14711263 14580068 15249475 15288436 15815039 15543692 16350721 16706668 16993929 17094145
14368 17094145 17662783 18153060 18752434 19096563 19214129 19489715 20022301 20942650 20823402
14359 20823402 21608067 21917085 22275424 23159386 23463319 23777558 24708326 25145892 25818647
14350 25818647 26503715 26921150 27953431 28357755 29124911 30029251 30769737 31863810 31940236
14341 31940236 33050018 33698289 35067465 35780150 36905140 38143731 39070182 40263171
14333 40263171 41285852 42463661 44156380 45066805 46696591 48126029 49922340 51378286
14325 51378286 53177766 54776431 56855518 58729685 60474786 63047010 64987827 67412000
14317 67412000 69885738 72082252 75100858 78116671 81427297 84652807 87509729 91793609
14309 91793609 95057395 99336348 103388292 108000535 112565279 117876401 123264405 128946846
14301 128946846 135328665 141941187 147856717 155269241 162625850 170627924 179250979 188043304
14293 188043304 197538417 207345384 217723520 228905125 240700981 252554427 265220312
14286 265220312 278410948 292115870 306391279 320691337 335504822 350191002 365185928
14279 365185928 379630529 393528022 407079396 419324836 430631224 439708197 444096912
14272 444096912 445725497 446882063 448113524 447471647 443491315 440682073 433164196 423357703
14264 423357703 411773530 398322972 383953467 368705223 352687741 336781128 321031793
14257 321031793 305613072 290376303 275567095 261395025 248029337 236179731 224210185
14250 224210185 212567181 201379338 191315884 181728506 172450152 163848047 156099021
14243 156099021 148860480 141210033 134404641 128284487 122057919 117292639 112280358 107087833
14235 107087833 102087081 97928411 93605654 90190550 86956721 83141979 80059514 76337991
14227 76337991 73502159 70658747 68398258 65474617 63066801 60819580 58624822 57493011
14219 57493011 55069761 53052932 51204395 49655427 48172931 46854874 45510289 44136056
14211 44136056 42625234 40945566 39823281 39184860 38503710 37139148 36063726 35043221
14203 35043221 34151230 33000400 32505244 31556410 30801368 29743977 28529711 28177746 27605438
14194 27605438 26879896 26361890 25548844 24907043 24307449 23914407 23362014 22726232 22335580
14185 22335580 21806278 20929796 20500982 20336142 19994837 19220583 19167732 18571610 18071398
14176 18071398 17681538 17289772 16884287 16804406 16242567 15939124 15616302 15556331 15317190 14922032
14166 14922032 14653407 14608293 14028154 13706403 13687862 13648347 13224065 12695163 12865265 12447406
14156 12447406 12192470 12471044 11754876 11586013 11585824 11262759 11024562 10649964 10667295 10838678
14146 10838678 10505165 9959893 10122702 9710914 9780509 9752624 9378007 9525514 9183677 9328377
14136 9328377 9017010 8781772 8787310 8922562 8481206 8365932 7797048 8338311 7707628 7950433
14126 7950433 7485254 7772337 7452081 7356883 7554764 7257355 7302112 6907243 6916132 6888073
14116 6888073 6402423 6557696 6557364 6594759 6517328 6154346 6031884 6186644 5964644 5977311
14106 5977311 5579244 5749525 5807375 5921866 5567302 5751970 5730173 5555166 5447704 5249626
14096 5249626 5220521 5213073 5240472 5393278 4833767 5199046 4888366 4897500 4818322 4764694 4828185
14085 4828185 5003871 4603167 4379753 4748119 4279693 4448998 4271958 4605107 4071167
14076 4071167 4041829 4114407 4031453 4002041 3910811 4055761 3770203 4118224 3922438 3878404
14066 3878404 3918817 3730606 4003578 3688704 3685131 3787921 4013749 3597869 3960212 4034998
14056 4034998 3630930 3348721 3298871 3573681 3332504 3304691 3164481 3457508 3244205 3218214
14046 3218214 3148928 2994269 3506746 3122893 2851670 2974805 2948750 3133322 2879633 2554280
14036 2554280 2732201 2885150 2715992 2740673 2696501 3141213 3071132 3002325 2819992 2750130
14026 2750130 2736561 2688999 2855977 2568658 2576292 2845066 2352621 2296487 2393141 2546578
14016 2546578 2587921 2183852 2254627 2222774 2247015 2095679 2290130 1981740 2121381 2356485
14006 2356485 2180963 2194830 2143990 2102295 2382404 2036553 2038035 1915416 1782731 2001131
13996 2001131 1899496 2138843 2341086 2032730 1895050 2669727 2936384 3481584 7122832
13987 7122832 14106930 34410938 42682969 21615386 10434080 6660180 5071499 3720586
13979 3720586 3638254 2875115 2807416 2648837 2389452 2712802 2595154 2355806 2387485 2215277
13969 2215277 2192682 2173765 2364040 2106067 1704432 1829216 2119365 2450906 2239160 1764183
13959 1764183 1758758 2352936 1765433 1873021 1725642 1992252 1892898 2201886 1676517 2040009
13949 2040009 1729719 1710411 1986797 1605135 1406564 1599494 1642152 1746604 1491801 1632631
13939 1632631 1673321 1976313 1383737 1356390 1518923 1564653 1572742 1233247 1590011 1800384
13929 1800384 1461622 1507222 1272173 1575431 1476995 1576636 1493719 1332478 1484353 1546701
13919 1546701 1285550 1302603 1632371 1457912 1300797 1318751 1316563 1198224 1043067 1646631
13909 1646631 1152589 1146416 1389419 1216428 1187577 1280553 1143889 1106327 1079921 1088434 1451611
13898 1451611 1271637 1246886 1486644 1376388 1352246 1063497 1120730 1053771 1263415 1303055
13888 1303055 1230713 979040 1442637 1164329 1025866 1184268 1402838 858723 1054143 1118350
13878 1118350 1129351 1148455 913607 1127078 1421033 1231147 783154 1304357 987643 994172
13868 994172 782927 1293264 716062 873146 1245820 1077467 1149790 870463 865475 1116424
13858 1116424 1047757 606060 924852 874654 722074 867906 783916 832245 917534 904758
13848 904758 1242357 1017930 1090144 857158 958570 1362318 882096 834223 872766 858080
13838 858080 897031 667120 1028876 730026 998909 926159 1141726 620923 968695 706878
13828 706878 978334 769724 548906 946916 858586 1034122 737028 892406 841858 945724
13818 945724 715471 763417 543158 536351 866822 817216 656407 668673 716296 613464 870183
13807 870183 776533 875992 795897 545835 708660 740279 743505 796293 943347 774803 924087
13796 924087 505793 419338 579957 381332 636919 686274 606221 415241 490441 781919
13786 781919 1008606 457138 743262 1015303 1202039 643213 1014797 468229 993289 599709
13776 599709 612738 582928 877473 825791 547135 436002 505125 429656 672334 601846 612008
13765 612008 464287 537985 366863 544992 584432 805520 570102 760275 768019 519812
13755 519812 631993 384273 409587 470646 496749 523721 408377 451869 627335 392672
13745 392672 654359 695875 969012 992314 515058 552512 587779 617097 373795 584322
13735 584322 290320 522977 669458 445602 442068 589841 225516 861447 509922 299357
13725 299357 580113 459126 144289 276603 598132 511716 539377 425714 451940 305587
13715 305587 588008 288832 413705 502450 623846 505111 565501 757330 546259 300210
13705 300210 416302 708519 711108 711159 92554 256621 438448 570878 373421 497612 386371
13694 386371 153834 487323 13599 400114 230245 251090 363541 665305 244703 668096
13684 668096 419673 437489 538695 419580 534036 343670 437943 556009 364618 353953
13674 353953 619743 382961 357772 681520 490822 465904 305268 323371 520816 599879
13664 599879 500089 57425 368418 493014 741351 480227 219705 236949 369697 354220
13654 354220 330216 165423 521393 550681 511712 327736 368434 433280 179936 271963 477435
13643 477435 399516 468202 330298 397202 420503 541661 417286 644866 535732 432698
13633 432698 319030 567250 273977 524294 411030 407022 557280 491706 187777 -63724
13622 420483 528101 34561 318585 440440 463146 198903 535712 211995 533219 74948
13611 294152 445071 215943 704366 238347 307441 503258 246172 421876 433745 388340
13601 388340 592057 594782 502880 475302 125321 138563 368563 420652 165003 -93106 235935
13589 453721 216680 312546 172689 679717 140268 260010 64555 497123 337345 387864
13579 387864 304049 174644 14780 168459 465101 37979 62125 321938 410133 361580 141888
13567 667909 11668 161806 302542 121243 104998 169562 406424 316533 236640 -180704
13556 174793 134782 395040 169490 223761 236380 -77802 341346 309147 308324 84004 166649
13545 166649 225266 123970 352420 72687 614206 16034 160664 153874 517006 422498 179843
13533 296453 261080 414518 261125 207713 36579 492696 634709 290871 236694 165252
13523 165252 396022 209533 207430 171716 525343 280334 300890 68939 36470 205067 57466
13511 45983 419419 31464 108273 469150 609742 77876 348283 17675 384893 219160
13501 219160 202264 104675 160581 336984 571547 279345 554218 298912 258832 407947
13491 407947 104935 519834 320623 477253 289542 158278 164431 540417 124539 202428
13481 202428 156347 397861 -40352 244706 411165 241568 -88950 288552 253720 68623
13470 582127 137199 217108 429332 75327 69398 401307 400270 109755 178732 -68353 199826
13458 348063 384053 113624 -204442 83553 257978 -34081 -160423 273410 263126 216181
13448 216181 449388 113667 177037 201139 52403 201999 -63500 309619 126940 281987
13438 281987 395063 -15436 144476 192408 -107622 47289 98894 78428 487651 312196
13428 312196 -122830 206565 394301 350115 214716 327910 479353 151353 93210 180436
13418 180436 126995 330620 -58034 133031 12230 140122 155087 332236 38954 287808
13408 287808 57392 75747 314983 191246 -209442 -426 116549 -77882 142184 18922 416920
13397 416920 187550 228517 287435 38407 78350 259891 341644 -133729 65046 101880 391311
13386 391311 24458 288779 361008 354935 -5827 -116395 -170496 115752 558819 12965 108360
13375 108360 227404 35244 437557 153962 185123 524531 75951 183330 226400 126748
13365 126748 250248 53267 186533 -98760 -252335 288996 345079 313325 228527 517600
13355 517600 28220 188903 106746 489786 271778 141149 196562 445213 256415 -49675
13344 54982 310152 302339 38779 560947 192500 -24446 155641 187978 365648 31687 -62426
13332 158051 306581 -143870 413465 167957 317708 203383 122177 146764 515626 293128
13322 293128 3405 208129 309251 175838 344917 105440 74455 64312 88239 93937 -58524
13310 220970 113395 -82634 331389 140459 108340 168001 -19670 -4963 224412 521484 21182
13298 20361 -64955 287816 203322 276508 233048 260478 -37473 -200078 717869 208755 -17660
13286 -36542 -43940 -99469 78653 344915 -177426 171834 278057 327792 -56586 337664 220542
13275 220542 188760 248591 -53623 145750 158541 100807 21518 82795 195049 51153 103852
13264 103852 228644 -4800 160466 134962 55038 176555 -226440 97521 -33071 -2550 132648
13252 178464 -253756 212350 84331 252182 24169 183802 93516 -95725 59007 109968 -319543
13240 228323 164199 -966 156921 144994 162520 -216560 67433 173328 191225 158219 239597
13229 239597 72285 177853 -13919 -28138 281554 48557 77857 -120951 -199324 102286 -28147
13217 293190 197707 234382 382168 117345 -108727 159398 -34253 25496 96873 -150653
13206 356460 364185 -80689 165890 -73792 219206 314578 46956 -169306 -83504 -112263 370088
13194 90346 2766 -200252 247575 -39016 223790 285889 254739 66611 14053 31884 89715
13183 89715 -99345 378444 195577 -98713 49511 101348 -179007 -172230 417960 272679 -128676
13171 -48784 58631 132804 230833 -42235 288232 120272 -139148 161859 393878 -173388
13160 238408 83192 248093 179561 -383440 -52282 327342 17202 -184770 -166091 -40867 80224
13148 20637 -143067 -70326 -13073 119057 175467 149192 -255244 36351 188815 -58252 -138778
13137 -138778 -13097 51515 -56268 74968 61746 -103127 4019 -39250 83744 420884 356347
13126 356347 97030 -103224 -88607 200183 -47029 -160270 -103954 -114667 244277 2575 -53523
13114 340000 81634 -161279 416948 -342804 278921 122314 28684 89999 99089 124406 113852
13103 113852 -11645 262814 -260678 375530 64630 -15500 -125665 107171 24348 413695
13093 413695 117887 25638 272174 116121 103117 -6019 159351 264516 267524 -175193 301113
13081 200824 99331 126432 142006 -146159 -159177 175333 -63099 273527 151000 -376481
13070 202656 121658 107956 240520 289932 -99383 62275 276346 -89395 35098 309248 -29753
13058 -134716 134183 149260 198272 227320 291105 331069 -33909 -83048 -207611 111675 191610
13047 191610 258422 156985 -104010 -316828 127414 -126599 -1937 271638 6813 -19718 95905
13035 219683 -22272 280728 -199056 104245 70706 -188204 87836 264594 -13471 64558
13024 -24655 78326 275655 531767 245722 378085 22883 313495 -4336 -86339 69929 136501
13013 136501 357334 -217750 373684 218200 36175 266196 13934 147193 161800 78070
13002 132415 417730 269643 208391 416597 46327 -117886 359849 162740 -2690 -65185
12992 -65185 312715 -29566 170348 167518 -134248 86956 -225537 296400 -9348 198129 310098
12981 310098 136131 79429 31933 -162332 91674 -104376 42533 133473 28648 -4805 -97334
12970 -97334 -64648 -198169 97933 130197 38578 3239 -7759 33026 181591 64993 -30451 -40352
12958 -40352 -173384 50340 -52096 -496904 167998 -192133 56437 -162251 104956 215019
12948 215019 -170413 -38011 349092 -42367 100669 -63158 -270485 159635 -160156 64485
12937 -227026 226779 149412 -129189 284352 -30129 123413 -35153 -111153 -11192 -49231 29470
12925 -98083 -294334 -17335 -4162 235403 252410 52627 -145939 -149651 95508 -101565 -159183
12914 -159183 -262103 202291 19070 410252 212024 40993 -147413 361011 -139787 27684
12903 -103961 -66257 45098 -98631 152706 258383 59836 80299 -257572 -282830 116470 167579
12892 167579 -184058 18997 -112694 -24082 247579 -24410 128917 -143794 31643 235156
12882 235156 282567 -198005 -186845 -64986 183956 36677 87937 76848 -181593 -143277 1449
12870 -8841 34951 -86276 73689 -141475 -23890 219335 187101 165115 -241560 225009 118754
12859 118754 71532 -106890 90562 334023 3902 -12006 -76523 500280 -290311 -372702 54912
12847 -207390 -48712 216583 -69071 -186776 115547 -117675 145500 -12549 172529 131873
12837 131873 29351 -196273 -332883 -105999 120840 188831 -16948 -45642 -182921 92 -187689
12825 161893 143029 79682 14291 -253837 -114633 -100428 -160427 -433691 185024 151040 30279
12813 83450 -73976 24862 86806 63515 132807 44949 263649 92821 76251 85996 -45764 234160
12800 -82801 1505 -31405 7974 -263083 -32742 -57664 -119606 37993 -99802 -138289 171845 -46263
12787 49365 -27505 65283 241137 14506 -63189 12773 -98191 -201467 69537 251510 188248
12776 188248 -270590 -172670 106594 -42324 -259003 148115 -105334 89229 60197 133594
12766 133594 -207728 173584 116986 -50966 65090 -11704 157505 -266397 309848 -51592
12755 68160 -239829 49262 -339150 -252375 232106 148308 -231681 67717 53933 70114 -91340
12743 -169223 50595 82483 17491 43540 244435 7161 96315 82979 158575 77820 224068
12732 224068 359795 -94858 190227 -131643 57486 -294641 -348763 146538 46252 -89274
12721 -45775 -30976 -35438 -80329 -80790 130056 160904 -99037 -14621 -107242 490540 116793 201625
12709 201625 201377 380640 133952 407605 90579 192196 193682 -4353 101275 258591 380259
12698 380259 50947 309492 -42880 15720 -58291 133463 38644 117073 -238878 182357 55783
12686 -40883 254900 293580 109047 -59276 46390 219283 238369 333272 -87407 23555 135335
12675 135335 1026 78323 435268 146146 -202278 26453 128831 117032 243649 246033 225077
12664 225077 252370 135712 40357 -124757 59846 89062 98403 53609 85099 284068 -11082
12652 64225 114754 -52893 67121 172454 33520 199141 266397 -197754 235670 241319 -255360
12640 -48251 233133 41518 184568 -323468 92187 103418 75692 117407 -95222 198837 285461
12629 285461 124017 212962 528889 175156 318772 377925 203377 530799 145587 240188
12619 240188 59685 115049 121791 81683 -45625 109175 -47276 -100293 -39300 -103620 61014
12607 -2590 112605 148105 -77950 285619 -100307 -144066 198489 305811 -74443 -170508 198639
12595 -130716 256228 -211362 191152 -134190 72387 64731 -98372 -93902 58841 117632 27871
12583 195688 13480 -190253 54793 -14851 146369 -55331 110857 148307 -170995 -342143
12573 -342143 -20238 145382 133590 -294777 -187974 146777 122305 111596 116377 2318 -99139
12561 221336 30697 -44178 163040 -190784 277345 38246 61610 78987 2141 4969 133188
12550 133188 -246091 94800 237280 78990 297537 7268 44979 -180362 243886 65004 17128
12538 -143564 33260 47927 184666 146796 252210 198222 -41484 -145871 424 -207914 480871
12526 13734 -169414 -219566 -84109 75427 -145197 78826 -163559 262339 221893 3208 -70849
12514 -343325 35930 76064 -284980 254283 -372345 52153 136166 -42401 178846 -83459 61404
12502 -72844 21969 161560 -126274 293242 254916 94231 -103590 -147667 -65519 270713 -47045
12490 54901 199816 93265 71123 3799 16625 88204 94317 -115552 -70272 -100508 -49553 280883
12477 50365 -260727 70101 -132359 210025 116520 -263118 -127081 184080 -135776 15985
12466 40305 41188 -84688 29057 47233 58815 -39487 -2406 -32616 31526 -212915 141592 -66914
12453 140085 114978 356109 -54144 163590 -11232 64891 -19992 -16766 -127175 -45764 -146307
12442 -146307 -268098 -32981 -81090 32309 -26731 -20861 6276 139087 314826 122171 114604
12431 114604 127768 -167877 -258566 64569 281374 -18948 158159 22729 63504 -102412 143864
12419 259922 -45906 24438 -6958 -104213 228745 -74532 -77850 68548 -124771 190216 -5066
12407 585892 94256 -26177 -149716 212432 106091 151863 8273 52399 57743 190078 301589
12396 301589 303028 53151 57763 68186 97475 97305 -117855 105404 -89557 -233827 127300
12384 -153081 -369275 -142356 -14395 -4811 202133 -157539 -74863 -162714 -48316 268984 -6330
12372 157985 -82136 -103404 -155214 301900 485632 24383 -73862 50593 247706 456783 -267173
12360 15846 -58724 -185843 252772 -197057 55142 11240 13657 -149734 -364128 163108 727
12348 24681 129090 153466 159527 -127439 -26690 315631 242183 -184037 -106479 59873 1396
12336 238725 -356681 154872 215882 -60097 242421 40018 7847 -5115 154418 -164925 99460
12324 -93922 128616 54426 176536 400104 -239499 -141373 77935 6531 35017 320879 -29213
12312 62181 -12715 -57095 -123874 93045 -11488 188114 -168853 23139 21451 253338 -268063
12300 43479 283449 -40518 -386172 -177276 218403 117863 115013 -188864 160012 238036
12290 238036 272989 -205678 -15624 -2130 -373729 -100600 130644 -107945 122325 -29598
12279 -17396 264406 57312 -103620 10924 317772 409415 43540 206805 110932 52344 -216012
12267 208201 -185151 -7118 253826 145871 -17458 -298208 140969 -43815 132704 -35456
12256 183407 250233 157226 68433 157323 153021 283500 146745 26164 32071 252557 -146408
12244 31316 219322 223422 295996 -122299 244104 320301 43539 122628 190216 141444 170970
12233 170970 142437 114395 188705 365277 114916 182402 169157 351788 72265 437698 113419
12221 121352 -4010 48183 289102 335429 37841 -99425 68427 182490 -110560 365095 520709
12210 520709 335198 221912 197202 398046 -126796 -37841 414146 129980 332455 539603
12200 539603 144275 217415 45634 474381 298586 -238983 585738 223834 11869 -1101
12189 439677 14261 21893 94037 322834 24025 158798 96114 57648 315113 -296599 342993
12177 153371 348188 106628 -78543 499111 409569 154403 150438 -48984 -98837 433641 366146
12166 366146 -15919 97457 110432 162525 65674 256357 10809 236547 88429 130549 84760
12155 84760 -13626 249882 -278229 94995 196797 17718 -87372 -166490 -16466 180310 179927
12144 179927 -141109 -58272 27481 -26454 -396380 25717 -116422 53479 -85658 369085 -235427
12132 200212 127543 294022 -105017 -48402 263193 -437538 -52671 -33793 -111539 -97644 90190
12120 -92912 24317 155109 -149146 49527 123567 -61365 128053 -168829 -40778 178422 -158104
12108 -41978 194212 109508 -170461 39331 -4107 204631 -59425 67008 -321559 314992 -167753
12096 186804 354185 123982 -30311 -67863 -140728 76671 -250648 30807 119420 234271 -98851
12084 222378 32279 62351 151737 -126322 241392 204059 751461 1969486 1840073 706901
12073 132848 36968 106439 45966 86933 -29857 121960 112663 -41167 123469 183990 454990
12062 454990 -249714 -305913 -127148 -129776 106716 -172 -90205 -142175 -91734 -47341 56176
12050 131142 -157274 132153 221855 354942 -170905 -242979 43758 140640 263272 213086
12040 213086 -179375 -149507 -186779 181433 74511 -198786 -252314 240110 -241276 171719
12029 -97720 323505 95804 -67761 -99123 221718 217668 146773 -187144 368904 -298911 -153045
12018 -153045 -23753 86592 35487 104710 98781 -152002 -114689 193191 -198811 -99799 5826
12006 -10329 -226255 -162992 -247840 -30343 -204874 -59911 354887 155784 -231883 124800
11995 -6058 16120 -114650 51415 -80381 -135990 230707 78183 -144461 -74944 -179145 98935
11983 -179306 -157804 -57622 -235137 -31339 214659 50133 -101120 -373689 227906 91793
11972 33519 57408 308410 4957 -323390 52556 -48362 140432 -78812 -128645 -37393 109097
11960 -40849 91070 -64289 88595 89241 -14564 -318558 -100782 -119297 -86512 -70286 139521
11948 42838 -121264 177295 315907 -120749 -139408 68655 12680 -63900 46145 -34527 -184207
11937 -184207 68167 -59274 -69508 -4268 176071 -99061 49873 -216464 -1230 -284687 -228818
11926 -228818 287705 -96060 150034 -20681 19786 173767 -261030 -115826 197250 304350
11916 304350 -405752 139281 -24433 95016 48479 -78855 243198 -109874 -66950 113044
11905 -143796 38307 12145 152053 57758 -9751 -149195 -26452 -130278 206795 132885 152662
11894 152662 116605 74104 35959 -128013 248772 209880 -123434 -180100 232709 34407 172087
11883 172087 -81011 -201166 -75463 -276767 -112978 106419 -114561 168550 34479 356997
11873 356997 27725 -21238 -239041 23132 -56025 51307 136319 -170241 -189000 -93833 15945
11861 34768 -101779 117421 -62197 90673 -75835 -97137 -226170 26703 -203107 -118423 -287112
11850 -287112 -78601 -319113 308883 23479 -44746 -392692 -331957 258076 -17504 -222936
11840 -222936 143090 95554 -28108 59872 -25584 -54020 414543 47855 -49073 -245390 187010
11828 96592 105916 150570 -15926 19680 -172087 -88786 13058 69671 -141267 -214913 -182510
11817 -182510 -306392 -163363 -288712 -67709 97025 28755 -88979 156664 212151 36439 52577
11806 52577 99725 -4786 -365585 -13814 -62931 168648 -55463 211995 -112044 -181156 -142138
11795 -142138 -84955 156729 37096 -118376 220616 94354 -192529 -82453 -113638 78163 153418
11784 153418 24859 7605 89626 240217 -75113 -37236 -146079 136810 308966 171948 -53517
11772 -183640 192614 -11418 -42832 114584 64475 383086 81746 -52938 161221 -48923 -14350
11760 -309777 -144253 44614 208642 -98588 98230 -316911 183447 -198574 -19266 -4046 192003
11748 116829 175326 36662 167924 -42525 83250 -25061 -233379 -34709 -339779 31405 -44228
11736 -204846 -9458 33015 -37980 128874 22365 -45845 73379 88339 128181 -120247 66072
11724 49421 -174590 193627 -199410 -54935 237638 233180 -165819 30663 56109 -134766 -64269
11712 124209 -20922 -156501 -127533 237320 27252 -231067 90991 17045 -114677 208627
11701 89895 227312 -73375 -118885 47717 -77045 -213445 114570 -91520 -109864 507258 -61495
11689 -109894 54748 206021 -85672 -101915 -4836 -160571 352636 224604 66632 -307824 120344
11677 -39648 198674 283071 -39572 151560 13889 297052 -80701 -104713 87518 -13020 -62421
11666 -62421 -42643 -30609 154873 5763 -671 -166892 -41999 -39981 -192907 57127 211251 -156338
11653 112770 153008 106905 12395 361015 -85221 213542 125969 298469 209550 99156 252866
11642 252866 157739 85542 -134972 44464 -114481 69267 -5238 120252 -228531 52019 -49177
11630 455374 -129825 139439 94558 56879 -61987 116690 -59020 -118830 -127158 74414 -112226
11618 80497 55059 40291 181388 -137619 149623 32082 230013 73433 298898 -94815 -291075
11607 -291075 -35394 -43464 -132100 -103765 245731 81658 -109156 -28007 170221 161267 18605
11595 -112305 3833 -104542 270178 -26822 139300 -33305 42666 47232 290068 -107518 398936
11583 64710 72194 385255 -59558 137127 85206 -209775 -259087 159659 -19017 72481 -182322
11571 266724 210835 180423 323788 -60920 -139811 -15287 127843 -89974 -106173 297581 480625
11560 480625 -103238 -236697 235491 -693 153442 -110958 136455 273537 -24448 31000
11549 331202 95178 -13096 180513 136403 25040 -171146 106452 -134593 326823 -196411
11538 -67344 -27659 378750 634054 124219 53098 -77019 2888 302511 664 139918 76791
11527 76791 -155328 74250 52939 272026 30609 35206 157555 228480 152264 198097 146361
11516 146361 340404 78110 35284 468490 131577 -78264 -33969 25378 37493 365520 -53317
11504 55718 55274 246840 136439 82904 -53364 -18531 9390 34073 -232696 435145 254211
11493 254211 68431 -145629 317542 -134974 25026 58424 238554 89049 564359 254675
11482 244515 -63938 79890 28912 85610 152403 -22852 62404 135300 416485 317115 -3817
11470 453770 -141580 69527 212543 -27354 162211 408842 -12065 186685 215758 77040
11459 45561 161616 7451 132984 -125814 124286 78107 -5827 177329 107347 163836 -12771
11447 152901 24690 -103640 -8127 -55091 224510 190050 244833 11742 362650 -168568 80406
11435 64110 -120345 -198605 -361980 -86542 312231 90581 185469 99322 196230 33549 -77539
11423 -98084 -142952 -361469 -60309 483 131411 47572 -55452 -45558 -195395 -95746 54121 2910
11410 -122821 88200 252715 -115092 -40137 -38434 97165 200946 336947 225944 -68238 181587
11398 -223480 10866 -33151 214273 31015 654351 -106899 413829 -94658 128927 46190
11387 51836 176763 68840 65186 -79078 -101312 -145691 256103 -156237 136818 155250 141099
11376 141099 187601 192537 2906 -241496 132647 298786 -20541 -146915 -252847 182427 183856
11365 183856 202146 -133401 66387 -32100 168651 165 -173353 -70783 -206412 356324 49647
11353 193026 112733 -96089 -102657 135037 30077 -322371 150335 -205457 -41711 18509 -13309
11341 -142991 -109883 216356 -177257 324472 46953 284872 -441934 123914 -230191 57383
11330 -218934 102502 -456899 -100113 -193879 75769 -126160 27076 -187297 -142146 235747
11319 146561 166642 -197401 192832 243212 -107917 120403 320036 -77827 -62676 -40778
11309 -40778 -142386 -167317 -3812 101607 -33724 -264154 -109740 259520 -5162 59079 277178
11298 277178 80126 202707 -168882 -321111 899 137068 -425527 -52610 236225 -166791
11287 34936 -202798 131389 208861 63134 227605 128205 53792 -98289 -38936 -115584 83515
11275 -203605 130206 136727 -359449 -239929 80917 265272 179364 -56938 134961 7658 -120961
11263 -40127 -44809 792 -59609 226686 89982 -73618 -143032 46149 -79543 275649 80591 180929
11251 180929 57951 -149634 -62201 1179 -132968 145721 18625 -4695 162816 -62857 -170054
11240 -170054 -88898 71724 -162793 -327731 -182880 91006 50259 -36954 -135865 171083 65722
11228 -219583 -458078 -66174 -449432 -61431 122420 -287335 -12159 100885 -46212 -63128
11218 -63128 115499 -213185 -157898 82513 313809 -2805 -84794 -142413 35679 32424 -114488
11206 243815 -82537 152038 -45389 99797 230171 -67785 -144578 -294042 18333 -30141 -28236
11195 -28236 116807 -89445 -300874 11180 -102214 -64043 -154766 -12554 -106512 -98084 94995
11183 53693 -9259 -229123 -28796 -169551 14479 287825 78815 81407 -456608 202624 -256216
11171 230040 -28553 131906 47554 85671 -171133 -419503 7353 37376 131302 -151107 -37958
11159 -14784 9276 -331738 -24304 -122622 73382 215735 277391 120552 -12632 229461 180567
11148 180567 -4907 -6387 46064 197381 1559 -239003 87543 -276134 -192362 6768 -158757
11136 55204 112580 -32533 98049 -217360 277109 23886 -55494 30283 16494 -50382 -89614
11125 -89614 35581 320427 21750 124556 -249142 171313 -963 27202 205899 116163 -223695
11113 98862 197114 150496 217749 235233 55545 126826 221655 125492 14435 179820 323212
11102 323212 119549 -53314 118291 360559 194221 282298 282024 56384 -26860 90052 41723
11090 191500 88638 154897 232087 -38718 411990 301029 426661 431212 155541 205110 208012
11079 208012 193131 427576 25771 245964 316279 21246 570967 110869 90111 324611
11069 324611 -63699 520397 419877 522181 380107 449299 207453 377213 648866 491119
11059 491119 328820 287900 563931 698592 713676 725238 1006872 502373 742337 557136
11049 557136 699973 752825 511609 955197 860599 929726 586885 895781 627261 797413
11039 797413 386214 448324 870842 808445 874359 999653 709345 654833 430670 569834
11029 569834 803640 735521 862902 709885 543562 617777 506352 514136 422710 699831
11019 699831 835170 749222 593080 432458 606103 746180 901423 601855 937436 498248
11009 498248 356712 389248 860118 404710 524540 611683 742242 634871 742152 625428
10999 625428 686966 406591 721287 752127 878611 663013 929099 620961 642528 889003
10989 889003 799044 961925 878809 898532 924180 1247697 949987 988520 1117013 1213327 1122187
10978 1122187 1512497 1633552 1681148 2090709 1881943 2524900 2776858 2702564 3161833 2674371
10968 2674371 2414217 2193558 2370561 2086754 1572981 1946588 1974352 1808663 1944442 1714179
10958 1714179 2062732 2234686 2169295 2064964 2233148 1696501 1802332 1441509 1240995 1150249
10948 1150249 745641 694267 632103 288638 259964 294650 523262 91999 536404 46431
10937 269635 147322 318473 395837 57477 -99813 333851 160381 387953 255717 152057
10927 152057 23802 268722 263186 78434 -173096 103419 199880 66499 -160682 -48311 174655
10915 35035 64299 110336 -158096 85229 327936 78264 70513 -219565 -228849 -91579 22418
10903 69621 -273944 -29824 5877 -1796 -277135 -159087 -95941 77549 10644 118566 75399
10892 75399 -172168 147366 347059 -39905 132847 17310 -85463 -97498 -59597 151861 -268210
10880 -33880 142385 390869 -121674 -25860 -41430 134621 227275 -40121 -100322 -30411 -27597
10869 -27597 -323617 -215430 -73140 55564 -100460 -185179 -43073 14519 7508 255610 -32491
10857 123282 -336490 -80707 -41849 273729 -48208 152849 -234450 84186 49422 -118743
10846 -28208 -133801 -109904 -187402 4012 -18167 152840 56682 -316744 39927 117750 54076
10834 132334 -334586 170306 -340490 141627 155290 263619 -44524 -186325 -126747 -310633
10824 -310633 -126495 276999 96861 -120123 192309 103084 81744 -34732 -203513 68772
10813 -225270 16577 -193831 -160667 -182622 251626 -102509 157642 2354 -43991 -87613 301871
10801 -80256 216474 -241108 85975 159702 70955 -114076 590380 -124294 -47241 -197618
10791 -197618 -72063 73579 -236809 -269512 -148240 184159 -179008 -142614 -290727 -193058
10781 -193058 -93280 -353504 -74675 -203556 -265328 -151258 85062 97995 -192886 221051
10770 -56 499472 103221 71335 -115122 49944 -138505 42556 129876 -462063 -33549 326246
10758 -134579 281469 -494480 -15574 -195638 53410 333904 265340 -49897 -265748 145501
10747 -5267 41704 11924 -106408 -43440 68457 -201744 -179505 49787 -274764 -17045 -5497
10735 22450 -195678 122920 -79124 -183694 18885 -55348 -169216 -229057 -149823 -226345 29150
10723 128223 -253956 248250 -182203 -186741 -10884 -108275 -219145 46008 -5516 -133480 -64745
10711 -46918 -52245 121929 -347878 216986 -92154 -141158 -70449 -263790 -308282 252906 109900
10699 -177618 89309 -268519 110596 359256 69872 -51368 -226838 -129641 329344 16421
10688 -17083 35277 -124792 -233370 -161305 -77923 151294 -299743 198322 -124712 17432
10677 -357131 -119004 -290122 -96569 -149052 64457 40073 -43060 -211595 -57124 -36589 34479
10665 -195397 77526 268554 -11383 -89440 -4686 185949 -32065 -147213 -527740 -230329 -94008
10653 -36817 68314 -276545 -32256 261675 -279826 173431 50829 -50320 -342964 -50301 -151807
10642 -151807 -196588 -301442 -159604 -366886 -262527 -16968 5705 -98890 -60203 -96084 -161875
10631 -161875 -74101 -69406 -128542 85349 56162 477798 -247582 26385 -225862 -160356 -202249
10620 -202249 -262301 -13402 76793 -115355 -139705 -97267 29241 163001 39669 64863 -96444
10608 -82596 83227 -504654 -229271 -246292 -139056 -390965 -10259 48319 44590 -45500 18017
10596 -202326 -102724 -190504 -105189 111743 -171729 57416 -114709 -156224 21995 -140173 -36810
10584 16118 -267923 -202928 6847 174948 -226357 176115 208532 -1935 -172168 165055 -365411
10572 -130010 84583 -108311 215955 82061 -74906 -149078 -182017 166501 -171921 38227 -28126
10560 89880 155397 -117284 -372830 289725 38069 -66135 33576 -346662 -218260 73191 -171945
10548 -144595 -2242 -17827 103152 -36060 -182429 -27197 126349 -382728 44535 -204480 42098
10536 1909 72969 27735 -152364 -133453 9377 9623 -213710 -53857 -34310 -260675 130376 -339874
10523 -55319 -14537 277793 -3845 177612 180221 -48634 206195 -311720 -192058 -260020 -61311
10511 22708 59652 -15165 181 -179071 142966 -18459 -152518 -87586 219794 -15481 69139
10499 18678 187115 71554 34248 -196745 -111770 184138 -104562 253859 3491 131163 -241898
10487 -122354 200276 -11534 -147934 296928 373257 166099 297176 623949 890726 821880
10477 821880 627612 558009 507531 29718 119019 380867 185380 -58817 34759 -249652 161983
10465 164019 50467 360750 67713 -404558 -54503 171006 177160 -196036 9204 40416 58289
10454 58289 -78037 -205138 26982 153402 -149825 -21382 -12460 281146 165859 58122 -131273
10442 -161351 -5102 -166310 249509 -115892 123298 -59677 -45359 -21345 21711 -301217 -49533
10430 -137304 230979 -116493 -119881 42088 -199053 -343222 -1712 36573 -33059 -222604 141991
10418 -156240 -160246 -101352 56260 -98875 -143677 -95137 -88528 135323 -126767 -176568 157977
10406 -190766 -106495 -29902 -33502 116820 124139 -85836 -326519 -206589 69183 -157655 -106228
10395 -106228 174919 484604 67412 19096 77142 126175 11754 -55515 256376 119202 376013
10384 376013 294078 -11563 259952 -44167 79973 76699 466849 66600 -70870 41152 473044
10373 473044 -75722 374164 74321 264595 451449 455688 330325 464876 259519 225565
10363 225565 365984 78069 216490 309149 153095 270373 231927 250111 215903 -421092
10352 423534 345049 419462 425224 391929 308526 382162 390822 87575 319927 382149 527213
10341 527213 174907 386275 264993 448849 -97015 283732 34614 112349 -39789 382011
10330 171702 205971 465807 -740 214697 141759 -26804 307008 81292 238906 78786 374115
10319 374115 46889 119025 -43802 -78638 282684 384152 87967 -83357 311661 -201518 -105614
10308 -105614 -202449 45235 63448 208965 210532 43112 245902 103116 88412 -265080 -95225
10296 -251183 119654 33360 18981 55574 91418 2773 279158 -103250 38767 236372 30761
10284 27560 -135181 200929 -101721 249069 101322 -77973 144835 -15800 15608 22652 -58223
10272 47413 -125497 -193719 168176 -71974 129621 314312 146064 -193506 228574 49805
10261 20319 287539 395538 227514 -1595 453567 278512 367017 179716 14735 48000 204439
10250 204439 -160394 -20634 277502 -184197 195264 -118409 -221601 -3415 85438 -19670
10239 114597 -66292 -5571 -340641 -353860 -169513 -117752 -162281 -142707 329695 122342 182148
10228 182148 -114346 -78808 -238837 -208574 87021 -172728 -27487 -68980 -188111 218896
10217 -185829 20488 79591 101755 -184742 44039 -319929 269816 275192 -98186 47940 33893
10206 33893 125463 19034 101502 -135142 -10891 -373043 75934 -84735 192919 -123660 261669
10194 -183234 -165505 -67092 -60415 -253208 -74170 7224 6116 49955 -235165 -52716 105997
10182 34208 8823 -326404 -47660 -64718 -199493 57664 -29822 -151345 -350276 -32327 -94856
10171 -94856 227639 87342 -104395 -11861 -291634 -267061 -210505 -31191 106849 58366 -61958
10159 -349173 108038 -189289 -111968 -37993 -104696 179049 -285699 -159032 -450069 107816
10148 -97135 -106990 -4632 -4051 -328123 -126084 -206296 70661 -113955 -205013 220786 -62631 -281080
10136 -281080 -332296 203761 42275 -137056 -300137 -99375 346489 -90200 -203361 -20832
10125 -82580 -22785 -185415 -8277 18120 40477 2734 -25457 50969 2 205321 -226611 -57282
10112 -499635 152932 64515 -42072 -119620 -156737 95676 421458 -117642 -122410 147132 174440
10101 174440 -44410 -258847 450927 -33644 -107703 -69447 -167520 -136105 114851 -100204 -115973
10090 -115973 120785 -140157 -176687 47543 -84537 -257460 -169688 -269074 51320 -57822 -83863
10079 -83863 173970 -191937 -87080 -256179 -201729 -278648 -107714 -214720 -298126 386698
10068 168926 -457316 28772 119248 4633 -19345 -109504 77323 -51783 12731 -79026 -170937
10057 -170937 -113783 -10097 83694 183664 -226387 40498 429562 -79390 26917 -85342 -10628
10045 -12432 1676 -103846 -161006 -84516 -178253 88892 -308737 -152837 -112050 162776 -121058
10033 44774 -71001 -272971 174337 -180641 -104304 -223161 -180966 283047 -33370 -43301 -270852
10022 -270852 -16518 -90685 -161368 -246237 -38701 -295327 131629 -168535 -169655 -213139 268327
10010 -463286 -141815 -274534 15897 -47163 560639 -128631 -203369 -128468 -310588 -324576
10000 -324576 -156951 -223698 353703 -375999 -93472 -159275 -19383 -47676 -163434 -311267
9990 -311267 126091 6009 -8315 -297796 -71457 277055 -45500 -273849 87751 -199160 25050
9978 -119703 -107315 -131313 -40219 61274 -393591 114895 -87877 129357 144770 1616 -10657
9966 -105067 73702 -162761 78047 -126788 -151761 20297 -326562 -140390 -265219 -168180 -208503
9955 -208503 -124165 26930 -298614 2657 -111885 -93633 -155587 -205305 -36619 -97491 -55950
9944 -55950 -115641 10166 -116272 -60805 -76038 -6502 144568 -206450 -87317 -97238 -56578 14858
9931 2381 -359138 27929 214420 167041 -146767 7573 78274 155826 184171 -146807 100791
9919 -82308 84346 -52101 -359309 -196067 -135908 2951 -251803 7206 132125 -122444 34381
9907 120061 -279408 -56951 -207209 -210400 -36891 -131065 -90074 159683 -158942 -166176 28353
9895 24311 -269019 101144 -216329 -155608 52696 62570 -16760 -149324 -25603 -260020 -83967
9883 -42721 73935 104887 174442 8728 146533 -254890 -264334 59079 131904 91548 -249826 -140073
9871 -140073 -100751 -222395 16365 211855 -112316 -72510 -129376 -274491 -107813 3047 -173140
9859 72047 -85900 26792 148290 159788 -139494 117708 -103306 -118169 -23787 97322 163387
9848 163387 -306742 -310998 -2582 -128036 185956 -438797 35025 -128949 -11497 -274484 -134944
9836 -202141 -87199 86815 187309 -212340 237098 -315276 -223995 722 -129065 -142583 -11757
9824 120883 -219954 -21172 98596 -13813 78337 -102804 -218554 -48481 -264489 182209 -145917
9812 -218284 -153504 57710 -10304 -65765 -34204 19940 82252 -128870 -6159 197288 157069
9801 157069 92405 56216 68839 -106652 -51307 1912 -66513 -119721 -133940 7792 -200775 -138525
9789 -138525 -217060 -49986 101301 68371 416870 -85596 24277 -102017 111242 -301642 -248570
9778 -248570 107170 227764 -24817 -41540 317951 39458 -312862 -85158 -28681 83729 201410
9767 201410 -19050 -24135 112794 -186247 -4568 -125057 172357 -290808 -16875 -1342 -114421
9756 -114421 -60844 148298 -262 -50076 -285201 -44852 -268605 204336 115107 -48207 40077
9744 31931 -41781 -12724 187719 138249 -191615 -80063 206226 32140 -122769 -336528 198291
9732 12693 -188466 191853 -103507 -220503 78490 -46687 49914 -105377 -333244 118639
9721 8668 -87965 -431045 -399422 -567878 -62435 -88764 132022 173361 -14556 -37513 -87001
9710 -87001 122372 -20235 -219631 -80455 -364976 273350 -169295 -239559 -119849 29026 478815
9699 478815 59545 -111864 360488 145918 -240452 -187937 -132272 -314274 -131647 34759
9688 -127414 -79079 -143218 225136 -164378 47989 -452501 47297 161981 47361 -117625 -195160
9677 -195160 8220 -104630 -180879 254422 -30294 2192 -161015 130226 -143889 -125121 -92029
9666 -92029 170407 -304959 269216 -180431 61178 -14050 17969 -96946 -264089 184318 -387822
9654 72752 -144007 -38537 -6643 -24277 13235 -347965 -132924 -64503 -205101 154297 -130598
9642 -155577 -34219 -214689 -12918 296704 -6290 -502699 -107713 37665 -96887 -26619 -274916
9631 -274916 -371711 -373187 -24906 194947 11833 -262360 -431250 146681 -174768 -200631 -129575
9620 -129575 -206327 -114113 -174576 224803 -83257 -171676 -70476 256665 -312863 -9457 -406208
9609 -406208 165966 -41947 -91284 -59833 -70291 -12810 -314943 -44299 -2693 -284411 -225145
9598 -225145 -153059 -43333 -20802 -120378 -192494 278020 -1277 39335 -33085 -168431 -3760 -308142
9586 -308142 21657 79187 -7020 -5311 -81455 -91685 -135233 5241 122247 181905 88195 -174040
9573 -136052 -109687 -74194 16568 -255598 -139528 -247154 163706 -160803 62315 42017 -821
9561 -270020 83264 -66525 -63691 239028 38957 -28168 150967 -204771 -51971 -202587 -88284
9549 -13415 168467 -22498 55051 -20915 -48392 -107645 265127 -247037 64125 -255451 80305
9537 -156686 71238 76562 -44471 -147378 -299254 -19046 -57486 -136118 19048 -314795 -455910
9526 -455910 -150482 -90548 -5877 -46421 -243489 222669 -89651 -158412 -254586 -31944 -209033
9515 -209033 -33129 -143052 -81926 -285173 -50088 -276620 -131955 48063 -88237 -171596 14796
9503 144640 3783 206155 126171 7718 -126192 32525 114482 106286 176561 91342 -76334 -28762
9490 -298162 -73338 108222 -76488 -139566 38390 121644 -135622 -182327 42151 -225371 -254660
9479 -254660 -119290 211301 -231207 -115193 37462 -332657 225455 -264173 140492 -3962
9468 57748 -99031 -212784 5835 18086 -119983 50398 109467 -189046 -212752 107433 -134771
9456 -70093 27564 138093 -81894 -104326 -172842 -120399 -313588 -31614 -55618 -169098 1368
9444 142101 -49198 12695 -188005 17621 -162914 -231381 -105138 91492 -113342 -14094 -103782
9433 -103782 50238 68834 -70774 97513 -11870 -207828 16425 -147087 280666 -261078 -302009
9422 -302009 -174498 -201102 -22084 -10228 -18909 -109246 56736 -95572 -312254 -147449 -144425
9411 -144425 335238 -258893 3878 -236977 25747 226514 -135275 -80817 -556012 -23984 80816
9399 -415171 -70099 -266723 -168088 -243380 13560 -96421 -213288 -242435 -97610 157603 -119203
9387 -702 149813 16917 57479 50842 186401 -192965 74762 112744 -242562 164017 233981
9376 233981 -222347 202388 151907 242748 -271309 -35118 -553245 234858 42763 -230905
9365 193958 -402697 -431699 76384 -11736 16157 -103965 942 62145 -15024 178794 -86126
9353 -127343 -225264 89813 22611 59182 86164 -436 -241201 200875 -63365 -5140 -267273 55791
9340 -155603 -2828 -274194 -160778 -154166 -412105 49587 -263305 -55252 -271588 24462 -177249
9328 -80515 -10006 -200287 68144 164010 -60861 -69651 368861 -104331 -94899 -139921 68674 26344
9315 -72842 -128623 111574 68310 153035 124029 -75374 42972 21085 111620 -172903 -79859
9303 -176654 -430912 73400 67976 27222 199292 -184163 -18297 -243038 40788 -342319 18272
9291 59922 115564 -209934 -185372 -198256 216046 109541 -27384 -56501 -239210 -198864 -146954
9280 -146954 -111845 -47437 128737 11573 -10937 122150 121543 -277269 2191 -235135 -400643
9269 -400643 -22939 301644 99100 -14983 -57990 79697 -192166 -72124 -76781 -161268 -272529
9258 -272529 -57598 -14025 189372 -266827 -127671 216998 -257699 -102394 -280510 -3054
9247 -167818 -25039 -79061 -287154 -52148 -138551 -21188 86787 -80227 -232877 397555 81442
9235 237381 -46598 -141172 268870 -78356 -226957 11849 -103538 -173214 -89270 -456035 -173396
9223 -204528 96798 -18584 -254560 -308337 -24637 -168201 -74345 -199543 -176075 -208271 -290707
9212 -290707 -34132 -179835 16478 225490 14073 -75879 -166053 52356 73422 -166093 235674
9200 -189982 19282 -167497 60319 -196355 -83170 -264294 144942 106824 21482 -101679 115943
9188 66045 -12967 2102 -179513 57374 38203 -28947 -50456 -479449 -185875 -210184 136081
9176 -321190 -82817 -279891 -224195 5495 -83552 157698 130779 97409 36968 -139927 49267
9164 146668 14212 179266 -31521 -308795 -199167 -84734 126488 -372466 -382348 -183856 278952
9152 -144096 35968 -150465 58902 14940 -70689 126067 287835 49703 262085 -51571 -456564
9141 -456564 -264030 -72408 240624 -338823 -155556 -69303 72716 -63355 14903 85553 55755
9130 55755 -193052 -245209 -254960 254167 31316 -242224 -150776 25640 91320 -96192 -249306
9119 -249306 -260766 -133025 187541 3689 -124920 194581 202945 -371892 73677 286367 5719
9107 126333 -199992 -27047 180841 46709 -162665 -25023 103777 -113883 -196766 -18532 -58158
9096 -58158 -144460 93649 -282521 32645 -48076 121511 -27678 -172437 -133373 -175945 -229736
9085 -229736 -212495 -108443 -276120 -405390 -76714 211798 -98929 18448 -356490 -253834
9075 -253834 -144428 113365 -119651 -81351 3944 154198 11411 -108083 -51350 49020 9250
9063 -114956 -194662 -77435 55025 -252843 -79008 50791 11489 108368 -96926 26866 -11371
9051 222008 -177813 -342014 322754 -50573 -206833 96320 -294331 -135131 404855 -412182
9040 -328759 142339 71570 632 16150 -187572 241492 -201628 -91709 -192071 -372835 -58102
9028 149207 -19442 49934 -108487 -94855 82578 -82001 153073 -51770 115545 -67885 -107065
9017 -107065 21447 -233105 221131 3080 -177280 -338594 -133302 -92319 120207 -330524
9006 -115236 -17623 -111468 42803 -256162 -122987 7697 112914 -151512 -46510 -129812 -146910
8995 -146910 -56019 99280 150601 -238237 -254131 -148828 -26608 -231422 -45182 -12826 132311
8983 174428 -138634 -239862 124158 -195580 226323 -117298 -192293 -202212 5312 -110657 -108414
8972 -108414 -143395 -215425 -24808 -415194 -92009 75081 -3684 -173854 -156239 98626 -131081
8960 -73624 -107565 105176 55110 -253024 -112794 -91553 -51832 -269017 -331478 166633 -161559
8948 -165970 71595 -203218 91790 174696 -100671 -144225 144715 -91318 -165298 29500 -167988
8936 257873 -200769 677 53531 129314 -104230 -77626 56415 -198571 185442 9950 220727
8925 220727 432805 748223 1936467 6139558 7275293 1966248 699711 254022 370604
8916 370604 131156 -58877 -300538 -95539 -77473 -200276 -31520 187593 224325 294194 100926
8904 9976 -129885 201838 135898 11909 -30138 -260703 -194574 -118402 171730 -156778 -136720
8893 -136720 -145775 90976 -257120 -120504 33941 45371 -60582 4001 -265043 141999 85418
8882 85418 -18053 -346371 -260674 -225691 -35143 185642 -219018 81927 -238948 -354898 -135043
8870 290086 -304699 -18285 -204839 249210 -133218 71032 148132 -225777 -77725 127993
8859 -82434 240081 -10336 65080 -218849 168690 -231268 -314097 -107472 -100684 -256370 94366
8847 4938 -51093 -28737 -3287 -229391 -258699 259600 -32960 -281289 -160906 73414 -87957
8835 339763 -82342 -25508 -295674 -112553 -199015 -11079 -149134 -387508 390352 -15368 -129397
8824 -129397 -251694 -47097 91587 113250 -188021 240632 -96631 -477964 -276092 238936
8813 50813 -329797 -97867 -7782 -221127 4565 -187666 -51099 -5656 66515 137266 -126702 22415
8800 -233637 -27168 -105095 -37411 -94299 171930 -339757 148233 520 -97184 73181 -183226
8788 85751 -20162 -39026 84091 178842 -132038 -4476 7296 29293 -212253 -51485 -86783 -201964
8776 -201964 32692 -239793 -107387 103865 -7682 -57708 -24737 -54504 -32909 -202504 396127
8764 -67834 60824 104547 105536 -226517 228863 531 203112 42397 120561 -287104 104649 -312567
8751 88316 -200692 143144 -57718 -47505 -98297 -258797 -174354 -319221 97490 -428402 -94120
8739 -9106 -5015 25808 -6440 -310636 -87817 -207442 290129 -141561 -94426 -257433 16793
8727 80789 -65513 -288598 -71126 -26222 -24164 3104 24095 13495 -372764 10172 30424 -62831
8714 54998 81087 -104664 -216910 169766 28965 -235503 -153099 254725 -101950 -132330 -186302
8703 -186302 241085 8363 180284 284512 341249 -262785 -148884 212230 -453609 -643327
8693 -643327 -26655 -127598 -141421 -231960 -419284 -220557 162702 175433 -173499 -237276 -128339
8682 -128339 -278852 -43097 -177464 -8411 -82168 8966 8819 -266887 -117915 -140546 65752 -140967
8669 11068 152541 254385 -290107 92846 263555 92753 20121 -411889 102822 51558 -136608
8657 -123341 -472092 14677 22942 -230059 230363 -190522 -31831 -68039 185944 -57933 74282
8645 -115363 -61683 -63459 -19506 -37610 112887 146558 -303421 18541 -40108 71841 -70595
8633 -228748 15095 311865 153131 -170825 -103534 38836 -23129 -100599 140888 -166882 -309711
8622 -309711 167186 -185105 248138 135866 -483141 -189836 145275 305113 -141573 -233762
8612 -233762 -15052 89219 -157285 -52035 -212519 -138887 -150352 -10336 132751 -44534 -66324
8601 -66324 -247470 130722 -70758 166798 -100679 -35189 65892 -220199 67769 -124624 154217
8589 20056 -62572 -1144 168195 -43893 -44641 -148352 -357745 -100511 -23976 -41140 61960 -253924
8576 92588 94257 -305651 125760 -26896 -179457 18417 545807 -3605 -129009 91901 51130
8565 51130 -46970 166342 -207278 -18642 -115239 -11303 -322404 -222509 51527 -151131 -7266
8553 -57129 -78175 -101725 117049 -80245 -357054 -81444 -27423 25765 249356 29725 86050
8542 86050 -413015 -236368 199188 233107 -123016 -24593 -124020 146747 135032 -151671 295991
8530 -160775 -63463 172648 -27286 30238 -330277 -135692 80552 -121215 108545 -128172
8519 121 -160544 -397629 233618 -265784 -379342 42816 -552220 -180321 -157561 114516 92991
8508 92991 -9631 126344 -107476 -126133 -71372 32461 -286679 -57851 75711 210 -145673 -115829
8496 -115829 54045 -139010 102547 -152973 -42463 198359 -107326 -174756 -364117 -275005
8486 -275005 -74185 184545 67736 -90713 -202839 -81715 -128364 -67857 -197656 200131 71095
8474 -160243 -49712 65267 141720 56047 -159329 -60693 47179 -385697 -211201 -175675 12928
8462 209358 -263784 -162297 -286354 -234202 161731 121795 153046 -323269 -190220 190976
8451 -4809 159540 -55698 -248358 40525 -142220 -69159 5726 199023 177942 -162660 -303813
8440 -303813 -119399 -478838 -44423 -131064 195998 -136390 -199519 -142339 43897 17134 -183049
8428 31224 61467 -64 146631 -136805 -139941 -38638 -43546 -383196 -189489 -22208 -169073 -298409
8416 -298409 -324284 -3161 199774 -391656 67304 -118293 -137146 -74292 -68919 176548 231006
8405 231006 -172655 -260775 -134706 61857 -71341 -25894 -187501 -5831 -106040 -100782 -62092
8394 -62092 -132331 -637340 -104238 -61308 86907 -241228 14854 -27801 -559977 -469218 42592
8382 17717 -512 -157929 11479 -358111 -193619 -157789 -110558 95343 374071 -124599 -76728
8371 -76728 -419746 -5745 -304568 89254 86029 -383705 -59201 34745 -25179 116148 -473579
8359 -227678 371938 -55785 427106 25251 -130140 -59056 266421 81316 -25674 184204 133360
8348 133360 9864 -179691 -328247 -87681 25257 -158892 203324 -20573 -121085 -67221 -176213
8337 -176213 247818 98230 69876 220587 -323037 -73578 -24035 76717 -125820 -63248 -108949
8326 -108949 -48345 110318 -595770 -239027 -499169 24359 51521 -145612 78938 12918 -91554
8314 -21835 242117 304248 -176094 -122072 -350592 165504 -59526 2879 -294035 325060 -393396
8302 3812 149683 -136141 122152 -32685 23849 -56794 -29501 -15702 -99167 47608 -108662
8290 -158759 -183515 235982 83707 7989 -198738 320742 328513 541373 162579 225516 97074
8278 57080 -12870 130648 -202888 -86786 105474 -115671 38794 -322729 77642 53249 52648
8267 52648 18732 -276205 27103 -151968 69269 -451023 -149779 -177044 147931 -183838 131348
8255 -137005 1920 -13591 96497 6591 -197090 -132616 -240335 10657 15250 -443295 148054
8243 -33782 -3958 348769 79254 -248088 146021 -403581 44397 128175 -300883 -160368 131689
8231 -299636 125216 -156273 -29884 -391039 339346 -183488 -81421 -43621 -174693 132698
8220 157130 145608 -118483 70153 -8123 -27144 203524 -16632 -56624 27949 -120087 -307021
8209 -307021 -767092 -360375 -311371 -161315 -169745 -196750 -5766 -32936 -177081 -16275 66913
8197 -151227 -189771 45327 -96133 39493 -169177 276146 -35885 -278304 -306054 44098 271786
8186 271786 -105396 136459 51351 -320993 -162640 20180 -210394 -341165 -95852 -34110
8175 293175 232115 40719 -103855 153334 55252 -139265 -126226 -273294 -96887 28168 183601
8164 183601 -85437 177934 -88438 -32510 154599 -80419 122314 -55076 -19253 -157055 -50798
8152 -62842 73538 39967 85982 13268 -225551 -224477 -167418 93387 254230 30154 11242 3191
8139 186135 -156929 -187224 119722 43125 -139134 221186 86084 -93579 -51902 376121 87793
8127 -204763 -130968 -243907 60170 -127145 -205967 -259104 135256 -48361 42531 -43291 165707
8115 -47527 -77866 93854 -170952 19287 -199092 -182216 -249131 404397 306694 -157639 -397009
8104 -397009 -132271 -24188 7502 -97150 -107944 -18451 59464 -135209 338655 35584 356778
8093 356778 361121 45827 203427 -33313 -62369 -169450 -128346 146795 -32437 -257770 -38306
8081 88541 -287787 -59834 -237643 118608 -89565 309739 -262592 -108653 -110324 18522 164260
8070 164260 395979 -26803 216770 41368 -73024 219380 -325443 347338 -20637 -82560 -157357
8059 -157357 -203918 -55408 -247853 -79024 153140 18723 283821 -386430 -136901 127385
8048 -130822 -213884 -239292 110536 173994 -131048 175930 -135280 274253 207752 172379 97389
8037 97389 140560 -130108 37373 3299 72373 -116431 -90079 -9993 -392221 -57427 -120711 -159216
8025 -159216 -74559 182734 10917 -201453 209251 118873 -131309 -108365 -285553 4942 29885
8014 29885 27808 53771 -125734 -88576 14549 -12955 -352540 147499 -169849 105544 -224277
8002 140488 -259508 -183844 -215418 -196079 174577 -167274 228321 -140852 137554 -170163
7991 -462520 -98161 -170583 8662 -244501 -72474 -273459 -261388 21952 -62254 -103641 16377
7979 86331 88190 66516 -25513 218494 -276482 -89665 -29838 -148411 252373 -43638 -236723
7968 -236723 -234042 -104004 -9034 69060 17333 -77641 31155 22720 -65826 -8596 -297799 -178963
7956 -178963 -90259 -66704 -137818 -106432 -504580 -9453 -172543 -143470 -2456 -234414 -59216
7944 3814 48667 -215809 -151692 606 187990 -77813 -144150 349025 -352740 64972 48336 -35293
7931 -24714 79413 -117910 339182 37841 186 -111599 -7958 -36083 121618 -198022 148008
7919 38260 93156 148749 3463 468025 49541 119703 149026 -451186 116399 -19685 -64531
7908 -64531 -83456 -267859 -139484 -41659 -457003 149442 61492 -316983 -124845 25335 -256933
7896 2965 10966 -306535 -163222 -196469 -35419 85406 -385258 -82323 -126924 152529 -221040
7884 -29887 -116894 -921 -166540 188510 -215928 -52561 -347346 185041 14056 -153071 181987
7872 90502 -20184 80920 5592 -380651 89045 38229 23673 42674 -61591 -279113 -258592 -211110
7860 -211110 -283315 314583 -287097 -92966 -547854 -112678 27198 123558 24286 238916 217840
7849 217840 -213227 95634 37701 -6560 -71296 -36094 275603 125512 -246959 -94162 -164554
7838 -164554 6609 -57353 -209515 -270533 -105447 -102914 -59077 -209496 -177649 -8359 -186731
7827 -186731 -285070 -204512 142589 -281149 -37037 46784 29360 167433 -58324 153304 -3919
7815 -82507 -45413 -146296 224086 -2357 -31152 -90864 -292727 134451 -364257 -36787 -232331
7804 -232331 142068 28500 -157442 19913 -504797 219259 140093 -335728 -218096 -50239
7793 -3859 -55257 -239750 75228 97404 -27888 268536 -99756 -346107 93674 19179 -62868
7781 56672 11779 -103145 -148526 169448 347307 -25123 -9527 175005 -21577 101219 -69369
7769 -8884 -166051 -36909 -70953 -10429 148735 -13113 -83132 39769 99084 -160844 -103425
7758 -103425 -121220 286506 -150303 -90441 216054 41073 305008 142410 200656 3002 -94500
7746 -20078 -93002 -221505 116508 -118033 200598 8053 -115404 -13992 19092 117118 2496
7734 -99846 -57956 -98516 -94101 -179176 -201462 -200828 68734 -366140 -31989 -453616 -100384 -28255
7721 -137940 -207054 85852 -126122 -313305 -209434 111053 -139958 130691 204189 98345
7710 -45464 123578 -98359 194105 133398 5990 -184588 -144391 -39992 64080 -125158 120238
7698 17668 50122 -31881 -216411 -78249 -254248 176089 -153253 188740 -87383 -117741 -119515
7687 -119515 -390374 285841 126718 -4281 -48667 165213 -46250 -358533 -301259 -121486 -232237
7676 -232237 -213282 -73131 -159861 -168951 -57104 -211263 132951 21443 124393 296688 -106476
7664 -251368 -587 -289662 -2427 229201 353869 -211538 -68740 -62529 129908 49705 2628 -178893
7651 -23659 -146703 -170968 -172816 -98350 -24156 83939 455488 -94903 89665 -280036 -73043
7639 -135644 -207005 -230548 -53860 -513302 -221351 -43801 -120692 103925 190919 -442511 -38270
7627 -15108 -38143 -44268 51441 -38727 -277518 -76105 94833 -385560 30107 204284 49581
7615 -197903 96328 283625 -141383 -69316 102758 -229773 -92167 -22016 -40385 63733 -121746
7603 86283 -117920 -206983 149758 249384 -79273 -114025 72354 26034 -108061 -6302 -43966
7592 -43966 67436 -198978 210953 -255792 -58757 24 37106 20064 -103666 107542 90040
7581 90040 93976 14225 3686 -157180 -236937 -15922 -229523 -91119 72273 8703 298891 276619
7569 276619 185283 -492007 -74040 -207938 155726 -30499 -80763 50662 81141 -49034 -302439
7558 -302439 205127 251400 -500175 -110026 80637 155269 -182963 219660 -191672 -136919
7548 -136919 179029 -275805 -143088 131172 -117940 -234454 95685 -257219 77208 -90255
7537 -134732 -185854 -146580 -32962 80254 54845 40868 -47936 -39849 28194 -84415 -242969 77381
7524 -255743 -45649 188635 254834 -382477 -116196 -105392 97857 35037 -46040 -89961 -58891
7513 -58891 -166210 -247729 -73095 -93947 -155773 216781 314609 -25518 -148483 -278612 138189
7501 -98158 -222550 -33329 259751 65578 -273928 -11925 -245579 -32558 10833 -95084 -175178
7490 -175178 198959 1492 -130825 107463 -200152 30793 -33965 -28641 24764 113585 -128816
7478 139835 198039 -221261 -73356 -197713 106489 -140456 7450 -54300 283897 -264421 89848
7466 249178 -30408 -82772 -203178 -295864 -44448 36063 -157713 -122727 -315359 75938 93650
7455 93650 -114446 121361 50241 -279125 194665 -29012 223323 -324178 -232060 86323 -121549
7443 -227010 -182736 -94996 -108762 -86215 25071 -40240 -310897 -265164 154822 -325457 -2130
7431 77950 36017 219665 94630 137155 66694 43661 -147086 -206066 -84958 -62341 47428
7419 -186143 13743 -212829 126415 -3251 408002 -373948 -228053 -91789 359235 15105 -10190
7407 210668 -135141 318037 113051 145288 7765 -43762 -104647 -35935 -80138 -111978 -11629
7395 111722 346545 -28494 132897 2642 35056 -197517 -99783 -188617 271871 217607 -83669
7383 -7658 -16461 -83477 -18997 -121909 53968 1048 -166477 -38655 -248752 -88134 -107011 -216735
7371 -216735 -90595 -277745 99339 -55700 70004 -56047 -103022 -128454 -203237 127313 -148374
7359 -23034 134701 47842 8992 -100191 -149077 -96843 374090 48686 176162 225945 -138961
7347 -136841 209080 -116173 -132810 -143147 -239655 398883 -111971 97780 -191146 -4183 65601
7335 -257009 331551 7081 30461 273508 359636 254270 -161231 -400917 -211078 170876
7324 39273 -26846 -346947 43599 -35958 121096 19800 -111159 -62960 139708 -142909 -130758
7313 -130758 -134488 254553 -18634 -98883 -16798 -244378 -75688 188569 -356852 98999 -89998
7301 -200399 -302795 50976 48771 -231923 56238 -104922 -270590 54775 283336 -406010 -112855
7289 -20829 74305 -103854 8504 9886 128203 -153538 197492 -131526 25546 -24169 30191
7277 -74857 -109063 -79424 189310 -65954 -223279 -154197 44118 106769 -71515 -330390 109561
7265 -22645 132676 -30024 -18091 -78060 -25185 23800 48334 223367 333846 -111725 -94864
7254 -94864 -40596 -99840 12819 13521 46299 89262 -219342 -244591 -140291 -152513 -250463 193962
7241 120862 146172 18107 -95693 97227 137947 194389 -145841 -262598 -199039 -115093 -217729
7230 -217729 71744 -146419 45868 -51609 -11746 -167824 121805 -43014 -126387 48542 -194284
7218 165598 71766 101736 -187518 -164602 -59432 73980 59824 -31509 -132846 9234 -67557
7206 22918 202216 439813 -51148 -77881 -71633 -18109 14284 -306468 -159846 -66793 -187881
7195 -187881 32513 74296 -331687 -261110 -260252 95240 -90931 54815 -117973 239300 -226824
7183 201713 -142162 -11467 129943 -281285 -14743 -231891 -96894 -134027 -225152 -200068 83164
7171 -190416 -35303 86592 -84273 289591 -297333 90649 290242 -124259 90602 93513 -5356
7159 -60631 -4428 145737 -90 250711 226066 -41427 -334975 -113522 -166020 -61393 -83503 67971
7146 9147 41233 -61367 -127152 90865 -16898 -933 -380207 135444 -83862 141640 -293994 -247283
7134 -247283 -20935 51380 377612 -352387 -200631 -36668 63739 29049 -70239 325714 58388
7122 -156967 201585 71769 107867 134559 -289188 -161006 144562 145466 -267802 267971 -128381
7110 376313 -57676 -189550 -160625 -111193 -319829 134671 22912 -125980 -70365 -312027 193759
7098 25325 -507071 308743 -66440 -18447 -100540 54868 198657 -32486 -8724 -32127 -54059
7087 -54059 -65646 -92315 -264903 -14227 15405 18410 -77590 92036 -40592 -20515 -129464 71305
7074 -264988 237902 501396 -97262 160690 107387 -277629 173957 -134467 -44914 261554
7063 109953 -333753 31197 -44396 8523 46360 -58661 -33346 -1677 -176559 42844 -427154
7051 -116834 -204201 -85077 -323772 60622 138874 -423204 117678 -58080 83833 -219722 39897
7039 -51690 -28107 -240423 118974 148755 -119416 -221815 222960 -55219 -149199 -164268 -131421
7028 -131421 38273 236829 -214283 28199 -152803 -87783 96869 -100869 104684 245416
7018 245416 144835 -92359 -314095 -143885 192799 47356 -205314 303033 41896 -114268
7007 9055 -355550 28433 155580 70475 122649 122306 34340 -453234 311608 138103 133867 105417
6995 105417 131011 -128293 59803 188040 27860 247594 -58309 -265703 185284 141504 44027
6983 333228 200191 111713 -134620 321738 -105543 -85296 -144300 110780 212017 214507 32467
6971 -64454 76505 116263 185676 -125564 -141562 36734 -166763 -356291 -134506 -232182 -166303
6960 -166303 -153067 -52533 34423 -103472 -2071 -54500 155641 28153 167812 -10675 227773
6948 -54553 -194678 -82763 -76861 -148127 147789 -287307 -32363 1718 201680 97063 -60303
6936 273063 -217303 -343755 3227 -163786 -255827 98720 280231 -265815 48599 -113594 57972
6924 35138 -129932 -266277 -251578 202741 90339 -287300 118267 -251226 8391 234892 23433
6912 -357409 60844 -118138 83723 106926 -21708 83106 -22497 -112492 414588 -183481 233226
6900 202868 109991 8716 -71709 48685 86946 4609 -32321 19003 43802 -82624 124417 120027
6888 120027 -180871 -141926 2502 46626 -127964 46159 164784 -293039 100269 287621 245029
6877 245029 73594 95818 34424 8153 -183173 125575 -116294 -78546 31767 -18273 290143
6865 -88106 21437 -257502 321649 293229 384307 -21805 -219566 -301941 -231837 -40450 -7071
6853 148578 -221845 -101457 -289173 -72116 203922 -5034 -153311 12314 9294 -136452 95689
6841 -72047 30493 313489 130960 -232262 233348 -74971 279962 83865 -59126 -72827 -169391
6830 -169391 35010 209950 -103714 -24085 -192928 29223 -249581 -143835 -146869 73563 66839
6819 66839 -67614 -33662 31417 26146 76711 65541 257398 -290540 210950 -141891 198203
6807 28459 -387468 -162842 195777 107484 -67352 -5070 -142153 -178418 -213832 131444 255066
6796 255066 41515 98799 97514 -40428 -301905 -39222 -399827 -2530 -199889 -473033 117074
6784 59097 334216 -79557 -297138 -6413 35022 279120 -211708 146593 -408854 33044 -57447
6772 200066 98614 242849 -101254 146378 180795 -188120 -4126 71036 57042 267616 -111272
6760 -98748 -325732 338070 -267515 -115533 -49121 85591 188151 -153348 -46462 -98969 209214
6748 -5284 -121376 -29307 -115764 -304494 342728 -106637 -91038 -204392 -391586 213007 42340
6736 200249 -108599 -198143 -83965 80351 262511 29292 -191961 -363412 201257 -65416 70107
6724 -16484 -209375 -340211 71278 44053 120603 8611 52867 142444 -330608 35929 18064
6713 18064 185663 28721 20187 -82204 -51080 135145 -201628 -182357 -285764 -113701 -159722
6702 -159722 -60646 -163928 -129277 -69317 -73959 412356 -7609 39526 -468918 38114 -240505
6690 -167435 -193055 -152248 57491 -479774 32299 -5438 54437 -561 -181918 59901 -371982 -61491
6677 -111872 205290 123065 53896 -44927 16439 36219 37577 -202969 185313 95323 -9303
6665 169339 36857 -120856 -336676 -22803 -60500 132576 -100583 33282 -208477 137011
6654 245972 -132281 262314 102576 140276 -91469 -15609 -233919 -103014 -16620 -102129 -103547
6643 -103547 -19132 252282 139243 74173 169370 -94247 -33858 100557 39413 90207 55750
6632 55750 -23454 49951 -175909 -86077 103040 -27656 132818 -272237 212527 565 -104010
6620 -99052 -148909 -6561 22454 -207824 97621 -457277 -265401 -153144 210056 -82161 5012
6608 -127805 31266 -241476 225878 196959 -271616 -220724 122201 17273 -133014 -127335 -2655
6596 -247774 41963 -78276 153441 -173487 125539 -74255 -248142 -26584 -191924 -132453 -367826
6585 -367826 -267095 362962 34363 -77544 218568 -13801 -79915 -130442 -120513 -152848 70688
6573 -107272 220093 -19418 -21934 52834 -8681 -248564 141586 -71992 63599 -64548 329572
6561 140348 -49149 191381 194107 201315 82034 -242969 -59353 -81513 -208241 184791 120768
6550 120768 203542 -53018 -155209 -42437 16600 -107636 33502 -76789 -216338 -37483 100951
6538 -2397 79524 -261321 201377 -7559 -120347 -233983 181073 -108663 100154 89683 86561
6527 86561 198326 234900 59482 -9040 131146 150569 143336 -141347 -172949 -156195 -97142 -228801
6515 -228801 -201208 78964 277687 -109232 148553 44992 -48679 287425 -113275 -86083 136661
6503 -99036 49538 39554 -187334 -6971 -33018 38730 149010 -512934 -422530 -43698 170623
6491 -52136 -225490 -97209 -99168 279584 -256871 -14581 155714 212909 -261640 133908 30383
6479 281195 201715 114171 -317675 -37312 -67911 -154433 37193 -356992 253716 -99448 -68120
6468 -68120 157984 -332797 104233 284087 -28603 77086 -13911 -250488 -443647 -160613
6457 48073 87493 -83895 54921 -156551 76499 52936 8595 21923 -44156 175524 185707 213927
6445 213927 -9526 -191485 10599 -112274 -376573 -39298 61627 -61541 130187 -125185 -238074
6434 -238074 -283132 -38901 277284 76257 213511 -55048 411763 211216 -76901 -103833 -9102
6422 150881 -107165 130137 220718 -102577 -69112 -70360 -133578 -24189 -114255 158746 136944
6411 136944 5301 -17252 169032 -19032 7766 114853 128923 -11644 -23062 355734 191379
6400 191379 -3475 -247379 340246 -220068 160976 97254 96086 -337210 36061 119654 -106652
6388 361857 453738 184369 -375794 200623 199264 -160818 -20212 -85479 -134945 -306370 -135121
6376 -48244 55031 -112654 208066 -217537 -107179 26433 284552 86417 -23744 -68111 -418206
6365 -418206 186740 -154168 -228016 -36244 -8382 109789 11154 68889 -124284 293059 161035
6354 161035 83289 -89705 62923 -320822 99321 -40937 -297535 -111345 63131 -204246 -45395
6342 -198591 82554 129736 10553 -11205 -91129 -211043 -93381 61979 -147538 -15955 133421
6330 71070 -123919 -153183 -21880 -198799 72301 -190167 26657 -104894 285760 27195 141469
6319 141469 -210436 32087 -208500 81706 113665 160643 241126 227954 -150304 -108733 279004
6307 -128327 -178537 338343 268724 -58488 -301483 -124833 -17993 -128260 263921 -235981
6296 -43903 -194506 -5904 355324 -86465 144595 -181521 39153 -62321 184855 119380 -272456
6284 36887 122972 63655 -70797 -182602 224888 32414 36020 19925 101783 -16064 49680 91233
6272 91233 -70358 281619 -107417 172493 5880 271202 17658 140308 286692 -44046 83104
6260 339823 150455 98507 98155 6582 207465 -227548 38320 -249008 52873 111930 118714 -102513
6247 -325412 -45726 -279275 449 -20929 -8694 114333 137252 -113988 -146693 75716 142566 102326
6235 102326 176595 -86892 -229692 250519 -105036 99235 -28784 130090 255858 31232 64402
6224 64402 96287 177351 -177929 -62682 20057 -115167 -203068 -272594 -147226 159122 40799
6212 108812 -107007 -318871 89359 -47981 1403 -605 -31467 37959 -263915 -164669 -48887 283344
6199 -36386 132863 286589 222749 -113578 -24264 -113093 215776 72630 -223733 -110506 62373
6187 -6601 -199913 -232352 -219871 137837 -201755 334266 227203 -15356 343732 89385 10398
6175 58693 -380744 81253 336098 72498 -4691 -141372 -31633 -18996 -13037 -290726 -137378
6163 108122 94776 25145 93815 -5220 -44034 -216071 248293 -233792 -55579 -86503 10881
6151 -100954 150912 82052 -3169 -47517 24783 -122694 76290 -50442 -12622 -9921 -18925 -224919
6139 -224919 -19340 -82980 -83665 184205 -269859 -127270 217644 -128797 65940 -63069 -177191
6128 -177191 62490 128236 31847 84200 35675 112700 86294 -51211 -55644 -336896 -53308 1750
6115 34159 -81575 94568 -978 -124779 -253246 232008 -323347 -106592 -191201 -206728 57228
6103 -24420 -226189 -200366 49940 63022 -92666 65191 -58344 -62371 -89933 -308769 -79734 -172599
6091 -172599 -67595 -7829 218948 156216 -127608 22926 -123129 66178 107887 36397 100356
6080 100356 74843 147237 279618 29115 -161989 -118315 -19594 175992 100462 -154302 -154633
6069 -154633 -85175 241985 88851 234178 -83286 13199 176418 4647 -61697 -233464 351273
6057 162497 913 74641 -37399 254681 92756 264917 24165 149568 14834 -395126 212645
6045 177324 -80731 130579 -44412 99411 -261548 264165 132999 -198326 -61659 -39880 187705
6033 41862 166241 122464 -231 -2178 216532 90619 -124375 -114238 136570 58482 38236 114774
6021 114774 -143492 240655 188503 224588 8113 75340 -298707 -143642 -189397 83373 -204142
6009 30964 -65948 -108738 -230517 -135926 39375 -40522 9196 -84994 -169718 207373 -87168 58896
5996 -12709 -35264 21615 323916 -45472 -36979 117039 120422 -184199 143933 -48647 -113158
5985 -113158 54798 279653 -200605 111591 140205 -24726 -206132 -2467 244086 406514 -213996
5973 81099 178995 -261699 -40628 -2058 -69489 44201 98920 -35141 -206104 337597 338013 351181
5961 351181 37754 47979 -89621 -247402 51327 -142310 -76192 44654 264078 29476 -175572
5949 -5943 9262 63177 89525 -68422 95220 -342339 234164 65781 -229912 125081 -299734
5937 28053 124238 115212 -2430 -373284 -20359 -34082 -19919 -22089 -251169 -235746 34109 -276444
5924 -133868 -140682 19456 53218 357883 -199704 556603 -117200 -215569 155856 -155076 44023
5912 -266102 143322 -141746 264228 -171966 38781 73922 44453 -33544 449842 -148684
5901 23129 65608 -65614 -22637 68813 242669 -45270 9040 469381 -130728 3477 170471
5890 170471 -500546 21383 -126370 70821 -233214 -222309 14193 92741 39477 -58095 -62450
5879 -62450 -118085 -78168 84896 -98706 138171 101804 -203885 -300759 12712 135316 -39383
5867 -186944 -346478 100847 -75268 178420 -152891 227387 28491 -71267 -328684 154902
5856 231400 -239351 -77392 -187832 270586 17130 83579 -1756 -61915 -22903 -227969 -49624
5844 96673 -102379 167822 153908 174619 204134 257784 390349 -322673 -6492 -26288 -640 142106
5831 -139247 -431111 171608 72029 -223165 99776 -409980 -74137 -157672 -11422 -55172 -255962
5820 -255962 61412 264668 -143389 -38633 106441 -124764 -93100 119485 65279 23511 -63553
5808 -72640 -236925 -167180 -353966 84384 284014 158490 100108 15739 17142 128366 1306
5796 -99452 -195010 -193460 -103106 260587 36190 -74388 36122 -177437 -135581 -158086 57436 -8121
5783 -26047 -321228 -6450 191941 -72017 -137752 -162469 116204 48232 179957 -298537 -239407
5772 -239407 -134025 -49857 -181949 -257617 -194093 37308 13204 -8702 -311021 -58428 -166983
5761 -166983 74765 68197 -134834 150470 219038 71168 64107 293962 -211154 48231 -278564
5749 -6969 297084 35806 28226 7456 289705 178532 -19580 285925 -52244 67761 65372 13932
5736 -95357 19370 -33507 -48685 -18836 -13397 -156708 -55368 14118 -234263 39084 13937 -92818
5723 425211 341663 -53071 -26258 160022 -144809 41919 -64085 -941 295744 -78743 -129525
5712 -129525 197072 -3320 -43230 -17354 29434 198877 266408 -33484 -77904 -12357 97979
5700 165873 66142 -110720 120678 127894 -218681 42529 111908 -110213 94770 326376 -19954
5688 -204605 -84575 -8898 -61834 338951 103975 104835 -15103 14678 24726 -15201 125638 -18167
5675 116386 -60354 31093 37902 -108920 154618 313834 194213 -103621 -539396 112131
5664 328155 55856 162272 -111435 19284 -43532 230454 146286 19325 -168606 -157953 289075
5652 27223 -35106 53865 -19940 31737 -31134 61599 -124580 -44486 227405 -344042 -306083
5641 -306083 166115 75295 -30956 -177324 207457 180576 45000 104568 -44189 80455 22120
5629 -326477 334950 -156596 382599 149006 -325806 53940 -12806 87979 171515 94837 -291855
5617 62715 -248170 22774 96834 -18653 19066 -263436 -280428 160824 -111359 -222872 63669
5605 112279 140442 109039 -281338 -154775 -49751 -121127 -101243 -179775 249757 -55967 197063
5593 -374845 -63679 80431 50910 3539 92255 -20463 -157730 -62020 -85204 174654 -147940
5581 -105234 -80222 93357 180368 -46088 176380 2601 121431 -138197 10255 -249353 192644
5569 384049 -284829 106154 56195 -232696 -418632 179794 -150330 -106146 72010 -298299
5558 304262 135402 29649 -61801 8522 -304499 -155627 82661 -24614 -224782 -138749 112341
5546 134396 -184226 108698 27046 -81717 -293061 -9807 -62695 219409 175420 2214 -135835
5534 102600 120493 -190542 93026 -62257 -124660 80683 -101281 -177562 -425669 298693 -22468
5522 23884 42169 234745 148525 -266353 -20380 64070 -123805 -95840 -101174 168461 14738
5510 -121536 80615 -1628 -14694 -139251 -144007 12524 166431 33257 -110297 -154209 -20321
5498 -105395 -243079 113539 -37420 42764 -299959 -133942 108467 151648 -8253 248918 305618
5487 305618 52067 -72155 12185 -316242 -40614 -131168 -14583 -53075 -40351 -62198 136481
5475 51246 130509 28412 -58381 -231402 356206 -148411 -45320 138203 15213 -21814 -105797
5464 -105797 -147540 143451 -155375 5529 211514 230463 16020 58410 -27871 -17943 134063
5452 146928 -25482 -183758 118114 5367 398223 -106441 197367 -177162 -41547 -95205 198855
5440 104060 207160 -34619 -84100 -165641 -263810 156844 193046 -48612 255713 -147919 -99814
5429 -99814 -204685 -62603 -165692 -17552 299942 89072 -42122 -218646 -155934 -110359 -46209
5417 51716 12181 -66826 -183814 -169382 125886 36330 121863 140492 81568 185577 -11536
5405 18296 79638 -48169 -283456 21047 204763 152567 -48508 125859 -209392 93271 -15545
5393 -208167 -54841 191399 -148504 79848 -9374 201364 124056 -181635 265163 -6605 -76042
5382 -76042 -36760 -5338 178532 186491 309882 29795 399467 -241174 -6560 111095 239769
5371 239769 -190229 72496 104596 -438192 119371 -224866 -55375 -66140 24097 152036 243696
5360 243696 -221070 -18793 -379946 -184184 289989 192256 -230383 -265028 188831 -121956
5349 -13418 -71115 -259874 -36239 -79793 -251853 176970 -120882 -26677 -100137 -198565 194072
5337 193165 98474 49730 -125973 -59369 -141238 -117692 93118 55917 342208 172358 74865
5325 -109291 -49891 353628 -206198 -155766 -49335 208723 85397 198810 167146 -13302 -78515
5314 -78515 61615 422232 -159551 -226558 -289601 83495 -219666 -83934 155439 53799 -55305
5302 -55800 -12320 -135151 20689 -72256 280539 -168698 273092 -154333 -48040 9111 83633
5291 83633 39334 159282 -298560 -152685 -26032 100719 -138018 52023 -148290 40139 -153570
5279 93267 108406 48249 -135129 -14491 -57663 -120947 172761 -137225 -124200 181941 -260761
5267 110809 86348 46203 107317 -129989 -46526 96373 -614 -89639 126656 241075 40170
5255 197552 -55431 164369 -1991 13559 201780 209271 254402 221898 -62880 51096 197727
5244 197727 25690 113543 -146556 94892 -26535 -290059 -144950 -139359 -28418 -109208 412028
5232 207824 -73488 -109436 -81005 153094 -20215 -156102 365572 173824 -313295 -211848
5222 -211848 -241869 2403 -269999 -381627 181098 -21089 43898 71800 -307162 191570 -77385
5210 142057 136481 242635 85854 9638 73325 -269731 -50273 145355 186689 -249837 44820
5198 -32578 135592 34933 159060 -133148 92806 311285 -205423 -397038 -245534 -70487
5187 268660 -186481 65994 -786 220354 204137 589225 96988 -88623 -23848 -93292 303510
5175 -23062 242138 100294 17125 -110388 -67164 -92084 29525 -74135 -286421 -111119 -67178
5164 -67178 115152 27278 -22986 -242336 -156643 -57417 20257 -283462 104888 -269693 169567
5152 56070 -23351 -108444 144430 186914 70269 241049 176024 -260912 258542 -53807 -88742
5141 -88742 -94722 -188504 39283 221960 46635 -31836 39355 78689 -206417 168353 261667
5130 261667 -35984 63733 55528 91031 -7981 134528 43346 -16400 -126315 -264055 -37590
5118 195778 -94141 -229527 192719 44253 241827 -94225 -256049 -69738 21964 159230 105017
5107 105017 -403426 -78479 162711 87236 91940 -81931 227349 13517 -17954 -14691 234356
5095 -32039 -55192 -57702 -268700 154637 105006 -36541 22034 -135602 -282783 159989 160168
5084 160168 10977 85458 -171218 11900 194005 157480 267527 41573 92075 218860 -180861
5072 -165047 -60459 -102349 -188079 -17802 21527 54230 186896 164098 -58881 -4480 272952
5060 81387 152618 143501 49795 -7441 -106244 239463 -168120 -53667 -127176 109293 308210
5049 308210 159543 87549 228721 -162194 -65228 -144867 170481 -60583 88955 -153231 -201616
5038 -201616 67074 -303763 -140561 -119223 216913 -52719 -187698 -246822 100031 228407
5028 228407 387713 257714 79749 -203461 17592 377573 -322612 -329062 -20643 -20637 -34980 35710
5015 -56563 -100192 17927 100432 -142193 -111300 -106944 -172800 -105309 -64574 -117934 40192 -409949
5002 183071 17893 108353 63519 -230531 -275349 -188897 144961 -63377 41998 116968 152849
4991 152849 -193011 -138710 86070 55741 132430 50367 221709 191621 -57659 -108460 53367
4979 -290964 240129 -195033 62399 -148414 -6565 102068 62294 109734 -245696 96075 -158204
4967 -7414 -45190 88668 -22578 36023 -89419 243896 232552 -22828 -259991 -163469 -110438 273078
4954 1021 172609 -126905 140407 154156 -98793 -9405 88063 41483 -255838 -188503 299624
4942 288538 -276594 -106233 -108938 139103 -72419 -102156 49580 144812 191571 143176 100077
4931 100077 -276635 -82578 -53347 -68243 46477 -324339 41347 -282300 203925 42233 -108413
4919 55598 -235281 -394522 -291939 176582 192919 -239325 34975 31189 -201693 -265115 468994
4907 -39839 -107675 -140922 -60480 80468 34606 -74368 99266 -244216 386205 42499 76094
4896 76094 22102 -152366 -70203 -209987 -38379 44124 -332451 -176792 13159 -12775 49589
4884 82711 57868 -86685 354697 329618 -30986 396205 45491 248651 -29888 155680 120172
4873 120172 195023 -47069 249536 313440 272539 -180237 -203875 -415074 427571 -223703 -72044
4861 270523 -225699 -96395 -45751 81678 92757 235782 -107312 212791 -214596 -45986 131051
4849 44325 285364 -266818 65547 145757 -17858 59218 -107839 -84322 -93278 228908 87092
4837 11575 290258 -129809 -138761 7392 145431 -129430 -323576 -350490 67870 52973 -211129
4825 -63163 97311 104278 237968 26048 -3850 399083 27966 -54360 303609 -97695 -76686 -25109
4812 -295262 128555 -295906 -100901 -8132 -111657 -106533 -90455 -140224 -191571 -186437 629680
4800 27039 114941 -448 100189 200056 -46930 -202062 182424 -30911 8618 103391 378198 225971
4788 225971 90395 -212802 120791 54670 89196 -137738 -184868 76442 -62642 102001 -25439
4776 -106814 128367 183773 -417451 -167093 664 -97755 24221 -204446 -173780 -48932 131758
4764 -204376 246921 265794 -81287 -130377 88146 -118288 -170411 219381 27901 167176 -269578
4752 50764 -99458 -103228 2450 -261957 -26813 -23768 202779 211589 63241 -306837 -166005 12763
4739 -433441 -20905 309011 -144629 317597 -236222 2359 41430 -75204 116741 -72967 -303992
4728 -303992 -100102 60185 367187 -323036 11695 243696 365 98126 -1254 92575 -85719
4716 -112044 14321 32641 -96214 -57459 20088 153219 -143989 -185636 230212 468553 -103360
4704 -54359 -12878 258330 -44316 -343007 -10896 -34497 -194307 -41167 -155738 -27268 172566
4692 14625 29963 64417 -112391 15132 -30969 90958 295899 -392558 39220 223549 290686
4681 290686 118946 145175 235786 -126951 26230 -111649 124958 235630 182610 250140 -59787
4669 -22181 -100162 -55483 153716 -169801 4312 -29262 -2026 351831 53396 -180535 128774
4657 -117021 52693 -119668 -117185 173111 138277 -88349 195632 -31360 -225420 21195 86176
4646 86176 -5833 148995 -82393 -76819 7376 153640 -30417 93941 260659 -101772 -145783 216338
4633 -91378 147881 88985 -101920 15405 -82049 199091 41956 348619 -10526 -302967 -55967
4621 -12587 -159731 266330 -102754 -195539 192071 -303543 -105851 64326 -194489 15434
4610 156470 103754 -112633 -7921 69225 -174165 -67298 -116881 -186333 -118289 -41855 -21836
4599 -21836 156337 -11656 -255682 182665 327383 42071 253960 326156 359832 28502 199452
4588 199452 -55024 -23416 44527 113467 -42998 -199292 -65168 -236340 110791 29358 65597
4577 65597 -153205 -10632 206570 461793 -34010 3290 -339752 -65445 -111148 17096 -6081
4565 47891 24866 -118541 132895 -26895 235717 1756 153690 141674 -173344 78885 -230615
4553 253393 75628 161394 28922 215972 -129216 -129147 96308 -265629 176216 -278793 -44166
4541 51018 141755 -216489 -121626 -49150 21404 175950 -146417 282702 -79877 213950 1048
4529 -117760 4775 -197987 -138978 177712 30760 524346 -13544 -361204 2642 228441 125006
4518 125006 -281818 -227213 -185932 -264382 48113 -159340 60566 -321587 -80833 171862 -3663
4506 -150161 244509 115526 -138033 -164002 -262019 51538 108529 207799 -3322 59479 -35370
4494 -317031 -82639 -59378 -36197 20618 -141306 62193 182249 -200392 -59364 -86459 277983
4482 -52616 -154546 -49749 203294 -304164 46955 -51453 -75263 32626 143153 38614 -194979
4470 63977 166833 78055 -12135 -19297 -166774 235180 43884 154655 -53380 28110 62931
$$ [...]
##END NTUPLES=NMR SPECTRUM
##END=
